##TITLE=1H_SL62-5ID
 CDCl3
 8 sc, 
 19.11.2021
##JCAMPDX= 6.0         $$ Bruker NMR JCAMP-DX V2.0
##DATA TYPE= NMR FID
##DATA CLASS= NTUPLES
##ORIGIN= UXNMR, Bruker Analytische Messtechnik GmbH
##OWNER= root
$$ XWIN-NMR		Version 3.5
$$ Fri Nov 19 13:03:19 2021 Russian Standard Time (UT+4h)  she@DPX200
##.OBSERVE FREQUENCY= 200.131346
##.OBSERVE NUCLEUS= ^1H
##.DELAY= (6, 6)
##.ACQUISITION MODE= SIMULTANEOUS
##.ACQUISITION SCHEME= undefined
##.AVERAGES= 8
##.DIGITISER RES= 18
##SPECTROMETER/DATA SYSTEM= spect
##.PULSE SEQUENCE= zg30
##.SOLVENT NAME= D2O
##.SHIFT REFERENCE= (INTERNAL, D2O, 0, 15.7039)
##AUDIT TRAIL= $$ (NUMBER, WHEN, WHO, WHERE, WHAT)
$$ ##TITLE= Audit trail, XWIN-NMR		Version 3.5
$$ ##JCAMPDX= 5.01
$$ ##ORIGIN= Bruker BioSpin GmbH
$$ ##OWNER= she
$$ F:/spectra/data/she/nmr/H-F/1/audita.txt
$$ ##AUDIT TRAIL=  $$ (NUMBER, WHEN, WHO, WHERE, WHAT)
(   1,<2021-11-19 13:01:58.67 +0400>,<she>,<DPX200>,
      <created by zg, POWCHK disabled, PULCHK disabled
       configuration hash MD5:
       00 E9 B6 7A A2 85 ED C7 34 08 36 98 17 FE 4E 26
       data hash MD5: 16K
       38 86 5E 6A 29 B9 BA E5 67 91 A6 83 09 13 F4 70>)
$$ ##END=
$$ 
$$ hash MD5
$$ 39 4E 02 12 05 14 0D 2C CD D3 81 82 DD 6D 4F 13
##$RELAX= 
##$RELAX= 
##$RELAX= 
##$RELAX= 
##$RELAX= 
##$RELAX= 
$$ Bruker specific parameters
$$ --------------------------
##$DU= <F:/spectra>
##$EXPNO= 1
##$NAME= <H-F>
##$PROCNO= 1
##$TYPE= <nmr>
##$USER= <she>
##$AMP= (0..31)
100 100 100 100 100 100 100 100 100 100 100 100 100 100 100 100 100 100 
100 100 100 100 100 100 100 100 100 100 100 100 100 100 
##$AQSEQ= 0
##$AQ_mod= 1
##$AUNM= <au_zg>
##$AUTOPOS= <>
##$BF1= 200.13
##$BF2= 200.13
##$BF3= 200.13
##$BF4= 200.13
##$BF5= 200.13
##$BF6= 200.13
##$BF7= 200.13
##$BF8= 200.13
##$BYTORDA= 1
##$CFDGTYP= 0
##$CFRGTYP= 5
##$CHEMSTR= <none>
##$CNST= (0..31)
1 1 145 1 1 1 1 1 1 1 1 1 1 1 1 1 1 1 1 1 1 1 1 1 1 1 1 1 1 1 1 1 
##$CPDPRG= <>
##$CPDPRG1= <>
##$CPDPRG2= <>
##$CPDPRG3= <>
##$CPDPRG4= <mlev>
##$CPDPRG5= <mlev>
##$CPDPRG6= <mlev>
##$CPDPRG7= <mlev>
##$CPDPRG8= <mlev>
##$CPDPRGB= <>
##$CPDPRGT= <>
##$D= (0..31)
0 1.2 0 0 0 0 0 0 0 0.06 0 0.03 0 0 0 0 0.0002 0 0 0 0 0 0 0 0 0 0 0 0 
0 0 0 
##$DATE= 1637312518
##$DBL= (0..7)
120 120 120 120 120 120 120 120 
##$DBP= (0..7)
150 150 150 150 150 150 150 150 
##$DBP07= 0
##$DBPNAM0= <>
##$DBPNAM1= <>
##$DBPNAM2= <>
##$DBPNAM3= <>
##$DBPNAM4= <>
##$DBPNAM5= <>
##$DBPNAM6= <>
##$DBPNAM7= <>
##$DBPOAL= (0..7)
0.5 0.5 0.5 0.5 0.5 0.5 0.5 0.5 
##$DBPOFFS= (0..7)
0 0 0 0 0 0 0 0 
##$DE= 6
##$DECBNUC= <off>
##$DECIM= 32
##$DECNUC= <off>
##$DECSTAT= 4
##$DIGMOD= 1
##$DIGTYP= 9
##$DL= (0..7)
0 120 120 120 120 120 120 120 
##$DP= (0..7)
150 150 150 150 150 150 150 150 
##$DP07= 0
##$DPNAME0= <>
##$DPNAME1= <>
##$DPNAME2= <>
##$DPNAME3= <>
##$DPNAME4= <>
##$DPNAME5= <>
##$DPNAME6= <>
##$DPNAME7= <>
##$DPOAL= (0..7)
0.5 0.5 0.5 0.5 0.5 0.5 0.5 0.5 
##$DPOFFS= (0..7)
0 0 0 0 0 0 0 0 
##$DQDMODE= 0
##$DR= 18
##$DS= 0
##$DSLIST= <SSSSSSSSSSSSSSS>
$$ [...]
##$SUBNAM2= <"">
##$SUBNAM3= <"">
##$SUBNAM4= <"">
##$SUBNAM5= <"">
##$SUBNAM6= <"">
##$SUBNAM7= <"">
##$SUBNAM8= <"">
##$SUBNAM9= <"">
##$SW= 18.0517287032376
##$SWIBOX= (0..15)
0 0 2 0 0 0 0 0 0 0 0 0 0 0 0 0 
##$SW_h= 3612.71676300578
##$TD= 16384
##$TD0= 1
##$TE= 0
##$TE2= 300
##$TE3= 300
##$TEG= 300
##$TL= (0..7)
0 120 120 120 120 120 120 120 
##$TP= (0..7)
150 150 150 150 150 150 150 150 
##$TP07= 0
##$TPNAME0= <>
##$TPNAME1= <>
##$TPNAME2= <>
##$TPNAME3= <>
##$TPNAME4= <>
##$TPNAME5= <>
##$TPNAME6= <>
##$TPNAME7= <>
##$TPOAL= (0..7)
0.5 0.5 0.5 0.5 0.5 0.5 0.5 0.5 
##$TPOFFS= (0..7)
0 0 0 0 0 0 0 0 
##$TUNHIN= 0
##$TUNHOUT= 0
##$TUNXOUT= 0
##$USERA1= <user>
##$USERA2= <user>
##$USERA3= <user>
##$USERA4= <user>
##$USERA5= <user>
##$V9= 5
##$VALIST= <valist>
##$VCLIST= <CCCCCCCCCCCCCCC>
##$VD= 0
##$VDLIST= <DDDDDDDDDDDDDDD>
##$VPLIST= <PPPPPPPPPPPPPPP>
##$VTLIST= <TTTTTTTTTTTTTTT>
##$WBST= 1024
##$WBSW= 4
##$XGAIN= (0..3)
0 0 0 0 
##$XL= 0
##$YL= 0
##$YMAX_a= 97004
##$YMIN_a= -186219
##$ZGOPTNS= <>
##$ZL1= 120
##$ZL2= 120
##$ZL3= 120
##$ZL4= 120
##$ABSF1= 10
##$ABSF2= 0
##$ABSG= 5
##$ABSL= 3
##$ALPHA= 0
##$AQORDER= 0
##$ASSFAC= 0
##$ASSFACI= 0
##$ASSFACX= 0
##$ASSWID= 0
##$AUNMP= <proc_1d>
##$AZFE= 0.1
##$AZFW= 0.1
##$BCFW= 1
##$BC_mod= 2
##$BYTORDP= 1
##$COROFFS= 0
##$CY= 11.3945322036743
##$DATMOD= 1
##$DC= 2
##$DFILT= <>
##$DTYPP= 0
##$F1P= 2.36226072786647
##$F2P= -0.459571619588291
##$FCOR= 0.5
##$FTSIZE= 0
##$FT_mod= 4
##$GAMMA= 1
##$GB= 0.15
##$INTBC= 1
##$INTSCL= 1
##$ISEN= 128
##$LB= 0.24
##$LEV0= 0
##$LPBIN= 0
##$MAXI= 10000
##$MC2= 0
##$MEAN= 0
##$ME_mod= 0
##$MI= 1.114404
##$NCOEF= 0
##$NC_proc= 0
##$NLEV= 6
##$NOISF1= 3.799351
##$NOISF2= 2.8
##$NSP= 1
##$NTH_PI= 0
##$NZP= 0
##$OFFSET= 15.70392
##$PC= 1
##$PHC0= -15518.13
##$PHC1= 18.40081
##$PH_mod= 1
##$PKNL= yes
##$PPARMOD= 0
##$PSCAL= 0
##$PSIGN= 0
##$REVERSE= no
##$SF= 200.130013532006
##$SI= 16384
##$SIGF1= 3
##$SIGF2= 2
##$SINO= 400
##$SIOLD= 16384
##$SREGLST= <1H.CDCl3>
##$SSB= 0
##$STSI= 0
##$STSR= 0
##$SW_p= 3612.71676300578
##$SYMM= 0
##$S_DEV= 0
##$TDeff= 0
##$TDoff= 0
##$TI= <>
##$TILT= no
##$TM1= 0
##$TM2= 0
##$TOPLEV= 0
##$USERP1= <user>
##$USERP2= <user>
##$USERP3= <user>
##$USERP4= <user>
##$USERP5= <user>
##$WDW= 1
##$XDIM= 8192
##$YMAX_p= 0
##$YMIN_p= 0
$$ End of Bruker specific parameters
$$ ---------------------------------
##NTUPLES= NMR FID
##VAR_NAME=  TIME,          FID/REAL,        FID/IMAG
##SYMBOL=    X,             R,               I
##VAR_TYPE=  INDEPENDENT,   DEPENDENT,       DEPENDENT
##VAR_FORM=  AFFN,          ASDF,            ASDF
##VAR_DIM=   8192,          8192,            8192
##UNITS=     SECONDS,       ARBITRARY UNITS, ARBITRARY UNITS
##FACTOR=    0.0002768,     1,               1
##FIRST=     0,             0,               0
##LAST=      2.2672688,     0,               0
##MIN=       0,             -186219,         0
##MAX=       2.2672688,     97004,           0
$$ Real data points
##PAGE= N=1
##DATA TABLE= (X++(R..R)), XYDATA
$$ [...]
1767F16l04o48O08j44m66k51M08k76j16J42N9Q0R9k84J51M03L29n72r4R16Po95
$$ 616 312 -336 272 128 -338 -589 -181 -457 -573 -431 -372 -292 -193 -477 -326 77 406 -166 -260 656 663 -32
1789c2J54M17J83k34l29m0M71l4p84j2N35k29l60k34O34k87n11l8M76J13j76k29
$$ -32 122 539 722 488 159 119 590 556 -228 -240 295 66 -294 -528 106 -181 -692 -730 -254 -141 -317 -546
1811e46K17N43P0m92O33K01m94j82K3O56j28l16q8M32m03k02j86k0N54n73j19
$$ -546 -329 214 284 -208 425 626 132 -50 -27 629 501 185 97 529 126 -76 -262 -282 272 -301 -420
1832d20Q2M73k02j87K9J91j18j05J32J84J73n7k59K35J92m51m9M41J02j88q8J44
$$ -420 -338 135 -67 -254 -225 -34 -152 -257 -125 59 232 175 -84 151 343 -108 -157 284 386 198 110 254
1854B54j32J34l57j27N64k8n03r0L25J14k62r7K73j71P8j69K5M68j04l42l32O30
$$ 254 122 256 -101 -228 336 308 -195 -285 40 154 -108 -205 68 -103 -25 -194 -169 299 195 -147 -479 151
1876A51P0m06l5M14O4k96n84L09M24o4l52J88L69k1m68J18O56j35l54j72N36m02
$$ 151 221 -185 -220 194 258 -38 -622 -313 111 47 -305 -117 252 231 -237 -119 537 402 48 -124 412 10
1898A0r6K34p2N7n16n0J49K26J95o99M22K27k14k04K32L05k2m3k03K83k45L31
$$ 10 -86 148 76 133 -383 -433 -284 -58 137 -562 -140 87 -127 -331 -99 206 184 141 -62 221 -24 307
1920C07k97K57K84l8n23P7K52n4l68o5P9Q7l43m30M86J72j39l33J52O24n4o44
$$ 307 10 267 551 513 -10 67 319 265 -103 -168 -89 -2 -345 -775 -289 -117 -256 -589 -437 187 133 -511
1942e11M60M90k36j41J67M67P3o79NK65J69m70k76L94K91m67k94J76K8k93l82
$$ -511 -51 439 203 62 229 696 769 90 95 360 529 59 -217 177 468 1 -293 -117 -89 -382 -764
1963g64J41L81J88m90J56L42K38l66j11N69r3R8k31L99J80k78j68K06M8m4l64
$$ -764 -623 -242 -54 -544 -388 -46 192 -174 -285 284 191 289 58 457 637 359 191 397 445 401 37
1984C7j17K23j7k43k77K88N7q3m01L9M77k18l9k73N14J01j90j2J54M53j68k44
$$ 37 -80 143 126 -117 -394 -106 -49 -132 -533 -494 -17 -235 -274 -547 -33 68 -122 -134 20 473 305 61
2006F1L04k1n6l73J77K35j61k04n4K84l17l32K62J78J27o68O1L94J42l93j51N56
$$ 61 365 344 288 -85 92 327 166 -38 -92 192 -125 -457 -195 -17 110 -558 -497 -103 39 -354 -505 51
2028E1O2k99j24K55M58j09m92K87J03K1l54L19l5M2l50J48J16K06k49j85L55k04
$$ 51 113 -186 -310 -55 403 294 -198 89 192 213 -141 178 143 185 -165 -17 99 305 56 -129 226 22
2050B2j42j60M40k92K04m4kJ3P3l71j14N53m2j75j22J10J22O4k26j45N87k43k21
$$ 22 -120 -280 160 -132 72 28 26 39 112 -259 -373 180 138 -37 -159 -49 73 137 -89 -234 353 110 -111
2073a11k0K51J9k05J10OJ90l98J52J58M15m50l39Q1N68k83n64L67J15j32n53J02
$$ -111 -131 120 139 -66 44 50 240 -158 -6 152 567 117 -222 -141 427 144 -420 -53 62 -70 -623 -521
2095e21N73k6l65J12J55L81m16l20L17P06l81o0J30j0K04k92J74Q4O1m60r6o0
$$ -521 52 26 -339 -227 -72 309 -107 -427 -110 596 215 155 285 275 479 187 361 445 506 46 -50 -110
2117a10R5k17j88K9L43j73l27K92J79j53j84J63J24J85mJ4K41j23Q9k92L73L99
$$ -110 -15 -232 -420 -391 -48 -221 -548 -256 -77 -230 -414 -251 -127 58 54 68 309 186 275 -17 356 755
2139G55l71k55K01l1J89o07j44J43j76J38l68K75K36o00L2K99K24m13L0M67J23
$$ 755 384 129 330 299 488 -119 -263 -120 -296 -158 -526 -251 -15 -615 -583 -284 -60 -473 -443 24 147
2160A47j39j01J33K65k8Mn5K97Q0l90k17L23K15p46J36k7K81n93J1K55J28l94
$$ 147 8 -93 40 305 277 281 226 523 603 213 -4 319 534 -212 -76 -103 178 -415 -404 -149 -21 -415
2182d15K14j09K63n0k80L28J15P5k47J77L08nl17l8K92R9j46j30L2J03k20%p3
$$ -415 -201 -310 -47 -97 -377 -49 66 141 -106 71 379 374 57 19 311 410 264 134 166 269 49 49 -24
2205b4Q2r3K4l72K28N0j40J20k49K35Pn3q1O16l00j48j19M83K9l87PK22K54l67
$$ -24 58 -35 -11 -383 -155 -105 -245 -125 -374 -139 -132 -185 -266 350 50 -98 -217 266 295 -92 -85 137 391 24
2229B4k12K03M47m90N0r6J82p9k11J99rO2n18J54R1M04l89K48J01R3k58j22L74
$$ 24 -188 15 462 -28 22 -74 108 29 -182 17 8 70 -448 -294 -203 201 -188 60 161 254 -4 -126 248
2252B48l03OQ7J0J18j07k36K60j1L78n80q3K00qK77k07j14L99l64k91K06K4J61
$$ 248 -55 -49 38 48 166 59 -177 83 72 450 -130 -213 -13 -21 256 49 -65 334 -30 -321 -115 -91 70
2275G0r6k44J3K38k99J68J69j25j28K87k30J66J91k13o0K30o0k90K00J76L6k02
$$ 70 -26 -270 -257 -19 -318 -150 19 -106 -234 53 -177 -11 180 -33 -93 137 77 -213 -13 163 199 -3
2297cK7j1K21k68o3R1K6nj06l32M23k8k18j62N08k24m61J74M23j10j37Q5J90J22
$$ -3 24 13 234 -34 -97 -6 20 15 -91 -423 0 -28 -246 -408 100 -124 -585 -411 12 -98 -235 -150 40 162
2321A62J6j58K82K92n20p1J27J89k14qj88L4j40k69L44j89J34j89j60L86j09R7
$$ 162 178 20 302 594 74 3 130 319 105 97 -91 -57 -197 -466 -122 -311 -177 -366 -526 -140 -249 -152
2343a52j7J7J61k22P8J24L06o4p6J17O1Rj99M2J7J76L7k70k89R9J09l64J94j91
$$ -152 -169 -152 9 -213 -135 -11 295 231 155 272 333 342 143 185 202 378 415 145 -144 -45 64 -300 -106 -297
2367b97K21j59k39M30J4j90J1N8J68k70K71K11J20j34n13N05MK07l16J17L48l83
$$ -297 -76 -235 -474 -44 -30 -220 -209 -151 17 -253 18 229 349 215 -298 207 211 418 102 219 567 184
2389A84k95J7L31nk97k2M6j12j2P5j13K76j15j82J24Q5o5J1K40K66k96J22k97
$$ 184 -111 -94 237 232 -65 -87 -41 -153 -165 -90 -203 73 -42 -224 -100 -15 -80 -69 171 437 141 263 -34
2412c4J71kr7N8l4J83k39m5J07q5O9k3j3QJ74k95J0l2K16j93j22J33J96j25k2
$$ -34 137 135 38 96 62 245 6 -39 68 -17 52 29 16 24 198 -97 -87 -119 97 -96 -218 -85 111 -14 -36
2437c6k09O5L94l66R8O8K11m65L2K99L5j34j69K23M1n4L3J10N4p0n8j43K64r1
$$ -36 -245 -180 214 -152 -54 14 225 -240 -208 91 126 -8 -177 46 87 33 66 176 230 160 102 -41 223 132
2461A32k9j81K03j99j14j3L7K68m21o2K81J65j07j47J38L1J70m21L75J81K6m56
$$ 132 103 -78 125 -74 -188 -201 -164 104 -317 -379 -98 67 -40 -187 -49 -18 152 -269 106 287 313 -143
2483a43L76L5l3n6k45K69n1o0l98O29m21M5j43j16P7R9r6J96p5M4p2O0j90L69
$$ -143 233 268 235 179 -66 203 152 92 -306 323 -98 -53 -196 -312 -235 -136 -232 -36 -111 -67 -139 -79 -269 100
2507A00l1k04K32n6K57q7l8K13P5j52k84J93j27r4j30j58L01n01j64M62J07k01
$$ 100 69 -135 97 41 298 211 173 386 461 309 25 218 91 -3 -133 -291 10 -491 -655 -193 -86 -287
2529b87j91J88K78o6j74K06K18j03K5l44Q68j11l27m4K27k34l9N0K8j6j15o5j73
$$ -287 -478 -290 -12 -78 -252 -46 172 69 94 -250 618 507 180 136 363 129 90 140 168 152 37 -28 -201
2552b01o8N2k14K94J54n3l10K80j30J2J29nP0K1R8q9kK54k25J8Q7k63M60k81j08
$$ -201 -269 -217 -431 -137 17 -36 -346 -66 -196 -184 -55 -60 10 31 129 40 38 292 67 85 172 -91 369 88 -20
2577b0K7J85j44M0j95K0J12m40l6L18K13j58q0K15J85m24k23O18j84R0m4N1j62
$$ -20 7 192 48 88 -107 -87 25 -415 -451 -133 80 -78 -158 57 242 -182 -405 213 29 119 75 126 -36
2600c6k40K32k9K62J07m15l8N85m68rp0L13n2j87q9J02l4J73l33M26k06j1j67
$$ -36 -276 -44 -73 189 296 -119 -157 428 -40 -49 -119 194 142 -45 -134 -32 -66 107 -226 200 -6 -17 -184
2623a84L11M7k66Kj4J88l77K58j62K85J87m26J38p5M7O3k3p8J01L7j8n0J10N3
$$ -184 127 174 -92 -90 -104 84 -293 -35 -197 88 275 -151 -13 -88 -41 22 -1 -79 22 59 41 -9 101 154
2647A54o1k34P7K23q2k51K52J8l80J67oq4L27l52J07l2M39m43L6O2L64j21j07
$$ 154 93 -141 -64 159 77 -174 78 96 -284 -117 -123 -207 120 -232 -125 -157 282 -161 -125 -63 301 180 73
2670G3M7Q9Pk49L67J6J18p30K42L12k47k19J24J16r4k77K62M9l09J12P9J75j11
$$ 73 120 209 216 -33 334 350 468 -262 -20 292 45 -174 -50 66 -28 -305 -43 6 -303 -191 -112 63 -48
2693d8j06k64O00M1j0j35N5J78j96J66j03n0j42N9J11l29J52q9k05J76J10K3k52
$$ -48 -154 -418 182 223 213 78 133 311 115 281 178 128 -14 45 156 -173 -21 -110 -315 -139 -29 -6 -258
2716b58N0J23M8j15k11J85L87j37mO1q4K25j74K6O8q2J83m76N55m08j93M6J3l1
$$ -258 -208 -85 -37 -152 -363 -178 209 72 68 129 45 270 96 122 190 108 291 -185 370 -38 -231 -185 -172 -203
2740b03J1m7n7K25jn5J03r0J17k89L38k9L29l89n3M71o6l71mK55J11l96J1L37
$$ -203 -192 -239 -296 -71 -72 -127 -24 -114 3 -286 52 23 352 -37 -90 381 315 -56 -60 195 306 -90 -79 258
2764B58p4j65M4kj30Q0j44M8K03j20k00j40M65j92J26n0k1oJ64K7m88M35p0J42
$$ 258 184 19 63 61 -69 11 -133 -85 118 -2 -202 -342 123 -69 57 7 -14 -20 144 171 -317 118 48 190
2788A90j36J27On13K27J43Q7r8r0K3K29k8k25J05j6P4k75J11k9J08k93J30O7J51
$$ 190 54 181 187 -326 -99 44 131 33 -57 -34 195 167 -58 47 31 105 -170 -59 -88 20 -273 -143 -76 75
2812G5lj43rJ66j21k29L3K63J42l43J05J68o4o9K58l48L89o0k56M24k07lk64L62
$$ 75 72 -71 -80 86 -35 -264 -231 32 174 -169 -64 104 40 -29 229 -119 270 210 -46 378 171 168 -96 266
2836B66j94k60M1K10n9j73K16k02J24Kj52K0j9J66K0l4QJ03j37qL55l00K1q6K24
$$ 266 72 -188 -147 63 4 -169 47 -155 -31 -29 -181 -161 -180 -14 6 -28 -20 83 -54 -62 293 -7 14 -72 152
2861A52J03j2m97L18J15o0l25o2J27J23J93j72k32K71Q2k51j19J66K20k3j03j25
$$ 152 255 243 -254 64 179 119 -206 -268 -141 -18 175 3 -229 42 124 -127 -246 -80 140 117 14 -111
2883a11K23r3k62L97J94k49n4K38J37k34j26J86j63J23m25oN1J71m09J29J06K38
$$ -111 112 19 -243 154 348 99 45 283 420 186 60 246 83 206 -219 -225 -174 -3 -412 -283 -177 61
2905F1k88q2K97o9K0p7J48J63k72J79q6K72l51K34o3J48k0j11k18R3R1k83J79
$$ 61 -227 -309 -12 -81 -61 -138 10 173 -99 80 -6 266 -85 149 86 234 214 103 -115 -22 69 -214 -35
2928c5k06J69k16N7J03Q7j69L6p8M25k69K23k29j34M18n8l5J02p9k2j28K88r3
$$ -35 -241 -72 -288 -231 -128 -41 -210 -174 -252 173 -96 127 -102 -236 182 124 89 191 112 90 -38 250 157
2951A57k37M66m94K10k49q2k8L64l4p3l58L03J6m0j16K11j89p1L60j45Q4J98k63
$$ 157 -80 386 -108 102 -147 -229 -257 107 73 0 -358 -55 -39 -79 -195 16 -173 -244 116 -29 55 253 -10
2974a0J24K32o78L54kJ17j50J36n8j95K23m9j51J22q2j99K34j8o3K15l17L35q5
$$ -10 114 346 -332 22 20 137 -13 123 65 -130 93 44 -107 15 -67 -266 -32 -50 -113 102 -215 120 35
2997C5j24J96k65M06k98M5J1K35l43L93j49k68P4J27k43K10l00K22R4k6j08R2
$$ 35 -89 107 -158 248 -50 -5 6 241 -102 291 142 -126 -52 75 -168 42 -258 -36 58 32 -76 16
3019A6K53m64N4K31k24L12o1j40L39m06pj14K89j95j10J86M4K6j24J99n7l1LK7
$$ 16 269 -195 -141 90 -134 178 117 -23 316 -90 -97 -211 78 -117 -227 -41 3 29 -95 104 47 16 19 46
3043D6N3J93k39J0L5N4k02o0k7K29k50O2Q7J16m7k10K11j33j82M51l47J81R8m49
$$ 46 99 292 53 63 98 152 -50 -110 -137 92 -158 -96 -9 107 60 -150 61 -72 -254 197 -150 31 129 -320
3067c20J35L74k21J12r9p2O3J02J63J53k23j08m1R2M6Rp2k43j06K09J03j58r6
$$ -320 -185 189 -32 80 -19 -91 -28 74 237 390 167 59 18 110 156 165 93 -150 -256 -47 56 -102 -198
3090a98j91R7J25JJ6K9L8K20j9O1n3l9j85K71j51K33j5R3k59k22l6N08k16j97
$$ -198 -389 -292 -167 -166 -150 -121 -83 137 118 179 126 87 -98 173 22 255 240 333 74 -148 -184 324 108 -89
3114h9j51K56Ll11P9Q0K32q8j83j12K03n4L26p9P1l63J77K43k84J84J69j12j78
$$ -89 -240 16 19 -292 -213 -133 99 11 -172 -284 -81 -135 191 112 183 -180 -3 240 -44 140 309 197 19
3137A9r9k00M99j18k79K59M5j19o2j05p0L3K34k37J95j32R7j16K25j84j54M34
$$ 19 -80 -280 219 101 -178 81 126 7 -55 -160 -230 -197 37 -200 -5 -137 -40 -156 69 -115 -269 165
3159A65j89L0Q2J38j73j60QK38Rk25K05q2O9l42K19p8J66j74M3J10RM9j57q1J53
$$ 165 -24 6 88 226 53 -107 -99 139 148 -77 128 46 115 -227 -8 -86 80 -94 -51 59 68 117 -40 -121 32
3184C2M8k93L04n6J3o2R2L3j42j91Q9K7q2M08n34K07R7Np0M01k01J9l06K93P0
$$ 32 80 -213 91 35 48 -14 78 111 -31 -222 -133 -106 -188 220 -314 -107 -10 -5 -75 326 125 144 -162 131 201
3209B01o5r8p2N8l06J40R6Q8j25l6J77k44P5J23j79K47Q5j90k9K77k45J74j79
$$ 201 136 38 -34 24 -282 -142 -46 42 -83 -119 58 -186 -111 12 -167 80 165 -25 -54 223 -22 152 -27
3232b7O2R9q3M4l78K66J54L2j05O0l3J14k68N7lj19j53P1P5J47n2p1K30j88L1
$$ -27 35 134 51 95 -283 -17 137 169 64 124 91 205 -63 -6 -9 -128 -281 -210 -135 12 -40 -111 119 -69 -38
3257c8j58K23N3J25k70K15Q9n6K5k95L53Nj60l95M40R2l98J8M0L0J2j72O4m7J31
$$ -38 -196 27 80 205 -65 150 239 183 208 -87 266 271 111 -284 156 248 -150 -132 -92 -62 -50 -222 -158 -205 -74
3282g4Q9J51k11J88j60J77R1j80R0J64P9k34m4Q7m5k20K90k13j78L37j45j00j32
$$ -74 15 166 -45 143 -17 160 251 71 161 325 404 170 126 213 168 -52 238 25 -153 184 39 -61 -193
3305a93r5J62M0k53J62M7Q4qk9J26P0L7q8KNj32K92j01l4j3j22O0M9j62N0J09
$$ -193 -288 -126 -86 -339 -177 -130 -46 -54 -83 43 113 150 62 64 69 -63 229 128 94 81 -41 19 68 -94 -44 65
3331F5O4k2l35j1J77Kk3j11J64J15j59r4K5J6M4J36K3K62l05o0J28kO9j85k5J36
$$ 65 129 107 -228 -239 -62 -60 -83 -194 -30 85 -74 -168 -143 -127 -83 53 76 338 33 -27 101 99 168 -17 -42 94
3357I4l73N01k80J6j0J21k72j26K81k46K81Q8R7l15M5J02Q7j63L0J48q3L8J0j45
$$ 94 -279 222 -58 -42 -52 69 -203 -329 -48 -294 -13 75 172 -143 -98 4 91 -72 -42 106 23 61 71 -74
3381g4L7J0K30r8m3j86K51n7j41J35O0q3j4P9n9j9j24J48L9q9r8o9K23q2K19m03
$$ -74 -37 -27 203 105 62 -124 127 70 -71 64 124 41 27 106 47 28 -96 52 91 2 -96 -165 58 -24 195 -208
3407b08J55J44l35O5J40j03K59l32M88m05P0P1q2K77k24J26J01j72J67j01N7j6
$$ -208 -53 91 -244 -179 -39 -142 117 -215 273 -132 -62 9 -73 204 -20 106 207 35 202 101 158 142
3429A42k87J37J83l28j4N2N6k53J09J26q5mm1K01J24k01L42j97j28oR1Q1r9J52
$$ 142 -145 -8 175 -153 -167 -115 -59 -312 -203 -77 -162 -166 -207 -6 118 -83 259 62 -66 -72 19 100 1 153
3453A53k07J05J52k73K9k47J67J62o1r0K07j32j21j10L69j15j50Q7j7L3J00J15
$$ 153 -54 51 203 -70 -41 -288 -121 41 -20 -110 97 -35 -156 -266 103 -12 -162 -75 -92 -59 41 156
3475A56k56J72J6M6Q8l03J43N4L8l01M2J2m1K90l51J68j29K6l4J75j69K20M7k21
$$ 156 -100 72 88 134 222 -81 62 116 154 -147 -105 -93 -134 156 -195 -27 -156 -130 -164 11 -158 62 109 -112
3499a12O2m1K43k01N7K5M4J3P3J6L9j20K2J77j67k03P2j47J09P3j45J58Mk31J02
$$ -112 -50 -91 152 -49 8 33 77 90 163 179 218 98 120 297 130 -73 -1 -148 -39 34 -111 47 51 -180 -78
3524g8kO0M3pr5k0M7K00k26J65j37L02l12j08J56m6J82m50J15L96l01J73k16L37
$$ -78 -80 -20 23 16 -79 -99 -52 148 -78 87 -50 252 -60 -168 -12 -58 124 -326 -211 185 -116 57 -159 178
3548A78p7k37J98j75l7K49l74L53K35m94K45K00n4j73k30L40j11P5K5j78q8N2
$$ 178 101 -136 62 -113 -150 99 -275 78 313 -181 64 264 210 37 -193 147 36 111 136 -42 -130 -78
3570g8Q2J81j61j8M5km3N0k7J10j09M5K8k4j36O1j04k9J95j59k9K01j16l1o3J18
$$ -78 4 185 24 6 51 49 6 56 29 139 30 75 103 79 -57 4 -100 -129 66 -93 -122 79 -37 -68 -131 -13
3596a3J56l71K84j05j99Q9K44j7K5k78J90J63k79K71O8k36j8m0K84k84K00j94
$$ -13 143 -228 56 -49 -248 -159 85 68 93 -185 5 168 -111 160 228 -8 -26 -66 218 -66 134 -60
3618f0J6o7K56k05L2j9nj24J20P4j58J19J60o1j02K1n2k4L02q5j27R3K43j59k25
$$ -60 -44 -111 145 -60 -28 -47 -52 -176 -56 18 -140 -21 139 78 -24 -3 -55 -79 223 138 11 104 347 188 -37
3643c7L0J77l95K43P4J97m54j8J16q0R5j34K71k94J19J39j52J30J4J21o9j43K64
$$ -37 -7 170 -225 18 92 289 -165 -183 -67 -147 -52 -186 85 -209 -90 49 -103 27 41 162 93 -50 214
3666B14k03l9J62j30K23l6k72J85O5k25J21j94Q6j59K54jj90N1pq4L20k18j30
$$ 214 11 -28 134 4 227 191 -81 104 169 -56 65 -129 -43 -202 52 51 -139 -88 -95 -179 141 -77 -207
3689b07L33l3K03j40LO5k18M00o44J85J02K6l06J13J82J8j36J95k03j95K02j1
$$ -207 126 93 296 156 159 224 6 406 -238 -53 49 75 -231 -118 64 82 -54 141 -62 -257 -55 -66
3711f6N5J8j06J70n9k7J5l0Q2J36j45m6J25n00M26qK44l67j17K64j51Q9J41j9
$$ -66 -11 7 -99 71 12 -15 0 -30 52 188 43 -3 122 -378 48 40 284 -83 -200 64 -87 2 143 124
3735A24l22J19O9P4m9j04J30k43M12k83l1K0K26j96J44kk32K71k16M5R0J9J7o4
$$ 124 -198 -79 -10 64 15 -89 41 -202 210 -73 -104 -84 142 -54 90 88 -144 127 -89 -44 46 65 82 18
3759A8o6J94q3Oj97J47j99K75J53k39QM1j22L7J71k71J26p3J5K1j04J12oj15K4
$$ 18 -48 146 63 69 -128 19 -180 95 248 9 17 58 -64 -27 144 -127 -1 -74 -59 -38 -142 -30 -36 -151 -127
3784a27J14J43p0k11J58nj24R6J37j10L10l05P5m9P0k44J45Opkj2K49j58J42k30
$$ -127 -13 130 60 -151 7 2 -122 -26 111 1 311 6 81 32 102 -142 3 9 2 0 -12 237 79 221 -9
3809iOj5k0k05O7Q2K02k35K29K74l67K70k28n4J35j76K03q8K5j17P8nJ8j53j56
$$ -9 -3 -18 -38 -243 -176 -94 108 -127 102 376 9 279 51 -3 132 -44 159 71 96 -21 57 52 70 -83 -239
3834b39J50l3J34l09M62k10o3J11ln2NJ94j39l9J03j33n1K46N4k87Q1p6J4J01
$$ -239 -89 -122 12 -297 165 -45 -108 3 0 -52 -47 147 8 -31 72 -61 -112 134 188 -99 -18 -94 -80 21
3858B1j01J77j09j32Oq9o9K93l3j84J16J50j60j5M9lK7l0J49LR3J8o4j27J56j09
$$ 21 -80 97 -12 -144 -138 -227 -296 -3 -36 -220 -104 46 -114 -129 -80 -83 -56 -86 63 66 159 177 113 -14 142 33
3884C3j2O3J40j59j2M3j28j47M48j91l0J41l91J36K6j01P7M4j41M61r8k74J13
$$ 33 21 84 224 65 53 96 -32 -179 269 78 48 189 -202 -66 -40 -141 -64 -20 -161 300 202 -72 41
3907D1k7J1L8O3J29j78j28M59k06j96O3l3j32Q5k31L98q4j96J19K04j88k00o5
$$ 41 14 25 63 126 255 77 -51 408 202 6 69 36 -96 -11 -242 156 72 -124 -5 199 11 -189 -254
3930b54K64M0k83N96m20j10K6K59j00p7R4k74L47J22l75R5R7j08J23J0L2j85K75
$$ -254 10 50 -233 363 -57 -167 -141 118 18 -59 35 -239 108 230 -145 -50 47 -61 62 72 104 -81 194
3953A94j87O0P6j70k2N5L5r7N0R4J37k19%l6O1p9J68l35M97k5l12J53j29K2R7
$$ 194 7 67 143 -27 -49 6 41 -56 -6 88 225 6 6 -30 31 -48 120 -215 282 257 -55 98 -31 -9 88
3978H8p5j16J08l1K61k29p9K12j6m71N55j10j03k08K70k44K25j03j47J48j23K50
$$ 88 13 -103 5 -26 235 6 -73 139 123 -348 207 97 -6 -214 56 -188 37 -66 -213 -65 -188 62
4000F2j87J73o1j87J74K16j72M2J35k64j06K85rL1q4n4j6K07k89p8Q1J70k2j68
$$ 62 -125 48 -13 -200 -26 190 18 60 195 -69 -175 110 101 132 48 -6 -22 185 -104 -182 -101 69 47 -121
4024a21K44j77K00p9m8j76J11K6N4%j52K32o6K18j14j18j88L75j76p3p9M32j89
$$ -121 123 -54 146 67 19 -157 -46 -20 34 34 -118 114 48 266 152 34 -154 221 45 -28 -107 325 136
4047A36j67J4J46K2k83N5K57k64mL1n6j78J02jk9K33K2L1J20j71J46j62K41J73
$$ 136 -31 -17 129 151 -132 -77 180 -84 -88 -57 -113 -291 -189 -190 -219 14 36 67 187 16 162 0 241 414
4071D14l38j02mj57L15p4R9k80P3K02k14j96M52k39q8J45k7j48M92n05K37Km1
$$ 414 76 -26 -30 -187 128 54 153 -127 -54 148 -66 -262 190 -49 -137 8 -19 -167 325 -180 57 59 18
4094A8q9J32R9j84j00J84m3K1j58K95k71K03j59j3k7k8Q7K45k98j14J6J61j68
$$ 18 -71 61 160 -24 -124 60 17 38 -120 175 -96 107 -52 -65 -92 -120 -33 212 -86 -200 -184 -23 -191
4117a91J67ML9m9L2K4o0r6L8J38J52j44k0r5N1N9n7J30j36M9N6L4j2j94R6j13
$$ -191 -24 -20 19 -30 2 26 -34 -130 -92 46 198 54 34 -61 -10 49 -8 122 -14 35 91 125 113 -81 15 -98
4143i8Q8N8j47l3J58po2J22K4j95J60j09j25R0J53k51M6J16qM5N9j72J4J80q8
$$ -98 -10 48 -99 -132 26 19 -43 79 103 -92 68 -41 -166 -76 77 -174 -128 -12 -20 25 84 -88 -74 106 18
4168A8K4n3Kk15O6K83pr2R1kj2n9j95K34k68K1k5k3J42k31J50j44L31m5oq6J49
$$ 18 42 -11 -9 -224 -158 125 118 26 117 115 103 44 -151 83 -185 -164 -189 -212 -70 -301 -151 -295 36 -9 -15 -101 48
4195D8q5O6P0L0j75N2m0Q9j3j74L24j69k33J68P5o2J86k80n3J79n9M0k26k5J58
$$ 48 -37 29 99 129 -46 6 -34 55 42 -132 192 23 -210 -42 33 -29 157 -123 -176 3 -56 -16 -242 -267 -109
4220a09K50n1k5K83k54J29m3q7j81L09k04n1J78K9L3j80J75k83j67M11j75j01
$$ -109 141 90 65 348 94 223 180 93 -88 221 17 -34 144 173 206 26 201 -82 -249 162 -13 -114
4242a14LL0J26j33J85j80K32N4o9j62N4lk81M52l69M10j6j62j31J84k4q4J81k27
$$ -114 -111 -81 45 -88 97 -83 149 203 134 -28 26 23 -258 194 -175 235 219 57 -74 110 86 2 183 -44
4266d4J39q4j97L11J06l07r8J78oK2J05j58l3N0j25J39o3Q9j28R6J01P5Q3k27
$$ -44 95 11 -186 125 231 -76 -174 4 -2 20 125 -33 -66 -16 -141 -2 -65 24 -104 -8 93 168 251 24
4290B4j37J30P6K6j25k07J33kL1J24l17N9L01P5l57M0J22J15o2O3k89J64J13p5
$$ 24 -113 17 93 119 -6 -213 -80 -82 -51 73 -244 -185 116 191 -166 -126 -4 111 49 112 -177 -13 100 25
4314B5j98N8N9p1o0J45j20J76MJ51k90M6J87p4n5rJ34j94j83M39k68R4j46J46
$$ 25 -173 -115 -56 -127 -187 -42 -162 14 18 169 -121 -75 112 38 -17 -26 108 -86 -269 170 -98 -4 -150 -4
4338dJ5O6r5k4J76l14R7J38p6r2K07j84R1J5Q1k96J23K48o0J2l37M67j21j60J68
$$ -4 11 77 -18 -42 134 -180 -83 55 -21 -113 94 -90 1 16 97 -199 -76 172 112 124 -213 254 133 -27 141
4363A41p7j2n5J26k57O7j2k57J46K39k66K39p0M3MO6L4Q1k23q2Q4M6k10L63l0
$$ 141 64 52 -3 123 -134 -67 -79 -336 -190 49 -217 22 -48 -5 -1 65 99 180 -43 -125 -41 5 -205 158 128
4388A28j23P5o8j60M48k95J64l51q6L84j29q8K52k41Q5p8K2r5J27K85k40j53q9
$$ 128 5 80 12 -148 300 5 169 -182 -268 116 -13 -101 151 -90 -5 -83 -61 -156 -29 256 16 -137 -226
4411b26K72k64O7K45j26K90j36j63J97j56J12k7j53j76J93K4j38N0l5J62j30o6
$$ -226 46 -218 -151 94 -32 258 122 -41 156 0 112 85 -68 -244 -51 -27 -165 -115 -150 12 -118 -184
4433a84k8K19j68J64J00k31K07J52k11Q6J63j32J14k51J65q3J38k13o3j96K22
$$ -184 -212 7 -161 3 103 -128 79 231 20 106 269 137 251 0 165 82 220 7 -56 -252 -30
4454c0pMj21P1j17L99k17j58L22k71J16l3j04j3k2K27M7k33r7K90J69N3k8l12
$$ -30 -37 -33 -154 -83 -200 199 -18 -176 146 -125 -9 -42 -146 -159 -181 46 93 -140 -237 53 222 275 247 -65
4478f5J19k4O9q2J37k43r9L9K00j36jk2J10K1k31O1P6Kk08L21j32J34j39P5l3
$$ -65 54 30 99 17 154 -89 -188 -149 51 -85 -86 -108 2 23 -208 -147 -71 -69 -277 44 -88 46 -93 -18 -51
4503e1J16l1q0J01k5J16j80k8J74j67p0L74k18J8j08n2L50l44j34L02Q4j35p7
$$ -51 65 34 -46 55 30 146 -34 -62 112 -55 -125 249 31 49 -59 -111 239 -105 -239 63 147 12 -65
4526f5N5r1L5J96j71rK20j87m6LJ8l7Pk21K73m4O9J0q9J13J07j35k72K04L04r6
$$ -65 -10 -101 -66 130 -41 -50 170 -17 -63 -60 -42 -79 -72 -293 -20 -64 5 15 -74 39 146 11 -261 -57 247 151
4552A51k29J73j1j00J55j94M6J49q6N2o9oj24R3j00J02J87k76J46m1K6J55L1q8
$$ 151 -78 95 84 -16 139 -55 -9 140 54 106 37 31 -93 0 -100 2 189 -87 59 18 44 199 230 142
4576A42j68P5l4q8J27q2L4N4RN2L3n2M2l32J75k02P9K41o9r7O9j0o3j5O5J35n1
$$ 142 -26 49 15 -73 54 -28 6 60 69 121 154 102 144 -188 -13 -215 -136 105 36 -61 8 -2 -65 -80 -15 120 69
4603F9M1j58K02n3j93Q9K8j46q5p8K95j00L4j18J69m2m9K09j70J96k85j61J87
$$ 69 110 -48 154 101 -92 -3 25 -121 -206 -284 11 -89 -55 -173 -4 -46 -95 114 -56 140 -145 -306 -119
4626a19K43j39r4P0L42k5l08J11k74J71K00j96l2K6J04l02J74k3J72l10L9J84
$$ -119 124 -15 -109 -39 303 278 -30 81 -193 -22 178 -18 -50 -24 80 -222 -48 -71 101 -209 -170 14
4648A4j94L7K30k56K5J11P1j58m42N44R8R7q2j33K40q5M7j40n5P1j40N39o25J80
$$ 14 -180 -143 87 -169 -144 -33 38 -120 -562 -18 80 177 95 -38 202 117 164 24 -31 40 -100 439 -186 -6
4672fp6pP2J26k21Q8K51k80n2j59L25pj38m3Q6l6K5J77O3o1l1L6K25l84M9j60
$$ -6 -82 -89 -17 109 -112 -24 227 -53 -105 -264 61 54 -84 -127 -41 -77 -52 125 188 127 96 132 357 -27 22 -138
4698a38L02k02N7QlK60l09n9J29j91L66q2o6p5N1j40K4K52k20k8Q5k14L27k22
$$ -138 164 -38 19 27 24 284 -25 -84 45 -146 220 138 72 -3 48 -92 -68 184 -36 -64 21 -193 134 -88
4722h8q3j27L91J66m7j41n8P2j7n9j33L54j24j49O4j3L24m09J3J15PJ7M4j28N9
$$ -88 -171 -298 93 259 212 71 13 85 68 9 -124 230 106 -43 21 8 332 -77 -64 51 58 75 119 -9 50
4747E0j31K1J22k21j65K75j29K66j26k10K28j9K60j15j76l7K13p8r4N9q7O4M2
$$ 50 -81 -60 62 -159 -324 -49 -178 88 -38 -248 -20 -39 221 106 -70 -107 106 28 -66 -7 -94 -30 12
4770A2QR4N0l31J09J66Qj31L6J48j54l2r2J32p5M1J39Q3k66J34K6j28j7K89j82
$$ 12 20 114 164 -167 -58 108 116 -15 21 169 15 -17 -109 23 -52 -11 128 211 -55 79 105 -23 -40 249 67
4795F7j10O8J41k03q0N5L9N9o9k4j7j83J24L49l96J04L01j28k2j36K55J9m8j20
$$ 67 -43 25 166 -37 -117 -62 -23 36 -33 -57 -74 -257 -133 216 -180 -76 225 97 75 -61 194 213 165 45
4819D5J60l02O8j68J51Kj5j28K27p5q2J23lk36J88q0nN6P2k4r1j01PK51p4L9j13
$$ 45 205 -97 -29 -197 -46 -44 -59 -187 40 -35 -117 6 3 -233 -45 -125 -130 -74 -2 -26 -117 -218 -211 40 -34 5 -108
4846a08J67J2j42L9j52Q5L7J56p9j39J00J9J90p7l09N8K75m3p2p4Q7k11J73j9
$$ -108 59 71 -71 -32 -184 -99 -62 94 15 -124 -24 -5 185 108 -201 -143 132 89 17 -57 30 -181 -8 -27
4870b7j60K94j15j7j14K19n4L01k31pK22l31k62J89K4K85l23K90j86J62k41K50
$$ -27 -187 107 -8 -25 -139 80 26 327 96 89 311 -20 -282 -93 -69 216 -107 183 -3 159 -82 168
4892A68l72L6L71j80m7n0J72m0j63K7k4p6K07q2Mj85L17j90J71n2j49J75n5K19
$$ 168 -204 -168 203 23 -24 -74 98 58 -105 -78 -102 -178 29 -53 -49 -234 83 -107 64 12 -137 38 -17 202
4916B02j26m6j20K22k09m3K65rO5k08O3r3l3J87j79K15r1j07p7J9J44J89k32K6
$$ 202 76 30 -90 132 -77 -120 145 136 201 -7 56 -37 -70 117 -62 153 62 -45 -122 -103 41 230 -2 24
4940B4m5k64L77q9Q4l73L65N8j75k7n9K91k23Q3K4%No2L2P3j14jJ60k05j63K22
$$ 24 -21 -285 92 3 87 -286 79 137 -38 -65 -124 167 -56 27 51 51 56 -6 26 99 -15 -16 144 -61 -224 -2
4966bL2p5k3K9p1N0K23mr2j53M4L6J40K4m10J02K90j75J75p1J32k14l3o7J53j17
$$ -2 30 -45 -68 -39 -110 -60 163 159 67 -86 -42 -6 134 158 -252 -150 140 -35 140 69 201 -13 -46 -113 40 -77
4992g7K28j90m0N2n5k12J32J90m46M00N9j82L84l45R8M7J6R1k34K49r0j49LK04
$$ -77 151 -39 -79 -27 -82 -294 -162 28 -418 -18 41 -141 243 -102 -4 43 59 150 -84 165 75 -74 -71 133
5016A33j50q9J14%k34L85m16L66l87O1K06j01j05J50K04j40k8L4P7j41O0J79n9
$$ 133 -17 -106 8 8 -226 159 -257 109 -278 -217 -11 -112 -217 -67 137 -3 -31 3 80 -61 -1 178 119
5039A19o7o9K9J87j27o5j79L04Q7k02J24k20m3J13k3m3J49rj71m2L2O7L3J23j96
$$ 119 52 -17 12 199 72 7 -172 132 219 17 141 -79 -122 -9 -32 -75 74 65 -106 -148 -116 -49 -16 107 -89
5064h9K00k70K23p3J32l22L40k9j31j22M32j40k45l4m6M81l52kK50j22k27K12
$$ -89 111 -159 64 -9 123 -199 141 112 -19 -141 291 151 -94 -128 -174 307 -45 -47 203 81 -146 66
5086F6o8P1j05Pm32M52K3N2N7j00J59j61K50j09l6j81K75j63p6M0J6o7J16Q5j49
$$ 66 -2 69 -36 -29 -461 -9 14 66 123 23 182 21 271 162 126 -55 220 57 -19 21 37 -30 86 171 22
5111B2L05j75l97L35Q0j46M5R4j99L36k70J27j90J7p6P7n7j12K06j3j62R9J60
$$ 22 327 152 -245 90 170 24 69 163 -36 300 30 157 -33 -16 -92 -15 -72 -184 22 9 -153 -54 106
5134A06j15J54O7j03K3k29O7K17J8k01P1l9n6P2O1m2l5K63m06K29k71J14q6m5
$$ 106 -9 145 212 109 132 -97 -30 187 205 4 75 36 -20 52 113 71 36 299 -107 122 -149 -35 -121 -166
5158a66J75rj3k90L24M1l03N1K06Q9j10m9OJ54k55rL37k19j11L08L3j72j1k23
$$ -166 9 0 -13 -303 21 62 -241 -190 16 105 -5 -54 -48 106 -149 -158 179 -40 -151 157 190 18 7 -216
5182b16K00J09l00J84j21nk37K34R1l3Q7J35K6m53M50j00J68k31j2Q9m0k01O9
$$ -216 -16 93 -207 -23 -144 -149 -386 -152 -61 -94 -7 128 154 -299 151 51 219 -12 -24 65 25 -176 -107
5205a07J59J6j80o2J92l2K23j92RJ75m8k75R8p8J83o1L6L12l94j67J36K06K50
$$ -107 52 68 -112 -174 18 -14 209 17 26 201 153 -122 -24 -102 81 20 56 368 -26 -193 -57 149 399
5228C99k65j83K54j76l03L45j22J06k88K63J86o7o4k16R8j6q8J99j49%P4q7J11
$$ 399 134 -49 205 29 -274 71 -51 55 -233 30 216 149 85 -131 -33 -49 -137 62 -87 -87 -13 -100 11
5251A1K08k22m6k19N3J73J96pj63mn6j08K27q8PM9O3N0l08j9J74R1k9J83k62J13
$$ 11 219 -3 -49 -268 -215 -42 154 147 -16 -20 -76 -184 43 -45 -38 11 74 124 -184 -203 -29 62 33 216 -46 67
5277F7j30J5p4L2Q7K50k80J84m66K62M00l83M43m34j62J11K44l12J49j81J67K02
$$ 67 -63 -48 -122 -90 -3 247 -33 151 -315 -53 347 -36 407 -27 -189 -78 166 -146 3 -178 -11 191
5299A91L5km49L20J3n4m9m8J29j64jJ03l1l66O07k59r4MR8j71K23Oo7J27j40o3
$$ 191 226 224 -225 95 108 54 5 -43 86 -78 -79 24 -7 -373 234 -25 -119 -115 -17 -188 35 41 -26 101 -39 -102
5325a02K1K64j57j30N9Q7j2J40k67K05k33l8L28k16Rj93J72k7r9L14p5m7j39J01
$$ -102 -81 183 26 -104 -45 42 30 170 -97 108 -125 -163 165 -51 -42 -235 -63 -90 -189 125 50 3 -136 -35
5349c5J2L0L06l40J52j10J51j37K14l50J14Q3j49N7Q4j64J51R3k46J21r8mO6m6
$$ -35 -23 7 313 -27 125 15 166 29 243 -107 7 90 -59 -2 82 -82 69 162 -84 37 -61 -65 1 -45
5373d5m2k6J01k3M7j58N8K23k7k34J22J70j54J66j21j34K88k60N8J37o1N5q1k55
$$ -45 -87 -113 -12 -35 12 -146 -88 135 108 -126 -4 166 12 178 57 -77 211 -49 9 146 85 140 59 -196
5397a96J94r8n0K43l42n6K51o3n0J41j99J64J70Nj78j08J61j07j03L67j16P7L2
$$ -196 -2 -100 -150 93 -249 -305 -54 -117 -167 -26 -225 -61 109 114 -64 -172 -11 -118 -221 146 30 107 139
5420A39l1l1j66l7L2K69q6m9oj51J70mK7j81J48lr3J70j63%J20j80K35R5m15L91
$$ 139 108 77 -89 -126 -94 175 89 40 34 -117 53 49 76 -105 43 40 -53 117 -46 -46 74 -106 129 224 -191 200
5446B00j0j84J5j2O2l6J02k60J49p2p8MJ33J19j54R3k03M4K91j80J23k11MK68
$$ 200 190 6 21 9 71 35 137 -123 26 -46 -124 -120 13 132 -22 71 -132 -88 203 23 146 -65 -61 207
5470B07k71K6R0Mj51K1J88k4l2j23KJ26J59n31L54j68J57J29q7j9j66J69K3m4
$$ 207 -64 -38 52 56 -95 -74 114 90 58 -65 -63 63 222 -309 45 -123 34 163 76 57 -109 60 83 39
5494C9L5j10K49k72K06P2L2n21L98K02k64k17J46Qp6J65q4J06j00r0P0jo4o2J54
$$ 39 74 -36 213 -59 147 219 251 -270 128 330 66 -151 -5 3 -73 92 8 114 14 -76 -6 -7 -71 -133 21
5519B1J54k65K54k84L20m53K70j44J65k34K98l08l8K11j16J78j35K9J77Q5k54
$$ 21 175 -90 164 -120 200 -253 17 -127 38 -196 102 -206 -244 -33 -149 29 -106 -77 100 185 -69
5540f9Pj9K35R0l24l4K5L24m16L71j27j88k3O9J54j92J19j7j82Q9N3j12P6n5R2
$$ -69 -62 -81 154 244 -80 -114 -89 235 -181 190 63 -125 -148 -79 75 -117 2 -15 -197 -108 -55 -167 -91 -146 -54
5565e4J76J29j94q2N5j43K62P0j62P8k71K00l75N08j69J07j23J62m20J36K10o3
$$ -54 122 251 57 -25 30 -113 149 219 57 135 -136 64 -311 197 28 135 12 174 -246 -110 100 37
5587C7K35k02J53m44K57j32J77k7r0j11K64J03j34L9Ln6N4J95l58K83l72K16K18
$$ 37 272 70 223 -221 36 -96 81 54 -36 -147 117 220 86 125 128 72 126 321 -37 246 -126 90 308
5610C08j57j84k0N9N9j97J91p2m7O0q0K19j97n0J32l6J69j40j00J60j84n3L29
$$ 308 151 -33 -53 6 65 -132 59 -13 -60 0 -80 139 -58 -108 24 -12 157 17 -83 77 -107 -160 169
5633A69j88Q2l5J24k24L10l09o6K74n3Ol33J47J48M5j54j73K12J44K06m18kR0
$$ 169 -19 63 28 152 -72 238 -71 -137 137 84 90 -243 -96 52 97 -57 -230 -18 126 332 -86 -88 2
5656Bj32P7k9K50j95M9J54j58L2R4p5j47L11j09o0j34J31m4KJ6M5l6J8j60J42
$$ 2 -130 -53 -82 168 -27 22 176 18 50 144 69 -78 233 124 64 -70 61 17 19 35 80 44 62 -98 44
5681D4J29M0j73N4q1k1k8l0J63j15R3r2j75m5K95j62o3K81K6l9j62J17j5o0Q8
$$ 44 173 213 40 94 13 -8 -36 -66 97 -18 75 -17 -192 -237 58 -104 -167 114 140 101 -61 56 41 -19 69
5706F9j43J21j21r2R9R2L3j28K00j89P4j7J6l1k21K82J84m3Lk56K06j81K3J1j
$$ 69 -74 47 -74 -166 -67 25 58 -70 130 -59 15 -2 14 -17 -238 44 228 185 188 -68 138 -43 -20 -9 -10
5731a0M4R3j69n3J93r9K74m05K59j20M6j93K65l15J17j31k1j92M65k39o7M39k79
$$ -10 34 127 -42 -95 98 -1 273 -132 127 7 53 -140 125 -190 -73 -204 -225 -417 48 -191 -258 181 -98
5754i8Q6p6j15K45p8J51j43O0R0L7MRj81KJ18j93J31nj22o0J41m6J65k79j27L39
$$ -98 -12 -88 -203 42 -36 115 -28 32 122 159 163 172 -9 -7 111 -82 49 44 -78 -138 3 -43 122 -157 -284 55
5780E5j0l43M83j1k35K42j49P5N6j23N0L3j14N3R4n8N7k24J97M9k15q2J97J68
$$ 55 45 -298 185 174 -61 181 32 107 163 40 90 123 9 62 156 98 155 -69 128 177 -38 -120 77 245
5804B45l27Q8J7o4j43K06O8l44M02k5o3j33K94k43j30N0K8K6J33j69Q8r0K57l97
$$ 245 -82 6 23 -41 -184 22 90 -254 148 123 60 -73 221 -22 -152 -102 -74 -48 85 -84 4 -86 171 -226
5828b26K40jQj78R8O4q1O4m1P6k9k0l0J45j68J42j16K0K3l3K3J41j89J21K0m4
$$ -226 14 13 21 -157 -59 5 -76 -12 -53 23 -6 -26 -56 89 -79 63 -53 -33 -10 -43 -20 121 -68 53 73 29
5854B9J4Q6k2J8j41M26k90pk39r6L11l20L15k49J48n2n5j60K09M8J47K7j01j50
$$ 29 43 129 107 125 -16 410 120 113 -126 -222 89 -231 84 -165 -17 -69 -124 -284 -75 -27 120 147 46 -104
5878a04J19J47k88R8l9J23j4k04L15j00q7j4l5J18K03j97r2J41Kp5o0K29m65K42
$$ -104 15 162 -126 -28 -67 56 42 -162 153 53 -34 -48 -83 35 238 41 -51 90 92 17 -43 186 -279 -37
5902c7L0j20j64L00j74K75o0J92l61K66l05K05l6K27j11L0j63k6K40j41R8Mj88
$$ -37 -7 -127 -291 9 -165 110 50 242 -119 147 -158 47 11 238 127 157 -6 -32 208 67 165 169 -19
5925a9q8j17K52n8J71k43j78K06O8k4k60qK60j55J75q9O6R3J12r1k06K41k60k6
$$ -19 -107 -224 28 -30 141 -102 -280 -74 -6 -30 -290 -298 -38 -193 -18 -107 -41 52 164 73 -133 108 -152 -178
5949a78K28l8O0p7r1pJ05L3O7k58J05j87J75Q5l30M03J4j48J4j50K64j28j37K04
$$ -178 50 12 72 -5 -96 -103 2 35 102 -156 -51 -238 -63 22 -308 95 109 -39 -25 -175 89 -39 -176 28
5973B8p3J11p2j01K61J2j73J27m1j7J4o1o0q7K03N5k40R5J82k94J28m1J1Q4P8
$$ 28 -45 66 -6 -107 154 166 -7 120 79 62 76 15 -45 -132 71 126 -114 -19 163 -131 -3 -44 -33 51 129
5998A29J5P7k74L39o27K68N8j36R7J99j58M6r4M44l16k77K06K13k03LJ59k72J40
$$ 129 144 221 -53 286 -341 -73 -15 -151 -54 145 -13 33 -61 383 67 -210 -4 209 6 9 168 -104 36
6021C6k45K08k5p9Q6Qk7J48j78q5K34p3k26L87o6k6j68j05L26k17ro6K20l9j00
$$ 36 -209 -1 -26 -105 -19 -11 -38 110 -68 -153 81 8 -218 169 103 77 -91 -196 130 -87 -96 -162 58 19 -81
6046h1JJ52j53j67K97m5r8J12k0O0j79K93l75P9K08J31q1j51r4Q4j34N4R0K03
$$ -81 -80 72 -81 -248 49 4 -94 18 -2 58 -121 172 -203 -124 84 215 134 -17 -111 -27 -161 -107 -17 186
6070A86k28j99N05o4j7k26K2K15l49L05k44L33j47j18K90j86L7j90K58l23j44
$$ 186 -42 -241 264 200 183 -43 -21 194 -155 150 -94 239 92 -26 264 78 115 -75 183 -140 -284
6091b84L91l3k22J00j12J79j58P0M3L4K7j63M0K19L0k09K79N4m04N8J25j87K10
$$ -284 107 74 -148 -48 -160 19 -139 -69 -26 8 35 -128 -88 131 161 -48 231 285 -119 -61 64 -123 87
6114H7L1N1k91K54k29j7K01j58k1J4J96k7r3k18L36m6mj08N3J2L4k32O1K83k00
$$ 87 118 169 -122 132 -97 -114 87 -71 -92 -78 118 91 -2 -220 116 70 66 -42 11 23 57 -175 -114 169 -31
6139c1J17j15j66M80k59J35k91J88k71K17K6k3o2O6J6J33k11O6N7j83p5J62j05
$$ -31 86 -29 -195 285 26 161 -130 58 -213 4 30 7 -55 11 27 160 -51 15 72 -111 -186 -24 -129
6162a29L31j14Nl05J2J26O3K10l46lJ05J68j48J88k71M3l5J48n4J13j42j7O7Q
$$ -129 202 88 93 -212 -200 -74 -11 199 -147 -150 -45 123 -25 163 -108 -65 -100 48 -6 107 -35 -52 15 23
6186B3N4j05l3L1l4J39L35m35J26N5l03K36k61K05J16k40J60j47q7M01j68q3j15
$$ 23 77 -28 -61 -30 -64 75 410 -25 101 156 -147 89 -172 33 149 -91 69 -78 -165 236 68 -15 -130
6209a30J49J0nJ81j62K8k5j97j68N04k00P6M6mk2P3k13N4K27j89j27J00q8J19
$$ -130 19 29 24 205 43 71 46 -151 -319 185 -15 61 107 103 81 154 -59 -5 222 33 -94 6 -82 37
6233C7P6k62K11Kj42M1j46j25K39k8N8P4j76L41l36K82k76K71j99K31QK4l41J01
$$ 37 113 -149 62 64 -78 -37 -183 -308 -69 -97 -39 35 -141 200 -136 146 -130 141 -58 173 181 205 -136 -35
6257c5MJ00k69Q9P9K50k13n9Q5j22r7L10k92K33O5j18j49K01O8n8k09m7K90L5
$$ -35 -31 69 -200 -111 -32 218 5 -54 31 -91 -188 122 -170 63 128 10 -139 62 130 72 -137 -184 106 141
6281A41k74J07J6k04J40rJ54j55P8R3k04p1L09l8O6ook36J11J19l20M32q6m3J00
$$ 141 -133 -26 -10 -214 -74 -83 71 -84 -6 87 -117 -188 121 83 149 143 137 -99 12 131 -189 243 157 114 214
6306B14l01O0O2N2k56L1L67k61L7j27K09j42J29J72k15K18k12o1J88l08J72j84
$$ 214 -87 -27 35 87 -169 -138 229 -32 5 -122 87 -55 74 246 31 249 37 -24 164 -144 28 -156
6328a56J62q1J45np9l9J53J24l15L02k62J5J42P6l88J21K52q1k7n0J00j12J9j2
$$ -156 6 -75 70 65 -14 -53 100 224 -91 211 -51 -36 106 182 -206 -85 167 86 59 9 109 -3 16 4
6352Dj11J39k5oQ2l9J22j07k52K82j05J7M1j4m3K09j31k35J27k61K29N8R8K3K4
$$ 4 -107 32 7 1 83 44 166 59 -193 89 -16 1 42 28 -15 194 63 -172 -45 -306 -77 -19 79 102 126
6377A26o5j57j66L79k63J50J12K4Nj98R9JK16k44j23J02j45K2K28j40J5M5J12
$$ 126 61 -96 -262 117 -146 4 116 140 145 -53 46 47 263 19 -104 -2 -147 -125 103 -37 -22 23 135
6400A35j17N1J10k72j76L15M4j36j00K43N4L8l58K07J61j04k08J92l21K15J49
$$ 135 18 69 179 -93 -269 46 90 -46 -146 97 151 189 -169 38 199 95 -113 79 -242 -27 122
6421A22q2j68m7J47j40K72Q4k55K71m69J08L46k91K58k50m0K44K6K4k09J12l2
$$ 122 40 -128 -175 -28 -168 104 188 -67 204 -265 -157 189 -102 156 -94 -134 110 136 160 -49 63 31
6443C1p5n3N4j62K17Q7j98J02J6j9K36j88J3m5k91L35l23K27J7K8j1j09N1J78
$$ 31 -44 -97 -43 -205 12 99 -99 3 19 0 236 48 61 16 -275 60 -263 -36 -19 9 -2 -111 -60 118
6467A18k36k11K97j43J90j07R0J6k2m8o7J69m8J03m2k01q6J94Jl65L33J00k88
$$ 118 -118 -329 -32 -175 15 -92 -2 14 -8 -56 -123 46 -2 101 59 -142 -228 -34 -33 -398 -65 35 -253
6490b53J79K94k14p6OJ98q5m1l07M66j06Rj2k52M75l21O6k9k05R4R2K31k11j0
$$ -253 -74 220 6 -70 -64 134 49 8 -299 167 61 70 58 -194 281 -40 26 -3 -208 -114 -22 209 -2 -12
6514a2j6j4J24j45K68n6k03%M3n4j1j06L09m24L69r3O9n1k72J56J63Q7l4k04L
$$ -12 -28 -42 82 -63 205 149 -54 -54 -11 -65 -76 -182 127 -297 72 -21 48 -3 -275 -119 44 131 97 -107 -104
6539a04L27k98K6N6L59j84k10o5k0l8K82m0R5m36L92Nn2q9k14J85p7M3l0J03j92
$$ -104 223 -75 -49 7 366 182 -28 -93 -113 -151 131 91 186 -250 142 147 95 6 -208 -23 -100 -57 -87 16 -176
6564a76K80l5R5j12j48K97m15J22J2L16j31k05N2M77o06L9K78k93L12k00j79p4
$$ -176 104 69 164 52 -96 201 -214 -92 -80 236 105 -100 -48 429 -177 -138 140 -153 159 -41 -220 -294
6586b94L60j41k0K05j03M19n12N1j05K31j63J9K41j86m6N8q8j60K38M0j91J61
$$ -294 66 -75 -95 110 7 426 -86 -35 -140 91 -72 -53 188 2 -44 14 -74 -234 4 44 -147 14
6608A4n8j91M23k44J72k57J18J40j73K17k04L7K5m1l6J89j22p9r2J39M6O8j92
$$ 14 -44 -235 188 -56 116 -141 -23 117 -56 161 -43 -6 19 -22 -58 131 9 -70 -162 -23 23 91 -101
6631a01J05P4J9r3p8K29k67K27j87J9Q8J49j19o7lJ40j9j41O3Q8Q1j19k64p8L03
$$ -101 4 78 97 4 -74 155 -112 115 -72 -53 35 184 65 -2 -5 135 116 -25 38 126 207 88 -176 -254 49
6656D9n4j79L18M0k28j70J10k5J04j48J55QR7k03K06k26K48l4k4j18P9n3O3r4
$$ 49 -5 -184 134 174 -54 -224 -114 -139 -35 -183 -28 -20 77 -126 80 -146 102 68 44 -74 5 -48 15 -79
6680g9J11N0J4j11j70M10k26P9O2k06j19Q5O4RN7j54NM5q1O9K16k40K57k1k4N3
$$ -79 32 82 96 -15 -185 225 -1 78 140 -66 -185 -100 -36 -27 30 -124 -119 -74 -155 -86 130 -110 147 126 102 155
6706A55j99L39m46J95p9P0L9P7k29K82j32J60k34J02k79J03Km8lL62j86J25k34
$$ 155 -44 295 -151 44 -35 35 74 151 -78 204 72 232 -2 100 -179 -76 -74 -122 -125 237 51 176 -58
6729e8M7J12j26L75l03J01k25P7p0K26k49Q7l8J38P9o7j15O6l3J02j34Q7j21K57
$$ -58 -11 101 -25 350 47 148 -77 0 -70 156 -93 -6 -44 94 173 106 -9 57 24 126 -8 79 -42 215
6753B15j96O4m26L50K13m01K49k01J56J15k24p5q8J01J69J25k89l5J59R7j97J79
$$ 215 19 83 -343 7 220 -181 68 -133 23 138 -86 -161 -249 -148 21 146 -143 -178 -19 78 -119 60
6775F0J22j39j85J28M9r8j30L91l42J74K49k92K10k32M8j08L26k32k5J08j94K80
$$ 60 182 43 -142 -14 35 -63 -193 198 -144 30 279 -13 197 -35 13 -95 231 -1 -26 82 -112 168
6797A68j06n5m9K58j65q1r2P9J38k16J80Q7l6j27n5K61k61R1M4M8r4M8m9k21J01
$$ 168 62 7 -42 216 51 -30 -122 -43 95 -121 59 146 110 -17 -72 189 -72 19 63 111 17 65 16 -205 -104
6822a04K08k48K6K54l38P2J88j69O7k45L88r6N8K33q3k12Rj04J66j33Q9j3Q5L5
$$ -104 104 -144 -118 136 -202 -130 58 -111 -44 -289 99 3 61 294 211 -1 8 -96 70 -63 26 13 98 133
6846A33O6l54p6K18J10L6k3l06J08RK57Q8l83K98k35j64K91l03K80Q1j32j50j23
$$ 133 199 -155 -231 -13 97 133 110 -196 -88 -79 178 266 -117 181 -54 -218 73 -230 50 131 -1 -151 -274
6869b74L57O1pk44j08L55P9m12J73K7k1L5O5J8q1P4k39L09j79J51l09K01l6N1
$$ -274 83 144 137 -107 -215 140 219 -193 -20 7 -14 21 86 104 23 97 -142 167 -12 139 -170 31 -5 46
6893D6r5m0J12J4o9J27J12k98j31P4pJ67L69k03l29J97k80L75j41K8j54J29K45
$$ 46 -49 -89 23 37 -32 95 207 -91 -222 -148 -155 12 381 178 -151 46 -234 141 0 28 -126 3 248
6916B48j42k1j66P5J4N1P6M7L7l59J65k43M04j96N0kj13J74j2j2j76K6K70k86
$$ 248 106 85 -81 -6 8 59 135 182 219 -140 25 -218 186 -10 40 38 -75 99 87 75 -101 -75 195 -91
6940i1J90k7k72J20N6j11M8m8K90L3l54K3M34n50L39j46J4J80j01J78m24K45j29
$$ -91 99 72 -200 -80 -24 -135 -87 -135 155 188 -166 -143 291 -259 80 -66 -52 128 27 205 -219 26 -103
6963a03J3J77O8k21M8n1q4L16l38J82N9k60K43L8k53N9L68j61j45K28k16m3J89
$$ -103 -90 87 155 -66 -18 -69 -153 163 -175 7 66 -194 49 87 -166 -107 261 100 -45 183 -33 -76 113
6986A13J7L2k63J89k06J50k0jL0q2L6M2L8p6o0r5p6J92R8q0o2J73J3Qj66n2O9
$$ 113 130 162 -101 88 -118 32 12 11 41 -41 -5 37 75 -1 -61 -156 -232 -40 58 -22 -84 89 102 110 -56 -108 -39
7013c9j32K42j1J61l13Q6O3j69K76k27J14l04M71k49k15R6K69k93J22L0Q0j19
$$ -39 -171 71 60 221 -92 -6 57 -112 164 -63 51 -253 218 -31 -246 -150 119 -174 -52 -22 58 -61
7035f1oJ1j98K71Kl80O91l56J89k04L8n4N6m0L22k29P7n6j22K31k6j85J49K19
$$ -61 -67 -56 -254 17 19 -361 330 -26 163 -41 -3 -57 -1 -41 281 52 129 73 -49 182 156 -29 120 339
7059C39k13J01r3l14K41r8K42k90K85l84K06p4j09L40k61J63J8j57ll6n0m0k0
$$ 339 126 227 134 -180 61 -37 205 -85 200 -184 22 -52 -161 179 -82 81 99 -58 -61 -97 -147 -187 -207
7082b07R8J89J1p1K69j89j41p3L72k02k53J21o2L8MJ15j32K11j94p2K63P2j25
$$ -207 -109 80 91 20 289 100 -41 -114 258 56 -197 -76 -138 -100 -96 19 -113 98 -96 -168 95 167 42
7105D2j16J73o7Q7k72K72m8j00J6j0J7j91J84K61k03j21m0K39K5j49L5k77J31
$$ 42 -74 99 32 119 -153 119 71 -29 -13 -23 -6 -197 -13 248 45 -76 -116 123 148 -1 34 -243 -112
7128a12K73k18lQ1O3J46j30k34L24l09K61j35pJ11PM1j70J18l4j19J8J66k17k26
$$ -112 161 -57 -60 21 84 230 100 -134 190 -119 142 7 0 111 118 159 -11 107 73 -46 -28 138 -79 -305
7152c05L38j67K7k3N5L29l37J99J94k58j63M1J32k2Q1q8o0P3n4j13O5j7JK02j45
$$ -305 33 -134 -107 -130 -75 254 -83 116 310 52 -111 -70 62 40 121 33 -27 46 -8 -121 -56 -73 -72 130 -15
7177a5k6J29m91K28K36J98l16J40j92N4J18k56K14P1Kk92K29j65M0P6j26L71j41
$$ -15 -41 88 -403 -175 61 259 -57 83 -109 -55 63 -193 21 92 94 -198 31 -134 -94 -18 -144 227 86
7200H6k4K87m31P1J47J4P2k00o2J97k13q7L82k23O6p5k48K92r7J25k7o9J37k35
$$ 86 62 349 -82 -11 136 150 222 22 -40 157 -56 -143 239 16 82 7 -241 51 -46 79 52 -17 120 -115
7224a15M1o9O2J55k48M80l39J27l6J32k01K73J1j82j76J76k4N7j4l15L43L0J0
$$ -115 -74 -143 -81 74 -174 306 -33 94 58 190 -11 262 273 91 -85 91 67 124 110 -205 138 168 178
7247A78j63K14k07o0Q3j37J54j20J24j9n2K9j68J66J43o5J00R1j99j0m5j86Q6
$$ 178 15 229 22 -38 45 -92 62 -58 66 47 -5 24 -144 22 165 100 200 291 92 82 37 -149 -63
7270f3K12j70L2j14j32L58o0P7j14k57L9Q3J31O0l14L92j13q5J1m5K93rk88K75
$$ -63 149 -21 11 -103 -235 123 63 140 26 -231 -192 -109 22 82 -232 160 47 -38 -27 -72 221 212 -76 199
7294A99k08k4J53K9k93j18K93r2j12J20l3L57k69K84k97o6J2q0P2J41P1j53k7
$$ 199 -9 -33 120 149 -144 -262 31 -61 -173 -53 -86 271 2 286 -11 -77 -65 -145 -73 68 139 -14 -41
7317d1J96j63M4J10l20J49O4p3J72k27P3K64k70j79P9R5O2j45R5j92J73j62K83
$$ -41 155 -8 36 146 -174 -25 39 -34 138 -89 -16 248 -22 -201 -122 -27 35 -110 -15 -207 -34 -196 87
7340H7J23k52p9J83R8j77oO1r5M21l84K16L4l39K07k07j0L05l12L1J06N6k16n5
$$ 87 210 -42 -121 62 160 -17 -23 38 -57 364 -20 196 230 -109 98 -109 -119 186 -126 -95 11 67 -149 -204
7364b04L29k66N8O3j83O8K54j91J53m2k12L37j82J26J00p0l5p9K2j83N2M31l28
$$ -204 125 -141 -83 -20 -203 -135 119 -72 81 39 -173 164 -18 108 208 138 103 24 46 -137 -85 346 18
7387A8j35J7J54j70R0L10l20j9p4P7J52j05rN6k01K16K2M5k22R6J9j4J61j66J10
$$ 18 -117 -100 54 -116 -26 284 -36 -55 -129 -52 100 -5 -14 42 -159 57 79 124 -98 -2 17 3 164 -2 108
7412A08m10L45qM5o4R2P1l05O0L24k97Q5k2r2N3J30l09M11j45R5j67n6o6%J09
$$ 108 -302 43 35 80 16 108 179 -126 -66 258 -39 46 24 -68 -15 115 -194 217 72 167 0 -56 -122 -122 -13
7437a3k2M5j13J23J25l16NJ61K22k21J23l16L9K48p5K9n2k5K10P1j30J01k21j61
$$ -13 -35 10 -103 20 145 -171 -166 -5 217 -4 119 -197 -158 90 15 44 -8 -33 177 248 118 219 -2 -163
7461a63K73j51R8J77k97J17j4m3R4p7J20J8j46Q6j1pr4l33J80P5K82j83j62R1
$$ -163 110 -41 57 234 -63 54 40 -3 91 14 134 152 6 92 81 74 -20 -353 -173 -98 184 1 -161 -70
7485g0JJ64q3J93k24j6J55j78K20j28L2j77J34j63r9K52j83M01k21q6J70J1Q0
$$ -70 -69 95 12 205 -19 -35 120 -58 162 34 66 -111 23 -140 -239 13 -170 231 10 -76 94 105 185
7508A85k63J5N8m0N3J88k12J00k25j46K36J8K56k43K8J11j8j98K00j31N1r3N6
$$ 185 -78 -63 -5 -45 8 196 -16 84 -141 -287 -51 -33 223 -20 8 119 101 -97 103 -28 23 -70 -14
7531a4j46ML9J63P0j20j91K09k8K16J01j23j75k7m7r4N21k52k10Q1l0K20j16l0
$$ -14 -160 -156 -117 46 116 -4 -195 14 -14 202 303 180 5 -22 -69 -163 358 106 -104 -23 -53 167 51 21
7555B1j47O5K42k97rJ85L3j01l2k16M03j40j85J80j4J26m1k32k5k6J77j34L42
$$ 21 -126 -61 181 -116 -125 60 93 -8 -40 -256 147 7 -178 2 -12 114 73 -159 -184 -210 -33 -167 175
7578A75l22j20L85j83L44j02j78j97K92R9l95K60M0k14K92k16k8p9J07j59J9K95
$$ 175 -147 -267 118 -65 279 177 -1 -198 94 193 -202 58 98 -116 176 -40 -68 -147 -40 -199 -180 115
7600A15j76k9M2J13O4n3j15j12J00n0J7J71M3n8j10k55L47k74J53P1J55j90K7
$$ 115 -61 -90 -48 65 129 76 -39 -151 -51 -101 -84 87 130 72 -38 -293 54 -220 -67 4 159 -31 -4
7623dM0nQ7l06P6J58j68J77j77P2J48j89J60j52K75m07K01N0k8R4k23Q4J37m4
$$ -4 36 31 118 -188 -112 46 -122 55 -122 -50 98 -91 69 -83 192 -215 -14 36 8 102 -121 -37 100 56
7647E6o2Q1P1k63R9Q7l2K5n8mm3J9O3j81J46n6O4J66m2j75L1j30L7K45k09p0J02
$$ 56 -6 75 146 -117 -18 69 37 62 4 0 -43 -24 39 -142 4 -52 12 178 136 -39 -8 -138 -101 144 -65 -135 -33
7674c3MJ02j93p1N5o3J85J70p7O8q8n5K0j0N7k42p3L06P0k6j4j65K80j21k52J53
$$ -33 -29 73 -120 -191 -136 -199 -14 156 79 147 59 4 24 14 71 -171 -244 62 132 106 92 -73 207 86 -166 -13
7700a3R9j68K06k16K0J10Q7k30K71o0J05k78J25j08j07p4L82o7j34J63j35M5m2
$$ -13 86 -82 124 -92 -72 38 125 -105 166 106 211 -67 58 -50 -157 -231 151 84 -50 113 -22 23 -19
7723a9j08Q9r9K58r5j20R8P6j08p0J06k3M9j49J43J02J10k46K30k5q9q5j0k0j16
$$ -19 -127 -38 -137 121 26 -94 4 80 -28 -98 8 -15 34 -115 28 130 240 -6 224 199 110 25 15 -5 -121
7748a21K38j21q7J53p4N0q7J07J48Ok51j8J24j84K11k20L42k48j07J81qk43J15
$$ -121 117 -4 -91 62 -12 38 -49 58 206 212 -39 -57 67 -117 94 -126 216 -32 -139 42 34 -209 -94
7771i4O8m2K43j01p5q1K11L6j27l4o6J7K38l3l2k69K33pJ6j24M6j60L44m75K74
$$ -94 -26 -68 175 74 -1 -82 129 165 38 4 -62 -45 193 160 128 -141 92 85 101 -23 23 -137 207 -268 6
7796FNj39K88j28j98p5K25J65J09j16p0n1O3m9j32N6j09m8M6L89j48l09J33kl3
$$ 6 11 -128 160 32 -166 -241 -16 149 258 142 72 21 84 35 -97 -41 -150 -198 -152 237 89 -220 -87 -89 -122
7821a22J8N1K6k25K13Rr2K24N5J21l44J20J28n6l6j18k0m8K96l44J09J5N7N7l4
$$ -122 -104 -53 -27 -252 -39 -30 -122 102 157 278 -66 54 182 126 90 -28 -48 -96 200 -144 -35 -20 37 94 60
7846F0K8j37n6K01j60k7J4Oj12M33k04K2m90K51J31r7q2K16J35r3j44J13Q2k26
$$ 60 88 -49 -105 96 -64 -91 -77 -71 -183 250 46 68 -422 -171 -40 -137 -219 -3 132 39 -105 8 90 -136
7870a36K88r8q6M9J05o2ml2Q3O1k17p3O9m4K33k9k17J86j09o1L5k5J08p2L62n10
$$ -136 152 54 -32 17 122 60 56 24 107 168 -49 -122 -53 -97 136 107 -110 76 -33 -94 -59 -84 24 -48 314 -196
7896a96J62J33j44J6r2O8l0J27k73J98J49m2k02N9K32k95O7r6L99n0j9r5j3k5
$$ -196 -34 99 -45 -29 -121 -53 -83 44 -229 -31 118 76 -126 -67 165 -130 -63 -159 240 190 171 76 63 38
7920C8P1k20Ml1J20q4M6K43r0J30j64k18K09R1k8j78J89p6o5N7J9m9n4J78k87
$$ 38 109 -111 -107 -138 -18 -102 -56 187 97 227 63 -155 54 145 117 -61 128 52 -13 44 63 14 -40 138 -149
7945a49J26j73K85k3m2l3Q5m0l1N2K8Nl9j59O1P5O3m3n0J06m7j24K13k00m6K22
$$ -149 -23 -196 89 66 24 -9 76 36 5 57 85 90 51 -108 -47 28 91 48 -2 104 57 -67 146 -54 -100 122
7971A22l0j37MJ15k62L27l25K53j21J05n6P9j29P8mj18J37J17j95p2L8J09r8l8
$$ 122 92 -45 -41 74 -188 139 -186 67 -54 51 -5 74 -55 23 19 -99 38 155 -40 -112 -74 35 -63 -101
7995a01J26J28o2N1J0m0n8j94K78k71J82K0p3k77L26R7j33K13J68m36L6J11O3
$$ -101 25 153 91 142 152 112 54 -140 138 -133 49 69 -4 -281 45 142 9 222 390 -46 -10 101 164
8018A64p1j46p4J51J12Oj0k3j51r0J58p9O5o5J80n0L6j66O8J55q8q8j7m3K5J6
$$ 164 93 -53 -127 24 136 142 132 109 -42 -132 26 -53 12 -53 127 77 113 -53 15 170 82 -6 -23 -66 -41 -25
8044b5K07j30j49QJ28q9O0J56k93J72p3K41j40J42l89l7J57M3J9J10k43J74N2
$$ -25 182 52 -97 -89 39 -50 10 166 -127 45 -28 213 73 215 -174 -211 -54 -11 8 118 -125 49 101
8067A01m0j33k92K12M00k76j7J34k19j38K64j51m9L10L3p6n8j82K57R7k46J44
$$ 101 61 -72 -364 -152 248 -28 -45 89 -130 -268 -4 -155 -204 106 139 63 5 -177 80 177 -69 75
8089G5j9K8k43R6N0M5p6j35M48l12K18k14j47NP8k04K71R7j65Q0j37J43k1j08
$$ 75 56 84 -159 -63 -13 32 -44 -179 269 -43 175 -39 -186 -181 -103 -307 -36 61 -104 -24 -161 -18 -39 -147
8113a47L48n9j5N5k49J1K6J99k35L6O3O9l3p4M4n4J19n4p3j13K12j54J6K15l91
$$ -147 201 142 127 182 -67 -56 -30 169 -66 -30 33 102 69 -5 39 -15 104 50 -23 -136 76 -78 -62 153 -238
8138b38K91K7L4j56p1m9J26K5Oq7Q1k50K63M8J58j18k80L51J00k79j4J52n7p4
$$ -238 53 80 114 -42 -113 -162 -36 -11 -5 -92 -11 -261 2 50 208 90 -190 161 261 -18 -32 120 63 -11
8162a1J11k10J04J11l41N14k37jj47R4L59k71q4r0PL15l67kJ31Q1J10Q8j69k8
$$ -11 100 -110 -6 105 -236 278 41 40 -107 -13 346 75 -9 -99 -92 223 -144 -146 -15 66 176 264 95 67
8186F7p6j03J71m1r0
$$ 67 -9 -112 59 18 -72
8191g2
$$ Imaginary data points
##PAGE= N=2
##DATA TABLE= (X++(I..I)), XYDATA
0@%%%%%%%%%%%%%%%%Qj6J6j6J6j7K5l2L2m0M8n3O1o9P9r0J02j15J30j46J62j81
$$ 0 0 0 0 0 0 0 0 0 0 0 0 0 0 0 0 0 8 -8 8 -8 8 -9 16 -16 16 -24 24 -29 32 -37 42 -48 54 -61 69 -77 85 -96
38i6K03k26K52k78L05l40L78m16M58n04N55o11O73p42Q19r03R97j106J231j375
$$ -96 107 -119 133 -145 160 -180 198 -218 240 -264 291 -320 353 -389 430 -473 524 -582 649 -726
58g26J543j742J983k283K669l180L890m947O673r948J8205p6287j22069J97560
$$ -726 817 -925 1058 -1225 1444 -1736 2154 -2793 3880 -6068 12137 -64150 -186219 11341
72A1341Q5663j15818j9541R3899o459l6498q157j1085K3798J6443m4600k5542
$$ 11341 97004 -18814 -38355 55544 49085 12587 4430 -6655 17143 33586 -11014 -36556
84c6556L3644K0477j9800J1737J8878m3324k6392K7102O626q133J4080J4002j0105
$$ -36556 -2912 17565 -2235 9502 28380 -14944 -41336 -14234 -7608 -15741 -1661 12341 2236
97B236m797N549k9303j702O7444j674p1011Q936N1266j5933l1468K6742K1794
$$ 2236 -2561 2988 -26315 -28017 39427 37753 -33258 -24322 26944 11011 -20457 6285 28079
110B8079j6258q74j4605j6777M3864J4223n5354j2878L8025n83l2813Q096K9613
$$ 28079 11821 10947 -3658 -20435 23429 37652 -17702 -30580 7445 6862 -25951 -17855 11758
123A1758l674j0159n881j0240N226N474L456J3179O795m265j0401l850Q589J044
$$ 11758 8084 -2075 -7956 -18196 -12970 -7496 -4040 9139 15934 11669 1268 -2582 6007 7051
137G051k061N06n556p697m494O566J2230O191P94j6084j3001J6153R422j0287
$$ 7051 4990 5496 -60 -7757 -12251 -5685 6545 12736 13530 -2554 -15555 598 10020 -267
151b67J74O531o164j6091k203J4327O826q70j776J704K523r842l094J2822M068
$$ -267 -93 6438 274 -15817 -18020 -3693 3133 2263 487 2191 4714 -5128 -8222 4600 8668
166H668l381p035o955P237Q753l360k703J0686J668k3825p910J7678K853l617
$$ 8668 5287 -1748 -8703 -1466 7287 3927 1224 11910 13578 -10247 -18157 -479 2374 -1243
180a243K484m494j270R427N199o611k46O839j1379j3657P930L980n158L730Q357
$$ -1243 1241 -3253 -4523 4904 10103 3492 3246 10085 -1294 -14951 -7021 -3041 -8199 -4469 3888
195C888J25p257k473K529L242N316l175k494J1293l98j6896R81J8549j341k0642
$$ 3888 4013 -3244 -5717 -3188 54 5370 2195 -299 10994 10596 -6300 -5319 13230 11889 -8753
210h753j185J1598k939J163Q355k727n072k248o431j945J0547L302j2196L957
$$ -8753 -9938 1660 -1279 -116 8239 5512 440 -1808 -8239 -10184 363 3665 -8531 -4574
224d574J4618j1004j3337J1717J0628o705o692L754L353m71N12j095N525Q443
$$ -4574 10044 -960 -14297 -2580 8048 1343 -5349 -1595 1758 1287 1799 704 6229 14672
238A4672q757j1139P679P315p105n115M211l561j1183K291R090L455J655k811
$$ 14672 5915 -5224 2455 9770 2665 -2450 1761 -1800 -12983 -10692 -1602 1853 3508 697
252F97o752R43L961k972k792P322N909n492k242M530r0k17Q5j981J15K272j774
$$ 697 -6055 -5112 -1151 -4123 -6915 407 6316 824 -1418 3112 3022 2805 2890 909 1024 3296 1522
269A522k930P689P610q222j0921n12K329j219o82L232N357j794q913l282P801
$$ 1522 -1408 6281 13891 5669 -5252 -5764 -3435 -4654 -5336 -2104 3253 1459 -7454 -10736 -2935
284b935N460m504l49M245k507k789N459N818k049m580m20K485N58l511l057N395
$$ -2935 2525 -1979 -2328 1917 -590 -3379 2080 7898 5849 1269 849 3334 3892 381 -2676 2719
300B719N895p014j0302J798O779K028J47L37j807j619n68n303k50R482K402q800
$$ 2719 8614 1600 -8702 -6904 -125 1903 2050 2387 580 -1039 -1607 -6910 -7160 2322 4724 -4076
316d076k671N748K243o78L412Q63l072k038j334Q58N843J56o910O52N366n438
$$ -4076 -6747 -999 1244 566 3978 4841 1769 -269 -1603 -745 5098 5254 -1656 -1004 4362 -1076
332a076o589P186O090l999l363Q32k087l68L384K40R56M484l525r411K318R843
$$ -1076 -7665 -479 5611 1612 -1751 -919 -3006 -3374 10 250 1206 5690 2165 -7246 -4928 4915
348D915j766o478J553K769l064j532K667L909K518m314p636K869P536k840n134
$$ 4915 3149 -3329 -1776 993 -2071 -3603 -936 2973 5491 1177 -6459 -3590 3946 1106 -4028
363d028O788O023o732o022L613L208j415j724l58Q39k21m493k36R836M159r450
$$ -4028 2760 8783 2051 -3971 -358 2850 1435 -289 -647 192 -29 -4522 -4758 5078 9237 -213
379b13n286M310j468n396L102P435R6m709j550K327M931K698n294k900L374p3
$$ -213 -5499 -1189 -2657 -8053 -4951 2484 2580 -2129 -3679 -1352 3579 6277 983 -1917 1457 1384
395A384l983K299O734J354l923m463j638J847J808m392M97O984k278j1102m75
$$ 1384 -2599 -300 6434 7788 3865 -598 -2236 -389 1419 -2973 -2476 4508 2230 -8872 -9347
410i347R054J681n365J49K825L98p01L05K469L920j824p218J51P830R91m128M211
$$ -9347 -293 1388 -3977 -3828 -1003 -605 -1306 -1001 1468 5388 3564 -3654 -3503 4327 5318 1190 5401
427E401L949o818o747K460M190q21l160j545J975L413m402p978N154Q243m167
$$ 5401 9350 2532 -4215 -1755 2435 1614 -1546 -3091 -1116 2297 -2105 -10083 -4929 3314 -853
442h53n750M098L383k013j71K329l09L86m89l293L318Q025j029n490K374O35p448
$$ -853 -6603 -2505 878 -1135 -1306 1023 714 1100 611 -2682 636 8661 7632 2142 4516 5151 -2297
459b297l047O852L284m166j902n18q27L74j086j510J970K404k585k808L849M682
$$ -2297 -5344 1508 4792 626 -1276 -1794 -2621 -2247 -3333 -4843 -2873 -469 -3054 -5862 -2013 2669
475B669m97j477K26r70j46Q47R21L486L035n127p253K321N441l331k336N399K031
$$ 2669 2172 695 921 -49 -195 652 1573 5059 8094 2967 -4286 -1965 3476 145 -2191 3208 5239
492E239n594l543K932K547j572m231j646L744K008l828M00O635J134n694l170
$$ 5239 -355 -3898 -966 1581 9 -4222 -5868 -2124 -116 -3944 -3544 3091 4225 -1469 -4639
507d639L474M277j440l048K674N250k279o261J006M634r11k926k53K41r69j990
$$ -4639 -1165 3112 1672 -1376 1298 6548 4269 -1992 -986 3648 2737 -189 -442 -201 -1170 -3160
523c160N49K856K076k043k384K241J246l262l92L906O30m392j893K204K687O31
$$ -3160 -2611 245 2321 278 -2106 135 1381 -1881 -2273 1633 2263 -2129 -4022 -1818 869 1500
539A500q14j484J239J297l071k514M319N249l122m370J907J236j354J411J074
$$ 1500 686 -798 441 1738 -1333 -3847 472 5721 2599 -1771 136 1372 18 1429 2503
554B503j111j45k411l547K631N359l115l842M922J220o145M87O420j062m177n37
$$ 2503 1392 1247 -1164 -4711 -2080 3279 164 -3678 1244 2464 -3681 -3194 3226 2164 -2013 -2550
570b550MR84K567j381k246M696K331o242k899O273L140k730o90K171j214k795
$$ -2550 -2546 -1562 1005 -376 -2622 2074 4405 -1837 -4736 1537 4677 1947 1257 3428 2214 -581
586e81j98R36J656R44l378k233L214M90m948l01N915k258n883K738N262r29l36
$$ -581 -779 157 1813 2757 -621 -2854 360 850 -4098 -4399 1516 -742 -6625 -3887 1375 446 110
603A10J863j105j085L91k027o4N905J535m771m17K555j351j854J880Q49j285q69
$$ 110 1973 868 -217 174 -1853 -1917 3988 5523 752 335 2890 1539 -315 1565 2414 1129 260
620B60j376j792K192K300l141k443J709L67j824R50M443K93l742l96J216R32M71
$$ 260 -1116 -2908 -716 1584 -1557 -4000 -2291 -1924 -3748 -2798 1645 1938 -1804 -2200 -984 -52 419
637D19J083J859J878j565m181J8M631l49n140K91L279j681l105Q57K295J73k310
$$ 419 1502 3361 5239 3674 -507 -489 4142 3793 -1347 -1056 2223 542 -2563 -1706 589 762 -1548
654a548k013K17K073L38q64J685J608k460k945J851L898J239k908O12K708j285
$$ -1548 -3561 -3344 -1271 -933 -1797 -112 1496 -964 -3909 -2058 1840 3079 171 783 3491 2206
670B206l424O10L451N26k257k160O62J683R8k648M5J259r47l340O59L303P00j016
$$ 2206 -1218 -608 2843 3369 1112 -1048 -386 1297 1395 -1253 -1208 51 -896 -4236 -3577 -274 426 -590
688e90N46l40j057J65M72J099K039j36k736r27L271M15k729Q76K604j718l124
$$ -590 -44 -384 -1441 -1276 -804 295 2334 2198 -538 -1465 1806 2221 -508 368 2972 1254 -1870
705a870N20K076P20q87j280j494J933M43k669R78M674j163n074P97L375q79j566
$$ -1870 -1350 726 1446 559 -721 -2215 -282 161 -2508 -1530 3144 1981 -3093 -2296 1079 200 -1366
722a366J984J238j444j751k73J247K665q39l348J490K783l071k762M110L055l110
$$ -1366 618 1856 412 -1339 -1612 -365 2300 1461 -1887 -397 2386 -685 -3447 663 3718 608
738F08k639J365J310q7j34k28N37J095j969k718K328K929j840j737Q88R8j798
$$ 608 -2031 -666 644 557 423 195 732 1827 -142 -2860 -532 2397 557 -1180 -292 -194 -1992
755a992J81J841M14k46p37j230N15J734m30o62J768J310k458j414K041J794q69
$$ -1992 -1811 30 444 198 -539 -1769 -1254 480 50 -612 1156 2466 8 -1406 635 2429 1560
772A560j155l59R11N79j961j014K698J493l179k802J571J686p48o56N36P75j048
$$ 1560 405 46 957 1536 -425 -1439 1259 2752 -427 -3229 -1658 28 -720 -1376 -840 -65 -1113
789a113j713K39K476Q16o48J52J440p60j469Q98K561K28k445j353J277J619q36
$$ -1113 -2826 -2587 -111 705 57 209 1649 889 -580 318 2879 3107 662 -691 586 2205 1369
806A369j742O62J582k408l000P90L025j18j933k19R12j27q25m7J935J705r63j792
$$ 1369 -373 289 1871 -537 -3537 -2747 278 160 -1773 -1992 -1080 -1207 -2032 -2079 -144 1561 598 -1194
824a194J511J619r40p27J736L21j368p48Q51Q33K01r05k020M59M53k067p52K393
$$ -1194 317 1936 996 269 2005 2326 958 210 1061 1894 2095 1190 -830 -371 82 -1985 -2737 -344
842c44J419j934j965N94J134O8k42P4J092J614j365j667J955K652q12k402R41
$$ -344 1075 -859 -2824 -2230 -1096 -1028 -1270 -1196 -104 1510 145 -1522 433 3085 2273 -129 812
859H12J348j073j052R91P55p08k019j191J190J508j339p35K510l6l369r66L491
$$ 812 2160 1087 35 1026 1781 1073 -946 -2137 -947 561 -778 -1513 997 961 -2408 -3374 117
876A17N29j556k68P98P87r12o00J051K199k09k846k22K172P38j358M39Q87r80
$$ 117 646 -910 -1178 -380 407 -505 -1105 -54 2145 1936 -910 -1132 1040 1778 420 859 1746 766
894G66j523p8N93J207k82j770l5Q66n23j097J206J688j97j570k20J276P73o92
$$ 766 -757 -835 -242 965 683 -1087 -1122 -256 -779 -1876 -670 1018 821 -749 -969 307 1080 388
912C88p49J23R58m52j747M71K160M03k149L8J231m96o63L09O23P63m65j739N15
$$ 388 -361 -238 720 268 -1479 -1008 1152 1555 -594 -556 675 179 -484 -175 448 1211 746 -993 -478
931d78K090o79j797J288R93j965j580J101J128K08q01q60J207N99j484m98K000
$$ -478 1612 933 -864 424 1417 -548 -2128 -1027 101 309 -492 -1352 -145 454 -1030 -1528 472
948D72J294j991j452J468J119p70k29O56O99p80p46L90J142O17j066j298M47P66
$$ 472 1766 -225 -1677 -209 910 140 -89 567 1266 486 -260 130 1272 1889 823 -475 -28 738
966G38j459m92J533O14k020n71M15K38J32n55l62J139J162j641k27K489J105j592
$$ 738 -721 -1213 320 934 -1086 -1657 -1242 -1004 -872 -1427 -1789 -650 512 -1129 -1356 1133 2238 646
984F46n28P65R8O6j59J95P99l36j487q79R80N19j244j43Q00k39j444n17J218O85
$$ 646 118 883 981 1047 888 1083 1882 1546 59 -820 160 679 -565 -708 92 -147 -1591 -2108 -890 -205
1004b05j050m67Q95J142l89j006M65J981K98k143m16K625N10j344L2P74M44j557
$$ -205 -1255 -1722 -827 315 -74 -1080 -615 1366 1664 -479 -895 1730 2240 896 928 1702 2146 589
1022E89j072j16J470p61j397P4O45q25q21J068P42l84q48K73J040J001j032k54
$$ 589 -483 -599 871 110 -1287 -1213 -568 -1393 -2214 -1146 -404 -788 -1636 -1363 -323 678 -354 -608
1040f08J777J86j500k98J530P69k95q48m07K56K33j010o56J279O83j723m91N40
$$ -608 1169 1355 -145 -443 1087 1856 1561 713 306 562 795 -215 -871 408 1091 -632 -1123 -583
1058e83K51j08n95j17L95K34o56j36J284J081j119p96J511P81j662l71K388L22
$$ -583 -332 -440 -1035 -1152 -757 -523 -1179 -1315 -31 1050 -69 -865 646 1427 -235 -606 1782 2104
1076B104k064o01J074L67m09o10l20J261k02k308k96K728L79k327K90J331k16
$$ 2104 40 -561 513 880 471 -139 -459 802 600 -1708 -2004 724 1103 -1224 -934 397 181
1093A81j150N67O49M57k47j175k67J404J96j144L41J207o57j358P20J377m79r64
$$ 181 -969 -402 247 704 457 -718 -985 419 615 -529 -188 1019 362 -996 -276 1101 622 -342
1111c42K93K56k85o9l33R7J384m0j815P4J747m40j272O57Q98q97p04J39M10M14
$$ -342 -49 207 -78 -147 -480 -383 1001 961 -854 -780 967 527 -745 -88 810 -87 -791 -652 -242 172
1131A72J05j079l61J423k07j204P35J486q43j189N14J027N8P0j85M20M02r30j186
$$ 172 277 -802 -1163 260 53 -1151 -416 1070 227 -962 -448 579 637 707 522 942 1344 414 -772
1150g72O98J562q72j327L81R08p57j113Q30R46o90j328j47J103O61p19n27J101
$$ -772 -74 1488 616 -711 -330 578 -179 -1292 -462 484 -206 -1534 -1681 -578 83 -636 -1163 -62
1168f2P59r51p77J350J271k25j233J27J205l95j036J24J101k0j126r87O46J76
$$ -62 697 -254 -1031 319 1590 1365 132 259 1464 1069 33 157 1258 1238 112 -875 -229 -53
1186e3j80o47ML34k92r45N66R97K37p55K55O90l93j6K76J352K27p74r41O65Q15
$$ -53 -233 -880 -876 -542 -834 -1779 -1213 -216 21 -734 -479 211 -182 -198 78 1430 1657 883 -58 607 1422
1207A422j7j387J62R18p24j590N90J101k38j405j96N30J98J37q47J53J818n43
$$ 1422 1405 18 180 1098 374 -1216 -626 475 237 -1168 -1364 -834 -636 -499 -1346 -1193 625 82
1225H2j702P85J622n27m04J115K70q85k7K77M65K45q22o82N96O70j213j191J578
$$ 82 -1620 -835 787 260 -144 971 1241 356 329 606 1071 1316 494 -188 408 1078 -135 -1326 252
1244B52P07j788q06R46P02n42k18L91K97K68p90m73R75J086o52o39Q91J23q40
$$ 252 959 -829 -1635 -689 13 -529 -747 -356 -59 209 -581 -1054 -79 1007 355 -284 607 730 -110
1263a10l5R95j09l06j41n16J04P50n73m65N52J73j205l74J346L91n34o41K74M19
$$ -110 -145 850 741 435 294 -222 -118 632 59 -406 146 319 -886 -1260 86 477 -57 -698 -424 -5
1283em4k54q3J094L81j336p15J351M69r03k67O40K64j082K38J42P97l55m80l39
$$ -5 -49 -303 -386 708 1089 -247 -962 389 858 -45 -312 328 592 -490 -252 -110 687 332 -148 -487
1303d87R63j88p86N63P85l73j166L19R80O8n69n73L06O68r01n32N80P56n08q49
$$ -487 476 288 -498 65 850 477 -689 -370 610 678 109 -464 -158 510 -391 -923 -343 413 -95 -944
1323i44L81Q83k90l00j8P57K79q56j54O38P19o34o29P44L07q10k07K08M41L4r68
$$ -944 -563 320 30 -270 -288 469 748 -108 -262 376 1095 461 -168 576 883 73 -134 74 515 549 -419
1344d19l2L7M53k62o15P04M46r97o34O34J018m83j35J27N58L31m84l35J082P00
$$ -419 -451 -414 39 -223 -838 -134 312 -685 -1319 -685 333 -150 -285 -158 400 731 247 -88 994 1694
1364A694j078n78Q63P3q51k09P40K2p94j065L32N51M4p70j4J025m39j127M74J318
$$ 1694 616 38 901 974 123 -86 654 676 -118 -1183 -851 -300 -256 -1026 -1040 -15 -454 -1581 -1107 211
1384B11K18o26j10P78L89o78j06P54J72j95q19J46R49j77q36j5M84m08r56K13
$$ 211 429 -197 -307 471 860 182 76 830 1002 807 -12 134 1083 906 70 55 539 131 -825 -612
1404f12M61J4l19l78n1M20n2o67N32J295k00j078L93P93o7L16k55j35N60j82j069
$$ -612 -151 -137 -456 -834 -885 -465 -517 -1184 -652 643 443 -635 -242 551 484 800 545 410 970 788 -281
1425b81N82P50o49r63L81L43k33q56J64O18J80p76l68Q02N67o95k49N80M85n71
$$ -281 301 1051 402 -561 -180 163 -70 -926 -762 -144 36 -740 -1108 -306 261 -434 -683 -103 382 -189
1445a89n14O44J311o41p03L30N28M9o64j79N94L02q35o92O79N22r75j28O77M3
$$ -189 -703 -59 1252 611 -92 238 766 815 151 -28 566 868 33 -659 20 542 -433 -561 116 159
1465A59p97R3O1M90o4n32R3R14j43o79K15R67m18p23n7M52K59j19l59Q7O33j83
$$ 159 -638 -545 -484 6 -58 -590 -497 417 274 -405 -190 777 359 -364 -421 31 290 171 -188 -101 532 349
1487C49p85J42P94M3o41k73N43K68l96j11qO06l82p52L34L91K13o20j19L23N3
$$ 349 -436 -294 500 543 -98 -371 172 440 44 -67 -75 531 149 -603 -269 122 335 -285 -404 -81 -28
1508b8p57Q2J129o5q14p8O34J32l8n00M39N62k02j368Q73Q68j10p95L14M52l90
$$ -28 -785 -703 426 361 -453 -531 103 235 197 -303 136 698 496 -872 1 869 759 -36 278 730 340
1529C40n27q2L68K38m00p78N50L60o25j30O99K5l04l57K58O06l93J10J69K44J03
$$ 340 -187 -269 99 337 -63 -841 -291 69 -556 -686 13 38 -266 -623 -365 241 -152 -42 127 371 474
1550D74m15M5M59Q02r12k03j45M08k65m18k34O01n0o25l93M47P49q97m07P07M5
$$ 474 59 104 563 1365 453 250 105 513 248 -170 -404 197 147 -478 -871 -424 325 -572 -979 -272 -227
1571b27k99J17M27M97l13k11J48L37O05q87j23J163m45q16NO78j98l84n83J96
$$ -227 -526 -409 18 515 202 -9 139 476 1081 194 71 1234 789 -27 -22 656 458 74 -509 -313
1591c13K73l15q61Q67O11l57r57J45Q09j85m30O17O06j32k17j55L85N49k09m15
$$ -313 -40 -355 -1216 -349 262 -95 -1052 -907 -98 -283 -713 -96 510 378 161 6 391 940 731 316
1611C16J64K98l97q66Q76L79o72n27K59j02Nn3k63L76J97m77o75P42M50j56m44
$$ 316 480 778 381 -485 391 770 98 -429 -170 -272 -267 -320 -583 -207 -10 -487 -1162 -420 30 -126 -570
1632e70O99J44n1j43J25K30J54j88m38K66M77n18k37J26M27n45p48N27N42l82
$$ -570 129 273 222 79 204 434 588 400 -38 228 705 187 -50 76 503 -42 -790 -263 279 -103
1652a03k04J19N0K24n18qL75M78n13m42P21J60o86l1N36M07o37l62K16N12J92
$$ -103 -307 -188 -138 86 -432 -440 -65 413 -100 -542 179 339 -347 -378 158 565 -72 -434 -218 294 486
1673D86o70J49K45k44j74k23Q59jm60l84L22M93n37m8R3O20l20n87O7O08k14j93
$$ 486 -184 -35 210 -34 -208 -431 428 427 -33 -417 -95 398 -139 -187 -94 526 206 -381 -314 294 80 -113
1695a13r7N9O5K9m05L64N62k73l24K17N7Q9k7j97O33k57k01r2L38J04k28m52L17
$$ -113 -210 -151 -86 -57 -462 -98 464 191 -133 84 141 230 203 6 639 382 181 89 427 531 303 -149 168
1718A68K83p31l13M01L69k44n23K18J75N3j43j96L80M01o35q6N37O34m25j51M08
$$ 168 451 -280 -593 -192 177 -67 -590 -372 -197 -144 -287 -483 -103 298 -337 -423 114 748 323 172 580
1739E80j7m67j34O81K42n72j59jm4J98p20k66O51K46j142lQ16q4n93K45M48jJ24
$$ 580 563 96 -38 643 885 313 154 153 109 307 -413 -679 -28 218 -924 -927 -111 -195 -788 -543 -95 -96 28
1762B8j41K27M72N9k28l02M55j13j30o3J66J42n09j10J10P4k41j64k17K83K81
$$ 28 -113 114 586 645 417 115 570 457 327 264 430 572 63 -47 63 137 -104 -268 -485 -202 79
1783G9r56k1P35P1k49k31N15M07m68J9l5Q01r8o11K64L73J81p89J27M13m24l11
$$ 79 -877 -898 -163 -92 -341 -572 -57 350 -118 -99 -134 667 569 -42 222 595 776 -13 114 527 103 -208
1805b08M9K97k21l81j31L38J62k97l31M75R5m9m21M41M67j25Q6j75N37k00m99
$$ -208 -159 138 -83 -464 -595 -257 -95 -392 -723 -248 -153 -202 -623 -182 285 160 246 71 608 408 -91
1826i1k7L38N10o51l37R5N14m18k24K90J75j78n19Q1J98L75l06k41K25N06m73
$$ -91 -118 220 730 79 -258 -163 351 -67 -291 -1 174 -4 -523 -442 -244 131 -175 -416 -191 315 -158
1847a58r5m2M44k35j51K68R0K80m78J71M52N8q36j31M76L62p10o9K04J90k54j74
$$ -158 -253 -295 149 -86 -237 31 121 401 -77 94 546 604 -232 -363 113 475 -235 -304 -100 90 -164 -338
1869c38L96M63j65n46j98O14rl95p6L63J4n72L04N0K12m00j47K82J69Nn61K81
$$ -338 58 521 356 -190 -388 226 217 -178 -254 109 123 -449 -145 -95 117 -283 -430 -148 21 26 -535 -254
1891b54O67j34m25l1N15Q2o32O14r4J54m26J2j47L43J71p45K18K42m92M3k4L98
$$ -254 413 279 -146 -177 338 420 -212 402 308 462 36 48 -99 244 415 -330 -112 130 -362 -319 -343 55
1913E5j11m7k27j63K65j9j6j29P49k74l11J90N49j5k63k61L25Knk38J17K28l29
$$ 55 -56 -103 -330 -493 -228 -247 -263 -392 357 83 -228 -38 511 496 233 -28 297 299 294 56 173 401 72
1936G2o49L01L62l90l70M92L9pm42P1K56M99n32j55O62k6l22j26N73J80m32qM61
$$ 72 -577 -276 86 -304 -674 -182 -143 -150 -592 -521 -265 234 -298 -453 209 183 -139 -265 308 488 56 48 509
1959E09J75k71l02J85j16k34k99JM18k56l46j39L44J71l77J5M52N3j52r9M46j97
$$ 509 684 413 111 296 180 -54 -353 -352 66 -190 -536 -675 -331 -160 -537 -522 -70 -17 -169 -268 178 -19
1981a9M55k06k3L48N3l86j28L60n5j85j76J28M9j99j29k22P6L45o28K2K85J73
$$ -19 436 230 207 555 608 222 94 454 399 214 38 166 215 16 -113 -335 -259 86 -542 -520 -235 -62
2003f2l04j11L62q8j22m7L61K51l9l57M23K18n1m39K00K19j05l57j06L11J82n40
$$ -62 -366 -477 -115 -203 -325 -372 -11 240 201 -156 267 485 434 -5 195 414 309 -48 -154 157 339 -201
2025b01J36J04M1j02m60M09K84k90k17M32J93m10q4j0M68k71j02J0J65Kl67K93
$$ -201 -65 39 80 -22 -482 -73 211 -79 -296 136 329 -81 -165 -175 293 22 -80 -70 95 97 -270 23
2047B3J65K6k55q6L90j20j04j57NL01j69Q6k81J44K29k33p3L35k83P4k52L41O5
$$ 23 188 214 -41 -127 263 143 39 -118 -113 188 19 105 -176 -32 197 -36 -109 226 -57 17 -235 106 171
2070A71k18O4l04K15N8k0k95J87N20k71k24M70j67j09l67L34J31K08l49O7N47
$$ 171 -47 17 -287 -72 -14 -34 -329 -142 378 107 -117 353 186 77 -290 44 175 383 34 101 648
2091F48m17n89K66L31N6k86l45L01j42Jn16M10L21j58m70M12L26k13j34K25K61
$$ 648 231 -358 -92 239 295 9 -336 -35 -177 -176 -692 -282 39 -119 -589 -177 149 -64 -198 27 288
2112B88K6k54kK50J29k64N9j13O1L2m38J37K14j60m78L24r9J77l37o1L25J12j01
$$ 288 314 60 58 308 437 173 232 119 180 212 -226 -89 125 -35 -513 -189 -288 -111 -448 -509 -184 -72 -173
2135a73k29L23J49P9j54J34N33l41j28L10nJ19n11q1M4l4Q4j63q0K00l49k79k7
$$ -173 -402 -79 70 149 -5 129 662 321 193 503 498 617 106 25 69 35 119 -44 -124 76 -273 -552 -579
2158e79M61k65j48K31J18lj36m4L68J50k94J7P59k69k90J36K72J41l74r8o1j0
$$ -579 -118 -383 -531 -300 -182 -185 -321 -365 3 153 -141 -124 635 366 76 212 484 625 251 153 92 82
2180H2J38l94L2L25l85k30J22L80l03k77k66P40J07l74o2N01Q7l66K11K11kj1
$$ 82 220 -174 -142 183 -202 -432 -310 70 -233 -510 -776 -36 71 -303 -365 136 223 -143 68 279 277 266
2202B66j27P1J44j25N6l03K50k86K4k60J78q3J83j66o4L22m5l81K57J98p8j23
$$ 266 139 210 354 229 285 -18 232 -54 -30 -290 -112 -195 -12 -178 -242 80 35 -346 -89 109 31 -92
2224i2j80M42k8n6r1K55o0N8n57J36M11l60j78J84K15l0p2k27P14J6n78j31L80
$$ -92 -272 170 142 86 -5 250 190 248 -309 -173 238 -122 -300 -116 99 69 -3 -230 484 500 -78 -209 171
2247A71m1j09k92K74J71l13R2JL92l26j42J68L21l10k79N0J18J04j47n8J61j79
$$ 171 130 21 -271 3 174 -139 -47 -46 346 20 -122 46 367 57 -222 -172 -54 50 -97 -155 6 -173
2269a73K92l71L98o3L46l57Q8Q8k0o3k74K04m7j55j83L06r6P2l44L5J67j38R7
$$ -173 119 -252 146 83 429 72 160 248 228 165 -109 95 48 -107 -290 16 -80 -8 -352 -317 -150 -288 -191
2292a91j22J30K12j07L2J04n6j43L0K86M15l13j95L19J18j82o61L51J72j42l08
$$ -191 -313 -183 29 -78 -46 58 2 -141 -111 175 590 277 82 401 519 337 -324 27 199 57 -251
2313b51J16j38K82l31k07M35k61M09m71K20K07k5j47M15J16j39j63K64j42j12
$$ -251 -135 -273 9 -322 -529 -94 -355 54 -417 -197 10 -15 -162 253 369 230 67 331 189 77
2333G7n3J99K56l55q9J20O0L6j81k60j57M99n88J66L0oo7O4k10L23J41k15N6K82
$$ 77 24 223 479 124 35 155 215 251 70 -190 -347 152 -436 -270 -240 -246 -313 -249 -459 -136 5 -210 -154 128
2357A28K49j31j99J23r2J73k2K6j39J50m6k19N1J9rm10P5K95j86l02L90j6m8m5
$$ 128 377 246 47 170 78 251 229 255 116 266 220 1 52 71 62 -348 -273 22 -164 -466 -76 -92 -140 -185
2381a85j78N80l90lP0K08J77m26L60m2K26j53l58K43jp5k43J00N14m71l01K53
$$ -185 -363 217 -173 -176 -106 102 279 -147 213 171 397 244 -114 129 128 53 -190 -90 424 -47 -348 -95
2403i5J56P7l34q2J39M7q5j40L53M5M3k31K4J84k73K05%M63l71j67k7J05M8J73
$$ -95 61 138 -196 -278 -139 -92 -177 -317 36 81 124 -107 -83 101 -172 33 33 496 125 -42 -69 36 84 257
2427B57n13K67J93m11L1L76q3l49J34J28OJ59o2m9J98j08o1l76L28l4j24k33J68
$$ 257 -256 11 204 -207 -176 200 117 -232 -98 30 36 195 133 84 282 174 113 -263 65 31 -93 -326 -158
2450a58K15pk72K06K92m85KK40k7J12j89o9L87J23k88j71K90P9l96j19L66l84
$$ -158 57 50 -222 -16 276 -209 -207 33 6 118 -71 -140 247 370 82 -89 201 280 -116 -235 131 -253
2472b53J35P7l7J61k95j12K12O7Q9j51J17J09k90K31J12j58L95j20l78K53K05
$$ -253 -118 -41 -78 83 -212 -324 -112 -45 44 -107 10 119 -171 60 172 14 409 289 -89 164 369
2493C69k00R6k64m8M82n16l5o1K0o3j73K25J65l10k01J85J57j50K18J50Q0K03
$$ 369 169 265 1 -47 435 -81 -116 -177 -157 -220 -393 -168 -3 -313 -514 -329 -172 -322 -104 46 126 329
2515C29l26Q1J44K51k05m5k3J30k16J2j47L42k61l91K32l3J9m20K73O8J24n8l23
$$ 329 3 84 228 479 274 229 206 336 120 132 -15 327 66 -325 -93 -126 -107 -527 -254 -186 -62 -120 -443
2538d43K34K22l26k64O66J0K28k25N2O8j09K76l64M3L36k69q3K20l18O6j36q5
$$ -443 -209 13 -313 -577 89 99 327 102 154 222 113 389 25 68 404 135 52 272 -46 20 -116 -201
2560b01K01l04J4J7m4J03p4J27K16j39p0K50k17J94j32mL5K99j24N6p9J89j80
$$ -201 0 -304 -290 -273 -317 -214 -288 -161 55 -84 -154 96 -121 73 -59 -63 -28 271 147 203 124 313 133
2583A33n2Mr7J03k04p9L85l46j44J19pK00k25M3n1N32m15k6J65P1K04k36K5L36
$$ 133 81 85 -12 91 -113 -192 193 -153 -297 -178 -185 15 -210 -167 -218 314 -101 -127 38 109 313 77 102 438
2607D38m38Q9k49L63j00P6O8l23p5N0N3J42L3j60k87l7J78J06J1j33K04o6r1j84
$$ 438 0 89 -160 203 103 179 247 -76 -151 -101 -48 94 127 -33 -320 -357 -179 -73 -62 -195 9 -57 -148 -332
2631c32N56J12m02k33L13qrj3j19J29J38k59N5J31O1k39K07j39J53K5j17j5L9
$$ -332 224 336 -66 -299 14 6 -3 -16 -135 -6 132 -127 -72 59 120 -119 88 -51 102 127 10 -5 34
2654C4j42J48j43J45J22k00L26n78O10l23l23L91N1j08l93J95J54o9j15K27l0
$$ 34 -108 40 -103 42 164 -36 290 -288 322 -1 -324 67 118 10 -383 -188 -34 -103 -218 9 -21
2675b1j18R7M6L42j59k60Q4J72J68k55l6J23l10q8R0J3q6j32m0L45k00J05n7J83
$$ -21 -139 -42 4 346 187 -73 11 183 351 96 60 183 -127 -215 -125 -112 -198 -330 -370 -25 -225 -120 -177 6
2699Fm5K9k55L09m8J64J65l99M7J90k4k0rJ31k20J13o6j90K49K2p1l69R6j35J7
$$ 6 -39 -10 -265 44 -4 160 325 -74 -27 163 139 119 110 241 21 134 68 -122 127 149 78 -291 -195 -330 -313
2724c13K12j64K88n2j27K34k38K18j66L25K5l33K56K81j67k97o5J97N58n40k68
$$ -313 -101 -265 23 -29 -156 78 -160 58 -108 217 242 -91 165 446 279 -18 -83 114 672 132 -136
2745a36K95j06n6j94m9K68j27J8j75J82mm03M96J59j70Q0m2l7J70j01J36o9j55
$$ -136 159 53 -3 -197 -246 22 -105 -87 -262 -80 -84 -487 9 168 -2 78 36 -1 169 68 204 135 -20
2768b0P2j39K65J8j93K5rm3R8j53J7J23k48J0M1R4K0K06j96k30L12Q9O4k58m4
$$ -20 52 -87 178 196 3 28 19 -24 74 -79 -62 61 -187 -177 -136 -42 -22 184 -12 -242 70 159 223 -35 -79
2793g9J95j51J9j06K04r4O4k7J49j12k30R6N6Q9r0K3J1J50p3mq6L3k68J22N3r6
$$ -79 116 -35 -16 -122 82 -12 52 25 174 62 -168 -72 -16 73 -17 6 17 167 94 90 4 37 -231 -109 -56 -152
2819a52K09j5m3K06q0j81J04k11L64l69K68Ok42q8L50J58k47q8J06N6p4k5k04
$$ -152 57 42 -1 205 125 -56 48 -163 201 -168 100 106 -136 -224 126 284 37 -51 55 111 37 12 -192
2842a92L38kj40p9L9j82mJ20j46Q0O1j4O5o4NRJ71K7j80J56J33k22J15L5J95k14
$$ -192 146 144 4 -75 -36 -218 -222 -102 -248 -168 -107 -121 -56 -120 -115 -106 65 92 -88 68 201 -21 94 129 324 110
2868A10N4l6j46q2K82j40N8k95o5K51j37L0j75J51K03k24j8n5L29l4j65M0K61
$$ 110 164 128 -18 -100 182 42 100 -195 -260 -9 -146 -116 -291 -140 63 -161 -179 -234 95 61 -104 -64 197
2891A97j53Q8R2m3q5oJ57J16J02m18K8J65j94J40m72P1R2j43K6K3L32m05r4J87
$$ 197 44 132 224 181 96 90 247 363 465 47 75 240 46 186 -286 -215 -123 -266 -240 -217 115 -290 -384 -197
2915a97J09J20k54L42rl5J0M0N8j62J43L46l00k0j12Qj21rj1j99J52j6j22M7j84
$$ -197 -88 32 -222 120 111 76 86 126 184 22 165 511 211 191 79 87 -34 -43 -54 -253 -101 -117 -239 -192 -376
2940c76J56N3r2j04N24M0k05mj15M45k07j08o0K90%j78l7O7O1j49j73K05M6m2
$$ -376 -220 -167 -259 -363 161 201 -4 -8 -123 322 115 7 -53 237 237 59 22 89 150 1 -172 33 79 37
2964C7l34J78L1J68m30J2K87j41L9N1L11j58k25R8J74k50K79k53J83N1N4m55J38
$$ 37 -297 -119 -88 80 -350 -338 -51 -192 -153 -102 209 51 -174 -76 98 -152 127 -126 57 108 162 -293 -155
2987a55M15q1k95J23J64k3k95j10K13J10l2j8k49K23J20m3L6o1k28k9L50Ll0l00
$$ -155 260 179 -116 7 171 148 -147 -257 -44 66 34 16 -233 -10 110 67 103 42 -186 -215 135 138 108 -192
3011a92Q8k2J6o7q6K09J96O3k62K51p8J96l32Q5j18J93l20K77J14K28m53j29L14
$$ -192 -104 -126 -110 -177 -263 -54 142 205 -57 194 116 312 -20 65 -53 140 -180 97 211 439 -14 -143 171
3034A71k26l8j86L24K8o7j74pj71L98k27K67o8K12l05O0J29j3j10n0J63q6qn4
$$ 171 -55 -93 -279 45 73 6 -168 -175 -346 52 -175 92 24 236 -69 -9 120 107 -3 -53 110 24 16 -38
3058c8M6J95j81J10k59P6j23K85m6j55K31l86J86r0J88p3J22K3J43J08l37j0J04
$$ -38 8 203 22 132 -127 -51 -174 111 65 -90 141 -245 -59 -149 39 -34 88 111 254 362 25 15 119
3081A19l3R4n3Q3j66J34j63J20J4q7k72K62L3k69m1J76L3P3j72j72N3L73O6m60
$$ 119 86 180 127 210 44 178 15 135 149 62 -210 52 85 -184 -225 -49 -16 57 -115 -287 -234 139 205 -255
3105b55L06K89m20m7J72L29j33j91J49n4J04l76L88L6l35j13K91l95M65o39K01
$$ -255 51 340 -80 -127 45 374 241 50 199 145 249 -127 261 297 -38 -151 140 -255 210 -429 -228
3126b28P9L10r1l64J88O9n4k1J60k96L19p2J42J70q0l50J87K6L43j93O6j93k74
$$ -228 -149 161 70 -294 -106 -37 -91 -112 48 -248 71 -1 141 311 231 -119 68 94 437 244 310 117 -157
3149a57j0M3%O8J93l84N6L91k87O8J72k11R9J61k46L6J18j57J77K04k20K6k01
$$ -157 -167 -124 -124 -56 137 -247 -191 200 -87 -19 153 -58 41 202 -44 -8 110 -47 130 334 114 140 -61
3172f1j72L28j36N7p5K02O8j93k9M3k44J52r1K87l42L17j73j22L65j04l13K47
$$ -61 -233 95 -41 16 -59 143 211 18 -11 32 -212 -60 -151 136 -206 111 -62 -184 181 77 -236 11
3194A1k1K1Q4k62J62rj24P7J06n6l9L1K3R3O5j33j61J91M3m0j95J76n2R5L7j69
$$ 11 -10 11 95 -167 -5 -14 -138 -61 45 -11 -50 -19 4 97 162 29 -132 59 102 62 -133 43 -9 86 123 -46
3220d6pOP0R0O9n2k06j85N4j87K24J61j3J79j73j50M36Q2l42k4n9K78k26o5K38
$$ -46 -53 -47 23 113 182 130 -76 -261 -207 -394 -170 -9 -22 157 -16 -166 270 352 10 -14 -73 205 -21 -86 152
3245A52j8j75J27l23J41K7Kk13M05j52j20%R3k74J26j13K53K7J23q1J24J16l83
$$ 152 134 -41 86 -237 -96 -69 -67 -280 125 -27 -147 -147 -54 -328 -202 -315 -62 -35 88 7 131 247 -136
3268a36J37K04j45K21k12J07N1k18OjP1k34R5NP1j18r5j03J49L6r4K09k7l28L18
$$ -136 1 205 60 281 69 176 227 9 15 14 85 -149 -54 -49 22 -96 -191 -294 -145 -109 -203 6 -21 -349 -31
3293c1J24k3j72L23j29p1J63k03NJ20N0j17K38o0l55k0J32q3k17jJ73N6N6J45
$$ -31 93 70 -102 221 92 21 184 -19 -14 106 156 39 277 217 -138 -158 -26 -109 -326 -327 -154 -98 -42 103
3317A03j15J93j80oO0k10QK81r0K19R3k16j39P6M2l4J4j2j03q4J17o4L2j27q9
$$ 103 -12 181 1 -5 55 -155 -147 134 44 263 356 140 1 77 119 85 99 87 -16 -100 17 -47 -15 -142 -231
3342b31M01l08J77j07n7J27K29m25p8J65K19o9J09J2k74O4K09k30K23j43pK72
$$ -231 170 -138 39 -68 -125 2 231 -194 -272 -107 112 43 152 164 -110 -46 163 -67 156 13 6 278
3364B78r8n4k57q3K7M71l56Q0r8J95k69K9J71Q9l2r7k0m5J14K8lj10L9K06j71
$$ 278 180 126 -131 -214 -187 284 -72 8 -90 105 -164 -135 36 125 93 -4 -24 -69 45 73 70 -40 -1 205 34
3389C4Q2p6j92K30k11J5J97k84J88P7q3j0m4J80J79j67k93M6R8J05j55K21n6p2
$$ 34 116 40 -152 78 -133 -118 79 -205 -17 60 -23 -33 -77 103 282 115 -178 -132 -34 71 -84 137 81 9
3413Io2O0j24j48K28N4p6o7K37j34PP5K8r4m7J87j10q8M23l76P6O1m0j64j6j01
$$ 9 -53 7 -117 -265 -37 17 -59 -126 111 -23 -16 59 87 -7 -54 133 23 -65 358 -18 58 119 79 -85 -101 -202
3439b02Q5J98j45R5j40n2K30j70k7j88L16J08l09K45p0M2j70J6K75k24l7m8K17
$$ -202 -117 81 -64 31 -109 -161 69 -101 -128 -316 0 108 -201 44 -26 16 -154 -138 137 -87 -124 -172 45
3462D5P6j97k26K07K02k34k87L73P7r2lQ2N0L3j68QP1K0J46k52J86N5m1n2L3q1
$$ 45 121 -76 -302 -95 107 -127 -414 -41 36 -56 -59 23 73 106 -62 -54 17 37 183 -69 117 172 131 79 112 31
3488C1k5K59j13J35j45k31mJ8j0L9J2N9k9k16m7K49o3l0J40J4j15J76k21L11m4
$$ 31 6 265 152 287 142 -89 -93 -75 -85 -46 -34 25 -4 -220 -267 -18 -81 -111 29 43 -72 104 -117 194 150
3513A50r3L6J51j99j29L59J20j68m10J33K06k72K35J0n14M67k76K5N2J20m3J74
$$ 150 57 93 244 45 -84 275 395 227 -183 -50 156 -116 119 129 -385 82 -194 -169 -117 3 -40 134
3535A34k95J10J18L6N1l53N22j9n3l77O9K46j40n7L6J06k0j07o4J14J10l22L78
$$ 134 -161 -51 67 103 154 -199 323 304 251 -126 -57 189 49 -8 28 134 114 7 -57 57 167 -155 223
3558B23j30L9l86J94j74M15k16k02J47J01L2r3j24L13n1j47K5l03M44j92m9O1
$$ 223 93 132 -254 -60 -234 181 -35 -237 -90 11 43 -50 -174 139 88 -59 -34 -337 107 -85 -134 -73
3580g3L6Q7j61QK03Qj98oK52j71J6K05k21j03J32j41lj57J64R6K3r0k3J0n8n3
$$ -73 -37 50 -111 -103 100 108 -90 -96 156 -15 1 206 -15 -118 14 -127 -130 -287 -123 -27 -4 -94 -117 -107 -165 -218
3606b18K31l1L01m71j7K28N0P1q1J9k34K21J31p9k23K47q5K1k51K23m8j39j8j2
$$ -218 13 -18 283 -188 -205 23 73 144 63 82 -152 69 200 121 -102 145 60 81 -170 53 5 -134 -152 -164
3630a64M16k66Q0k30J47n5p1K19l52L50p7q7l2L29J4k41J28R1j92K83l14K13J59
$$ -164 252 -14 66 -164 -17 -72 -143 76 -276 74 -3 -90 -122 207 221 -20 108 199 7 290 -24 189 348
3653C48k45l08K04J1j80oO4J51n9k24J22QL5J8J23j66K25m12M38O8k32K8k6OL1
$$ 348 103 -205 -1 10 -170 -176 -112 39 -20 -244 -122 -114 -79 -61 62 -104 121 -291 147 215 -17 11 -15 -9 22
3678B2L1j15J49q7J49j74L0j57J74k39L3l8K93k57J90Q9k1j65Q3L2J17j02k4M0
$$ 22 53 -62 87 0 149 -25 5 -152 22 -217 -184 -222 71 -186 4 93 72 -93 -10 22 139 37 13 53
3702E3M5j50N02k79o9j48J04k20L4J2k44K40l3J76l91L35j78L39k73J07o1J16
$$ 53 98 -52 450 171 102 -46 58 -162 -128 -116 -360 -120 -153 23 -368 -33 -211 128 -145 -38 -99 17
3724A7%O9n1m0L8mj08L45l63oK11P9o5j42J66l02K62l1j62N2q7J30j42J38m4k6
$$ 17 17 86 35 -5 33 29 -79 266 -97 -103 108 187 122 -20 146 -156 106 75 -87 -35 -122 8 -134 4 -40 -66
3750f6J34n0L33l08j48J12N5j14K0J10q7K31pmk3k41J37r2j4m8n3L61l24J50K28
$$ -66 68 18 351 43 -105 7 62 -52 -32 78 -9 222 215 211 188 -53 84 -8 -22 -70 -123 238 -86 64 292
3775B92k46n8J00j05r5R7R6O5k89L24l08N3j55L67l03o1J67J3K4k44J03J72l0
$$ 292 46 -12 88 -17 -112 -15 81 146 -143 181 -127 -74 -229 138 -165 -226 -59 -46 -22 -266 -163 9 -21
3798b1q4J15J89J5k21J37j49oL23j78L9r8k16L15j50j40J60k01L52k28M6j2j80
$$ -21 -105 10 199 214 -7 130 -19 -25 298 120 159 61 -155 160 10 -130 30 -171 181 -47 -1 -13 -193
3821a93J53P5j38k15L11J91o8j35P7j95K88l4M4m0L2l1r7J01k13j81J01J58o5
$$ -193 -40 35 -103 -318 -7 184 116 -19 58 -137 151 117 161 121 153 122 25 126 -87 -268 -167 -9 -74
3844g4M4o0Q8j62k3K13k1L6j9p4J27K1k96K86J41o3j64K13k31P0N4o2j76M08k29
$$ -74 -30 -90 -2 -164 -187 26 5 41 22 -52 75 96 -200 86 227 164 0 213 -18 52 106 44 -132 276 47
3869D7Q6j61J54N2k31j8l25M56j47K56m19O2J36R7j11p1J92J62k66J56J95k92
$$ 47 133 -28 126 178 -53 -71 -396 60 -87 169 -250 -188 -52 45 -66 -137 55 217 -49 107 302 10
3891A0p1J80k67J29l1J53q6L3j23j37j28K71Q3N9r9j04J80q2l8K78l7j17k05r2
$$ 10 -61 119 -148 -19 -50 103 17 50 -73 -210 -338 -67 16 75 -24 -128 52 -30 -68 210 173 56 -149 -241
3915b41L19o5K4J5l5l0r9M08l66M6P8j43j6J56j64J35J98j54k65J18P1l6J63k34
$$ -241 78 13 37 52 17 -13 -112 296 -70 -24 54 -89 -105 51 -113 22 220 66 -199 -81 -10 -46 117 -117
3939a17J3J74J52m67M20k87K98k65QN9p9L3j25L75l76j5K78k47P8Q2j7NJ34k23
$$ -117 -104 70 222 -245 175 -112 186 -79 -71 -12 -91 -58 -183 192 -184 -199 79 -168 -90 -8 -25 -20 114 -109
3963a09K16Kk3K03m36J87K5L7k09m0K94j54K00P1l95K13k19N8K30K0j24M7k15
$$ -109 107 109 86 289 -147 40 65 102 -107 -147 147 -7 193 264 -131 82 -137 -79 151 171 47 94 -121
3986a21J57Q6k32Q5K62l58K69j69J13o5j74J6o3J62p9J70j14J03M9m87K57L09
$$ -121 36 122 -110 -25 237 -121 148 -21 92 27 -147 -131 -194 -32 -111 59 -55 48 97 -390 -133 176
4008A76l45r3K23Q7q8K15k70K19k10J72j04k9J43m3J67L2j96O3q5P0m08M92k48
$$ 176 -169 -262 -39 48 -40 175 -95 124 -86 86 -18 -47 96 53 220 252 56 119 34 104 -304 188 -60
4031f0j27Q8K14k2j18n7N1j66P5o7J59L40m43L39m2k99N6J6K19o7L7j8J00k16
$$ -60 -187 -99 115 93 -25 -82 -31 -197 -122 -189 -30 310 -133 206 164 -135 -79 -63 156 89 126 108 208 -8
4055hQ0k41J76r2J65k54r7M21k59j48P2K08p8l2J19k14m5M68l02j7J88l21L46
$$ -8 72 -169 7 -85 80 -174 -271 150 -109 -257 -185 23 -55 -87 32 -182 -227 241 -61 -78 110 -211 135
4078A35q5r2K01j54P4j9l38J27K92Ll25K19k21M3J47L0j40J83j37K45l00K07l29
$$ 135 50 -42 159 5 79 60 -278 -151 141 144 -181 38 -183 -140 7 37 -103 80 -57 188 -112 95 -234
4101b34J19L68k99Q1j82K46L8j78K58j59K0J01j64p1j52K50j18M3o8oK33m0j31
$$ -234 -115 253 -46 35 -147 99 137 -41 217 58 78 179 15 -56 -208 42 -76 -33 -101 -107 126 86 -45
4124d5l3l3j46M57k38k31K57j65l8L85l62K33o1j26l0J21K26l9m05K31R1k16K26
$$ -45 -78 -111 -257 200 -38 -269 -12 -177 -215 170 -192 41 -20 -146 -176 -55 171 132 -273 -42 49 -167 59
4147E9J4pO7k79J01J7r5n2R0J40K9l7l23N66l89J60k29J56K5j77k8M2K70k88L43
$$ 59 73 66 133 -146 -45 -28 -123 -175 -85 55 84 47 -276 290 -99 61 -168 -12 13 -164 -192 -150 120 -168 175
4172A75q1r5l4P6N6RJ86j75r9J43P9j01k86P8K14k62J66r6J60l6k89J95O3J96
$$ 175 94 -1 -35 41 97 106 292 117 18 161 240 139 -147 -69 145 -117 49 -47 113 77 -212 -17 46 242
4196B42m35K62j70j15L98k42Q1j01K9J37J56l34K48m3m9K71k96j56QK62j71j55
$$ 242 -193 69 -101 -216 182 -60 21 -80 -51 86 242 -92 156 113 64 335 39 -117 -109 153 -18 -173
4218a73K58k11J50j84K15j2j43J26k07K17n7N4J4p1J31j92J49o0J4l26O1N38k52
$$ -173 85 -126 24 -160 55 43 -100 26 -181 36 -21 33 47 -24 107 -85 64 4 18 -308 -247 291 39
4241C9Q7j03j0N2r9o3jR3l6K41k12q7R6M7o8P6j9j54K4l2j19N21l34J99q3j8m9
$$ 39 126 23 13 65 -34 -97 -98 -5 -41 200 -12 -99 -3 44 -24 52 33 -121 -97 -129 -248 273 -61 138 55 37 -12
4268a2J60j41J0j14n3J10L1j14j7o4J85P8k80K56k86L91j56n4J55m07M40j86M46
$$ -12 148 7 17 -97 -150 -40 -9 -123 -140 -204 -19 59 -221 35 -251 140 -16 -70 85 -322 118 -68 378
4291C78m14j00K00J44l42J80K67m83j69M01j0j10L5K1J31j38J92j08k37J89m7
$$ 378 -36 -136 64 208 -134 46 313 -170 -339 62 52 -58 -23 -2 129 -9 183 75 -162 27 -20
4312b0J97L1k52J83j31M9j36j99Q1K56j08O0J9j52J76l70J58P4L7N5M7j77K92
$$ -20 177 208 -44 139 8 57 -79 -278 -197 59 -49 11 30 -122 54 -316 -158 -84 -47 8 55 -122 170
4335A70j93o2k0J4J05j63J63j4m7K47j51k35K10m6Q8j7R7l95J82J75P6j71M0Q5
$$ 170 -23 -85 -105 -91 14 -149 14 0 -47 200 49 -186 24 -22 66 49 146 -249 -67 108 184 13 53 138
4359A38k27O9L05k50J11r5R9K50m35J98O3k15N8j1j88K43l55M81j02k31J78l44
$$ 138 -89 -20 285 35 146 51 150 400 -35 163 226 11 69 58 -130 113 -242 239 137 -94 84 -260
4381b60J76J28k01K71j36l1oK33j17k34l2J18J56Jm4K81m5k96L5j33J30J80l14
$$ -260 -84 44 -157 114 -22 -53 -59 174 57 -177 -209 -91 65 66 22 303 258 -38 -3 -136 -6 174 -140
4404a40J5PJ98j27K1J3j74K80j08r1o2P9J56j25K3K32l40J03L56k55M2r3p6M9
$$ -140 -125 -118 80 -47 -26 -13 -187 93 -15 -106 -168 -89 67 -58 -35 197 -143 -40 316 61 103 10 -66 -17
4428a7N3J28o1J67m11P2O9l5N8q9K27m19J21k0L29k23L7J2K9j69o4J26K59j33
$$ -17 36 164 103 270 -141 -69 0 -35 23 -66 161 -258 -137 -157 172 -51 -14 -2 27 -142 -206 -80 179 46
4452D6J29j09Q9M0k38P4P7k63K93k07J10j41J77j29k3k00K64J58l5l60J85Q7n6
$$ 46 175 66 155 195 -43 31 108 -155 138 -69 41 -100 77 -52 -75 -275 -11 147 112 -248 -63 24 -32
4475c2L0o1J9P9M7M6M9j28K65l97K91j35j76J12R9j40r1J33R4j77m5K84pl2n03
$$ -32 -2 -63 -44 35 82 128 177 49 314 -83 208 73 -103 9 108 -32 -123 10 104 -73 -118 166 159 127 -376
4500c76M28J47q7r7o4j03K26k38K15k36K66l8J45k9j57J7q1Q6p4o5K28o6j9J29
$$ -376 52 199 112 15 -49 -152 74 -164 51 -185 81 43 188 159 2 19 -62 24 -50 -115 113 47 28 157
4524A57j67P2j40K07p2P8j45n6K1R3n9k64L56J8q8j36J34J2k04o4J61K65l48J35
$$ 157 -10 62 -78 129 57 135 -10 -66 -45 48 -11 -275 81 99 11 -125 9 21 -183 -247 -86 179 -169 -34
4548c4l5J89j75J53M8n7K4ljQ6p7j6Q3k91j0P5L9M0m3M0r7Q1JM6L0j63J70k30
$$ -34 -69 120 -55 98 146 89 113 110 109 195 118 102 185 -106 -116 -41 -2 38 -5 35 -62 19 20 66 96 -67 103 -127
4576a27N3p5K92j83N2J10m39M62m4j99K69l1m9k7J02n7r2m0j30p8J56l9J22L2
$$ -127 -74 -149 143 -40 12 122 -317 145 101 -98 171 140 91 64 166 109 17 -23 -153 -231 -75 -114 8 40
4600D0O5q1p2K26l57k8N11l50K16k88M02j98k3J0Q8j82O0k0K5r6M1J6J91l57j44
$$ 40 105 24 -48 178 -179 -207 304 -46 170 -118 284 86 63 73 161 -21 39 19 44 -52 -11 5 196 -161 -305
4625c05M41k68q9K66Q7p4o0nj4k3J82l29Q6m2R9k8J12R3k76J40j53J41m63M27
$$ -305 136 -132 -221 45 132 58 -2 -7 -21 -44 138 -191 -105 -147 -48 -76 36 129 -147 -7 -160 -19 -482 -55
4649e5J87k11K07k71K64J15l10j29K09M10k49m06K21l3Q3P0j90K3J33j2N2J7j58
$$ -55 132 -79 128 -143 121 236 -74 -203 6 416 167 -239 -18 -51 32 102 -88 -65 68 56 108 125 -33
4672c3J73oj20q4Q9P4k53K19n1Q2J27j73j02J46n4J14k68oj70J09J94J17r5k39
$$ -33 140 134 14 -70 19 93 -160 59 8 90 217 44 -58 88 34 148 -120 -126 -296 -187 7 124 29 -210
4696b10L28J8k28K18L1j88N6PJ18j98J48r4j54J50J25k06l7J05p0j81K16j34K54
$$ -210 118 136 -92 126 157 -31 25 32 150 -48 100 6 -148 2 127 -79 -116 -11 -81 -262 -46 -180 74
4719G4ll6j01r5J62K19j41j69j36K93r8l3j50L93m2j0N6m4j36J61M6j89k52L49
$$ 74 71 35 -66 -161 1 220 79 -90 -226 67 -31 -64 -214 179 137 127 183 139 3 164 210 21 -231 118
4743A18j64j30K03L0k23m0J48N6J13k10K52k54n1L5K04j48%n2M9j69N3J94k1j35
$$ 118 -46 -176 27 57 -166 -206 -58 -2 111 -99 153 -101 -152 -117 87 -61 -61 -113 -64 -233 -180 14 -7 -142
4767a42N7j9J79Mo2m5J92l19M20q0l52P2K31k56M7j58K16l5k70M10j73J22r1K74
$$ -142 -85 -104 75 79 17 -28 164 -155 265 185 -167 -95 136 -120 -73 -231 -15 -50 -320 90 -83 39 -52 222
4791B22k36K55k24J35j03R1j70Q4N5K1q6j65Q7K2P6R3m1k06J90j92P3j98L44M5
$$ 222 -14 241 17 152 49 140 -30 54 109 130 44 -121 -34 -12 64 157 116 -90 100 -92 -19 -217 127 172
4815A72M0m93J93K66j61q6K88l25J15j77L20j0k31K4O1R5k12K06l25K81o4R3K4
$$ 172 212 -281 -88 178 17 -69 219 -106 9 -168 152 142 -89 -65 -4 91 -121 85 -240 41 -23 70 94
4838I4j38o0r8K22nj62J05P9O2l1J84j04K7j29P3Q3j91J26k97L85l9p0K29l52
$$ 94 -44 -104 -202 20 15 -147 -42 37 99 68 252 148 175 46 119 202 11 137 -160 225 186 116 345 -7
4862gJ01J40k34j10J91R2j60k38J06k1J33Or0k6K73j57j29o4J66L0r1K7J24j09
$$ -7 94 234 0 -110 81 173 13 -225 -119 -140 -7 -1 -91 -117 156 -1 -130 -194 -28 2 -89 -62 62 -47
4886d7J63O8k79kR7n9k41M75k10k59K65P2P8j32J18j60L5l7q0J97j09J83k02Q
$$ -47 116 184 -95 -97 0 -59 -300 175 -35 -294 -29 43 121 -11 107 -53 -18 -55 -135 62 -47 136 -66 -58
4910e8Pj95K38k9o4l2mJ33L2j70L1N2j22K72L4j57J46j19j62L15j23j5j02J46
$$ -58 -51 -246 -8 -37 -101 -133 -137 -4 28 -142 -111 -59 -181 91 125 -32 114 -5 -167 148 25 10 -92 54
4934E4R8j88o8J65m8l26L60L5nj03j30K0j89L49k74M31j97L49n10M00q1m2n4J04
$$ 54 152 -36 -104 61 13 -313 47 82 77 -26 -156 -136 -325 24 -250 181 -16 333 -177 223 142 100 46 150
4958A50l23J76J2m5J57M1m7j6M4j06j7j53K47o6j98J57n9L3J82j80J89k61K23
$$ 150 -173 3 15 -30 127 168 121 105 149 43 26 -127 120 54 -144 13 -46 -13 169 -11 178 -83 140
4981A40o6l46O38j82KP9j72j1k13QJ99j16R7j62Q9j13j55K00J55J39k90j4r7K07
$$ 140 74 -272 366 184 186 265 93 82 -131 -123 76 -40 57 -105 -16 -129 -284 -84 71 210 -80 -94 -191 16
5005A6J46j80Q4j58M0J19j86J6J03r8K67k96Q1J84l86K30K8jO3j68J86j79Q8N2
$$ 16 162 -18 66 -92 -52 67 -119 -103 0 -98 169 -127 -46 138 -248 -18 10 9 72 -96 90 -89 -1 51
5029E1k2k34K12J38q8M6q9j09L5R6j86L29k12J1rl6L28r6k8L0j31J34l15K09j97
$$ 51 29 -205 7 145 57 103 14 -95 -60 36 -150 179 -33 -22 -31 -67 261 165 137 167 36 170 -145 64 -133
5054a33P4p3L3L44j34k02K32j64O2q1J34q2qm3J47L7j63kP8r5K0m7l0P8J94j91
$$ -133 -59 -132 -99 245 111 -91 141 -23 39 -42 92 10 2 -41 106 143 -20 -22 56 -39 -19 -66 -96 -18 176 -15
5080a5kK49j50N0j75m8ML0J82j76R1j68K35R3k88o7J12p6O0L9O1J17n3J9ln8Q7
$$ -15 -17 232 82 132 -43 -91 -87 -57 125 -51 40 -128 107 200 -88 -155 -43 -119 -59 -20 41 158 105 124 121 63 150
5107A50j43n8L1Q0P1j57K95o7j24m6J54k26R7J21l7J03m01M06k98l16L91J69k37
$$ 150 7 -51 -20 60 131 -26 269 202 78 32 186 -40 57 178 141 244 -157 249 -49 -365 26 195 -42
5130d2O5P4k53J29n9p6J81j28k38K08J51J5q4J19j06j73L23j59K40j34nj42m7
$$ -42 23 97 -156 -27 -86 -162 19 -109 -347 -139 12 27 -57 62 -44 -217 106 -53 187 53 48 -94 -141
5153a41J81j36r0J96p0J54k82O6K53k76K13l11K40j30n6L71j10J28l61J66Q1j01
$$ -141 40 -96 -186 10 -60 94 -188 -122 131 -145 68 -243 -3 -133 -189 182 72 200 -161 5 86 -15
5175a5O8N7J65k03J3k23K65j92K86k69n3K22qj25N8l15L8K79nr9J08j17p6K50
$$ -15 53 110 275 72 85 -138 127 -65 221 -48 -101 121 113 -12 46 -269 -231 48 43 -56 52 -65 -141 109
5199A09l50L87l37L11l52K81j9J27J9O8k42k38L02J13k76K2j25K03k7j21J75j13
$$ 109 -241 146 -191 120 -232 49 30 157 176 244 2 -236 66 179 -97 -75 -200 3 -24 -145 30 -83
5221h3J49k77J44m6P1J9J2K83j92l18J86qQ1O9J07o3j03n5J18j38PK08k32M5n0
$$ -83 66 -211 -67 -113 -42 -23 -11 272 80 -238 -52 -60 21 90 197 134 31 -24 94 -44 -37 171 -61 -16 -66
5246f6m1K3j15J10J42j36K41k23j9j8J63p2J23j08r1K87l29Q5K09j95M0J24l5
$$ -66 -107 -84 -199 -89 53 -83 158 -65 -84 -102 61 -11 112 4 -87 200 -129 -44 165 -30 10 134 99
5269I9k20J41L6k55L6k6L05j79q9J36k79K01p0K10l9j23J50k19J33J70j46k7J69
$$ 99 -121 20 56 -199 -163 -189 116 -63 -152 -16 -295 -94 -164 46 7 -116 34 -185 -52 118 -28 -55 114
5292A14l77L06j7j3k8m9rJ98L4j57j11J10J46k63Q9L12l08j54P2j04r8J63J83
$$ 114 -263 43 26 13 -15 -64 -73 125 159 2 -109 1 147 -116 -27 285 -23 -177 -105 -209 -307 -144 39
5315C9j59J60R4p3n6j07j44Q4K31j52j23J37P5l64L67J96j1j34k62K78j02j28
$$ 39 -120 40 134 61 5 -102 -246 -162 69 -83 -206 -69 6 -358 9 205 194 60 -202 76 -26 -154
5337a54K6N6oK70q5P7j09j70K77j72j15k85K73j38J34J46J4l4j08J11OMk41J49
$$ -154 -128 -72 -78 192 107 184 75 -95 182 10 -105 -390 -117 -255 -121 25 39 5 -103 8 14 18 -223 -74
5361g4K35k35M9M0J33k47k30M70k03jn0J90L2l11K08K7M0k99m6K67l1n5k6o8J9
$$ -74 161 -74 -25 15 148 -99 -329 141 -62 -63 -113 77 109 -202 6 33 73 -226 -272 -5 -36 -91 -117 -185 -166
5386a66K98K7l4j56J1J74j03r8O1J04O1l39J21J73Kj9k70J22l1J0M8M7j83N1q2
$$ -166 132 159 125 -31 -20 154 51 -47 14 118 179 -160 -39 134 136 117 -153 -31 -62 -52 -4 43 -140 -89 -171
5411a71K09j44J42L7p8Q8L8k40R4J40j2j55L12k31j03j6J47j25p6J90m3JQ4Pj86
$$ -171 38 -106 36 73 -5 83 121 -119 -25 115 103 -52 260 29 -74 -90 57 -68 -144 46 3 4 88 95 -91
5436i1K48r1m4k16m7N1k15L67o5J14pK05q5jj45j51J13m7J27J15k94J63q8J88
$$ -91 157 66 22 -194 -241 -190 -405 -38 -103 11 4 209 124 123 -22 -173 -60 -107 20 135 -159 4 -84 104
5460A04j86j7K06q7M1j5j49P9j57K19o4J3J57o0k6k7j30R8j02P0J45k10L4J90
$$ 104 -82 -99 107 20 61 46 -103 -24 -181 38 -26 -13 144 84 58 31 -99 -1 -103 -33 112 -98 -64 126
5484A26R2J9l31Q5J46j97K67k18J32j45k8p5j7J28J38L1l37L32j42L3M2q0K7j2
$$ 126 218 237 -94 -9 137 -60 207 -11 121 -24 -52 -127 -144 -16 122 153 -184 148 6 39 81 1 28 16
5508A6j2j90K70k13j28J09K6J50q8J08J08k55R5J25L6Q9k97J68k13K47j33J42
$$ 16 4 -186 84 -129 -257 -148 -122 28 -60 48 156 -99 -4 121 157 246 -51 117 -96 151 18 160
5530A60l17L28j04M6M1l74q2J66K74pm1R5j0Qj63K4q3J85k62L69k82K16l91M0
$$ 160 -157 171 67 113 154 -220 -302 -136 138 131 90 185 175 183 20 44 -39 146 -116 253 -29 187 -204 -164
5554a64K96j81L10j75k2p2q3M0j52J45L7J33j75J19nmO6j90N2j40L04k84PJ71
$$ -164 132 -49 261 86 64 -8 -91 -51 -203 -58 -21 112 -63 56 51 47 113 -77 -25 -165 139 -145 -138 33
5578C3J25k70K42J80l12NJ94O3j35j46K21j47j68K50M5m44J56K51j50L4j14J34
$$ 33 158 -112 130 310 -2 3 197 260 125 -21 200 53 -115 135 180 -264 -108 143 -7 27 -87 47
5600D7k12J37q9K38k08rj06K26k4J08k33J36j14k2L66k30%q8N6j09M23l90P9K5
$$ 47 -165 -28 -117 121 -87 -96 -202 24 0 108 -125 11 -103 -125 241 11 11 -77 -21 -130 293 -97 -18 7
5624Gj06J81j32J27j46J3n1J2J05j34K82L0k99K72o2p3Q8l87K61j48K34k20K61
$$ 7 -99 82 -50 77 -69 -56 -107 -95 10 -124 158 188 -111 161 99 26 114 -273 -12 -160 74 -146 115
5647A15J8l1j55l49N16K00k15q3j5j77J54j8L66l48o4K62j09Q1l12J8pp9K68J55
$$ 115 133 102 -53 -402 114 314 99 16 1 -176 -22 -40 326 -22 -86 176 67 148 -164 -146 -153 -232 36 191
5671A91P9k15k9j50K0K24l6p4m8L60k70r3J82M4J4k33J8J5j15j02K07j9r4M1m4
$$ 191 270 55 26 -124 -104 120 84 10 -38 322 52 -41 141 185 199 -34 -16 -1 -116 -218 -11 -30 -124 -83 -127
5696a27M2K12j49K15k89L01k48l6J13RJ1M9Pj27N8j28J86j33l6P4J3Q4K8j67J86
$$ -127 -85 127 -22 193 -96 205 -43 -79 34 43 54 103 110 -17 41 -87 99 -34 -70 4 17 101 129 -38 148
5721A48k93J15J90j36j8m4J32pj22R0p9j74nK72p3O7q7K7J03n9k4J31l21L17j2
$$ 148 -145 -30 160 24 6 -38 94 87 -35 55 -24 -198 -203 69 -4 63 -24 3 106 47 23 154 -167 150 138
5746A38l52J02J56k8Q2k91J90j1j71OJ45J70j39m3K51j63k49J43l0L3j1J23O0
$$ 138 -214 -112 44 16 98 -193 -3 -14 -185 -179 -34 136 -3 -46 205 42 -207 -64 -94 -61 -72 51 111
5769A11j15L3m3j06J58J64k38J46k44K10L9k74k1J83K4k63L18n6p7K6P6q5K35
$$ 111 -4 29 -14 -120 38 202 -36 110 -134 76 115 -159 -180 3 27 -236 82 26 -51 -25 51 -34 201
5792B01j55R5O5j99N3j3m2p7J15j88lL83j42j90J44j25K59j58J77k07p8J6j11
$$ 201 46 141 206 7 60 47 5 -72 43 -145 -148 235 93 -97 47 -78 181 23 200 -7 -85 -69 -180
5815a80K50K9J31l21J20Nj11N9k8O1K5p9R5o5QL37k02l68J26J0J38J10k81M0o
$$ -180 70 99 230 -91 29 34 -77 -18 -46 15 40 -39 56 -9 -1 336 134 -234 -108 -98 40 150 -131 -91 -97
5840i7KJ90j93J51J71m18K06p5K4K53l07M5m3J97k40j73J35K46Q4l74L96k65l6
$$ -97 -95 95 -98 53 224 -194 12 -63 -39 214 -93 -48 -91 106 -134 -307 -172 74 158 -216 180 -85 -121
5863a21J02J88m0j51L0k3K02j18%P2j37L8l8J72l00L4J57j49J44Ok08L66p9k03
$$ -121 -19 169 129 -22 8 -15 187 69 69 141 4 42 4 176 -124 -90 67 -82 62 68 -140 226 147 -56
5887e6L2j26P3J81j11pJ34p4o1q6K26j90j1J7m2j46K77P2n9j0j80J43k20p0K83
$$ -56 -24 -150 -77 104 -7 -14 120 46 -15 -101 125 -65 -76 -59 -101 -247 30 102 43 33 -147 -4 -224 -294 -11
5912a1j6l8K9k4M6J14m4j80J15k07o3L87m7k57L28k20K74k63k6R1K79l08m8m6
$$ -11 -27 -65 -36 -60 -14 100 56 -124 -9 -216 -279 108 61 -196 132 -88 186 -77 -103 -12 267 -41 -89 -135
5936a35KJ9nN5M9l7M2k44M8K09O8mj28j34L53l76K29rN1k36K50J5j21Q0rk9k0
$$ -135 -133 -114 -119 -64 -15 -52 -10 -254 -206 3 71 67 -61 -195 158 -218 11 2 53 -183 67 82 -39 41 32 3 -17
5963a7j4r8J50R0q8k39K24j96p1L58o8j24J30j59%K47q4R0Oj68K30m62K26J42
$$ -17 -31 -129 21 111 23 -216 8 -188 -259 99 31 -93 37 -122 -122 125 41 131 137 -31 199 -263 -37 105
5987A05jk41q1J94J62j29j79K74m85L98j63J20l1l7j47L6KJ09J46k37L41k5l46
$$ 105 104 -137 -218 -24 138 9 -170 104 -381 17 -146 -26 -57 -94 -241 -205 -203 -94 52 -185 156 131 -215
6010b15K46Q6o5k01K15j82K26k45J77n0M2n3K58n45K03J59k81O0J2K18n1L9o5
$$ -215 31 117 52 -149 66 -116 110 -135 42 -8 34 -19 239 -306 -103 56 -225 -165 -153 65 14 53 -12
6033a2K5l1l58J93k8K53J78q5J23k22J24j75j03J4L55n2k45J59P9O6l27p6K72
$$ -12 13 -18 -376 -183 -211 42 220 135 258 36 160 -15 -118 -104 251 199 -46 113 192 258 -69 -145 127
6056A27k2j6j61M8J92k58K02l12M8J08%K02k10K01m5Pm2l02J91m7K7J01R5k4j21
$$ 127 105 89 -72 -24 168 -90 112 -200 -152 -44 -44 158 -52 149 104 111 69 -233 -42 -89 -62 39 134 110 -11
6081a1j0P5L4J15l04M57m55P2j55K20J61j87J47k05Q2j9R6k1J41l95L01n7j17
$$ -11 -21 54 88 203 -101 356 -99 -27 -182 38 199 12 159 -46 36 17 113 92 233 -162 139 82 -35
6104c5l4L3J97k84m0J10M4MJ80k20K25j44k18N4J26M1j59L1L0J51j76O7M1O7K25
$$ -35 -69 -36 161 -123 -163 -53 -9 -5 175 -45 180 36 -182 -128 -2 39 -120 -89 -59 92 -84 -17 24 91 316
$$ [...]
8191a6
##END NTUPLES=NMR FID
##END=
