##TITLE=1H_SL62(20.10)
 CDCl3, 8 sc, 
 22.10.2020
##JCAMPDX= 6.0         $$ Bruker NMR JCAMP-DX V2.0
##DATA TYPE= NMR FID
##DATA CLASS= NTUPLES
##ORIGIN= UXNMR, Bruker Analytische Messtechnik GmbH
##OWNER= root
$$ XWIN-NMR		Version 3.5
$$ Thu Oct 22 10:08:04 2020 Russian Standard Time (UT+4h)  she@DPX200
##.OBSERVE FREQUENCY= 200.1315066352
##.OBSERVE NUCLEUS= ^1H
##.DELAY= (6, 6)
##.ACQUISITION MODE= SIMULTANEOUS
##.ACQUISITION SCHEME= undefined
##.AVERAGES= 8
##.DIGITISER RES= 18
##SPECTROMETER/DATA SYSTEM= spect
##.PULSE SEQUENCE= zg30
##.SOLVENT NAME= CDCl3
##.SHIFT REFERENCE= (INTERNAL, CDCl3, 0, 15.7039)
##AUDIT TRAIL= $$ (NUMBER, WHEN, WHO, WHERE, WHAT)
$$ ##TITLE= Audit trail, XWIN-NMR		Version 3.5
$$ ##JCAMPDX= 5.01
$$ ##ORIGIN= Bruker BioSpin GmbH
$$ ##OWNER= she
$$ F:/spectra/data/she/nmr/H-F/1/audita.txt
$$ ##AUDIT TRAIL=  $$ (NUMBER, WHEN, WHO, WHERE, WHAT)
(   1,<2020-10-22 10:06:58.60 +0400>,<she>,<DPX200>,
      <created by zg, POWCHK disabled, PULCHK disabled
       configuration hash MD5:
       00 E9 B6 7A A2 85 ED C7 34 08 36 98 17 FE 4E 26
       data hash MD5: 16K
       5F 11 94 8D 8D C2 49 16 2A 6B 20 94 AB 44 8F 6D>)
$$ ##END=
$$ 
$$ hash MD5
$$ 30 D4 79 38 DB 5C 81 C1 F0 C4 61 5B BB B0 56 29
##$RELAX= 
##$RELAX= 
##$RELAX= 
##$RELAX= 
##$RELAX= 
##$RELAX= 
$$ Bruker specific parameters
$$ --------------------------
##$DU= <F:/spectra>
##$EXPNO= 1
##$NAME= <H-F>
##$PROCNO= 1
##$TYPE= <nmr>
##$USER= <she>
##$AMP= (0..31)
100 100 100 100 100 100 100 100 100 100 100 100 100 100 100 100 100 100 
100 100 100 100 100 100 100 100 100 100 100 100 100 100 
##$AQSEQ= 0
##$AQ_mod= 1
##$AUNM= <au_zg>
##$AUTOPOS= <>
##$BF1= 200.13
##$BF2= 200.13
##$BF3= 200.13
##$BF4= 200.13
##$BF5= 200.13
##$BF6= 200.13
##$BF7= 200.13
##$BF8= 200.13
##$BYTORDA= 1
##$CFDGTYP= 0
##$CFRGTYP= 5
##$CHEMSTR= <none>
##$CNST= (0..31)
1 1 145 1 1 1 1 1 1 1 1 1 1 1 1 1 1 1 1 1 1 1 1 1 1 1 1 1 1 1 1 1 
##$CPDPRG= <>
##$CPDPRG1= <>
##$CPDPRG2= <>
##$CPDPRG3= <>
##$CPDPRG4= <mlev>
##$CPDPRG5= <mlev>
##$CPDPRG6= <mlev>
##$CPDPRG7= <mlev>
##$CPDPRG8= <mlev>
##$CPDPRGB= <>
##$CPDPRGT= <>
##$D= (0..31)
0 1.2 0 0 0 0 0 0 0 0.06 0 0.03 0 0 0 0 0.0002 0 0 0 0 0 0 0 0 0 0 0 0 
0 0 0 
##$DATE= 1603346818
##$DBL= (0..7)
120 120 120 120 120 120 120 120 
##$DBP= (0..7)
150 150 150 150 150 150 150 150 
##$DBP07= 0
##$DBPNAM0= <>
##$DBPNAM1= <>
##$DBPNAM2= <>
##$DBPNAM3= <>
##$DBPNAM4= <>
##$DBPNAM5= <>
##$DBPNAM6= <>
##$DBPNAM7= <>
##$DBPOAL= (0..7)
0.5 0.5 0.5 0.5 0.5 0.5 0.5 0.5 
##$DBPOFFS= (0..7)
0 0 0 0 0 0 0 0 
##$DE= 6
##$DECBNUC= <off>
##$DECIM= 32
##$DECNUC= <off>
##$DECSTAT= 4
##$DIGMOD= 1
##$DIGTYP= 9
##$DL= (0..7)
0 120 120 120 120 120 120 120 
##$DP= (0..7)
150 150 150 150 150 150 150 150 
##$DP07= 0
##$DPNAME0= <>
##$DPNAME1= <>
##$DPNAME2= <>
##$DPNAME3= <>
##$DPNAME4= <>
##$DPNAME5= <>
##$DPNAME6= <>
##$DPNAME7= <>
##$DPOAL= (0..7)
0.5 0.5 0.5 0.5 0.5 0.5 0.5 0.5 
##$DPOFFS= (0..7)
0 0 0 0 0 0 0 0 
##$DQDMODE= 0
##$DR= 18
##$DS= 0
##$DSLIST= <SSSSSSSSSSSSSSS>
$$ [...]
##$SUBNAM2= <"">
##$SUBNAM3= <"">
##$SUBNAM4= <"">
##$SUBNAM5= <"">
##$SUBNAM6= <"">
##$SUBNAM7= <"">
##$SUBNAM8= <"">
##$SUBNAM9= <"">
##$SW= 16.880792210976
##$SWIBOX= (0..15)
0 0 2 0 0 0 0 0 0 0 0 0 0 0 0 0 
##$SW_h= 3378.37837837838
##$TD= 16384
##$TD0= 1
##$TE= 0
##$TE2= 300
##$TE3= 300
##$TEG= 300
##$TL= (0..7)
0 120 120 120 120 120 120 120 
##$TP= (0..7)
150 150 150 150 150 150 150 150 
##$TP07= 0
##$TPNAME0= <>
##$TPNAME1= <>
##$TPNAME2= <>
##$TPNAME3= <>
##$TPNAME4= <>
##$TPNAME5= <>
##$TPNAME6= <>
##$TPNAME7= <>
##$TPOAL= (0..7)
0.5 0.5 0.5 0.5 0.5 0.5 0.5 0.5 
##$TPOFFS= (0..7)
0 0 0 0 0 0 0 0 
##$TUNHIN= 0
##$TUNHOUT= 0
##$TUNXOUT= 0
##$USERA1= <user>
##$USERA2= <user>
##$USERA3= <user>
##$USERA4= <user>
##$USERA5= <user>
##$V9= 5
##$VALIST= <valist>
##$VCLIST= <CCCCCCCCCCCCCCC>
##$VD= 0
##$VDLIST= <DDDDDDDDDDDDDDD>
##$VPLIST= <PPPPPPPPPPPPPPP>
##$VTLIST= <TTTTTTTTTTTTTTT>
##$WBST= 1024
##$WBSW= 4
##$XGAIN= (0..3)
0 0 0 0 
##$XL= 0
##$YL= 0
##$YMAX_a= 513328
##$YMIN_a= -415922
##$ZGOPTNS= <>
##$ZL1= 120
##$ZL2= 120
##$ZL3= 120
##$ZL4= 120
##$ABSF1= 10
##$ABSF2= 0
##$ABSG= 5
##$ABSL= 3
##$ALPHA= 0
##$AQORDER= 0
##$ASSFAC= 0
##$ASSFACI= 0
##$ASSFACX= 0
##$ASSWID= 0
##$AUNMP= <proc_1d>
##$AZFE= 0.1
##$AZFW= 0.1
##$BCFW= 1
##$BC_mod= 2
##$BYTORDP= 1
##$COROFFS= 0
##$CY= 11.3945322036743
##$DATMOD= 1
##$DC= 2
##$DFILT= <>
##$DTYPP= 0
##$F1P= 16.9975609425685
##$F2P= -3.02152046262296
##$FCOR= 0.5
##$FTSIZE= 0
##$FT_mod= 4
##$GAMMA= 1
##$GB= 0.15
##$INTBC= 1
##$INTSCL= 1
##$ISEN= 128
##$LB= 0.24
##$LEV0= 0
##$LPBIN= 0
##$MAXI= 10000
##$MC2= 0
##$MEAN= 0
##$ME_mod= 0
##$MI= 1.114404
##$NCOEF= 0
##$NC_proc= 0
##$NLEV= 6
##$NOISF1= 3.799351
##$NOISF2= 2.8
##$NSP= 1
##$NTH_PI= 0
##$NZP= 0
##$OFFSET= 15.70392
##$PC= 1
##$PHC0= -10691.55
##$PHC1= 13.60089
##$PH_mod= 1
##$PKNL= yes
##$PPARMOD= 0
##$PSCAL= 0
##$PSIGN= 0
##$REVERSE= no
##$SF= 200.130013532006
##$SI= 16384
##$SIGF1= 3
##$SIGF2= 2
##$SINO= 400
##$SIOLD= 16384
##$SREGLST= <1H.CDCl3>
##$SSB= 0
##$STSI= 0
##$STSR= 0
##$SW_p= 3612.71676300578
##$SYMM= 0
##$S_DEV= 0
##$TDeff= 0
##$TDoff= 0
##$TI= <>
##$TILT= no
##$TM1= 0
##$TM2= 0
##$TOPLEV= 0
##$USERP1= <user>
##$USERP2= <user>
##$USERP3= <user>
##$USERP4= <user>
##$USERP5= <user>
##$WDW= 1
##$XDIM= 8192
##$YMAX_p= 0
##$YMIN_p= 0
$$ End of Bruker specific parameters
$$ ---------------------------------
##NTUPLES= NMR FID
##VAR_NAME=  TIME,          FID/REAL,        FID/IMAG
##SYMBOL=    X,             R,               I
##VAR_TYPE=  INDEPENDENT,   DEPENDENT,       DEPENDENT
##VAR_FORM=  AFFN,          ASDF,            ASDF
##VAR_DIM=   8192,          8192,            8192
##UNITS=     SECONDS,       ARBITRARY UNITS, ARBITRARY UNITS
##FACTOR=    0.000296,      1,               1
##FIRST=     0,             0,               0
##LAST=      2.424536,      0,               0
##MIN=       0,             -415922,         0
##MAX=       2.424536,      513328,          0
$$ Real data points
##PAGE= N=1
##DATA TABLE= (X++(R..R)), XYDATA
$$ [...]
2182c588J809R96Q83J338r80p97J65K47J119p6p7M20j786o69j688q01K590J928
2200A033J104J419p79l69j203l472L37J075N99J764q24n60N23l90j12M34R87J302
2218B868k15j789j812j160k64qK005J089J414J257o33k281j509l24J69N31R07
2235B45k16k81L52j287o43J273K085J513k06j721k201j47m24j224Q70K238J542
2252A768O42n10j324m38K48o48n50Q93J580n20j534j794o1K106J589N55P89l60
2270B431p83j840k177l45J136J725N86p7N02Q0o47j058l69N76J097M16p52j615
2288a114j024m40K90J297J593J532L31j233k249j290K1L95N60K54L56P62K94r35
2306f00j396M55J322O43L25p16q18n33j069j323J436K502J597J33q74j390k66
$$ plain form
2182 -3588 -1779 -783 100 1438 458 -339 -174 73 1192 1116 1039 1459 -327 -996 -2684 -3485 -895 1033
2200 1033 2137 3556 2777 2408 1205 -2267 -1930 -855 -256 1508 684 124 647 257 145 579 1566 2868
2218 2868 2653 864 -948 -2108 -2372 -2380 -375 714 2128 3385 2752 471 -1038 -1362 -1193 -662 245
2235 245 29 -252 100 -1187 -1830 -557 1528 3041 2835 1114 -1087 -1234 -1658 -2882 -2012 226 1768
2252 1768 2410 1900 576 138 386 -262 -812 81 1661 1141 -393 -2187 -2248 -142 1447 2002 2791 2431
2270 2431 1648 -192 -2369 -2714 -1578 147 733 656 1158 1238 591 -467 -836 -260 837 1253 501 -1114
2288 -1114 -2138 -2578 -2288 -991 602 2134 2465 1232 -1017 -2307 -2286 -1891 -1331 -1077 -721 41 335 -600
2306 -600 -1996 -1541 -219 424 749 33 -785 -1318 -2387 -3710 -2274 228 1825 1958 1084 -306 -572
2323e72j55q60K26J475M46J78o64q57M10P92K74J20J094M06m14j996j176l42N24
2342a091K007R17P31K74r01j077n61m87M66Q17L71K54j124k21k36o03R99P84N87
2361A906J424j393j957n06j163O10J094j59J845j38n98m02j797J50J365o66J020
2378F35o3r71M45j989o03J864J82R83J169j364m89q40j396J26R53N60J169m12
2396d1L47r31n39M01n69M97J728o98n22M68j891p75J229L96J567Q29o50k09r26
2415b89q51k82P60N62M86N14l34o60J55k68m99R07L08J219q39l07o67j686Q23
2434i48P70l19K778p4k474N11q85q77J604p5N38K93o00K57j723M54J198j810J245
2453a37K236k072J257p78l222K081K21n34K488l25l75m12k299R56N34N8J996j608
$$ plain form
2323 -572 -727 -1587 -1361 114 560 738 74 -783 -373 419 693 813 1907 2313 1899 -97 -1273 -1615 -1091
2342 -1091 916 1833 2564 2838 1937 860 299 -188 278 1095 1466 1720 596 375 139 -464 535 1319 1906
2361 1906 3330 1937 -20 -526 -1689 -1079 15 -144 1701 1563 965 563 -1234 -1084 281 -385 635
2378 635 572 -399 46 -1943 -2546 -682 -500 483 1652 288 -201 -1041 -2437 -2311 -1358 -798 371 -41
2396 -41 306 -625 -1164 -763 -1332 -835 893 195 -327 141 -1750 -2525 -1296 -900 667 1496 846 637 -289
2415 -289 -1140 -1422 -662 -100 386 900 566 -94 61 -207 -706 201 509 1728 889 582 -85 -1771 -948
2434 -948 -178 -497 2281 2207 -267 244 -641 -1518 86 11 549 842 242 499 -1224 -770 428 -1382 -137
2453 -137 2099 27 1284 506 -2716 -635 -414 -948 1540 1215 840 428 -1871 -915 -381 -323 1673 65
2471F5O6J444k738R09Q16j773K063K01q35J726j460j093M34p98J511R23k93P16
2489A884j212j258N45q74R97J778r05J27J5q22j56m81N60l5K17N53l42k81K55
2508E65j764o2J135M59J119j84j317o51j096N32M52K83J276n51o19K42j059K01
2526a039k09M1Q45l59K73J86j403K97J43p12J409R94j87K9j678p62P72j86P56
2545g90L79J99O49j120m51J073q08J068K09j099J286j69j177K38k71L5J650O2
2563I63Q10m61n97N6j422N53N02l82J355M8j240O05K7k53O56m67L74N74o28l94
2583F79j093j75J269k14Q39M25k59L87j086j201K98J92O68k27j074P19J75o64
2601c42R16r14Q42J132j390j46n91o36L62m54Q9J204K59L54o38q98P06m14L00
$$ plain form
2471 65 131 1575 -1163 -254 562 -1211 852 1053 218 1944 484 -609 -175 -973 538 1461 1168 1884
2489 1884 672 -586 -41 -915 82 1860 955 1082 1097 275 119 -362 198 163 380 933 591 310 565
2508 565 -1199 -1261 -126 333 1452 1268 -49 -700 -1796 -1264 -812 -529 747 196 -423 -181 -1240 -1039
2526 -1039 -1248 -1207 -362 -721 -448 -262 -1665 -1368 -1225 -1937 -528 466 279 308 -1370 -2132 -1360 -1546 -790
2545 -790 -411 -212 437 -683 -1134 -61 -869 199 408 -691 595 426 -751 -513 -784 -749 901 963
2563 963 1773 1312 715 771 -651 -98 404 22 1377 1425 185 790 817 564 1220 753 1127 1701 1073 679
2583 679 -414 -589 680 466 1305 1730 1471 1858 772 -429 -131 61 729 502 -572 147 322 -342
2601 -342 574 -340 502 1634 244 98 -493 -1129 -767 -1221 -1132 72 331 685 47 -851 -145 -559 -259
2620b59q1j027N80P19j014M71R6n46J832r9n72N94r12k64o17r58R99Q47P25K72
2640G86r37k7Q48n0j86p65l28Q01p99p0J52j01J002j85k50J032N64l43j054j435
2660a345K02K25K63M56l65Q65k71p4J38J63L93j30j398k19N05o63J185m48q82
2679a400J432P81L04K27j192o45m56J10K16k36M43N26n73J21J039J60P17n36j428
2698c90n5Q3K52L55j144L9J314K36M37O79k65j37q75q05N13k15N13l13o55Q2J363
2719A012L73L28O0n17o87J46o76k12R8l15n07J095P10p7Q76k22j353j01O52p27
2739d4n65o8p97j58J354N12J53N23m84k27j42m95k2m15p31k48K20J71J127N82
2759B46k82k30M02j90l18q78Q0n49l89M24O96N93J86O51n16o6O38m03q86J70q28
$$ plain form
2620 -259 -340 -1367 -787 -68 -1082 -611 -515 -1061 771 672 100 694 -218 -482 -1099 -2057 -1058 -211 514 786
2640 786 -151 -178 670 620 434 -331 -659 142 -657 -727 -575 -676 326 141 -109 923 1487 1144 90 -1345
2660 -1345 -1143 -918 -655 -199 -564 301 30 -44 94 257 650 520 -878 -1097 -592 -1255 -70 -518 -1400
2679 -1400 32 813 1117 1344 152 -493 -949 -839 -623 -859 -416 110 -463 -342 697 857 1574 1038 -390
2698 -390 -445 -362 -110 245 -899 -860 454 690 1127 1806 1541 1404 529 -276 237 22 535 222 -433 -351 1012
2719 1012 1385 1713 1773 1256 569 715 39 -173 -75 -390 -897 198 908 831 1707 1485 132 31 683 -44
2739 -44 -609 -677 -1474 -1632 -278 234 387 910 426 199 57 -438 -460 -875 -1606 -1854 -1634 -1463 -336 246
2759 246 -36 -266 136 -54 -372 -1250 -1170 -1719 -2108 -1684 -988 -395 -209 442 -74 -140 498 95 -791 -621 -1449
2780a449k22N02O08J16Q20O51o13L69P72j212o76K20q52J70M87J51M47N83L3N71
2800A476k29J68p1j075l55l64M42m26k4R91J13N43J144k50p08q12n83n24Q8M88
2820C2J0n34q5R18J53N26J198r23q65j40j120l93P81p13oM43J218L43k17O45o21
2841F50p64K54r08l34R58n64m65N8N10J164M79m16O19p24k49n54m95m81l99R26
2861g35M26m4J485M11j226j93O55o86L66j69j166n13J84L26M23J251O55o68j12
2880F70P20j164p02k3j188j79O53O60Q00M19L00q94j042J205M11o77J64j206j341
2899b414L79K54J193J008L86L62p26n63k2m31k66o42r9M80j02J083Q12j253R93
2918D32O27p22L67L52j626m44j24l79O9J105J501J20k66J092j206o65Q09j277
$$ plain form
2780 -1449 -1671 -1169 -561 -445 375 1026 413 782 1554 342 -334 -114 -966 -796 -309 -158 289 872 905 1476
2800 1476 1247 1415 1344 269 -86 -450 -8 -434 -458 533 646 1189 2333 2083 1375 563 -20 -544 -456 32
2820 32 42 -492 -577 341 494 1020 2218 1295 430 290 -830 -1223 -442 -1155 -1161 -718 500 843 626 1271 650
2841 650 -114 140 -768 -1102 -144 -708 -1173 -1115 -605 559 1038 622 1241 517 268 -286 -781 -1262 -1661 -735
2861 -735 -309 -353 1132 1543 317 124 779 93 459 290 -876 -1389 -1205 -879 -456 795 1450 782 670
2880 670 1390 226 -476 -499 -1687 -1866 -1213 -553 247 666 966 72 -970 235 646 -31 133 -1073 -2414
2899 -2414 -2035 -1781 -588 420 806 1168 442 -121 -143 -574 -840 -1482 -1581 -1101 -1203 -120 692 -561 432
2918 432 1059 337 704 1056 -570 -1014 -1138 -1517 -1448 -343 1158 1278 1012 2104 898 233 1042 -235
2936b35o57Q46L48j79j98M10N67j28J532j43r19L28j197j444L20J00P28Q40J3
2955I32K49N89o98K76j86r90k47l94O71o86l97O98n41J29J731M0N88K09j770j472
2975a269j68m61K69J028M06k83N44L88j018j93J435l31o30n37q61n00R1N35L69
2994a186L08J910K78j154K65r3j197j26r51p9J180M59N17j36k22N59j05j78P94
3013H43l61K03j157j822P01J85P05K053R9R7M54j462K11p74j227J063R0l30O47
3032B18l99P75J42n10R25j77R8J176j553j562l47o59R49P93N37J718m26q46n40
3051C12n53K22M09m67r5j40k13j9m71P16J036Q25M32o74j101l14j294M4L37K09
3071g99J025J67j96N61N1J88k00q03k02k5j0J66m1m06k83J82J523M66M47N70j394
$$ plain form
2936 -235 -892 -46 302 123 -75 335 902 774 2306 2163 1244 1572 375 -1069 -749 -649 79 919 932
2955 932 1181 1770 1072 1348 1162 172 -75 -469 202 -484 -881 -183 -724 -595 1136 1176 1764 1973 203 -1269
2975 -1269 -1437 -1898 -1629 -601 -195 -478 66 454 -564 -757 678 347 -283 -820 -1681 -2181 -2090 -1555 -1186
2994 -1186 -878 1032 1310 156 421 328 -869 -995 -1946 -2025 -845 -386 131 -5 -227 332 227 49 843
3013 843 482 685 -472 -2294 -1593 -1408 -703 1350 1449 1546 2000 538 749 -25 -1252 -189 -99 -429 218
3032 218 -181 594 736 226 1151 974 1072 2248 695 -867 -1214 -1873 -924 -131 406 2124 1698 852 312
3051 312 -241 -19 390 -77 -172 -312 -525 -544 -1015 -299 737 1562 1994 1320 219 -95 -1389 -1345 -1008 -799
3071 -799 226 393 197 758 809 997 797 -6 -208 -233 -243 -77 -118 -524 -807 -625 898 1364 1811 2381 987
3092I87j706p32o16J150J634R0p1p00n2M82k3N80J75r61l29k41q86P63m28nO17
3113b72N91J141J62q12n27j739k72M45K38P01L35n81l33k0M04R94k05L26l7j011
3133d72p40o45k5Q4P74J342L43m1K20j222p73N67J1j78R77p12m41J93N57K53K47
3154C19Q10k74n86J035m86j376k43q1o90J459J127Q41J28o82o57j040J79J154
3172I37q8O3n6q43p01MJ229O21N43O24p14r40o6m69j004L45Q06K34J38K1K43k84
3194F43k58k75q6N9Q43q92p43k1m82j27N66J234O21K2j76q88j599J9M70j40J156
3215e4O89o08p30L2J44o7P05K77l95p19N2m72q7K84J81k5P80J025k85k62o16k00
3237c51j043L88O33M7Q41n8j009m78P57K26M93P64j73m72r43o74l16L07Q98J176
$$ plain form
3092 987 -719 -1451 -2067 -917 717 807 736 36 -16 466 443 1023 1198 237 -92 -333 -1219 -456 -884 -889 -272
3113 -272 319 1460 1622 810 283 -1456 -1728 -1283 -1045 -344 -9 -590 -923 -943 -539 455 250 576 539 -472
3133 -472 -1212 -1857 -1882 -1798 -1024 318 661 620 840 -382 -1155 -588 -577 -755 222 -490 -931 -738 -181 72 319
3154 319 1129 855 269 1304 818 -558 -801 -882 -1572 -113 1014 1855 1983 1301 644 -396 -217 937
3172 937 849 912 856 13 -688 -684 545 1166 1709 2333 1619 679 613 144 -860 -515 291 525 663 684 927 643
3194 643 385 110 24 83 926 34 -709 -730 -1212 -1339 -773 461 1082 1104 928 40 -1559 -1540 -1070 -1210 -54
3215 -54 635 27 -703 -671 -527 -594 111 388 -7 -726 -674 -1146 -1233 -949 -768 -793 -13 1012 727 465 -151 -351
3237 -351 -1394 -1006 -373 -326 515 457 -552 -1030 -273 -47 446 1210 1037 565 -378 -1052 -1368 -1061 -163 1013
3257A013K28k34J45j294l26J92K50L92K22j98q16k21L23j56O02Q12p5m14R6l63
3277A78o38n49k62M35M17J061N66m12l43q63o27N01R10L36K6p90n15l96j83R12
3297b36J038K95N7n98j99l69n40J47Q6L7M84L78K00K17n14m33l69O46M32K18m1
3318I36p62o42Mr6K80Q75R19j18j60j094p38Q9P2R8R08oK83o83q02n2O32L25L09
3341E77J9k15j038j83k48j34Q12J66J25N58n55Jk42o33J69o07N02R92j26N3n61
3362e68r40J64L43Q96P14j73m87o17j044J04Q03L66J118j69o75J85m38k51L03
3381c66K51P68l48n10O51l77k09J4L0M81M18K31L1o64m27o4l64M83P85J66O96
3402A676p23r65j9k34M71P33K40J01l49n98l88l92L01R78J72K98o81m57m5l29
$$ plain form
3257 1013 1241 1007 1152 -142 -468 -276 -26 366 588 390 -426 -647 -324 -480 122 934 859 445 541 178
3277 178 -460 -1009 -1271 -836 -419 642 1208 796 453 -410 -1037 -536 374 710 736 -54 -569 -965 -1148 -236
3297 -236 802 1097 1154 556 357 -12 -552 -405 -319 -282 202 580 780 997 483 50 -319 327 759 977 936
3318 936 174 -468 -464 -560 -280 595 1514 1396 1236 142 -596 -507 -435 -337 571 565 848 165 -637 -689 -57 268 577
3341 577 596 381 -657 -840 -1088 -1222 -410 -244 -119 439 -116 -115 -357 -990 -821 -1428 -926 66 -60 -7 -568
3362 -568 -1508 -1344 -1001 -105 609 436 -51 -668 -1712 -1608 -805 -439 679 510 -165 20 -418 -669 -366
3381 -366 -115 653 305 -205 446 69 -140 -126 -96 385 803 1034 1065 401 -26 -90 -454 29 814 980 1676
3402 1676 953 -12 -31 -265 206 939 1179 1280 931 333 -55 -447 -146 832 1004 1302 621 164 119 -210
3422b10J22M20l70O75J22o83K12k78k66l3l88M69Q31m34Qn34n74N26k88M58Q30
3443F15m13q1n64p46N7N27P00L75k06j54m42o89K87j7L98J047p72J04l9p68K34
3464e47L29J05M86j29m3K21o10Q0m52j28P33k87O74M20p67K1p12l17N98M32O19
3485G26q3r64n2p1l56R71K48L73j23r16k59k47L9M10O34p4q4k62L75m69k65L48
3507a01o02K39O12k23M4Q8o18K07K1P6J093j43l89n3q18j50K81N1P71K21J72K74
3529A053j032l96J24o6Q79j2l26Q27j307j65N88ML98K39k47K40m10j06k08l00
3549b23K00L60oP09Q8q63L03n81j03M66M4N1K99q36m6p86O07O46k06J023n72q22
3571b48Q2q26k17P71l3L19%n57K87J43O0k57O6L02j21l66j99q0M3Mj47L50P93
$$ plain form
3422 -210 -88 332 -38 637 759 76 288 10 -256 -289 -677 -208 623 189 197 -337 -911 -385 -673 -215 615
3443 615 202 121 -443 -1189 -1132 -605 95 470 264 110 -332 -1021 -734 -751 -353 694 -78 26 -13 -781 -547
3464 -547 -218 -113 373 244 201 422 -188 -108 -560 -688 45 -242 432 852 85 106 -606 -923 -325 107 726
3485 726 643 -321 -373 -444 -800 171 419 792 669 -247 -506 -753 -714 -304 330 256 172 -90 285 -184 -449 -101
3507 -101 -703 -464 148 -75 -31 57 -561 -354 -333 -257 836 693 304 251 -567 -717 -436 -385 386 607 779 1053
3529 1053 21 -375 -251 -317 562 550 224 1051 -256 -421 167 171 569 808 561 801 391 285 77 -223
3549 -223 -23 337 331 1040 1128 265 568 -13 -116 350 394 445 744 -92 -138 -924 -317 329 123 1146 574 -248
3571 -248 -166 -992 -1209 -438 -471 -152 -152 -709 -422 -279 -219 -476 -410 -108 -229 -595 -794 -874 -831 -827 -974 -624 169
3594A69O6r8l33l60m46N3M23k59N48L68m76j95M42k97R4O53K18k36l80j99l96
3615f41n0M89N61k41M88n9j19J11k91j19Lj82M2L83J73j54j47p2M56j69M89j02
3637H49k00mp18o13L94J28N07O07l32P8j08k67l29J54j55l06LJ59r1j04L46L78
3659C76k15O30j38m44j14m82n4j65q6J13L83L32K26j16K04n38k94N09ll33j2o8
3681b89l61K22J43M37M26J96k84J74p89k50L6K6j28J81P8j25N44Q5J92p3m2O8
3703D67o93l7q0k16LO8q5N43N46R2l08k70m3l98k04j33k20N09M56j64n06O27K40
3726A94j08J73j30n49j51ro92J65O27Q3L18J48J63O4J6k71m14j20Nj0N9j02N02
3749c9R4L34k23N23l9k96J85n70l87M3k71M79L41K27N03J08j22l98k30K35j05
$$ plain form
3594 169 235 137 -196 -556 -1002 -949 -526 -785 -237 131 -345 -540 -98 -395 -301 352 570 334 -46 -245 -641
3615 -641 -691 -202 359 118 606 547 428 539 248 129 132 -50 -8 375 548 394 247 175 631 462 951 849
3637 849 649 645 -73 -686 -292 -164 343 950 618 696 588 321 -8 146 -9 -315 -312 -153 -244 -348 -2 376
3659 376 161 791 653 209 95 -387 -441 -606 -692 -579 -196 136 362 246 450 -88 -382 127 124 -209 -221 -289
3681 -289 -650 -428 -285 152 578 774 490 664 -125 -375 -339 -313 -441 -260 -182 -307 237 322 514 441 399 467
3703 467 -226 -263 -343 -559 -556 -488 -573 -30 516 608 300 30 -13 -411 -615 -748 -968 -459 -3 -167 -673 -46 194
3726 194 86 259 129 -420 -571 -580 -1272 -1107 -480 -397 -79 69 232 296 312 41 -373 -493 -488 -498 -439 -541 -39
3749 -39 55 389 166 689 650 354 539 -31 -418 -375 -646 -167 174 401 904 1012 890 492 262 497 392
3770C92k49k49j61L93Q7J03M01J59P4K08m44k00r4j88o05R5J90M25QK77k23K03
3792F02J38l12l46L1l63k68J94k92q1N74p4L53M83p1m03k57l73m9k47j65J10k11
3814a027L84P03l54K08L06k17k85j46l53j18M9Q7J41J02M63r1K28O17n81j8k09
3835a11p72Ol6Q5N84p0K45L61J57K22M7n20j14k79k19K91k01K74J78k66M62N56
3857H80m5M12m70p12j3m69L75l61O0M32J75K07K37K02j40n26k89q0m3l10J36q
3879c50J42K43j16O19J61j47R6o58l92O1l74K35P0J39J10K54M49K05l62Q1l24
3900A42j92J00l58l45M19k83M18K63K74O33m50l88j56k07P6J65m29J15j95M14
3920A6J56M3M02Q0j96k49k87k8j1m03m9J37j51P35L49oK04m69m88L5n97J72Lj07
$$ plain form
3770 392 143 -106 -267 126 213 316 717 876 950 1158 714 514 420 232 -373 -278 -88 337 345 622 399 602
3792 602 740 428 82 113 -250 -518 -324 -616 -697 -123 -197 156 639 568 165 -92 -465 -514 -761 -926 -816 -1027
3814 -1027 -643 60 -294 -86 220 3 -282 -428 -781 -899 -850 -763 -622 -520 -57 -148 80 697 116 98 -111
3835 -111 -883 -877 -913 -828 -244 -314 -69 292 449 671 718 198 84 -195 -414 -123 -324 -50 128 -138 324 880
3857 880 835 1247 777 65 52 -417 -42 -403 -343 89 264 471 708 910 770 244 -45 -125 -168 -478 -342 -350
3879 -350 -208 35 -81 538 699 552 648 -10 -402 -341 -715 -480 -410 -271 -161 93 542 747 385 466 142
3900 142 -50 50 -308 -653 -234 -517 -99 164 438 1071 621 233 77 -130 -54 111 -318 -203 -398 16
3920 16 172 215 617 697 501 252 -35 -63 -74 -477 -526 -389 -540 195 544 538 742 273 -215 -180 -777 -605 -602 -709
3944g09N7P1j7P46l07M22o5l83J93m13m08J52l79N0Q81j14N44l1k0k24m04k93
3966f51J04j53L34k96j2J77J88j4L42K06N10l19k05m04m15P7M2rL72Q32j88J80
3988F98p0K0j15k85L24j33m29Q8l42M4P33j4K72L73j06K4l75j91n16j05L4J8K92
4011B39O6M05m28L13J64n78M19k17k65p5o92J25n7K12Q71j28J89R2n52m8k65m07
4033f17K15l07j40N16k14J07J62J18K74j3j76R0k18l04k56p12M03M04P12L49j97
4054A96p7Q6r42J48M08l8l57j21k7O07k46M15J35j52M96j55O2l06n05Jj10l6M85
4077c3K87K95Q7m99M0J21k88L48j96l13m2r3N6K35j7L32n1K57j03K45o49l32k42
4100e55l41M47L0R31m6k73J14k17l7L00k29J48o38m0k65k7M21N43l2J31J85K33
$$ plain form
3944 -709 -652 -581 -598 148 -159 263 198 -185 8 -405 -813 -661 -1040 -990 -109 -223 321 290 270 46 -358 -651
3966 -651 -547 -700 -366 -662 -674 -497 -309 -323 19 225 735 416 211 -193 -608 -531 -489 -498 -126 706 518 698
3988 698 628 648 533 248 572 439 10 98 -244 -200 533 519 791 1164 1058 1082 707 516 0 -105 -71 -53 239
4011 239 305 710 282 595 759 181 600 383 118 43 -649 -524 -581 -369 502 374 563 655 103 55 -210 -617
4033 -617 -402 -709 -849 -333 -547 -440 -278 -160 114 101 -75 15 -203 -507 -763 -1475 -1072 -668 44 393 196
4054 196 119 205 -737 -589 -181 -219 -576 -697 -724 -117 -363 52 187 35 531 376 438 132 -373 -372 -482 -518 -33
4077 -33 254 549 636 137 177 298 10 358 162 -151 -193 -286 -230 5 -12 320 269 526 423 668 19 -313 -555
4100 -555 -896 -449 -419 512 466 193 307 90 53 353 124 272 -366 -406 -671 -698 -277 266 234 365 550 783
4122G83k72n12n10j18pO19M11L0j06k33j47L45J31L01On63m11J0L9Q9M8K83L75
4145E91m9J88o8l17l13k88m1M49m81K52J67l2Q2L6k02M67K88j39m74o86J00l90
4167h60L2N69M26J02K18l93l46j58j04p6p1K19J50k69r5J86l77L28O49m6j3q1
4189a0m98j66k35j26M99J98M17J94k27j45J76j85j29K37J09j75k71MJ14OL03J48
4211B38J07K29nk00m73j28r2J62K35M61q0L30k09n89M25K22o8J53j42j28l09k86
4233a47J15K13O0J13K00L09m29p6k59j14k91J44M69j55K16O3o14J48J00R7L49
4254E11j28k71n50J44j50P3J25K28K76k44P6Q2k54l88j98k17P54K68k05j4k25
4275c07k99ON33M99j87m1k02n80j5J53n6K50M20j23O7J65j53l19q3k2K35K37p8
$$ plain form
4122 783 511 -1 -511 -629 -636 -17 394 424 318 85 -62 283 414 715 721 158 -253 -243 -204 -115 -67 216 591
4145 591 542 730 662 345 32 -256 -297 152 -329 -77 90 58 140 176 -26 441 729 590 116 -570 -470 -860
4167 -860 -828 -259 167 269 487 94 -252 -410 -514 -590 -661 -442 -292 -561 -656 -470 -847 -519 130 84 71 -10
4189 -10 -508 -674 -909 -1035 -536 -338 79 273 46 -99 77 -108 -237 0 109 -66 -337 -333 -219 -213 90 238
4211 238 345 574 569 369 -104 -232 -324 -162 73 534 454 784 575 -14 411 633 565 718 576 448 139 -147
4233 -147 -32 181 241 354 554 863 434 358 99 -15 -306 -162 307 152 368 431 -183 -35 65 162 511
4254 511 383 112 -438 -294 -444 -371 -246 -18 258 14 90 172 -82 -470 -668 -885 -131 137 -68 -82 -307
4275 -307 -606 -600 -67 432 245 204 2 -578 -593 -440 -496 -246 174 51 118 283 130 -189 -272 -294 -59 178 100
4298A00k2m20j43K62K3N99J35j64J8o06k71L13LK09J66n21M84o4L0j5l03J49J53
4321A15k97L78p0l53j87k31k3P23K24J58l78l47k03J14MK12L15p0L9k91P9r4l5
4344b18L7J43R8J70J75k69j3n27M8L23M60K24k10j96q5m26K75j58N41J12o9j98
4366B37J6k51M15l16J5L05K0m3j4j94j88j79J16O95j73j7k6m88Q6o7l58N63J79
4389C33Q8j06m89j62K6j7K88K79l20K62l08k16k10l8K88J84p4K44m27K60k93o17
4411a025O29j77L02M74j44k09j18k56o5J90r3O42j57k40O8l58K59K12k31M41M
4432A48j38j32j03j24LL7K21L71N5K06n49J6l18K56M65L56l98K84l91j72j68O
4454f9M70K76k50lj19l9j31k7q7J93J02J31Ol02O9k05m72O53K03J64j67k46k27
$$ plain form
4298 100 78 -342 -485 -223 -200 399 534 370 388 -218 -489 -176 -173 36 202 -319 165 101 131 116 -187 -38 115
4321 115 -182 196 126 -227 -414 -645 -668 55 279 437 59 -288 -491 -377 -373 -161 154 84 123 -168 -89 -183 -218
4344 -218 -181 -38 60 230 405 136 123 -404 -356 -33 427 651 441 245 160 -266 9 -149 392 504 435 237
4366 237 253 2 417 101 116 421 441 398 384 190 2 -177 -61 634 461 444 418 -70 16 -51 -409 154 333
4389 333 421 315 -174 -336 -310 -327 -39 240 -80 182 -126 -342 -552 -590 -302 -118 -192 52 -375 -115 -408 -1025
4411 -1025 -396 -573 -271 203 59 -150 -268 -524 -589 -399 -492 150 -7 -247 -179 -537 -278 -66 -297 144 148
4432 148 10 -122 -225 -349 -346 -309 -88 283 338 544 -5 11 -307 -51 414 770 372 656 265 93 -75 -69
4454 -69 401 677 427 424 305 266 135 108 21 214 316 447 453 151 220 15 -457 196 399 563 396 150 -77
4477g7k16PN36rJ95r7m05m9J12m03K51p0O8K55j85O47l19m02O6k87K58O25l21
4500A80K7n90n42O51L0L57K10p6k01O5m82L04m6j30J5J53K36Q4m4m4Nk49N0K93
4524B56J49k31m64j69K1J43O16R5J8k00k25m5j25k06L26J3j45K29k33K19j59m96
4546f13M80QO6N62o02j82j53l90M59M9J78K75j21r1k32J9J83J29k53K70m13J10
4568b62K03k73K57J22k59M98k3J5l39K3l27K83j26M69J6Q2L60p27J18L08k99J73
4590B92L7K18l67K5k65L63L2O0k3K63j28j55J70o9m68P0n4K98J39k40J77j53J2
4613B34o0K82K4j63m3k93n26L5R2L42J05K65J11k10l61R3k18J00k53J29j98L41
4635a72j54P9j14K4Q8M76k3l39k27l8k81k04O29o2K05J59j01K2j77K26k42l72
$$ plain form
4477 -77 -293 -286 250 241 436 339 -66 -115 -3 -406 -155 -225 -157 98 -87 560 241 -161 -95 -382 -124 501 180
4500 180 207 -383 -925 -274 -244 113 323 247 46 111 -371 -67 -113 -243 -228 -75 161 245 201 157 162 -87 -37 256
4524 256 405 174 -290 -459 -438 -295 321 416 434 234 9 -36 -161 -367 -41 -28 -173 56 -177 42 -117 -613
4546 -613 -133 -125 -59 503 -99 -281 -434 -824 -365 -316 -138 137 16 -75 -307 -288 -105 24 -229 41 -372 -262
4568 -262 -59 -332 -75 47 -212 286 263 278 -61 -38 -365 -82 -208 261 277 359 719 -8 110 418 119 292
4590 292 329 547 180 205 -60 303 335 395 372 635 507 352 522 453 -15 55 1 299 438 198 375 222 234
4613 234 174 456 480 317 274 -19 -545 -510 -418 -76 29 294 405 195 -166 -73 -291 -191 -444 -315 -513 -172
4635 -172 -326 -247 -361 -337 -249 227 204 -135 -362 -400 -681 -885 -256 -318 -113 46 -55 -33 -210 16 -226 -598
4657e98K64q9K59K36j64J78j36Q6J00K36K33L9r64j29Q3N1N16O8J65J10l25J68
4679C87q9%k57O0J8j26j33J86qJ11J3o0J02O05j43m27l62l92k9K81K64K12j0N
4703B08p1L8k13K32q5L1l30l2RM3j14K12K09J08NK8O3l65J41l34k66M54p7J41
4727C5j81K13J74o8j55L43o3k96o2l95J59R7K54p9R6J10K64m4J31m34j39M9k92
4750b83L30j51J34j73q1J49J97OK25j74j2m41J81ml69K56Q2J3J52J46l3P5l04
4773g9l82J52m4k76L83k65L6j67N00L0M5K17p2l84l10J84o3K39JP4K47l8J0J44
4797A82j66k3q7k20J91n56M66J50n3kM90j32K15k5q0q7k16l38QJ79M33j77J24
4820B76K04k3J30J81j18P0l13m41K1j61K17O4J68J28J79L2q6j28R4n91j81J93
$$ plain form
4657 -598 -334 -423 -164 72 -92 86 -50 36 136 372 605 644 -320 -449 -366 -315 201 269 434 544 219 387
4679 387 298 298 41 101 119 -7 -140 46 38 149 162 102 204 809 666 239 -123 -515 -544 -263 1 213 203 208
4703 208 137 175 -38 194 109 140 -190 -222 -213 -170 -284 -72 137 245 250 278 341 -24 117 -217 -483 -29 -106 35
4727 35 -146 67 241 173 18 361 298 2 -60 -455 -296 -199 55 -24 72 182 446 402 533 99 -40 9 -283
4750 -283 47 -104 30 -143 -224 -75 122 128 353 179 167 -274 -93 -97 -466 -210 -128 -115 37 183 150 225 -79
4773 -79 -461 -309 -353 -629 -246 -511 -475 -642 -142 -112 -67 150 78 -306 -616 -432 -495 -256 -255 -181 66 28 38 182
4797 182 16 -7 -94 -314 -123 -679 -213 -63 -116 -118 372 240 455 430 350 263 47 -291 -283 -104 329 152 276
4820 276 480 457 587 768 650 720 407 -34 -13 -174 43 107 275 403 582 614 528 400 494 -97 -278 -85
4842h5O6k72m3K59J90j6J16J20j88q7L7k02l85P2L0j21J75K14O4J31J8k27j30
4865b64J79r4l86M15l71j61K39p2L33N12k36j41j74r3o9q6m8J7K64k09K01J14
4887a30K51M18j81k65k89j10JJ26j34j21L00KK70K49j25K2k90l0p3m2J40pj19
4910a37K0R8L72O7r9o0q4J75n44Q1j5l5K30l39J16K84O9J79j70L04j97l13R4k15
4934a19l05K1L93l61N21P6j38K54n4m02L44l98mJ88m17K31L24Pj05J49q6M23l50
4957A92k7o5p7l5k84J0L87P0K57N6k95l0k98L94M4l38Q0m80K22K79L0J35J06m15
4981h2Q4J82p7k1j70j00k51J16L0N58L4j86l13rR1J54m16K32k93K83l70pQ2K81
5005a68K08Q8k17R2l17j74K27q4K2j92K3K22j2J70L01l37j47J12J02j07l2K0M9
$$ plain form
4842 -85 -19 -291 -334 -75 115 99 215 335 147 60 97 -105 -490 -418 -388 -509 -334 -120 -56 75 93 -134 -264
4865 -264 -85 -179 -565 -150 -521 -682 -443 -515 -182 330 94 -47 -221 -314 -383 -469 -517 -500 -236 -445 -244 -130
4887 -130 121 539 358 93 -196 -306 -305 -179 -313 -434 -134 -132 138 387 262 284 -6 -36 -109 -151 -11 -18 -137
4910 -137 -117 -19 353 420 321 261 177 352 -192 -111 -126 -161 69 -270 -154 130 199 378 208 512 315 2 96 -119
4934 -119 -424 -403 -10 -371 150 226 88 342 288 -114 230 -168 -172 16 -401 -170 154 161 56 205 119 542 192
4957 192 165 100 23 -12 -296 -286 101 171 428 484 189 159 -139 255 299 -39 41 -439 -217 62 92 227 333 -82
4981 -82 2 184 107 86 -84 -184 -435 -319 -289 269 303 117 -196 -205 -114 40 -376 -144 -437 -154 -524 -531 -449 -168
5005 -168 40 128 -89 3 -314 -488 -261 -345 -323 -515 -492 -270 -282 -112 189 -148 -295 -183 -81 -188 -220 -200 -151
5028a51j96O0L49J46J36J15k71KQj60j93P0q9L08j66K22J50j81J9J32P5Q2k4l30
5052A13J39m06L38O8J0K69l5m6J72l42M1l28k2L4P4M48k82J59l62J66K18j07P2
5075C91k16k0k34j7n73L62K16K89k3n7l29J87r1m2N7j15p0k39L51R9j86L18k05
5098a47J63n9J47m32rj3j09J42j08M97k00K52J16l31Kj24J87L1Q2l55L3q2K92
5121b5k32M34j69j3K02Q0P3k95Qj01l14K94N8K09j36j59O0J29j65R2k3j64N3P
5145i7R6j17k6M3K98N6Q9l83k4j42M9P0k04P5K98j98K9J69j67M2J03R6j77j9l
5170d4J2J13k34j30L05J01J72J51j98j5j38j62J63N8N1p3p3j5K4J91O1K36l1j66
5194C59l10J59k07k6K93j41K23j04K92l49mj07j94J80q0K51k71M8p0k60L14j15
$$ plain form
5028 -151 -347 -287 62 208 344 459 188 190 198 38 -155 -85 -174 134 -32 190 340 159 178 310 385 467 443 113
5052 113 252 -154 184 252 262 531 496 450 622 280 321 -7 -29 5 79 527 245 404 42 208 426 319 391
5075 391 175 155 -79 -96 -669 -307 -91 198 175 118 -211 -24 -115 -157 -100 -215 -285 -524 -173 -74 -260 58 -147
5098 -147 16 -43 104 -328 -337 -350 -459 -317 -425 72 -128 124 240 -91 -89 -213 -26 5 87 -268 -235 -317 -25
5121 -25 -257 177 8 -5 197 277 350 55 63 -38 -352 -58 0 209 73 -86 -26 103 -62 30 7 -157 -104 -97
5145 -97 -1 -118 -144 -101 197 253 342 -41 -65 -207 -158 -88 -292 -217 81 -117 -88 81 -86 -44 59 155 -22 -41 -44
5170 -44 -32 81 -153 -283 22 123 295 446 248 233 95 -67 96 154 205 132 59 44 68 259 320 556 525 359
5194 359 49 208 1 -25 268 127 350 246 538 189 185 78 -116 64 -16 235 -36 12 -58 -318 -4 -119
5216a19K5K54j93L80n85p7j69P8O8L45O8j00r8j19J1Q1rj38K00k64j06j5J77j22
5240d27J06L59j38J18n3l1j42l17O6R6K28Q1q1P4N0l39J11nJ34R3K0K7n8k32K13
5265d7J45k4J24J80l36R4j03K22k57L2O7J62P2m0l8k76J45m6K28K00m04K03k19
5288H4R8o7J42j96M2K03j93J97k11K52k32k66O7K68Q5k40k5j04j8j26L56N3L3
5311B02j15o7j28p8J48j33J24r5KJ20n6Nk93K16q7L34K6n22N17j3r5l31L55j16
5335h0L75l83P1k05J31J0N7j15QL59k95K57p3l24j15K07L9L61k71R8k3k19O9n8
5359a19P3K71L8k11j49jQ2k47N7K00l9j13n1J50Nl4Qk3j66M13k76j90j87L57j58
5384c10J69n1K61M0k82k5j78J3K61J43j94J79K8k73l9J61n1K86k8J97j51k61K25
$$ plain form
5216 -119 -94 160 -33 347 -238 -315 -484 -406 -338 7 75 -25 -123 -242 -231 -150 -159 -297 -97 -361 -467 -482 -305 -427
5240 -427 -321 38 -100 18 -35 -66 -208 -525 -459 -363 -135 -54 -135 -61 -11 -350 -239 -244 -110 -17 3 30 -28 -260 -47
5265 -47 98 74 198 378 42 136 33 255 -2 30 97 259 331 291 253 -23 122 76 304 504 100 303 84
5288 84 182 115 257 61 103 306 113 310 99 351 119 -147 -80 188 273 33 8 -96 -114 -240 116 169 202
5311 202 87 20 -108 -186 -38 -171 -47 -142 -140 -20 -76 -71 -364 -148 -235 99 125 -397 120 107 12 -319 36 -80
5335 -80 295 -88 -17 -222 -91 -81 -24 -139 -131 228 -67 190 117 -207 -322 -115 -76 285 14 112 89 -130 -61 -119
5359 -119 -46 225 263 52 -97 -98 -16 -263 -206 -6 -45 -158 -209 -59 -54 -88 -80 -103 -269 144 -132 -322 -509 -152 -310
5384 -310 -141 -192 69 109 -173 -198 -376 -363 -102 41 -153 26 54 -219 -258 -97 -148 138 110 307 156 -105 120
5407A20q9J58l11L66l6j17J68k87O7j40K83J13M9N5j58j70P6J59n2k00Q2K96l00
5430A32k17M67k53K0j28L68k84mN4J78o09l8L80j69K19K93m24j08K20l23O2J54
5452a0j69o2Q1J87m84L17j63M7K06k36KJ19j05j51n0k53M14r9L55j20K92q6j92
5475a60p7L2N6J02mr5j05L5j34M84j08k63K55J7Kr6q0M6q3N6M23k17mj06N4j40
5501a10J17P4Q9k82K64k90K83n8Mj54N23J99n42L32o06n9P4j6J58R7n8J94O8k91
5525A0L0m2L62j38j82J49k67K00j99k34L17J7P0L29k49K5k85r4j45J63J85j60
5547a38K88k71J8n9K04q3K14P3j22k7k59j02K57l16O09q0m9J08o8k10K47j55J6
5570I5M5L6j93l8j47R5N8R1L9j6J3J55l58m15M98j90Q0O1K17l1J49k63P6k19L8
$$ plain form
5407 120 31 189 -122 244 208 91 259 -28 39 -101 182 295 344 399 241 71 147 306 254 54 136 432 132
5430 132 -85 382 129 149 21 389 105 101 155 333 -276 -314 66 -103 116 409 -15 -123 97 -226 -164 -10
5452 -10 -179 -241 -160 27 -457 -140 -303 -256 -50 -286 -284 -165 -270 -421 -471 -724 -310 -409 -54 -174 118 32 -160
5475 -160 -237 -205 -149 -47 -51 -146 -251 -216 -350 134 26 -237 18 35 37 -59 -139 -93 -176 -120 303 86 82 -24 30 -110
5501 -110 7 81 170 -112 152 -138 145 87 91 -63 460 659 117 449 -157 -216 -142 -158 0 97 39 233 301 10
5525 10 40 -2 360 222 40 189 -78 122 -77 -311 6 23 93 422 173 198 -87 -181 -326 -163 22 -138
5547 -138 150 -121 -103 -162 42 -41 173 246 124 97 -162 -264 -7 -323 286 206 157 265 197 -13 234 79 95
5570 95 140 176 -17 -55 -202 -107 -49 42 81 65 78 233 -125 -540 -42 -232 -152 -91 126 95 244 -19 57 -162 -124
5595a24J18j08j12J51l22K41j14J52l7J24K30r6k34j19J46k60N7K72J3L84n20
5616a58J03k1J59j82J19r3P1j83J31j48p3L09J02o6j13K37r3J92o09K02J16J63
5638A65l7r4J41K27k62l8J16J74k75Rj00m4R0K06j65n7K27M5P2K36m36K02o02
5661b00K95R5JL0J03j47l6K7j10R5R9N7j73N1k71m4l60J98q9M71J63j00Q8n67
5685c24J20j12j8P4J94j95k2N2R5r2J18J84m2j43j29Q9j22j74P1LK02k51L12n5
5709a65L13k32M8L34k58k8j20OK8k55K04M3K04j60K76k17k0L6k26k50L89J11m5
5732A6j24P0L06p0j67P4j03J21p8j94J48j50K30j81J49L1K10Q3j18k59Jj76J06
5755g5j51J01R4M8l1N0K64n65L67m7J89l82l2k79L94n5K13P4J89j29k63J59O0
$$ plain form
5595 -124 -6 -114 -226 -75 -397 -156 -270 -118 -155 -31 199 103 -131 -250 -104 -364 -307 -35 -22 362 -158
5616 -158 -55 -76 83 -99 20 -73 -2 -185 -54 -202 -275 34 136 70 -43 194 101 293 -316 -114 2 165
5638 165 128 34 175 402 140 102 218 392 117 126 26 -18 72 278 113 56 283 328 400 636 200 402 -200
5661 -200 95 190 191 221 324 177 141 168 58 153 252 309 136 187 -84 -128 -488 -290 -379 92 255 155 243 -324
5685 -324 -204 -316 -334 -260 -66 -261 -283 -231 -136 -228 -110 74 32 -111 -240 -151 -273 -447 -376 -373 -171 -422 -110 -165
5709 -165 148 -84 -36 298 40 12 -108 -102 -74 -329 -125 -82 122 -38 238 21 1 37 -189 -439 -50 61 16
5732 16 -108 -38 268 198 31 105 2 123 45 -149 -1 -151 79 -102 47 78 288 371 253 -6 -5 -181 -75
5755 -75 -226 -125 -31 17 -14 36 300 -265 102 55 244 -138 -170 -449 -55 -110 103 177 366 237 -26 133 193
5778A93j67j31j14j8K89r2J65J67l01J40J86l1L9k16j07K85n35K02j36J96J57
5799A71j19k4J69J19m6q8k06k52rL4L1J28R4k7O9J82j78J1N8j88J7k76J06Mk38
5824d58L66Kj2K61k29j41Q1M0j01k35J11o9N9K09J60K7r7L1n7m7j39Q9j19j19
5848c87J12K00p6p1J87j30K8M01l91P4q0j02J26n7M40l04K1K78k30L08K3k45j27
5871bQ4j8J29l01R4M8M9K16j89J97O7q0l9J00m79K12Q5r0q6K08j10L78k99j77
5895cL14l52lJ17l18J83K58m1j3m56M27k6J04Rj36l77R4j75K67M3M6J18k51L90
5919B19j9m56O4J25j26L1nK4q7J36j77M77j94O1qk55K11j71J59l53o1L97k30J07
5943a31J49J03j44J24JP0N7n56J20q4L26j61m8L08K63n19K13O6j38l5L9j50k8
$$ plain form
5778 193 26 -105 -219 -237 52 -40 125 292 -9 131 317 286 325 109 2 287 -248 -46 -182 14 171
5799 171 52 28 197 316 270 182 -24 -276 -285 -251 -220 -92 2 -25 44 226 48 59 117 -71 -54 -330 -224 -220 -458
5824 -458 -92 -90 -102 159 -70 -211 -130 -90 -191 -426 -315 -384 -325 -116 44 71 -26 5 -52 -99 -238 -149 -268 -387
5848 -387 -275 -75 -151 -222 -35 -165 -137 264 -127 -53 -133 -235 -109 -166 274 -30 -9 269 39 347 370 125 -2
5871 -2 82 64 193 -108 -14 34 83 299 110 307 374 294 255 355 -124 88 173 83 -3 205 95 473 174 -3
5895 -3 311 -41 -44 73 -245 -62 196 155 142 -314 113 87 191 200 64 -313 -219 -394 -127 -84 -38 80 -171 219
5919 219 200 -256 -192 -67 -193 -162 -167 -143 -230 -94 -271 206 12 73 65 -190 21 -150 9 -344 -405 -8 -238 -131
5943 -131 18 121 -23 101 102 172 229 -327 -207 -291 35 -126 -174 134 397 -122 91 157 19 -16 23 -127 -155
5966a55J22j85J04M03k66J30j86J77Lk87K59k55o3j32K25j2J21J07k37K31J49
5987B53r0r4kq6j6o2q8Q2M0K12Q2j51K00k57J71n4k47J00j53K76k31M11q3j22
6011I1k8J18q7L5j62K95n53M90j62J29L08j42J7r8Rk0q5k0n7j17L2k6J68J45j84
6036I6M5n8J05K3j02p3j40o5j73L21M8J13n4k29K41n6j62J52n1l78M43o05J88
6059c71J03q1k5J99J66j78j16K36j48j31O0n1K76j87o4M59k17Q3J70k86L2R1m57
6082d37L58j02k5L3rO7K63n6L19l17j3P7n3Q8k69K93n09M79j18k1J73K30j01j59
6106A91rj19M5j3K5j24J7J67K7J41l67J61k0N1l48K22k1q4J45j47J94j69K92j59
6130I8P8j4j07q2Q4m66K15rK57J36k2n4q6j40J56j71K19j99K24R2o12M66l08J28
$$ plain form
5966 -155 -33 -218 -114 289 23 153 -33 144 147 -140 119 -136 -199 -331 -106 -118 3 110 -127 104 253
5987 253 163 69 67 -19 -35 -97 -185 -103 -63 149 231 80 280 23 194 140 -107 -7 -160 116 -115 296 213 91
6011 91 63 181 94 129 -33 262 -291 199 37 166 474 332 349 251 260 240 155 135 78 -39 -7 -33 135 280 96
6036 96 141 83 188 211 109 36 -104 -169 -342 -21 27 140 86 -143 98 42 -120 32 -19 -397 46 -559 -371
6059 -371 -268 -349 -374 -175 -9 -187 -303 -67 -215 -346 -286 -337 -61 -248 -312 147 -70 13 183 -103 -71 20 -437
6082 -437 -79 -181 -206 -173 -182 -115 148 92 411 94 81 158 105 193 -76 217 -292 187 69 48 221 451 350 191
6106 191 182 63 108 95 120 -4 13 180 207 348 -19 142 122 173 -175 47 26 -58 87 -60 134 -35 257 98
6130 98 176 162 55 -27 57 -409 -194 -203 54 190 168 114 28 -112 44 -127 92 -107 117 209 -403 63 -245 -117
6154a17K40l13J42L62k47j58P8j8j01L60j78K64m19n3j06L95o6Q3j80J96l7m19
6176b92N13k09j54O1j14K00j5r8K09l45j22L04j64K34k15K11l4p0J89j05K56m27
6198a87J02n1j19Q2r8M58l07K21k26J1j41L69j63j26J02m7K33j20j09P2j47M1
6220a50J03j96L39k07K79q7k53J14M5l5M28j64j5p6J22Lo5m05M47k12K52j23n6
6243H8J01j05j10J81L1o8K5j24J31M0O9o1P7l4P0j22K33k14l3m5k9J52k44j14
6267a05L97k96k2j80L9K56Q2q7l8K0l94K71m32N41j96J02k41J97j85R7K14j83
6289a43P6j38O2O7K22j36l91J96NK33j50l33L24k07R9M5j1K52j85J35%k19j00
6312b97O6M1K97J89l20l2o4J33l6r9K32j89K54j29k63J88J61k81K71o1J72o4p0
$$ plain form
6154 -117 123 -190 -48 314 67 -91 -13 -31 -132 228 50 314 -105 -158 -264 131 65 148 -32 164 127 -292
6176 -292 221 12 -142 -81 -195 5 -10 -108 101 -244 -366 -62 -226 8 -207 4 -30 -100 89 -16 240 -187
6198 -187 -85 -136 -255 -173 -271 187 -120 101 -125 -114 -255 114 -49 -175 -73 -120 113 -7 -116 -44 -191 -150
6220 -150 -47 -243 96 -111 168 81 -172 -58 -13 -48 380 216 201 125 247 250 185 -220 227 15 267 144 88
6243 88 189 84 -26 155 186 118 143 19 150 190 259 198 275 241 311 189 422 208 175 130 101 253 9 -105
6267 -105 292 -4 -26 -206 -167 89 171 84 46 66 -328 -57 -489 52 -144 -42 -283 -86 -271 -174 40 -143
6289 -143 -67 -205 -143 -76 146 10 -381 -185 -180 53 -97 -430 -106 -313 -214 -169 -180 72 -113 22 22 -197 -297
6312 -297 -231 -190 107 296 -24 -56 -120 13 -23 -122 110 -79 175 46 -217 -29 132 -149 122 61 233 169 99
6335I9o4L1N3j33L58j29Oo1Mk32n7N7J69J24K08l58m7j05J39k02K99l2j74R1L9
6360H3j59J51j84J78J81k00l47M10q6q8O0O9k58J99n2L5j10P5j11O2J6K00N1o6
6384A09mn3r2K8j68M20j82J83m5p3k97K50OJ6k10J16R6J0M8m12J95r4k2J4L41
6409A80k37L1N0r4m5m6P3q0KK97k26O3j61j28J34N8K34l49L04l93J74R4q5rM3
6434a16M1N1m3r0j10j37M60k46J15n8R4m6j45K61j13J06j56K62o6j35K0q7J26
6457a2l2k3Q3J11k5j33J04J74k61Q7J17j96J13q0Q0J49J59j41J78l58N1j83J85
6480A47M2J94m09RJ2K37j39J64r6O9L3j56J72j18j68p4J63k30j98J76K26P0j16
6503A0P9k19k4Q6j2l3k3k15o2L66k58J24J45j14N6Qk15K60k03M5JM8K7j11R0j50
$$ plain form
6335 99 35 66 119 -14 344 215 221 160 164 -68 -125 -68 101 225 433 75 28 -77 62 -140 159 127 -47 44 83
6360 83 -76 75 -109 69 250 50 -297 113 27 -61 -1 68 -190 9 -43 -8 -118 -43 -154 -92 -76 124 175 109
6384 109 105 52 -40 -12 -180 240 58 241 196 123 -174 76 82 98 -112 4 100 110 158 -254 -59 -153 -175 -161 180
6409 180 -57 -26 24 -70 -115 -161 -88 -168 -166 131 -95 -32 -193 -321 -187 -129 105 -244 60 -333 -159 -65 -150 -159 -116
6434 -116 -75 -24 -67 -157 -267 -404 56 -190 -75 -133 -39 -85 -230 31 -82 24 -132 130 64 -71 -51 -138 -12
6457 -12 -44 -67 16 127 102 -31 73 247 -14 73 190 -6 107 27 107 256 415 274 452 94 145 -38 147
6480 147 189 383 -26 -17 -5 232 93 257 161 230 263 107 279 161 -7 -81 82 -148 -346 -170 56 126 10
6503 10 89 -130 -154 -68 -80 -113 -136 -351 -413 -47 -305 -181 -36 -150 -94 -86 -301 -41 -244 -199 -198 -150 -123 -234 -144 -294
6529b94K16j11L37j18j60L2K20k93O9L0pJ50j1R9j4R3n7j66j14rq8L11j76p2Q6
6554d7J49k04k3K75r5r1L0OP4k47l4J60K38j5q6J13J34j04j30j22p5P7pk9J61
6579A08j49k1N2K1J92n3M3L1k59Q0m09j1L81j3N7K52l39P9J29m48J87K04j22M4
6603C6Oj30K9O9J40J55j39j10j49J92r0N9o7p7J4oJ74Q3j78L70j92l19K89j28
6627C1j52J11n7N8k5j3J50l15J57K64k03k45K77k81j41M02r6O8j35K96j01j41
6649i1N4k02K61j49J76k25j36k0L26j71L9J40k46O4l4J12l50J88K93k26R7J2J06
6672A8j90L42p3l52N39k10MJ20k70L0j08Q3L41k18J48j96J96j50L5ON2k6j46O6
6696D1J77O2J4k79K07k70P7J36rj37K65j13k63K86k33J78j74K41L8l4K95l05j13
$$ plain form
6529 -294 -78 -189 148 30 -130 -98 122 -171 -102 -72 -79 71 60 159 145 238 181 15 -99 -108 -196 115 -61 -133 -47
6554 -47 102 -102 -125 150 55 -36 -6 0 74 -173 -207 -47 191 176 90 203 337 233 103 -19 -94 -17 -24 -53 108
6579 108 -41 -62 -10 11 203 150 193 224 -35 45 -364 -375 6 -7 50 302 -37 42 171 -277 -90 114 -8 36
6603 36 42 -88 -59 10 150 305 166 56 -93 99 9 68 1 -76 -62 -68 106 189 11 381 189 -130 159 31
6627 31 -121 -10 -67 -9 -34 -47 103 -212 -55 209 6 -239 38 -243 -384 18 -78 -10 -145 151 50 -91
6649 -91 -37 -239 22 -127 49 -176 -312 -332 -6 -177 -138 2 -244 -180 -214 -102 -452 -264 29 -197 -100 -88 18
6672 18 -172 170 97 -255 284 74 78 198 -72 -42 -150 -67 274 56 204 8 204 54 89 95 147 121 -25 41
6696 41 218 280 294 15 222 -48 29 165 156 19 284 171 -92 194 -39 139 -35 206 244 210 505 200 87
6719H7o3Q2k03o8L67m4o3N6n1J8j65k2n6j46n2K5K48J86O9k19k06J60j56O8O6
6744h2o4j45M9L07m1L8j73J23l13K04K66m7l48J14j47m3K24j27K37j40J47j60
6766a21OK93k35PJ5j16L9J36J05M1j86r1J94L9p5J78l30M8l9m6K91j16j71K54
6790A20j42q0K80q7o8K61k34j59O9n7J0J13O1j53K14L82l47M2K1o1k65J53k41
6813a68L3M8J63j24J3K65j09o4P4j55o0n6m0J38R7K10j59J23j55J21Q4l91k27
6836c39N98j56L0l36J80M9r9J84K0j15K11j01Oj02R1j69K14q1J49l08Q0K67k99
6859b6K07J05m52K98j61j22pN5l7ln7K56n1j07N6pJ62k82j28K93k02K1M7L9R4
6884ik5q4lJ79k38M6k98K11l6j3K24K2J38pn8k31K49k43Q7j12O2R3p9J8j40M75
$$ plain form
6719 87 24 106 -97 -165 202 158 95 151 100 118 -47 -69 -125 -271 -323 -298 -50 136 205 -14 -220 -60 -216 -148 -82
6744 -82 -146 -291 -242 65 24 62 -111 12 -301 -97 169 122 -226 -112 -259 -302 -78 -205 32 -108 39 -121
6766 -121 -115 178 -57 -50 -35 -151 -112 24 129 170 -16 -107 87 126 51 229 -101 -53 -92 -138 153 37 -134 120
6790 120 -22 -102 178 91 23 284 50 -109 -40 -97 -87 26 87 -66 148 530 183 225 246 185 -80 73 -168
6813 -168 -135 -87 76 -48 -35 230 121 57 131 -24 -84 -140 -180 -42 55 265 106 229 74 195 279 -112 -339
6836 -339 259 103 133 -203 -23 26 -73 111 131 16 227 126 132 30 121 -48 166 85 234 -74 6 273 -26
6859 -26 181 286 -166 132 -29 -151 -158 -103 -140 -143 -200 56 5 -102 -46 -53 109 -173 -301 -8 -210 -189 -142 -103 -9
6884 -9 -34 -118 -121 58 -180 -134 -432 -221 -257 -270 -46 -24 114 107 49 -182 67 -176 -89 -201 -139 -46 -125 -107 -247 228
6910B28j23r8J4K10l24m1J50j73J7J23J04n4J57K4J78k83J57k26J38p6k93J96
6932Eq0M2L12j37j58J60J84j10m4j46j00J92k09p8K51j33L68j80j47p5M28k97
6954D8q6qj94J9N8O5L61k24K23j99J60n60L27J00j93j62K59p0k6l2O7J64M5m7
6978I5n6l25L78j88j21Q4k66K27J94k6J6j02R9L5k14N37n77K35k34J92j10K50
7000A23j8j33p0L65j60J7k20j10J4J68J3oK55j88Q7P1r3O8k12j98qK00J7l27J30
7025b15Q0j53K26j99K62j40J95J33k56p5j58J11N8lJ22n1k7J8K5J67K3l44J70
7048c1M5k36J28L0J21J24K0P7l7j68NK8j06J16j30K74o7j90K80j68M3j29J7Q4
7072A30J86k66J53o8j00P9l9p9j07K02Q4o4M7j7k5k67L16l00J25MJ44j04j18Q7
$$ plain form
6910 228 105 7 21 231 -93 -134 16 -157 -140 -17 87 33 190 214 392 109 266 40 178 102 -191 5
6932 5 -75 -33 279 142 -16 144 328 218 174 28 -72 120 -89 -167 84 -49 319 139 -8 -83 345 48
6954 48 -38 -46 -240 -221 -163 -98 263 39 262 63 223 -337 -10 90 -103 -265 -6 -76 -102 -134 -67 97 142 95
6978 95 39 -286 92 -96 -217 -133 -399 -172 22 -4 12 -90 9 44 -170 367 -210 25 -209 -17 -127 123
7000 123 105 -28 -98 267 107 124 -96 -206 -192 -24 -11 -17 238 50 137 208 115 183 -29 -227 -235 -35 -18 -345 -215
7025 -215 -135 -288 -62 -261 1 -139 56 189 -67 -142 -300 -189 -131 -134 -12 -63 -90 -72 -47 120 143 -201 -31
7048 -31 14 -222 -94 -64 57 181 201 278 241 73 78 106 0 116 -14 260 193 3 283 115 158 29 46 130
7072 130 316 50 203 135 35 114 75 -4 -111 91 175 111 158 141 116 -151 165 -135 -10 -6 138 34 -84 3
7096Ck09JK61l8j91Q2j78M01k50q1Q3P1j5j09K53k52K08L0m13K56O7j09k11J54
7120a86J67p8j72J18j18K88l79J74QJ07J74l18J07K10P8l69J31j83M10l34L16
7141A51o8P2k21J08r9OP3j27K28J15k83J89O2k18Q5Q8Pr0Kr0L4J9K31j94j08p6
7167a04P7OK50K1k75K52l2j52J79k38O8L62k83j87J27j96O0Q0n7J1n8j60J52L82
7191B85Rq5j66j91J94r6p2N2K63l16J67J45j13l26K49l9J4l22M80k63K56j8j42
7214c5K50l12J21M2j29K3j83K9l7J90J04p0K04j79lj29j5j32R4J14j51J86J39
7237A21j29N0r9p4L18k35Q5L3o5j30Jm9Q0O8Qk63P2L99m66k4J36J4o8L08k40J24
7263b5K57m55j8J26RJ89k80m9K16j7J32l36K18J9k60J40J03O9j19MLp7J33K39
$$ plain form
7096 3 -206 -205 56 18 -173 -91 -269 132 -118 -199 -116 -45 -60 -169 84 -168 40 70 -343 -87 -20 -129 -340 -186
7120 -186 -19 -97 -269 -151 -269 19 -360 -186 -178 -71 103 -215 -108 102 180 -189 -58 -241 169 -165 151
7141 151 83 155 -66 42 -57 -51 22 -105 123 238 -45 144 206 -12 73 161 168 78 80 -10 24 43 274 80 -28 -104
7167 -104 -27 -21 229 250 -25 227 195 43 222 -16 52 414 131 -56 71 -125 -65 15 -42 -31 -89 -249 -97 285
7191 285 294 209 43 -148 46 -50 -122 -70 193 -123 44 189 76 -250 -1 -40 -26 -348 132 -131 125 107 -35
7214 -35 215 -97 24 66 -63 -40 -223 -194 -231 -41 63 -7 197 18 15 -114 -129 -261 -167 -53 -204 -18 121
7237 121 -8 42 -57 -131 187 -48 37 70 5 -125 -124 -173 -93 -25 -17 -280 -208 191 -275 -299 -163 -149 -217 91 -149 -25
7263 -25 232 -223 -241 -115 -106 83 -197 -246 -30 -47 85 -251 -33 -14 -274 -134 -31 38 -81 -77 -74 -151 -18 221
7287B21j27k0N1J05k92K75j85K13l53L47j78n1r5L7K29M0p5j11L02k1l95J77p8
7310A6J97k47K9P4j13K06o4j10K2J34j22jj27M6j73K66n6j4J97K9j69m3Mk98N8
7335b59K72j46PJ39k61J42j23J57K5j43N1R4k72K25j80O9J33k19J36l7K25J03
7357A38j29k63M29k94R8J41j49J35k7j71J27o1JM8O3j77K21O3j21j75L16j24O8
7380A57j5o0N1L1l34K79M0j69K95j76J54j53Rj95J44Q7j46L5L26k64j46J78N3
7403A81n37M44K4k25K58k29j0K66j94n1J65k46J10j1J10l1m2J75l03L59j18K5
7425A20k62K09l82L64M5k1J13n6j36j08K55R1p4k19J18O6k39L44Q1l59J62k68
7447a56J98k6j78R3k29L85J30l02R4K70n05K80N2q7j91L33k32j12K63j1l37L29
$$ plain form
7287 221 94 74 125 230 -62 213 28 241 -112 235 57 6 -89 -52 177 217 142 31 333 312 -83 94 16
7310 16 213 -34 -5 69 -44 162 98 -12 10 144 22 21 -106 -60 -233 33 -23 -37 160 189 20 -23 -19 -317 -259
7335 -259 13 -133 -126 13 -248 -106 -229 -72 -47 -190 -139 -45 -317 -92 -272 -203 -70 -289 -153 -190 35 138
7357 138 9 -254 175 -119 -21 120 -29 106 79 -92 35 -26 -25 23 86 -91 130 193 72 -103 213 89 157
7380 157 142 82 133 164 -170 109 149 -20 275 99 253 100 109 -86 58 145 -1 34 360 96 -50 128 181
7403 181 -356 88 112 -113 145 -84 -94 172 -22 -73 92 -154 -44 -55 55 24 -18 157 -146 213 95 120
7425 120 -142 67 -315 49 94 73 186 130 -6 -114 141 232 158 -61 57 123 -116 228 309 -50 112 -156
7447 -156 42 16 -162 -69 -298 87 217 -85 9 279 -226 54 106 19 -172 161 -71 -183 80 69 -268 61
7469F1m6k61j12J6J91q1L23k10j24P9M16m53l4L67J03k42p1O0k02K72j29J78l1
7492G0k00K26q0m0L2J57k45nJ4j22J15j79L53k62K23L8M6j55L1j73j6J90k0J32
7516A30p6j2P4J34l31M45k94Q0k94K28k9L24l08l6K03l8k97P2J45QJ61k11j39
7539f1J16K46l76K76k47j85K61j0J00j33J70j50j8j48J03J11k6l1J27j39rP7j43
7562h9K29j5n7Q4l40j04K18J72k78J04k2J66K8l99L03J21k25J22k63J17n7O3J36
7585A4J48l01P8Mq8J06j64L48l47J38j7J71l81K86K8J02q9kk3l6J76N3j94Pp5
7610e8J98k6k14J2n0N6j6J5J02j58L18k14L1k3n4J24j59K77j42K15k73o3j01J11
7634i2J78j29k07L51m33L93j29N4R7R1p4L3l69J44J93J75k27K9k40K8J38Lj07
$$ plain form
7469 61 15 -246 -358 -342 -151 -232 91 -119 -243 -164 252 -201 -235 132 235 -7 -78 -18 -220 52 -77 101 70
7492 70 -130 96 16 -24 8 165 -80 -85 -71 -193 -78 -257 96 -166 57 95 141 -14 17 -156 -172 18 -2 130
7516 130 54 42 116 250 -81 364 70 150 -144 84 55 379 71 35 238 200 -97 -25 120 128 289 78 -61
7539 -61 55 301 -75 201 -46 -231 30 20 120 -13 157 7 -11 -159 -56 55 29 -2 125 -14 -23 54 -89
7562 -89 140 125 68 152 -188 -292 -74 98 -180 -76 -98 68 96 -303 0 121 -104 18 -245 -128 -185 -122 14
7585 14 162 -139 -61 -57 -145 -39 -203 145 -202 -64 -81 90 -291 -5 23 125 36 34 11 -25 151 204 10 17 -58
7610 -58 140 114 -100 -88 -138 -82 -98 -83 19 -139 179 -35 -4 -27 -81 43 -116 161 19 234 -39 -102 -203 -92
7634 -92 86 -43 -250 101 -332 61 -68 -14 83 174 100 133 -236 -92 101 276 49 78 -162 -134 4 7 -100
7657a00J98n2l1l09K95J32m01N82l9n2n1O5m8l28J17M7rN0p8L7J28N8l69M76k33
7682H5J91l85J0P8K68r3k91p5M5L18k26J74j24M0j65J77k35M14m48j63M18j40
7704a27J93k2L8j76q4O6P9k90K55j56O9K93l70J66K19j27k34K71k39M4J27j23
7726a28J62j72o6J58J6j62L90j99j63j7K86j64N6j49K54J06k38P0J49Q7k67j11
7748a02R3J36J49l43n2J50J7k9J94J93m59L28k38O7j24J59P0j87J05j29J78j91
7770a5K02m2J02j47L3j54n3J12j28K68p1J96k64o0j7j17L24j98N7J54m50L55k91
7793b04o6K58Lj07m2n8K31j74L53j61o8j10Q0J44k38r8K79j4j19N3L0N7o1j09
7817a41k5R6J09j03k1j68K92q6Q%L05l64L42j92M3k17J1m6kK68n0k20Q6J86m59
$$ plain form
7657 -100 98 46 15 -294 1 133 -268 314 275 223 172 237 189 -139 -22 25 16 66 -12 25 153 211 -158 318 85
7682 85 276 -109 -99 -21 247 154 -137 -212 -167 151 -75 99 -25 15 -150 27 -208 206 -242 -405 13 -127
7704 -127 66 44 82 -94 -178 -112 -33 -323 -68 -224 -155 138 -232 -66 153 26 -208 63 -176 -132 -5 -128
7726 -128 34 -138 -204 -46 -30 -192 198 -1 -164 -181 105 -59 -3 -152 102 208 -30 40 189 276 9 -102
7748 -102 -9 127 276 -67 -119 31 48 19 213 406 -53 275 37 104 -20 139 209 22 127 -2 176 -15
7770 -15 187 145 247 100 133 -21 -74 38 -90 178 107 303 39 -21 -38 -155 169 -29 28 182 -268 87 -204
7793 -204 -270 -12 -9 -116 -158 -216 15 -159 194 33 -35 -145 -65 79 -159 -257 22 8 -111 -58 -28 29 -32 -141
7817 -141 -166 -70 39 -64 -85 -253 39 -47 -39 -39 266 -98 244 52 95 -122 -111 -157 -159 109 59 -161 -75 111 -348
7842c48K42pM9j82K66J12j21p2j62K95j29p0p6J83k8o6j36J93M2k27P5J43J79
7865A55q9k45K69k6j02j15J69p6k5J04L7q8J38k14JL2J23p6K21l39K83J5j16M3
7889G9J76k22K99l35K00ql57L80j94L4O0j55j29K08J17L4k02Qn9K01j82R7Q6K3
7913A59P0l39N0l0k35J82N2n1jJ0P1j55J43J79k01J17p7k8N6O0p6o6j75K69k1
7938c7j43p3Q5J48M9k07L3J21j61M0n5k40J46M40j88J12j66J16k46K03k51J62
7960a12k01K67RP3Rj98L41k15K92l49L78k50k42J84L5j07K03k16loJ84n7J50j26
7984D3J29k60k2J73L3R7k49K08m5j74J51j77K24j58Q9K51m45J05M15k25p4J05
8006A94j20j55K46j21k3J19l01J79m61M56k30J8M71k51j02M3j07J31J20j67J07
$$ plain form
7842 -348 -106 -113 -64 -246 20 132 11 -61 -223 72 -57 -127 -203 -20 -48 -114 -250 -57 -15 -242 -167 -24 155
7865 155 66 -179 90 64 -38 -153 16 -60 -85 19 56 -32 106 -108 -107 -75 48 -28 193 -146 137 152 36 79
7889 79 255 33 332 -3 197 189 -168 212 18 52 112 -43 -172 36 153 187 -15 -7 -66 135 -47 50 136 159
7913 159 229 -110 -60 -90 -325 -143 -91 -142 -143 -133 -62 -217 -74 105 -96 21 -56 -84 -28 32 -44 -110 -285 -16 -37
7938 -37 -180 -253 -168 -20 29 -178 -145 -24 -185 -145 -200 -440 -294 146 -42 70 -96 20 -226 -23 -274 -112
7960 -112 -313 -46 -37 36 45 -153 188 -27 265 -84 294 44 -198 -14 21 -86 117 -99 -102 -108 76 19 169 43
7984 43 172 -88 -110 63 96 193 -56 152 107 -67 84 -93 131 -27 62 313 -132 -27 388 163 89 194
8006 194 74 -81 165 44 21 140 -161 18 -443 13 -217 -199 272 21 -81 -38 -145 -14 106 -61 46
8027D6JJ20n5j50J6J98n27K02oO2O2J20k16QP0j95M8K07k69L63j00j21LL11k39
8052d1n8J95j98J93M7j38j18J4K56k33L9K72l99N0p3K55j60O1j14J40j22o9J04
8075i7L00l56K63q3n0lN3k48J71N8K77m54N3J73k08O0j1o6K43q1K3j15J45J13
8099A60j55m71N22p3Rrj47L81l75J66Rn5J62j25j5K15r9J6j34J01j60J17r8L12
8123B54L8l66J86M9k23J46K59l75L4J02M0j61J75o3M9J38o4q6j40N2J18o5p7l5
8147a5L1o8m6N2M7P6r4l6j02N3L4j42R5n7J57L4k46J77R1j23J16n6k12L17j66
8172h3J5l4O3j10J28k05K20R2j17j46Q0N9p2K34J48l42Q1rJ39
$$ plain form
8027 46 47 167 112 -38 -22 176 -351 -149 -155 -93 -31 89 -127 -119 -49 -244 -196 11 -258 105 5 -116 -113 198 -41
8052 -41 -99 96 -102 91 138 0 -118 -104 152 -81 -42 230 -169 -119 -192 63 -97 -36 -150 -10 -132 -201 -97
8075 -97 203 -153 110 27 -23 -26 27 -221 -50 8 285 -169 -116 57 -151 -91 -102 -168 75 -6 17 -98 47 160
8099 160 5 -466 56 -17 -8 -17 -164 217 -158 8 17 -38 124 -1 -16 199 100 116 -18 83 -77 40 -58 254
8123 254 292 -74 112 161 -62 84 343 -32 2 104 144 -17 158 95 144 282 218 132 -8 44 162 97 20 -15
8147 -15 16 -52 -98 -46 1 77 -17 -53 -155 -102 -68 -210 -115 -172 -15 19 -227 -50 41 -82 34 -22 -234 83 -83
8172 -83 -68 -102 -39 -149 -21 -226 -6 86 -31 -177 -97 -38 -110 124 272 -70 11 2 141
8191A41
$$ Imaginary data points
##PAGE= N=2
##DATA TABLE= (X++(I..I)), XYDATA
0@%%%%%%%Qj6J6j6K4l2M0n0N8p2R6j20J44j76K08k42K84l35L92m55N27o08O98
30C73q00R11j034J173j326J494j678J880k102K342k607K900l217L563l941M353
46B284m804N300n842O433p083P802q600R487j0479J1597j2867J4322j6007J7990
60I533k0361K3252k6869L1547l7851M6840o0743Q5204j40300M71810l288p94696
72d15922O30492k39637k83250L80353J01308j32555n8405j0519O0337j60706J23730
83d774J69270p3980o9671p3646P863J38963j13460n4392R0947q2522K5344J45225
95A05167p8156K9812l0172j20045J60778p2031j32675K55575o5063j92552Q3628
106e5734O9484M3474q0097J6235J16444j90030J2788K08190j23979j40620O3465
$$ plain form
0 0 0 0 0 0 0 0 0 8 -8 8 -8 16 -16 24 -26 32 -40 56 -64 80 -96 112 -130 154 -181 211 -244 283 -325 373
30 373 -427 484 -550 623 -703 791 -887 993 -1109 1233 -1374 1526 -1691 1872 -2069 2284
46 2284 -2520 2780 -3062 3371 -3712 4090 -4510 4977 -5502 6095 -6772 7550 -8457 9533
60 9533 -10828 12424 -14445 17102 -20749 26091 -34652 50552 -89748 382062 378774 -415922
72 -415922 214570 -25067 -308317 72036 173344 40789 -17616 -28135 32202 -128504 -4774
83 -4774 164496 90516 20845 -52801 -44938 94025 -19435 -73827 17120 -65402 -40058 105167
95 105167 27011 56823 26651 -93394 67384 -4647 -137322 118253 53190 -139362 -55734
106 -55734 13750 57224 -22873 -6638 109806 -80224 -67436 140754 16775 -123845 -60380
117f0380J16699j00825j09306K78567Q636k60335J64563M6895k07241J12803J07056
128I7132j44057l8661Q9908J6049k0505j501k5186O385M6852N205n850K8714k9698
141B4787r4576j6742L1885L0668P3136L4187j9414r1676p3943J24702J8290q7896
153d6592J24106j523j50280J5108L0033k911J7873O1422M9516j03186l0585P4317
165C7298l7517k6549K1257J2849j2554m4356M4366K7763m3152N5560K1803q1870
177b5102J513L6383j6271J9724M960n5885N135J0231k8134N1700N4555j1677k4532
190B2600k4373j5793j9289K2419M1836l1652j9298J4438L755J2510p85J9434N46
203B6348m8639J5196L4466r109r933j5048k2720k9493K3709P8386J6479j7490
$$ plain form
117 -60380 56319 -44506 -153812 124755 133391 -126944 37619 84514 -122727 -9924 97132
128 97132 -46925 -85586 4322 20371 -134 -1635 -26821 -20436 26416 31621 25771 54485 24787
141 24787 -69789 -86531 -54646 -23978 49158 83345 63931 -27745 -101688 23014 41304 -46592
153 -46592 77514 75991 -74289 -59181 -29148 -32059 -14186 47236 96752 -6434 -37019 37298
165 37298 -219 -26768 -5511 7338 -5216 -49572 -5206 22557 -20595 34965 56768 -25102
177 -25102 -23589 12794 -3477 16247 21207 -34678 -29543 -19312 -47446 4254 58809 47132 22600
190 22600 -1773 -17566 -36855 -14436 27400 -4252 -23550 -9112 -5357 7153 6368 25802 26348
203 26348 -22291 -7095 27371 18262 8329 -6719 -29439 -58932 -35223 43163 59642 42152
215D2152p840m2115l4887J4439L9946J5514j2869m563j8115k3053J4400K3409
227F418J2554J1380j884r494l890j5041l1741j0325K0539J8661K1677K1571j9311
240B1114m0288l840J7308Q969K3242R403l9896m1502o335K7914L6788Q371n770
253A5478j5121k9932Q099L7956J5860j2287l4589l0740j3891J8284O0451K4269
265D3837k7282j8843k1446r216K6144K8737P818k6009l1344r496O799K9380J5462
278A4541j2794j370l445K951K8260M883l0883k7961j1730K673K5052M8335J2829
291E1341m7601k6188N986l860L0706M4251j5340l3144k2796k1729P697K7224K6131
304B2678R006j6122m416q99p311O945j2090q266K0035r045k822J8525k3848r098
$$ plain form
215 42152 34312 -7803 -42690 -28251 11695 27209 14340 9777 -8338 -31391 -16991 6418
227 6418 18972 30352 28468 18974 15084 43 -31698 -42023 -21484 -2823 18854 40425 21114
240 21114 -19174 -23014 -5706 3263 26505 35908 -3988 -45490 -51825 -23911 12877 21248 15478
253 15478 357 -29575 -21476 16480 32340 20053 -14536 -45276 -59167 -40883 19568 43837
265 43837 16555 -2288 -23734 -32950 -6806 21931 29749 3740 -27604 -37100 -30301 -921 14541
278 14541 1747 377 -3068 -117 28143 33026 2143 -25818 -37548 -34875 -9823 38512 51341
291 51341 3740 -22448 -16462 -20322 10384 54635 39295 6151 -16645 -38374 -30677 -3453 22678
304 22678 31684 15562 11146 10247 2936 9881 -2209 -10475 9560 515 -2307 16218 -7630 -16728
318a6728K0973M25J5805J0859j7394j1480k2116m281K4687L160K354p268j7194
331a8198J3753J2475J1047J4073l1225k4346J1032p609M414L0762M723k2581k1003
344b2683k107J5602J8867K3024n323l4817o522N76j0089J0582P499Q993J1688
357A5290j3735p316R300K340n393p135M545L31J532J1303j9805j7425J8578R005
371A415K999Q203J12J111m496j6024j6071J677K0026N361K360J0020k3846o614
385a3767K9234k4855j0985N2552o229l3881j573j6793M288K6431J0001l053k1750
398a0380O194J9091j9225Q20J2424o538m179k4753P03L7465J213n52o761l5173
412b9651J7716L0846j1038O36q884r915J1678j7850l378K6496K023K086j1572
$$ plain form
318 -16728 4245 4670 20475 31334 13940 2460 -19656 -23937 750 3910 6264 -1004 -18198
331 -18198 -4445 8030 19077 33150 1925 -22421 -11389 -18998 -14584 16178 20901 -1680 -22683
344 -22683 -24790 -9188 9679 32703 27380 -7437 -13959 -13383 -23472 -12890 -5391 3602 15290
357 15290 1555 -5761 3539 5879 486 -6649 -2104 -1773 -241 11062 -8743 -26168 -7590 1415
371 1415 4414 12617 12729 13840 9344 -6680 -22751 -21074 -1048 4313 6673 16693 -7153 -13767
385 -13767 15467 -9388 -20373 32179 25950 -7931 -9504 -26297 -22009 4422 14423 11370 -10380
398 -10380 -4186 14905 -4320 -3500 8924 2386 -1793 -26546 -25843 11622 12835 12283 5522 -29651
412 -29651 -11935 18911 7873 8509 -375 -10290 1388 -16462 -19840 6656 8679 10765 -807
425h07q827K7077l423j7475k295j5262J0032L0605R420k7497l0559L0749Q503
438A0241k9867M5410J5950n0782J0322K126l8081K5817M5268j4422l3339O12J4774
451D029O403J3479j0525l1596J1146J5106r921J4286R02j8213M647j6104l773
464b0134M0782J0815p686k5035m3497K6102L6725j2059L201o749j8937K218Q741
477e513J5388l512j931P593l6315j0158L9526J3681p142k4189j2728J2509J377
490a1414K3697J2729l6497p30J5182k1700K456K5984m798j0612L707r873q98K6528
504A3761l19k8039Q05J4148j113J2776J362l2941K618J9141o195J1822L464o694
518D596M337k2808l928K5310K659O76n723j3797k183J1718J8848j7265j1848K1470
$$ plain form
425 -807 -9634 17443 14020 -3455 -5750 -21012 -10980 19625 29045 1548 -29011 1738 10241
438 10241 -19626 25784 41734 -9048 1274 3400 -34681 -8864 36404 21982 -11357 -10745 4029
451 4029 10432 23911 13386 -18210 -7064 8042 -1879 12407 13309 -4904 -257 -16361 -20134
464 -20134 20648 31463 23777 -1258 -44755 -18653 18072 6013 9214 2465 -16472 -14254 -5513
477 -5513 9875 6363 4432 12025 -24290 -34448 5078 18759 11617 -12572 -25300 -12791 -11414
490 -11414 12283 25012 -11485 -12215 2967 -18733 -16277 9707 4909 -5703 -1996 -11869 -12767 13761
504 13761 13442 -14597 -13792 356 -757 12019 13381 -19560 -16942 2199 -3996 7826 11290 4596
518 4596 8933 -13875 -17803 7507 10166 10842 5119 -8678 -10861 857 19705 2440 -9408 12062
532A2062j2952l169J8871j4990O72O671j5952N604J0150J370L630j2419q337R553
546G64Q18L209P241j3273p047J3721r26j0448P937Q740j6138p30J7269j7050j463
561g376K5804k1268r534K0173j0346O66P097j1417N876N944n331n577j343N704
575i28l40Q765N95j6565P721j600j0913J9118O90o926Q119j6853n602J9682K794
590G757l436M58n770p530J517J2686K046r599J527j607p840J1927J1534q372n901
605f03m972n2M853J381R777p489j5791R070k272P086J7379j7019n725J215j0178
620a3340J4447N616n233q23j3034K734N763M728J3998j2749j0500K398m188J4372
634D189J620j3631P569r733q091K5183L076q939K802j1176o222J0789J0493K934
$$ plain form
532 12062 -890 -4059 14812 -178 494 7165 -8787 -3183 6967 8337 11967 -452 -8789 764
546 764 1582 4791 12032 -1241 -8288 5433 4507 -5941 1996 10736 -5402 -6132 11137 -5913 -7376
561 -7376 18428 -2840 -12374 7799 -2547 -1881 5216 -6201 -325 5619 288 -5289 -6632 -928
575 -928 -1268 7497 8092 -8473 -752 -2352 -13265 5853 6543 -383 7736 -9117 -14719 4963 7757
590 7757 4321 4779 -991 -8521 -7004 5682 7728 -1871 -344 -1951 -9791 2136 13670 5298 -603
605 -603 -5575 -5627 -774 607 10384 2895 -12896 -3826 -6098 988 18367 1348 -4377 -3162 -13340
620 -13340 1107 6723 1490 667 -12367 -9633 -3870 858 14856 2107 -8393 -5995 -10183 4189
634 4189 5809 -7822 -253 -9986 -18077 7106 10182 1243 4045 -7131 -13353 -2564 7929 10863
648A0863j4148o830K589n625J5591J5126j2035r96p049r827J7311M544n675j23
662C716j0696j770O724R755Q940j1554m637N20p836J3221J2204j0747q643q121
676h924J54R837M492R828l90j6041j514L572J136Q361l247r701m966J22J0602
691C321M176k878q76n514K735J772l035J2233o999j9059N947q5N10J7167j227
706H188q531l897o92P706j854j897J375q814k11K799j90P399k228k923L951m710
722d529L463R583m549r485q342P31R802O13J412N001m073J49K257m861K221M003
738C396k023l803p150K190J0208j650o659J078J0316M533o302K318m005j1149
752h702Q401j552j1092J3028Q504l811j260n409J639O630Jl847l159L416p53r582
$$ plain form
648 10863 -3285 -10115 -7526 -13151 2440 17566 5531 4535 -2514 -12341 4970 9514 3839 3716
662 3716 -6980 -8750 -2026 7729 16669 5115 478 998 -6838 6383 18587 7840 -803 -8924
676 -8924 -8770 1067 5559 15387 14997 -1044 -2558 1014 2150 10511 7264 -2437 -7403 -7281 3321
691 3321 7497 4619 3743 -1771 964 2736 -299 11934 4935 -14124 -8177 -8262 -7752 9415 8188
706 8188 -343 -4240 -4932 2774 920 -977 398 -8416 -8627 -5828 -6018 1381 -847 -3770 181 -4529
722 -4529 -1066 8517 3968 -5517 -13859 -13128 -3326 -2713 -1301 3700 -373 -224 2033 -2828 -607 3396
738 3396 1373 -2430 -9580 -7390 2818 1168 -5491 -4413 5903 10436 4134 6452 2447 -8702
752 -8702 -301 -1853 -12945 83 8587 4776 3516 -1893 -254 6376 6377 2530 -629 2787 2034 -7548
768g548N34K235R83J3919L287j1488m05M300j313q134o593Q713K597n709P744
783C122k545o868J3609J715j3903L540J0092L79p545j0813m781N219R757L021
797C999l801O153M429q201l451r80j888Q246n12j3738j234J2103P382o107p052
812d652N529O108O69J924m607q092k803j110j801N90J2273J2365q387j0968J827
827a135L553L266J01o006n993q29P048Q64p095L211O411k296K120L774j401J930
843G523n845j8015m218J4487R754j2Q78n418q289J0022Q447j4534K745J1404j5237
858f308p243P962k622L914N333o642N74R749R035k700j4769q642K18L215M692
873d234L667M281j982n541K505k583M861J3926p715j0758J784o141J115Q960p880
$$ plain form
768 -7548 -7014 -4779 -3796 10123 13410 1922 1517 5817 4504 -3630 -10223 -1510 1087 -4622 3122
783 3122 577 -6291 7318 9033 -4870 -1330 8762 9141 1596 -9217 -13998 -8779 978 3999
797 3999 198 6351 10780 2579 -872 -1852 -3740 4506 3994 -9744 -10978 1125 8507 2400 -4652
812 -4652 877 6985 7654 9578 4971 -3121 -5924 -7034 -8835 -8245 4028 16393 8006 -2962 -1135
827 -1135 2418 5684 5785 -221 -6214 -7043 5 869 -6226 -3015 3396 1100 3220 6994 5593 7523
843 7523 1678 -16337 -20555 -6068 3686 3674 4552 -866 -9155 867 9314 -5220 -2475 8929 -6308
858 -6308 -13551 -5589 -8211 -4297 1036 -5606 -5032 4717 13752 11052 -3717 -12359 -12141 -8926 -4234
873 -4234 -567 3714 1732 -3809 -1304 -3887 974 14900 7185 -3573 -1789 -7930 -6815 2145 -5735
888e735k147J2236L329J953M099o365r055k177n31j622O336Q668l914o969k305
903d199J897J0578M333l025O12q803m213M991r280k771J1355N06l51O650K794
918A1074j306m530o854m859L605N217n66k18n831m784P931J440M01J0165m65p083
934C337j939o053n085J897k87J243O364K658O28M031k397r756J848N012n481K659
950a321L380j0590q40M031l075O909O872J040M742p043p755J687o323k391M166
965f511K316O557O13n23J160o305M705K479m650N460l868n030J045r846M990R328
981A920m349J0110N316o793K351p874r085L469j287K477N684j25O0l153l16L043
997A448J29O747j72q276J544m729q078M928o29K832J0014j643M081K558r790k489
$$ plain form
888 -5735 -7882 4354 7683 9636 13735 7370 -1685 -3862 -4393 -6015 321 8989 5075 -1894 -4199
903 -4199 -2302 8276 12609 9584 10196 1393 -2820 2171 -7109 -9880 1475 1981 1630 8280 11074
918 11074 9768 5238 -1616 -6475 -2870 2347 1781 1563 -4268 -9052 -1121 319 720 10885 10420 3337
934 3337 1398 -4655 -9740 -7843 -8130 -6887 -523 2135 2763 6794 4397 -5359 -3511 1501 -3980 -1321
950 -1321 2059 -8531 -9371 -5340 -8415 -1506 5366 6406 11148 4105 -3650 -1963 -8286 -10677 -6511
965 -6511 -4195 2362 2975 2452 3612 -2693 2012 4491 -159 5301 1433 -3597 -2552 -12398 -7408 1920
981 1920 -2429 7681 12997 6204 8555 681 -8404 -4935 -6222 -3745 1939 1814 1874 -1279 -1595 1448
997 1448 1577 8324 8152 -124 1420 -3309 -11387 -6459 -7088 -4256 5758 4115 8196 10754 964 -1525
1013a525l576k770O324L51J802j65n483K596o93L197R687k068K9l237r753J696
1029c588k657l121O007J954O208M615m136L524n070q496M442K55j074N027q16
1044C074o306m449M019N808L96Q865L305j1418l97j775j0752L403L248k863P456
1059A614M657j983K74q9k502o335L766O552p139K014J66j5712M508R907k737P252
1075D213N447k011l688p101k482k061j070N270k423J847P855l741M25j077o097
1090f694Q492K315n344K843m235o590j054j044M987P648O224L063p731k806j34
1105f0o443K413J51l643Q350K294n157R09O81M82K767L530%m150L460l919j5082
1122a3417L393P898J007Q787K549n047J204j053m513n203J366Q331j829n073J458
$$ plain form
1013 -1525 -5101 -7871 -1547 -1196 606 441 -5042 -2446 -3139 58 9745 7677 7706 4469 -5284 -3588
1029 -3588 -6245 -9366 -3359 -1405 4803 9418 5282 8806 3736 -4760 -318 -63 -1137 3890 3074
1044 3074 -3232 -7681 -3662 2146 2542 11407 14712 3294 2897 1122 -9630 -6227 -2979 -5842 1614
1059 1614 6271 4288 4562 4473 1971 -4364 -598 5954 -1185 829 995 -14717 -10209 -302 -3039 4213
1075 4213 9660 7649 3961 -3140 -5622 -7683 -8753 -3483 -5906 -4059 3796 55 480 -597 -6694
1090 -6694 1798 4113 -1231 1612 -2623 -9213 -10267 -11311 -6324 1324 7548 10611 2880 74 -60
1105 -60 -6503 -4090 -3939 -7582 768 3062 -2095 -1186 -505 -23 2744 6274 6274 2124 5584 1665 -13417
1122 -13417 -10024 -2126 -1119 7668 10217 5170 6374 5321 808 -4395 -3029 5302 3473 -1600 -142
1137a42k698K648L859l733M387N578n08j299j0691o161N641k702J987N444o94
1152I16P901m07q899N51j051J550K398n736J753l62l025L613n662j536J3641K102
1168G747k778K011o074m602j912k343p67K338R386M829p890k134K651q42J371
1183I91q72o80K876q16m413n174k765O618Q320kr72M160K34o708n932k851J280
1200f706O752K365l763J576R86j170L91j581J305N775J686n807q268L60K222l701
1216g578L742P844j152L669K077q448n002J507K904j418l203L822K239l198J316
1231h79j008j065N414K342m00j803m406M19j981o467J914O300N228L668l120k559
1247A597J56l985m08J377p83L974K073m582m920L84N956K513o31M173J582m472
$$ plain form
1137 -142 -2840 -192 3667 -66 4321 9899 9391 8092 -2599 -8760 -3119 -5821 -3834 1610 916
1152 916 8817 8410 -489 62 -989 561 2959 -2777 -1024 -1386 -4411 -798 -6460 -7996 5645 7747
1168 7747 4969 6980 906 -3696 -5608 -7951 -8718 -6380 3006 7835 -55 -2189 462 -380 991
1183 991 119 -561 2315 1499 -2914 -8088 -10853 -4235 4085 4083 3111 7271 7505 797 -5135 -7986 -6706
1200 -6706 46 2411 -1352 224 1210 40 431 -1150 155 5930 7616 1809 -6459 -6099 -3877 -7578
1216 -7578 -3836 4008 2856 6525 8602 154 -4848 -3341 -437 -1855 -5058 -1236 1003 -2195 -879
1231 -879 -1887 -2952 2462 4804 4404 2601 -1805 -1386 -3367 -9834 -7920 -1620 3608 7276 4156 1597
1247 1597 1753 -2232 -2640 -1263 -2046 1928 4001 -581 -5501 -5117 839 3352 2721 6894 8476 4004
1263D004l729l711k368J821L681M459j32j103L164j583n642J814K119j029J809
1278C574p90l426j360o79K61K355K586L188K686j458n567m424m03m30O03K543
1294g41K457M96J1j951k243P96J886J700j37l550j047J099m459j965M523J790
1310a335J733L474n79k198j645k470k829j470L197M248j79m24k63k465r48K065
1326b088K410J786J930k809m494k232j046L79L533N309K453k138M51k420n122
1341d098K728P81j468M357J73l219K33j363Q45K631P73K211J366k982k194j409
1357f35k631M17K255J037K296K453m08l514n59P89l120K247L485m390J937J124
1373B783q030K260N165j915L291K142l583q98j024k884k87J865k44m5L188K38
$$ plain form
1263 4004 275 -3436 -5804 -3983 -302 4157 4025 2922 6086 4503 -1139 675 2794 1765 3574
1278 3574 2784 -642 -2002 -2681 -2420 -65 2521 5709 8395 6937 1370 -3054 -3457 -3887 -3284 -741
1294 -741 1716 2212 2223 272 -1971 -1175 711 2411 2274 -1276 -2323 -1224 -5683 -7648 -3125 -1335
1310 -1335 398 3872 3293 1095 -550 -3020 -5849 -7319 -4122 126 -53 -477 -740 -3205 -4153 -2088
1326 -2088 322 2108 4038 1229 -3265 -5497 -6543 -6164 -2631 2678 5131 2993 3444 1024 -4098
1341 -4098 -1370 -589 -2057 2300 2473 -746 -513 -1876 -1031 1600 2373 4584 5950 2968 774 -635
1357 -635 -3266 -2849 -594 443 2739 5192 4784 1270 711 1500 -1620 627 4112 -278 1659 2783
1373 2783 -5247 -2987 2178 263 3554 5696 2113 1215 191 -2693 -2980 -1115 -1359 -1404 1784 2022
1389B022j010K297m293k597M147j521P82M528l477l307k64k900K200N331K372
1404D310N41j729k434l564k728L318J914M00L686k083l055J531j496qJ446K310
1420B359K703m808j542J731o037K757M594l807M849L052o388P94J75l096K310
1435c54j0p81P68P31J003k574m97J652k499K662K614k718J069j416l372Q86j683
1452d519K343N048j860l53n89l219J928N75r82J57m8K961j288l087K008O4j256
1469b117R83l27K433K203j087k985m258J673L362n18L396Q02k811J198l246l825
1485e124N146L396n09k1j979j399o27P90J748j310K582L343m055k213M16k42K268
1502B210l08q01J381p95J555j188l524K575M40l09J416l572K248L153l675j611
$$ plain form
1389 2022 1012 3309 -984 -3581 566 -955 -173 4355 878 -2429 -2693 -5593 -3393 1938 4310
1404 4310 4851 3122 688 -2876 -5604 -2286 -372 28 3714 1631 -1424 107 -1389 -1397 49 2359
1420 2359 5062 254 -1288 443 -5594 -2837 1757 -2050 2799 5851 -537 257 432 -2664 -354
1435 -354 -364 -1145 -377 354 1357 -1217 -1714 -62 -2561 101 2715 -3 1066 -350 -3722 -2836 -4519
1452 -4519 -2176 2872 1012 659 70 -3149 -1221 -646 -1628 -1471 -1519 1442 154 -2933 -925 -861 -2117
1469 -2117 -1134 -1461 972 3175 2088 -897 -5155 -3482 -120 -638 2758 3560 749 1947 -1299 -5124
1485 -5124 22 3418 2909 2888 909 -490 -1117 -327 1421 111 2693 6036 1981 -232 184 -58 2210
1502 2210 1902 1101 2482 1687 3242 2054 -1470 1105 1545 1236 2652 -920 1328 4481 806 -805
1518h05j138P27L818m21j158r05k82J222k916j367L046R07K775k754o148M858
1534e41J246m254L113j552l07N418l743k386J062o77K703j833k096M365l55o88
1550e25r49m332L897J800j130K630k040m4J880m340N28k76O26O272k706l873L659
1567A077k859n7L972l108J466L297l230j886j751O42M702N38j614j513J104K170
1583B950k753k3J227k090K331j338l506M810J511j821l27k587J549L576j166j526
1599H17j379l23O47r47K92J518J083P06j735q81O09M10O30k497j895K991k28j61
1617c43K027k753m47L877j864m65K200j963p48N59l119K61L411J223j590P67O61
1634A694j757K227k81m862L618J725m097K240o70j877L257M3j74J338j1M86m070
$$ plain form
1518 -805 -1943 -1216 2602 2181 1023 118 -164 1058 -1858 -3225 -179 728 3503 749 -5399 -541
1534 -541 705 -3549 -436 -1988 -2295 3123 -620 -3006 -1944 -2621 82 -1751 -3847 518 163 -525
1550 -525 -1474 -5806 -1909 -109 -1239 1391 -649 -693 1187 -3153 -2625 -2901 -2275 3997 1291 -2582 1077
1567 1077 -1782 -1839 2133 -975 491 3788 558 -1328 -3079 -2437 2265 2803 1189 -324 780 2950
1583 2950 197 174 1401 -689 1642 304 -3202 1608 3119 1298 971 -1616 -67 3509 2343 817
1599 817 -562 -885 -238 -1185 -893 625 1708 2414 679 -202 407 817 1447 -1050 -2945 46 -182 -343
1617 -343 1684 -1069 -1516 2361 497 32 2232 269 -479 80 -3039 -2778 633 1856 266 1033 1694
1634 1694 -63 2164 1883 -2979 639 2364 -1733 507 -163 -2040 1217 1260 1086 2424 2413 2899 -1171
1651a171j313K585q92J530L45k856J464O76M92J554r86P58j839l698K677l50j524
1668b548M161k235k666L572j70J74K650k827j178m9j658N37k42j99J908k81K35
1685h16r9J286J723l000k96P99l577J696J860l534J748K365r40M51J020Q84j006
1702E64r48P1j378m96J556j538K25K346P99L04K90M07N1j803N15o29k589K476
1720B23L40k649L426J955k102J087Q32n60m4l45n65k555m50J654j396J633L312
1737C796j092o5L11j399L46q45j251J017j080r37K88L31R74J341J62L78J85j011
1755A449j389j965p05P14m50R80J104k18R19O18p63L79k80r32j033q72M08m70
1773b506q98J092J101J45K332J127p45j010p10k726j147J891K06k3J069J74K75
$$ plain form
1651 -1171 -2484 101 -791 739 1084 -1772 -308 368 860 2414 1428 2186 347 -3351 -674 -1024 -2548
1668 -2548 1613 -622 -3288 284 114 288 2938 111 -1067 -1116 -2774 -2237 -2479 -2678 -770 -1051 -816
1685 -816 -915 371 2094 -906 -1202 -403 -3980 -2284 -424 -3958 -2210 155 -785 -334 686 1570 564
1702 564 -384 -313 -1691 -2187 -631 -2169 -1944 402 1201 1505 1795 2202 2253 450 965 336 -2253 223
1720 223 563 -2086 1340 3295 1193 2280 3112 2552 2508 2163 1598 -957 -1407 247 -1149 484 3796
1737 3796 2704 2639 2950 1551 1897 1052 -199 818 -262 -1199 -911 -580 394 1735 1897 2275 2460 1449
1755 1449 60 -1905 -2610 -1896 -2346 -1366 -262 -480 439 1057 294 673 393 -539 -1572 -2444 -2036 -2506
1773 -2506 -3404 -2312 -1211 -1066 1266 2393 1648 638 -72 -2798 -3945 -2054 -1848 -1871 -802 -628 -353
1790c53P56N89M13K50q07j414p51k54m74L8k91J222K307J194M31Kr01j348k449
1809a840n26J240P62N24j165j4J560K22Q57O66l95N67j216k463n53j298K67K036
1827g69n62J616L108L14j936j280m92j363o3J862j486j785J424J058j199J813
1843B60K710p08K85R6l086j265O67j478r28J161K178K405J021p05j749O92K56
1860A812j656o46O38P03j538j993J027N99K815L248j810o22P84r31k709k897P73
1877b403K041n75J991L93m92K166j180j376Q10j345K109o3n183l35J636j062J817
1894a051K412L73J165N60j239l867j381J015q89K06J110o78K478N66k762J105
1910h77J550N34P14k128k067j056j026J114j209K26O385J376k333K6p02j179j238
$$ plain form
1790 -353 403 992 1405 1655 848 -566 -1317 -1571 -2045 -2007 -2298 -1076 1231 2425 2856 2858 1957 609 -1840
1809 -1840 -2366 -1126 -364 160 -1005 -1019 541 763 1620 2286 1891 2458 1242 -1221 -1774 -3072 -2805 -769
1827 -769 -1331 285 3393 3707 1771 491 -1 -1364 -1427 435 -1051 -2836 -1412 -354 -1553 260
1843 260 2970 2262 2547 2643 -443 -1708 -1041 -2519 -3447 -2286 -108 2297 3318 2613 864 1556 1812
1860 1812 156 -490 148 851 -687 -2680 -1653 -1054 1761 5009 3199 2577 3361 2430 -279 -3176 -2403
1877 -2403 -362 -937 1054 1447 955 3121 1941 565 1375 30 2139 2076 -3107 -3442 -1806 -2868 -1051
1894 -1051 1361 1734 2899 3459 2220 -1647 -3028 -2013 -2902 -2696 -1586 -2264 214 780 -1982 -877
1910 -877 673 1207 1921 -207 -2274 -3330 -4356 -3242 -4451 -4225 2160 3536 1203 1229 527 -652 -1890
1927a890p39j10k1L140q2l340J424K243K75K196p27j349J868k759l458K47m53
1944c535K132K438J011J243o55R15p53l550M79J460n51R14j995j195J167J45J904
1961A574J501J44J907n14k891k193k370J237N49j015K456K031K30P85j493j889
1977D9J00J374K5k206p4j70k322O4J368J044M019J475k881J53j664k347m85j512
1995c990O86K141P34J467o67q03J785j783N70J222q93J29k147k263jm96K890L144
2013A725J70J895j078j849k35k820m97P74L4J771j00r00J864l85p30J776K43R66
2031B624J73k681k499j766K43J845O66L305K214j759R6j950j827J078j247L63
2047a122P19j679J640j09k106K671O61M70K412j569m22j980l395r2j9J120L427
$$ plain form
1927 -1890 -2629 -2739 -2760 380 298 -3042 -1618 625 900 3096 2369 1020 2888 129 -3329 -3082 -3535
1944 -3535 -1403 1035 2046 3289 2634 3549 2796 -754 -275 1185 634 1548 -447 -1642 -475 -330 1574
1961 1574 3075 3219 5126 4612 1721 -472 -2842 -1605 -1056 -2071 385 2416 2646 3431 1938 49
1977 49 149 1523 1548 -658 -732 -902 -3224 -3160 -1792 -748 3271 4746 1865 2018 354 -1993 -2478 -3990
1995 -3990 -3304 -1163 -429 1038 371 -432 1353 -430 140 1362 469 598 -1549 -3812 -3813 -4309 -1419 1725
2013 1725 1895 3790 2712 863 628 -2192 -2689 -1915 -1881 -110 -210 -1110 754 369 -361 1415 1658 2624
2031 2624 2797 116 -2383 -4149 -3906 -2061 -1395 1910 4124 2365 2461 511 -1316 -238 -1485 -1122
2047 -1122 -403 -2082 -442 -551 -2657 14 675 1145 3557 1988 1566 -414 -3809 -3901 -3920 -2800 627
2064F27L87J762K00k567k1o59m72J210p40j26k93j446N21j85M31L889R94l93N66
2083C685k240k388j332j276J723J567J146J608l93j10k32j223Q36L09Q10k15k935
2100f60K43q70j564K387J464J332L319j837j207n34l450m54m7k22K917K67j32
2117I52l14j044P25K29J11J500m49j200j540l223M85J076l00L907J580q61J265
2134B899k537k535P67j563J08J771o51Q88K15j803N22J112P84J296N67m71k246
2151h77j928j439q23K285K180Q73J926J6j555n90j023n15J021K62k70K81o28m21
2169a225jO31Q82K174J202p71n38j930k885k90J187J97K313J778m76L55r30j631
2187D2P57J84K35K47j034j54q65j046O06J18K795K314j041n09j413j549j236j458
$$ plain form
2064 627 1014 2776 2976 409 388 -271 -743 467 -273 -399 -692 -2138 -1617 -1802 -1371 2518 3512 3119 3685
2083 3685 1445 -943 -2275 -3551 -1828 -261 885 2493 2100 1990 1758 535 1371 1680 2490 2275 -660
2100 -660 -417 -1287 -2851 -464 1000 2332 5651 3814 2607 2073 -1377 -1831 -1878 -2100 817 1084 952
2117 952 638 -406 319 548 659 2159 1710 510 -1030 -4253 -3768 -2692 -2992 915 2495 1634 2899
2134 2899 362 -2173 -1406 -2969 -2861 -1090 -1741 -853 -638 -2441 -1919 -807 -23 1273 1840 1369 -877
2151 -877 -2805 -4244 -5067 -2782 -602 271 2197 2213 658 68 -955 -1470 -449 -187 -457 -176 -804 -1225
2169 -1225 -1226 -595 287 2461 3663 2892 2354 424 -2461 -2751 -1564 -1367 946 2724 2248 2603 1673 42
2187 42 799 983 1218 1465 431 277 -588 -1634 -1028 -910 1885 4199 3158 2649 1236 -313 -1549 -3007
2205c007P14K478R32R97r54j561Q53N7l01M67N04j62j114j752j245P33J015J117
2223b29J737Q64j01l36j575k464q28J210Q41J005O03k18q54M05p87K5J891J548
2241B737n18j179k484j414M86J123K19J094K377N89p61j707j603l5O14l50m7J046
2259A87R83r86j471o15R54K438J002o45p22j062j447j367q07J349K069J655k47
2276A268p43qm21j103l99n5Q12J073j97j140j396l6O52J227J538J096l92j060
2294G16j582k105j57J375J379R25J02k86J70L93j165j036Q73J705j00p57n36r91
2312a077J00J01L09J630K520M35j663k020j320J11Q52J71K80J279M77q13n84n17
2330B71K03J284j97m88O30m48q56j696m23J003J127K027L59j082l64j423j278
$$ plain form
2205 -3007 -2293 185 1117 2114 1160 -401 452 509 208 675 1179 1017 -97 -1849 -3094 -2361 -1346 -229
2223 -229 1508 2372 2271 1935 360 -2104 -2932 -1722 -881 124 727 509 -345 60 -727 -702 1189 2737
2241 2737 2219 1040 -1444 -2858 -2372 -1249 -1030 64 2441 3030 2269 562 -1041 -1076 -462 -812 -859 187
2259 187 1170 184 -1287 -1902 -948 1490 2492 1847 1125 63 -1384 -2751 -3558 -2209 -140 1515 1268
2276 1268 525 517 96 -1007 -1406 -1461 -649 424 227 -913 -2309 -2345 -1693 -466 1072 2168 1776 716
2294 716 -866 -2971 -3128 -1753 -374 551 653 367 537 930 -235 -1271 -398 1307 1207 450 -86 -1077
2312 -1077 -977 -876 -567 1063 3583 4018 2355 335 -985 -874 -22 149 429 1708 2185 1372 788 271
2330 271 474 1758 1561 1073 1703 1255 399 -1297 -1720 -717 410 2437 2796 1714 1350 -73 -1351
2347a351K94K06Q80J100m21o70r06k18O28L3P09Q09l96Q0j712j962J30N87Q48
2366a332J714k44P06Qk247k31p75L10J900k72j40O17j753Q99n30j073K927M06
2384H90l40O66k133r10L60p71J039J627L87L76o90m32p45n41R17N90q8J268m84
2403I86j445M31r35m84K282N71M35L45j576q17m04n56P40R27R19m26j45l6j155
2422c43L48nk29R49P15O4j062j124o2n92N46J881j81J082k18l064L70M24p59J861
2442F01L84n93L57r31j99l35j97J987j218j05K670k308p18Q34k847J760K188j049
2460B81J456m26j648O6j071O54J673o16J179o89j762J936j633m49K183j456J265
2477I43N78j643Q23o47j563J504l09J034J155j345j67q56j562J392M17K22J664
$$ plain form
2347 -1351 -1057 -851 29 1129 708 38 -868 -1086 -458 -425 284 1093 697 777 -935 -2897 -2767 -2180 -1332
2366 -1332 382 138 844 852 -1395 -1626 -2401 -2091 -191 -463 -603 14 -1739 -840 -1370 -2443 484 890
2384 890 550 1216 -917 -1827 -1467 -2238 -1199 428 815 1191 501 69 -676 -1217 -300 290 202 1470 986
2403 986 -459 -28 -963 -1447 835 1406 1841 2186 610 -207 -611 -1167 -427 500 1419 993 848 812 -343
2422 -343 5 0 -229 720 1435 1499 437 -687 -749 -1341 -795 1086 905 1987 1769 -1295 -925 -501 -1260 601
2442 601 985 392 749 -182 -381 -716 -913 1074 -144 -249 2421 113 -605 229 -2618 -858 1330 281
2460 281 1737 1311 -337 -271 -1342 -688 985 369 1548 859 -903 1033 -600 -1049 1134 -322 943
2477 943 1521 -122 701 54 -1509 -5 -314 720 1875 530 363 -493 -2055 -663 -246 -24 1640
2494A640j266p91L82q90m07L32L69O30l09N15p87r89P55n87k61J889k02j06J27
2513D4j803k86J90J007P27K25P63q85j254O04m05J5J029r6J69m2m50L56r40L23
2533g09J028n19J085P88j358j65m31j059J462M20K52Q07m93K14q46p18J231k80
2551G09N4J048j575O15O11j796O41M88l7J607l95p89k24j022p2r8j53J695n94
2570G13L42L76j754N80O11n80M49k94m80M77j122j73l62J02J678K36m20K23p92
2589a90l1q54r49R68O33j1O6o39K56Q07p72M42n69L18J146j025j417N85l98L77
2609a257Q39r6J100J14k90o17j071R60k39k70O83o59N65P92q87L2P57j97M35L27
2629A021q32np61k82p2oJ195J117nl34r95j88R84n84m13l21k22O59J68n77O77
$$ plain form
2494 1640 374 -417 -35 -925 -1332 -1000 -631 -1 -310 205 -582 -1571 -816 -1403 -1664 225 23 -83 44
2513 44 -1759 -2045 -1855 -848 -121 104 867 -18 -1272 -668 -1073 -1058 -29 -125 44 2 -448 -92 -1032 -709
2533 -709 319 -200 885 1673 315 150 -281 -1340 122 542 794 1601 1108 1322 476 -242 989 709
2551 709 763 1811 236 851 1462 -334 307 795 758 2365 1970 1181 957 -65 -137 -235 -388 1307 713
2570 713 1055 1431 -323 257 868 288 737 443 -37 440 -682 -855 -1217 -1115 563 799 379 602 -190
2589 -190 -221 -1075 -2024 -1056 -423 -434 -368 -1007 -751 56 -716 -274 -843 -525 621 -404 -1821 -1236 -1634 -1257
2609 -1257 -418 -514 586 700 410 -207 -1278 -318 -557 -827 -144 -803 -238 554 -333 -301 456 259 694 1021
2629 1021 189 184 -577 -859 -931 -937 258 1375 1370 1036 41 -147 837 253 -160 -481 -703 -44 124 -453 224
2650B24j30P23Nn42P20J40j059j272r76J043J604J64o1k50R4J7l45K54mm39j80
2671b70o30o38J396L8L83J38o38J255R83j039p75m93q67J59Q22M54K22K22K19
2690I41k18l82J289l49l00n27j094Q0N02j3N94m97L8J218K09p0J51j143m10n45
2710e26m95N55M82K8L52q60N72J351k71m40n52q47j49n2o9o07P48J30l69J198
2730A79M32m58j90l02q34q32J205m33n09L13R3K94J034P28m12j3q56j25m14m34
2750a534K90J84l52K87J144L03L28K13o96m85L11j34o35n38K49M39O5J009O86
2769A134L44j3l61l30l90L80l62r64P5K29K1R94O77j9J06O04p46p77N55j286j011
2790a140R75P5L87Q41j16J1O04j93k77l87n99k09p34k82N89O50K3l29P15M61k36
$$ plain form
2650 224 94 817 822 280 1000 1140 81 -1191 -2167 -1124 480 644 583 333 427 444 99 353 349 -90 -270
2671 -270 -900 -1538 -142 -104 279 417 -221 1034 2017 978 203 -290 -1157 -998 -176 278 500 722 941
2690 941 723 341 1630 1281 981 454 -640 -560 -58 -71 523 26 64 1282 1491 1421 1572 429 19 -526
2710 -526 -1021 -466 16 44 396 -464 108 1459 1188 748 196 -651 -800 -852 -921 -1528 -780 -650 -1019 179
2730 179 611 153 -37 -339 -1173 -2005 -800 -1233 -1742 -1429 -1336 -1042 -8 720 308 295 -561 -686 -1100 -1534
2750 -1534 -1244 -1060 -1412 -1125 19 322 650 863 167 -318 -7 -141 -776 -1314 -1065 -626 -561 448 1134
2769 1134 1478 1465 1104 774 384 764 402 -562 -487 -258 -237 757 1434 1415 1521 2125 1379 602 1157 -129 -1140
2790 -1140 -165 -90 297 1138 1022 1033 1637 1444 1167 780 181 -28 -762 -1044 -455 195 218 -111 604 1065 829
2811H29K42k70j471p96K77j03L86R46k61l13M53O09J93k36K12q14j298P8k41j62
2831a740J286J09l95R47J069L2p81k44n13j062N95l21k68R70j04k08P83M36Q50
2850A441j69r04j57n67p31J50l18J98M54N38J004L42J11j93j502m81O89l52k88
2869g35L48p12k92P97Q29P61K86J87p31j602O43p54p68L95m3Q4J393P33L78j49
2889A048m10n91j073J302M05j293j52p22n92J293J324P45R90r49m50p02q78L46
2907c59j74l15J57N51M02N37L87P81j161j44P86r70k40N21j743k33J020N95K00
2926E98J054P45l44j170L49r26j263J043l18p97J425O46o58N9M61J85r4K29p8
2945A146k065%J38j718J156J529L4P27r1m34Mn77o53j03n60LJ32M59N8m48R46
$$ plain form
2811 829 1071 801 -670 -1466 -1189 -1292 -906 40 -221 -534 -81 528 721 485 697 -117 -1415 -1337 -1578 -1740
2831 -1740 -454 -345 -740 207 1276 1308 527 283 -230 -1292 -697 -1018 -1286 -316 -420 -628 155 591 1441
2850 1441 1272 368 211 -356 -1087 -937 -1255 -1057 -603 -65 939 1281 1392 1199 -303 -784 -95 -447 -735
2869 -735 -387 -1099 -1391 -594 235 996 1282 1469 738 -864 -221 -975 -1743 -1348 -1391 -1307 86 819 1197 1048
2889 1048 638 47 -1026 276 681 -612 -764 -1486 -2078 -785 539 1284 2274 1325 875 173 -705 -359
2907 -359 -533 -848 -691 -140 262 799 1186 1967 806 662 1448 478 238 759 -984 -1217 -197 398 598
2926 598 1652 2397 2053 883 1232 306 -957 86 -232 -1029 396 1042 384 443 904 1089 995 1224 1146
2945 1146 -919 -919 -781 -2499 -1343 186 220 947 856 422 426 -151 -804 -907 -1467 -1464 -1332 -873 -815 -1263 -317
2966c17M2k88J624r5j248J09k028j189J113P62J130O32K68n28q9O30r92l11J198
2985D23j69j753L99n8j46R60O44M53J02Q13k4j607o08L20q55K16n2N54J475O01
3005A688k98j4p25K21l71k28N62m43l07n17j003J253J197K27J536p20j175k8j324
3024d69k87L99q41R44O06n44N30K73O8L54p94L22J8n08M41j237j735Q53R23J193
3044E09O41j8P39r48j417k37l53K13P37j21m04J63j30P64k66M80J238k59m39r83
3064i1j230j37k22N40J223L15N35K51p85J25J1l99j7q52j77M97L9M79j23m89L06
3085b01L85J562R3r58m48j384j620N59J051J208J101k89j004l61j44N25P6Pj87
3104b9p56l86o5k64R25O53k14P01M14J57p74j099o33q67J51J438O45L54K53m62
$$ plain form
2966 -317 -275 -563 1061 966 -282 -173 -2201 -3390 -2277 -1515 -385 247 515 -13 -102 528 -464 -775 423
2985 423 254 -1499 -1100 -1158 -1304 -344 300 753 855 1668 1644 37 -571 -251 -1106 -890 -942 -388 1087 1688
3005 1688 1390 1376 651 872 501 273 835 392 85 -432 -1435 -182 1015 1242 2778 2058 883 855 -469
3024 -469 -756 -357 -1198 -254 352 -192 338 611 679 1033 239 561 579 71 512 -725 -2460 -1607 -684 509
3044 509 1150 1132 1871 923 -494 -731 -1084 -871 -134 -255 -659 -496 -626 138 -128 352 1590 1331 892 -91
3064 -91 -1321 -1458 -1680 -1140 83 398 933 1184 399 524 535 136 119 -733 -910 -413 -374 105 -18 -507 -201
3085 -201 184 1746 1839 881 433 -951 -2571 -2012 -961 247 1348 1059 55 -306 -450 75 151 158 -29
3104 -29 -785 -1171 -1236 -1500 -575 78 -136 565 979 1136 362 -737 -1370 -2237 -2086 -648 -3 351 604 142
3124A42m37j43P15L50l9j96k59j184l19K06N84Q24R97N46J52r51l53r54p65J043
3144d1O50o83Q80p2o80O99J40M44o2P0l37o40J54q2j416L16M70L8J497J215o04
3165A956l10j692o59k95O13J170k10n87m9n28k40O25P79J105l81p16q64j136J22
3184a297k23N5P99O87M89l24K28q35k01j86J57m1K06P5m81q82L73O01j7J074P12
3205I69n6n49q94q03j283Q74J412K73N14K49r69n15M28L22J33M48k85o63p38M48
3225f85L9q3J226K65J40M0O00p43r00n21J53n18R11P89J56K41n51o70l54J015
3245E50L49j4ml02j059o35R6N10O34R04R03n68j036l13o80l98P31N98J08Ml26
3266E2n90J32P14Q0J43K98l08o55J47o07l93J21L39M13R46L01R1o64q17k97j43
$$ plain form
3124 142 -295 -438 277 627 588 392 133 -1051 -1370 -1164 -580 244 1241 1787 1939 988 635 -319 -1084 -41
3144 -41 609 -74 806 734 54 753 893 1337 1275 1345 1008 368 522 440 -976 -660 -190 -152 1345 2560 1956
3165 1956 1646 -46 -705 -1000 -387 783 573 -14 -63 -591 -831 -206 573 1678 1297 581 -283 -1419 -1297
3184 -1297 -1520 -1465 -666 21 510 186 414 -421 -622 -808 -651 -692 -486 -411 -892 -1774 -1401 -800 -817 257 969
3205 969 913 364 -530 -1333 -2616 -1742 -330 -57 457 706 -263 -778 -350 -28 105 553 268 -395 -1133 -685
3225 -685 -646 -729 497 762 902 942 1542 799 -101 -622 -469 -987 -76 713 869 1110 559 -111 -465 550
3245 550 899 885 881 579 -480 -1115 -1019 -509 125 1029 1932 1364 328 15 -665 -1063 -332 266 374 378 52
3266 52 -538 -406 308 388 531 829 521 -134 13 -594 -987 -866 -527 -114 832 1133 1224 560 -257 -554 -697
3287f97N53J080K0n97p25l71K15N61J030O38p32j94j068k14j1j26L62J70M79L18
3307F91J98l81l2m25m29k13Q47L17kp55p99j13L70N92K36O65R4o20p41n11k93
3328a304M28J93M49M03jm21p45j20J17P81P75m17j53p10p33o3O18O0P00M84q0
3349B61k73k14l12J2l17mM49M73P32k47o23l17k52L76P76L40Q5k85q59k83l70
3370h52M42J377M34j07J12j226orj50M89M06K07l28o24K23L15j08J57k01M33K44
3391A228n93j76n11l30N83k82N86Q70l22k72l71j292L20M56K71P33l34k46n65
3410b47q33J96K70M73O15Q5p89r7o76j37N31J92N12r1k08J5o27n6K4l11Q34J22
3432b03O4M52o02o35M5k81R53M68j26N40o72o06m03r7O29Q29M2M61r24q3l35l69
$$ plain form
3287 -697 -144 936 956 359 -366 -737 -522 39 1069 1707 975 781 -287 -501 -512 -638 -276 -106 373 691
3307 691 889 508 476 51 -378 -591 256 573 571 -184 -983 -1096 -726 -134 102 767 861 241 -500 -1011 -1304
3328 -1304 -876 -683 -234 169 168 -253 -998 -1118 -1001 -220 555 138 -15 -725 -1458 -1521 -903 -843 -143 341 261
3349 261 -12 -226 -538 -526 -843 -847 -398 75 807 560 -63 -380 -632 -256 520 860 945 660 -199 -482 -852
3370 -852 -410 967 1401 1294 1406 180 174 165 15 504 910 1117 789 165 388 703 595 752 551 984 1228
3391 1228 635 459 -52 -382 201 -81 505 1375 1053 781 410 -882 -562 -106 165 898 564 318 -247
3410 -247 -1080 -884 -614 -141 474 559 -230 -327 -1003 -1140 -609 -417 95 4 -204 -189 -816 -872 -848 -1159 -325 -203
3432 -203 -139 313 -289 -924 -879 -1160 -207 261 135 675 3 -603 -1006 -1103 -474 355 397 858 -66 -149 -484 -853
3454h53O83M76j30P24n44m79K44o01K55M51J39K76n59l0J75o40J63M39k23N56
3474E22j43oJ96r14r4J73o36J107N10l98L81j078j87qJ03P54P04o47j27o02m42
3495h32P06M1L16N52l03j63k35k42j2lL4K4J85Q32p04k41L27o14J77M76qO79j82
3518H10p77L5o14K08M75N43K50L22p66j6j004J79O17k18P79l64q82Q50o10m94
3538f77J241j39Q0J84o27j21n75p1L59m99O14L85l5K99m38q88L38r9k28O04J32
3559a61l58J59o95N2K24J66J045k02j57j57j252J87L81l70P74M58l12p0j26l33
3579g47Q11j32j97l37N03P3k29K3l8l00R11k99N0R20k47k12o95m47k02O07N10
3600C26L26R2n9j13l25L05lnN22l67l06o35K47J61L55K6P92m26Q0j95n86j36K11
$$ plain form
3454 -853 -170 306 176 900 356 -123 121 -480 -225 226 365 641 82 52 227 -413 -250 189 -34 522
3474 522 379 373 569 -345 -439 -266 -902 205 715 317 698 -380 -567 -575 -472 282 986 339 212 -390 -832
3495 -832 -126 -85 231 783 480 317 82 -160 -172 -175 -141 -117 68 900 196 -45 282 -332 -155 321 313 992 810
3518 810 33 68 -546 -338 137 680 930 1252 486 470 -534 -355 262 44 823 459 -423 427 -183 -677
3538 -677 564 425 505 689 62 -59 -634 -705 -346 -845 -231 154 119 418 -20 -908 -570 -669 -897 -293 -161
3559 -161 -519 -360 -1055 -1003 -779 -613 432 230 73 -84 -1336 -1149 -768 -1138 -364 94 -218 -288 -414 -747
3579 -747 64 -68 -265 -602 -99 -26 -255 -232 -270 -570 341 42 92 1012 765 553 -142 -589 -791 -184 326
3600 326 652 744 685 572 247 552 549 544 1066 699 393 -242 5 166 521 547 1339 913 993 798 212 76 287
3623B87o11K29R1k07Q17l61l20L38j19K74k16J64l5o10q4m63l8Q63M19k74N21
3644F65m31o58J51l79K1M81k34l8k28Q0J11j17O40N45m95l00Kl59M14m89l18N42
3666c94J46M39K01l5j20k69R9j9o33O30j09m84L82j86j02N71L47j4RJ79o78m08
3688d48n9j60o2O53L7K44K57k17Q0K45l43n28J42k86p6k61L26J73l7M41j81L94
3710C34L91l11n56j29l39m9K9K12L41l5M06J0l92M17K02k30q8k08n79l46M62J66
3732b92K76N34O9p1J40r2m18K13n07j68N5R7K76M94J89J13k97K05J21k49k87k40
3754A61J36l23m53K76L86J31M76R4j40K30m80m35j63K29l30j64K9r0O75k7N1J21
3776C90J68k57l76m30l01M17l34m10K41O31J04L35k27r2k51K01m50k50O7j46j56
$$ plain form
3623 287 -324 -95 -4 -211 606 245 -75 263 144 418 202 366 331 -279 -363 -826 -864 -1 418 144 665
3644 665 234 -424 -273 -652 -631 -150 -384 -422 -650 -570 -459 -576 64 609 114 -186 -184 -543 -129 -618 -936 -394
3666 -394 -248 191 392 357 237 -32 67 48 -585 45 -64 -548 -166 -352 -454 117 464 450 459 638 -40 -448
3688 -448 -507 -667 -729 -76 -39 205 462 245 325 570 227 -301 -159 -445 -521 -782 -456 -283 -320 121 -60 334
3710 334 725 414 -142 -271 -610 -659 -630 -418 -77 -112 294 304 -88 329 531 301 213 5 -574 -920 -458 -292
3732 -292 -16 518 587 516 656 564 146 359 -148 -316 -261 -164 112 606 795 908 611 816 937 688 401 161
3754 161 297 -26 -479 -203 183 314 790 884 744 974 494 59 -104 125 -205 -369 -340 -430 245 218 269 390
3776 390 558 301 -75 -505 -806 -389 -723 -1133 -892 -261 -157 178 -49 -141 -392 -191 -641 -891 -824 -970 -1126
3797a126N02J81R5K42L83k73j14j2p02J86j82N8n0P3P49j5o8P99k60m23M08p92
3819c41j45L28n33L51P2M20K86K08j11M08j12J9m28l67r0k12k21P63J03J99K65
3840H62l47K05J26M4k98l82m24k73OL63L39K00J41p4K85l6l22J6m52m43J70l25
3862f19J59O53j58L67P6p2P8r8m73p6m72j2Q2K16J75k54N30MK78K75j63m14l60
3885b78k27n60L28L71K64K69K88q3j07L97k94l65l50j26k4K00j00pO2M33L04M15
3907H10n1k86k38p82j77mK79N7k80M77M31j13L09j75p0n3m54r5k57p9L61j32M6
3930d76N87J20j4M86p28j00k09n12J56k32L01K52k38O60J31k7K17k17qR1p48j39
3952f47J23l62K15M1O71R71k86j82J22l94j23n90K38J50J39J94o0k9N25L3M3K15
$$ plain form
3797 -1126 -624 -443 -348 -106 277 4 -110 -122 -824 -638 -820 -762 -812 -739 10 -5 -73 726 466 43 451 -341
3819 -341 -486 -158 -691 -340 -268 152 438 646 535 943 831 850 422 55 -35 -247 -468 295 398 597 862
3840 862 515 720 846 890 592 210 -214 -487 -481 -118 221 421 562 488 773 737 415 431 -21 -464 -294 -619
3862 -619 -460 193 35 402 478 406 484 386 -87 -163 -635 -647 -565 -349 -174 -428 102 106 384 659 496 82 -278
3885 -278 -505 -1065 -737 -366 -102 167 455 372 265 662 368 3 -347 -473 -497 -297 -397 -404 -342 91 395 810
3907 810 759 473 235 -547 -724 -728 -449 -392 -672 -195 236 123 432 257 187 134 -320 -415 -672 -751 -390 -522 -476
3930 -476 111 231 217 703 -25 -125 -334 -846 -690 -922 -621 -369 -607 53 184 157 374 157 149 240 -508 -647
3952 -647 -524 -886 -671 -630 41 1012 726 544 666 272 149 -441 -203 -53 86 280 220 191 716 749 792 1007
3974A007j78j12m75m86N2J53P4K42r2M13O84n5p25L75n77j03k24j17n3L9n8K8
3996a88K92M83K09r5p6k59n44j94l84J67K31j99P49k35M01R9o20m0Q7n33K72j55
4018e32k97J35j91K50L3L46N22Ml08J08p90l50J78K7M16K32K0K09P5J11J53k69
4040H2L2l77J01j10j14k14p3NO42N37M33L9m56m98k78j32K57K48j10P9j10J1N35
4063E29J69J38M9o54L15o6o42Q1l20j13O23L3N69L71n54J8k20m64J34j57J83J18
4085A40m96J81J11Q2M90k09K59l38J50o9k49p06M3q7J13P91L28M63k72q52J26
4106aRJ6K42j59m41K68l91N77j29L88L56j20M3m6p28k11p5k84L43M8O84K19l70
4129B38J6r6k16M16l8k51J20o40j48L87k58O16j20M38O6k17j73l05k74k43P1L5
$$ plain form
3974 1007 829 717 242 -244 -192 -39 35 277 185 598 1282 1227 502 877 300 197 -27 -144 -197 -158 -216 -188
3996 -188 104 587 796 701 625 366 -178 -372 -756 -589 -358 -557 192 -43 358 457 -163 -203 -116 -649 -377 -532
4018 -532 -829 -694 -885 -635 -602 -256 266 270 -38 70 -720 -1070 -892 -865 -449 -217 -197 12 87 198 351 82
4040 82 114 -263 -162 -272 -386 -600 -673 -668 -26 511 944 983 527 29 -249 -381 -124 124 14 93 -17 -6 529
4063 529 698 836 885 231 546 480 -162 -81 -401 -514 109 142 711 1082 528 546 326 -138 -4 -161 22 140
4085 140 -356 -175 -64 18 508 299 558 220 370 301 52 -654 -611 -698 -585 206 534 997 725 -127 -1
4106 -1 8 24 266 107 -334 -66 -457 120 -9 379 735 615 658 612 -116 -327 -402 -686 -343 -295 389 608 238
4129 238 254 158 -58 358 320 69 189 -451 -599 -212 -470 146 26 464 530 313 140 -165 -439 -682 -611 -576
4151e76M62j53J95K29m21j39L40k19J96R8m45j34m44J64M44M37J15J64j90j29
4171fm15j39K6J05N7k0J64L35n08K34J02j59N03O8j81O0k41n24p3K26O48J98L26
4194G86j27qk09m28K1j6L75J25j6L7k12j62J82nK83J2K9j98n2k88l03J02J54N6
4218A38L19J51k93J03l02l45K80J55O2j86M8m66o0K81K03k74L11R0K7j25k70p2
4240b25l25j64K10N48k35K56r1l32k29k9M33K90k18p4o15K51j48M2N09O9J84L04
4262D11k76j80j82L4k10k67M61L01J97j29l2n24J56J06L62L43l95q0l96j66K12
4283b54J69M16kK13l19k12K42k15l25l6J28O9O91m65j19j26PJ14L84j00L15k90
4305B85n64k81j69P94J66l86N24j21j90j1j57k82J69pL24K53m52L13m57j41K74
$$ plain form
4151 -576 -114 -267 -72 157 -264 -403 -63 -282 -86 12 -433 -567 -1011 -847 -403 34 149 313 123 -6
4171 -6 -421 -560 -534 -429 -372 -392 -228 107 -401 -167 -65 -224 279 347 166 226 -15 -539 -612 -386 262 460 786
4194 786 659 651 442 14 35 19 394 519 503 540 328 166 348 343 626 638 667 469 417 129 -174 -72 82 138
4218 138 457 608 315 418 116 -229 51 206 268 82 130 -336 -396 -115 88 -186 125 215 242 117 -153 -225
4240 -225 -550 -714 -504 44 -191 65 -26 -358 -587 -616 -183 107 -111 -185 -800 -549 -697 -655 -146 -77 107 411
4262 411 135 -45 -227 -193 -403 -670 -209 92 289 160 128 -396 -240 -134 228 571 176 96 -300 -466 -254
4283 -254 -85 331 329 542 223 11 253 38 -287 -323 -195 -126 565 100 -19 -145 -138 -24 360 260 575 285
4305 285 -279 -560 -729 65 231 -155 369 248 58 47 -110 -392 -223 -230 94 347 -105 208 -249 -390 -116
4326a16J81M31O4l12j07m06l6q7M10L32j5J49j81j76r9J21r3K87j2j75J84j62
4348A82k52o9q3K10O09Rk67m3k27j26l40L47M31O7j1l07k31L8k8n7K16n4p9M47
4372C82n17j68k57J73j03L11M20r8k67L7n41K5j04M38P8J90k3m17m5k70J24p8
4394g10M68L72k61j7m16l75K30L61J61J88o1j03m4k2l08J95J74L87k03L77R5n38
4416e0k69k6J05N47L38k51p2k53j29j44M61L20k00K0L31n98P4j20m17P12J55l6
4438D98L9j90j3l21j49J21L30J90K90m18k58j67l00L40L39k42M62l14m34P3O3
4459f1L6n1O0K24r2M5k6m77Q8l78J46K74N21m42J34m42j48J5K50O39k16k42k01
4482c44j97L00p1qJ66j35R8K28K21n39J55j29J2R1K7K21k41m6k15q9N33L88k71
$$ plain form
4326 -116 65 496 560 248 141 -265 -301 -388 22 354 339 488 307 131 32 153 60 347 335 160 344 182
4348 182 -70 -139 -222 -12 597 606 339 296 69 -57 -397 -50 381 448 437 130 -101 -63 -91 -148 68 14 -65 382
4372 382 -135 -303 -560 -387 -490 -179 241 143 -124 -87 -628 -603 -707 -269 -191 -1 -24 -441 -486 -756 -632 -710
4394 -710 -242 130 -131 -148 -564 -939 -709 -348 -187 1 -60 -163 -207 -229 -537 -342 -168 219 16 393 488 -50
4416 -50 -319 -345 -240 307 645 394 322 69 -60 -204 257 577 377 397 728 130 204 84 -333 379 534 498
4438 498 537 347 334 13 -136 -15 315 505 795 377 119 -48 -348 -8 331 89 551 237 -197 -124 -61
4459 -61 -25 -76 -16 208 116 161 135 -342 -254 -632 -486 -212 309 -133 1 -441 -589 -574 -324 315 99 -143 -344
4482 -344 -541 -241 -312 -320 -154 -289 -191 37 258 -281 -126 -255 -243 -152 -125 96 -145 -191 -406 -495 38 426 155
4505A55K31n76L8k69J31L98j19K50k77J87l6O5l82K03j46Q7K41J47m03p1j82k
4527c30J54j32P33J18m76j21j12k34J38K7J88J92l07l8L12l20k8J20M5L73j93
4548A09Kk48m05M26m67L16N33K00L06n28k27j71J34nL51k35K39k75R1J78j26L08
4570E06j64N1MJ68j10m89l9j94L32J25J14M47k17o5k37j58J89k30J86J29j85m15
4592b52K13j69M76p4J54L1l03l6l43j05ORJ09K27J29L5j33j47o4k95L15j52J45
4615b24J47n24j26L2L43P5M38m4j70J6n45k38lL51K67j81J82J64K08k91J19k16
4637b20R1L08k73J48l47k30Q8J45L44L34K72l57j19p9k30L54K8l93j83N05j84
4658BK27nJ20R2Kj95J51k4m1r9o39j20M42M95K0L19q8n26r3K24j17l51L72l72
$$ plain form
4505 155 386 -190 -152 -421 -290 108 -11 239 -38 149 113 178 -204 -1 -147 -60 181 328 -75 -146 -328 -330
4527 -330 -176 -308 425 543 67 -54 -166 -400 -262 -235 -47 145 -162 -200 112 -208 -236 -116 -71 302 109
4548 109 111 -137 -542 -116 -583 -267 266 466 772 244 17 -154 -20 -25 326 91 330 55 146 324 198 506
4570 506 342 393 397 565 455 -34 -73 -267 65 190 304 751 534 469 232 74 263 33 219 348 163 -252
4592 -252 -39 -208 268 194 348 379 76 40 -303 -408 -402 -393 -284 -57 72 107 -26 -173 -237 -532 -217 -369 -224
4615 -224 -77 -601 -727 -695 -352 -277 161 117 -53 -37 -582 -820 -823 -472 -205 -386 -204 -40 168 -123 -4 -220
4637 -220 -129 179 -94 54 -293 -523 -435 -290 54 388 660 303 184 105 -125 229 257 -136 -319 186 2
4658 2 229 224 344 436 438 243 394 370 329 230 -409 -529 -87 408 428 747 659 133 40 264 147 -204 168 -204
4682b04K0K59Q6L6j34R7O0k1K59j12k6o09m10L29J6M50P0J92n1k82o0P7n5J23
4706A10l39m5k87M85L9K8m4J39rOO4O2k20p4q03M70J63L68j15M0O0J07k14K67
4730B58M1N9m19j52K1k82K62K17M9K02J50l97J71j04l10q8P5k81N80k16L2l6L08
4753A40r7K14J7k61j38m15N8o7J00J73L9J59J18k47L12R0n7n54r3J96R6j69K68
4776a18L07j80J11J04K06Rr9j70j35k98m3m9J69J96L07J3K04O5j85q6K72m20l46
4799a66J44J6l4J32L89jj8R6P8k04ql64j15JK1K08j21L41k01L17l3r9k41R5k89
4824e6P0l52MJ94r1K1K97J35j53j16K16k2n82j98J93n8R3Q3J19OJ30K95k14q8
4848g4J8p5o32K63l64J42K73J22Q1K79J7Q8j73j86k8l4m80L98k4J86K39k49L60
$$ plain form
4682 -204 -184 75 161 197 63 160 220 199 458 346 320 -289 -699 -370 -354 96 166 358 307 25 -35 42 -13 110
4706 110 -229 -274 -561 -76 -37 -9 -53 86 77 83 147 209 -11 -85 -888 -418 -255 113 -2 38 98 205 -9 258
4730 258 299 358 -61 -213 -192 -474 -212 5 54 256 406 9 180 76 -234 -322 -247 -528 52 -164 -132 -168 140
4753 140 43 257 274 13 -125 -540 -482 -549 -449 -276 -237 -78 40 -207 105 195 138 -416 -509 -313 -217 -386 -118
4776 -118 189 9 120 224 430 439 340 170 35 -263 -306 -355 -186 10 317 330 534 599 414 328 600 180 -166
4799 -166 -22 -6 -40 92 481 480 462 558 636 432 424 60 -55 -54 -33 175 54 395 194 511 478 379 138 233 -56
4824 -56 14 -338 -334 -140 -231 -210 87 222 69 -47 169 147 -435 -633 -440 -498 -405 -322 -203 -197 -67 228 14 -74
4848 -74 -56 -131 -763 -500 -864 -722 -449 -327 -246 33 50 138 -35 -221 -249 -283 -763 -365 -389 -203 36 -213 147
4871A47K0J16j27K12l66p5j82K70l30K81J59L0o8L65j45M88k21l93j33k59K76
4892F5q2Q8N0M69m04K47N4k11K89o08PR5l33K72op2J70j37m1M93j08Kl58J03j87
4917a43k15K77j34J74L3L13N2Q0m39J14k02m1j02J86k96J26OJ51K85J80j3j82
4939B10j91J89m67ML36m23L63o0J47L1J27l3j04j7j24K17j24m03J75Q4j84K04
4961d3K05J92O7l43m5k43L1n9j89%K14j80J00J46l2K00J11j34N6l40J17j48j96
4984e13M3k63L42K41L4j2K02L11o70k58n8K41J68j21P6L67m43K92N1j07L65l7
5006B51j70k90o8j58K12K41j97J42P3L88P2k93J56j82N8J14k85j97J76nJ65R2
5028B95O8M62j00l22k5p4k90J03l98M40M5n7N46m42J93J82k74j88j44J70o9o3
$$ plain form
4871 147 167 283 156 368 2 -73 -255 15 -315 -34 125 155 87 452 307 795 574 181 48 -211 65
4892 65 -17 71 121 590 186 433 487 276 565 -43 -36 59 -274 -2 -8 -80 90 -47 -88 405 297 299 -59 44 -143
4917 -143 -358 -81 -215 -41 -8 305 357 437 -2 112 -90 -131 -233 -47 -343 -217 -211 -60 225 405 392 210
4939 210 19 208 -259 -255 81 -342 21 -39 108 139 266 233 129 112 -12 205 81 -322 -147 -63 -247 -43
4961 -43 162 354 421 78 33 -210 -179 -238 -427 -427 -213 -393 -293 -147 -179 21 132 -2 54 -286 -169 -317 -513
4984 -513 -470 -733 -391 -150 -116 -128 74 385 -285 -543 -601 -360 -192 -313 -237 130 -313 -21 30 -77 288 251
5006 251 81 -209 -277 -435 -223 18 -179 -37 36 424 496 203 359 177 235 349 64 -133 43 38 203 295
5028 295 363 825 725 403 378 304 14 117 -281 159 204 147 693 251 444 626 352 164 20 190 121 58
5050E8l56Q3O8J00M69l0k67P6p5k69l03K73k31j9L89k8k20L70l13L22j81k53J57
5073a80Q1r6k2m00P9K41l3K78J30P0k51n3j93q8N7J37J45l40K58L17k39k51K20
5096a33L81j49q9P8k21j95J25j87M09J54j13K69k0k15J08j69q1J29j95K04k91
5117b01O8J16J16O8j16l3J10o6Rj20j5k61P2O8L18J32q9J50j59P2j51k38J33K4
5141Gk63J98q3O7M2j95L56J41j54l71L77k02L8m2K08q8M5K37k34j51K71k1nn2
$$ plain form
5050 58 -298 -215 -147 -47 422 392 125 201 126 -143 -446 -173 -404 -423 -34 -62 -282 88 -225 97 -84 -337 -180
5073 -180 -99 -195 -217 -617 -538 -297 -330 -52 78 148 -103 -156 -349 -437 -380 -243 -98 -438 -180 137 -102 -353 -133
5096 -133 248 99 10 88 -133 -328 -203 -390 19 173 60 329 309 94 202 33 -48 81 -114 90 -201
5117 -201 -133 -17 99 167 51 18 128 62 71 -49 -64 -325 -253 -185 133 265 176 326 167 239 88 -150 -17 7
5141 7 -256 -58 -141 -74 -32 -227 129 270 116 -255 122 -80 -42 -84 124 36 81 318 84 -67 204 183 178 126
$$ [...]
8191E6
##END NTUPLES=NMR FID
##END=
