##TITLE=1H_SL59-yellow-point
 CDCl3
 8 sc, 
 31.05.2022
##JCAMPDX= 6.0         $$ Bruker NMR JCAMP-DX V2.0
##DATA TYPE= NMR FID
##DATA CLASS= NTUPLES
##ORIGIN= UXNMR, Bruker Analytische Messtechnik GmbH
##OWNER= root
$$ XWIN-NMR		Version 3.5
$$ Wed Jun  1 14:10:59 2022 Russian Standard Time (UT+4h)  she@DPX200
##.OBSERVE FREQUENCY= 200.13135
##.OBSERVE NUCLEUS= ^1H
##.DELAY= (6, 6)
##.ACQUISITION MODE= SIMULTANEOUS
##.ACQUISITION SCHEME= undefined
##.AVERAGES= 8
##.DIGITISER RES= 18
##SPECTROMETER/DATA SYSTEM= spect
##.PULSE SEQUENCE= zg30
##.SOLVENT NAME= CDCl3
##.SHIFT REFERENCE= (INTERNAL, CDCl3, 0, 15.7039)
##AUDIT TRAIL= $$ (NUMBER, WHEN, WHO, WHERE, WHAT)
$$ ##TITLE= Audit trail, XWIN-NMR		Version 3.5
$$ ##JCAMPDX= 5.01
$$ ##ORIGIN= Bruker BioSpin GmbH
$$ ##OWNER= she
$$ F:/spectra/data/she/nmr/H-F/1/audita.txt
$$ ##AUDIT TRAIL=  $$ (NUMBER, WHEN, WHO, WHERE, WHAT)
(   1,<2022-06-01 14:09:39.82 +0400>,<she>,<DPX200>,
      <created by zg, POWCHK disabled, PULCHK disabled
       configuration hash MD5:
       00 E9 B6 7A A2 85 ED C7 34 08 36 98 17 FE 4E 26
       data hash MD5: 16K
       42 6A B1 52 C2 D5 F2 84 15 0E 03 FC 60 23 83 F8>)
$$ ##END=
$$ 
$$ hash MD5
$$ 24 DE 27 F3 37 ED B5 FF EE D0 7F 99 86 26 DE 5E
##$RELAX= 
##$RELAX= 
##$RELAX= 
##$RELAX= 
##$RELAX= 
##$RELAX= 
$$ Bruker specific parameters
$$ --------------------------
##$DU= <F:/spectra>
##$EXPNO= 1
##$NAME= <H-F>
##$PROCNO= 1
##$TYPE= <nmr>
##$USER= <she>
##$AMP= (0..31)
100 100 100 100 100 100 100 100 100 100 100 100 100 100 100 100 100 100 
100 100 100 100 100 100 100 100 100 100 100 100 100 100 
##$AQSEQ= 0
##$AQ_mod= 1
##$AUNM= <au_zg>
##$AUTOPOS= <>
##$BF1= 200.13
##$BF2= 200.13
##$BF3= 200.13
##$BF4= 200.13
##$BF5= 200.13
##$BF6= 200.13
##$BF7= 200.13
##$BF8= 200.13
##$BYTORDA= 1
##$CFDGTYP= 0
##$CFRGTYP= 5
##$CHEMSTR= <none>
##$CNST= (0..31)
1 1 145 1 1 1 1 1 1 1 1 1 1 1 1 1 1 1 1 1 1 1 1 1 1 1 1 1 1 1 1 1 
##$CPDPRG= <>
##$CPDPRG1= <>
##$CPDPRG2= <>
##$CPDPRG3= <>
##$CPDPRG4= <mlev>
##$CPDPRG5= <mlev>
##$CPDPRG6= <mlev>
##$CPDPRG7= <mlev>
##$CPDPRG8= <mlev>
##$CPDPRGB= <>
##$CPDPRGT= <>
##$D= (0..31)
0 1.2 0 0 0 0 0 0 0 0.06 0 0.03 0 0 0 0 0.0002 0 0 0 0 0 0 0 0 0 0 0 0 
0 0 0 
##$DATE= 1654078179
##$DBL= (0..7)
120 120 120 120 120 120 120 120 
##$DBP= (0..7)
150 150 150 150 150 150 150 150 
##$DBP07= 0
##$DBPNAM0= <>
##$DBPNAM1= <>
##$DBPNAM2= <>
##$DBPNAM3= <>
##$DBPNAM4= <>
##$DBPNAM5= <>
##$DBPNAM6= <>
##$DBPNAM7= <>
##$DBPOAL= (0..7)
0.5 0.5 0.5 0.5 0.5 0.5 0.5 0.5 
##$DBPOFFS= (0..7)
0 0 0 0 0 0 0 0 
##$DE= 6
##$DECBNUC= <off>
##$DECIM= 32
##$DECNUC= <off>
##$DECSTAT= 4
##$DIGMOD= 1
##$DIGTYP= 9
##$DL= (0..7)
0 120 120 120 120 120 120 120 
##$DP= (0..7)
150 150 150 150 150 150 150 150 
##$DP07= 0
##$DPNAME0= <>
##$DPNAME1= <>
##$DPNAME2= <>
##$DPNAME3= <>
##$DPNAME4= <>
##$DPNAME5= <>
##$DPNAME6= <>
##$DPNAME7= <>
##$DPOAL= (0..7)
0.5 0.5 0.5 0.5 0.5 0.5 0.5 0.5 
##$DPOFFS= (0..7)
0 0 0 0 0 0 0 0 
##$DQDMODE= 0
##$DR= 18
##$DS= 0
$$ [...]
##$SUBNAM2= <"">
##$SUBNAM3= <"">
##$SUBNAM4= <"">
##$SUBNAM5= <"">
##$SUBNAM6= <"">
##$SUBNAM7= <"">
##$SUBNAM8= <"">
##$SUBNAM9= <"">
##$SW= 18.05172834244
##$SWIBOX= (0..15)
0 0 2 0 0 0 0 0 0 0 0 0 0 0 0 0 
##$SW_h= 3612.71676300578
##$TD= 16384
##$TD0= 1
##$TE= 0
##$TE2= 300
##$TE3= 300
##$TEG= 300
##$TL= (0..7)
0 120 120 120 120 120 120 120 
##$TP= (0..7)
150 150 150 150 150 150 150 150 
##$TP07= 0
##$TPNAME0= <>
##$TPNAME1= <>
##$TPNAME2= <>
##$TPNAME3= <>
##$TPNAME4= <>
##$TPNAME5= <>
##$TPNAME6= <>
##$TPNAME7= <>
##$TPOAL= (0..7)
0.5 0.5 0.5 0.5 0.5 0.5 0.5 0.5 
##$TPOFFS= (0..7)
0 0 0 0 0 0 0 0 
##$TUNHIN= 0
##$TUNHOUT= 0
##$TUNXOUT= 0
##$USERA1= <user>
##$USERA2= <user>
##$USERA3= <user>
##$USERA4= <user>
##$USERA5= <user>
##$V9= 5
##$VALIST= <valist>
##$VCLIST= <CCCCCCCCCCCCCCC>
##$VD= 0
##$VDLIST= <DDDDDDDDDDDDDDD>
##$VPLIST= <PPPPPPPPPPPPPPP>
##$VTLIST= <TTTTTTTTTTTTTTT>
##$WBST= 1024
##$WBSW= 4
##$XGAIN= (0..3)
0 0 0 0 
##$XL= 0
##$YL= 0
##$YMAX_a= 231546
##$YMIN_a= -236238
##$ZGOPTNS= <>
##$ZL1= 120
##$ZL2= 120
##$ZL3= 120
##$ZL4= 120
##$ABSF1= 10
##$ABSF2= 0
##$ABSG= 5
##$ABSL= 3
##$ALPHA= 0
##$AQORDER= 0
##$ASSFAC= 0
##$ASSFACI= 0
##$ASSFACX= 0
##$ASSWID= 0
##$AUNMP= <proc_1d>
##$AZFE= 0.1
##$AZFW= 0.1
##$BCFW= 1
##$BC_mod= 2
##$BYTORDP= 1
##$COROFFS= 0
##$CY= 11.3945322036743
##$DATMOD= 1
##$DC= 2
##$DFILT= <>
##$DTYPP= 0
##$F1P= 2.36226072786647
##$F2P= -0.459571619588291
##$FCOR= 0.5
##$FTSIZE= 0
##$FT_mod= 4
##$GAMMA= 1
##$GB= 0.15
##$INTBC= 1
##$INTSCL= 1
##$ISEN= 128
##$LB= 0.24
##$LEV0= 0
##$LPBIN= 0
##$MAXI= 10000
##$MC2= 0
##$MEAN= 0
##$ME_mod= 0
##$MI= 1.114404
##$NCOEF= 0
##$NC_proc= 0
##$NLEV= 6
##$NOISF1= 3.799351
##$NOISF2= 2.8
##$NSP= 1
##$NTH_PI= 0
##$NZP= 0
##$OFFSET= 15.70392
##$PC= 1
##$PHC0= -18039.16
##$PHC1= 15.00074
##$PH_mod= 1
##$PKNL= yes
##$PPARMOD= 0
##$PSCAL= 0
##$PSIGN= 0
##$REVERSE= no
##$SF= 200.130013532006
##$SI= 16384
##$SIGF1= 3
##$SIGF2= 2
##$SINO= 400
##$SIOLD= 16384
##$SREGLST= <1H.CDCl3>
##$SSB= 0
##$STSI= 0
##$STSR= 0
##$SW_p= 3612.71676300578
##$SYMM= 0
##$S_DEV= 0
##$TDeff= 0
##$TDoff= 0
##$TI= <>
##$TILT= no
##$TM1= 0
##$TM2= 0
##$TOPLEV= 0
##$USERP1= <user>
##$USERP2= <user>
##$USERP3= <user>
##$USERP4= <user>
##$USERP5= <user>
##$WDW= 1
##$XDIM= 8192
##$YMAX_p= 0
##$YMIN_p= 0
$$ End of Bruker specific parameters
$$ ---------------------------------
##NTUPLES= NMR FID
##VAR_NAME=  TIME,          FID/REAL,        FID/IMAG
##SYMBOL=    X,             R,               I
##VAR_TYPE=  INDEPENDENT,   DEPENDENT,       DEPENDENT
##VAR_FORM=  AFFN,          ASDF,            ASDF
##VAR_DIM=   8192,          8192,            8192
##UNITS=     SECONDS,       ARBITRARY UNITS, ARBITRARY UNITS
##FACTOR=    0.0002768,     1,               1
##FIRST=     0,             0,               0
##LAST=      2.2672688,     0,               0
##MIN=       0,             -236238,         0
##MAX=       2.2672688,     231546,          0
$$ Real data points
##PAGE= N=1
##DATA TABLE= (X++(R..R)), XYDATA
0 0 0 0 0 0 0 0 0 0 0 0 0 8 -8 8 -8 8 -16 16 -24 24 -32 40 -48 56 -64 76 -88 104 -119 136 -154 176 -200
33 -200 228 -257 290 -326 365 -409 457 -508 565 -627 694 -766 847 -936 1033 -1138 1254 -1381
51 -1381 1522 -1678 1850 -2043 2262 -2507 2791 -3117 3502 -3960 4518 -5217 6118 -7328 9048
66 9048 -11702 16370 -26932 104472 -105082 -169096 231546 20964 -209699 42734 128117
77 128117 -124101 -47979 97756 -3435 -50515 43170 17925 -15608 -2569 -1957 -956 -716
89 -716 -25022 9864 15249 -32011 -819 34253 -38437 -29104 41583 -13066 -46747 39726 32074
102 32074 -27526 22416 48511 -4329 -190 15895 -9317 -10753 -14803 -28067 2144 -324 -30134
115 -30134 15343 34474 -23777 2539 48446 -20212 -33432 38123 -3945 -57386 16754 30117
127 30117 -44183 -12891 45344 -6267 -35327 19454 26359 -22013 -15889 30584 21442 -19394 5071
140 5071 42449 -287 -26955 18002 7023 -40808 -8882 7814 -33199 -4590 27380 -19552
152 -19552 -790 52595 -7366 -30496 44963 9992 -61545 7056 33601 -47239 -22748 42868
164 42868 -5723 -26507 29031 17773 -17062 6722 14606 -4700 -306 5471 4918 6032 -2658
177 -2658 2285 10023 -14794 -16224 9849 -14280 -30472 12725 10249 -23620 12233 32293 -8300
190 -8300 -416 24103 -7224 -15043 4004 -14767 -15704 5582 -11364 -6906 25065 1501 -8859
203 -8859 32326 11284 -25006 18658 20321 -33929 -2018 32987 -23424 -22651 34357 -1727 -39722
216 -39722 13641 18556 -36213 -13902 28510 -4805 -24079 20605 28670 -13660 -8870 29153 4138
229 4138 -36821 -599 23443 -30183 -27649 36434 10125 -33244 27000 44274 -25050 -6936
241 -6936 43464 -10765 -37458 19727 7965 -37490 -1981 19840 -17153 -12860 14703 -2096
253 -2096 -13095 2274 2403 -3729 722 3667 6898 6794 1159 5253 6534 -5941 -6321 917 -6969
268 -6969 -8789 2440 3016 1366 8954 10693 8127 5609 -286 626 -1801 -16434 -11062 2461 -15608
283 -15608 -17164 13983 3547 -19637 13420 21868 -20045 -3752 29682 -8912 -21036 26622
295 26622 11959 -25825 10843 26060 -19577 -12927 22020 -5516 -25900 8687 13720 -14415
307 -14415 -2404 22389 5731 -9688 8739 11744 -15001 -14888 6179 -8684 -25100 2853 11123
320 11123 -15802 -592 27106 68 -11305 22862 11101 -21132 4724 18204 -16145 -10055
332 -10055 19717 -1121 -15789 10547 7403 -13880 -2184 7258 -6190 -4760 5704 2057 1913
345 1913 4391 685 2096 623 -9100 -7160 -1550 -11155 -11457 4089 2976 -5085 8665 16836 2009
360 2009 709 13801 4188 -12057 -430 7397 -12041 -11941 11609 3419 -16137 5190 18876
373 18876 -11662 -12572 19506 2827 -24178 7405 20991 -17833 -11203 24972 -1431 -26738 9536
386 9536 13022 -27589 -10901 22707 -6298 -19401 22606 21378 -15005 4315 29240 -4481 -19543
399 -19543 13342 7236 -25377 -7672 15599 -8175 -15829 14180 11678 -12447 506 14798 -5637
412 -5637 -11712 7019 1622 -11991 12 7199 -5612 -4612 4968 -1018 -6037 231 1093 -834
426 -834 2182 3727 5835 9212 3556 2585 9268 639 -10268 505 1134 -16652 -8173 9107 -5799
441 -5799 -11188 13646 9977 -12185 3730 16118 -10034 -12664 11572 -379 -18418 2865 11474
454 11474 -10490 -5501 15508 2045 -12056 7708 12822 -9079 -4337 17691 4077 -11791 9553
467 9553 15369 -13349 -10105 13144 -6644 -23914 3862 7463 -19286 -2874 19680 -4041 -8766
480 -8766 19042 6779 -15371 5210 9998 -15777 -7954 11334 -4065 -10395 9338 8438 -5029
493 -5029 2320 9722 1005 -2864 2463 3560 -824 -3042 1160 2581 -3632 -4814 208 -3109 -8505
508 -8505 -3937 -428 -4163 -2579 4141 5136 1785 2913 7388 4323 -4962 -1688 5064 -6615 -11916
523 -11916 5971 4785 -12511 2929 18094 -4987 -6889 17924 3989 -16546 6115 10892 -16567
536 -16567 -7641 14363 -6067 -15618 8994 5898 -15486 -3237 11908 -4932 -10733 9682 9943
549 9943 -7848 556 16678 635 -11375 8030 7602 -16779 -5728 13161 -8004 -12615 15454
562 15454 7832 -12506 9600 16743 -10343 -4942 13739 -5887 -14807 5425 668 -13019 -22
575 -22 5235 -5684 -1642 4447 -1040 -429 2101 -327 2632 3287 -955 3936 5249 -3199 -802 4439
591 4439 -4071 -6307 2748 -516 -5601 1963 6450 658 290 5694 5608 -3017 -5142 3267 -934 -14774
607 -14774 -4152 8510 -9942 -12228 14347 5853 -16140 6605 18567 -11560 -7448 19597 -100
620 -100 -15172 11235 10769 -13419 -386 13214 -6661 -10120 8332 1764 -10986 641 9593
633 9593 -2967 -5719 8198 7213 -9123 -3901 8664 -5342 -15441 3159 4061 -14209 -1612
646 -1612 13146 -3833 -4151 14906 3870 -6621 9552 6227 -9227 2478 6842 -7970 -2215
659 -2215 7025 -4586 -4264 5596 -2361 -5021 3963 -1477 -4888 4927 988 -4883 4523 3540 -6452
674 -6452 -497 2785 -6416 -4583 1282 -2553 -2461 3928 2703 2461 5903 5125 2728 2602 2420 1125 -3461
691 -3461 -3198 2659 -3197 -9413 4015 6047 -11478 -2327 14594 -5942 -13398 13626 6322 -17828
705 -17828 3059 16317 -11688 -9083 15607 -1420 -15332 7165 7750 -12720 -1524 12911 -1585
718 -1585 -5061 10574 8747 -4782 90 8953 -999 -10391 132 4346 -9637 -8463 7259 868
732 868 -9778 3765 8822 -5861 -2623 8115 -1109 -5519 3501 1111 -4606 751 1067 -1718 890
747 890 -1110 -1111 3465 -1234 -2985 7044 3435 -5259 5752 9251 -6918 -2462 9332 -4870 -11896
762 -11896 3802 1895 -11982 -2885 8114 -2511 -6019 6680 7102 -4967 -2197 7977 640
775 640 -9842 1696 7833 -8462 -6578 11168 1061 -11625 7523 10363 -10276 -1407 14498
788 14498 -3173 -8198 11065 4151 -10494 3038 6966 -9135 -5395 4795 -4681 -7498 1884
801 1884 1112 -3558 1242 4092 1877 385 1353 2413 -40 -3317 840 1371 -4932 -1160 4706 -1293
817 -1293 -2348 6078 2921 -3021 3590 4267 -2685 217 2675 -1970 -1541 92 -3086 -1482 -880 -5261
833 -5261 -1331 1349 -5033 -1504 5514 -1430 -2338 8066 2615 -5044 5555 5427 -7427 -992 6898
848 6898 -5479 -5842 7107 1419 -6570 4576 7201 -3889 -1357 6963 -526 -6956 1523 3171
862 3171 -6881 -5581 4350 -745 -9333 562 6478 -6171 -5383 9215 2505 -8086 5473 10271
876 10271 -5143 -2025 9785 -284 -7755 3914 3103 -7486 -1327 4751 -2401 -3054 4328 2569
890 2569 -2489 814 3005 -1068 -3303 -382 -214 -3900 -3818 1138 -344 -3997 264 3721 -829 -1125
906 -1125 4268 3131 -1064 1535 3939 1042 -1102 995 2396 -1209 -3456 777 1624 -4689 -2842
921 -2842 4772 -627 -5151 4643 5524 -5574 -877 7442 -3667 -7219 4177 978 -9334 -284
935 -284 5792 -4819 -3528 7668 2033 -5042 4125 7126 -3218 -1768 6752 869 -5684 1800 4379
950 4379 -4828 -3557 4694 -442 -6498 2279 4173 -4749 -1604 6525 -473 -4881 4391 3196 -6033
965 -6033 -1633 3725 -3649 -5108 2436 1024 -3517 1018 4221 627 659 3519 2818 424 -56 1480
981 1480 667 -1785 -1380 1018 -1294 -3112 229 1424 -2944 -1431 3198 -321 -3201 2348 2766 -3389
997 -3389 -1157 3125 -1143 -4227 776 1881 -3782 -2623 4073 907 -3341 3080 6228 -1613 -1108
1012 -1108 6780 2047 -5639 2320 4622 -6141 -4252 5383 -2149 -8026 3434 4060 -7156 -1446
1026 -1446 7182 -2436 -5928 5138 3206 -6648 -397 5936 -2982 -5247 3873 2588 -4814 -669 5388
1041 5388 12 -2713 4063 4870 -1617 -131 5283 350 -3980 1366 1797 -5210 -2990 1736 -2277
1056 -2277 -4635 1371 1326 -2824 -318 2836 -142 -1140 1118 1458 -873 -883 721 866 -1040 -1215 2028
1073 2028 1388 -2339 1281 4137 -1306 -1471 5159 1443 -4039 2139 3626 -4901 -3197 3482 -2468
1088 -2468 -6955 1203 2133 -5400 -1874 5153 225 -3640 3456 4706 -2807 -1544 5197 325 -5354
1103 -5354 1734 4296 -4276 -2639 5750 144 -4881 3882 4661 -4249 -181 5785 -1642 -4050 3488
1118 3488 897 -5476 -764 2356 -3877 -3667 1983 -99 -3206 412 3265 259 -913 2589 2883
1133 2883 -1157 -809 2642 512 -3068 332 2121 -2463 -1619 2899 663 -2050 1713 2675 -1061 -968
1149 -968 1987 857 -2074 -1364 1357 -725 -4077 -824 1888 -2984 -3361 3390 970 -4308 2236 5107
1165 5107 -2648 -873 5935 116 -3911 3409 2266 -4580 -487 3679 -2581 -2946 3453 1799 -3092
1180 -3092 794 3825 -975 -2399 2040 1603 -3785 -2176 2598 -1555 -5140 1500 2041 -4977 -1119
1195 -1119 5271 -1555 -3503 5508 3240 -4319 2084 5503 -2486 -2193 3832 -104 -3625 823 1641
1210 1641 -1637 -790 1184 548 -822 -467 1554 688 -1844 -559 1740 -2348 -3130 1661 -759 -4377
1226 -4377 798 2582 -2809 -997 4252 672 -1807 2847 2987 -1006 312 2638 942 -1560 -569
1241 -569 1963 -431 -3196 902 2269 -3461 -1752 4135 -187 -4655 2874 2969 -5085 -1183 4717 -2731
1257 -2731 -4874 3198 754 -5170 781 4228 -2086 -1338 4146 2122 -1606 1421 4008 196 -2221
1272 -2221 1923 2479 -3353 -2531 3011 -901 -5114 1558 2458 -4340 -910 4134 -1457 -3030 3334 1215
1288 1215 -3401 711 2225 -2677 -1423 1900 -118 -1275 608 1666 1137 103 713 2559 468
1303 468 -1164 1932 1853 -2381 -877 2109 -1755 -3021 1109 -263 -3318 502 1319 -2193 -528 2198
1319 2198 -228 -1212 1098 953 -1030 -428 849 650 -1639 -596 2257 -278 -1922 2524 2849 -2226
1335 -2226 571 4577 -814 -2627 3434 709 -4434 701 1997 -3785 -2169 2353 -1448 -3057 1486
1350 1486 1532 -1849 -648 2355 487 -1442 186 1641 -942 -1708 1675 1279 -3028 -88 3322 -1388
1366 -1388 -2227 3649 2155 -2854 1708 3955 -2059 -1660 3431 -108 -3559 429 1063 -2573 -1941 864
1382 864 -220 -2167 -461 1614 -93 -1761 1007 2524 -1466 -1365 2834 152 -3428 1500 2847
1397 2847 -2896 -742 3933 -285 -2431 3237 2424 -2139 165 2772 -608 -2141 658 778 -2495
1412 -2495 -2378 784 -121 -3430 -616 2492 -1592 -2396 3084 1685 -3005 1183 4152 -2074 -1909 4118
1428 4118 498 -3801 1712 3009 -2382 -1284 3324 697 -2307 1349 2599 -892 -1777 1376 973
1443 973 -2671 -1797 1453 -1073 -3463 804 1470 -3056 -1108 3085 -119 -1953 3027 2191 -1857 1196
1459 1196 3169 -916 -1380 2083 761 -2071 -184 1670 -583 -1824 1104 1854 -1022 -1111 2063 291
1475 291 -2800 339 1787 -2592 -2478 1901 -688 -3620 404 1959 -2029 -605 2611 638 -1020
1490 -1020 1835 2339 -531 155 1990 340 -1121 427 1010 -696 -1299 947 283 -1871 98 1682
1506 1682 -1462 -1535 2085 281 -2638 437 1309 -2541 -1436 1303 -618 -1978 774 1288 -1036 -236
1522 -236 2115 825 -773 976 2046 -264 -1002 1428 976 -2190 -585 2161 -1419 -2522 1667 1148
1538 1148 -2985 -317 2657 -1369 -1890 2224 672 -2463 121 1626 -1735 -1672 1293 233 -1732 -68
1554 -68 1722 -268 -963 1887 2034 -994 181 2391 -99 -1760 1466 1609 -2562 -1139 2301 -947
1570 -947 -2919 1462 1279 -2611 -478 2408 -755 -1945 1005 1137 -1947 -1030 1245 -135 -1893 113
1586 113 1440 -541 -739 1637 1656 -706 532 2760 -259 -1379 1842 1483 -2273 120 1878 -1838
1602 -1838 -2368 1498 101 -2743 -114 1660 -1522 -1538 1577 369 -1835 117 1197 -922 -1315 891
1618 891 567 -1383 639 1897 -679 -665 2285 958 -1242 970 2408 -648 -1138 1814 41 -2316
1634 -2316 -34 897 -2013 -1746 1099 -246 -2174 223 1019 -1209 -825 1565 455 -1523 471 1607
1650 1607 -638 -1220 1360 906 -1339 435 2267 -245 -1091 2032 1431 -1551 318 2072 -605 -1725
1666 -1725 788 550 -2378 -1093 848 -1244 -2245 320 1226 -1409 -1040 1835 693 -1711 886 2553
1682 2553 -1015 -1352 2427 779 -1904 1059 2276 -1496 -815 2352 652 -1809 1143 1929 -1125 -947
1698 -947 1603 67 -2054 -311 862 -1387 -1816 515 258 -1854 -590 1812 -110 -1875 1472 1421
1714 1421 -1616 194 2338 -702 -970 1852 954 -1801 557 1549 -1414 -651 1633 289 -1142 598
1730 598 938 -620 -661 481 -323 -1154 -520 216 -801 -1195 321 454 -1190 -427 1309 -28 -937 1322
1748 1322 1424 -979 157 1693 -133 -1362 904 734 -1174 -398 1265 -61 -1080 928 1163 -821
1764 -821 -806 1487 139 -1892 231 1434 -1917 -1780 1603 -232 -2647 629 1887 -1783 -784 2946
1780 2946 251 -1531 1868 1531 -1279 -284 2067 -216 -1290 890 1055 -1385 -682 1670 -117 -1719
1796 -1719 501 1615 -1220 -1067 1793 26 -2605 516 1022 -2214 -1376 1155 -389 -1711 662 959
1812 959 -978 -27 1485 564 -169 818 1186 423 -534 519 1048 -878 -732 1295 45 -1705 543
1829 543 979 -1551 -1009 1336 -487 -2208 597 759 -1728 -718 1172 -483 -1322 231 920 -500
1845 -500 -327 1206 1273 -566 653 2114 52 -640 1693 911 -1981 115 1754 -1831 -1649 2114 -332
1862 -332 -2401 1053 946 -2215 -720 1650 -735 -1588 1171 280 -1524 94 1142 -632 -691 815
1878 815 331 -498 454 1041 409 -422 973 1395 -710 -226 1420 -203 -1681 566 758 -1687 -971 974
1896 974 -362 -1205 672 327 -488 -346 440 102 -468 -409 890 252 -610 161 1095 -92 -633 1822 616
1915 616 -1198 803 1756 -1044 -416 2166 -203 -1759 1061 1124 -1898 -858 1566 -626 -2545 605
1931 605 1128 -1906 -996 1950 397 -2360 955 1810 -1474 -1224 2177 76 -2300 1337 1738 -1860
1947 -1860 -269 2300 -387 -1370 1674 873 -1454 339 1497 -614 -873 1033 173 -1114 -18 -81
1963 -81 -638 -834 -101 301 -40 -202 328 403 -539 138 433 -412 -378 545 151 -598 763 760 -122 405 836
1984 836 480 137 131 485 49 -721 -362 672 -458 -992 553 -25 -1643 -504 934 -1036 -1122 1115
2002 1115 142 -1732 659 1479 -1285 -148 1769 -43 -1202 986 878 -1206 108 1562 -476 -917
2018 -917 1194 565 -1327 -89 1148 -824 -1528 823 227 -2049 -236 1293 -1136 -1927 1307 259
2034 259 -1999 257 1481 -852 -561 1520 316 -392 932 1036 -501 95 1035 -4 -249 60 550
2051 550 -114 -532 396 223 -531 -455 278 -412 -1141 -466 -39 -817 -613 209 -161 -662 131 416 95 -71
2071 -71 553 699 -210 -43 1133 442 -762 449 1548 -938 -834 1557 -108 -2142 846 1384 -1937
2088 -1937 -790 1829 -578 -1953 1005 673 -2383 -317 1304 -1091 -1579 1404 403 -1304 556
2103 556 1779 -510 -636 1696 804 -1328 401 1862 -791 -911 1361 747 -1484 271 1448 -1302
2119 -1302 -1207 1088 -29 -1642 634 647 -933 -427 890 -381 -744 392 -66 -333 97 -164 -2 518
2137 518 7 340 1001 251 -259 654 385 -644 303 647 -699 -603 696 76 -786 383 401 -891 -649
2156 -649 898 -35 -1336 144 874 -778 -455 918 -86 -1244 724 970 -1118 -173 1643 -340
2172 -340 -945 1682 1490 -1146 439 1847 -624 -965 1496 111 -1594 358 1311 -892 -740 1118
2188 1118 -252 -1443 217 462 -1241 -633 653 -563 -1237 819 738 -906 -75 1215 -249 -768 645
2205 645 746 -740 -43 1324 175 -451 887 444 -318 -204 115 -315 -579 -216 -307 -98 -493 -224 434
2224 434 -230 -762 331 244 -1193 -438 1068 -275 -756 866 886 -778 20 1731 -191 -766 1005 1247
2242 1247 -924 -37 1581 -494 -1125 1224 1205 -1488 -414 1072 -720 -1696 624 170 -1761 175
2258 175 1314 -772 -905 1590 412 -1095 659 1236 -1255 -39 1438 46 -736 1474 1123 -946
2274 -946 156 1139 -376 -509 592 121 -895 -82 321 -482 -249 214 -363 -587 -341 -22 -582 -339 111
2293 111 171 60 100 316 330 360 -14 18 131 -107 -142 320 326 -41 272 611 -339 -396 613 -47 -1133 7
2315 7 351 -1130 -643 890 -575 -1205 965 425 -1461 39 1020 -1024 -744 1224 468 -1291 696
2332 696 1388 -641 -580 1345 121 -1476 641 1174 -1001 -550 1496 200 -1045 611 1116 -1119 -753
2349 -753 1007 -674 -1623 722 598 -1317 172 1342 -568 -772 846 231 -881 27 483 -542 -144
2366 -144 907 339 247 253 385 227 -87 -131 125 -58 -490 5 566 -310 -210 287 -11 -650 -267 153 -493
2387 -493 -838 -189 135 -642 -123 857 324 -506 466 650 -409 -71 1337 259 -636 1209 837 -1055
2405 -1055 125 1403 -780 -1062 1002 1 -1486 90 886 -1437 -577 1278 -390 -1331 542 440
2421 440 -1437 -243 841 -415 -759 920 697 -399 387 1482 58 -355 979 525 -903 209
2437 209 808 -696 -256 876 -51 -1002 441 368 -998 -318 331 -751 -464 475 130 -653 339 202 -442
2456 -442 -110 -3 -111 -102 391 39 502 324 197 360 945 206 -136 770 49 -1016 38 208 -499 -767
2476 -767 596 360 -895 112 880 -734 -1028 807 167 -1630 239 1187 -669 -551 1430 318 -1454
2493 -1454 585 1288 -1173 -290 1711 -30 -928 1531 793 -1088 -2 1237 -802 -1074 692 3
2509 3 -1392 185 781 -732 -435 558 130 -758 135 254 -780 -686 719 69 -180 450 662 -94 126
2528 126 440 175 -241 -32 170 -311 274 270 -63 430 3 -563 -57 148 -652 -511 294 -562 -350 343 268
2549 268 -644 619 162 -789 237 589 -857 -509 1066 18 -640 687 1099 -518 64 896 121 -1015
2567 -1015 397 745 -1118 -507 1159 -10 -1101 416 883 -1234 -800 808 -630 -1424 822 431
2583 431 -1091 61 1089 -407 -657 1031 112 -965 545 559 -783 4 931 -220 -154 691 416 -530
2601 -530 -61 358 -438 -545 116 170 -411 42 204 0 -397 -166 -156 -675 -236 -290 -281 30 28 4 367 609 -99
2624 -99 151 888 -191 -248 663 -48 -966 664 854 -773 316 909 -496 -979 394 4 -1337 -102
2642 -102 253 -1088 -456 991 -85 -795 516 791 -1258 -389 1088 -219 -589 1059 980 -712 125
2659 125 1120 -203 -529 713 184 -1216 -43 662 -419 -403 1106 390 -1078 123 399 -1097 -432
2676 -432 188 -749 -571 783 141 -579 484 709 -362 360 459 -172 -152 469 291 -26 326 448 -6 273
2696 273 230 -46 -1 14 -140 -328 -12 -243 -66 30 266 -183 -179 164 -95 -810 -10 -6 -651 -42 659 -297 -315
2719 -315 800 179 -548 399 762 -852 -303 938 -67 -433 1093 386 -955 574 847 -569 -752
2736 -752 516 -121 -1372 476 865 -795 -209 932 -83 -1049 459 395 -920 -374 847 -155 -320
2753 -320 831 639 -371 211 960 -321 -326 382 -76 -563 102 462 -220 -79 445 -21 -296 -11 -188 -552
2773 -552 -145 -138 -371 106 -213 15 223 359 -516 -196 130 -313 -29 530 314 -212 600 553 -54 -198 1031
2794 1031 -22 -762 95 345 -693 -299 807 -15 -968 523 421 -1103 -233 481 -459 -789 666 246
2812 246 -997 204 1129 -79 -400 1077 59 -783 465 783 -374 -145 927 144 -391 395 549
2829 549 -531 161 438 -619 -305 210 -10 -659 -44 643 -162 -178 386 166 -313 202 15 -473 296 505
2849 505 -262 144 560 196 7 374 141 -253 85 124 -260 81 337 -468 -12 600 -289 -503 35 -144
2869 -144 -1224 -92 363 -377 -320 718 276 -442 733 467 -455 -156 582 -51 -465 664 621 -499 304
2888 304 983 -415 -324 633 -317 -1007 161 330 -724 -399 719 -33 -909 406 353 -860 -58 296 -666
2907 -666 -597 664 213 -499 156 702 -73 -224 612 -153 -390 399 215 -385 129 505 41 -183 222 107
2927 107 -276 -5 -9 -413 -20 -32 -28 -170 52 -116 -305 114 -116 -249 -53 -108 -474 44 329 -49 -107 719
2949 719 474 -468 318 565 -365 -404 523 -249 -422 427 187 -581 109 492 -442 -589 99 74 -835 -101 490
2970 490 -459 -289 573 47 -479 96 468 -689 -163 818 72 -208 787 539 -248 51 813 -29 -519 676
2990 676 57 -587 47 227 -450 -157 723 -302 -543 282 -160 -694 -336 -175 -590 -279 481 141 -54 255
3010 255 395 -98 -28 301 -248 -6 262 171 248 686 174 30 286 -38 -405 -316 -150 -625 -309 190 28
3031 28 -502 174 404 -211 -325 428 -199 -276 199 352 -642 283 1010 -531 -17 817 105 -477 312 347 -700
3052 -700 -325 818 -110 -525 394 405 -586 -123 112 -274 -920 331 153 -619 44 506 -240 -261 551 113
3072 113 -247 427 563 -383 -61 653 48 -157 552 269 -347 202 435 -438 -48 16 -305 -340 301 -111 -67
3093 -67 9 108 -209 -36 55 -412 -134 239 -135 61 460 149 -68 209 442 -99 -52 296 -16 -137 351 265
3115 265 -86 289 461 1 -336 386 -55 -777 -97 136 -546 -418 644 98 -382 81 203 -468 -49 342
3135 342 -481 -510 627 250 -523 573 479 -126 84 539 353 -637 410 420 -262 -79 504 -176 -125 131
3155 131 219 -361 -234 155 -402 -443 23 65 -262 133 365 8 -198 360 -130 -243 61 60 -119 201 342 -70
3177 -70 478 363 -100 143 285 -116 -79 111 -76 -133 149 150 -497 -222 381 -120 -369 214 98 -478 -31 272
3199 272 98 -239 585 205 -234 282 373 -359 -48 647 -168 -355 399 638 -410 -122 561 -188 -576 599
3219 599 173 -650 103 354 -646 -276 287 -257 -665 110 -25 -360 -174 257 -122 -218 315 189 -28 175
3239 175 489 67 -134 284 96 -241 49 246 -252 -3 234 24 -55 271 -447 -422 -102 -306 -137 -44 31
3260 31 -269 39 192 169 -268 498 -337 -247 245 85 -129 70 531 -77 223 272 40 -88 225 218 -249 -287
3282 -287 309 -26 -455 472 412 -535 -446 124 -387 -555 31 284 -447 67 497 -380 -139 557 343 -247 180
3303 180 536 -567 -155 923 113 -124 274 189 -344 132 308 -107 -120 71 -198 -387 318 -73 -160 -47
3323 -47 198 -141 -16 184 -107 -266 117 -43 26 -91 137 108 98 111 -119 72 -36 48 -328 -52 210 -56
3345 -56 91 281 248 -231 363 -115 -318 -230 263 -200 -307 347 88 -214 217 17 -321 -173 258 -304 -173
3366 -173 134 317 -158 281 735 -5 -230 186 208 -187 239 106 -322 -124 496 -82 -475 235 145 -382 -421
3387 -421 528 -27 -529 171 -140 -408 106 180 -509 -214 124 -163 -67 68 252 -25 109 199 129 208 147 -73
3409 -73 -55 191 -212 -220 130 70 -195 -127 -173 188 -42 53 -282 -147 118 -151 -123 -125 245 -174 14 238 42 -151
3433 -151 -1 295 -169 -56 379 -128 -37 500 187 -163 270 454 -168 -89 171 -6 -387 4 289 -135 -236
3454 -236 214 232 -259 302 234 -120 -101 297 35 5 410 224 -133 266 309 33 -175 332 -175 -194 199 198 -148
3477 -148 129 212 77 -354 -34 -139 -102 -31 250 -265 -313 212 -30 -160 -80 283 172 -36 60 19 314 254 31
3500 31 -78 299 -42 -19 410 44 -37 89 106 -219 -60 191 11 -148 230 -77 -160 73 255 -201 -103 77
3522 77 260 -18 -133 343 -76 147 231 314 -130 147 101 -240 -128 306 85 -193 221 -35 -222 -196 154 -147
3544 -147 -234 50 -189 -198 50 269 -66 40 216 4 -34 -241 94 -282 -122 168 -50 4 243 298 -238 163
3566 163 160 108 7 148 114 -26 188 107 -26 -77 -68 -131 -140 82 -136 -113 -23 -206 139 14 86 -69 345 323 -253
3591 -253 -93 159 -265 -354 437 369 -271 215 267 -164 -246 258 -110 -75 73 93 -501 -271 141 -150 -165 142
3613 142 -209 -311 -280 -116 -159 -288 193 260 -167 219 13 -21 174 202 53 -207 264 65 -43 327 4 -190
3635 -190 -204 109 17 -254 -29 -284 -101 -469 -93 -263 -67 -117 126 -259 -145 111 -221 -114 197 -114 66
3656 66 164 10 141 245 146 180 209 142 72 -218 166 -51 -150 23 -156 -333 -1 6 -100 -101 128 -34 -375 -91
3680 -91 201 -347 -31 186 -3 90 24 261 -347 4 77 206 -81 105 96 -7 199 292 -223 83 80 -8 -297
3703 -297 -42 370 -186 -569 -130 -166 -205 90 -30 -179 88 6 -234 -121 185 -11 32 196 74 124 46 205
3725 205 -57 -68 289 -31 -49 134 -133 76 7 22 -274 -92 285 -84 116 -75 -175 93 114 77 -70 -99
3747 -99 92 24 -91 113 -31 -65 -49 240 73 60 384 29 12 295 314 -43 -100 187 -5 -68 -189 242 -367
3770 -367 10 111 -286 -72 -109 58 4 -62 -229 -161 -70 -40 -247 59 177 68 152 215 82 23 -30 266 289 -192
3794 -192 383 208 139 -39 141 -89 -12 -2 301 -270 -94 -10 -26 190 80 -128 -60 38 -100 -155 -200 -134 -92 40
3818 40 155 -1 -7 229 150 89 94 16 -251 108 86 50 81 -317 -5 18 -95 -177 -103 -188 -142 -171 -152 -211 140 -22
3844 -22 -106 -73 -155 37 114 23 -213 117 108 133 55 250 67 12 32 196 239 156 -90 -219 26 190 90 -235 -51
3869 -51 -184 -178 -142 122 129 -71 -358 188 -53 158 188 281 181 -17 253 5 -58 102 314 -22 310 69 -229
3892 -229 2 -231 155 53 -205 -190 -137 8 3 65 34 -146 -88 13 254 -36 202 72 -67 126 -195 -29
3914 -29 -99 87 99 -149 243 -92 -41 -197 233 55 154 48 -72 134 78 -95 -223 -322 -61 31 -85 -71 -40
3937 -40 -88 -39 263 8 -83 66 -68 -154 -26 94 -13 -148 -35 -14 60 -27 17 31 3 71 -17 254 -18 -48 -47
3962 -47 15 101 10 -193 -6 -133 -65 -56 -91 -44 -178 119 -99 6 -53 -372 -15 184 -30 -153 -33 182 80
3985 80 21 106 136 -314 81 238 213 -15 26 -71 -117 -48 22 58 -93 64 -152 -176 -98 -56 -172 15 25 -218 -13
4010 -13 202 155 48 126 -38 105 -42 -11 62 -2 28 78 57 139 -133 120 -69 -152 -75 -294 67 33 -225 -124
4034 -124 -15 -190 -162 -85 29 -45 278 -92 65 -100 90 78 74 119 146 165 101 -99 62 -117 108 196 -123 -206
4058 -206 -138 60 109 -7 126 -8 101 -174 57 -60 -25 -109 -97 57 -79 155 -125 28 17 21 -69 -32 -118 16
4082 16 346 82 178 90 34 74 -91 -274 -191 -83 -124 -328 -49 21 -211 80 -110 -69 -109 -177 23 53 73 -28
4106 -28 -116 166 67 -41 122 153 -54 -27 9 195 122 59 10 -55 -211 52 137 14 137 125 90 -190 -253 1 -244
4131 -244 -22 86 -145 97 50 11 58 97 -185 -173 156 0 106 156 -192 -84 151 -88 78 22 -80 -108 195
4154 195 142 -63 178 -52 36 -89 -2 8 8 -79 93 -204 -79 -339 54 -25 -29 31 -120 -198 134 -12 134 177
4178 177 -5 105 -134 216 20 343 -61 318 104 -159 206 105 -23 105 -121 -41 -14 234 -118 -213 287
4199 287 -231 81 -114 234 -54 249 -141 -107 161 24 -132 134 98 -72 -175 292 13 32 94 24 -62 -61 -135
4222 -135 -72 135 -9 136 -358 105 92 -9 -410 -212 123 94 -188 1 -27 238 -42 -194 60 38 -13 37
4244 37 54 125 279 100 126 39 -111 -61 159 -80 -202 -34 10 -239 -347 -105 95 12 -7 -159 37 35 -33 -84
4268 -84 -50 -78 -169 -68 -108 128 14 87 11 137 80 14 -11 -27 41 31 171 -250 81 -152 -95 -142 -169 -90 -30 94
4294 94 114 -138 -109 -5 74 -158 -131 102 -136 244 -106 -108 2 91 -45 -42 6 -4 60 226 143 -69 134 56 159
4319 159 184 101 242 39 -197 166 134 -82 -108 126 -116 127 49 -113 1 40 -44 -193 -182 314 292 37 197
4342 197 50 95 66 -16 150 -52 92 -30 -245 -31 -182 -151 30 -16 -208 -161 -213 -180 132 50 -129 -61 -19 14
4366 14 -71 241 231 -27 -60 50 33 33 91 13 -110 -12 220 157 173 93 -16 26 -278 -105 223 -148 -47 236 -204
4391 -204 9 -103 108 -17 262 -182 136 165 -78 114 79 240 -11 102 19 157 -37 39 119 266 -165 20
4413 20 128 -24 -44 159 20 15 168 5 148 -57 -90 111 -227 -63 87 -207 -156 45 11 -157 170 -3
4435 -3 -83 267 -67 184 30 -106 -111 287 218 101 -53 43 -175 -28 -120 49 -94 -154 182 130 -114 -98 -25 72
4459 72 44 -58 61 -17 97 184 -156 158 120 -163 -101 119 -4 65 161 -16 -57 77 -136 -62 87 274 -91
4482 -91 -256 -57 -14 -46 -131 -27 174 36 -53 -318 -40 169 -118 264 -19 136 -12 20 -30 139 144 -18 55
4505 55 -168 -207 -154 90 36 -129 175 -285 -115 218 180 -173 -53 -121 41 3 -37 -116 -5 -31 -88 90 86 68 -47
4530 -47 198 81 14 25 98 -47 -113 227 74 44 163 -4 -3 42 6 -366 -115 44 0 46 -199 -29 -36 146 60
4555 60 -417 -211 -93 -9 267 -13 55 -17 -27 241 181 60 -267 38 251 5 167 222 25 74 129 -94 -28
4578 -28 39 179 171 66 -51 71 243 78 138 -22 14 35 -9 -173 16 247 -20 29 169 -132 175 186 58
4601 58 269 78 -6 164 232 355 -160 -37 92 64 5 -195 -22 -43 -281 -29 250 1 41 5 120 43 169
4624 169 -12 332 -28 -75 189 24 -114 227 -62 197 84 15 -332 -171 -22 46 78 32 70 129 28 -18 -111
4647 -111 -26 67 54 -94 -260 -117 -170 -12 232 -61 38 -3 116 -101 -157 328 279 23 43 90 -40 -18 47 18
4671 18 21 -39 57 -71 -33 246 -18 199 -182 -368 -364 -14 140 25 -182 127 83 327 -30 -175 -3 34 -18 62
4695 62 38 48 30 -18 300 80 -20 -15 194 -215 -81 42 -72 -179 173 17 -66 52 255 -199 -87 -160 -112
4718 -112 37 -251 -110 -258 13 58 332 88 -81 9 81 -43 -250 -105 171 217 65 -119 285 63 32 3
4740 3 -30 -175 -142 -42 -60 79 -264 -130 10 -373 -203 -67 62 63 -165 -279 55 104 -206 -109 -81 42 -10 -27
4764 -27 117 -82 -71 -206 31 33 82 -68 -115 54 -205 -58 -230 -178 -71 -152 91 -30 -69 141 72 -195 118
4787 118 37 -87 -225 39 45 208 46 165 -36 7 139 118 -36 -54 183 -95 -13 -110 -15 -32 -101 -51 -53 35 -84
4812 -84 39 -22 -3 30 -32 46 -201 -9 -288 -76 101 138 114 -202 208 -188 106 194 159 151 -109 -20 -47 203 -21
4837 -21 176 -163 -219 -179 121 46 -210 187 -99 -77 -43 330 21 158 26 -83 -180 19 -14 -89 -121 -54 -112 -92
4861 -92 96 -77 -32 71 61 -8 -47 -36 -133 -66 296 -160 -42 -73 -18 84 -11 31 -19 -217 185 100 -150 -219 217
4886 217 65 -226 132 -95 90 45 -78 -146 106 51 -271 83 -304 162 45 71 -9 54 178 -62 -146 -143 208
4909 208 -114 94 -269 135 -55 -33 174 -181 130 -65 53 -293 1 -109 57 0 69 123 -18 -132 -90 -90
4931 -90 97 123 13 -172 184 54 -102 -181 -55 69 -108 -24 -199 -203 34 -16 5 -119 -37 -124 -151 100 142 66
4955 66 -52 -62 148 -157 305 138 115 82 86 198 29 90 -211 -207 -17 -185 -135 321 -110 -12 114 -166 -160 164
4979 164 -31 -8 38 48 -87 -15 -108 -27 -172 117 -7 115 -22 -51 143 174 8 105 -190 21 -109 -185 17
5002 17 -170 128 -106 -27 -331 306 -107 -303 62 -25 202 41 -72 76 -28 -169 -103 -26 189 123 28 74 -264
5025 -264 253 -187 -123 -102 -147 152 284 8 110 88 41 79 -112 41 -125 209 -269 -378 307 64 -156 101
5047 101 -149 100 -23 31 -36 32 -53 -27 -361 -40 42 13 -139 -122 335 -86 -12 -18 -9 51 -98 48 -84 124 38
5072 38 -171 235 -75 -179 224 28 -26 -16 237 -131 163 343 21 -3 65 172 -179 -70 55 -127 169 -39
5094 -39 131 -302 30 197 -118 -48 13 -134 -71 -79 -49 -44 -206 107 12 -58 -134 13 103 -132 -45 121 -55 -179 -15
5119 -15 28 61 -155 -145 -111 -43 185 68 -3 12 60 -45 3 15 35 -68 49 11 130 -92 -274 -35 302 -22
5143 -22 126 -76 36 -86 -117 -51 -228 54 -45 -1 3 -45 -71 103 17 23 -34 138 -173 20 131 -64 -238 30
5167 30 51 58 70 9 -263 -14 -66 77 183 -212 76 -114 96 -403 -130 3 -92 -143 51 31 55 109 228 -23
5191 -23 -119 -85 14 78 -159 -137 5 -160 120 -199 48 -71 154 50 143 162 -150 12 183 17 -123 -111 -113 239
5215 239 120 55 -90 -81 -163 199 44 293 -89 -3 75 84 -47 -10 -20 -119 -203 96 -80 -99 -74 -72 154 -59 148
5240 148 66 -35 182 -29 21 -67 157 167 51 -1 -73 73 -30 -82 42 103 -38 52 104 -203 -149 273 -24 -219
5264 -219 32 195 40 -60 -221 -21 205 96 111 106 116 35 85 28 176 163 -177 76 12 91 77 68 -10 -92 -15
5289 -15 53 66 80 -25 69 -31 81 -106 -1 51 111 -116 -195 -26 -71 -194 -75 206 42 -38 10 -45 -124 200
5313 200 -127 29 -214 -102 -75 36 116 133 -229 -41 -146 159 150 37 -15 106 156 272 -128 104 -35 -126 104
5336 104 80 -46 -230 91 -1 62 167 185 1 -24 89 203 114 268 -231 156 -127 -126 56 -212 -151 -7 97
5359 97 14 73 -169 144 128 140 90 91 73 -65 -109 -74 266 36 -20 -106 14 -44 280 -36 15 96 14 14 -94 70
5385 70 -53 96 168 -160 29 121 -53 53 -207 -106 53 -78 -153 12 17 50 117 162 80 -7 52 25 117 50 179
5410 179 -33 -35 34 -21 33 250 125 144 254 -41 -51 -117 83 -31 9 -26 -106 164 -115 -115 73 -48 -55 -29 176
5435 176 14 -81 -67 79 -9 199 25 -135 76 156 134 -62 327 -22 -3 30 155 98 -119 -7 33 120 -26
5458 -26 61 -71 96 -13 110 124 4 -30 -89 -209 -234 -64 -101 -3 30 87 -20 -86 52 -82 -51 162 223 -67
5482 -67 178 -73 67 -40 -20 36 -206 -110 181 109 137 8 42 186 -272 62 23 -100 69 18 -53 -69 104 93
5506 93 -112 104 216 -66 111 -1 15 -146 -206 -157 -146 137 77 -40 -57 -34 -21 -130 52 51 -184 -63 -81 -12
5530 -12 168 -97 117 -103 269 12 57 -227 41 10 -129 -109 193 -97 -100 8 29 -175 195 -93 29 -34 47
5553 47 109 -360 -42 -15 75 2 54 165 -11 262 122 147 110 -37 -27 94 165 -245 -70 66 204 -123 275
5576 275 -50 -278 69 -9 143 -7 -125 72 133 73 -85 120 -149 10 15 67 5 -74 74 43 -7 94 40 92
5600 92 131 39 -254 -204 -5 132 35 -5 -111 -18 209 170 -155 -186 -77 72 114 78 -107 175 65 -249 -176 113
5624 113 83 -157 -32 -45 275 182 80 -49 -158 187 -60 -142 -131 28 -153 7 -169 94 225 -101 -203 72
5646 72 -72 -217 -16 -26 0 121 -37 -19 52 98 117 93 -66 203 -38 6 36 71 -15 34 66 -105 96 -126 -38
5671 -38 46 -206 -7 -260 87 -166 -110 109 -12 -105 -5 -106 -35 28 48 -114 -147 -267 -14 -6 143 -210 18
5694 18 76 155 15 29 -21 -24 44 44 -69 148 22 -8 175 3 180 32 -136 -37 -14 24 81 -22 -249 -68 -22
5719 -22 -134 368 -61 56 -72 -13 -25 50 138 -105 46 54 179 35 192 86 -136 155 107 225 87 5 12 52
5743 52 -259 -92 134 -139 -96 -79 -139 82 -70 73 -157 116 41 -18 56 -58 -61 287 120 207 -270 143 138 -265
5767 -265 61 -127 80 -171 130 -40 -95 209 17 149 144 12 22 249 -28 144 -77 -44 65 -38 -7 -15 155
5790 155 -172 -3 320 -126 -100 2 103 -71 410 -23 -130 213 70 81 -126 299 66 44 44 -206 -107 58
5812 58 -125 -202 -14 110 -112 108 68 -20 198 255 -49 -208 -30 27 115 -115 22 -105 -22 59 -54 -5 -281
5835 -281 95 -4 -99 -46 9 28 -13 138 53 105 103 68 -103 117 -143 105 -126 -126 -95 -69 -34 46 169 123 -31 192
5861 192 24 -191 59 66 201 68 -67 -38 18 0 -190 14 -217 106 48 46 -195 166 36 -22 57 -23 32 0
5885 0 10 -198 35 -196 175 -382 -14 198 81 79 157 31 -130 -81 129 124 -155 -45 -120 10 43 114 -221 165
5909 165 -219 242 -74 -113 -81 181 -20 -11 -8 -83 -160 54 28 -48 -154 15 -138 96 -79 136 19 78 -41 172
5933 172 -62 -79 -326 -41 30 -98 29 -3 -147 10 237 -320 -30 -3 -152 -36 -35 -10 -241 99 -75 95
5955 95 -7 -315 -86 -88 -127 175 -32 111 63 -148 1 -60 85 -169 115 177 129 -41 -2 87 180 -25 14 -16
5979 -16 147 -103 -95 -11 71 89 13 45 -23 13 110 28 -271 -37 219 -90 -59 -92 -96 -73 123 96 -194 162 -26 -93
6005 -93 111 -210 104 20 -135 144 -167 93 119 -56 141 88 81 -16 -59 30 -45 76 21 -7 292 167 -94 -271
6029 -271 138 -44 181 -168 71 81 -3 5 -21 -189 -97 -55 -73 -219 -151 22 -285 -26 174 278 -295 40 -39
6052 -39 -85 -195 232 51 0 165 -264 118 -55 -302 137 -65 96 108 108 -52 -201 159 -103 96 200 -92
6074 -92 67 88 160 -11 212 114 45 -40 60 43 -185 -66 -100 147 96 91 64 42 -63 -127 -189 -150 68 27 93 209
6100 209 -31 122 -77 -25 -94 -20 26 -61 69 -82 249 -20 16 284 3 23 -19 -57 79 -72 -57 -148 213 -35
6124 -35 243 -162 -227 245 181 188 106 -57 220 57 -129 -67 31 -48 -56 64 161 -26 263 49 -4 126 118 -262 8
6149 8 -265 -42 -29 92 56 -21 50 -150 54 107 1 74 8 57 89 16 134 48 -222 -91 45 -69 6 43 140
6174 140 -65 -46 165 -122 -168 46 31 51 -14 96 -194 170 30 -135 -16 23 98 151 -117 178 -97 133 97
6197 97 -43 -193 198 247 -13 271 -127 101 191 -61 5 38 -215 31 -1 253 -50 -95 -93 -34 206 15 15 4
6221 4 -77 -78 96 -107 -58 166 24 70 -272 -38 -89 28 -169 203 -259 -248 76 10 170 -103 -255 59 -202
6244 -202 -21 54 -106 -101 295 -32 -11 -88 -13 -105 250 -36 -23 141 31 175 -74 -116 -115 39 38 160 -28 -5 7
6269 7 93 -53 97 -32 -64 87 -176 -105 297 -270 70 47 -65 -22 16 194 -217 57 -25 -33 239 -131 39 -169
6293 -169 164 -20 -25 226 91 110 -190 76 2 -7 -69 -51 77 -88 -92 -39 32 182 23 -177 -215 -222 139 14 -249
6318 -249 -64 -94 -135 72 163 61 123 137 -17 -75 157 120 -70 35 -137 -48 67 53 -133 9 90 -201 21
6341 21 -207 -85 31 4 91 -164 86 96 -116 -57 -114 -61 40 -119 61 8 233 334 -11 -12 -16 -45 162 163 87
6366 87 -212 -2 -91 104 -82 175 58 -25 -61 -186 100 -97 91 -24 10 -68 29 -133 -60 -6 -250 36 203
6389 203 80 -44 24 190 160 73 -28 2 -120 -145 16 -218 -147 -65 126 320 -468 61 -119 -190 20 -1 -10 68
6413 68 -69 144 169 104 -31 69 46 95 47 -193 128 33 104 10 -11 144 52 31 46 18 52 18 207 -5 -36 -209
6439 -209 11 -47 97 -113 -172 139 130 -42 199 48 12 162 14 -38 -165 -216 366 29 171 139 -19 114 173
6462 173 -150 149 -47 126 -250 39 -16 -140 141 -31 10 253 55 -79 -86 -108 36 -121 103 217 150 -217
6484 -217 -23 -66 -24 -124 -149 61 -15 135 18 106 -13 179 183 -106 86 95 -24 178 62 314 33 -63 -102 -20
6508 -20 -85 155 -86 39 -117 0 -221 -154 -46 109 -56 127 352 -85 81 -45 -50 95 -30 -90 44 -93
6530 -93 146 -196 -36 104 -79 -78 55 214 61 -145 -53 -88 -199 9 267 49 16 64 85 -182 198 -9 -29
6553 -29 -36 -1 41 -134 -56 56 -65 -136 -305 69 33 -36 24 78 -233 212 -190 94 -10 -35 -477 84 72 114 -19
6578 -19 -111 -168 -153 46 -41 82 -169 -85 -87 56 113 -91 -74 49 107 -228 -43 -27 79 34 -67 -118 -19 -110 -136 236
6604 236 163 162 -148 18 -299 2 -68 -11 -62 -70 -72 201 -184 93 92 -343 -203 41 127 -89 -309 -124 -84 66 34
6629 34 -95 59 108 -89 53 -131 -193 38 -40 95 -147 -94 -101 -89 -48 66 -97 -79 -455 -159 -130 132 -46 -161
6653 -161 57 -5 218 -198 11 468 -107 -103 -330 60 179 -123 -39 22 -177 117 224 -3 -244 149 -198 -187
6675 -187 62 -11 -1 -10 102 -182 166 -64 42 -187 81 -54 -77 -24 -41 -221 -62 82 -29 50 127 -15 57
6698 57 207 51 18 -266 -17 78 -3 83 193 -158 -181 231 248 169 -133 137 105 -27 58 148 -59 -31 56 -77
6722 -77 -246 39 -159 -218 11 -213 -22 1 95 -159 36 3 -166 -161 -121 -54 -26 -164 136 193 65 -28 113 68
6746 68 -130 65 -35 279 -34 9 -24 -1 -153 26 85 -104 -82 64 68 -33 19 -3 -51 -70 -58 34 50 -23 -196
6771 -196 -79 195 -90 -108 53 -104 43 -181 -7 51 -144 -206 252 212 -209 -36 -95 -43 -40 34 155 192 -137
6794 -137 64 114 -25 -51 35 -170 49 -207 -344 -19 -29 20 -70 24 -203 -177 -148 -81 109 215 -13 3 -231 -52
6818 -52 -204 34 85 89 88 149 177 -75 -103 -346 96 -211 -134 44 251 -276 95 80 48 -199 -81 -33 221 -169
6842 -169 152 -307 -129 50 160 103 134 143 -59 229 151 -86 37 11 -20 124 131 57 290 0 53 20 99 -123
6866 -123 -167 -82 -357 119 -237 190 -55 -189 -26 190 45 8 -67 128 9 207 -147 -161 11 80 58 -37 138
6889 138 37 229 -40 57 -69 259 -143 102 85 19 -123 159 31 -182 68 -124 -26 -1 -137 43 -51 8
6911 8 -85 50 74 -13 -8 16 49 238 -147 77 41 97 196 17 2 -401 39 -67 -54 93 -117 279 -46 218 -49
6936 -49 -10 97 31 -93 -309 -134 -212 59 129 97 -156 300 39 141 70 -4 -91 112 -187 -80 61 -81 -207
6959 -207 -210 94 -126 -260 319 -1 57 -107 115 -236 56 63 190 232 -98 35 -47 21 73 148 -36 97 3 76
6983 76 150 106 -124 30 18 148 -36 -37 52 17 -158 -80 -98 81 -130 -187 92 -57 -56 97 -46 127 78 65 -25
7008 -25 123 19 90 -137 -87 146 -75 122 -136 -172 146 -29 143 -156 7 -14 -47 -171 -112 -140 -207 71 104
7031 104 51 -6 -113 -305 91 152 -73 13 -238 214 -36 155 -221 -137 -5 246 -156 -22 5 -16 -33 10 -127
7054 -127 32 -102 153 102 19 -95 -41 68 11 -92 -189 -168 -322 41 -17 64 -50 162 2 138 95 -293 -234
7077 -234 378 82 63 24 -25 89 234 -128 57 136 9 -64 -99 -11 19 -136 87 -89 93 -212 48 -167 -68
7100 -68 82 103 127 191 50 -323 51 174 -149 -86 -64 -85 -10 39 61 -139 38 -206 185 -131 53 -168 91
7123 91 3 112 -10 145 211 35 -33 -166 77 49 63 175 -99 65 109 27 -205 1 68 175 -175 -142 -131 1
7147 1 -33 50 102 -71 -191 -45 103 87 167 28 64 88 -152 -25 -97 -74 130 -191 168 -261 -64 63 174 -81
7171 -81 -28 163 -82 -193 172 -278 -65 220 36 -226 -151 -126 -36 -92 -151 53 78 -129 202 -92 -74 -56 -295
7194 -295 38 86 -73 -175 -155 289 96 109 87 76 -120 -14 -222 -132 111 -142 -35 -218 -39 23 -136 38
7216 38 -101 -121 123 -192 -11 -7 6 -63 -205 -215 -109 235 262 72 4 75 225 -53 20 84 154 15 -122 29
7240 29 62 119 -247 -26 -96 18 52 -17 -112 -30 -73 -12 86 -182 -89 -16 63 110 -133 -46 43 146 147 164 17 2 16
7267 16 -113 222 252 114 140 213 -148 165 -104 145 -164 11 34 -189 95 158 212 -93 51 183 51 -17 4
7290 4 12 -14 -38 6 212 252 20 166 -80 69 24 -196 -125 -111 86 275 -108 35 172 -207 -1 57 83 0 -206
7315 -206 15 117 -31 -51 -70 95 118 21 13 293 83 175 141 -272 -26 3 170 196 176 -46 159 -240 -25 22
7339 22 -174 -208 14 181 -217 45 75 -121 149 99 -228 124 26 -41 -219 49 86 -126 -153 208 0 50 114
7362 114 -260 -22 306 -288 -140 -7 157 17 -33 19 159 75 131 90 115 241 110 -48 111 -152 -25 -74
7384 -74 166 -21 -112 38 -32 -8 -208 -22 -35 205 118 219 -21 -170 167 -113 131 130 15 24 98 -4 125 -14
7408 -14 98 76 -97 14 335 -226 -10 7 -93 -44 -11 12 -61 -1 55 -64 38 181 -54 124 -14 2 94 286
7432 286 104 80 -109 -119 -145 135 203 -135 -166 -8 -142 227 177 217 -99 -177 130 -346 -91 -103 93 12 20 5
7456 5 58 27 17 166 7 19 152 4 -109 -67 -44 -97 54 84 203 127 282 -226 45 82 117 187 7 110 96
7481 96 -201 127 -107 198 -54 -99 -129 -145 182 -72 -63 -48 1 -102 239 -251 112 -34 29 5 -42 -134 23 -15
7505 -15 94 58 84 -72 60 262 95 162 -99 89 116 -137 -56 -42 271 249 -78 37 -45 -56 -80 142 16 -128
7529 -128 -87 -5 10 -123 7 43 -7 -85 -175 49 -12 -43 43 -63 -50 -164 -5 -81 -186 -69 -196 -80 49 66
7553 66 45 -179 -79 9 -63 13 66 -19 -91 146 41 31 221 179 177 -25 -141 -145 200 64 -85 46 274 194 -268
7578 -268 10 -82 41 -15 112 -55 -7 137 -165 315 -175 -51 40 92 -88 134 -62 108 -140 0 134 -258
7600 -258 -34 104 84 82 -25 -78 -176 -56 -4 110 243 -40 -155 -138 -53 48 -55 140 15 -73 26 -42 252 122
7624 122 -76 243 267 205 -52 70 -62 147 -127 401 -169 -32 -159 63 -187 -191 -23 -55 168 -197 -44 -276
7646 -276 -260 -52 -102 -94 -147 178 157 270 -29 31 -195 377 -156 240 98 61 22 197 -29 -256 163 120 -68
7669 -68 87 20 27 -263 26 102 -102 121 100 102 98 13 -148 11 43 191 109 349 44 43 -107 123 129 -231 -71 61
7695 61 104 304 15 26 75 41 -1 300 144 125 15 -4 -252 -46 -114 25 202 -248 53 -32 -71 36 35 -117
7719 -117 130 78 129 -98 -271 74 -11 -128 -88 263 219 62 -7 120 34 235 -211 257 -106 -205 -143 -135 -119 -129
7743 -129 -5 125 146 -263 -297 -124 -158 -80 -107 -125 -25 -94 42 56 -69 122 76 -91 116 -93 -63 -76 -111 -160
7767 -160 -107 -49 31 -85 -66 -15 -168 -17 327 165 214 -214 -66 -53 370 -126 -312 97 -8 -204 102 209
7789 209 157 272 70 38 -36 -448 3 -201 -90 -47 -6 -19 -153 -55 -247 -105 -160 124 -102 -33 32 -198 0
7812 0 144 -89 27 200 -301 -232 69 -179 -41 109 45 -87 205 140 117 35 -157 122 60 -186 3 82 106
7835 106 30 156 -50 36 115 170 -207 -43 33 -234 -45 -194 9 154 -153 -225 82 87 -122 -110 -23 -8 -1 -55 77
7860 77 -48 -218 44 194 -31 103 162 52 142 -86 -148 43 60 -222 148 -32 15 109 13 107 -187 52 68
7883 68 14 51 63 133 -231 -179 65 -60 -33 -1 -3 -82 64 332 160 149 -64 -351 -119 89 -117 87 43 -69
7907 -69 -182 228 169 40 -173 183 -217 -111 52 -236 -95 49 37 111 -45 -117 74 83 29 31 182 5 -65 19
7931 19 -1 -112 146 -144 -124 2 -186 14 -26 1 157 42 -54 63 -29 -113 96 -82 -119 142 120 -35 -62 161
7955 161 154 314 -12 16 161 105 -33 97 -208 21 37 159 132 -26 -39 -66 42 152 317 -121 -90 -74 24 -212
7979 -212 -105 -66 45 -85 -40 375 72 240 -61 83 -77 195 37 121 305 -157 88 19 116 96 -14 -44
8001 -44 -238 63 -72 26 -96 88 157 -239 -3 222 -259 38 190 109 39 270 -214 -122 129 116 -88 -28 -166
8024 -166 81 -41 -27 -60 159 115 -1 -31 105 -29 -210 71 1 -41 -65 24 181 -47 -46 -252 51 79 63 -20
8048 -20 148 -9 -81 98 102 -198 -115 230 -365 -139 215 -6 -229 -412 -177 -127 -350 53 37 119 -38 -175 40
8071 40 -93 -24 43 61 -40 168 -351 199 126 -75 46 -24 176 -47 27 197 42 -89 169 -202 104 15 51
8094 51 -195 66 -1 40 80 -188 -114 44 120 -57 -144 255 -57 -8 -10 -34 214 56 -148 43 76 57 86 -136 151
8119 151 -130 279 210 30 58 -111 275 6 -28 7 27 -183 -81 -251 -125 138 -79 -11 -98 -13 -25 8 -150
8142 -150 148 -120 -185 -222 75 55 23 157 -208 274 -198 13 -49 -7 -130 -5 -212 315 63 -46 -60 -12 -289
8165 -289 -140 157 -89 139 41 20 56 -149 -199 305 -65 -142 -72 115 -97 -123 3 64 -48 18 -192 48 -24
8188 -24 164 -3 139
8191A39
$$ Imaginary data points
##PAGE= N=2
##DATA TABLE= (X++(I..I)), XYDATA
0 0 0 0 0 0 0 0 0 0 0 0 0 0 0 -8 8 -8 8 -8 16 -16 16 -24 24 -32 36 -40 48 -56 64 -74 84 -96 108 -123 139
35 139 -156 172 -195 217 -242 269 -298 330 -365 403 -445 488 -540 594 -654 722 -795 877 -968
54 -968 1071 -1188 1326 -1481 1661 -1882 2149 -2483 2913 -3489 4302 -5534 7595 -11664 22540
69 22540 -108856 -236238 179335 75575 -231515 8256 179822 -86808 -73691 128437
79 128437 32513 -65879 39704 37317 -27300 -6602 6070 -3931 2095 -16258 859 18031
91 18031 -26415 -17406 28647 -26690 -40491 37652 6969 -46816 30872 44942 -32239 -1178
103 -1178 41070 -18113 -28867 6339 -12020 -18291 -1911 -7388 14105 25918 -5580 18803 45403
116 45403 -12624 -13855 38187 -14660 -49524 23859 8453 -56779 5437 41830 -35458 -24262
128 -24262 44622 522 -42755 12601 30090 -20604 -18800 29210 22611 -20973 -6419 32226
140 32226 -2922 -38371 6454 15497 -32691 -7632 29892 -6966 1069 41413 1004 -9663
152 -9663 41341 -3234 -48320 20542 13377 -65058 -9230 44093 -32544 -30289 48570 9638 -34322
165 -34322 21016 23589 -23998 -4035 16469 -6481 -5559 7294 3477 2114 -2515 -3016 6335 -9038
179 -9038 -14662 13051 3759 -18199 19149 27790 -13268 5614 32498 -11122 -20706 11173 -12242
192 -12242 -29882 -1082 -7040 -16016 10087 3792 -4642 23105 8588 -15918 18139 11837 -30747
205 -30747 3201 24143 -27985 -11520 37110 -9091 -26806 32771 12876 -37645 9674 31184
217 31184 -24463 -14385 35967 6271 -25231 13431 24627 -21019 -24930 13960 -1449 -41298
229 -41298 -9345 26613 -16104 -25062 38175 25890 -29995 14498 44759 -24207 -25497 35746
241 35746 -3265 -43335 15831 23831 -29141 -2423 32804 -6425 -14619 18215 5021 -15080
253 -15080 1966 5844 -5330 -2413 1493 142 -1410 -6950 -6051 -1949 -10795 -10523 1672 -402 -2690
268 -2690 10244 13093 6530 10615 11056 3509 -215 -4349 -4969 -3212 -11454 -7431 9053 -1484 -9469
283 -9469 16867 13109 -16516 4861 20964 -19465 -16912 22713 -5995 -30010 16108 15260 -29155
296 -29155 -2005 25644 -16961 -20624 22175 5054 -21662 12134 26055 -5816 -2154 24033
308 24033 7606 -15121 711 8219 -16095 -18341 6227 68 -17789 5311 20111 -7860 -4524
321 -4524 23466 243 -21452 8866 8333 -26554 -6606 18259 -12600 -15049 19772 5465 -16706
334 -16706 8752 13820 -10852 -2072 13935 656 -2564 9775 5690 -454 1879 -2259 -4596 -4055
348 -4055 -10419 -8449 518 -4101 -5946 8851 9762 -2093 5178 12642 -2999 -9645 3333 -1661
362 -1661 -16680 -5295 8010 -6322 -9019 14155 11452 -10657 3864 21120 -5915 -14286 17641
375 17641 9472 -21779 2698 23533 -13205 -17875 19795 2016 -30317 2110 17634 -21230
387 -21230 -13182 26220 3741 -19518 17062 22551 -18533 -9232 20916 -7469 -27919 6398 11562
400 11562 -19920 -5977 24029 3450 -11223 16320 18130 -10919 -3177 14940 -3803 -14699
412 -14699 5195 4878 -11574 -2851 7619 -5281 -8512 2923 -725 -7606 -314 2900 -359 1973
426 1973 4036 3365 4329 -203 -3525 2028 -2072 -11447 -1097 6160 -7070 -2216 17501 6226 -6275
441 -6275 14096 13780 -12605 -3842 12790 -10313 -18661 6930 2438 -18601 -863 13655 -8619
454 -8619 -9911 12573 3483 -14111 3225 13597 -7098 -6872 15828 6397 -13462 3973 14868
467 14868 -11455 -13471 13337 1902 -18465 7087 18533 -9567 -2650 22772 698 -14709
479 -14709 10840 4678 -22537 -5261 8407 -15428 -12685 12042 838 -10980 8356 11601 -5793
492 -5793 -972 9301 488 -4915 2112 4719 -179 -1875 1980 3590 -1860 -3896 1734 513 -4929
507 -4929 -366 4723 510 4 5526 4131 -1555 -2398 44 -2696 -10042 -7240 1670 -4668 -9811 6597
523 6597 10321 -6687 2314 19022 -1239 -11040 13401 6635 -17831 1176 14582 -11858 -9474
536 -9474 16452 1214 -15338 7562 10755 -13123 -4940 13513 -1431 -11394 7677 10570 -9206
549 -9206 -6057 10779 -2413 -17165 1173 7226 -14596 -7525 16065 824 -10444 15643 14259
562 14259 -11554 3004 17124 -9679 -11699 11837 -1804 -15932 5376 7762 -9711 513
574 513 10059 -3176 -3237 5334 -614 -3337 635 -1234 -896 1015 -3397 -1492 1895 -5405 -5324 2664
590 2664 -2654 -5776 4675 5007 -1634 4714 9690 2159 -454 4247 2929 -4724 -6794 1184 644
605 644 -10808 -3298 11691 -2350 -10543 12794 9988 -15882 -248 16986 -11319 -15427 14420
618 14420 2001 -19600 4898 12769 -13293 -5524 14217 -2637 -10881 9901 8095 -7243 2736
631 2736 13570 664 -5624 6791 6704 -9633 -7603 6829 -3125 -15143 2437 9128 -9652 -3265
645 -3265 14448 -813 -9124 9354 3410 -12772 1262 5419 -11411 -2789 8294 -5479 -3762
658 -3762 9801 497 -3783 7663 3467 -3414 5790 3793 -2980 4519 3260 -5759 704 2624 -8238
673 -8238 -4843 1744 -5745 -6271 2736 345 -2165 4155 3738 272 2489 1718 -1453 -1873 -779 -1451
689 -1451 -3394 -2285 4038 1740 -4212 5619 10734 -5698 -2906 15022 -1007 -14243 9782 9618
703 9618 -17610 -3190 15951 -9892 -15355 12289 1702 -18267 3131 11033 -10509 -3580 13939
716 13939 1070 -7464 7874 7855 -7204 -3953 6424 -1247 -9970 184 7893 -3725 -5198 10436
730 10436 6636 -7032 2612 10154 -5063 -6418 6374 -941 -9215 796 1570 -5985 -1358 1329
744 1329 -2561 -651 -4 -1263 2665 1233 -2257 5065 4741 -4893 1865 8208 -6243 -6389 8021
759 8021 -1450 -11373 4699 7927 -6974 -1010 11921 1550 -5968 5533 6451 -6797 -5855 4387
773 4387 -712 -11126 -1361 7544 -6114 -8533 9893 4416 -11248 3665 12230 -8034 -4884 13880
787 13880 56 -10841 8456 6988 -10932 -176 9182 -6468 -5865 7750 404 -6061 4644
800 4644 5538 -2129 1045 3953 -509 -2992 -1983 -1417 -3441 -5533 -1764 814 -3593 -1692 5483 738
816 738 -2613 5431 4463 -3318 1741 4954 -2315 -1285 3460 -941 -1531 1643 -877 -874 1112 -2144 -609
833 -609 3719 -1758 -1999 5463 -384 -5423 4101 1334 -8696 -935 3176 -8808 -4618 6488 -2789
848 -2789 -6211 8087 5497 -5414 3918 9589 -2761 -2736 6754 1061 -6822 975 4861 -4324 -4906
863 -4906 5302 1990 -7542 95 7631 -3965 -6709 7461 3432 -9770 727 8503 -6542 -7737
877 -7737 6884 -48 -10163 2007 5878 -5214 -981 8410 1437 -1581 6004 4562 -1902 103
891 103 2934 -1244 -4055 -788 495 -2932 -3164 1436 1189 -3112 -304 3548 -1012 -3279 2100 1523
907 1523 -3017 -1470 2028 -576 -2836 -323 1433 -787 -2246 1433 3680 -1312 -798 6801 2734
922 2734 -3677 3753 6399 -5067 -3577 5832 -2402 -9207 2462 2904 -8061 -1418 7452 -2686
936 -2686 -4887 7150 3154 -6604 1206 5614 -4161 -4668 4469 893 -6323 455 5395 -2902 -3499
951 -3499 5867 2631 -4527 2534 6876 -2377 -2410 6512 973 -6241 1801 3151 -6928 -4156 3775
966 3775 -2285 -5696 2531 2855 -3168 396 4210 -9 -1634 1556 745 -1700 -1675 128 22 -1657
982 -1657 -1088 1818 1127 -1034 1780 3825 -277 -157 3981 1300 -2635 1429 2543 -3621 -2700 2216
998 2216 -1298 -5408 -467 1802 -3275 -2795 3440 1767 -3665 1550 5408 -1927 -3503 4343 1597
1013 1597 -6650 304 5595 -3770 -4302 6741 2172 -5622 4025 7490 -4205 -1749 7971 -509 -7324
1028 -7324 3000 3442 -7662 -3322 4679 -2892 -7091 2072 3094 -4753 -1730 5469 497 -3377 2859
1043 2859 4944 -2034 -1861 4264 713 -4441 738 3416 -2965 -1739 4339 1095 -2780 2626 3375
1058 3375 -2029 -676 2534 -737 -3269 -516 -479 -2549 -2590 -800 -191 -1571 -1677 1473 1771 -1562 728
1075 728 4332 49 -1797 4405 2646 -3893 984 4379 -3491 -3570 4212 444 -5341 1977 4594 -3107
1091 -3107 -1941 5127 538 -4927 772 3202 -4650 -4571 2793 -148 -6357 -449 4696 -3107 -3275 5864
1107 5864 2414 -4332 3099 6061 -3022 -1762 6088 -381 -4760 2845 2378 -4985 -1143 3845 -2220
1122 -2220 -3207 2811 1933 -2568 181 2853 -368 -2351 526 1117 -2852 -2909 1048 -7 -3373 -349
1138 -349 2598 -1156 -1192 3460 2387 -1756 1712 3372 -574 -1340 2013 675 -2233 -1217 1161 -146
1154 -146 -2815 -283 2839 -1305 -2732 3173 2277 -4088 259 4480 -3027 -3507 4070 -85 -5913 958
1170 958 2858 -4507 -1125 4735 -484 -2626 4217 3413 -2240 762 4136 -305 -2749 1464 2152 -3030
1186 -3030 -2394 2728 -272 -4438 1168 3421 -3618 -2006 5138 -616 -5137 3225 2919 -5625 -1165
1201 -1165 4235 -3128 -4246 2856 917 -3766 1202 2993 -492 117 2788 1920 339 680 1692 1090
1217 1090 -1657 -1020 1438 -1485 -3395 1554 593 -4360 183 2993 -2687 -2358 3457 389 -3578 983
1233 983 2000 -2471 -1974 1280 306 -2328 -320 2303 513 -1500 1840 4110 -744 -1335 4949 1503
1249 1503 -4083 1767 3671 -4548 -2918 3821 -2092 -5854 2266 1837 -5206 -366 4350 -1476 -2828
1264 -2828 3028 1712 -2961 -284 2829 -344 -2781 1005 2868 -1980 -1778 3875 1556 -3151 2210
1279 2210 4688 -2285 -1082 4818 -264 -3999 2172 1182 -4811 -946 1795 -2741 -2866 1324 158
1294 158 -2109 334 1698 650 -593 492 1675 370 -1779 746 2011 -1968 -1155 3042 -103
1309 -103 -2217 2254 2050 -1865 1070 2729 -1165 -797 2183 -273 -2447 9 106 -2199 -1750 9
1325 9 -126 -1741 -937 1691 359 -1573 1728 2964 -1814 -594 3694 -443 -3109 2554 2110 -3896
1341 -3896 58 3517 -1956 -1840 3774 662 -2541 1849 2427 -1845 -882 1709 -296 -2422 -765 830
1357 830 -1305 -2766 464 820 -2529 -875 3164 -101 -2505 3434 2647 -3326 440 4393 -1567 -2696
1373 -2696 2937 1001 -3571 665 2546 -1491 -1187 2325 883 -1246 9 1795 265 -2090 65
1388 65 1531 -2165 -2883 1760 -41 -4189 81 2921 -2502 -1799 3992 763 -2679 2667 3390 -1942
1404 -1942 -322 3056 38 -1937 933 1883 -1589 -1408 1868 920 -2120 -208 2992 -600 -2840 1878
1420 1878 1589 -4263 -1263 2876 -2273 -4200 2549 663 -4582 292 3660 -1815 -1795 3944 1582 -1840
1436 -1840 1182 3211 -144 -1470 1579 2010 -1938 -1401 2316 -5 -3008 472 2250 -2169 -1624 2794
1452 2794 -234 -3150 1216 1500 -3282 -1262 2266 -1490 -2495 1103 976 -1663 67 2695 530
1467 530 -779 1755 2567 -168 -694 2532 1126 -2051 102 2154 -1665 -2792 1781 510 -3283 79
1483 79 2516 -1888 -1583 2238 110 -2297 520 1058 -1448 -1251 1077 -34 -1454 308 1635 15
1499 15 -529 1713 1817 -514 546 2522 -41 -1345 2108 730 -2642 -162 1574 -1853 -2062 1338
1515 1338 -92 -2510 192 1186 -1286 -979 1495 251 -1631 140 1073 -428 -1656 1000 1126 -1486
1531 -1486 -497 2734 232 -1574 2320 2507 -1949 -156 3417 -541 -2153 1668 782 -3153 -491 1859
1547 1859 -1595 -2176 915 577 -2061 -288 1662 -287 -1067 893 1114 -1433 -995 1645 45 -2299
1563 -2299 577 2032 -1552 -797 2953 544 -2119 2039 2505 -1657 -441 2731 -127 -2484 769
1578 769 1099 -2062 -1475 995 -186 -2112 -381 902 -578 -1087 737 1270 -1565 -762 1833 -206
1594 -206 -1675 1216 1328 -2249 -480 2715 -509 -1523 2231 1763 -1869 553 2671 -528 -1586 1565
1610 1565 520 -2395 -687 1229 -1402 -1898 129 153 -1901 -325 1422 -823 -1016 1501 1395 -1572
1626 -1572 450 2246 -622 -1393 1734 849 -1671 545 2327 -780 -973 1696 804 -1426 572 1572
1642 1572 -1022 -1524 838 71 -2228 -519 585 -1465 -1989 548 693 -1760 -262 2103 143 -1397
1658 -1397 1440 1812 -1382 -132 2204 33 -1468 1249 1335 -1191 -753 2027 236 -1598 348 1760
1674 1760 -1269 -1497 1421 258 -2530 -652 1476 -1792 -2244 1274 390 -2578 -226 2371 -689 -1267
1690 -1267 2223 1202 -1471 793 2072 -683 -684 1953 656 -1677 58 1549 -271 -1390 827 742
1706 742 -1296 -541 1484 -4 -1995 364 1012 -1933 -1013 1592 -796 -1906 1114 722 -1654 -68
1722 -68 1996 -242 -797 2029 875 -703 936 1270 -307 -436 467 101 -706 -205 215 -288 -817 144
1740 144 663 -644 -851 1137 -125 -1459 153 1085 -1673 -989 977 -492 -1774 565 901 -935
1756 -935 -322 1544 734 -805 923 1754 -274 -678 1294 801 -1648 44 1694 -1139 -1822 1650 406
1773 406 -2533 206 1971 -1576 -1589 1994 31 -2428 873 1360 -1909 -1109 1875 -115 -1716 906
1789 906 1417 -1117 -482 1938 993 -1218 740 2152 -785 -813 1668 667 -2299 -44 1435 -1281
1805 -1281 -1461 1371 -59 -1768 318 904 -966 -836 1079 -40 -1220 -308 468 -360 -919 33 909
1822 909 -275 -363 1449 868 -1002 709 1970 -417 -836 1998 580 -1813 239 1418 -1682 -1145
1838 -1145 1025 -355 -1684 -179 596 -811 -942 507 594 -1224 -256 1439 -150 -1524 1105 1565
1854 1565 -1402 15 2400 -488 -1065 2613 1503 -1790 1164 2485 -1624 -1026 2118 -658 -2261
1869 -2261 737 473 -2271 -847 1034 -985 -1159 274 575 -974 -190 1202 186 -711 454 1256
1885 1256 -554 -586 1445 540 -1342 560 1625 -846 -485 1531 460 -809 406 931 -480 -1018
1901 -1018 325 105 -889 -769 10 -175 -994 -588 1008 -369 -1163 1117 734 -1552 302 1858 -690
1918 -690 -1025 2077 521 -1519 745 1480 -1108 -738 2082 172 -1498 829 1687 -940 -949 1836 314
1935 314 -2450 -80 1897 -1541 -1989 1926 378 -2590 429 1927 -1252 -1044 2428 126 -2034 1310
1951 1310 1531 -1381 -220 1717 -331 -794 901 296 -1010 -133 389 -10 -352 364 341 -378 -451 104
1969 104 -105 -573 -682 134 -868 -945 189 -336 -641 4 486 -287 24 794 223 13 262 233 355 -209
1989 -209 -131 1094 8 -440 663 610 -1160 -397 1597 -527 -1325 1014 618 -1988 125 1067 -1335
2006 -1335 -1257 1048 -218 -1937 708 912 -1360 -245 1459 160 -431 1098 1371 -916 1 1639
2022 1639 -146 -1542 980 1168 -1582 -314 2003 -319 -1848 1096 833 -1994 -290 1364 -1178
2037 -1178 -1516 852 -111 -1386 447 849 -868 -520 825 -97 -386 660 1171 233 166 612 892 261
2055 261 -51 366 163 -798 -119 648 -518 -743 511 -50 -764 -72 159 -515 -731 51 352 -442 -534 733
2075 733 303 -885 -25 1397 -707 -1034 1637 586 -1356 817 2251 -940 -722 2166 94 -2145
2091 -2145 1026 1281 -2225 -544 1544 -748 -1492 1103 817 -1851 -337 1546 -774 -1473 1244 600
2107 600 -1694 -426 1736 -170 -1196 1255 1216 -1299 -23 1961 -460 -1261 1403 784 -1162 287
2123 287 1121 -466 -848 817 -236 -1253 -87 247 -481 -328 -88 -133 -146 -19 -391 189 -244 -547 435
2142 435 416 -664 -188 1066 -181 -378 1227 514 -843 449 1247 -148 -706 930 390 -1012 131
2159 131 1133 -760 -1054 713 -79 -1348 27 810 -1329 -1034 1534 -68 -1517 824 1165 -1530
2175 -1530 -113 1921 -507 -1285 1331 997 -1292 224 1834 -343 -650 1647 584 -1373 338 1004
2191 1004 -1087 -784 928 -226 -1416 150 869 -1180 -595 659 -576 -1327 375 963 -849 -534
2207 -534 1349 50 -671 646 781 -615 -8 621 75 -219 358 753 542 -188 -57 235 41 -586 -261
2226 -261 378 -947 -936 427 -394 -1363 197 762 -1257 -867 991 -184 -1296 597 1126 -800 -378
2243 -378 1572 398 -1063 1149 1395 -996 -326 1473 -263 -1268 772 1073 -1193 162 1371 -568
2259 -568 -1428 769 73 -1673 -192 1102 -1113 -932 1369 3 -1287 810 1129 -1130 -231 1212
2275 1212 -195 -851 1092 566 -470 171 1105 57 -262 248 -42 -214 -67 91 -251 -176 24 -118 -268
2294 -268 -32 -187 -214 -160 -372 -356 -306 165 -370 87 572 83 211 696 110 -262 510 137 -777 484 837
2315 837 -666 -269 1304 8 -1009 631 363 -1268 -437 973 -661 -1171 1008 366 -1390 40
2331 40 918 -621 -1269 784 373 -1209 249 1365 -471 -549 1715 664 -965 394 1117 -985 -720
2348 -720 1373 -160 -1185 939 1108 -822 -443 1167 -347 -1350 372 161 -1344 -118 726 -584
2364 -584 -556 546 98 -336 54 144 -56 -164 70 319 417 59 575 500 413 -11 388 210 -541 -166 157
2385 157 -3 -581 186 287 -561 -518 795 -218 -1209 -252 335 -840 -624 601 -29 -778 460 1138 -769
2404 -769 -231 1290 -84 -709 1130 930 -1011 667 1719 -330 -772 1472 374 -1541 277 739
2420 739 -1230 -592 635 -532 -1218 317 574 -1227 -263 630 -657 -1185 367 392 -1027 45 1269
2437 1269 -64 -335 1211 618 -637 430 946 -524 -237 900 -64 -408 893 380 -753 -217 176
2454 176 -764 -669 -122 -504 -470 80 -371 159 589 -83 -272 516 0 -640 470 448 -410 232 824 -120 -190
2475 -190 1033 378 -957 -174 982 -448 -1206 686 390 -1535 -356 1046 -711 -1277 721 353 -1844
2492 -1844 39 993 -889 -689 1419 254 -1299 1034 957 -1203 28 1275 -484 -1122 1229 665
2508 665 -1062 46 1287 -460 -580 718 164 -1118 -289 413 -591 -527 372 15 -642 94 612 -564
2526 -564 -577 239 -82 -601 108 277 22 245 463 138 582 343 -410 185 159 -337 -185 629 -78 -92 450
2547 450 121 -682 153 86 -1157 -469 180 -653 -707 490 79 -833 123 925 -432 -588 535 184 -985
2566 -985 507 1136 -247 -304 1396 538 -750 618 1030 -887 -665 1079 -264 -1238 927 1009 -1122
2583 -1122 -217 943 -321 -1341 484 -156 -1425 22 564 -656 -140 1124 166 -626 628 534 -672
2600 -672 -35 579 -82 -163 484 737 -133 183 675 172 -70 96 -125 -358 -392 -331 -172 -124 216 -180 234
2621 234 107 -686 -203 192 -391 -700 546 431 -272 571 1078 -396 -111 1306 9 -825 849 481
2639 481 -1076 372 1053 -190 -491 880 -120 -1068 124 342 -1235 -906 613 -291 -919 482 842
2656 842 -784 -122 1136 -216 -911 869 542 -1215 258 1281 -152 -281 1068 441 -772 200 603
2673 603 -784 -378 589 -350 -310 708 175 -767 0 166 -746 -546 -213 -402 -546 259 194 -239 347 546
2693 546 277 -9 137 51 -124 187 2 36 293 488 17 76 291 -309 -279 150 -183 -926 -165 487 -302
2714 -302 -216 614 -22 -567 515 135 -1094 278 595 -734 -782 1214 16 -326 1044 667 -632 114
2732 114 888 -286 -659 750 376 -928 254 936 -695 -625 529 30 -1166 69 582 -802 -536
2749 -536 514 130 -537 589 497 -977 -247 505 -270 -712 448 533 -414 174 661 -16 137 655 177
2768 177 -416 54 -194 -301 56 291 -15 192 241 -171 -261 -316 -605 -283 -43 -544 -377 251 95 -230 -1
2789 -1 529 -189 -541 485 308 -445 62 1071 -321 -200 1107 478 -702 265 868 -778 -302 601 -671
2808 -671 -1038 783 381 -954 -413 656 -483 -814 758 139 -1026 -332 771 -380 -466 766 295
2825 295 -285 411 546 -381 -219 493 -372 -125 527 406 -674 9 635 -292 -758 -3 -204 -1024 -354 125
2845 125 -201 2 399 213 -371 192 69 -412 140 203 -178 86 500 115 -3 662 157 25 488 -27
2865 -27 -362 337 277 -609 -99 399 -417 -249 548 -228 -611 114 159 -972 -553 491 -113 -662 446 408
2885 408 -638 48 809 61 -462 419 399 -635 541 1154 -234 -124 848 177 -508 262 658 -710 -323
2904 -323 703 -279 -955 631 478 -512 -275 572 -443 -813 306 46 -322 30 375 62 -204 474 207
2923 207 -144 153 291 -228 178 441 -87 92 76 107 178 111 -59 -397 -235 -191 -430 -272 325 -442 -276 492
2945 492 84 -291 137 186 -972 -266 429 -363 -307 658 199 -372 510 808 -475 24 878 97 -472 500
2965 500 330 -533 -140 712 -473 -659 629 -164 -829 -172 237 -596 -239 576 17 -415 363 633 -317
2984 -317 -226 901 -196 -391 499 523 -170 510 876 -159 -75 668 153 -593 108 263 -623 -37 189 -176
3004 -176 -220 318 -58 -457 -133 -37 -720 -324 71 -375 -2 275 143 -138 160 136 80 266 428 54 -25 385
3026 385 -299 -176 420 407 -107 123 285 -456 -447 161 -181 -939 41 403 -548 7 355 -420 -702 551 -16
3047 -16 -852 90 416 -7 36 845 95 76 587 301 -221 -48 337 -161 -734 435 393 -420 -332 569 -322
3068 -322 -367 54 92 -811 -513 230 -737 -177 439 3 -299 115 38 -233 58 519 -166 -136 357 194 76
3089 76 489 93 107 303 40 -95 -27 -8 -278 -164 410 52 -251 245 362 -320 -31 142 -333 -202 302
3110 302 -29 -236 253 156 -400 76 393 207 -378 524 448 -320 -94 624 -211 -159 603 142 -552 109 263
3131 263 -809 -457 354 -127 -707 375 340 -665 -194 371 -465 -375 156 92 -634 91 496 -22 -28 376 168
3152 168 -284 269 225 -468 -109 394 53 -203 208 318 -563 -112 -37 -141 -358 -50 -124 -384 -34 -28 -222 178
3174 178 153 -164 258 -84 -282 90 503 -38 -101 311 468 -66 93 234 -582 56 237 -326 -441 359 81
3195 81 -638 -96 266 94 -384 274 -137 -417 -76 -64 -260 -183 232 -115 -487 258 445 -328 -176 661 45
3216 45 -454 619 389 -378 61 838 -40 -227 388 -80 -353 112 121 -542 -242 259 -195 -180 180 41 -263
3237 -263 -170 147 -143 -139 -148 -64 -63 107 624 134 25 577 -70 -109 20 -113 -308 163 151 -224 33 -3 34 136
3261 136 78 -79 -404 170 -211 -280 21 87 -197 -129 506 -195 -165 323 86 -293 228 623 -287 98 532 150
3283 150 -169 341 397 -594 -387 281 -138 -582 76 155 -419 -211 352 -289 -622 330 -196 -361 -169 291 -645
3304 -645 -281 431 89 -85 316 364 -147 -33 268 -109 -153 106 -16 -40 284 151 -35 -100 92 -289 11
3325 11 146 -146 37 122 29 -96 83 17 -51 -163 21 -152 -106 -40 216 104 37 407 -71 -19 502 250 -316
3348 -316 131 336 -427 -130 444 231 -81 243 330 -281 99 402 -355 49 185 -148 -352 316 139 -295
3368 -295 140 164 -84 -170 336 -2 -212 43 224 -104 -17 471 140 -346 331 223 -455 -274 368 -194 -385
3389 -385 229 29 62 -141 28 -118 -203 34 299 -323 -129 -71 -432 77 140 -43 183 262 56 31 -62 189
3411 189 -137 45 131 -41 209 199 -70 -121 -42 1 -56 -114 -246 -174 23 -6 -362 -417 141 -29 -313 -98 -47 -227
3435 -227 -141 274 -42 -87 461 229 -22 126 210 -103 -225 367 315 -530 -97 205 5 -239 488 100 -290
3456 -290 14 211 -417 -384 152 -133 -191 124 188 -233 -93 92 -71 -338 -86 179 -87 -35 231 -69 -157 437
3478 437 267 4 89 -120 -231 54 -69 3 -452 134 41 -142 192 -64 -251 49 54 -274 28 12 22 14 189
3501 189 -230 -113 257 69 -149 124 525 -12 -57 17 7 -419 96 365 -137 -48 136 -212 -273 199 -67 -169
3523 -169 -26 77 -296 -431 194 -89 -251 39 294 -204 -60 371 89 -292 528 376 -104 184 397 -77
3543 -77 -296 260 116 0 245 257 -47 -145 171 -67 -403 115 138 -42 -302 -231 11 -366 -129 143 -17 414
3565 414 315 -155 12 274 -120 95 321 153 -33 157 189 185 53 194 -66 -160 233 -297 -49 268 111 -188
3587 -188 -316 -184 -206 -342 96 146 68 124 26 -323 -106 158 -91 -151 149 54 -106 372 453 178 -223 280 117
3610 117 -216 207 164 -183 -146 90 -57 -437 -105 112 -270 72 108 -78 -11 97 -94 -302 -71 182 -51
3631 -51 276 317 -50 -69 224 328 -225 374 184 -7 -28 174 -49 36 -12 -88 -193 -129 -227 -354 -112 -116 -161 -106
3655 -106 138 -264 -301 6 -124 20 80 185 82 229 188 -63 0 167 198 51 -98 19 16 -46 49 116 -232
3678 -232 273 11 -98 -131 78 -329 -83 9 88 -416 -108 50 -73 101 100 15 -79 121 159 106 -98 -93 149 -183
3702 -183 -85 242 -27 -63 12 -28 -50 93 -32 -354 149 46 -349 -53 59 276 -202 -75 -32 -154 -130 -13
3724 -13 -119 -329 163 -26 277 126 257 -181 141 150 -9 273 140 217 -28 221 -38 -138 156 54 -15 -140
3746 -140 -23 279 -135 31 -3 -91 -164 106 153 -158 -128 -20 -47 -196 122 -129 -91 181 18 -143 188 188 -14
3769 -14 65 410 -71 -24 184 110 -65 74 78 -220 -255 -105 -255 -132 113 -46 -124 -326 132 -89 -65 120 114 -44
3793 -44 -286 -73 -121 -114 -79 -105 -78 192 334 -185 78 67 -94 -71 95 -64 -150 142 -121 -443 88 102 -51 99
3817 99 -37 -174 8 -72 -114 -62 35 165 38 -1 243 21 26 9 -32 -89 175 57 82 -189 67 -129 -258 34
3841 34 -50 -133 47 67 -10 54 -36 -105 -121 -136 195 -159 -104 283 15 -209 69 266 -65 160 19 161 9 184
3865 184 11 -303 -100 65 -52 -29 195 259 -161 225 162 -144 81 -161 -44 -95 -135 -150 -223 199 49 -112
3887 -112 272 218 -63 58 -115 480 30 -2 187 -67 148 55 182 -131 137 -57 43 38 262 -109 201 -188
3909 -188 -292 -41 290 -86 73 14 19 -285 101 170 -202 157 -71 233 -49 155 182 99 -252 1 -43 -164
3931 -164 135 128 234 188 65 -95 -231 46 -108 -3 -164 -70 -14 -166 52 35 -74 280 131 -125 14 -301
3953 -301 154 -116 180 -34 -51 -185 36 12 23 273 125 204 170 267 -45 -214 120 -156 182 -6 37 3 -259
3976 -259 -52 -252 18 -278 -219 -47 -210 45 -172 -22 -35 228 -217 -191 69 38 30 126 130 -45 212 0 159
3999 159 174 100 -205 102 57 -88 100 10 -119 -141 -73 87 298 -82 -109 111 -7 -117 -148 -117 129 67 13 191
4023 191 402 -62 -190 43 70 -161 -97 75 -88 -294 -28 180 -35 177 60 23 43 -50 -162 114 -115 11
4045 11 -1 98 33 82 -208 147 128 -4 148 227 340 56 127 127 -40 6 126 138 33 -177 60 10 -189 -133 -51
4070 -51 -75 -194 99 -82 185 -36 39 -274 -72 -77 7 -41 -159 -124 -16 40 91 -42 347 310 -13 163 -190 248
4094 248 87 6 -56 157 183 -40 -218 -251 177 -165 92 -181 -163 17 -24 22 57 42 -240 39 -110 -107 -128 -167
4118 -167 -23 106 -18 138 -46 8 167 -86 56 122 181 -114 120 -93 -20 -150 -91 -102 112 66 -143 -53 -61
4141 -61 -200 -260 49 -146 -64 -351 -71 225 -29 -21 184 78 -78 103 -119 -45 25 29 283 136 -12 -32 119
4164 119 44 -6 200 5 -168 195 4 -47 -284 -236 -100 92 4 -62 -33 55 -127 112 83 60 -107 119 268
4187 268 37 66 -69 224 164 177 -126 -138 -44 262 -22 -105 53 -109 77 -103 -159 -216 -93 -77 157 -135 17
4210 17 39 106 -76 138 154 16 94 85 -278 62 262 -165 110 148 147 -77 -74 9 -56 31 208 123 -25 -374 -77
4235 -77 -44 56 155 -133 -152 -95 -91 16 65 -364 6 164 100 16 -65 28 231 139 269 100 -51 36 -122 62 -230
4260 -230 -83 29 172 45 48 -180 -119 -16 -131 -109 -234 -154 -233 -55 -130 -201 20 -159 -42 5 66 41 50 111 112
4285 112 84 -107 169 159 -260 203 126 26 82 122 -1 -75 325 -243 -351 -25 -1 195 -14 -7 17 -108 -197 -110
4309 -110 -55 140 85 -2 -79 -137 9 176 -68 75 -117 62 3 -67 264 61 265 128 -103 108 -131 -118 -12
4332 -12 -156 50 -133 36 -423 -112 101 -132 -181 -173 -3 90 80 -126 27 67 2 -76 154 -51 -24 -43 17 182
4356 182 99 -95 -106 41 -24 23 32 -106 -376 -122 -34 131 91 87 -116 34 62 75 -33 27 161 49 -34 17 18 133
4382 133 288 25 95 122 -6 90 -140 -344 -159 -6 -86 -197 36 -48 -22 -175 -19 -230 -200 -106 13 36 -108
4405 -108 205 -172 -100 55 -19 188 48 -1 -54 88 46 43 196 196 97 2 41 22 -123 171 -11 -35 -63 82 -137
4430 -137 -16 -207 -224 -202 -59 -189 89 -276 -49 184 -55 47 92 20 154 56 67 76 -126 128 -38 74 -5
4453 -5 -229 -245 -37 114 -22 -114 -198 72 -204 -50 42 -37 50 164 -137 123 128 -201 128 130 16 279 -74 103
4477 103 252 89 144 -134 71 112 95 91 136 36 62 -204 71 126 -97 -264 -155 -335 1 -73 219 -210 -104
4500 -104 26 119 -27 -66 102 61 -80 236 46 66 112 -6 -22 235 -87 186 35 -200 -78 -158 122 -23
4522 -23 -42 40 -50 10 -146 284 -183 -102 -87 -154 -118 125 226 132 52 -131 -55 19 2 -7 -3 -14 -66 -132 100 20 87 198
4550 198 6 -81 -174 56 164 -173 108 -181 -58 -122 -152 200 48 34 -354 103 -59 -164 206 -21 -21 285
4572 285 35 -32 375 242 243 126 75 28 -290 288 34 20 43 98 35 12 -175 -6 -164 -139 -71 200 -33 13
4596 13 167 190 -313 0 323 95 100 0 37 -235 -15 122 219 31 76 -29 106 31 -9 52 22 -47 -177 120
4620 120 -89 51 52 216 114 -121 -60 40 75 -9 -79 -75 32 -125 -102 313 34 82 231 157 116 117 239 19 31
4645 31 -183 -162 -66 35 12 -153 108 117 -120 -21 4 -164 -120 -37 196 -10 -121 231 -55 22 -10 -35 136 -46
4669 -46 -321 82 -224 222 123 82 23 84 -7 17 18 -29 118 -54 -127 81 -10 -131 0 -133 223 10 19 8 205
4694 205 41 149 -170 -176 -70 62 -25 -169 -42 53 126 199 8 -125 24 -82 -142 -87 154 -127 45 -183 -156
4717 -156 -69 -39 -43 -177 -167 -325 -56 -285 54 67 -41 102 -94 -167 -201 124 -14 214 161 145 -96 105 239
4740 239 -58 245 -66 -20 -119 34 3 98 112 -41 -28 31 -18 130 -10 72 117 -192 1 -14 -32 -155 -178 -42
4764 -42 178 -200 70 -39 -9 57 418 79 204 -63 -76 -54 -145 100 -108 -88 -224 -240 285 6 110 -32 75
4787 75 259 -252 141 -64 -160 175 161 -77 -149 -76 13 -204 63 73 135 -89 -18 -105 210 -3 62 -136 -196 117
4811 117 -157 -2 -18 127 -115 153 153 -60 195 -64 67 -116 256 -238 36 -64 -54 -94 78 13 173 107
4833 107 62 105 -142 -116 218 41 19 -22 66 -86 -139 -13 -190 -30 -353 -31 285 103 19 12 308 -81 39
4856 39 3 -76 133 -100 -254 -111 -67 5 -12 -46 65 -77 -112 203 -196 -30 -46 108 66 -173 -43 -5 -87 -36
4880 -36 214 -76 146 -259 -204 213 9 159 -272 -22 222 153 -31 -215 314 -23 91 6 -168 -251 -204 -58
4902 -58 28 -125 21 -166 81 -51 109 -78 -159 -19 146 -77 166 -127 -23 99 -205 -81 -71 -310 71
4923 71 -45 -102 52 12 -102 -59 89 120 -43 64 53 -109 -220 -105 -24 161 -60 -31 80 101 52 -81 -13 -97
4947 -97 -1 102 109 5 131 -125 -230 5 76 -44 -5 -227 -17 29 105 224 73 22 189 151 -17 130 192 -87
4971 -87 -2 148 -66 19 48 104 100 -33 118 -1 11 -83 -22 -60 -77 -23 133 -299 194 96 121 119 -32 108 -173 96
4997 96 -70 86 -66 -73 54 160 333 -12 60 19 153 -110 0 -64 184 -123 -5 36 -180 -70 129 -181
5019 -181 100 290 -115 -78 -109 100 -16 5 -79 -229 -100 21 303 42 63 -187 97 168 65 -111 -137 13
5041 13 25 131 135 76 -131 9 -150 -86 90 -32 -87 126 103 2 -38 54 -90 236 139 176 3 -23 89 20 -236
5066 -236 345 -166 -213 63 -66 -42 -43 79 -137 168 69 -6 -99 -66 -161 32 -95 255 -180 -160 -35 122 -126
5089 -126 50 -43 -8 268 34 -99 34 15 81 20 24 -173 -43 31 -61 84 18 3 138 12 178 -7 -133 160
5113 160 132 -77 -194 354 239 136 199 -54 -119 -200 -142 59 42 -138 -16 23 -193 243 164 47 118 102 103 -46
5137 -46 -150 -42 190 -60 -218 -126 -116 -79 -118 -183 10 2 24 152 163 43 -104 -3 27 -222 45 112 -4 162
5161 162 339 -3 243 -64 89 137 62 -53 185 59 36 -147 102 -161 -55 168 12 -51 141 -101 -154 61
5183 61 -115 70 -151 152 -155 128 -111 79 -50 17 115 164 -38 -132 299 56 -59 -160 -6 72 -30 209
5205 209 19 20 158 130 4 -5 -405 98 -254 -54 -20 -141 186 -1 107 161 206 35 -331 77 -230 197 -5
5228 -5 -279 5 53 245 -14 70 -9 -63 -35 21 -142 -106 67 53 92 -170 41 -79 -58 84 -85 128 -68 158
5252 158 171 160 -95 -245 -78 32 144 104 -100 116 45 -88 -109 45 -42 58 189 -180 -168 -29 39 -72 264
5275 264 161 -72 -27 -151 207 137 -59 -57 -12 -247 -245 130 20 -114 148 170 -64 -287 25 -44 104 -65 11
5298 11 177 260 52 1 -176 -75 57 142 265 30 -159 -20 81 204 -146 7 -230 -37 -117 -176 -194 164
5320 164 -75 -14 -22 -32 -146 78 60 -350 94 47 -84 6 164 -59 279 218 41 37 -76 -15 196 -69 -72 37
5344 37 -56 114 -174 16 -30 22 191 -275 -131 60 -184 53 98 168 98 156 -119 -49 139 -262 -315 -35 23 -225
5368 -225 -151 165 -71 140 97 76 -38 -105 -128 130 132 396 104 -52 74 5 -88 34 174 -108 16 100 101 31
5392 31 223 -63 -65 -97 47 155 9 -66 -81 -85 -104 -72 18 -116 275 -116 -87 -72 -25 2 -147 -45 73 -69 14
5417 14 318 -73 -82 91 108 -252 386 -45 170 -71 147 114 -123 -212 57 -21 39 -60 -164 127 227 -158 -52
5440 -52 -77 -179 -96 -56 -10 -63 215 -11 80 193 59 101 -12 66 -81 -25 44 183 52 14 -37 60 217 -130 -150
5465 -150 110 111 -173 144 154 169 -122 81 -168 -176 -9 -65 108 52 -25 -105 -31 18 -217 -42 -22 192 -42 -109 -102
5490 -102 21 28 286 -57 -62 -118 -160 -156 -87 -85 -70 105 -162 44 -85 90 5 84 -351 3 81 137 59 35 135 11
5516 11 -189 25 31 87 93 0 275 -170 55 -117 -4 -241 -27 -32 -262 79 41 169 -38 -111 77 142 -78 -2
5540 -2 198 23 -53 75 -2 47 -282 59 -211 -24 68 256 38 78 -104 85 -115 -143 -62 -7 133 -215 181
5563 181 177 124 17 39 -25 140 -75 -183 -30 -213 -76 -65 -61 136 -220 83 75 64 6 -113 -77 -36 42 48 92 211
5589 211 147 -242 -142 -33 -195 -67 65 216 -263 -207 -107 -160 37 23 -8 145 150 181 353 -179 -165 -276 -49
5612 -49 2 -287 -207 -51 -160 -209 -34 -293 70 14 45 54 -47 -101 204 -17 69 -19 94 -68 -130 -32 49 -51 51
5637 51 218 38 -25 84 195 12 130 29 -123 -43 1 -149 -360 -120 108 -182 -43 60 -83 19 -92
5658 -92 -166 96 -40 182 -196 -34 9 77 183 -122 -35 -70 117 -95 -116 7 -80 -72 -131 65 161 -57 -111 -17 -23
5683 -23 -61 -111 80 119 40 -54 -82 245 -190 100 26 64 -14 29 -107 124 -196 -159 -34 81 -72 43 103 19 83
5708 83 239 -92 172 -94 -225 -7 -58 -58 112 127 169 168 -46 -132 126 -29 165 -128 81 36 33 80 -128 -188 -284
5733 -284 18 -84 229 -185 23 -329 -204 -44 95 1 186 197 47 110 102 -143 -225 -183 381 -101 4 -137
5755 -137 -89 140 32 12 85 -34 -43 -121 10 -203 193 160 80 -77 172 124 -7 22 36 160 24 84 93 9 -128
5780 -128 -222 -122 289 -349 25 -72 -5 -274 106 66 102 65 -147 -11 -91 152 -118 6 218 -242 192 -81
5802 -81 79 32 33 -105 99 117 48 27 -69 -32 -129 -55 264 164 -271 65 -78 235 -91 41 -108 -190 -26 27
5826 27 -67 70 45 108 55 147 7 38 -12 167 -200 102 -44 -195 84 22 53 58 76 -66 -36 153 94 152 125 -49
5852 -49 -29 -23 -70 163 99 -17 -211 66 -43 43 45 168 -242 141 31 -43 164 -45 -31 -242 54 74 -57 -74
5876 -74 157 70 164 -181 -45 -145 112 192 9 95 108 -36 -118 -45 -1 66 0 -33 -31 -35 -32 -39 87 112 -96 -3 -122
5903 -122 81 -169 -190 -38 -219 31 -77 -122 -28 -75 -36 -176 62 -107 219 -298 -15 -13 -134 -117 129 191 -159
5926 -159 62 179 -50 36 -141 -31 105 111 121 -257 -132 -45 -54 191 43 1 90 -133 19 -261 -44 109 92
5949 92 -105 -86 -94 -94 62 -10 229 75 -159 -234 35 -101 -16 30 -57 71 -41 61 30 54 35 23 -2 -157 -58 -125
5975 -125 81 149 -153 36 72 -35 -20 184 -105 85 -21 59 -84 -145 -148 -210 207 65 -10 241 28 -49 346
5998 346 -35 -163 5 266 -340 -205 7 -8 -12 -77 -35 -168 -68 -5 9 -228 420 -61 113 169 -15 -13 -15 94
6022 94 104 -44 -46 72 -70 73 -276 -247 76 -103 -166 -295 -161 87 -126 161 -114 -95 -109 48 112 43 48 -39
6046 -39 -40 145 48 -58 -8 -163 101 -121 -318 -45 216 -81 -20 137 117 -111 -192 117 90 -160 -267 9 94
6069 94 70 153 -253 -117 -114 -100 -38 17 -46 -34 110 -57 48 39 -23 -2 -36 -156 -266 130 262 250 126 179 -129 118
6095 118 54 -122 325 103 41 -57 119 84 -8 -153 -194 -97 -255 -115 24 -152 -115 -90 -112 74 -104 75 -15 23
6119 23 -106 122 -83 110 42 103 47 -81 -105 198 -260 -72 -32 -16 6 311 -126 -110 43 -144 11 -290 -52
6142 -52 49 80 175 82 4 -184 -6 -29 -125 -95 117 15 262 10 165 62 -85 -136 80 -59 -197 -79 36
6165 36 -106 -19 163 -40 -46 -102 -39 -47 -184 334 206 117 -71 125 75 96 108 -49 -38 -188 42 65 18 -188 -64
6190 -64 -101 109 -212 -234 26 167 75 197 -75 47 147 -9 260 -84 6 -29 143 104 57 -6 196 -84 -69
6213 -69 -63 -104 170 182 228 343 174 -93 -316 195 -54 191 135 4 15 125 112 -146 159 160 -37 -214 6 -14
6237 -14 -110 -178 -55 -184 90 -132 -162 -427 -8 35 -6 37 -79 -47 12 184 -76 -199 94 393 31 -75 121
6260 121 71 6 16 -112 -22 -284 200 110 108 130 78 134 -127 -298 -211 -28 194 -35 96 -176 100 -198 89 140
6284 140 95 -268 266 -75 84 203 65 6 -25 29 -27 -132 -68 268 -139 -131 242 53 225 -54 111 225 -145
6307 -145 154 113 -32 154 35 -134 -59 79 343 152 -9 91 203 -145 -91 206 -46 151 1 -54 148
6328 148 30 -138 66 -4 -101 -20 -143 -25 141 -138 -169 277 77 117 -67 -363 82 -115 -10 -34 -224 154
6350 154 -44 146 82 -20 0 -129 22 142 56 -67 -144 187 -32 35 -22 -209 -78 -138 -155 269 -42 66 42
6373 42 24 -190 0 203 244 -93 151 46 -52 -260 -144 92 -87 -29 53 163 -36 114 -113 -13 89 -22
6395 -22 -174 -54 35 -104 -15 -103 18 -58 -125 -30 14 16 -74 -39 -207 -41 -40 90 -97 163 -245 -274 90 166 -306
6420 -306 67 -146 -12 126 -78 -428 29 151 38 -40 -15 106 100 -170 -37 119 -126 182 45 2 -107 47
6442 47 59 -79 -235 108 -31 -4 -168 218 -139 -84 167 -1 49 -7 13 96 107 -97 98 -128 -182 -107 -108 -68 -100
6467 -100 -36 85 96 44 89 0 -66 -45 102 141 125 -66 -155 124 105 6 -102 -37 25 -169 26 -12 5 -26 -139 -46
6493 -46 85 -190 -121 -212 -9 41 26 -220 -180 14 -38 29 98 -139 -9 -106 36 -73 -12 95 103 101 150 3 251
6518 251 164 161 82 -237 -207 14 125 -15 93 -127 -229 129 73 116 120 113 83 35 -57 -2 23 94 139 130 -18 232 -241
6545 -241 -126 70 -14 172 -170 107 -190 -152 113 -86 223 -463 -63 227 9 -5 136 -9 -159 63 -18
6566 -18 -291 -37 -89 80 331 1 -12 142 291 -32 -83 136 144 79 9 69 -101 -133 132 187 83 142 508 303
6590 303 14 -102 -19 131 -196 28 17 -102 -40 2 -16 202 -41 12 13 -62 153 150 -92 168 127 -60 224 7
6614 7 75 -21 -38 2 57 78 -101 210 -46 97 -4 -176 -207 304 34 231 -347 -26 -127 191 -30 -101 52
6637 52 151 14 46 -11 19 92 -55 41 -93 81 -192 151 60 185 167 -115 -31 -112 -135 117 -100 136 45 106 -138
6662 -138 -60 -315 76 60 -46 -58 55 49 -16 -48 88 -21 -111 -3 -132 -49 -152 -172 197 -92 10 -19 -205 -155
6686 -155 84 24 -22 35 39 -13 2 70 -94 -261 -3 -119 83 -95 89 -104 50 -54 -166 238 -39 -165 -79
6709 -79 38 57 23 143 -128 69 92 -50 -149 39 -149 -171 -80 239 -143 -45 228 -54 -68 194 172 -259 37
6732 37 78 -142 137 -47 -47 195 -35 173 217 -185 -157 57 -17 -109 105 -31 264 60 -42 -28 21 -97 -200
6755 -200 187 -190 -336 -117 -83 94 -193 170 -1 -58 102 80 185 93 -2 88 -154 60 278 48 0 39 -49
6778 -49 4 124 -71 -32 -152 109 68 133 16 -126 71 74 -128 66 -277 -132 -193 -17 -80 -64 -119 122 55 -23
6802 -23 90 43 -8 65 -112 -222 286 156 93 -222 -105 199 -145 -104 -51 30 -155 -44 39 138 -55 48 186
6825 186 49 116 39 81 -170 60 -142 -65 -8 105 186 48 -29 -84 218 3 58 71 -110 -157 -73 -19 191 -108
6849 -108 -69 -30 -35 69 15 5 -158 133 249 68 -221 91 0 -165 11 105 139 21 229 -240 -159 -129 -20 28
6873 28 -236 127 79 -13 144 252 -132 -11 -40 20 -223 -193 -316 -74 132 -79 -131 13 -194 -201 255 89 108
6896 108 172 -42 -84 -166 -202 -258 -39 -170 129 24 -155 63 60 -148 -41 -8 -10 272 -52 92 280 -62 20 42
6920 42 -14 -35 -154 -332 -152 62 115 37 124 62 -38 89 -219 145 22 -68 9 377 121 5 -117 -144 -27
6943 -27 -12 -122 -30 -117 -26 -95 78 228 -119 -148 -33 73 12 -119 -191 187 129 6 274 136 6 44 40 -85
6967 -85 225 193 78 -150 280 -160 -28 41 -19 -42 -14 60 57 107 -138 -45 -154 -172 -37 116 88 96 90 -161 74 46
6993 46 -212 -222 -161 116 5 35 -132 -8 247 -90 96 -5 68 18 -58 -132 -134 147 -33 -66 -36 -40 -88 -226 -41
7018 -41 -210 -206 157 -314 -52 -65 73 -67 98 -163 -39 106 146 -15 11 97 1 67 -34 -52 16 -109 23 35
7042 35 -94 185 -96 58 39 89 384 94 68 -69 -77 181 -15 210 29 227 -146 140 126 -67 92 -4 147
7065 147 -28 -36 135 248 -200 56 69 181 -108 -283 161 -34 19 63 -28 256 271 -135 -4 18 209 138 -31
7088 -31 129 -199 -191 1 176 181 -1 38 29 -50 61 -41 32 -270 8 -194 -235 114 244 206 -103 226 90 161
7112 161 -131 -28 239 192 72 81 -113 -43 54 -175 -52 38 17 22 130 -19 -78 -92 -57 -193 36 67 160 40 103
7137 103 74 -218 -9 217 -33 -148 -36 42 28 35 -110 -13 -121 -104 -191 -61 -233 -226 -81 -162 50 -109 26 103
7161 103 16 -143 -199 -170 -28 64 92 -206 -199 160 -76 -218 111 33 -153 228 79 98 121 -24 -6 -52 -71 246
7185 246 100 -241 -28 -55 -23 -121 -94 -128 163 -255 -82 72 -69 -153 -12 87 -27 108 133 -70 218 282 41
7208 41 135 -67 -100 227 -114 -62 9 -150 99 -247 -43 87 -49 -23 17 -157 -98 -222 -133 -72 -36 -237 -254 -91
7232 -91 220 160 35 -90 21 126 -76 -127 105 -18 215 -219 134 53 -132 55 -33 212 -103 83 10 7 41
7255 41 1 10 -133 -47 22 27 182 -34 -85 239 60 -117 -20 -60 -50 163 -240 -143 239 164 105 250 -143 -147 54 -1
7281 -1 -117 -90 177 204 132 53 -81 -13 -49 152 83 -277 9 245 -129 -58 -130 -276 314 36 14 -157 215 35
7305 35 13 45 113 54 -10 171 16 30 96 63 262 40 -83 -223 220 90 -21 124 228 78 50 119 216 174
7329 174 -171 -296 108 44 71 36 21 79 -23 -9 65 126 -142 108 187 158 61 -28 -290 229 -99 -40 -145 302
7353 302 -26 -140 -72 6 -127 -124 -258 -349 -155 -147 -223 -158 -21 59 101 -207 197 28 -55 -88 -154 84 -170 99 119
7378 119 -89 105 48 -113 8 -162 21 198 -275 -61 -169 58 -73 -41 16 77 105 -137 114 -209 -49 147
7400 147 -107 -301 273 37 -37 9 -161 -158 118 -35 -128 -27 -102 -35 85 175 -187 81 -144 147 42 -58 -12
7423 -12 -92 -126 -129 -10 173 -7 -39 -89 -65 211 2 -230 -90 -91 -92 -125 66 -28 -27 144 -169 30 45 156 141 167
7449 167 -3 39 -64 -170 118 217 40 -5 -87 -102 28 -169 121 54 -90 1 248 -79 -129 142 -42 94 -115
7472 -115 28 138 21 -55 63 103 -60 275 211 -54 37 148 -70 -82 -170 29 -46 90 57 -93 109 -238 -358
7495 -358 -94 -215 132 -96 -182 217 -170 128 -170 10 -145 -30 66 64 -249 -16 -241 -35 -130 92 85 284
7517 284 77 273 15 -96 -158 59 -234 -22 -39 -222 -163 129 189 -31 -298 -99 -42 218 172 -108 74 306
7539 306 -23 -255 -95 78 119 -68 31 -92 67 193 -80 -39 17 62 -231 -82 -12 -183 175 25 -297 -121
7561 -121 77 152 -120 6 -121 -116 -84 -76 353 -138 -18 -227 58 -238 -45 130 200 17 -130 -42 -126 314 -46
7584 -46 -140 143 -71 147 -29 -35 -176 -146 -113 -95 148 -329 -164 -170 -25 -192 -201 115 96 97 -303 -81 -33 25 -127
7609 -127 -16 80 -72 -235 -14 80 -59 -198 237 -120 -59 -83 106 -128 -202 177 1 -103 -132 -123 1 -80 116
7632 116 85 68 120 -133 -127 104 -10 163 60 -36 -37 -80 51 -143 -37 -147 219 148 245 -60 55 -101 134 107
7656 107 -239 289 -94 110 -12 310 -12 -58 -147 -149 22 -35 35 -22 184 -76 -62 -128 149 45 112 159 168 302
7680 302 164 85 197 -60 -42 -106 -49 46 -4 -155 220 -52 247 100 -40 -49 62 -134 -1 255 19 -173 -135
7703 -135 79 347 161 -100 -25 23 46 116 46 -8 156 84 66 15 -347 -107 8 162 137 236 -261 -49 -292 -61
7727 -61 290 -44 -200 -16 76 -77 81 -35 19 188 126 7 79 86 -25 257 -55 64 -12 46 73 13 -113 20
7751 20 28 -78 195 -210 -150 21 69 175 -173 -251 8 -184 -17 212 156 -82 -143 -155 34 -24 -43 -178 -168 86
7775 86 116 -12 -162 -79 8 58 262 137 29 -32 -110 -161 -5 163 -208 -252 -84 -1 133 83 -9 95 78 1 246
7800 246 -103 -35 -34 -107 -44 -7 -70 -203 -69 6 -64 66 -54 -202 -28 -27 -2 -103 -18 39 -115 -19 156 -102 -9
7825 -9 -270 -46 -23 139 -48 -87 88 68 -140 -132 -131 -246 278 -2 -346 66 -204 -2 163 -9 93 -55 38
7848 38 119 26 72 -147 -81 51 3 -61 103 -33 -51 326 76 139 -7 156 -176 109 -89 87 -75 195 90
7871 90 -108 -95 -212 29 43 -206 82 47 72 46 -55 -123 67 17 -147 86 -198 -234 -47 117 -34 9 79 15
7895 15 354 -130 -167 -166 143 62 11 -39 -10 -85 147 20 392 -127 -76 -73 250 -101 -115 -190 -62 -31 -183 49 -45
7920 -45 -189 5 -20 46 233 -184 109 -331 -95 193 -62 148 -110 155 -20 -189 119 55 -7 -50 178 -60
7942 -60 -119 -112 9 25 62 -3 82 18 -127 -69 51 33 -4 177 45 -111 248 232 -41 104 152 -50 -39 298 -185
7967 -185 53 111 26 14 -175 319 6 -93 -74 -2 -97 150 -137 -66 -66 228 -112 272 -46 43 98 89 -224 -89 42
7992 42 131 -85 123 139 -26 -122 21 -11 184 90 -80 -2 -108 -163 -133 -78 -161 -40 -270 74 -53 -65 30 -192
8016 -192 16 -138 43 45 -68 -144 12 100 122 233 35 -138 -80 200 -15 127 47 213 -352 -131 11 -302
8038 -302 135 -161 62 -63 121 -185 -325 -245 -230 -169 200 105 149 3 -128 137 -85 -117 141 268 43 -51
8060 -51 -6 74 -33 -189 -18 -213 94 -44 194 72 -105 -104 83 128 93 107 -339 114 -73 -116 -51 -172 -77 -121
8084 -121 -213 -279 -85 200 -9 -92 -78 36 157 105 42 40 195 88 -82 -154 41 -22 -34 -18 -57 18 138 -198 -32
8109 -32 116 -106 14 -128 85 1 17 52 16 -46 -123 -14 43 203 183 -149 100 292 -24 102 118 292 -189
8132 -189 -99 114 15 -62 -62 27 -184 66 28 -250 277 5 -97 -111 22 78 76 -156 -72 -69 -90 208 63 -90 77
8157 77 -168 107 -268 -118 -174 -32 -86 307 108 -27 -112 278 54 -61 146 105 -52 94 0 169 46 121
8179 121 -32 -51 -39 -113 1 -131 -68 -208 40 201 141 47
8191D7
##END NTUPLES=NMR FID
##END=
