##TITLE=1H_SL59-Yellow-point
 CDCl3
 8 sc, 
 10.06.2022
##JCAMPDX= 6.0         $$ Bruker NMR JCAMP-DX V2.0
##DATA TYPE= NMR FID
##DATA CLASS= NTUPLES
##ORIGIN= UXNMR, Bruker Analytische Messtechnik GmbH
##OWNER= root
$$ XWIN-NMR		Version 3.5
$$ Fri Jun 10 14:32:28 2022 Russian Standard Time (UT+4h)  she@DPX200
##.OBSERVE FREQUENCY= 200.13135
##.OBSERVE NUCLEUS= ^1H
##.DELAY= (6, 6)
##.ACQUISITION MODE= SIMULTANEOUS
##.ACQUISITION SCHEME= undefined
##.AVERAGES= 8
##.DIGITISER RES= 18
##SPECTROMETER/DATA SYSTEM= spect
##.PULSE SEQUENCE= zg30
##.SOLVENT NAME= DMSO
##.SHIFT REFERENCE= (INTERNAL, DMSO, 0, 15.7039)
##AUDIT TRAIL= $$ (NUMBER, WHEN, WHO, WHERE, WHAT)
$$ ##TITLE= Audit trail, XWIN-NMR		Version 3.5
$$ ##JCAMPDX= 5.01
$$ ##ORIGIN= Bruker BioSpin GmbH
$$ ##OWNER= she
$$ F:/spectra/data/she/nmr/H-F/1/audita.txt
$$ ##AUDIT TRAIL=  $$ (NUMBER, WHEN, WHO, WHERE, WHAT)
(   1,<2022-06-10 14:31:21.98 +0400>,<she>,<DPX200>,
      <created by zg, POWCHK disabled, PULCHK disabled
       configuration hash MD5:
       00 E9 B6 7A A2 85 ED C7 34 08 36 98 17 FE 4E 26
       data hash MD5: 16K
       B7 E0 39 4F 1F BD 05 39 FF B2 0B C9 DC D4 EE 26>)
$$ ##END=
$$ 
$$ hash MD5
$$ 79 63 95 24 AD 6B 2F 78 8A 65 0F 50 46 E7 AE 3A
##$RELAX= 
##$RELAX= 
##$RELAX= 
##$RELAX= 
##$RELAX= 
##$RELAX= 
$$ Bruker specific parameters
$$ --------------------------
##$DU= <F:/spectra>
##$EXPNO= 1
##$NAME= <H-F>
##$PROCNO= 1
##$TYPE= <nmr>
##$USER= <she>
##$AMP= (0..31)
100 100 100 100 100 100 100 100 100 100 100 100 100 100 100 100 100 100 
100 100 100 100 100 100 100 100 100 100 100 100 100 100 
##$AQSEQ= 0
##$AQ_mod= 1
##$AUNM= <au_zg>
##$AUTOPOS= <>
##$BF1= 200.13
##$BF2= 200.13
##$BF3= 200.13
##$BF4= 200.13
##$BF5= 200.13
##$BF6= 200.13
##$BF7= 200.13
##$BF8= 200.13
##$BYTORDA= 1
##$CFDGTYP= 0
##$CFRGTYP= 5
##$CHEMSTR= <none>
##$CNST= (0..31)
1 1 145 1 1 1 1 1 1 1 1 1 1 1 1 1 1 1 1 1 1 1 1 1 1 1 1 1 1 1 1 1 
##$CPDPRG= <>
##$CPDPRG1= <>
##$CPDPRG2= <>
##$CPDPRG3= <>
##$CPDPRG4= <mlev>
##$CPDPRG5= <mlev>
##$CPDPRG6= <mlev>
##$CPDPRG7= <mlev>
##$CPDPRG8= <mlev>
##$CPDPRGB= <>
##$CPDPRGT= <>
##$D= (0..31)
0 1.2 0 0 0 0 0 0 0 0.06 0 0.03 0 0 0 0 0.0002 0 0 0 0 0 0 0 0 0 0 0 0 
0 0 0 
##$DATE= 1654857081
##$DBL= (0..7)
120 120 120 120 120 120 120 120 
##$DBP= (0..7)
150 150 150 150 150 150 150 150 
##$DBP07= 0
##$DBPNAM0= <>
##$DBPNAM1= <>
##$DBPNAM2= <>
##$DBPNAM3= <>
##$DBPNAM4= <>
##$DBPNAM5= <>
##$DBPNAM6= <>
##$DBPNAM7= <>
##$DBPOAL= (0..7)
0.5 0.5 0.5 0.5 0.5 0.5 0.5 0.5 
##$DBPOFFS= (0..7)
0 0 0 0 0 0 0 0 
##$DE= 6
##$DECBNUC= <off>
##$DECIM= 32
##$DECNUC= <off>
##$DECSTAT= 4
##$DIGMOD= 1
##$DIGTYP= 9
##$DL= (0..7)
0 120 120 120 120 120 120 120 
##$DP= (0..7)
150 150 150 150 150 150 150 150 
##$DP07= 0
##$DPNAME0= <>
##$DPNAME1= <>
##$DPNAME2= <>
##$DPNAME3= <>
##$DPNAME4= <>
##$DPNAME5= <>
##$DPNAME6= <>
##$DPNAME7= <>
##$DPOAL= (0..7)
0.5 0.5 0.5 0.5 0.5 0.5 0.5 0.5 
##$DPOFFS= (0..7)
0 0 0 0 0 0 0 0 
##$DQDMODE= 0
##$DR= 18
##$DS= 0
##$DSLIST= <SSSSSSSSSSSSSSS>
$$ [...]
##$SUBNAM2= <"">
##$SUBNAM3= <"">
##$SUBNAM4= <"">
##$SUBNAM5= <"">
##$SUBNAM6= <"">
##$SUBNAM7= <"">
##$SUBNAM8= <"">
##$SUBNAM9= <"">
##$SW= 18.05172834244
##$SWIBOX= (0..15)
0 0 2 0 0 0 0 0 0 0 0 0 0 0 0 0 
##$SW_h= 3612.71676300578
##$TD= 16384
##$TD0= 1
##$TE= 0
##$TE2= 300
##$TE3= 300
##$TEG= 300
##$TL= (0..7)
0 120 120 120 120 120 120 120 
##$TP= (0..7)
150 150 150 150 150 150 150 150 
##$TP07= 0
##$TPNAME0= <>
##$TPNAME1= <>
##$TPNAME2= <>
##$TPNAME3= <>
##$TPNAME4= <>
##$TPNAME5= <>
##$TPNAME6= <>
##$TPNAME7= <>
##$TPOAL= (0..7)
0.5 0.5 0.5 0.5 0.5 0.5 0.5 0.5 
##$TPOFFS= (0..7)
0 0 0 0 0 0 0 0 
##$TUNHIN= 0
##$TUNHOUT= 0
##$TUNXOUT= 0
##$USERA1= <user>
##$USERA2= <user>
##$USERA3= <user>
##$USERA4= <user>
##$USERA5= <user>
##$V9= 5
##$VALIST= <valist>
##$VCLIST= <CCCCCCCCCCCCCCC>
##$VD= 0
##$VDLIST= <DDDDDDDDDDDDDDD>
##$VPLIST= <PPPPPPPPPPPPPPP>
##$VTLIST= <TTTTTTTTTTTTTTT>
##$WBST= 1024
##$WBSW= 4
##$XGAIN= (0..3)
0 0 0 0 
##$XL= 0
##$YL= 0
##$YMAX_a= 147862
##$YMIN_a= -143095
##$ZGOPTNS= <>
##$ZL1= 120
##$ZL2= 120
##$ZL3= 120
##$ZL4= 120
##$ABSF1= 10
##$ABSF2= 0
##$ABSG= 5
##$ABSL= 3
##$ALPHA= 0
##$AQORDER= 0
##$ASSFAC= 0
##$ASSFACI= 0
##$ASSFACX= 0
##$ASSWID= 0
##$AUNMP= <proc_1d>
##$AZFE= 0.1
##$AZFW= 0.1
##$BCFW= 1
##$BC_mod= 2
##$BYTORDP= 1
##$COROFFS= 0
##$CY= 11.3945322036743
##$DATMOD= 1
##$DC= 2
##$DFILT= <>
##$DTYPP= 0
##$F1P= 2.36226072786647
##$F2P= -0.459571619588291
##$FCOR= 0.5
##$FTSIZE= 0
##$FT_mod= 4
##$GAMMA= 1
##$GB= 0.15
##$INTBC= 1
##$INTSCL= 1
##$ISEN= 128
##$LB= 0.24
##$LEV0= 0
##$LPBIN= 0
##$MAXI= 10000
##$MC2= 0
##$MEAN= 0
##$ME_mod= 0
##$MI= 1.114404
##$NCOEF= 0
##$NC_proc= 0
##$NLEV= 6
##$NOISF1= 3.799351
##$NOISF2= 2.8
##$NSP= 1
##$NTH_PI= 0
##$NZP= 0
##$OFFSET= 15.70392
##$PC= 1
##$PHC0= -18046.62
##$PHC1= 17.60069
##$PH_mod= 1
##$PKNL= yes
##$PPARMOD= 0
##$PSCAL= 0
##$PSIGN= 0
##$REVERSE= no
##$SF= 200.130013532006
##$SI= 16384
##$SIGF1= 3
##$SIGF2= 2
##$SINO= 400
##$SIOLD= 16384
##$SREGLST= <1H.CDCl3>
##$SSB= 0
##$STSI= 0
##$STSR= 0
##$SW_p= 3612.71676300578
##$SYMM= 0
##$S_DEV= 0
##$TDeff= 0
##$TDoff= 0
##$TI= <>
##$TILT= no
##$TM1= 0
##$TM2= 0
##$TOPLEV= 0
##$USERP1= <user>
##$USERP2= <user>
##$USERP3= <user>
##$USERP4= <user>
##$USERP5= <user>
##$WDW= 1
##$XDIM= 8192
##$YMAX_p= 0
##$YMIN_p= 0
$$ End of Bruker specific parameters
$$ ---------------------------------
##NTUPLES= NMR FID
##VAR_NAME=  TIME,          FID/REAL,        FID/IMAG
##SYMBOL=    X,             R,               I
##VAR_TYPE=  INDEPENDENT,   DEPENDENT,       DEPENDENT
##VAR_FORM=  AFFN,          ASDF,            ASDF
##VAR_DIM=   8192,          8192,            8192
##UNITS=     SECONDS,       ARBITRARY UNITS, ARBITRARY UNITS
##FACTOR=    0.0002768,     1,               1
##FIRST=     0,             0,               0
##LAST=      2.2672688,     0,               0
##MIN=       0,             -143095,         0
##MAX=       2.2672688,     147862,          0
$$ Real data points
##PAGE= N=1
##DATA TABLE= (X++(R..R)), XYDATA
$$ [...]
$$ plain form
1877 364 -404 5 790 -168 48 689 668 -184 394 990 -269 -610 708 740 -804 -193 874 -387 -1012
1896 -1012 143 142 -901 -564 289 -361 -809 -112 216 47 -459 199 734 -424 -231 843 638 -604 718
1915 718 1158 -476 124 1346 204 -726 667 662 -1050 -161 1015 -735 -1396 468 334 -1551 -630 751
1933 751 -461 -1437 238 847 -1096 -881 1549 351 -1292 1004 1593 -755 -40 1520 253 -714 1122
1950 1122 753 -986 199 1340 -632 -561 995 147 -758 -28 -2 -345 -455 -15 -405 -351 -396 -126 -147 -312
1970 -312 3 185 -273 -85 484 387 -54 573 876 67 73 545 125 -190 119 100 10 -139 180 -130 -261 -404
1992 -404 216 37 -860 -417 412 -738 -657 693 73 -1250 215 1013 -797 -287 1181 217 -651 706
2010 706 827 -731 117 1088 -235 -311 642 267 -773 -125 526 -722 -966 548 177 -1085 -287 861
$$ packed form
1877C64p68M09P85r58K16O41k1q52N78N96j259l41J318L2j544O11J067j261o25
1896a012J155jj043L37Q53o50m48O97L28j69n06O58N35j158J93J074k05j242J322
1915G18M40j634O00J222j142r30J393nj712Q89J176j750o61J864j34j885R21J381
1933G51j212r76J675O09j943K15K430j198j643K296N89k348P15J560j267r67J836
1950A122l69j739J185J141j972P1J556q48r05P30K6l43j10M40l90N4m5K70k1j65
1970c12L15J82m58J88N69r7m41O27L03q09OM72m20l15L09j9r0j49L19l10j31j43
1992d04O20j79q97M43Q29j150Q1J350o20j323J465P98j810N10J468r64q68J357
2010G06J21j558Q48R71j323p6R53l75j040O48O51j248k44J514l71j262P98J148
$$ plain form
2028 861 -515 -1211 521 274 -1070 -254 785 -545 -612 1050 389 -744 546 867 -142 73 902
2045 902 26 -350 426 522 -100 215 418 -72 -487 -261 154 -205 -653 -318 53 -699 -116 409 -248 -412
2065 -412 15 69 -122 -392 290 136 -13 91 689 654 -29 315 871 -91 -252 912 306 -785 541 939
2085 939 -748 -376 835 -350 -1500 344 462 -1040 -431 1058 -733 -1362 673 306 -1236 87
2101 87 765 -755 -760 946 177 -724 534 1253 98 -297 763 810 -734 243 947 -368 -692 535 223
2120 223 -1290 109 453 -814 -840 253 -200 -1034 70 190 -601 -243 298 -7 -73 500 -60 167 175 10
2140 10 448 414 -29 218 534 22 -116 623 424 -653 23 118 -811 -670 199 -363 -959 -206 221 -463 -586
2161 -586 379 -82 -742 86 454 -593 -51 1073 308 -386 618 1059 -669 -60 1243 -71 -903 895
$$ packed form
2028H61j376o96J732k47j344Q16J039j330o7J662o61j133J290L21j009K15Q29
2045I02q76l76P76R6o22L15K03m90m15K26M15l59m48L35L71p52N83N25o57j64
2065d12M27N4j91k70O82j54j49J04N98l5o83L44N56r62j61J164o06j091J326L98
2085I39j687L72J211j185j150J844J18j502O09J489j791o29K035l67j542J323
2101H7O78j520nJ706p69r01J258P19j155l95J060M7j544R77P04j315l24J227l12
2120B23j513J399L44j267k6J093m53q34J104J20p91L58N41l05o6N73n60K27Qj65
2140A0M38l4m43K47L16n12j38P39j99j077O76R5r29J41Q69n62n96P53M27o84j23
2161e86R65m61o60Q28L68j047N42J124p65o94J004M41j728O09J303j314q32J798
$$ plain form
2179 895 602 -695 -104 951 -377 -1057 878 5 -1128 -313 159 -841 -684 441 -176 -658 528
2196 528 655 -483 -168 620 -63 -662 593 1038 -100 -66 1057 155 -136 663 392 -124 -72 461 -197
2215 -197 -288 32 -31 -501 -200 157 -10 -495 -530 -352 -152 -409 -321 520 157 -543 159 586 -295 -162 894
2236 894 182 -1094 516 857 -507 51 1128 239 -597 532 613 -622 -500 813 -206 -1040 476
2253 476 391 -990 -390 760 -249 -811 292 274 -922 -137 1059 -393 -282 973 519 -389 652 973
2271 973 -571 -231 581 -30 -443 208 401 -178 -4 357 -233 -329 22 -299 -357 -412 102 -147 -332 71 -261
2292 -261 -4 -15 4 -97 188 -39 23 164 141 -3 424 680 275 285 479 208 -242 432 150 -330 -157 56
2314 56 -307 -655 414 -53 -894 -95 438 -855 -589 580 -255 -843 531 599 -892 -100 825 -282 -499
$$ packed form
2179H95k93j297N91J055j328o80J935q73j133Q15M72j000J57J125o17m82J186
2196E28J27j138L15P88o83n99J255M45j138L4J123r02k91P99k71n16N2N33o58
2215a97r1L20o3m70L01L57j67m85l5J78K00k57Q8Q41l63p00P02M27q81J33J056
2236H94p12j276J610L41j364N58J077q89q36J129Q1j235J22J313j019q34J516
2253D76q5j381O00J150j009n62J103j8j196P85J196j452J11J255m54r08J041L21
2271I73j544L40Q12o11m13O51J93n79J74L61n90r6L51l21n8n5N14k49j85M03l32
2292b61K57j1J9j01K85k27O2J41k3j44M27K56m05J0J94k71m50O74k82m80J73K13
2314E6l63l48J069m67q41P99N33j293K66J169q35n88J374O8j491P92R25j107k17
$$ plain form
2333 -499 683 696 -708 496 1079 -2 -189 800 799 -776 -55 506 -497 -561 327 -138 -1011 -16 452
2352 452 -651 -863 598 -166 -862 249 509 -870 -141 769 -45 83 610 474 -77 242 603 9 30
2371 30 235 279 242 -64 -105 -88 -110 -230 -56 73 -459 -477 22 -224 -308 24 535 -358 -243 329 68 -454 200
2394 200 649 -212 -337 791 515 -391 191 869 -450 -307 502 79 -534 212 691 -834 -231 716 -419
2413 -419 -924 205 141 -990 -236 497 -710 -390 496 122 -726 213 433 -423 -99 680 18 -297 539
2432 539 473 -376 105 836 124 -237 416 279 -537 -338 416 -483 -456 441 -186 -412 24 213 -519 -416 360
2453 360 -132 -583 -33 48 -170 537 177 110 173 152 -76 277 139 -90 158 340 -171 -41 670 78 -297
2474 -297 355 263 -671 -475 280 -385 -671 51 98 -644 -417 379 -35 -1020 88 540 -537 -372 995 77
$$ packed form
2333d99J182J3j404J204N83j081j87R89jj575P21N61j003o4Q88m65q73R95M68
2352D52j103k12J461p64o96J111K60j379P29R10q14J28N27j36n51L19L61n94K1
2371C0K05M4l7l06m1J7k2j20J74J29n32j8M99k46q4L32N11q93J15N72k61n22O54
2394B00M49q61j25J128k76r06N82O78j319J43Q09m23o13P46M79j525O03R47j135
2413d19n05J129o4j131P54P33j207L20Q86l74q48R39K20q56L24P79o62l15Q36
2432E39o6q49M81P31p12l61O53j37q16J99P54q99K7Q97o27k26M36J89p32J03P76
2453C60m92m51N50Q1k18P07l60o7O3k1k28L53j38k29K48J82n11J30P11n92l75
2474b97O52r2r34J96P55o65k86P22M7p42K27P96m14r85J108M52j077J65J367r18
$$ plain form
2494 77 -326 742 896 -393 264 980 -312 -423 852 142 -666 424 774 -466 -156 927 -209 -873
2512 -873 212 191 -765 -366 349 -304 -411 183 226 -143 -234 405 -66 -140 219 647 -332 15 512 114 81
2533 81 597 164 -50 365 -355 -485 154 -230 -219 -21 112 -362 -204 231 -440 -319 112 -460 -400 526 248
2554 248 -397 443 583 -291 3 751 79 -316 470 521 -433 56 645 -228 -225 305 395 -810 -335 438 -330
2575 -330 -859 370 344 -847 -111 674 -546 -547 254 206 -541 60 453 -539 -51 777 368 18 896 447
2595 447 -245 301 576 -589 -307 254 248 -401 89 410 -144 -41 1 -243 -439 -253 0 -127 -264 49 -30
2616 -30 20 -68 -153 215 143 6 -263 265 232 -188 390 608 134 -83 586 234 -26 223 -177 -868 -106 419
2638 419 -162 -709 650 18 -758 250 261 -707 -688 352 -168 -506 405 189 -317 325 810 -23 -457 597
$$ packed form
2494G7m03J068J54j289O57P16j292j11J275p10q08J090L50j240L10J083j136o64
2512h73J085k1r56L99P15o53j07N94M3l69r1O39m71p4L59M28r79L47M97l98l3
2533H1N16m33k14M15p20j30O39l84J1J98J33m74J58M35o71J21M31n72O0R26k78
2554B48o45Q40J40q74K94P48o72l95P86N1r54M89N89q73LN30R0j205M75P73p68
2575c30n29J229k6j191P36P85j220jQ01m8p47O01L93r92M88Q28m09l50Q78m49
2595D47o92N46K75j165K82N61oo49M90L21n54J03M2k44j96J86K53j27j37L13p9
2616c0N0q8q5L68p2j37k69N28l3m20N78K18m74k17O69l52k60K49m00o91P62N25
2638D19n81n47J359o32p76J008J1r68J9J040n20l38R11k16n06O42M85q33m34J054
$$ plain form
2658 597 470 -611 195 733 -202 -206 724 313 -495 -5 609 -753 -468 122 -161 -584 68 104 -379 -123
2678 -123 454 -194 -304 272 -273 -110 88 292 -117 185 307 128 229 344 210 -247 161 152 -64 -1 239
2699 239 81 19 126 47 -246 -148 -186 -326 -324 -302 -607 -499 137 -79 -436 255 301 -325 113 411 -77 -50 579
2722 579 306 -32 465 686 -138 182 811 -190 -562 317 525 -614 266 350 -508 -339 360 -144 -702 -87
2742 -87 156 -660 -422 421 -102 -594 153 589 -271 -65 738 30 -510 377 422 -284 170 717 -84 -105 337
2763 337 86 -331 -70 94 -580 -425 90 -327 -189 -23 -41 -182 30 -95 -417 -26 -71 -276 173 275 61
2784 61 387 527 28 -64 327 212 -195 198 508 -249 -256 546 206 -563 144 120 -592 -501 222 -361 -410 360
2806 360 414 -541 -58 576 -87 -395 390 132 -629 -125 567 -54 -332 715 489 -221 334 499 -561 -265
$$ packed form
2658E97j27j081Q06N38r35mR30m11q08M90O14j362K85N90k83m23O52L6m83K56
2678a23N77o48j10N76n45J63J98K04m09L02J22j79J01J15j34m57M08rk16O3K40
2699B39j58o2J07p9k93R8l8j40KK2l05J08O36k16l57O91M6o26M38K98m88K7O29
2722E79k73l38M97K21q24L20O29j001l72Q79K08j139Q80Q4q58J69O99n04n58O15
2742h7K43q16K38Q43n23m92P47M36q60K06Q03p08n40Q87M5p06M54N47q01k1M42
2763C37k51m17K61J64o74J55N15m17J38J66j8j41K12j25l22L91m5k05M49J02k14
2784F1L26J40m99r2L91j15m07L93L10p57pQ02l40p69P07k4p12R1P23n83m9P70
2806C60N4r55M83O34o63l08P85k58p61N04O92o21k78J047k26p10N55J65j060K96
$$ plain form
2826 -265 559 -291 -554 227 253 -162 -228 347 -33 -427 -73 -106 -414 -340 143 -41 -237 442 -52 92 191 469
2848 469 -164 306 197 98 31 288 143 146 479 179 -110 96 192 -298 -51 291 -340 31 217 69 -466 -85
2870 -85 90 -220 -465 72 -425 -461 99 -150 -373 251 480 -146 238 408 135 -382 268 421 -306 25 705
2891 705 92 -179 315 339 -319 -201 295 -376 -342 -60 -268 -810 -102 308 -357 -236 527 -272 -487 241 277
2912 277 -411 238 683 25 -106 449 292 -59 26 251 -40 -81 130 -59 -159 228 -43 -277 5 52 -148
2933 -148 -331 -193 -383 -178 -35 -187 -232 225 2 -97 87 -21 -38 48 463 184 -55 467 390 55 289 569
2955 569 -99 -276 546 -150 -522 284 -2 -439 -59 190 17 -334 -136 -12 -574 -89 449 -285 -432 257
2975 257 402 -330 140 613 -21 -108 326 115 -229 153 196 -364 -199 541 -23 -373 344 -193 -249 23 9
$$ packed form
2826b65Q24q50k63P81K6m15o6N75l80l94L54l3l08P4M83j84j96O79m94J44R9K78
2848D69o33M70j09r9o7K57j45LL33l00k89K06R6m90K47L42o31L71J86j48n35L81
2870h5J75l10k45N37m97l6N60k49k23O24K29o26L84J70k73n17O50J53p27L31O80
2891G05o13k71M94K4o58J18M96o71L4K82k08n42P08M10o65J21P63p99k15P28L6
2912B77o88O49M45o58j31N55j57l51Q5K25k91m1K11j89j00L87k71k34K82M7k00
2933a48j83J38j90K05J43j52m5M57k23r9J84j08j7Q6M15k79k39N22p7l35K34K80
2955E69o68j77Q22o96l72Q06k86m37L80K49j73l51J98J24n62M85N38p34j47O89
2975B57J45p32M70M73o34q7M34k11l44L82M3n60J65P40n64l50P17n37n6K72j4
$$ plain form
2996 9 -416 -403 376 -83 -364 236 -46 -360 -21 400 -17 32 128 -211 -96 380 198 51 270 466 89 193
3018 193 331 -223 397 87 11 -76 7 134 -102 -74 18 -134 -152 -180 -171 -266 -63 22 -307 -361 423 32 -270 -57
3042 -57 353 -341 -181 416 87 26 498 333 -274 288 460 86 -37 227 124 -398 50 262 -502 -130 231
3063 231 -39 -656 -86 174 -588 -154 233 -142 -234 240 399 -39 46 448 65 -39 288 80 -497 151 412
3084 412 -15 39 290 -65 -23 207 -2 -585 102 40 -412 -195 2 -3 -308 361 -96 -280 69 265 -295 158
3106 158 215 -181 28 441 280 101 463 296 -157 157 175 -403 -111 29 186 -198 40 153 -323 -276 121
3127 121 -411 -479 223 -88 -453 204 335 -293 -107 501 114 -580 258 382 -243 -95 184 166 -159 166 243
3148 243 -172 -40 540 -148 -319 -317 88 -312 -277 144 -156 -176 276 -141 -203 -54 39 -254 -129 3 -113 -140
$$ packed form
2996Im25J3P79m59k81O00k82l14L39M21m17M9R6l39J15M76j82j47K19J96l77J04
3018A93J38n54O20l10p6q7Q3J27k36K8R2j52j8k8Rr5K03Q5l29n4P84l91l02K13
3042e7M10o94J60N97l29o1M72j65o07N62J72l74j23K64j03n22M48K12p64L72L61
3063B31k70o17N70K60p62M34L87l75r2M74J59m38Q5M02l83j04L27k08n77O48K61
3084D12m27N4K51l55M2K30k09n83O87o2m52K17J97nl05O69m57j84L49J96n60M53
3106A58N7l96K09M13j61j79L62j67m53L14J8n78K92J40J57l84K38J13m76M7L97
3127A21n32o8P02l11l65O57J31o28J86O08l87o94Q38J24o25J48K79j8l25L25P7
3148B43m15J32N80o88j71KM05m00L5M21l00k0M52m17o2J49R3k93J25J32j16k7
$$ plain form
3170 -140 289 348 3 172 108 84 184 153 -243 29 427 -179 -37 54 21 -254 -140 -14 -209 149 -89 -350
3192 -350 -440 -78 -153 -305 9 212 -296 -103 137 -101 -228 361 482 -28 -8 544 288 -267 388 -116 -236
3213 -236 43 345 -264 -133 487 121 -210 140 295 -305 -262 132 -131 -365 336 195 -400 88 172 -76 99
3234 99 2 50 -320 92 257 156 216 101 392 352 391 161 8 187 173 -267 -157 -27 -43 -162 70 3 -461
3257 -461 -44 -66 -557 -8 -10 -273 -59 72 -120 -24 165 417 -14 150 203 -126 18 397 274 201 241 148 -250
3280 -250 -69 68 -120 -672 20 -86 -340 42 -44 -248 -249 139 -4 -598 -346 373 -120 -588 179 79 -275
3301 -275 386 184 -129 -145 498 -56 -85 195 138 -239 -1 265 -20 39 45 1 -152 211 -139 -248 -425 46
3323 46 -127 -182 -50 -131 -157 154 182 -206 33 102 176 55 238 190 60 239 372 84 78 56 167 -117 -73 47
$$ packed form
3170a40M29N9l45J69o4k4J00l1l96K72L98o06J42R1l3k75J14J26j95L58k38k61
3192c50r0L62p5j52L14K03n08J93K40k38j27N89J21n10K0N52k56n55O55n04j20
3213b36K79L02o09J31O20l66l31L50J55o00M3L94k63k34P01j41n95M88Q4k48J75
3234I9r7M8l70M12J65j01O0j15K91m0L9k30j53J79j4m40J10J30j6j19K32o7m64
3257d61M17k2m91N49kk63K14J31j92R6J89K52m31J64N3l29J44L79j23p3M0r3l98
3280b50J81J37j88n52O92j06k54L82q6k04jL88j43n94K52P19m93m68P67j00l54
3301b75O61k02l13j6O43n54k9K80n7l77K38K66k85N9Om4j53L63l50j09j77M71
3323D6j73n5J32q1k6L11K8l88K39O9P4j21J83m8j30J79J33k88ok2J11k84M4J20
$$ plain form
3347 47 -168 145 -16 -345 -104 126 -134 -206 -342 -318 -390 14 361 -170 -33 338 126 -225 269 -5 -130
3368 -130 74 151 -65 -258 393 300 -123 336 218 -393 11 119 -157 -354 179 47 -292 -223 335 -139 -200
3389 -200 159 -191 -277 -7 258 -22 75 96 161 -184 225 95 -101 195 106 116 15 194 157 -259 63 21 -122
3412 -122 -98 19 -106 21 121 76 -330 -147 -84 -263 -145 -14 -103 -48 -31 -103 45 192 190 138 349 53 49 -94
3436 -94 243 367 -275 83 -14 -220 89 317 -111 -124 124 -189 -221 -170 13 -258 -344 121 -142 -353 -66 137
3458 137 116 120 -50 -155 68 155 179 -226 -3 457 139 -58 140 60 1 144 220 145 -138 19 -208 -130 -49 -130
3482 -130 -214 -177 106 -226 -42 -15 8 -229 66 -35 150 134 52 336 231 30 24 137 540 113 -19 191 166
3505 166 -77 69 20 118 26 42 -376 -93 -18 -193 -340 67 158 15 -90 141 109 -292 -90 247 -103 -94 85
$$ packed form
3347D7k15L13j61l29K41K30k60p2j36K4p2M04L47n31J37L71k12l51M94k74j25
3368a30K04P7k16j93O51r3m23M59j18o11M04J08k76j97N33j32l39O9N58m74o1
3389b00L59l50q6K70K65k80R7K1O5l45M09j30j96K96q9J0j01J79l7m16L22m2j43
3412a22K4J17j25J27J00m5m06J83O3j79J18J31q9N5J7p2J48J47kn2K11k96mj43
3436i4L37J24o42L58r7k06L09K28m28j3K48l13l2N1J83k71q6M65k63k11K87K03
3458A37k1Mj70j05K23Q7K4m05K23M60l18j97J98q0n9J43P6p5k83J57k27P8Q1q1
3482a30q4L7K83l32J84K7K3k37K95j01J85j6q2K84j05k01oJ13M03m27j32K10k5
3505A66k43J46m9R8r2J6m18K83P5j75j47M07R1j43j05K31l2m01K02L37l50RJ79
$$ plain form
3528 85 244 21 204 318 -221 -50 273 12 -224 78 11 -120 3 22 -29 -302 173 124 -236 -114 -227 144
3550 144 -376 -16 -42 -226 124 -133 -64 -14 322 -206 -95 51 63 -42 -10 230 32 294 132 81 -260 -62
3572 -62 -106 -98 49 -199 -141 177 -70 -165 -78 -65 49 -26 141 -215 -24 -51 287 -94 -84 282 70 100 238 266
3596 266 -178 12 -21 -6 -79 135 -113 -70 249 37 -54 -297 37 -4 -157 -22 -167 -97 -26 -132 -352 -182 -121
3619 -121 -16 -82 -6 88 -137 129 352 260 61 161 54 -124 220 91 54 -80 115 49 3 -6 69 118 28 -3
3643 -3 45 -215 -193 -279 -185 -161 70 -120 -269 -154 191 107 -25 29 25 374 86 11 -23 131 137 271 293 -28 -15 -23
3669 -23 19 22 -57 -70 -344 -177 -215 -91 -293 -177 164 -201 -50 123 -61 -114 201 167 -160 13 188 -49 135
3692 135 290 189 -31 143 365 86 6 148 109 -109 107 -35 35 -6 -275 217 -70 111 -85 -93 20 -247
$$ packed form
3528H5J59k23J83J14n39J71L23k61k36L02o7j31J23J9n1k73M75m9l60J22j13L71
3550A44n20L60k6j84L50k57O9N0L36n28J11J46J2j05L2K40j98K62j62n1l41J98
3572f2m4QJ47k48N8L18k47r5Q7J3J14p5J67l56J91k7L38l81J0L66k12L0J38K8
3596B66m44J90l3J5p3K14k48M3L19k12r1k43L34m1j53J35j45P0P1j06k20J70O1
3619a21J05o6P6R4k25K66K23r2j99J00j07j78L44j29l7j34J95o6m6rP5M9r0l1
3643cM8k60K2q6R4K4K31j90j49J15L45q4j32N4mL49k88p5l4J54OJ34K2l21J3q
3669b3M2Lp9j3k74J67l8J24k02J16L41l65J51J73j84n3L15l4l27J73J75k37J84
3692A35J55j01k20J74K22k79q0J42l9k18K16j42P0m1k69M92k87J81j96qJ13k67
$$ plain form
3714 -247 -88 -39 0 91 -29 -72 104 -49 -218 3 45 -37 311 87 258 80 -95 -59 48 -82 74 73 18
3737 18 4 -46 -139 -133 -270 119 -286 -97 -47 31 21 -103 -78 -38 172 28 106 145 -17 -100 26 -80 196 88 26
3762 26 -142 -143 -14 -271 1 -45 -146 -16 -16 92 -134 6 159 -77 -168 -10 -241 -185 108 132 -143 38 117
3785 117 -110 43 229 -42 52 143 144 62 130 303 86 -196 -30 195 -3 111 -232 3 -1 -18 -291 8 -255
3808 -255 -84 -465 23 -14 73 -97 -139 -221 169 273 11 39 260 149 180 159 311 -22 147 114 -34 168 48
3831 48 -190 -249 233 -5 94 -85 233 9 -237 -102 -91 -107 -110 -137 -75 40 87 173 135 261 408 41 -153 177
3855 177 241 129 25 316 56 -221 166 177 -143 70 -12 -126 -101 -154 -118 -149 194 -119 -174 71 90 24 -121
3878 -121 -167 -40 1 -58 43 229 26 -50 8 146 -18 172 230 -108 72 -197 -14 61 17 152 190 -61 -124
$$ packed form
3714b47J59M9L9R1j20m3J76j53j69K21M2q2L48k24J71j78j75L6J07j30J56jn5
3737A8j4n0r3Oj37L89m05J89N0P8j0j24K5M0K10j44P8L9j62q3J26j06K76j08o2
3762B6j68jJ29k57K72m6j01J30%J08k26J40J53k36r1J58k31N6K93K4k75J81P9
3785A17k27J53J86k71R4R1Jq2O8J73k17k82J66K25j98J14l43K35mj7k73K99k63
3808b55J71l81M88l7Q7j70m2q2L90J04k62K8K21j11L1k1J52l33J69l3j48K02j20
3831D8k38n9M82k38R9j79L18k24k46J35J1j6lk7O2J15M7Q6l8J26J47l67j94L30
3855A77O4j12j04K91k60k77L87J1l20K13q2j14K5n3L6l1L43l13n5K45J9o6j45
3878a21m6J27M1n9J01J86k03p6N8J38j64J90N8l38J80k69J83P5m4J35L8k51o3
$$ plain form
3901 -124 72 -215 93 -197 306 -31 -175 180 -100 -107 -26 -64 -21 93 -17 -19 -16 71 209 -115 88 264 114
3924 114 -142 4 151 -230 76 195 18 -219 202 -89 -178 228 60 -55 -62 44 -47 9 -74 125 -186 8
3946 8 283 130 54 15 -100 -110 135 -78 -22 187 149 146 -136 53 18 -6 95 -93 -30 -162 82 -65 -334 -107
3970 -107 -3 -330 109 -79 215 74 295 -75 -50 152 -167 -161 30 179 157 334 -92 -18 -87 144 -201 -17
3992 -17 69 129 -133 -162 -57 -76 -349 16 -5 -71 -128 17 -78 -41 -12 96 -348 -65 -63 112 -42 -154 24 8 -71
4017 -71 63 -33 216 344 38 236 142 143 -345 -167 83 102 -63 107 -133 -27 -96 -392 46 134 110 8 30
4040 30 -18 -62 -2 -61 -78 -168 47 79 237 228 194 209 -148 10 -94 311 68 -52 -104 -79 85 -78 -157 -209 -256 47
4066 47 -68 103 -438 -232 -187 -276 141 -7 -165 -48 114 185 201 -60 164 152 141 -169 -173 171 79 19 -14 -52
$$ packed form
3901a24J96k87L08k90N03l37j44L55k80pQ1l8M3J14j10kLQ7J38l24K03J76j50
3924A14k56J46J47l81L06J19j77k37M21k91q9M06j68j15pJ06r1N6q3J99l11J94
3946HK75j53p6l9j15j0K45k13N6K09l8lk82J89l5k4J01j88O3j32K44j47k69K27
3970a07J04l27M39j88K94j41K21l70K5K02l19OJ91J49k2J77m26P4o9K31l45J84
3992a7Q6O0k62k9J05j9k73L65k1o6n7J45r5L7K9J08m44K83KJ75j54j12J78j6p9
4017g1J34r6K49J28l06J98r4Jm88J78K50J9j65J70k40J06o9k96M38Q8k4j02K2
4040C0m8m4O0n9j7r0K15L2J58rl4J5l57J58j04M05k43j20n2K5J64j63p9n2m7L03
4066D7j15J71n41K06M5q9M17j48j58J17J62P1J6k61K24j2j1l10mL44r2o0l3l8
$$ plain form
4090 -52 97 -38 80 141 303 -15 28 75 -115 -30 106 -27 -93 -137 122 -70 131 176 -108 -42 -153 -90 1 122
4114 122 59 6 83 234 -5 -97 125 51 199 116 -105 -102 -115 -239 -77 24 -103 -150 -93 -102 -128 -142 -58 75 -155
4139 -155 -60 -76 40 -198 207 300 -92 162 -94 -222 8 104 -178 -74 -57 -110 210 67 251 26 -78 -70 167
4162 167 -16 -173 -61 16 -65 21 99 -96 -112 -135 -103 -15 -17 380 80 189 -112 -180 -9 47 78 -84 189 -155
4186 -155 33 -183 -50 35 39 -97 157 -86 42 -387 -286 -201 -37 -179 200 22 10 -73 193 80 90 84 -89
4209 -89 -82 123 -78 276 33 209 7 227 -137 276 -21 -102 22 62 32 -52 -277 87 25 -102 -44 -286 -29
4232 -29 -19 21 -128 210 133 -72 138 308 -96 171 -19 53 97 248 200 302 138 -75 -61 -135 -20 93 -72
4255 -72 -135 155 -167 -399 11 -262 -163 -59 -124 227 -135 -122 49 -56 -8 -36 82 124 129 46 263 -35 88 176
$$ packed form
4090e2J49j35J18O1J62l18M3M7j90Q5J36j33o6m4K59j92K01M5k84O6j11O3R1J21
4114A22o3n3P7J51k39r2K22p4J48q3k21Lj3j24J62J01j27m7N7rk6j4Q4J33k30
4139a55R5j6J16k38M05R3l92K54k56j28K30R6k82J04J7n3L20j43J84k25j04QK37
4162A67j83j57J12P7q1Q6P8j95j6k3L2Q8kL97l00J09l01o8J71N6L1j62K73l44
4186a55J88k16J33Q5Mj36K54k43J28m29J01Q5J64j42L79j78j2q3K66j13J0oj73
4209h9PK05k01L54k43J76k02K20l64M13k97q1J24M0l0q4k25L64o2j27N8k42K57
4232b9J0M0j49L38p7k05K10J70m04K67j90P2M4J51m8J02j64k13J4p4J15J13j65
4255g2o3K90l22k32M10k73R9J04o5L51l62J3J71j05M8k8J18M2Nq3K17k98J23Q8
$$ plain form
4279 176 -54 82 237 106 94 48 -9 -128 -132 166 69 -2 -165 138 -62 -154 70 -296 0 100 162 2 133
4302 133 -38 147 257 21 52 44 -37 120 54 6 119 -95 -36 244 160 -216 85 47 118 -206 15 -125 -12
4325 -12 -91 66 47 -87 115 14 -102 -97 34 -21 169 -75 -11 102 196 -157 27 233 -1 193 -101 130 96
4348 96 136 69 -144 151 -63 -40 -159 -207 54 -114 16 -166 -69 -141 -62 2 -86 28 -4 137 239 207 13 25
4372 25 206 -84 4 49 -41 -188 218 -129 277 -43 -54 -64 -58 -181 29 -28 -91 -1 159 94 175 5 -159 -224 -303
4397 -303 62 60 97 -175 -136 151 234 245 360 -17 179 -155 -78 -97 77 -30 40 127 -155 51 30 -83 -171 -135
4421 -135 45 -59 38 -4 -107 -134 -62 112 149 23 -200 -39 64 -75 127 53 286 76 -7 283 -123 -157 -12
4444 -12 118 -173 24 -9 99 98 82 -63 -192 -134 -30 -39 119 33 -68 -69 -93 85 -111 -43 171 -173 7 56 287
$$ packed form
4279A76k30J36J55j31j2m6n7j19mK98r7p1j63L03k00r2K24l66K96J00O2j60J31
4302A33j71J85J10k36L1qq1J57o6m8J13k14N9K80q4l76L01l8P1l24K21j40J13
4325a2p9J57j9j34K02j01j16NJ31n5J90k44O4J13R4l53J84K06k34J94k94K31l4
4348I6M0o7k13K95k14K3j19m8K61j68J30j82R7p2P9O4q8J14l2J41J02l2j94J2
4372B5J81k90Q8M5r0j47M06l47M06l20j1j0Oj23K10n7o3R0J60o5Q1j70j64o5p9
4397c03L65kL7k72L9K87Q3J1J15l77J96l34P7j9J74j07P0Q7k82K06k1j13q8L6
4421a35J80j04R7m2j03k7P2J74L7j26k23J61J03j39K02p4K33k10q3K90m06l4J45
4444a2J30k91J97l3J08jj6j45j29N8J04rJ58q6j01jk4J78j96O8K14l44J80M9K31
$$ plain form
4469 287 -4 180 -44 310 115 -41 207 99 32 220 41 -112 -3 110 -184 5 132 -228 -102 45
4489 45 -220 -115 -30 -87 -16 177 -32 101 34 -121 -63 -50 106 50 105 97 -59 -72 69 -7 17 163 -69 -4 13
4514 13 182 -76 -57 -78 25 -65 137 145 -168 57 -59 83 35 -86 96 14 230 101 229 185 83 -95 -27
4537 -27 159 196 357 288 75 -257 163 73 106 -169 -172 -111 40 -8 -62 -123 17 17 -322 -141 -8 82 210 25 116
4562 116 -65 4 -78 -299 -31 168 312 -19 112 152 -17 84 18 119 -59 278 48 42 -106 -23 -166 -197 132
4585 132 154 23 -140 98 31 54 -173 25 -190 99 94 -249 133 -194 138 185 -87 173 31 -165 91 -156
4607 -156 -79 329 31 62 -51 -44 -149 141 -169 44 -86 23 -186 34 -161 -36 35 64 103 318 46 -169
4629 -169 164 168 364 190 -68 121 -39 -57 266 218 -231 -128 97 -52 -132 -139 -76 -83 -189 -46 -234 -71 -200
$$ packed form
4469B87k91J84k24L54j95j56K48j08o7J88j79j53J09J13k94J89J27l60J26J47
4489D5k65J05Q5n7P1J93k09J33o7j55N8J3J56n6N5qj56j3J41p6K4J46k32O5J7
4514A3J69k58J9k1J03r0K02Ql13K25j16J42m8j21J82q2K16j29J28m4j02j78O8
4537b7J86L7J61o9k13l32M20r0L3k75lO1J51m8n4o1J40%l39J81J33R0J28j85R1
4562A16j81O9q2k21K68J99J44l31J31M0j69J01o6J01j78L37k30oj48Q3j43l1L29
4585A32K2j31j63K38o7K3k27J98k15K89nl43L82l27L32M7k72K60j42j96K56k47
4607a56P7M08k98L1j13Pj05K90l10K13j30J09k09K20j95J25P1K9L9K15k72k15
4629a69L33MJ96j74k58J89j60j8L23m8m49J03K25j49q0pO3pj06J43j88J63j29
$$ plain form
4652 -200 -163 -3 57 3 84 87 -51 -132 67 310 -120 279 116 -83 -2 99 -24 173 -22 116 224 -134 60
4675 60 152 -142 -7 -59 -44 -151 -179 -40 -49 33 -46 -142 -208 215 51 27 -21 194 -129 207 32 18 282 97 170
4700 170 -151 62 -108 162 39 159 0 -89 -2 8 -183 -154 25 -112 -147 -43 -173 171 -30 45 -300 40
4722 40 214 98 -27 -168 251 -80 136 111 281 87 -90 -129 196 174 -24 -24 -47 -51 -99 -79 -50 -291 6 -63
4746 -63 79 -220 -140 46 -94 -151 94 -65 78 -34 23 -197 110 436 208 -39 -169 132 -3 234 79
4767 79 293 -125 -67 -87 111 151 155 119 -161 127 -8 -51 -233 84 -46 -129 91 -64 143 91 46 1 29 18 11
4792 11 -68 76 251 36 44 174 -164 23 173 2 196 -18 42 -163 -314 218 -165 -278 13 -154 -84 -110
4814 -110 33 -224 -273 -134 -26 -16 -169 41 0 -118 -106 -38 -24 230 30 426 101 131 -28 -21 90 230 34
$$ packed form
4652b00L7J60O0n4Q1Lj38q1J99K43m30L99j63j99Q1J01j23J97j95J38J08l58J94
4675F0R2k94J35n2J5j07k8J39rQ2p9r6o6M23j64k4m8K15l23L36j75j4K64j85P3
4700A70l21K13j70K70j23J20j59q9Q7J0j91K9J79j37l5J04j30L44k01P5l45L40
4722D0J74j16j25j41M19l31K16k5J70j94j77l9L25k2j98%k3mm8K0K9k41K97o9
4746f3J42k99Q0J86j40n7K45j59J43j12N7k20L07L26k28k47j30L01j35K37j55
4767G9K14m18N8k0J98M0Ml6k80K88j35m3j82L17j30q3K20j55K07n2m5m5K8j1p
4792A1p9J44J75k15QJ30l38J87J50j71J94k14O0k05j51N32l83j13K91j67P0k6
4814a10J43k57m9J39J08J0j53K10m1j18J2O8J4K54k00L96l25L0j59PJ11J40j96
$$ plain form
4837 34 99 41 -263 127 10 105 -111 20 18 -189 -21 -32 -162 256 -78 147 -55 116 -33 -48 57 -15 -15 -132
4861 -132 190 230 151 -36 133 4 153 -125 65 51 -71 55 21 67 -189 -177 -32 -7 69 -114 -76 -212 13
4884 13 -43 -1 89 -120 15 120 14 -30 -96 -122 -6 10 -36 197 181 54 16 31 -251 64 -52 -79 -164 28 91
4909 91 -130 -89 -14 15 -172 24 138 -216 38 -78 -52 -39 108 -52 27 104 58 211 47 374 -2 204 94
4932 94 42 135 27 84 -28 -57 -133 171 -259 -31 219 -148 32 -182 -201 -67 -210 -338 -106 77 57 7 -139
4955 -139 161 139 143 46 -84 -45 40 181 105 -187 102 110 -101 61 10 -218 -277 -268 -23 -108 -36 -70 -129 -38 248 176
4981 176 -19 -128 -18 -239 239 180 81 159 132 82 -18 190 -63 72 -160 159 75 -175 -67 -16 -108 -15 126
5004 126 53 61 123 12 -110 -209 15 -148 18 -21 125 210 -90 -102 98 1 130 13 14 75 -116 71 -29 21
$$ packed form
4837C4O5n8l04L90j17R5k16J31kk07J68j1j30M18l34K25k02J71j49j5J05p2%j17
4861a32L22M0p9j87J69j29J49k78J90j4j22J26l4M6k56J2J45K5P6j83L8j36K25
4884A3n6M2R0k09J35J05j06m4o6k6J16J6m6K33j6j27l8J5k82L15j16k7q5J92O3
4909I1k21M1P5K9j87J96J14l54K54j16K6J3J47j60P9P7m6J53j64L27l76K06j10
4932I4n2R3j08N7j12k9p6L04m30K28K50l67J80k14j9J34j43j28K32J83k0n0j46
4955a39L00k2Mr7j30L9Q5J41p6k92K89Qk11J62n1k28n9RK45q5P2l4n9R1K86p2
4981A76j95j09J10k21M78n9r9P8k7n0j00K08k53J35k32L19q4k50J08N1r2R3J41
5004A26p3QO2j11j22r9K24j63J66l9J46Q5l00j2K00r7J29j17JO1j91J87j00N0
$$ plain form
5028 21 219 -12 205 89 -189 -48 63 90 -65 3 152 -122 62 -264 -74 33 149 85 119 134 196 -30
5050 -30 252 174 -18 114 114 -7 -10 42 63 17 155 -21 102 -105 202 -20 -42 -179 -108 -139 -40 -10 -16 20 -105 75
5076 75 -104 -37 87 78 -47 -31 -233 -75 19 98 68 -70 33 137 -91 46 -64 -35 -120 79 -203 293 41
5099 41 -101 29 -86 88 -77 1 5 -161 -172 -122 -153 -157 -153 -349 -12 251 -119 67 270 -20 -61 202 77 -91
5123 -91 -96 35 -246 59 -138 146 -162 142 22 32 108 61 -50 -6 0 -166 -25 6 -206 33 -37 87 255 208
5147 208 -4 -161 87 139 -3 202 -68 6 7 32 -75 -73 -148 -168 -21 -142 -161 6 -146 -102 -347 -40 -159 -252
5171 -252 -24 -76 -275 201 57 -331 9 223 -113 42 -108 72 86 -27 144 -94 -150 -36 87 -45 -2
5192 -2 106 206 -142 152 -138 -100 79 20 -159 -60 -76 -177 103 140 20 172 -14 48 33 11 3 -67 64 327
$$ packed form
5028B1J98k31K17j16k78J41J11K7j55O8J49k74J84l26J90J07J16o4L4J5O2k26
5050c0K82p8j92J32%j21lN2K1m6J38j76J23k07L07k22k2j37P1l1R9L0oL6j25J80
5076G5j79O7J24rj25J6k02J58R4P9l0j38J03J04k28J37j10K9q5J99k82M96k52
5099D1j42J30j15J74j65P8Mj66j1N0l1mMj96L37K63l70J86K03k90m1K63j25j68
5123i1nJ31k81L05j97K84l08L04j20J0P6m7j11M4Oj66J41L1k12K39p0J24J68m7
5147B08k12j57K48N2j42K05k70P4JK5j07Kp5k0J47j21j9J67j52M4k45L07j19r3
5171b52K28n2j99M76j44l88L40K14l36J55j50J80J4j13J71k38n6J14J23j32M3
5192bJ08J00l48K94k90L8J79n9j79R9j6j01K80L7j20J52j86O2j5k2qp0J31K63
$$ plain form
5216 327 206 179 162 250 95 17 175 81 -55 315 154 -292 69 356 142 99 35 -40 -165 -76 17 43 160 -98
5240 -98 7 62 167 271 424 183 73 -108 45 91 -37 146 140 312 93 75 34 44 -133 -211 302 55 146
5263 146 5 75 129 -100 -55 63 61 -26 55 -279 -163 -172 -222 268 75 -91 -32 -120 103 -108 -11 59 97 119 106 10
5289 10 154 -31 53 -9 -59 -186 38 -58 -25 -86 161 -85 108 -99 69 43 -140 -163 158 29 69 183 71
5312 71 199 250 113 -164 168 -85 -48 -40 169 -7 -95 -146 226 -127 -235 -23 71 -290 88 -102 -255 -60 24
5335 24 -144 253 -180 -55 -206 228 64 111 171 50 106 39 325 -227 212 188 251 54 55 79 -74 84 52 -218
5359 -218 -17 -26 26 -243 245 -68 -138 262 39 121 -78 24 96 -8 -60 52 225 157 -169 136 -241 -67 148
5382 148 -185 156 -85 157 -59 202 71 4 126 114 94 -242 44 -12 72 -9 104 -50 -159 -150 -189 -16 133
$$ packed form
5216C27j21k7j7Q8j55p8J58r4j36L70j61m46L61K87k14m3o4p5j25Q9R3K6J17k58
5240i8J05N5J05J04J53k41j10j81J53M6j28J83oJ72k19j8m1J0j77p8N13k47R1
5263A46j41P0N4k29M5J18kq7Q1l34J16rn0M90j93j66N9q8K23k11R7P0L8K2j3r6
5289A0J44j85Q4o2n0j27K24r6L3o1K47k46J93k07J68k6j83k3L21j29M0J14j12
5312G1J28N1j37k77L32k53L7QK09j76q8n1L72l53j08K12R4l61L78j90j53J95Q4
5335B4j68L97m33J25j51M34j64M7O0j21N6o7K86n52M39k4O3j97JK4j53J58l2k70
5359b18K01rN2k69M88l13p0M00k23Q2j99J02P2j04n2J12J73o8l26L05l77J74K15
5382A48l33L41k41K42k16K61j31o7J22j2k0l36K86n6Q4q1J13j54j09Rl9J73J49
$$ plain form
5405 133 89 40 -48 -90 14 -153 -255 -145 -249 176 67 113 54 -73 14 -2 -53 166 -7 -18 204 -32 51 -140
5429 -140 -75 -96 -186 73 -25 177 57 -175 13 -108 -144 107 -7 -226 199 282 -90 -100 -57 -158 161 124 218
5452 218 -43 -217 -19 -60 124 -117 -79 -357 105 232 -58 109 -53 65 -162 -93 -75 109 -144 19 33 -62
5474 -62 151 40 135 -65 110 30 66 -55 -76 49 221 -34 -73 160 37 1 -296 25 -186 -58 68 -10 -155
5497 -155 -21 155 -44 -12 -8 -16 -13 -23 -47 -70 60 356 180 68 273 -80 101 -105 217 268 -67 -83 343 -75
5521 -75 -222 29 -76 -95 -291 -63 -314 -38 75 -125 -4 20 114 -208 85 103 101 132 10 -39 93 136 -162
5544 -162 193 -47 81 7 -157 69 25 -147 -221 25 -131 47 -16 -20 15 242 188 -381 -2 -197 -69 -167 -255
5567 -255 -23 37 -116 -48 228 290 -127 -114 160 32 95 -237 180 -97 41 -61 -256 -1 -35 -39 -181 -322 -150
$$ packed form
5405A33m4m9q8m2J04j67j02J10j04M25j09M6n9j27Q7j6n1K19j73j1K22k36Q3j91
5429a40O5k1r0K59r8K02j20k32J88j21l6K51j14k19M25Q3l72j0M3j01L19l7R4
5452B18k61j74J98m1J84k41L8k78M62J27k90J67j62J18k27O9J8J84k53J63J4r5
5474f2K13j11R5k00J75q0L6j21k1J25J72k55l9K33j23l6k97L21k11J28J26p8j45
5497a55J34J76j99L2MqLj0k4k3J30K96j76j12K05l53J81k06L22N1l35j6M26m18
5521g5j47K51j05j9j96K28k51K76J13k00J21K4R4l22K93J8kL1j22m9J32M3k98
5544a62L55k40J28p4j64K26m4j72p4K46j56J78o3mL5K27n4n69L79j95J28r8q8
5567b55K32O0j53O8K76O2m17J3K74j28O3l32M17k77J38j02j95K55l4mj42j41J72
$$ plain form
5590 -150 -147 -87 -45 -208 -48 -175 -82 204 94 242 122 216 89 -34 -195 -7 227 230 245 56 -16 -14 -55 65
5614 65 89 -135 223 -46 -62 10 -150 229 100 -37 -96 114 109 -147 9 237 56 -28 -40 -79 72 -120 61
5637 61 -104 30 279 -42 181 49 148 -247 -240 184 100 -44 -144 -107 -245 32 -66 -150 -138 -301 -41 109 -176
5660 -176 37 -82 -91 24 133 116 -111 345 -80 182 118 106 192 -45 41 162 30 -180 -13 79 84 -26 98
5683 98 61 37 -29 67 121 161 -153 -117 56 -3 -4 18 123 149 213 104 -96 88 202 -105 217 8 74 -145 266
5708 266 18 77 -36 292 153 183 -78 20 -160 -78 18 -36 187 -221 194 149 35 117 -65 95 -15 -45 190
5731 190 -257 22 48 228 51 -44 88 -23 219 -40 284 120 272 83 230 -169 -30 94 -187 108 -157
5752 -157 -54 -201 -6 2 -15 111 138 -8 122 80 -182 -168 76 -146 -28 -68 -76 -124 -268 246 -108 197 79
$$ packed form
5590a50LO0M2j63J60j27R3K86j10J48j20R4j27j23j61J88K34LJ5j89p2Km1J20
5614F5K4k24L58k69j6P2j60L79j29j37n9K10nk56J56K28j81q4j2l9J51j92J81
5637F1j65J34K49l21K23j32R9l95PM24q4j44j00L7j38K77r8q4J2j63K60J50k85
5660a76K13j19rJ15J09j7k27M56m25K62o4j2Q6k37Q6J21j32k10J67R2Nj10J24
5683I8l7k4o6R6N4M0l14L6J73n9jK2J05K6O4j09k00J84J14l07L22k09O6k19M11
5708B66k48N9j13L28j39L0k61R8j80Q2R6n4K23m08M15m5j14Q2j82J60j10l0K35
5731A90m47K79K6J80j77r5J32j11K42k59L24j64J52j89J47l99J39J24k81K95k65
5752a57J03j47J95Qj7J26K7j46J30m2k62J4K44k22J18m0qm8j44N14l54L05j18
$$ plain form
5775 79 108 -63 -40 -22 -21 13 -87 153 -104 -203 -116 92 -124 326 -54 -100 -142 -116 33 24 -138 -72 -57 112 223
5800 223 -27 85 175 -165 -137 237 -11 -70 28 -37 -204 -63 157 -41 -92 141 -22 -227 16 -101 -150 -122 -52
5823 -52 -29 -58 -48 192 -2 -83 141 -41 -223 35 56 16 275 103 17 -239 161 -139 4 -35 -71 207 -78
5846 -78 -68 -100 26 90 315 426 106 29 -142 46 -103 -35 137 56 -183 115 -114 49 10 -42 131 -16 2
5869 2 -68 -211 -97 -12 41 -64 55 29 -104 -81 -174 -130 -116 20 130 38 34 186 157 103 -112 34 -48 118 94 79
5895 79 -126 23 159 7 -133 -20 92 -124 -91 -35 281 -35 -250 9 -29 39 -238 -58 94 -304 158 19
5917 19 120 -55 -108 145 -153 -121 345 86 48 126 165 -19 -31 -51 51 -9 99 16 -113 69 -50 -225 17
5940 17 82 -2 -23 13 -23 -99 -110 -266 4 -143 44 54 -18 -30 5 22 -72 -16 244 -19 -154 -3 12 23 -49 116
$$ packed form
5775G9K9j71K3J8JL4j00K40k57r9Q7K08k16M50l80m6m2K6J49rj62O6J5J69J11
5800B23k50J12R0l40K8L74k48n9R8o5j67J41K20j98n1K33j63k05K43j17m9K8P0
5823e2K3k9J0K40j94q1K24j82j82K58K1m0K59j72q6k56M00l00J43l9l6K78k85
5846g8J0l2J26O4K25J11l20p7j71J88j49O8J72q1k39K98k29J63l9n2J73j47J8
5869Bp0j43J14Q5N3j05J19k6j33K3r3M4J4J36J10r2mJ52k9n4k15J46q2J66k4j5
5895G9k05J49J36j52j40J13J12k16L3N6L16l16k15K59l8O8k77J80J52l98M62j39
5917A9J01j75n3K53k98L2M66k59l8P8L9j84j2k0J02o0J08q3j29J82j19j75K42
5940A7O5q4k1L6l6p6j1j56K70j47J87J0p2j2L5J7r4N6K60k63j35J51J5J1p2J65
$$ plain form
5966 116 204 -103 135 -250 -15 33 91 82 -20 -42 -342 228 58 -127 271 -83 41 -113 -90 -209 183 2
5988 2 83 205 -16 343 -36 41 24 -30 69 -188 -146 77 -71 -37 31 55 53 148 -211 -45 -70 23 -239 -44 53 402
6014 402 -200 17 136 -119 133 -4 65 243 -163 78 -171 23 17 37 282 66 12 -178 108 35 -30 -178
6036 -178 6 -28 16 -160 227 -121 116 -371 -198 120 -50 121 -177 -233 102 -41 -5 -129 39 80 50 189
6058 189 -36 92 50 -78 39 -23 -136 33 65 -60 -176 235 -13 153 301 202 260 -112 -169 -122 -57 -203 131
6081 131 -124 46 -195 -63 168 32 216 52 -70 109 349 -144 -11 147 172 -94 -12 -84 -14 173 -118
6102 -118 56 155 -54 52 -214 -130 65 -163 -143 5 6 19 -92 -186 226 -120 18 -22 -58 -85 226 72 141 174
6126 174 5 -35 -95 158 -61 51 -81 -98 112 200 97 124 -7 -171 190 -107 149 202 21 -100 -114 -344
$$ packed form
5966A16Q8l07K38l85K35M8N8rj02k2l00N70j70j85L98l54J24j54K3j19L92j81
5988BQ1J22k21L59l79P7j7n4R9k57M2K23j48L4O8K4kR5l59J66k5R3k62J95R7L49
6014D02o02K17J19k55K52j37O9J78m06K41k49J94oK0K45k16n4j90K86p3o5j48
6036a78J84l4M4j76L87l48K37m87J73L18j70J71k98n6L35j43L6j24J68M1l0J39
6058A89k25J28m2j28J17o2j13J69L2j25j16M11k48J66J48r9N8l72n7M7O5j46L34
6081A31k55J70k41J32K31j36J84j64j22J79K40m93J33J58K5k66Q2p2P0J87k91
6102a18J74R9k09J06k66Q4J95k28K0J48JJ3j11r4M12l46J38m0l6k7L11j54O9L3
6126A74j69m0o0K53k19J12j32j7K10Q8j03K7j31j64L61k97K56N3j81j21j4k30
$$ plain form
6148 -344 290 58 21 160 -138 82 70 -285 -151 -167 -92 361 230 86 170 151 -29 2 -41 85 -190 -12 -60
6171 -60 80 -18 6 -41 141 24 103 21 -10 8 4 26 218 -128 208 122 356 -32 166 205 50 195 97 82 77 142
6197 142 34 -8 -72 122 26 -35 -200 255 -247 141 -72 22 252 72 106 200 103 -132 35 113 15 -112 59
6220 59 145 -17 -77 -62 -78 76 -77 45 -269 289 178 198 0 -62 51 55 51 -96 -274 -84 61 -113 135 -8
6244 -8 204 117 -66 69 -161 87 133 1 -40 31 -17 -44 122 166 95 142 -129 13 206 -194 64 -161 -11 13
6268 13 -16 21 174 103 70 18 -85 -50 248 99 -224 0 -17 67 84 81 44 214 -117 178 -73 115 -65 38
6292 38 -38 -85 -58 -30 -240 -243 -246 -56 -84 285 66 255 -145 -48 152 144 41 185 -64 221 124 120 155 -21 111 180
6318 180 210 -103 -52 140 -60 49 234 33 162 -14 199 3 -31 86 75 132 144 36 -198 -130 26 41 -137
$$ packed form
6148c44O34k32l7J39k98K20j2l55J34j6P5M53j31j44Q4j9j80L1m3J26k75J78m8
6171f0J40r8K4m7J82j17P9q2l1J8mK2J92l46L36q6K34l88J98L9j55J45r8j5nO5
6197A42j08m2o4J94r6o1j65M55n02L88k13R4K30j80L4R4r7k35J67P8r8j27J71
6220E9Q6j62o0J5j6J54j53J22l14N58j11K0j98o2J13Mmj47j78J90J45j74K48j43
6244hK12q7j83J35k30K48M6j32m1P1m8k7J66M4p1M7k71J42J93m00K58k25J50K4
6268A3k9L7J53p1l3n2j03L5K98j49l23K24j7Q4J7ll7J70l31K95k51J88j80J03
6292C8p6m7K7K8k10llJ90k8L69k19J89m00R7K00qj03J44k49K85r7mL5j76J32O9
6318A80L0l13N1J92k00J09J85k01J29j76K13j96l4J17j1N7J2j08k34O8J56J5j78
$$ plain form
6341 -137 -166 5 -41 -29 61 73 -193 -30 127 79 124 127 133 -80 -65 5 30 -68 19 19 130 -41 71 -59 -52 -96 -98 -108
6369 -108 6 131 17 -163 36 54 -1 -126 29 -113 90 119 -79 -103 -77 125 141 -221 8 0 -202 -59 -20
6392 -20 220 326 -156 -70 -147 66 -172 166 -46 -299 29 33 -116 -40 123 279 -8 -86 101 35 224 -3 71
6415 71 18 1 20 -36 -17 149 10 -110 253 -117 87 167 -101 -33 -149 -37 -134 -8 -22 72 -28 84 -5 293
6439 293 112 -107 143 -15 -86 50 -20 93 -250 75 -138 -37 -214 80 -93 -18 183 20 8 47 227 -147
6461 -147 -59 -73 -69 -54 69 50 53 185 14 6 -216 135 -5 -44 90 282 129 127 -166 27 -232 -217 166 -4 52
6486 52 -23 -92 238 304 -22 138 -125 114 68 -116 -112 77 -157 64 -93 91 -306 -137 -176 -63 85 140 -85
6509 -85 59 12 84 -1 72 -62 4 114 -109 -22 -36 -102 172 102 -11 1 -38 182 49 -175 -220 80 -120 157
$$ packed form
6341a37k9J71m6J2R0J2k66J63J57m8M5LOk13J5P0K5r8Q7%J11j71J12j30Pm4kj0
6369a08J14J25j14j80J99J8n5j25J55j42K03K9j98k4K6K02J6l62K29qk02J43L9
6392b0K40J06m82Q6p7K13k38L38k12k53L28Mj49P6J63J56k87p8J87o6J89k27P4
6415G1n3j7J9n6J9J66j39j20L63l70K04Q0k68O8j16J12r7J26j4R4j00J12q9K98
6439B93j81k19K50j58p1J36p0J13l43L25k13J01j77K94j73P5K01j63j2L9J80l74
6461a47Q8j4MJ5J23j9LJ32j71qk22L51j40l9J34J92j53kk93J93k59J5L83j70N6
6486E2p5o9L30O6l26J60k63K39m6j84MJ89k34K21j57J84l97J69l9J13J48N5k25
6509h5J44m7P2q5P3j34O6J10k23Q7j4o6K74p0j13J2l9K20j33k24m5L00k00K77
$$ plain form
6533 157 65 -150 -61 134 158 90 -52 174 -43 176 -36 109 40 46 -37 -7 8 211 -28 -46 132 -12 -137 -136
6557 -136 -106 98 -80 -99 -63 -77 -150 -182 -227 -94 -8 19 41 -198 -148 -190 258 -57 -48 14 33 48 117 69 200 210 217
6584 217 138 114 -141 66 61 -183 216 -91 -217 -390 -138 -217 -176 50 114 -83 -71 118 -337 -28 -21 -88 11 117
6608 117 267 59 14 25 376 84 -43 -13 121 132 15 -47 -101 -147 160 74 -37 -55 86 13 -86 -76 6 130
6632 130 80 -195 92 149 34 -67 238 132 -239 -19 1 -95 74 -115 20 -95 -236 -62 181 -23 -83 93
6654 93 88 162 202 -35 -135 155 279 235 -87 -195 -60 -140 -120 52 -60 -10 71 -26 107 -34 -70 145 -142 159
6678 159 196 -39 218 91 74 15 -118 -33 -412 36 -55 -111 -20 37 -125 -143 -150 42 55 -129 1 -9 -64 131 117
6703 117 190 72 -75 -11 163 -168 -78 -20 63 105 -94 60 -37 -157 -6 -142 91 86 47 -240 -173 -127 -120 55 -124
$$ packed form
6533A57r2k15Q9J95K4o8j42K26k17K19k12J45o9Oq3L0J5K03k39j8J78j44j25J
6557a36L0K04j78j9L6j4p3l2m5J33Q6K7K2k39N0m2M48l15RO2J9J5O9m8J31J0P
6584B17p9k4k55K07nk44L99l07j26j73K52p9M1K26O4j97J2J89m55L09Po7R9J06
6608A17J50k08m5J1L51k92j27L0J34J1j17o2n4m6L07q6j11j8J41p3r9J0Q2J24
6632A30n0k75K87N7j15j01L05j06l71K20K0r6J69j89J35j15j41J74K43k04o0J76
6654I3nP4M0k37j00K90J24m4l22j08J35q0K0J72j12N0Q1r7J33j41l6K15k87L01
6678A59L7k35K57j27j7n9j33Q5l79M48r1n6R1N7j62j8pJ92J3j84J30j0n5J95j4
6703A17P3j18j47O4J74l31R0N8Q3M2j99J54r7j20J51j36K33nl9k87O7M6PJ75j79
$$ plain form
6728 -124 132 -155 -201 -40 -153 8 73 230 -125 -165 -29 194 301 -75 24 -164 -228 39 98 -18 52 -2 -96
6751 -96 165 -112 -360 47 -159 -5 104 11 183 67 24 102 -122 -17 99 17 101 112 31 -334 74 40 222
6774 222 -243 -51 48 -185 94 221 185 49 -249 22 -47 88 160 -210 205 33 -74 -260 72 -63 -127 76
6796 76 -40 90 151 -31 93 163 -3 -107 -39 36 48 90 35 -230 307 50 -53 -233 125 268 -211 34 -80
6819 -80 21 174 -60 -6 -10 133 85 -24 50 -48 -54 63 197 -2 -24 160 10 18 20 12 -8 86 21 191 30 -204
6845 -204 -124 51 -249 53 -103 21 -126 -38 294 57 -50 -148 -157 -19 -85 57 30 29 -60 -9 -219 -154 186 121
6869 121 53 -88 -8 -103 -90 128 -144 -146 -139 -32 -214 248 -104 -3 -8 55 -60 275 12 -20 142 126 79 146 -43
6894 -43 115 381 -62 107 -47 -8 67 149 274 62 -82 -33 48 19 141 -13 131 87 -88 7 -227 -71 -60
$$ packed form
6728a24K56k87m6J61j13J61O5J57l55m0J36K23J07l76R9j88o4K67N9j16P0n4r4
6751i6K61k77k48M07k06J54J09r3J72j16m3P8k24J05J16q2Q4J1q1l65M08l4J82
6774B22m65J92R9k33K79J27l6j36k98K71o9J35P2l70M15j72j07j86L32j35o4K03
6796G6j16J30O1j82J24P0j66j04O8P5J2M2n5k65N37k57j03j80L58J43m79K45j14
6819h0J01J53k34N4mJ43m8j09P4r8oJ17J34j99k2J84j50QKqk0R4o5J70j61k34
6845b04Q0J75l00L02j56J24j47Q8L32k37j07r8rJ38o6J42k7jq9N1k10O5L40o5
6869A21o8j41Q0r5J3K18k72kPJ07j82M62l52J01nO3j15L35k63l2J62j6m7O7j89
6894d3J58K66m43J69j54L9P5Q2J25k12j44M9Q1k9J22j54J44m4j75R5k34J56J1
$$ plain form
6917 -60 -97 -2 66 -187 -206 210 -125 -12 161 120 166 102 60 217 14 -59 -35 -201 -69 244 -32 169 191 75
6941 75 82 165 110 24 41 69 56 -47 20 -77 -164 -332 -61 -48 -267 -67 -31 -155 -3 33 26 80 166 123 -205 -95 -115
6968 -115 51 104 14 12 176 109 -94 -89 -160 -162 39 -47 -91 -65 167 -110 -10 113 -114 -108 -116 -186 197 293 150 -84
6994 -84 -25 39 -139 -41 -1 70 -87 83 -174 -69 296 115 -346 51 158 -18 -71 -166 -37 -132 -47 158 82 -133
7018 -133 173 157 72 -355 22 12 -265 -10 -88 -211 89 66 -125 -9 19 34 -270 48 -160 -122 44 -177 108
7041 108 -15 -44 -9 10 -189 -21 115 68 31 226 160 157 -60 80 -36 -109 111 285 113 176 152 -29 -15 97
7065 97 49 72 349 -11 30 -146 -245 226 30 25 145 50 87 167 166 -125 -89 -121 212 293 117 -66 -55 -4 -16 121
7091 121 60 37 -161 -203 -36 -39 -1 -7 57 365 190 43 -144 -8 -167 -25 193 -27 39 92 74 -153 112 -89
$$ packed form
6917f0l7R5O8k53j9M16l35J13J73m1M6o4m2J57k03p3K4j66J32L13k76K01K2j16
6941G5PQ3n5q6J7K8j3j03O7r7q7j68K71J3k19K00L6j24J52L6pN4Q6m3l28J10k0
6968a15J66N3r0kJ64o7k03Np1kK01q6m4K6K32k77J00J23k27Oqp0L83R6j43k34
6994h4N9O4j78R8M0P1j57J70k57J05L65j81m61L97J07j76n3r5J29r5Q5K05p6k15
7018a33L06j6q5m27L77j0k77K55p8j23L00k3j91J16K8J5l04L18k08L8J66k21K85
7041A08j23k9L5J9j99J68J36m7l7J95o6lk17J40j16p3K20J74j72O3k4j81J4J12
7065I7m8K3K77l60M1j76r9M71j96nJ20r5L7Q0jk91L6l2L33Q1j76j83J1N1j2J37
7091A21o1k3j98m2J67lL8oO4L08j75j47j87J36j59J42K18k20O6N3j8k27K65k01
$$ plain form
7115 -89 128 139 40 95 -244 70 213 134 29 -148 -4 -50 -53 132 144 138 -24 -185 101 -20 -216 -93 -63 41
7139 41 -333 -87 133 -126 43 297 -76 -106 94 39 140 -59 58 -40 96 -134 137 110 65 124 147 -71 76
7162 76 223 270 -77 -49 1 2 -107 -54 -96 -170 -190 44 -35 -85 -34 -59 2 80 -146 -52 149 187 38 123 -123 11
7188 11 122 127 140 43 268 4 78 128 96 -155 -95 12 -95 -254 -172 -232 -74 -35 98 91 51 184 295 -55 -418
7213 -418 -190 144 -103 -45 91 -115 53 48 13 -172 105 75 50 10 133 -110 169 12 -148 -23 -131 -85 28
7236 28 -258 25 -12 51 106 152 9 70 -75 54 -36 197 -91 102 63 -97 -11 221 118 -22 47 0 50 125
7260 125 75 191 71 23 -82 -65 22 61 39 141 7 -8 280 -133 -53 -94 -169 -25 -127 -204 101 97 182 121 -88
7285 -88 143 157 55 160 -149 -37 73 -23 -103 -120 2 -27 -158 65 -58 49 -1 -36 -212 218 -189 -216 208
$$ packed form
7115h9K17J1r9N5l39L14J43p9j05j77J44m6lJ85J2oj62j61K86j21j96J23L0J04
7139D1l74K46K20k59J69K54l73l0K00n5J01j99J17r8J36k30K71k7m5N9K3k18J47
7162G6J47M7l47K8N0Jj09N3m2p4k0K34p9n0N1k5O1P8k26R4K01L8j49Q5k46J34
7188A1J11NJ3r7K25k64P4N0l2k51O0J07j07j59Q2o0J58L9J33pm0J33J11l50l63
7213d18K28L34k47N8J36k06J68nl5j85K77l0k5m0J23k43K79j57j60J25j08M6J13
7236B8k86K83l7O3N5M6j43O1j45J29r0K33k88J93l9j60Q6K32j03j40O9m7N0P5
7260A25n0J16j20m8j05J7Q7L9k2J02j34j5K88m13Q0m1p5J44j02p7L05mQ5o1k09
7285h8K31J4j02J05l09J12J10r6q0j7J22k9j31K23j23J07n0l5j76M30m07k7M24
$$ plain form
7308 208 220 145 40 97 100 70 -142 -49 228 68 119 68 -83 -196 90 276 -76 138 75 31 16 139 -7 -21
7332 -21 95 -272 88 -108 18 -71 -189 263 73 -11 -4 -133 169 20 -54 -5 146 125 7 166 39 6 60
7355 60 -146 36 99 95 -33 -300 -126 110 33 95 -178 54 -51 -11 -138 18 -96 12 -162 -38 73 131 93
7378 93 -241 118 106 72 -8 -3 -84 40 -124 4 98 82 146 216 256 71 -286 -173 -2 -68 128 -94 -43 -95 -40
7403 -40 -171 22 -123 -26 236 36 -21 -106 -92 154 160 -111 110 184 -87 -229 82 18 -146 98 63 -10 -48 47
7427 47 87 66 -193 -146 -100 67 -33 21 -12 -438 -128 -130 -168 -15 87 -27 -22 -232 22 85 -67 18 -119 188 -11
7452 -11 180 -56 3 -185 -61 -162 -76 145 -183 -194 54 43 -224 -227 138 73 -149 -78 -123 -127 -18 -50 29 -159 35
7477 35 67 -94 205 -19 45 -84 191 79 74 -60 -19 85 -50 213 48 -113 -231 94 49 84 -145 -183 -151
$$ packed form
7308B08J2p5j05N7Ll0k12R3K77j60N1n1j51j13K86J86l52K14o3m4j5J23j46j4
7332b1J16l67L60j96J26q9j18M52j90q4Pj29L02j49p4M9J51k1j18J59j27l3N4
7355F0k06J82O3mj28k67J74K36p7O2k73K32j05M0j27J56j14J08j74J24J11N8l8
7378I3l34L59j2l4q0Nq1J24j64J28R4j6O4P0M0j85l57J13J71o6J96k22N1n2N5
7403d0j31J93j45R7K62k00n7q5J4K46Ok71K21P4k71j42L11o4j64K44l5p3l8R5
7427D7M0k1k59M7M6J67j00N4l3m26L10kl8J53J02j14Nk10K54O3j52Q5j37L07j99
7452a1J91k36N9j88J24j01Q6K21l28j1K48j1k67lL65o5k22P1m5mJ09l2P9j88J94
7477C5L2j61K99k24O4j29K75j12nj34M1J04j35K63j65j61j18L25m5L5k29l8L2
$$ plain form
7500 -151 -22 -130 10 96 -71 96 51 -29 -19 -56 -77 -107 127 124 -17 59 153 -10 83 201 155 4 23 -64 1
7525 1 -59 121 92 -96 -137 75 -183 86 -29 115 187 -172 -6 -29 -102 -230 49 121 16 -14 -38 134 262 107
7549 107 111 -88 200 -265 101 5 9 45 -213 22 -82 107 -115 -47 58 81 -312 -129 156 -111 -85 -90 5 -39
7573 -39 -115 -32 136 -62 53 257 87 165 57 180 140 49 118 21 272 44 -209 251 231 -92 -75 -91 -105 102
7597 102 -68 106 -123 188 49 -191 0 5 24 134 57 -195 -448 -186 130 -109 37 176 -165 132 266
7618 266 -3 -103 109 -135 -9 -179 193 190 -141 -30 -1 -68 46 -86 269 -196 37 58 169 -67 154 -15
7640 -15 -57 247 82 88 -93 210 50 193 -74 -128 35 -8 -25 -260 -55 108 39 61 38 -158 -122 -108 -44 -20 -9
7665 -9 -39 -24 -124 22 109 -122 0 -152 198 30 188 312 -33 1 236 -103 151 118 264 -111 -23 -23 0 -35
$$ packed form
7500a51J29j08J40Q6j67J67m5q0J0l7k1l0K34lj41P6R4j63R3J18m6j51J9q7O5
7525Ao0J80k9j88m1K12k58K69j15J44P2l59J66k3p3j28K79P2j05l0k4J72J28j55
7549A07Mj99K88m65L66r6ML6k58K35j04J89k22O8J05K3l93J83K85k67K6nR5m4
7573c9p6Q3J68j98J15K04j70P8j08J23m0r1O9r7K51k28k53M60k0l23J7j6j4K07
7597A02j70J74k29L11j39k40J91NJ9J10p7k52k53K62L16k39J46J39l41K97J34
7618B66k69j00K12k44J26j70L72ll31J11K9o7J14j32L55m65K33K1J11k36K21j69
7640a5m2L04j65Oj81L03j60J43k67n4J63m3j7k35K05J63o9K2k3j96L6J4O4K4J1
7665il0J5j00J46Q7k31J22j52L50j68J58J24l45L4K35l39K54l3J46l75Q8%K3l5
$$ plain form
7689 -35 -41 -211 -162 1 -70 -89 84 127 29 44 -70 22 -16 166 130 111 186 22 148 -221 -88 -82 -243 -53 -19 -93
7715 -93 17 -145 -28 226 -25 52 59 -128 -60 1 79 -91 -203 78 -475 -117 88 10 6 156 111 -20 197 -37
7739 -37 204 248 -36 -154 -73 46 -233 30 -114 -226 -26 216 -59 42 70 -147 -4 -150 -43 -200 175
7760 175 99 -57 -33 225 -118 66 80 -71 -13 110 47 -89 100 -29 -37 -196 14 -80 -152 121 -36 273 -101
7783 -101 108 -41 -148 -47 -38 84 -111 -87 211 -94 -257 92 62 -230 104 58 -102 122 74 -199 -44 156
7805 156 122 -167 -40 122 -73 230 214 -3 -102 -149 51 148 -110 -14 102 69 -251 17 -109 -222 -236 -146 17
7828 17 138 -38 -168 47 48 -28 171 4 133 130 183 11 -160 -21 52 38 -96 79 -127 32 103 -22 90
7851 90 83 84 -40 -193 -88 157 28 172 -52 -91 131 122 -187 20 226 64 6 75 139 102 -49 -145 10 162
$$ packed form
7689c5oj70M9J63p1j9J73M3r8J5j14R2l8J82l6j9P5j64J26l69J33Oj61J90L4p4
7715i3J10j62J17K54k51P7Pj87O8O1P8j70j12K81n53L58K05p8mJ50m5j31K17k34
7739c7K41M4k84j18Q1J19k79K63j44j12K00K42k75J01K8k17J43j46J07j57L75
7760A75p6j56K4K58l43J84J4j51N8J23o3j36J89j29qj59K10r4p2K73j57L09l74
7783a01K09j49j07J01RJ22j95K4K98l05j63L49l0k92L34m6j60K24m8k73J55K00
7805A56l4k89J27J62j95L03j6k17r9m7K00R7k58R6J16l3l20K68j26j13j4R0J63
7828A7J21j76j30K15Jp6J99j67J29lN3j72j71J39P3j4j34J75k06J59P1j25J12
7851I0pJj24j53J05K45j29J44k24l9K22rl09K07K06j62n8O9O4l7j51r6J55J52
$$ plain form
7875 162 190 277 -101 -162 27 222 -66 -195 93 57 -80 56 225 187 179 -196 -34 -161 -116 61 80 -27 112
7898 112 -41 -68 49 -15 104 57 66 81 -183 -95 -62 3 275 128 3 -120 5 179 48 30 -110 77 -19 -194
7922 -194 -107 -62 108 -267 49 -40 -170 283 79 30 -37 208 106 -105 203 180 -86 -16 29 -85 206 -120 111
7945 111 66 151 27 1 96 157 -154 -242 -86 0 36 4 241 38 2 -205 -34 143 85 -75 169 -62 -36 6
7969 6 107 202 162 84 203 -183 1 -62 93 -145 -72 17 -244 54 -110 -29 -59 -357 9 50 -24 -112 -292 -35
7993 -35 150 41 98 19 -37 19 -32 130 -71 -130 -27 57 59 266 212 58 139 33 -123 -43 -124 166 22 88 96 -66
8019 -66 8 24 -81 -208 -64 46 126 -19 -10 -109 -258 -13 -193 203 4 135 54 13 14 -22 230 20 76 66 241
8044 241 -19 129 0 -89 -202 59 -126 -234 228 -108 -40 16 162 -26 -73 175 21 -219 31 -159 43
$$ packed form
7875A62K8Q7l78o1J89J95k88j29K88l6j37J36J69l8ql75J62j27M5J77J9j07J39
7898A12j53k7J17o4J19m7RJ5k64Q8L3O5K72j47j25j23J25J74j31j8j40J87r6j75
7922a94Q7M5J70l75L16q9j30M53k04m9o7K45j02k11L08k3k66P0M5j14K91l26K31
7945A11m5Q5j24k6R5O1l11q8J56Q6L6l2K37k03l6k07J71J77n8j60K44k31K6M2
7969FJ01R5m0p8J19l86J84o3J55k38P3Q9k61K98j64Q1l0k98L66M1p4q8j80K57
7993c5J85j09N7p9n6N6n1J62k01n9J03Q4KK07n4j54Q1j06j56Q0q1K90j44O6Qj62
8019f6P4J6j05j27J44J10Q0j45Rr9j49K45j80L96j99J31q1m1Jl6K52k10N6j0J75
8044B41k60J48j29q9j13K61j85j08M62l36O8N6J46j88m7K48j54k40K50j90K02
$$ plain form
8065 43 -154 15 95 -21 221 -34 280 1 -53 -153 -220 -13 13 11 -86 -86 -37 -320 91 26 -95 151 87 -193
8089 -193 163 -4 -161 171 179 75 191 79 97 -122 64 -9 -29 -11 66 40 -27 -152 74 148 -291 74 60 73
8113 73 -29 135 -210 -175 -68 96 158 -143 24 41 -26 50 123 123 220 -159 -187 181 -11 23 -70 175 42 127 193
8138 193 195 165 -38 190 -203 -40 48 103 -2 -6 113 104 34 61 147 208 -331 34 219 33 -165 88 35 -319 -75
8163 -75 -64 -288 -59 47 -11 -140 -323 253 8 -118 -58 87 -124 -7 83 58 23 -32 -59 -51 24 -14 -46 297 -193
8188 -193 3 178 39
$$ packed form
8065D3j97J69Q0j16K42k55L14k79n4j00o7K07K6kr7%M9k83M11o5j21K46o4k80
8089a93L56j67j57L32Qj04J16j12J8k19J86p3k0J8P7k6o7j25K26P4m39L65j4J3
8113G3j02J64l45L5J07J64O2l01J67J7o7P6P3%R7l79k8L68j92L4r3K45j33Q5O6
8138A93Kl0k03K28l93J63Q8N5j05mJ19rp0K7Q6O1n39L65J85j86j98K53n3l54K44
8163g5J1k24K29J06n8j29j83N76k45j26O0J45k11J17R0k5l5n5k7QP5l8l2L43m90
8188a93J96J75j39
8191C9
$$ Imaginary data points
##PAGE= N=2
##DATA TABLE= (X++(I..I)), XYDATA
$$ plain form
0 0 0 0 0 0 0 0 0 0 0 0 0 0 0 0 7 -8 8 -8 8 -8 16 -16 18 -24 24 -32 37 -40 48 -56 64 -72 80 -91 104 -116
36 -116 131 -146 163 -181 202 -223 247 -273 303 -334 368 -405 447 -490 541 -596 658 -726 803
55 803 -890 992 -1105 1244 -1403 1601 -1845 2160 -2577 3165 -4046 5512 -8360 15880 -77485
70 -77485 -141974 119502 34614 -143095 16160 109998 -59749 -39186 83028 17300 -40924
81 -40924 28341 23774 -18198 -3498 7652 -1723 -978 -8334 3706 7614 -18558 -7841 16336
94 16336 -21475 -23792 25495 342 -31308 22256 26813 -25174 -1073 28088 -14286 -21654 7490
107 7490 -4646 -14539 -589 2209 9626 12833 685 16296 23928 -9101 -3087 23754 -13794
120 -13794 -27861 19413 2038 -38245 7555 26512 -28171 -16234 31298 -3688 -32686 10530
$$ packed form
0@%%%%%%%%%%%%%%Pj5J6j6J6j6K4l2L4m2M8n6O9p7Q8j04J20j36J52j71J95k20
36a16K47k77L09l44L83m25M70n20N76o37P02p73Q52r37J031j137J254j384J529
55H03j693J882k097K349k647L004l446M005m737N742p211R558j3872K4240r3365
70g7485o4489K61476q4888j77709J59255R3838j69747K0563J22214o5728n8224
81d0924O9265m567m1972J4700J1150r375P45p356J2040L908k6172J0717K4177
94A6336l7811k317M9287k5153l1650N3564M557n1987K4101K9161m2374p368K9144
107G490j2136r893J3950K798P417L207j2148J5611P632l3029O014K6841l7548
120a3794j4067M7274j7375m0283M5800J8957n4683J1937M7532l4986k8998M3216
$$ plain form
132 10530 21023 -18400 -12925 24006 12962 -18600 -802 24218 -6321 -25947 9963 10995
144 10995 -25011 -2058 26025 -6550 -3276 32124 4181 -13477 24694 5829 -33068 5060
156 5060 13913 -35391 -13983 25672 -11747 -22328 20633 9581 -17651 4386 10820 -7954 -2673
169 -2673 3734 -745 3770 1704 -2047 8037 2076 -8785 3580 2588 -11322 1871 9286 -5193
183 -5193 4928 16788 207 1283 12797 -3227 -9019 -96 -10684 -12817 -879 -10559 -9335
196 -9335 11619 -1193 -9277 17644 9091 -17453 8347 16157 -19294 -5131 21534 -8686 -13543
209 -13543 21121 4537 -17765 11360 12608 -17114 -2008 16567 -6194 -8671 14757 7806 -9201
222 -9201 2467 10114 -7301 -14823 -470 -782 -18957 -10355 10325 -3228 -12625 15341 15770 -11441
$$ packed form
132A0530J0493l9423N475L6931j1044l1562J7798K5020l0539j9626L5910J032
144A0995l6006K2953K8083l2575L274L5400k7943j7658L8171j8865l8897L8128
156E060Q853m9304K1408L9655l7419j0581M2961j1052k7232K2037O434j8774N281
169b673O407m479M515k066l751J0084n961j0861J2365r92j3910J3193P415j4479
183e193J0121J1860j6581J076J1514j6024n792Q923j0588k133J1938r680J224
196i335K0954j2812q084K6921q553k6544K5800P810l5451J4163K6665l0220m857
209a3543L4664j6584k2302K9125J248k9722J5106J8575k2761k477K3428o951j7007
222i201J1668P647j7415p522J4353l12j8175Q602K0680j3553r397K7966M29k7211
$$ plain form
236 -11441 4730 22392 -8841 -12462 17326 -272 -19770 9693 12535 -14471 1267 17316
248 17316 -6871 -7433 11805 -1328 -10401 5671 3606 -7533 1589 5014 -4572 -3939 -78 -5425
262 -5425 -7930 -5224 -3029 -3078 -2584 3342 8183 4124 5001 11093 5209 -1421 3483 850 -6721 -1924
278 -1924 -256 -4907 1500 3095 -3294 3947 6544 -6577 -1083 8326 -8392 -9370 10690 -2025
292 -2025 -15181 8016 8358 -16789 -2687 13718 -11240 -13672 13659 3534 -13167 8981 17858
305 17858 -3318 -593 17264 4830 -10369 1534 6392 -10903 -11224 5433 583 -12115 2811
318 2811 13212 -6154 -6507 14095 1480 -16603 3605 9414 -15941 -7581 14268 -4004 -13365
331 -13365 10517 7382 -12832 178 11261 -4927 -4930 9882 5565 -1522 5274 7336 916 -442
$$ packed form
236a1441J6171J7662l1233l621K9788j7598j9498K9463K842k7006J5738J6049
248A7316k4187n62J9238j3133r073J6072k065j1139R122L425r586O33L861n347
262e425k505K706K195m9M94N926M841m059Q77O092n884o630M904k633p571M797
278a924J668m651O407J595o389P241K597j3121N494R409j6718r78K0060j2715
292b025j3156K3197L42k5147J4102J6405k4958k432K7331j0125j6701K2148Q877
305A7858k1176K725J7857j2434j5199J1903M858j7295l21J6657m850j2698J4926
318B811J0401j9366l53K0602j2615j8083K0208N809k5355Q360K1849j8272r361
331a3365K3882l135k0214J3010J1083j6188lJ4812m317p087O796K062o420j358
$$ plain form
345 -442 -1103 -1745 -3424 -7457 -5416 453 -2853 -4663 4859 6120 -2752 1050 7461 -2143 -8184 1833
361 1833 1114 -9784 -4101 6597 -1689 -7070 7068 8827 -6893 -1296 13397 -298 -10041 10080
375 10080 11489 -10605 -1268 16794 -3506 -14708 8466 4792 -19549 -5273 11888 -9743 -12963
388 -12963 14081 7258 -13213 4965 16359 -8217 -10771 11694 508 -17825 772 11093
400 11093 -8516 -7256 14208 6391 -8460 6069 13332 -4769 -5405 9770 2195 -8858 2234
413 2234 6866 -6288 -4802 4466 -2824 -9009 -986 -119 -6349 -2427 3300 1027 533 3438 3539 2217
429 2217 -22 -1770 815 -1053 -5998 -760 4857 -2317 -1840 10382 5878 -4499 6070 10339 -7028
444 -7028 -5544 8722 -2326 -13310 3379 5482 -11809 -5009 8839 -4379 -11321 4939 4671
$$ packed form
345d42o61o42j679m033K041N869l306j810R522J261q872L802O411r604o041J0017
361A833p19j0898N683J0698q286n381J4138J759j5720N597J4693j3695r743K0121
375A0080J409k2094R337J8062k0300j1202K3174l674k4341J4276J7161k1631l220
388a2963K7044o823k0471J8178J1394k4576k554K2465j1186j8333J8597J0321
400A1093j9609J260K1464p817j4851J4529P263j8101o36J5175p575j1053J1092
413B234M632j3154J486R268p290o185Q023Q67o230L922N727k273m94K905J01j322
429B217k239j748K585j868m945N238N617p174M77J2222m504j0377J0569M269j7367
444g028J484J4266j1048j0984J6689K103j7291O800J3848j3218o942J6260k68
$$ plain form
457 4671 -10247 -1359 11445 -510 -6537 9637 9578 -8006 -1847 11517 -3329 -12960 5642 7097
471 7097 -11324 -1634 15151 -849 -7611 11837 7211 -11743 83 8175 -10336 -9916 6068
484 6068 -2715 -11290 3023 5156 -6844 -1888 6489 -603 -3902 3035 3976 -48 333 3776 4362
499 4362 289 -914 2610 962 -4352 -2326 2097 -1634 -3418 3212 4197 -586 925 4616 937
514 937 -4387 -1448 1024 -5585 -7832 928 954 -7889 -480 9311 -1815 -5436 9993 5453 -8746
529 -8746 2849 10862 -6250 -4900 11281 1134 -9219 5530 6387 -8914 -3173 7326 -3152
542 -3152 -7455 4983 4501 -5026 -35 7714 -537 -6162 1823 2065 -8786 -5869 3985 -3519 -7619
557 -7619 5131 5433 -5056 3304 10691 -2740 -2513 9456 265 -7328 5696 3928 -7484 911
$$ packed form
457D671j4918Q888J2804j1955o027J6174n9j7584O159J3364j4846r631J8602J455
471G097j8421R690J6785j6000o762J9448m626j8954J1826Q092j8511M20J5984
484F068q783q575J4313K133j2000M956Q377p092l299O937R41m024L81L443N86
499D362m073j203L524j648n314K026M423l731j784O630R85m783J511L691l679
514I37n324K939K472o609k247Q760K6q843P409R791j1126l621J5429m540j4199
529h746J1595Q013j7112J350J6181j0147j0353J4749Q57j5301N741J0499j0478
542c152m303J2438m82r527M991P749q251n625P985K42j0851K917R854p504m100
557g619J2750L02j0489Q360P387j3431K27J1969r191p593J3024j768j1412Q395
$$ plain form
571 911 6160 -5043 -2738 5139 -2163 -4893 2674 167 -3737 2058 1656 -1940 868 660 -2764 -1235
587 -1235 -1749 -4237 -1519 -651 -2742 968 3285 1297 2868 5475 2639 1271 2132 1786 -369 -2523
603 -2523 -671 1403 -2722 -4191 3805 1958 -7383 272 7108 -6320 -6532 8462 502 -10856 4348
618 4348 7515 -8877 -2874 8892 -3817 -8278 5558 1987 -7477 2461 7742 -1581 -87 8792
632 8792 3922 -2994 2339 5499 -3280 -6525 1834 1292 -8537 -3342 6001 -2800 -6750 5957 3212
647 3212 -7823 984 6025 -5964 -3259 6716 -2191 -5191 5757 1566 -5448 2890 3612 -4505 811
662 811 4922 -1230 1138 4874 856 1511 4060 -922 -1575 1650 -3190 -5191 -285 -2416 -5060 112
678 112 967 -2013 1028 2523 -523 471 1676 -454 -875 685 626 -686 -1006 1750 2482 -2373 -551
$$ packed form
571I11N249j1203K305P877p302k730P567k507l904N795m02l596K808k08l424J529
587a235n14k488K718Q68k091L710K317j988J571K607k836j368Q61l46k155k154
603b523J852K074m125j469P996j847r341P655O836j3428k12J4994p960j1358J5204
618D348L167j6392O003J1766j2709m461J3836l571r464R938N281r323J494Q879
632H792m870o916N333L160q779l245Q359n42r829N195R343q801l950J2707k745
647C212j1035Q807N041j1989K705R975q907l000J0948m191p014Q338P22q117N316
662H11M111o152K368L736m018O55K549m982o53L225m840k001M906k131k644N172
678A12Q55k980L041J495l046R94J205k130m21J560n9j312l20K756P32m855J822
$$ plain form
695 -551 5885 -248 -5419 5996 6052 -7507 124 11195 -3588 -8657 8272 2254 -13287 150
709 150 6330 -9868 -6485 7809 -1156 -7258 5876 6325 -4857 187 6901 -784 -4805 2737 3255
724 3255 -4407 -2858 5456 1770 -5057 2418 6591 -2748 -3172 6567 2009 -5713 2064 4473 -4226
739 -4226 -2240 2904 -2432 -4140 21 -1634 -3164 -1045 -1039 -161 1680 -402 1551 5021 -220 -1384
755 -1384 5317 656 -5798 2353 3796 -5784 -2066 6990 -981 -4686 5131 4750 -4089 -661 5413
770 5413 -816 -5606 1393 2974 -4789 -4748 3737 304 -7936 -107 5533 -5547 -5149 7962 1197
785 1197 -7059 5616 8316 -5388 -277 9193 -2208 -6014 5284 1514 -7000 1273 4523 -3320
799 -3320 -1328 4714 780 -2151 1420 1400 -1629 -2416 -636 -411 -2993 -2941 1060 -495 -3572 689 2753
$$ packed form
695e51O436o133n171J1415N6j3559P631J1071j4783n069J6929o018j5541J3437
709A50O180j6198L383J4294q965o102J3134M49j1182N044O714p685m021P542N18
724C255p662J549Q314l686o827P475M173r339m24R739m558p722P777K409q699
739d226J986N144n336j708M161j655j530K119OQ78J841k082J953L470n241j164
755a384O701m661o454Q151J443r580L718R056p971l705R817l81q839L428O074
770E413o229m790O999J581p763M1Q485l433q240P829N640j1080L98J3111o765
785A197q256J2675K700j3704N111R470j1401l806J1298l770q514Q273L250p843
799c320J992O042l934k931L571k0l029p87J780K25k582N2M001j555l077M261K064
$$ plain form
816 2753 -2603 -828 4389 656 -1159 4320 3078 -647 1839 2877 -393 -544 -270 -1164 -218 -1582
832 -1582 -1866 1847 402 -2888 1848 2897 -3659 -1088 3907 -3320 -5042 2746 -557 -6534 1579
847 1579 3485 -4765 -776 6011 -439 -2722 4993 3412 -3022 1345 5194 -939 -2225 3214 1615
862 1615 -4192 -1157 2794 -2582 -5077 2026 2189 -5200 -822 5517 -1372 -4415 4152 2233 -6093
877 -6093 -620 3802 -3871 -3970 3257 610 -2973 2062 3686 -580 967 3867 859 -317 1787 1349
893 1349 -814 -535 564 -112 -1628 -1407 -3 -1212 -2410 -137 639 -1583 -783 1670 530 -1202
909 -1202 526 1033 -802 -1092 -297 113 -1217 -1634 1474 1315 -1152 1030 4289 149 -1139 4009 1983
926 1983 -3591 807 3389 -3631 -3054 3261 -1351 -4960 1270 1909 -4505 -1381 3474 -1659 -3162 3164
$$ packed form
816B753n356J775N217l733j815N479j242l725K486J038l270j51K74q94R46j364
832a582k84L713j445l290M736J049o556K571M995p227j722P788l303n977Q113
847A579J906q250L989O787o450k283P715j581o434M367L849o133j286N439j599
862A615n807L035L951n376k495P103J63p389M378O339o889l043Q567j919q326
877f093N473M422p673r9P227k647l583N035J624m266J547K900l008j176K104m38
893A349k163K79J099o76j516K21J404j209j198K273P76k222Q00K453j140j732
909a202J728N07j835k90P95M10j330m17L108j59k467K182L259m140j288N148k026
926A983n574M398K582p020N77O315m612l609O230O39o414L124M855n133j503O326
$$ plain form
942 3164 2001 -2952 420 3558 -1523 -2756 2325 925 -3244 105 3691 -770 -1299 4016 2520
957 2520 -1923 1653 4018 -1804 -2255 2882 -415 -4685 79 1477 -3994 -2528 2039 -952 -2991
972 -2991 1096 1257 -1455 -107 1736 332 -512 504 1063 235 -353 316 919 -431 -809 1816 1335
989 1335 -693 962 2842 -8 -778 2137 777 -2756 -696 831 -2528 -3546 316 -444 -3482 -656
1005 -656 1968 -719 -2011 2198 2545 -2333 55 4037 -446 -2850 2961 2807 -3475 53 4474 -1564
1021 -1564 -3223 4323 1856 -4166 1073 4477 -2521 -2536 4101 25 -5015 215 1952 -4276 -3413 2100
1037 2100 -427 -3792 847 2983 -1021 -947 3355 2221 -1417 765 3173 -390 -1684 2079 1074
1052 1074 -2502 140 2319 -1232 -1523 2018 605 -2079 407 1608 -1294 -1184 680 -163 -1566 -1119
$$ packed form
942C164j163m953L372L138n081j233N081j400m169L349L586m461n29N315j496
957B520m443L576K365n822m51N137l297m270M764J398n471J466M567k991k039
972b991M087J61k712J348J843j404q44J016N59q28n88O69O03j350l78K625m81
989A335k028J655J880k850p70K915j360l533K060J527l359j018L862p60l038K826
1005f56K624k687j292M209L47m878K388L982m483k404N811j54o282L528M421o038
1021a564j659P546k467o022N239L404o998j5O637m076n040N230J737o228Q63N513
1037B100k527l365M639K136m004P4M302j134l638K182K408l563j294L763j005
1052A074l576K642K179l551k91L541j413k684K486J201k902J10J864q43j403M47
$$ plain form
1068 -1119 -523 -900 -2011 -899 739 -206 -1529 1405 2576 -626 617 3609 732 -1757 2437 1833
1084 1833 -2945 -395 3004 -1521 -2922 2324 1293 -3005 -113 3167 -1291 -2322 2006 1477 -3500
1099 -3500 -1106 2557 -1606 -3720 1159 1338 -3589 -1197 3473 -704 -2545 3364 2935 -2427 1032
1114 1032 4418 -1033 -1432 3306 615 -3585 319 2145 -2504 -1936 2004 -140 -2370 548 1748
1129 1748 -934 -1288 1002 412 -2077 -1202 1127 -773 -2374 234 949 -1910 -542 1946 473 -987
1145 -987 1943 2305 -131 338 2295 1170 -1123 62 1112 -512 -2146 392 1205 -2193 -1977 2290
1161 2290 2 -3187 1373 2663 -2953 -1448 2747 -969 -3287 1551 1138 -3181 -213 2870 -1362
1176 -1362 -1312 2948 1862 -1259 1149 2924 39 -762 1931 1618 -2078 -1068 1704 -1341 -3495 630
$$ packed form
1068a119N96l77j111J112J638r45j323K934J171l202J243K992k877k489M194o04
1084A833m778K550L399m525j401N246j031m298K892L280m458j031M328n29m977
1099c500K394L663m163k114M879J79m927K392M670m177j841N909m29n362L459
1114A032L386n451l99M738k691m200L904J826m649N68L940k144k230K918J200
1129A748k682l54K290n90k489Q75K329j900j601K608P15k859J368K488j473j460
1145i87K930L62k436M69J957j125k293J185J050j624j634K538Q13l398K16M267
1161B290k288l189M560J290n616J505M195l716k318M838m13m319K968L083m232
1176a362N0M260j086l121K408J775k885q01K693l13l696J010K772l045k154M125
$$ plain form
1192 630 1047 -3373 -1287 2877 -1332 -2481 2494 1399 -3243 581 2904 -2005 -1578 2404 96 -1829
1208 -1829 745 1530 -472 283 1589 922 566 629 1222 958 -846 -236 768 -1052 -1930 449 -280 -3209
1226 -3209 -524 853 -2407 -1541 1849 -277 -1765 1197 1574 -998 -405 1378 92 -912 103 1193
1242 1193 391 -1336 1115 2499 -835 -387 2897 622 -2254 1673 2360 -2875 -1208 2668 -1737 -3217
1258 -3217 1391 95 -3626 -239 1838 -2037 -1330 1992 867 -1219 296 1981 -148 -1075 1336
1273 1336 1808 -1406 -845 2178 392 -2213 1413 2234 -1884 -445 3068 -432 -1864 2074 753 -2797
1289 -2797 -528 1183 -1951 -1813 475 -711 -1536 -66 698 -128 -212 260 1184 428 -419 1075 1496 -764
1307 -764 -58 1751 -550 -1259 1173 355 -1328 607 1406 -628 -240 1568 -113 -979 474 267 -1338
$$ packed form
1192F30M17m420K086M164m209j149M975j095m642L824K323m909M27L982k308j925
1208a829K574P85k002P55J306o67l56O3N93k64j804O10J004j820q78K379p29k929
1226c209K685J377l260Q66L390k126j488K962L77k572N93J783j286j004J015J090
1242A193q02j727K451J384l334M48L284k275k876L927O87n235J667L876m405j480
1258c217M608j296l721L387K077l875P07L322j125k086J515J685k129r27K411
1273A336M72l214N61L023j786k605L626Q21m118J439L513l500j432L938j321l550
1289b797K269J711l134J38K288j186q25J470P64q26q4M72R24p56q47J494M21k260
1307g64P06J809k301p09K432q18j683J935P99k034L88J808j681q66J453k07j605
$$ plain form
1324 -1338 -957 -324 -719 -1724 -779 409 -310 -1376 786 1532 -1106 128 2823 -49 -1385 2547
1340 2547 1491 -1862 733 2245 -1377 -941 2132 -216 -1616 991 1125 -1412 -430 988 -105 -1358
1356 -1358 -214 364 -1032 -1938 -135 51 -2084 -756 1450 -530 -1546 2165 1891 -1685 770 3336
1372 3336 -743 -818 2675 730 -1999 795 1561 -1269 -1367 1074 5 -1347 -164 988 -228 -1170
1388 -1170 164 878 -1592 -1820 1048 -76 -2565 -109 1735 -1657 -1352 2454 416 -1481 1811 2382
1404 2382 -1162 346 2315 327 -1101 948 1067 -785 -867 876 249 -1853 -430 1201 -850 -2197
1420 -2197 1044 714 -2342 -188 2349 -1450 -2209 1870 895 -2738 277 2192 -1520 -1015 2351 1397
1436 1397 -1028 1034 2389 -106 -595 1322 1331 -1056 -896 1239 -4 -2334 -224 934 -1688 -1461
$$ packed form
1324a338L81O33l95j005R45J188p19j066K162P46k638J234K695k872j336L932
1340B547j056l353K595J512l622M36L073k348j400K607J34k537R82J418j093j253
1356a358J144N78j396r06J803J86k135J328K206j980j016L711k74l576K455K566
1372C336m079p5L493j945k729K794P66k830r8K441j069j352J183J152j216r42
1388a170J334P14k470k28K868j124k489K456J844l392L05L806k038j897L292N71
1404B382l544J508J969j988j428K049J19j852q2J743o27k102J423J631k051j347
1420b197L241l30l056K154K537l799p59M079r75l633L015J915l712N05L366r54
1436A397k425K062J355k495m89J917Rk387J60K135j243k330K110J158k622K27
$$ plain form
1452 -1461 1552 -131 -2063 850 1432 -1767 -398 1461 -387 -1413 1029 691 -1387 -86 1517
1467 1517 48 -872 823 1660 47 -303 1782 1155 -1124 258 1917 -799 -1619 740 276 -2487
1483 -2487 -624 1122 -1424 -1778 1061 77 -1572 293 953 -577 -706 879 492 -780 -27 997
1499 997 -46 -942 780 1047 -633 590 1725 150 -689 1394 1340 -1441 -145 1378 -1151 -1543 548
1516 548 -81 -1895 -519 656 -915 -973 533 363 -912 63 887 -90 -912 365 1259 -548 -574 1545
1534 1545 244 -1323 718 1876 -838 -238 2366 284 -1334 908 1263 -1670 -842 950 -938 -1964
1550 -1964 81 -136 -1535 -674 588 -234 -1088 315 1156 -382 -653 1524 914 -791 244 1418 -490
1567 -490 -1031 1558 749 -1422 669 1851 -922 -608 1486 424 -1533 17 1039 -1113 -1387 216
$$ packed form
1452a461L013j683j932K913N82l199J369J859j848j026K442l38k078J301J603
1467A517j469r20J695Q37j613l50K085o27k279J382J659k716q20K359m64k763
1483b487J863J746k546l54K839r84j649J865O60j530j29J585l87j272P53J024
1499I97j043q96J722K67j680J223J135j575q39K083n4k781J296J523k529l92K091
1516E48o29j814J376J175j571n8J506j70j275R75Q24r77q22J277Q94j807k6K119
1534A545j301j567K041J158k714O00K604k082j618K242L55k933Q28J792j888j026
1550a964K045k17j399Q61J262q22q54J403Q41j538k71K177o10j705J035J174j908
1567d90n41K589q09k171K091J182k773L14K094j062j957J550J022k152k74J603
$$ plain form
1583 216 -182 -1339 -993 241 -642 -1288 47 829 -518 -287 1332 928 -482 933 1567 -225 -229 1547
1601 1547 388 -1179 774 940 -1192 -194 1446 -189 -1369 396 578 -1293 -826 676 -646 -1587
1617 -1587 13 -20 -1490 -768 759 -207 -1030 623 869 -498 172 1704 186 -557 1166 1165 -767 -92
1635 -92 1567 -405 -829 498 398 -1192 -67 914 -562 -1254 307 119 -957 -511 391 -346 -1099 62
1653 62 509 -844 -738 1002 69 -747 669 1354 -101 -104 1615 739 -555 457 1311 -428 -965 799
1671 799 418 -1293 -370 986 -184 -1345 516 844 -1387 -466 1175 -188 -1739 421 672 -1558
1687 -1558 -744 1357 -164 -1529 937 1127 -1025 180 1710 -42 -477 1165 1117 -739 -98 993
1703 993 -278 -1056 318 514 -510 -700 411 -62 -1009 -97 754 -1058 -1015 594 8 -1124 295 816
$$ packed form
1583B16l98j157L46J234q83o46J335P82j347K31J619m04j410J415O34j792mJ776
1601A547j159j567J953J66k132R98J640j635j180J765J82j871M67J502j322r41
1617a587J600l3j470P22J527r66q23J653K46j367O70J532j518p43J723jj932O75
1635i2J659j972m24J327j00j590J125R81j476o92J561j88j076M46R02p37p53J161
1653F2M47j353J06J740r33q16J416O85j455lJ719q76j294J012Q54j739n37J764
1671G99l81j711R23J356j170j161J861L28k231R21J641j363j551K160K51k230
1687a558Q14K101j521j365K466J90k152J205J530j752m35J642m8j856O41J091
1703I93j271p78J374J96j024j90J111m73r47R12Q51j812M3J609n86j132J419N21
$$ plain form
1721 816 -1140 -413 1189 -456 -826 1034 790 -284 290 1131 380 18 522 485 -223 -152 344 -228 -769
1740 -769 -517 -32 -620 -1248 7 169 -1168 -164 715 -534 -1110 672 464 -846 -64 735 -304 -532
1758 -532 750 786 -225 354 1455 387 -404 904 1208 -776 -433 1102 -152 -1432 522 542 -1750
1775 -1750 -976 871 -666 -1740 677 636 -1469 -160 1440 -580 -719 1128 667 -835 140 1242
1791 1242 -103 -880 969 1255 -603 -98 1599 366 -806 871 876 -1005 -968 900 -266 -1622 239
1808 239 335 -1363 -709 382 -413 -868 275 418 -215 -329 679 355 -39 177 742 498 -405 599 1111
1827 1111 -362 -291 993 327 -882 817 973 -902 -317 1080 -391 -1311 242 119 -1269 -442 540
1844 540 -166 -982 -153 698 -98 -664 959 645 -557 340 1498 -46 -732 1184 367 -1191 611 1154
$$ packed form
1721H16j956P27J602j645l70J860k44j074N74Q41p51l62N04l7p08P1M96n72n41
1740g69K52M85n88o28J255J62j337J004Q79j249n76J782k08j310P82P99j039k28
1758e32J282L6j011N79J101j068p91J308L04j984L43J535j254j280J954K0k292
1775a750P74J847j537j074K417m1k105J309J600k020j39J847m61j502R75J102
1791A242j345p77J849K86j858N05J697j233j172J677Nj881L7J868j166j356J861
1808B39R6j698O54J091p95m55J143J43o33j14J008l24l94K16N65k44r03J004N12
1827A111j473P1J284o66j209J699J56j875N85J397j471r20J553j23j388Q27R82
1844E40p06q16Q29Q51p96n66J623l14j202Q97J158j544o86J916q17j558J802N43
$$ plain form
1862 1154 -982 -259 1580 -71 -1292 911 733 -1286 -116 873 -807 -894 280 55 -842 -372 336
1879 336 -303 -605 599 442 -320 27 823 471 -365 643 900 -124 -85 1032 265 -908 283 901
1897 901 -621 -207 538 120 -406 138 172 -354 -686 -93 296 -502 -761 238 117 -1151 -412 511 -693
1916 -693 -251 1180 464 -624 622 1220 -463 26 1463 300 -857 923 1027 -700 -409 1042 72
1933 72 -1374 149 893 -755 -904 1026 172 -1848 187 1032 -1394 -1328 1159 -46 -1554 716 1119
1950 1119 -981 194 1618 77 -538 1034 665 -615 455 1137 -184 -217 398 -180 -315 -259 -58 -307
1968 -307 -410 -240 -159 -392 -611 70 69 -549 85 275 -490 -311 310 66 -176 457 482 207 77 583 368
1989 368 131 -114 420 473 -315 -95 608 -313 -856 311 257 -1254 -165 775 -870 -965 849 -220 -981
$$ packed form
1862A154k136P23J839j651j221K203j78k019J170R89j680q7J174k25q97M70P08
1879C36o39l02J204j57p62L47P96l52q36J008K57j024L9J117p67j173J191O18
1897I01j522M14P45m18n26N44L4n26l32N93L89p98k59R99j21j268P39R23j204
1916f93M42J431p16j088J246N98j683M89J437j163j157J780J04j727K91J451r70
1933G2j446J523P44j648j49J930q54k020K035Q45k426O6K487j205j508K270M03
1950A119k100J175J424j541o15J572l69j280J070O82j321l3O15n78j35N6K01k49
1968c07j03J70Q1k33k19O81jo18O34J90p65J79O21k44k42O33K5k75j30N06k15
1989C68k37k45N34N3p88K20P03r21n43J167n4j511J089R40j645r5J814j069p61
$$ plain form
2008 -981 285 528 -769 -414 1013 -110 -745 671 742 -419 68 966 9 -500 776 938 -538 -120
2026 -120 1079 -405 -1248 354 492 -1220 -467 756 -649 -1099 529 125 -1028 -21 587 -957 -218
2043 -218 632 -88 -586 444 745 -138 230 639 339 136 108 530 378 -42 107 331 -75 -184 379 -16
2063 -16 -338 -324 -56 -497 -563 97 37 -313 27 348 -117 -187 107 412 -80 -514 664 477 -681 336 1397
2084 1397 -105 -407 1403 340 -1106 665 1167 -717 -481 1212 -82 -1150 536 443 -1400 -346
2100 -346 700 -867 -1080 403 421 -1060 -163 809 -282 -985 510 679 -693 -219 1140 -132 -612
2117 -612 800 995 -457 209 1335 175 -637 678 75 -693 129 381 -554 -235 -65 -13 -665 -306 -123
2136 -123 -165 -79 -594 -84 228 -316 15 580 128 -127 682 473 13 -3 517 249 -391 476 406 -299 54
$$ packed form
2008i81J266K43j297L55J427j123o35J416P1j161M87Q98r57n09J276J62j476M18
2026a20J199j484q43J602J38j712P53J223j405m50J628m04j153J007O08j544P39
2043b18Q50p20m98J030L01q83L68M09l00k03k8M22j52m20J49K24m06j09N63l95
2063a6l22J4K68m41o6O60o0l50L40L21m65p0K94L05m92m34J178j87j158J017J061
2084A397j502l02J810j063j446J771N02j884K36J693j294j068J686r3j843J054
2100c46J046j567k13J483J8j481Q97R72j091p03J495J69j372M74J359j272m80
2117f12J412J95j452O66J126j160q12J315o03p68Q22K52r35L19J70N2o52L59J83
2136a23m2Q6n15N10L12n44L31N65m52k55Q09k09m60j6N20k68o40Q67p0p05L53
$$ plain form
2157 54 705 -170 -590 364 -5 -1069 -478 320 -601 -728 534 -1 -1099 -134 605 -827 -438 1080 328
2176 328 -804 856 1320 -392 98 1143 67 -614 810 405 -522 63 888 -449 -341 614 300 -693
2194 -693 -164 190 -631 -825 174 -221 -882 54 448 -504 -219 542 147 -484 286 675 -371 -118 351 384
2214 384 -139 718 237 202 -154 -102 65 -242 -380 -221 284 -157 -439 -32 278 -752 -280 357 -245 -767
2234 -767 315 59 -718 -66 689 -333 -289 886 509 -541 511 930 -404 -492 986 594 -718 495
2252 495 1038 -667 -566 846 50 -933 323 204 -869 -224 675 -128 -912 571 413 -1205 -271 898
2270 898 -573 -735 803 231 -793 447 920 -179 -138 983 184 -117 299 434 -135 39 238 63
2288 63 2 158 -20 -136 -393 -136 -256 -567 -609 -515 -51 -27 -107 -176 -20 36 275 501 17 -208 194 338 144
$$ packed form
2157E4O51q75m20R54l69j064N91P98r21j27J262n35j098R65P39j432L89J518p52
2176C28j132J660M64j712M90J045j076o81J424m05r27N85Q25j337J08R55l14r93
2194f93N29L54q21j94R99l95o61R36L94r52K85P61l95o31P70L89j046K53M69L3
2214C84n23Q57m81l5l56N2J67l07j38J59N05m41k82M07L10j030M72O37o02n22
2234g67J082k56p77O52P55j022M4J175l77j050J052M19j334q8J478l92j312J213
2252D95N43j705J01J412p96r83J256j19j073O45Q99q03p84J483j58j618R34J169
2270H98j471j62J538n72j024J240M73j099M1J121p99l01M16J35n69J74J99j75
2288F3o1J56j78j16k57K57j20l11m2R4M64K4q0o9J56N6K39K26m84k25M02J44j94
$$ plain form
2311 144 282 745 126 -388 731 480 -569 157 392 -555 -645 608 31 -992 -63 287 -907 -673 601
2330 601 -427 -984 315 416 -933 -212 970 34 -546 773 612 -514 52 888 24 -197 840 727
2348 727 -674 180 950 -305 -316 483 -316 -1248 -213 454 -541 -500 214 -172 -722 127 353 -815 -106
2367 -106 114 -70 36 286 225 186 435 40 383 45 21 74 253 188 -189 295 277 -340 233 170 -382 -361 -34
2390 -34 -297 -726 -468 309 -237 -452 473 307 -263 -216 546 -327 -529 441 297 -599 361 1038 -127 -173 969
2411 969 292 -702 395 494 -800 -218 722 -387 -730 551 88 -1254 -90 307 -532 -679 437 -88
2429 -88 -740 161 648 -234 -256 587 179 -414 534 558 -292 -395 672 19 -231 440 238 -490 312 283 -306
2450 -306 -258 -30 -333 -459 -43 28 -364 21 21 -448 -114 -248 -452 18 -49 -190 -15 334 154 -111 640 464
$$ packed form
2311A44J38M63o19n14J119k51j049P26K35r47r0J253n77j023R29L50j194K34J274
2330F01j028n57J299J01j349P21J182r36n80J319j61j126N66Q36q64k21J037j13
2348G27j401Q54P70j255j1P99p99r32J035O67r95M1P14l86n50Q49K26j168P09
2367a06K20j84J06K50o1l9K49l95L43l38k4N3J79o5l77M84j8o17N73o3n52K1L27
2390c4k63m29K58P77n46k15R25j66n70M7P62q73k02R70j44q96R60O77j165m6J142
2411I69o77r94J097R9j294N82R40j109l43J281m63j342J164L97q39j47J116n25
2429h8o52R01M87q82k2Q43m08n93R48K4q50j03J067o53k50O71k02p28Q02k9n89
2450c06M8K28l03j26M16P1l92L85%m69L34j34k04M70o7j41J75L49j80k65P51j76
$$ plain form
2472 464 -306 463 567 -252 -87 583 252 -437 319 472 -559 -542 536 -91 -861 218 327 -701 -868
2491 -868 620 -103 -775 320 623 -711 -162 845 -266 -681 824 683 -662 259 1503 -218 -143
2508 -143 884 200 -563 377 471 -584 -767 431 -52 -731 140 39 -570 -478 -50 -207 -172 -156 -57 -230 -39
2529 -39 248 82 -72 95 -58 -10 368 140 23 603 284 -123 531 408 -38 -10 134 -204 -291 -50 -120 -498
2551 -498 152 -24 -657 -90 306 -409 -389 456 -33 -575 97 464 -277 -30 815 302 -303 669 475 -276
2571 -276 -135 501 110 -268 559 606 -634 -211 743 -296 -913 369 -58 -912 -168 535 -385 -453 241 71
2591 71 -711 412 361 -465 -74 477 28 -287 587 473 -172 235 152 276 -89 289 57 -338 -225 9 -1
2612 -1 -180 -71 -6 -223 -197 -271 -413 -25 -259 -340 -121 177 -361 -13 474 45 -184 460 125 -459 133 460
$$ packed form
2472D64p70P69J04q19J65O70l31o89P56J53j031J7J078o27p70J079J09j028j67
2491h68J488p23o72J095L03j334N49J007j111m15J505j41j345R21J244j721P5
2508a43J027o84p63R40R4j055j83J198m83o79Q71j01o09R2M28j57L5J6R9j73J91
2529c9K87j66j54J67j53M8L78k28j17N80l19m07O54j23m46K8J44l38q7K41p0l78
2551d98O50j76o33N67L96p15K0Q45m89n42O72L67p41K47Q45n13o05R72j94p51
2571b76J41O36l91l78Q27M7j240M23R54j039o17J282m27q54P44P03r20o8O94j70
2591G1p82J123n1q26L91N51m49l15Q74j14o45M07q3J24l65L78k32l95J13K34j0
2612aj79J09O5k17K6p4j42L88k34q1K19K98n38L48M87m29k29O44l35n84N92L27
$$ plain form
2634 460 -440 -35 882 143 -290 373 635 -785 12 381 -79 -697 633 -114 -546 193 334 -593 -204
2653 -204 563 -244 -788 264 303 -422 145 649 -147 -412 461 536 -206 0 807 -332 -94 606 517 -379
2673 -379 214 659 -310 -216 145 -380 -436 64 -62 -418 -224 109 -334 -263 239 -196 -332 94 -135 -258 -84
2694 -84 134 122 313 615 420 213 291 -41 111 58 104 -176 -35 263 -36 29 159 4 -158 -159 -371 -809 -553
2717 -553 80 -320 -318 283 200 -598 210 485 -598 -323 676 60 -571 409 664 -208 148 853 198 -349 386
2738 386 11 -706 12 359 -444 -565 369 217 -630 145 266 -580 -364 263 -157 -604 107 308 -347 -136
2758 -136 748 -10 -248 550 301 -305 125 204 -120 -26 313 140 -33 234 100 -140 -50 -141 -251 -356 -100
2779 -100 -14 -87 90 -18 -117 129 -250 -400 9 -6 -237 79 360 -55 -87 706 186 -84 252 500 -251 -450
$$ packed form
2634D60r00M05R17p39m33O63K62j420P97L69m60o18J330p47m32P39J41r27L89
2653b04P67q07n44J052L9p25N67N04p96k65Q73P5p42K06Q07j139K38P00q9q96
2673c79N93M45r69R4L61n25n6N00j26l56J94L33m43P1N02m35j36M26k29j23J74
2694h4K18j2J91L02j95k07P8l32J52n3M6k80J41K98k99O5J30j55j62jk12m38K56
2717e53O33m00KO01q3p98Q08K75j083K75R99o16o31R80K55q72L56P05o55n47P35
2738C86l75p17P18L47q03j21R34j52q47P75J21q46K16O27m20m47P11K01o55K11
2758a36Q84p58k38P98k49o06M30P9l24R4L39j73j73K67j34k40R0r1j10j05K56
2779a00Q6p3J77j08r9K46l79j50M09j5k31L16K81m15l2P93n20k70L36K48p51j99
$$ plain form
2801 -450 344 -13 -536 261 483 -681 -139 555 -354 -1032 -22 245 -885 -533 663 -45 -565 524
2819 524 349 -397 -4 620 -655 -538 384 167 -335 508 440 -47 98 391 144 -503 159 108 -263 -240 426
2840 426 -356 -176 249 171 -435 -328 -115 -232 -107 205 -274 -428 234 123 -98 148 167 -189 48 66 -6
2861 -6 298 513 189 69 335 182 -163 462 212 -243 -108 109 -378 -310 260 169 -446 57 188 -495 -350
2882 -350 357 -210 -600 3 247 -436 89 756 10 -303 278 499 -383 -60 322 -47 -235 518 231 -443
2902 -443 -67 650 -330 -692 316 -244 -519 17 96 -659 -179 263 -101 -309 98 464 -263 246 125 147
2922 147 273 463 227 -154 205 113 16 246 120 -25 55 141 -43 -79 -139 -50 -37 -214 -33 -332 -350 12 -420
2945 -420 -379 170 -64 -114 267 376 -182 8 365 -73 -272 353 116 -177 266 536 162 -223 630 106 -398
$$ packed form
2801d50P94l57n23P97K22j164N42O94r09o78J010K67j130L52J196p08n20J089
2819E24j75p46L93O24j275J17R22k17n02Q43o8m87J45K93k47o47O62n1l71K3O66
2840D26p82J80M25p8o06J07K13j17J25L12m79j54O62j11k21K46J9l56K37J8p2
2861fL04K15l24j20K66j53l45O25k50m55J35K17m87O8N70r1o15N03J31o83J45
2882c50P07n67l90O03K44o83N25O67p46l13N81K21q82L23L82l69j88P53k87o74
2902d43L76P17r80l62J008n60k75N36P9p55M80M42l64k08M07L66p27N09j21K2
2922A47J26J90k36l81L59r2r7K30j26j45Q0Q6j84l6o0Q9J3j77J81k99j8L62m32
2945d20M1N49k34n0L81J09n58J90L57m38j99O25k37k93M43K70l74l85Q53n24n04
$$ plain form
2966 -398 172 305 -681 -346 348 -14 -491 -80 215 -649 -16 404 -381 -457 251 121 -377 59 566 37
2986 37 -125 545 73 -148 198 332 -260 133 202 -153 -108 259 141 -461 152 131 -322 -204 222 -169 -348
3007 -348 89 110 15 -159 -248 -92 -13 162 -70 82 120 -39 -181 278 290 223 356 250 99 338 397 -146 -246
3030 -246 52 323 -358 -214 69 -86 -212 233 -119 -504 -83 392 -701 -357 257 -96 -229 346 116 -241
3050 -241 98 384 83 -324 513 220 -52 194 671 22 -192 448 -100 -634 72 42 -275 -198 131 -136 -198
3071 -198 -61 44 -492 -189 301 -193 -157 20 36 -38 295 171 -23 226 316 38 -147 370 104 364 121
3092 121 163 131 155 281 -39 57 -60 -85 -347 -118 -219 -327 -343 -33 -42 -125 -33 1 -294 -2 309 56 -32 286
3116 286 60 58 330 340 -127 119 703 -31 -334 566 -127 -288 286 301 -394 66 492 -238 -333 239 -16 -736
$$ packed form
2966c98N70J33r86L35O94l62m77M11K95q64O33M20p85p6P08j30m98M36N07n29
2986C7j62O70m72k21L46J34n92L93O9l55M5L67j18o02O13k1m53J18M26l91j79
3007c48M37K1r5j74q9J56P9J75k32J52L8j59j42M59J2o7J33j06j51K39N9n43j00
3030b46K98K71o81J44K83j55j26M45l52l85M21M75j093L44O14l53j33N75k30l57
3050b41L39K86l01m07Q37k93k72K46M77o49k14O40n48n34P06l0l17P7L29k67o2
3071a98J37J05n36L03M90m94L6J77J6p4L33j24j94K49R0k78j85N17k66K60k43
3092A21M2l2K4J26l20R6j17k5k62K29j01j08j6L10rq3R2L4k95K92L11k53q8L18
3116B86k26kK72J0m67K46N84p34l03R00o93j61N74J5o95M60M26p30r5N72k55p20
$$ plain form
3138 -736 13 41 -474 -434 513 175 -117 180 158 -106 -206 321 -215 -223 488 135 -212 -58 639 -7 -70 375
3160 375 -7 -440 -185 4 -152 -384 -10 -33 3 -110 81 17 -222 -55 -221 14 158 -132 36 360 121
3181 121 189 302 243 -216 78 349 -31 221 422 38 -251 39 49 -322 -13 6 -388 -276 -29 -94 -433 75
3203 75 341 -465 57 21 29 -402 139 -45 -395 176 523 -48 -29 401 103 -213 348 212 -69 32 4 113
3225 113 -336 339 212 -147 -98 348 35 -370 -48 -260 -407 -447 273 -149 4 355 130 49 211 108 -70
3246 -70 -90 145 234 120 313 199 63 244 129 77 56 145 33 -102 -49 -68 -195 110 -327 -244 42 -94 -428
3269 -428 -272 243 -135 -237 171 487 -216 24 566 96 -92 415 20 41 420 417 -85 79 343 -31 -79
3290 -79 151 224 -104 -33 227 -423 -536 154 -57 -677 -292 209 -212 21 203 -257 -394 -9 286 13 66
$$ packed form
3138g36P49K8n15M0R47l38k92K97k2k64j00N27n36qP11l53l47J54O97o46o3M45
3160C75l82m33K55J89j56k32L74k3L6j13J91o4k39J67j66K35J44k90J68L24k39
3181A21O8J13n9m59K94K71l80K52K01l84k89K90J0l71L09J9l94J12K47o5l39N08
3203G5K66q06N22l6Qm31N41j84l50N71L47n71J9M30k98l16N61j36k81J01k8J09
3225A13m49O75j27l59M9M46l13m05L22k12j47m0P20m22J53L51k25q1J62j03j78
3246g0k0K35Q9j14J93j14j36J81j15n2k1Q9j12j35N3j9j27L05m37Q3K86j36l34
3269d28J56N15l78j02M08L16p03K40N42m70j88N07l95K1L79ln02J64K64l74m8
3290g9K30P3l28P1K60o50j13O90k11o20L85N01m21K33J82m60j37L85K95k73N3
$$ plain form
3311 66 426 192 316 365 211 33 97 151 77 -137 617 -226 152 59 -117 -312 -442 -183 -391 -120 42 -121
3333 -121 -100 -131 -78 -47 146 -62 -117 81 258 -82 -93 562 35 -96 -8 287 149 24 310 -59 -320 230
3355 230 230 -146 -241 138 -215 -217 200 4 -432 101 265 -615 107 131 -67 -269 104 413 58 -58 383 -353
3377 -353 -110 590 55 -318 311 452 -39 -11 8 55 -22 271 54 -440 -45 57 -181 -260 219 -231 -96 -120
3399 -120 -36 -269 -21 132 213 -193 225 284 -38 287 261 -23 109 41 -74 160 225 -4 -217 124 44 -161
3421 -161 -72 5 -455 -54 22 -238 -106 225 92 -295 105 154 75 -86 -122 -73 -174 278 152 -83 76 512
3443 512 236 -84 411 190 -139 42 247 -3 -155 231 98 -218 -86 100 -334 -221 -151 -252 -396 -121
3463 -121 60 -338 -50 218 28 45 143 -79 -126 6 -249 -16 -25 321 396 14 173 130 -59 36 247 -10 -103
$$ packed form
3311F6L60k34J24M9j54j78O4N4p4k14P54q43L78r3j76j95j30K59k08K71J62j63
3333a21K1l1N3L1J93k08n5J98J77l40j1O55n27j31Q8K95j38j25K86l69k61N50
3355B30%l76r5L79l53kM17j96m36N33J64q80P22K4j98k02L73L09l55j16M41p36
3377c53K43P00n35l73O29J41m91K8J9M7p7K93k17m94L95J02k38p9M79m50J35k4
3399a20Q4k33K48J53Q1m06M18N9l22L25k6k84J32o8j15K34O5k29k13L41q0k05
3421a61Q9P7m60M01P6k60J32L31j33l87M00M9p9j61l6M9j01M52j26k35J59M36
3443E12k76l20M95k21l29J81K05k50j52L86j33l16J32J86m34J13P0j01j44K75
3463a21J81l98K88K68j90J7R8k22m7J32k55K33rL46P5l82J59m3j89R5K11k57r3
$$ plain form
3486 -103 94 -125 -106 47 140 -64 -139 20 -243 -146 -90 -122 -95 154 -127 -110 245 74 65 -109 209 143 -188 164
3510 164 -25 13 -13 230 55 -65 -37 113 -200 2 132 -40 -166 33 12 -248 -63 -52 -251 24 135 -135
3532 -135 -79 58 335 15 109 198 -67 -101 28 111 -156 -30 91 -37 -258 270 11 -240 289 -146 -191 18
3554 18 97 -350 -219 -103 25 9 99 -1 -97 -206 86 -221 16 234 32 -223 214 302 -50 97 166 19
3576 19 59 158 92 -199 30 -133 49 53 -59 -377 84 -216 -301 -182 -86 -90 -501 -54 44 -1 -289 21 -259 -64
3600 -64 66 73 -24 123 351 88 0 273 283 -146 236 66 -64 -58 -29 54 -73 120 -140 -26 -125 -66 -353 94
3624 94 87 37 -113 -189 82 139 -270 45 187 105 149 307 -100 158 48 283 -114 178 100 -65 -155 -9 119
3647 119 -55 262 -101 -119 -113 2 -23 -2 -74 -157 32 182 -48 -129 187 136 -66 -64 161 66 24 273 73 -231
$$ packed form
3486a03J97k19J9J53R3k04p5J59k63R7N6l2K7K49k81J7L55j71rj74L18o6l31L52
3510A64j89L8k6K43j75j20K8J50l13K02J30j72j26J99k1k60J85J1j99K75J11k70
3532a35N6J37K77l20R4Q9k65l4J29Q3k67J26J21j28k21N28k59k51N29m35m5K09
3554A8P9m47J31J16J28j6R0j00r6j09K92l07K37K18k02k55M37Q8l52J47O9j47
3576A9M0R9o6k91K29j63J82Mj12l18M61l00q5J19R6mm11M47R8m5k88L10k80J95
3600f4J30Pr7J47K28k63q8K73J0m29L82j70j30OK9Q3j27J93k60J14r9N9k87M47
3624I4pn0j50p6K71N7m09L15J42q2M4J58m07K58j10K35l97K92p8j65r0J46J28
3647A19j74L17l63j8OJ15k5K1p2q3J89J50k30q1L16n1k02KK25r5m2K49k00l04
$$ plain form
3671 -231 265 292 -152 -54 292 -2 -88 -81 -117 -22 -86 121 -196 70 67 -149 -141 -240 -186 62 27 374 77 28 214
3696 214 21 -215 137 59 -10 113 278 121 4 175 168 53 165 -26 -14 -169 115 -277 -234 -41 -150 -120
3718 -120 -295 -21 -96 22 153 -178 -313 -36 46 69 218 102 -140 -129 18 219 182 92 216 240 245 0 223
3741 223 16 106 -62 180 -86 72 -98 -182 293 -84 -158 24 -89 -62 66 113 -89 25 175 -192 318 96
3763 96 30 -115 -11 243 -193 119 23 136 -355 -42 271 223 -85 321 113 -143 -153 14 -407 -284 -156 -221
3785 -221 2 54 -33 -133 -76 -43 -124 -246 -22 -39 -57 119 213 41 33 -16 -110 -23 124 181 27 -70 -19 51 142 152
3811 152 120 -303 102 76 -222 71 -8 -178 -69 -37 -207 -96 -165 19 139 345 -118 32 148 161 90 233
3833 233 50 59 16 52 200 -40 -135 3 -248 67 -72 -97 -150 -262 152 -100 -336 -120 -365 -88 160 -43
$$ packed form
3671b31M96K7m44R8L46k94q6Pl6R5o4K07l17K66lk16Qr9N4K48l5L47k97m9J86
3696B14j93k36L52p8o9J23J65j57j17J71pj15J12j91J2j55K84l92M3J93j09L0
3718a20j75K74p5J18J31l31j35K77Q2K3J49j16k42J1J47K01l7r0J24K4Nk45K23
3741B23k07R0j68K42k66J58j70q4M75l77p4J82j13K7J28M7k02J14J50l67N10k22
3763I6o6j45J04K54m36L12r6J13m91L13L13m8l08M06k08k56j0J67m21J23J28o5
3785b21K23N2q7j00N7L3q1j22K24j7j8J76R4j72qm9r4Q7J47N7j54r7N1P0R1J0
3811A52l2m23M05k6k98K93p9j70J09L2j70J11o9J84J20K06m63J50J16J3p1J43
3833B33j83Rm3L6J48k40r5J38k51L15j39k5n3j12M14k52k36K16k45K77K48k03
$$ plain form
3855 -43 -138 -13 337 -113 120 -9 142 -168 336 192 60 10 35 135 89 110 11 -124 -111 -120 -170 -154 -143 59
3879 59 -187 -251 -114 6 87 -372 3 35 67 -16 22 30 -156 47 98 -20 121 -14 126 -4 -153 210 62
3902 62 -43 -2 361 8 87 -20 -244 -286 -11 -8 154 13 174 -50 -290 -232 11 -193 7 277 -79 -179
3924 -179 366 173 -5 70 156 149 -96 41 -145 -69 8 158 -83 -98 35 -184 -21 -105 84 -140 27 -104 -297
3947 -297 138 54 -54 -234 -20 -37 -24 -6 122 -46 141 254 8 92 120 178 -21 19 253 -176 83 -340 -263
3970 -263 1 73 26 -98 -168 -243 -182 -43 57 -40 -282 -159 -142 -427 -54 199 69 -102 73 296 -222 153
3992 153 -19 117 15 44 183 70 276 177 -226 33 171 143 -194 292 -132 44 -41 -131 30 -178 -82 -2
4014 -2 -149 -19 123 41 -43 -32 -69 -231 347 10 130 62 358 33 73 31 177 -29 -243 157 35 14 166
$$ packed form
3855d3r5J25L50m50K33j29J51l10N04j44j32n0K5J00m6K1r9j35J3rn0J6J1K02
3879E9k46o4J37J20Q1m59L75L2L2q3L8Qj86K03N1j18J41j35J40j30j49L63j48
3902F2j05M1L63l53P9j07k24m2K75LJ62j41J61k24k40N8K43k04K00K70l56j00
3924a79N45j93j78P5Q6pk45J37j86P6P7J50k41j5J33k19J63q4J89k24J67j31j93
3947b97M35q4j08j80K14j7J3J8J28j68J87J13k46Q4K8N8j99M0K34m29K59m23P7
3970b63K64P2m7j24p0p5O1J39J00r7k42J23J7k85L73K53j30j71J75K23n18L75
3992A53j72J36j02K9J39j13K06r9m03K59J38k8l37M86m24J76q5r0J61k08R6Q0
4014bj47J30J42q2q4J1l7j62N78l37J20o8K96l25M0m2J46k06k14M00j22k1J52
$$ plain form
4037 166 -94 -42 -21 -104 -226 41 -140 -61 367 87 -42 -105 -191 135 -99 -18 98 142 260 108 0 85 144
4060 144 389 28 162 -152 98 96 -50 37 -276 -125 -109 -93 131 -25 73 163 -45 -190 59 258 -67 -183
4082 -183 -122 -95 -95 86 250 -17 -46 403 -35 62 169 -48 -187 175 169 -85 -41 201 -118 -66 -211 -125 -241 42
4106 42 -149 -103 -85 -12 155 -28 -25 -58 107 36 150 -215 256 164 353 -52 -166 114 101 216 106 -13 -4 34
4130 34 47 -72 -137 159 -262 59 -29 -367 -57 -323 -211 66 412 -137 -129 -3 126 -16 -148 -84 0 -148 -117
4153 -117 22 83 -99 80 165 -205 35 225 3 -290 226 -250 55 32 94 56 -317 -164 -2 -129 -33 -59
4175 -59 -143 -184 222 23 -21 -58 -38 195 107 53 -171 31 110 184 260 115 106 -67 -117 67 -89 70 -49 -6 -17
4200 -17 13 -312 33 -30 47 2 -168 -140 -146 -131 72 29 -115 133 -97 172 81 55 -2 10 173 50 53 57 298 50
$$ packed form
4037A66k60N2K1q3j22K67j81P9M28k80j29o3q6L26k34Q1J16M4J18j52j08Q5N9
4060A44K45l61J34l14K50kj46Q7l13J51J6J6K24j56R8R0k08j45K49J99l25j16
4082a83O1K7%J81J64k67k9M49m38R7J07k17j39L62ok54M4K42l19N2j45Q6j16K83
4106D2j91M6J8P3J67j83Ll3J65p1J14l65M71r2J89m05j14K80j3J15j10j19RL8
4130C4J3j19o5K96m21L21q8l38L10k66J12K77L46n49QJ26J29j42j32O4Q4j48L1
4153a17J39O1j82J79Q5l70K40J90k22k93N16m76L05k3O2l8l73J53J62j27R6k6
4175e9q4m1M06j99m4l7K0K33q8n4k24K02P9P4P6j45rj73n0J84j56J59j19M3j1
4200a7L0l25L45o3P7m5j70K8oJ5K03m3j44K48k30K69r1k6n7J2J63j23LMK41k48
$$ plain form
4226 50 91 -20 37 89 -203 36 133 73 -223 -73 -131 -27 -190 20 -216 -26 -107 72 -80 -112 75 28 -119
4249 -119 -39 -279 -108 252 13 58 71 171 -145 116 -48 -157 -62 16 -21 -44 -129 74 -60 76 -43 -109 -56
4272 -56 56 193 -210 -108 53 93 -67 98 -46 154 162 162 109 -74 216 -47 -72 101 137 62 76 125 5 -90
4296 -90 -34 -62 -113 123 27 -63 -72 -226 30 15 296 -85 -87 -315 130 -92 -102 66 -22 55 79 315 105 200 -3
4321 -3 7 123 -4 29 80 -198 106 -28 82 -174 203 -19 14 60 91 -289 -321 -94 23 -53 -83 76 26 -61
4345 -61 -76 288 -39 66 24 159 132 -372 231 105 -126 205 -75 -9 169 6 -48 -43 79 79 31 -163 -153 23
4369 23 -43 -67 -72 221 76 -109 -36 -64 -272 168 -181 29 265 18 31 72 236 -34 -103 56 -140 86 45 2
4393 2 -176 215 -15 -131 -208 -222 -260 -166 -61 -94 -55 -108 61 169 76 146 -46 73 56 227 72 -262 148 134
$$ packed form
4226E0M1j11N7N2k92K39R7o0k96J50n8J04j63K10k36J90q1J79j52l2J87m7j47
4249a19Q0k40J71L60k39M5J3J00l16K61j64j09R5P8l7k3q5K03j34J36j19o6N3
4272e6J12J37m03J02J61M0j60J65j44K00Q%n3j83K90k63k5J73L6p5J4M9j20r5
4296i0N6k8n1K36r6r0rj54K56j5K81l81kk28M45k22j0J68q8P7K4K36k10R5k03
4321cJ0J16j27L3N1k78L04j34J10k56L77k22L3M6L1l80l2K27J17p6l0J59n0q7
4345f1j5L64l27J05m2J35k7n04O03j26k31L31k80O6J78j63n4NJ22%m8j94J0J76
4369B3o6k4nK93j45j85P3k8k08M40l49K10K36k47J3M1J64k70o9J59j96K26m1m3
4393Bj78L91k30j16p7j4l8R4J05l3L9n3J69J08r3P0j92J19j7J71j55l34M10j4
$$ plain form
4417 134 315 -148 75 -25 167 -197 122 48 -369 -98 -43 -66 -8 -227 -232 -171 47 -146 34 24 60 -231 -49
4440 -49 0 101 46 81 183 90 68 166 189 111 30 -16 125 -118 -17 -60 -197 -100 48 -9 -53 -110 239 -105 -65 -77
4466 -77 -208 36 -51 -168 2 -18 24 82 97 -55 85 85 -94 78 5 142 55 -40 -96 -248 -221 -5 -138 281
4490 281 -6 -224 27 -192 2 -95 -164 -107 -117 79 261 -115 52 -63 -174 114 98 -13 -87 -88 20 31 30 -116
4514 -116 -68 229 203 131 43 -193 152 -84 -165 108 25 -149 38 -85 -218 -191 27 -100 -197 102 -52 -236 163
4537 163 49 65 198 304 139 -48 99 225 -31 387 261 -154 302 -61 -196 37 -62 28 -9 -58 -40 120
4559 120 -108 23 -107 46 -232 -157 60 -221 -112 -101 -50 -216 -47 154 146 1 133 173 117 181 -55 2 117
4582 117 51 37 16 229 -141 -195 176 -67 72 -144 -12 -108 -50 -114 -207 -86 -211 -88 241 172 -113 38 -12
$$ packed form
4417A34J81m63K23j00J92l64L19p4m17K71N5k3N8k19nO1K18j93J80j0L6k91J82
4440d9M9J01n5L5J02r3k2R8K3p8q1m6J41k43J01m3j37R7J48n7m4n7L49l44M0j2
4466g7j31K44q7j17J70k0M2N8J5j52J40%j79J72p3J37q7r5n6j52K7K16j33M19
4490B81k87k18K51k19J94r7o9N7j0J96J82l76J67j15j11K88j6j11p4jJ08J1jj46
4514a16M8K97k6p2q8k36L45k36q1K73q3j74J87j23j33K7K18j27r7K99j54j84L99
4537A63j14J6J33J06j65j87J47J26k56M18j26m15M56l63j35K33r9R0l7m9J8J60
4559A20k28J31j30J53k78P5K17k81J09J1N1j66J69K01qj45J32M0n6O4k36N7J15
4582A17o6j4k1K13l70n4L71k43J39k16J32r6N8o4r3J21j25J23L29o9k85J51n0
$$ plain form
4605 -12 74 175 55 64 -53 31 216 -26 86 88 -37 71 87 81 32 43 174 35 -295 -197 -242 36 -82 -102 -112
4630 -112 -145 -231 -1 77 99 -40 -70 -189 -40 -29 -13 -6 -51 -219 -41 100 10 18 -13 196 -122 -14 -223 -126 124
4655 124 -107 -60 -94 -44 107 -103 125 101 73 -42 -136 -32 -219 36 -170 23 162 187 172 52 45 166 88 74
4679 74 -136 53 -40 -31 -52 79 32 -80 129 94 78 64 9 -46 195 15 -186 -122 -115 -52 -149 -132 220 164 -94 -90 -11
4706 -11 -222 -6 -176 -114 26 179 -132 -47 -176 22 30 -149 180 -19 46 -61 67 55 -125 352 48 -130
4728 -130 -35 -163 -83 -352 175 63 -39 224 -23 -2 -33 141 -71 -45 -156 -20 56 -56 -110 -91 222 65 144
4751 144 -7 -242 -27 -7 -57 -269 -138 -114 115 20 11 -127 -220 -236 75 153 -190 -71 155 200 44 -83 76
4774 76 253 59 269 167 93 307 -172 94 -49 -124 -34 -3 -159 35 -2 -84 103 -140 -238 38 -155 304 -140
$$ packed form
4605a2Q6J01j20Rj17Q4J85k42J12Kj25J08J6om9J1J31j39l30R8m5K78j18k0j0
4630a12l3q6K30P8K2j39l0j19J49J1J6Pm5j68J78J41r0Ql1K09l18J08k09R7K50
4655A24k31M7l4N0J51k10K28k4k8j15r4J04j87K55k06J93J39K5j5j20pJ21p8j4
4679G4k10J89r3Rk1J31m7j12K09l5j6j4n5n5K41j80k01O4PO3r7J7L52n6k58MP9
4706a1k11K16j70O2J40J53l11Q5j29J98Qj79L29j99O5j07J28j2j80M77l04j78
4728a30R5j28Q0k69N27j12j02K63k47K1l1J74k12K6j11J36P6j12n4J9L13j57P9
4751A44j51k35K15K0n0k12J31K4K29r5rj38r3j6L11P8l43J19K26M5j56j27J59
4774G6J77j94K10j02p4K14m79K66j43p5R0L1j56J94l7q2J87k43r8K76j93M59m44
$$ plain form
4797 -140 98 141 -66 69 -2 357 213 228 -28 179 -30 9 -76 48 21 231 48 -52 24 53 -163 -131 58
4820 58 -95 -72 -76 108 51 -178 -6 127 -216 -64 -130 187 -32 280 107 -48 81 -30 -117 25 -5 -45 -31
4843 -31 190 123 -302 -81 14 -410 -187 -108 -51 -311 -295 -263 177 136 -143 108 -76 -81 286 77 -83 152 134 37
4867 37 65 -100 245 -1 148 -46 264 -7 -129 -35 78 -129 9 -23 -80 21 -143 104 -253 -89 -158 -63
4889 -63 71 -196 199 -24 -160 -116 74 47 98 -37 135 -75 197 40 59 6 7 -111 -49 -72 -138 -21 64 -67
4913 -67 179 -77 101 103 -54 13 -137 20 -181 55 -235 -1 -91 -189 28 -46 311 -62 164 251 4 366 40
4936 40 -40 49 225 44 157 133 -129 -5 -28 -51 -162 -23 48 -282 -155 25 -27 -51 41 -39 69 -12 66 -212
4960 -212 -212 145 209 -43 -210 119 -54 67 63 68 -51 82 74 9 -104 -163 47 -53 -95 166 -169 -146 -168 22 54
$$ packed form
4797a40K38M3k07J35p1L59j44J5k56K07k09L9q5J24k7K10j83j00P6K9k16L2J89
4820E8j53K3mJ84n7k29J72J33l43J52o6L17k19L12j73j55J29j11q7J42l0m0J4
4843c1K21o7m25K21R5m24K23P9N7k60J6L2M40m1k79K51j84nL67k09j60K35j8r7
4867C7K8j65L45k46J49j94L10k71j22R4J13k07J38l2n7J01j64K47l57J64o9R5
4889f3J34k67L95k23j36M4J90k7N1j35J72k10K72j57J9n3Jj18O2k3o6J17Q5j31
4913f7K46k56J78Kj57O7j50J57k01K36k90K34r0r8K17p4L57l73K26Q7k47L62l26
4936D0q0Q9J76j81J13k4k62J24k3k3j11J39P1l30J27J80n2k4R2q0J08q1P8k78
4960b12%L57O4k52j67L29j73J21mNj19J33qo5j13n9K10j00m2K61l35K3k2J90L2
$$ plain form
4985 54 128 86 131 -18 109 -27 -260 -202 248 -167 73 -3 232 -63 119 -1 45 232 -6 98 188 11 -65
5008 -65 -133 -215 133 57 89 -249 -103 45 2 -110 -44 53 -23 -154 54 70 -78 153 -159 87 274 214 -290 279
5032 279 94 35 87 41 92 83 83 -231 -195 -55 -198 -34 124 -17 83 -51 -16 65 -60 79 42 8 -334 74
5056 74 -84 -10 145 -351 -50 -95 123 266 -80 181 130 217 -171 -107 -41 -69 84 50 -171 7 12 5 13 -100 44
5081 44 -67 -99 -66 -54 -107 47 89 208 253 -55 67 -161 -79 -24 161 -27 10 332 -56 157 -185 -122 195 23
5105 23 -189 90 -107 -181 -334 93 -89 181 -139 106 23 205 -240 -173 40 -235 79 -41 -218 94 -27
5126 -27 -47 200 -2 50 107 65 -117 -147 -243 61 37 -21 -215 -52 -148 86 -230 -133 -182 -38 -268 108 -69 58
5150 58 -208 -153 110 -115 11 38 14 -74 -79 -31 109 32 24 102 -44 42 261 106 61 115 91 -5 -137 -22 14 115
$$ packed form
4985E4P4m2M5j49J27j36k33N8M50m15K40p6K35k95J82j20M6J87k38J04R0j77p6
5008f5o8q2L48p6L2l38J46J48m3j12O6R7p6j31K08J6j48K31l12K46J87o0n04N69
5032B79j85n9N2m6N1r%l14L6J40j43J64J58j41J00j34L5Q1j25J39l7l4l42M08
5056G4j58P4J55m96L01m5K18J43l46K61n1Q7l88O4O6k8J53l4k21J78NpQj13J44
5081D4j11l2L3J2n3J54M2J19M5l08J22k28Q2N5J85j88L7L22l88K13l42O3L17j72
5105B3k12K79j97p4j53M27j82K70l20K45q3J82m45O7K13k75L14j20j77L12j21
5126b7k0K47k02N2N7m2j82l0r6L04k4n8j94J63r6K34l16R7m9J44k30L76j77J27
5150E8k66N5K63k25J26K7k4q8nM8J40p7qP8j46Q6K19j55m5N4k4r6j32J15L6J01
$$ plain form
5176 115 46 7 -112 -62 -64 20 -158 -212 -35 103 46 93 117 179 72 125 182 -26 138 23 9 49 36 61 88 181
5202 181 80 -125 31 -303 -356 234 -60 -176 30 135 102 23 24 116 3 103 245 -230 183 -23 -32 -46 28
5225 28 30 -131 27 85 209 60 148 107 -82 130 55 -100 -300 -206 20 -115 -49 149 26 109 20 17 -384 161
5249 161 91 158 -26 -59 -6 335 252 -322 213 3 33 -91 111 -43 -22 22 0 13 152 -162 -209 -192 108 14
5273 14 49 6 -53 -100 11 -116 -21 -108 -342 -156 52 -116 27 112 -159 15 -254 -83 -169 163 -140 13 -32
5296 -32 172 86 125 150 -164 -56 170 -262 -142 -316 178 53 69 22 -136 -15 -44 -135 -311 102 7 -94 85
5319 85 -181 -39 10 185 -162 -16 79 117 -177 117 -32 -12 -149 61 135 -101 64 -136 -79 -285 -155 -93 75
5342 75 -153 -272 13 -44 -14 129 122 168 -161 -13 272 199 -144 147 239 152 -284 -40 -2 26 -91 158 -249 141
$$ packed form
5176A15o9l9j19N0kQ4j78n4J77J38n7M7K4O2j07N3N7k08J64j15j4M0j3K5K7R3
5202A81j01k05J56l34n3N90k94j16K06J05l3p9JR2j13J00J42m75M13k06rj4P4
5225B8Kj61J58N8J24j49Q8m1j89K12p5j55k00R4K26j35O6J98j23Q3q9lm01N45
5249A61p0O7j84l3N3L41q3n74N35k10L0j24K02j54K1M4k2J3J39l14m7J7L00r4
5273A4L5m3n9m7J11j27R5q7k34J86K08j68J43Q5k71J74k69J71q6L32l03J53m5
5296c2K04q6L9K5l14J08K26m32J20j74M94j25J6m7j58J21k9r1j76M13r5j01J79
5319H5k66J42M9J75l47J46R5L8k94K94j49K0j37K10P4k36J65k00N7k06J30O2J68
5342G5k28j19K85n7L0J43pM6l29J48K85p3l43K91R2q7m36K44L8K8j17K49m07L90
$$ plain form
5366 141 53 -177 -30 -179 -208 -264 -156 -111 -192 -288 -16 177 -144 -91 204 334 72 76 -136 24 193 21 46
5389 46 59 -213 -44 -8 98 -185 -231 105 -134 79 30 65 -45 -208 -209 -227 -191 -106 -4 85 -152 -100 -4 120 86
5414 86 60 -13 -33 100 164 -116 135 172 116 55 39 -1 97 -33 -79 94 0 105 -47 75 -135 82 -146 -29
5438 -29 -130 31 5 108 26 101 32 -208 89 1 132 23 -90 200 -70 173 145 -60 80 39 -83 -120 -58
5461 -58 96 -146 -113 -42 -297 -52 -92 -84 -138 -99 257 -107 78 96 -114 93 230 59 190 -14 -134 -95 -59 217
5485 217 43 -58 136 92 -115 -39 93 -130 1 -189 -38 -192 182 176 28 -177 -32 -155 236 -154 7
5506 7 -85 -127 175 224 214 -78 -51 282 26 -35 -120 185 84 8 92 9 129 -191 141 238 -146 -278 53 -26 -267
5531 -267 129 -2 -149 -71 -107 219 -157 135 79 -189 153 -39 -2 -61 25 73 -67 307 -88 -48 -31 -14 -212
$$ packed form
5366A41q8k30J47j49k9n6J08M5q1r6K72J93l21N3K95J30k62Mk12J60J69j72K5
5389D6J3k72J69L6J06k83m6L36k39K13m9L5j10j63jj8L6Q5J02Q9k37N2R6J24l4
5414H6k6p3k0J33O4k80K51L7n6o1j6m0R8j30m6J73r4J05j52J22k10K17k28J17
5438b9j01J61k6J03q2P5o9k40K97q8J31j09j13K90k70K43k8k05J40m1j22l7O2
5461e8J54k42L3P1k55K45m0Qn4L9L56l64J85J8k10K07J37j71J31k04j20L9L6K76
5485B17j74j01J94m4k07P6J32k23J31j90J51j54L74oj48k05J45j23L91l90J61
5506Gr2m2L02M9j0k92K7L33k56o1q5L05j01p6Q4q3J20l20L32R7l84j32L31p9k41
5531b67L96j31j47P8l6L26l76K92n6k68L42j92L7n9Q6M8j40L74l95M0J7J7j98
$$ plain form
5554 -212 93 148 -112 -50 23 1 -157 49 -10 -279 -119 -373 -146 29 16 50 -40 -49 14 26 116 81 52 13 -25 46
5580 46 27 190 -41 -74 195 -186 -23 -215 -9 108 95 -12 -175 -15 325 -293 -143 -392 -66 -70 5 5 226
$$ packed form
5554b12L05N5k60O2P3k2j58K06n9k69J60k54K27J75j3L4r0rO3J2R0l5k9l9l8P1
5580D6j9J63k31l3K69l81J63j92K06J17j3j07j63J60L40o18J50k49L26mP5%K21
$$ [...]
8191a2
##END NTUPLES=NMR FID
##END=
