##TITLE=1H_SL59-Dau(bat2)-f5
 CDCl3, 32 sc, 
 1.06.2021
##JCAMPDX= 6.0         $$ Bruker NMR JCAMP-DX V2.0
##DATA TYPE= NMR FID
##DATA CLASS= NTUPLES
##ORIGIN= UXNMR, Bruker Analytische Messtechnik GmbH
##OWNER= root
$$ XWIN-NMR		Version 3.5
$$ Tue Jun  1 11:23:39 2021 Russian Standard Time (UT+4h)  she@DPX200
##.OBSERVE FREQUENCY= 200.131506
##.OBSERVE NUCLEUS= ^1H
##.DELAY= (6, 6)
##.ACQUISITION MODE= SIMULTANEOUS
##.ACQUISITION SCHEME= undefined
##.AVERAGES= 32
##.DIGITISER RES= 18
##SPECTROMETER/DATA SYSTEM= spect
##.PULSE SEQUENCE= zg30
##.SOLVENT NAME= CDCl3
##.SHIFT REFERENCE= (INTERNAL, CDCl3, 0, 15.7039)
##AUDIT TRAIL= $$ (NUMBER, WHEN, WHO, WHERE, WHAT)
$$ ##TITLE= Audit trail, XWIN-NMR		Version 3.5
$$ ##JCAMPDX= 5.01
$$ ##ORIGIN= Bruker BioSpin GmbH
$$ ##OWNER= she
$$ F:/spectra/data/she/nmr/H-F/1/audita.txt
$$ ##AUDIT TRAIL=  $$ (NUMBER, WHEN, WHO, WHERE, WHAT)
(   1,<2021-06-01 11:21:38.26 +0400>,<she>,<DPX200>,
      <continue with go, POWCHK disabled, PULCHK disabled
       configuration hash MD5:
       00 E9 B6 7A A2 85 ED C7 34 08 36 98 17 FE 4E 26
       data hash MD5: 16K
       11 38 3E F9 9B 3B 6A DA CA E5 19 4F 91 E6 84 BA>)
$$ ##END=
$$ 
$$ hash MD5
$$ A5 94 B9 D7 86 E6 14 71 16 6D 61 A8 E7 18 62 39
##$RELAX= 
##$RELAX= 
##$RELAX= 
##$RELAX= 
##$RELAX= 
##$RELAX= 
$$ Bruker specific parameters
$$ --------------------------
##$DU= <F:/spectra>
##$EXPNO= 1
##$NAME= <H-F>
##$PROCNO= 1
##$TYPE= <nmr>
##$USER= <she>
##$AMP= (0..31)
100 100 100 100 100 100 100 100 100 100 100 100 100 100 100 100 100 100 
100 100 100 100 100 100 100 100 100 100 100 100 100 100 
##$AQSEQ= 0
##$AQ_mod= 1
##$AUNM= <au_zg>
##$AUTOPOS= <>
##$BF1= 200.13
##$BF2= 200.13
##$BF3= 200.13
##$BF4= 200.13
##$BF5= 200.13
##$BF6= 200.13
##$BF7= 200.13
##$BF8= 200.13
##$BYTORDA= 1
##$CFDGTYP= 0
##$CFRGTYP= 5
##$CHEMSTR= <none>
##$CNST= (0..31)
1 1 145 1 1 1 1 1 1 1 1 1 1 1 1 1 1 1 1 1 1 1 1 1 1 1 1 1 1 1 1 1 
##$CPDPRG= <>
##$CPDPRG1= <>
##$CPDPRG2= <>
##$CPDPRG3= <>
##$CPDPRG4= <mlev>
##$CPDPRG5= <mlev>
##$CPDPRG6= <mlev>
##$CPDPRG7= <mlev>
##$CPDPRG8= <mlev>
##$CPDPRGB= <>
##$CPDPRGT= <>
##$D= (0..31)
0 1.2 0 0 0 0 0 0 0 0.06 0 0.03 0 0 0 0 0.0002 0 0 0 0 0 0 0 0 0 0 0 0 
0 0 0 
##$DATE= 1622531993
##$DBL= (0..7)
120 120 120 120 120 120 120 120 
##$DBP= (0..7)
150 150 150 150 150 150 150 150 
##$DBP07= 0
##$DBPNAM0= <>
##$DBPNAM1= <>
##$DBPNAM2= <>
##$DBPNAM3= <>
##$DBPNAM4= <>
##$DBPNAM5= <>
##$DBPNAM6= <>
##$DBPNAM7= <>
##$DBPOAL= (0..7)
0.5 0.5 0.5 0.5 0.5 0.5 0.5 0.5 
##$DBPOFFS= (0..7)
0 0 0 0 0 0 0 0 
##$DE= 6
##$DECBNUC= <off>
##$DECIM= 32
##$DECNUC= <off>
##$DECSTAT= 4
##$DIGMOD= 1
##$DIGTYP= 9
##$DL= (0..7)
0 120 120 120 120 120 120 120 
##$DP= (0..7)
150 150 150 150 150 150 150 150 
##$DP07= 0
##$DPNAME0= <>
##$DPNAME1= <>
##$DPNAME2= <>
##$DPNAME3= <>
##$DPNAME4= <>
##$DPNAME5= <>
##$DPNAME6= <>
##$DPNAME7= <>
##$DPOAL= (0..7)
0.5 0.5 0.5 0.5 0.5 0.5 0.5 0.5 
##$DPOFFS= (0..7)
0 0 0 0 0 0 0 0 
##$DQDMODE= 0
##$DR= 18
##$DS= 0
$$ [...]
##$SUBNAM2= <"">
##$SUBNAM3= <"">
##$SUBNAM4= <"">
##$SUBNAM5= <"">
##$SUBNAM6= <"">
##$SUBNAM7= <"">
##$SUBNAM8= <"">
##$SUBNAM9= <"">
##$SW= 16.9725357007746
##$SWIBOX= (0..15)
0 0 2 0 0 0 0 0 0 0 0 0 0 0 0 0 
##$SW_h= 3396.73913043478
##$TD= 16384
##$TD0= 1
##$TE= 0
##$TE2= 300
##$TE3= 300
##$TEG= 300
##$TL= (0..7)
0 120 120 120 120 120 120 120 
##$TP= (0..7)
150 150 150 150 150 150 150 150 
##$TP07= 0
##$TPNAME0= <>
##$TPNAME1= <>
##$TPNAME2= <>
##$TPNAME3= <>
##$TPNAME4= <>
##$TPNAME5= <>
##$TPNAME6= <>
##$TPNAME7= <>
##$TPOAL= (0..7)
0.5 0.5 0.5 0.5 0.5 0.5 0.5 0.5 
##$TPOFFS= (0..7)
0 0 0 0 0 0 0 0 
##$TUNHIN= 0
##$TUNHOUT= 0
##$TUNXOUT= 0
##$USERA1= <user>
##$USERA2= <user>
##$USERA3= <user>
##$USERA4= <user>
##$USERA5= <user>
##$V9= 5
##$VALIST= <valist>
##$VCLIST= <CCCCCCCCCCCCCCC>
##$VD= 0
##$VDLIST= <DDDDDDDDDDDDDDD>
##$VPLIST= <PPPPPPPPPPPPPPP>
##$VTLIST= <TTTTTTTTTTTTTTT>
##$WBST= 1024
##$WBSW= 4
##$XGAIN= (0..3)
0 0 0 0 
##$XL= 0
##$YL= 0
##$YMAX_a= 357083
##$YMIN_a= -275885
##$ZGOPTNS= <>
##$ZL1= 120
##$ZL2= 120
##$ZL3= 120
##$ZL4= 120
##$ABSF1= 10
##$ABSF2= 0
##$ABSG= 5
##$ABSL= 3
##$ALPHA= 0
##$AQORDER= 0
##$ASSFAC= 0
##$ASSFACI= 0
##$ASSFACX= 0
##$ASSWID= 0
##$AUNMP= <proc_1d>
##$AZFE= 0.1
##$AZFW= 0.1
##$BCFW= 1
##$BC_mod= 2
##$BYTORDP= 1
##$COROFFS= 0
##$CY= 11.3945322036743
##$DATMOD= 1
##$DC= 2
##$DFILT= <>
##$DTYPP= 0
##$F1P= 15.9154993809931
##$F2P= -4.1035820241983
##$FCOR= 0.5
##$FTSIZE= 0
##$FT_mod= 4
##$GAMMA= 1
##$GB= 0.15
##$INTBC= 1
##$INTSCL= 1
##$ISEN= 128
##$LB= 0.24
##$LEV0= 0
##$LPBIN= 0
##$MAXI= 10000
##$MC2= 0
##$MEAN= 0
##$ME_mod= 0
##$MI= 1.114404
##$NCOEF= 0
##$NC_proc= 0
##$NLEV= 6
##$NOISF1= 3.799351
##$NOISF2= 2.8
##$NSP= 1
##$NTH_PI= 0
##$NZP= 0
##$OFFSET= 15.70392
##$PC= 1
##$PHC0= -11124.56
##$PHC1= 18.60099
##$PH_mod= 1
##$PKNL= yes
##$PPARMOD= 0
##$PSCAL= 0
##$PSIGN= 0
##$REVERSE= no
##$SF= 200.130013532006
##$SI= 16384
##$SIGF1= 3
##$SIGF2= 2
##$SINO= 400
##$SIOLD= 16384
##$SREGLST= <1H.CDCl3>
##$SSB= 0
##$STSI= 0
##$STSR= 0
##$SW_p= 3612.71676300578
##$SYMM= 0
##$S_DEV= 0
##$TDeff= 0
##$TDoff= 0
##$TI= <>
##$TILT= no
##$TM1= 0
##$TM2= 0
##$TOPLEV= 0
##$USERP1= <user>
##$USERP2= <user>
##$USERP3= <user>
##$USERP4= <user>
##$USERP5= <user>
##$WDW= 1
##$XDIM= 8192
##$YMAX_p= 0
##$YMIN_p= 0
$$ End of Bruker specific parameters
$$ ---------------------------------
##NTUPLES= NMR FID
##VAR_NAME=  TIME,          FID/REAL,        FID/IMAG
##SYMBOL=    X,             R,               I
##VAR_TYPE=  INDEPENDENT,   DEPENDENT,       DEPENDENT
##VAR_FORM=  AFFN,          ASDF,            ASDF
##VAR_DIM=   8192,          8192,            8192
##UNITS=     SECONDS,       ARBITRARY UNITS, ARBITRARY UNITS
##FACTOR=    0.0002944,     1,               1
##FIRST=     0,             0,               0
##LAST=      2.4114304,     0,               0
##MIN=       0,             -275885,         0
##MAX=       2.4114304,     357083,          0
$$ Real data points
##PAGE= N=1
##DATA TABLE= (X++(R..R)), XYDATA
$$ [...]
2327c32J18l16R26q8m13m64J26J87K06k51k82O97J33j43M8q60N17L3M86Pk86k6
2349B3j80M15K60M0o19O31n22N86l64K87o62J130j067J76N41q30M75k74K00P51
2369I97j028L24J45j35n17K02K41o64J059l53j19o09P49m45M93k46R6l87l65M63
2389i9m9m59K6J103j298J008k08r12M79j51L01j86k2N33q01L82k93O61o77OR3
2410e63M21o96L45k65J179n07K1l07j84Q73j41K79p27R5q1P00m73M53p80L83j7
2431Hn21O03j35M7k26N49Q3l83J81j41K26r4K58l24M2L16j66k5m69M00J87k69
2453A47K91o90M46Q5m4l95J83J37J24q31M55P52q93J049j121o23Q38L60o40J081
2473G11p42j89M94o20p07O87M61r86M55P38l43o25J130K8j377L49J13O65q62R9
$$ plain form
2327 -332 -214 -530 396 308 -105 -569 -443 -256 -50 -301 -583 114 247 104 152 -708 -191 -158 328 335 49 23
2349 23 -157 258 518 558 -61 570 48 634 270 557 -105 1025 -42 134 675 -155 320 46 246 997
2369 997 -31 293 438 303 -214 -12 229 -435 624 271 152 -457 292 -153 340 94 190 -197 -562 -99
2389 -99 -148 -607 -581 522 -776 232 24 -888 -409 -560 -259 -445 -467 66 -735 -353 -646 15 -662 -656 -563
2410 -563 -142 -838 -493 -758 421 -86 -65 -372 -556 317 176 455 -272 -177 -258 442 -31 422 -358 25 8
2431 8 -513 90 -45 2 -224 325 408 25 206 65 291 197 455 131 173 489 323 298 -171 229 416 147
2453 147 438 -252 194 279 235 -160 23 160 284 -547 -92 660 -233 816 -305 -928 -90 270 -370 711
2473 711 -31 -220 274 -346 -1053 -366 95 -891 -436 302 -41 -666 464 492 -885 -536 -423 242 -620 -521
2493e21L40K16P57j389L72K01J41j177J183R8L25o73J088j026m09N61m72k9J70
2512b44O19l62l32J127K07m77n52L3M68j027J198o79M69p48Q43o79K44P3j26j47
2532i2J79J33J0k34P88j192K70J50o7L14k75Q2l14J2K53J10n53K81j6K65m69K12
2554a53O0o74L14L59p5J0j18L18j33L8o6L24l67j97L08J65k41M00l9m98M12K87
2576D34o14L57L26m81j50J25O66k46K74m53j122J208j35l00N27j56o68J997k229
2595f40P20K95N0K90J060j071j228K62L30M19r25L98m53O11K03j16j44l38J09
2614a68K50J98o62M00o07K77K93J47j08m11k4J9n4L40k88M07q3j46l5J24k12L44
2636Am95J00K02p00P33J75o58M25n5O50m81J6K68l12K58m22Q2K62J21p2M20Jm24
$$ plain form
2493 -521 -181 35 792 -597 -225 -24 117 -1060 123 221 546 -127 961 -65 -474 87 -385 -414 -244
2512 -244 375 13 -319 808 1015 538 -14 19 487 -540 658 -21 448 -300 543 -136 108 181 55 -92
2532 -92 87 220 230 -4 784 -408 -138 12 -55 259 -16 66 -248 -236 17 127 -426 -145 -161 104 -365 -153
2554 -153 -93 -767 -453 -94 -169 -159 -277 41 -92 -54 -120 204 -163 -360 -52 113 -128 272 233 -265 147 434
2576 434 -180 177 503 22 -128 -3 663 417 691 238 -884 324 189 -111 416 260 -408 1589 -640
2595 -640 80 375 425 715 1775 704 -524 -262 68 487 -438 -40 -493 118 321 205 61 -277 -168
2614 -168 82 280 -382 18 -589 -312 -19 128 20 -391 -415 -396 -450 -110 -398 9 -74 -220 -255 -131 -343 1
2636 1 -494 -394 -192 -892 -159 16 -642 -217 -272 378 -103 -87 181 -131 127 -295 -213 49 170 98 518 519 95
2659I5Q8M83k75l26j69L93k84O4J62R7j41J35j60j14j1J32O9l2l62J19P6J93K45
2682D77l99K11K54r08K87K28l51J56M2P0J5l9K20m77J89r0q8K37j86m4J08K63
2704A75J31J42o17R7j19m79M89K04ql57K02J63q43J538j060J68O19j086Q43o44
2724d42N46k20k97Q21l18J21P2o21M92l0l67J92R0j16J30j61M42j13j18l15M72
2745B60K22l19m18Q21j34l25K71j97K43n13L40L56j40m44j49N45o58J29K12j42
2765d0K87k93J71j50L92n66K98m11MK25L8k00K17K73l73k13K89O5j46j11K06J54
2787A16l71j80K65n60Q26k70L55n8k70k60J16M56n9p4K69j16l71j47N03l95K96
2808G1J6m13M96j56k13P7k37L20j8M9Q6O6j43K36k71R8K10m54L70j11L12k18k86
$$ plain form
2659 95 183 666 391 65 -104 289 5 69 231 328 187 322 162 48 37 169 238 206 -156 -37 39 232 477
2682 477 78 289 543 -365 -78 150 -201 -45 -3 67 82 43 263 -214 -25 -115 -203 34 -152 -196 -88 175
2704 175 306 448 -169 -72 -191 -670 -181 23 15 -342 -140 23 -820 718 -342 -174 445 -641 202 -442
2724 -442 104 -116 -413 408 90 211 283 -338 154 124 -243 -51 39 -77 53 -108 334 221 103 -212 260
2745 260 482 163 -255 566 432 107 378 181 424 -89 251 607 467 23 -126 419 -239 -110 102 -40
2765 -40 247 -46 125 -25 367 -199 99 -312 -308 -83 -45 -245 -28 245 -128 -341 -52 13 -133 -244 -38 116
2787 116 -255 -435 -170 -730 96 -174 181 123 -147 -407 -291 165 106 32 301 185 -186 -333 170 -225 71
2808 71 87 -326 170 14 -199 -122 -359 -39 -57 -8 78 144 1 237 -34 64 274 -180 190 79 391 173 -113
2831a13N53n3j60r6N6j95m98O51M1m73l8M43n09J62Q7P5j83K13m63nM45j87N2
2854a95k57L03R2L55m50K1K00j70J24nK24j92l94L76r3L13l93J20l68K94k2j82
2876b99N88o41J61L4n77J041m61r3K13k21L16j22M02n14P7J60n84N45k40O00j39
2897B46l17L46k08l84Q23o6k14L37o95L75L26n19Q5J06n34M22K81r41L73L5L24
2918B01k31M08n14j96PK89l14L99l90M96n34M16M36j58q42M42j25k06K88kJ1N4
2940f5n1L34l55j22j71L03J99m18L78j77O86m50M54o35J19Q6l6O9k69n08L16N07
2962A94l9l38J74J16Q1M00o24k3j00K39j84L04O2k32L66k45p8j78j06M70l00N01
2984D60m70j59j21O85l85j42J40j06j89L94J87p22L00M8M23m22K64k21J49m29
$$ plain form
2831 -113 440 387 227 131 187 -8 -506 145 186 -287 -325 118 -391 -229 -142 -67 -250 -37 -500 -505 -60 -247 -195
2854 -195 -452 -149 -57 298 -152 -131 69 -101 23 18 242 50 -344 32 -61 252 -141 -21 -389 -95 -117 -299
2876 -299 289 -352 -191 -157 -734 307 -154 -247 -34 -255 61 -61 341 -173 -96 64 -520 25 -215 385 246
2897 246 -71 275 67 -317 506 440 226 563 -132 243 569 50 135 241 -293 129 410 -531 -158 -123 201
2918 201 -30 378 -136 -332 -325 -36 -350 49 -341 155 -379 37 473 315 -527 -85 -210 -416 -128 -130 -119 -65
2940 -65 -116 218 -137 -259 -430 -127 72 -346 32 -145 541 91 545 -90 29 115 79 148 -121 -629 -313 194
2962 194 155 -183 -9 107 188 588 -36 -59 -159 80 -104 200 262 30 396 151 73 -105 -211 259 -41 460
2984 460 -10 -169 -290 395 10 -132 8 -98 -287 107 294 -428 -128 -80 343 -79 185 -36 113 -316
3004c16k26O51o2j77j31k90M96j24N2J08m30Q91p47J44L21j60j73K29k71K23K90
3025B98l90J42pk13K05P3l9qk82K60n1J1J05m53N02l25J55K0O4k04J69P2j64Q7
3049B7o8k39K57LK1k00L79P4l31n4M68l63L33n73L16j04K84r8K8l28J3M01n73
3072c27n8N6N12o9l35K0Q1m82N43L07l19K7J27J09m18J37l3L81k98K71m86j12
3094c66R20j46q40O84k06oL02N1o0n74N85l65k77L95L3l36L64m59O99m28%l89
3116d19L83K05J16km07J9J2j5J08J51l5l72L86k71L77l89L34JJ6j06K78k85j92
3139a07Q38p31j91q7K35K26K75o48K90O6n75J24Q6l26R47n02J62k37R2K49m03
3160b17p7L18J88o13P13J00o74K08M48n9j99o11P94n76q02J150l2nn3j045J047
$$ plain form
3004 -316 -542 109 47 -130 -261 -551 -55 -179 -127 -19 -449 442 -305 -161 160 0 -173 56 -215 8 298
3025 298 -92 50 43 -170 35 108 69 61 -221 39 -12 -1 104 -349 153 -172 -17 3 67 -137 32 104 -60 27
3049 27 -41 -280 -23 -20 1 -199 180 254 -77 -131 337 -26 307 -266 50 -54 230 132 160 -168 -155 246 -327
3072 -327 -385 -329 183 114 -221 -201 -120 -602 -59 248 -71 -44 83 192 -226 -89 -122 259 -39 232 -254 -366
3094 -366 554 408 -432 252 46 40 342 393 333 -241 344 -21 -298 97 130 -206 158 -301 398 -30 -30 -419
3116 -419 -36 169 285 283 -124 -105 -93 -108 0 151 116 -256 130 -141 236 -153 181 182 198 92 370 85 -107
3139 -107 731 0 -191 -278 -43 183 458 -190 100 166 -409 -285 -199 -525 422 -80 82 -155 -63 186 -217
3160 -217 -294 24 212 -401 312 412 -262 -54 394 335 136 -475 319 -257 -1059 91 59 54 1 -1044 3
3181Cn55P61j35m29N15j87J57J78K04p05J43J24m0J19k80j40J64r8M20n10N25
3202B34o38M45J12l17N26n37l02K51K0K31M11k07K86l55P0l07L35o73L71M82o55
3223b17L41r6K9j82n7K82K07l57m99M59m0L24k90m5L51k43j86J66K96m45O10o46
3245b38j67M24j35l82O34J57o52J4O46J99k45n83O30O3r68L41K8L26k03J84J56
3266B29m1L17m16Q8K53j95l59P33m69j99N5j80n8M07N4k7K42m32j45N5J04M00
3288D16m65N62o43K99n00kJ238r27K72J18m90K3L2N13n02J61j91J61l61M22o8
3309F8j37K13j30J14p6l06O51m00O62r67M95k90j54O2M67m73L81q53M63O13l23
3330H0K09k77k07j92O61j67n3N71n18k9N05q78j22%P92k80O5n53O25k86N12m00
$$ plain form
3181 3 -552 209 74 -355 160 -27 130 308 512 -193 -50 74 34 153 -127 -267 -103 -201 219 -291 234
3202 234 -404 41 153 -164 362 -175 -477 -226 -206 25 436 229 515 160 230 -77 258 -415 -44 438 -217
3223 -217 124 28 57 -125 -182 100 307 -50 -549 -90 -130 194 -96 -141 210 -33 -219 -53 243 -202 408 -238
3245 -238 -405 19 -116 -498 136 293 -359 -345 301 500 255 -328 302 365 -603 -262 -234 92 -111 73 229
3266 229 188 505 89 177 430 235 -124 609 140 -59 -4 -184 -242 165 219 192 434 2 -143 -88 16 416
3288 416 -49 513 -130 169 -331 -333 905 -22 250 368 -122 -99 -67 446 -56 105 -86 75 -286 136 68
3309 68 -69 144 14 128 52 -254 397 -3 659 -308 187 -103 -257 -195 272 -201 180 -673 -210 403 80
3330 80 289 12 -195 -387 274 107 54 625 107 78 583 -295 -417 -417 375 95 160 -393 232 -54 458 58
3352E8o9M82n07m27M28L47o86L89J66l98j43j18M08J56j19L71j22N6K49j26p47
3373c52m59J258j302R54n4j96P88r52O78j80K19p84M44k63k89P46p1l03N96n21
3393d3j10l48R53q55N48lQk63k11N09k44P42n66M66m13M15l72l87O58m88L42k40
3415I8M4q9M77n10m45P26j89P8m29m92j82J192q97J98M27o7m54Q19j35K8O48o07
3437B39k94j88R06m19J33k17K43k38J48j027K34M47m4l8k44K6o0N38m00n0K18
3458h7j10P45k94l69q5O38m39O68r28J69l57J59N10r32J131l66k45L05l5n86L18
3479a90m3J17j50L49J17k73m88J4L03K11j88l5O25l61L65J96p89L01j90q4J07
3500h6J71J5j32k34M64L08m28j26K24j88j21N54l72J0j00K61m0j82J10o63O70
$$ plain form
3352 58 -11 471 -36 -463 -35 312 -374 15 181 -217 -360 -478 -70 86 -33 338 216 272 521 395 -352
3373 -352 -811 447 -855 99 45 -151 637 -315 363 183 402 -382 62 -201 -490 256 185 -118 478 -43
3393 -43 -153 -501 452 -403 145 142 150 -113 -324 185 -59 683 117 583 170 585 213 -174 484 -4 338 98
3415 98 142 53 530 20 -425 301 112 190 -239 -731 -913 279 -618 -420 7 -60 -514 305 170 198 846 239
3437 239 -55 -243 663 244 377 160 403 165 313 -714 -480 -33 -77 -115 -359 -333 -393 145 -255 -305 -87
3458 -87 -197 548 254 -115 -200 438 -1 667 -261 -92 -449 -290 220 -712 419 53 -192 113 78 -508 -190
3479 -190 -233 -116 -266 83 200 -73 -561 -547 -244 -33 -221 -256 369 8 373 569 -220 81 -109 -193 -86
3500 -86 85 100 -32 -266 198 506 78 -48 176 -12 -133 421 49 59 -41 220 180 -2 108 -555 115
3521A15j21k02n0N70k58P0l30M24k42n35O72j78q10J126j91p1l6N59p72J21J09
3542c0j26L00m02J52J57k61l1K28M61j92l07j51J10N99j52k02k13m45K03L23p5
3563e4p6J56j01m6k6K86j84J13k63j24o2M70k22J05p9K25j9L82l64M29n23o06
3585e83O06M1K73o1l27M17j41k02N8k11K90m19K89Q0J0l22o05O47P9j57N20j30
3607A52K36n55L38n9J18o71J85Pk19M19m36Q42j62m39M2J03J78p2N46l05l48L99
3629B99p8n06J26P37l75n83K07j34j7J74J71k01O52j64l43k01P21q12M06p15N69
3650f7L85j35J78n48P30K53q63n98Q11j007O3J314j33p40l53M84o00j72L86L7
3670e75%l11Q78L27r46L19N19M96j199M22q7L03j70m81O4N92p9j03J04n33N47
$$ plain form
3521 115 -6 -208 -258 312 54 124 -206 218 -24 -559 113 -65 -875 251 60 -11 -47 512 -260 -139 -30
3542 -30 -156 144 -258 -106 51 -210 -241 -13 448 256 -51 -202 -92 507 355 153 -60 -505 -302 21 -54
3563 -54 -130 26 -75 -121 -147 139 -45 68 -195 -319 -381 89 -133 -28 -107 118 99 481 117 546 23 -583
3585 -583 23 64 337 276 -51 366 225 23 81 -130 160 -259 30 110 120 -202 -807 -160 -81 -238 282 152
3607 152 388 -167 171 112 230 -441 -256 -249 -468 -49 -485 357 195 -244 -202 -99 79 7 553 248 -100 299
3629 299 221 -285 -159 578 203 -380 -173 -307 -324 -150 21 -180 472 308 -35 -236 485 -327 79 -636 -67
3650 -67 318 183 361 -187 543 796 -67 -665 146 -861 -798 516 383 -357 -710 -226 -826 -998 -612 -575
3670 -575 -575 -886 -8 319 -627 -308 211 707 -492 -70 -157 146 -24 -505 -441 151 72 -31 73 -460 87
3691H7J01q02K23J29N15qn79L78P9p4k4K55j57J22M9j10O3j87j2K63n76K41K27
3714B03k17N06l45J82m54J37l87P23k83j69K71j24L97k12k40j94j04K49M14O3
3734D16m53M13l01J5K09l57j57NK07K11k0o58K39O77l90J87L2m27L00m17M61n11
3756c19O09l85K64n49J06J00k20P62n77O7j64M29j13l6j78O1j04P2J54k40j54
3777d15K78M0j40L94m16O45L14p78l32P70n86R7K97Q8km47K86j34L9M0L5k43K26
3800E6n4n8J2K2m03N12K11j72q15Q57l45K96k96M74J8m48n5M50m33J65j65o28
3822g99J330o11N49l47K50o36k46R11l15j27j14K91k42lp8k57R14j55q43O62k10
3843g6k42N0M26m55M95k59N63o73k62M93N0j64QJ01l34J74J1N3M45n89J24N77
$$ plain form
3691 87 188 -614 -391 -262 253 245 -334 44 123 49 25 280 123 245 294 184 247 60 48 311 -265 -24 203
3714 203 -14 492 147 329 -125 12 -375 348 65 -104 167 43 440 228 -12 -206 -310 -61 353 416
3734 416 -37 376 75 90 299 -58 -215 -210 -3 208 188 -470 -231 446 56 243 275 -152 148 -269 192 -319
3756 -319 290 -95 169 -380 -274 -174 -394 368 -209 -142 -306 123 10 -26 -204 -143 -247 -175 -21 -261 -415
3777 -415 -137 -97 -237 157 -259 386 700 -78 -410 360 -226 -129 168 256 254 -193 93 -41 -2 38 73 -170 56
3800 56 2 -56 -44 -22 -425 87 298 126 -689 168 -177 119 -177 297 315 -133 -188 262 -171 -6 -171 -799
3822 -799 531 -80 469 122 372 -264 -510 401 86 -41 -155 136 -106 -109 -187 -444 470 315 -528 134 -76
3843 -76 -318 -268 158 -297 198 -61 502 -171 -433 60 110 -54 -46 55 -279 -105 -94 -41 404 -185 -61 516
3865E16m07M4K98K2k97l24J21J27L4j08K2M17k93k64J83L58p48J20P2L1N4N29
3887E07l69L19k4n01K91m94P9J38j94M24l19j4j89J26J76L26j76J4J28l92L53
3908B09l48O5k67P21l74l58K24M0k84L63J11L50l97l08K63m0K28p64N82L55q16
3929d45Q88o51K86m60K75JJ38%P7m48L97m34J78L42k28L00o11J86L02M66l86m05
3951b32rJ63j74J33P0k31K49j44l9K88L23p7J31l63K18m38J99l94J41K16M21m51
3973@m80J097r87L62K28q9n07p2K28l0R9J83J51k50k65M6L71j59K14Q0l26J87
3995H1J04k78J14K09O4r09K54L08K05l8k8M0n06n9K45N52l69q45J047l21q0N23
4017C13n17N74l01k75O45j15M22n19q89L15L12q66O71K05N53q77P07J84l65o51
$$ plain form
3865 516 109 153 451 473 176 -148 -27 100 134 26 48 465 172 -92 91 449 -299 -179 -107 -76 -22 507
3887 507 138 457 433 -68 223 -271 -192 -54 -248 176 -143 -157 -346 -220 -44 282 106 120 248 -144 209
3908 209 -139 -74 -341 380 6 -352 -128 -88 -372 -9 102 452 55 -253 10 -30 198 -566 16 371 -445
3929 -445 443 -208 78 -382 -107 -106 32 32 109 -339 58 -376 -198 144 -84 216 -395 -209 93 559 173 -232
3951 -232 -241 -78 -252 -119 -49 -280 -31 -175 -214 74 397 320 451 88 306 -132 67 -327 -186 30 451 0
3973 0 -480 617 -370 -8 220 131 -376 -448 -220 -250 -151 32 183 -67 -332 -286 85 -74 140 220 -106 81
3995 81 185 -93 21 230 294 -615 -361 -53 152 114 86 126 -380 -439 -194 358 -11 -856 191 -130 -210 313
4017 313 -204 370 69 -206 439 324 746 227 -662 -347 -35 -901 -230 -25 528 -349 358 542 177 -474
4037d74O08J23j58L58q09Q79r71K62k0K09k35M32j56j34qJ14J13l30l7J94n05
4058e45M89J39n4j33m59R32k87P2j11k41L82j09l55k01L66l5J33K68m62j7J2j69
4080c85M70r2K29k32q2J82L08p53K66J23j61K60j92J13j16K30k04K59J32m69o1
4101a75n4j41K75lK30J28l82J48o1j33r1K13J18k76J68M69m06j58J22l32M88R5
4123B42l94J07m09M09K35m33q5J66J27r4J40m07J12J66m6q7O03l29J05l44p8O04
4145C10k71o45L90k14K8N07Q3k17j04m0J75L82Q7k01k51r1j10L15m07L27LK99
4167C55n52N04m85L12n11P74m51N6m58M92N2K81j83j9j21k16R0n4o0J59J41R9
4189B05m66J6K32J38l59j53K52J51N28q51L50k2L37n20K01n6J26L02o93l4Q71
$$ plain form
4037 -474 134 257 99 457 -352 527 -444 -182 -202 7 -228 204 48 -86 -94 20 133 -197 -234 -40 -545
4058 -545 -56 83 29 -104 -563 369 82 154 43 -198 184 75 -280 -481 -115 -150 -17 251 -211 -228 -216 -385
4080 -385 85 -7 222 -10 -92 90 398 -355 -89 34 -127 133 -59 54 -62 168 -36 223 355 -114 -175
4101 -175 -229 -370 -95 -98 132 260 -122 26 -35 -168 -259 -46 72 -204 -36 433 27 -131 -9 -341 147 242
4123 242 -152 -45 -454 -45 190 -243 -328 -162 -35 -129 11 -396 -284 -118 -164 -251 352 23 128 -216 -294 310
4145 310 39 -606 -216 -430 -402 105 188 -29 -133 -173 2 384 471 270 19 -72 -182 133 -274 53 56 355
4167 355 -197 307 -178 134 -377 397 -54 2 -456 36 88 369 186 167 46 -170 -80 -134 -194 -35 106 205
4189 205 -261 -245 -13 125 -234 -387 -135 16 544 -307 43 21 358 -162 39 -17 109 411 -282 -316 555
4210E55r83l27O10J62k05J61Q81j020n25Q48J80k03M40j46l96j59oj04O45m56
4230d8M28m10j7M18l42J81j72j14k6P27o61k12lm07J036n92J12M15n0Q6m07J8
4252d0J3N3l2K44k06K41q6k89M59l12k37P2K6M86q0k83K32K80o04N72n42K32l99
4275b00o4P14o03M13j16K1j4m92L37K20l90O7k99j01J45L5P90o95M57o40N39j87
4297f3k26M00K53k39l92j89N31k53K63j47l33N61m60r5L23J89J73l58j62P35r33
4318d22M52M22o77K48m18Q24j37o69P58n30K26j75M54n25J92j56K68j17K01j07
4338A12K9j87n8R9j93J39k8k08M48j02j60O64p92N02k74O14r79R63n38r1k00K65
4360B5m14J94N2l25M19K26m76K24K26K64n21o6J8K52l41N0K88m07O56n21Q3R1
$$ plain form
4210 555 -428 -755 -145 17 -188 -27 854 -166 -691 157 337 134 574 428 32 -127 -133 -237 408 -48
4230 -48 380 -30 -47 371 29 210 38 -76 -102 625 -36 -248 -251 -658 378 -214 -102 313 263 349 -58 -40
4252 -40 -27 26 -6 238 32 273 187 -102 357 45 -192 -120 -94 392 312 29 261 541 -63 509 -33 199 -200
4275 -200 -264 450 -153 260 144 165 151 -341 -4 216 -174 -107 -406 -507 -362 -327 463 -232 225 -415 124 -63
4297 -63 -289 111 364 125 -267 -456 75 -178 85 -62 -395 166 -294 -389 -66 123 296 -62 -224 511 -422
4318 -422 30 452 -225 23 -395 429 292 -377 381 -149 77 -98 356 -169 23 -133 135 18 219 112
4338 112 141 -46 -104 -5 -198 -59 -87 -295 153 51 -109 555 -237 265 -9 605 -374 589 51 -40 -240 25
4360 25 -389 -195 -143 -468 -49 177 -299 -75 151 415 -106 -172 -154 98 -243 -193 95 -312 344 -177 -94 -3
4382cq0K18K1m19M33r6j09j09L44j31m27L60o9L97k05L52j32j59K5m04K69L51
4404D27q5k63N6M69j229M50K48j09n4M08k39m5o78N15J21k41R0M36q57M15m34
4425e99L30Mj82J51j9L61j82O2P87o74k22L47o51L11M15j15k94L94m23K21m12
4446c90N18j34j23m33J79J87J46J52q2R0k28J70K6k80L75m49L58L82j036N87o97
4467f82P24l06M65L20l94j18Q3k95j15M32j69j68L26K11n04n8m6M91l76J24K34
4488A79k71Q03o40J12j7j11j8R1k43L81l11L0L44k63N0l23L7O1QJ58p60R14p55
4511e44K02L83K05n91M07J37L0n6l30j79L36j56M18l0k15L9m12J82m93P34K3q0
4533A0K60j09o75P18n72O71j72l04J8l63J143q33M58l61l20J59J18N9L93k33J31
$$ plain form
4382 -3 -83 135 156 -263 170 74 -35 -144 200 69 -358 2 -67 330 125 477 345 186 211 -193 76 427
4404 427 342 79 135 604 -625 -175 73 -36 -90 318 79 34 -644 -129 -8 -249 -159 277 -580 -165 -599
4425 -599 -269 -265 -447 -296 -315 46 -136 -74 713 39 -183 164 -487 -176 239 124 -170 224 -199 22 -390
4446 -390 128 -6 -129 -562 -383 -196 -50 102 20 110 -118 52 78 -202 173 -276 82 464 -572 15 -682
4467 -682 42 -264 201 521 127 9 92 -203 -318 114 -55 -223 103 314 -190 -248 -294 197 -179 -55 179
4488 179 -92 711 71 183 166 55 37 128 -115 266 -45 -15 329 66 116 -207 -170 -109 -101 57 -703 211 -544
4511 -544 -342 41 246 -345 62 199 229 173 -157 -336 0 -156 262 232 17 56 -356 -174 -667 67 90 10
4533 10 270 161 -514 204 -368 303 131 -173 -155 -518 625 -208 250 -111 -431 -272 -154 -95 298 65 196
4554A96m67O01p9m58l1K00R8K60k63l1j56k14M96L1l66J31l81N97J2k25J78k8
4576A01J36j45k81J35J11n73O55n66K59L46j52L01j17L58m53P5k18m6l5j45j42
4597c96N66P2j05j85N34j024O78k53n39P43k39N17l63J58m00n1M62k94K10O5l25
4618a69k64J49K92K40k43J74k2j83m00R43m92l03J32J21k50K20L00k49J56k15
4638f3J24k95K07O94m32J39k6n95J07L22k59J21N65j029O34k99qJ78N0o35P57
4659B57j51n8J07j68q7N27m25m82M38k12J18p4Q1K21Oj78j26p7R6n4J93j62o8
4682b78L44k17K19P3O5j83K49l49Q8L26p05J55K12J98o00Q51k84k58P23m67r2
4703G0j21L51r15O54j26j5M11k38K10k78J74k28J45K81m81p9L06M5O51l99l31
$$ plain form
4554 196 -271 330 251 -207 -238 -38 60 320 57 26 -130 -344 152 183 -183 -52 -433 164 176 -49 129 101
4576 101 237 92 -189 -54 57 -516 139 -427 -168 178 26 327 210 568 115 190 -28 -74 -109 -254 -396
4597 -396 170 242 137 -48 486 -538 140 -113 -652 91 -148 369 6 164 -236 -287 175 -119 91 156 -169
4618 -169 -433 -284 8 248 5 179 157 -26 -426 517 25 -278 -146 -25 -275 -55 245 -4 152 -63
4638 -63 61 -234 -27 667 235 374 348 -247 -140 182 -77 44 609 -420 214 -85 -93 85 135 -500 257
4659 257 106 48 155 -13 -100 427 2 -480 -42 -254 -136 -210 -129 92 98 -80 -206 -283 -187 -241 -48 -210 -278
4682 -278 66 -151 68 141 206 23 272 -77 11 337 -368 -213 -1 197 -403 448 164 -94 629 162 70
4703 70 -51 300 -615 39 -87 -102 309 71 281 3 177 -51 94 375 -106 -185 121 166 817 418 87
4724H7l10L33K29n02N30K24j007L54k78L64k86j54J41Q3K49k08L50n19O62l89
4744d7m01N43p4j74l83N43J69l05O6k91j61K85J66M51q16K99pm26J95K94L67l74
4766h1k38L44O8k29L86J34n84K68k25N67r54K33J98N4M80l57J62J47l53L61r1
4787B90j54j08J41m34k14J97L40j94K25O40p77k62L97L58l26J41k25n6j32J92
4807C9j96o1N48k72n82N05O76n35l83k92L24j0k80P78m38kO99o54l42L86R2l27
4829c27P11J21L3n61K46l71Q33n99p91N58J83J66n91M91j74K91j63m86l17Q22
4849G5n2l4J55j71J49M04n12j30J33M48o94j00N05l4O3l2K52m43N02l26M37p05
4871a10J13K73m93L83L36l86j41M26n06k39L85l8k01L07j21O1k3O8m71K95O3j46
$$ plain form
4724 87 -223 110 339 -163 367 591 -416 -62 -340 24 -262 -416 -275 -192 57 -151 199 -320 342 -47
4744 -47 -448 95 21 -153 -536 7 176 -129 -63 -354 -515 -230 -64 387 -429 -130 -137 -563 -368 -74 293 -81
4766 -81 -319 25 93 -136 250 384 -200 68 -157 410 -544 -311 -113 -59 421 64 226 373 20 381 290
4787 290 136 28 169 -265 -479 -282 58 -136 89 729 -48 -310 87 445 119 260 35 -21 -153 39
4807 39 -157 -218 330 58 -524 -19 657 122 -261 -553 -229 -239 -519 259 -179 -181 518 -136 -478 -92 0 -327
4829 -327 384 505 538 -23 223 -148 685 86 -705 -147 36 202 -389 102 -72 219 56 -430 -747 75
4849 75 23 -11 144 -27 122 526 14 -116 17 465 -229 -329 176 142 205 173 425 -18 484 158 595 -110
4871 -110 3 276 -217 166 502 116 -25 401 -105 -344 41 3 -198 109 -12 49 26 94 -377 -82 -19 -165
4893a65k49M23o2m3l19K39j43N67k92j08k7M1j02r3KK78J69K11j98l09K18l46
4915c08L25j78j62j38J7N77j84m7L04K6j11m5j22m42N87M38o69m25P36m24P4K11
4937D0Q1l25K35r5m3J93p1j6K10kj73J88j55K44J62o54M65o11N56k57J44n7M31
4960D90n84l2M5J8O2K25k18k05j72K99J34l7K15m63K19L33n72L16J78m01j47q0
4982c77N59k68N3k45n2K40J44J9P7JrK2j58J08k61k31L66k63K17J65jr3j44K29
5006I8j76k36J30J6O02n12K97k90J37j77J63J08l25L39J55j79L85n75j59K02j80
5027a77J78Ml30N0J63L4l2M72k65P9j53K54o42J06M95q99Q53j32k88K13J18o77
5049e76j0K81J18l04L22L18l33L57l40k68L44M79l65O2k89O4K98o20J51K56M48
$$ plain form
4893 -165 -414 9 -53 -96 -415 -176 -319 248 -44 -152 -179 -138 -240 -333 -331 -53 116 327 129 -180 38 -308
4915 -308 17 -161 -323 -461 -444 133 -51 -98 206 232 121 76 -46 -488 99 537 -132 -557 179 -245 -171 40
4937 40 121 -204 31 -64 -107 86 15 -1 209 207 34 222 67 311 473 -181 284 -327 229 -28 116 59 490
4960 490 -94 -126 -81 -63 -1 224 6 -199 -371 -72 62 25 240 -223 -4 329 -243 73 251 -150 -297 -377
4982 -377 182 -86 -33 -278 -330 -90 54 73 150 151 142 164 6 114 -147 -378 -12 -275 -58 107 106 13 -131 98
5006 98 -78 -314 -184 -168 434 -78 219 -71 66 -111 52 160 -165 174 329 150 535 -40 -199 3 -177
5027 -177 1 5 -325 -275 -112 -78 -110 362 97 176 23 277 -365 -259 236 -663 190 58 -230 -17 101 -576
5049 -576 -586 -305 -187 -491 -169 149 -184 173 -167 -435 -91 388 23 85 -204 -140 158 -462 -311 -55 393
5070C93k42m45J04j26k8o7L40L61m40L37K83j079Q63K97L2k50l34j41j29N5N62
5091C46n74N29O7k44n28M12J22L38m80L55l54l12K25j58m42Q66j58m2m68N49j24
5112g5k47j01O92k17m4k19j03Q57m39L7N41q18km19N91J51n77K50n89O52o51N20
5134b10m3O64j73q25P70J55n71L41M8j431J476O86q77o3j65k53L00J054j093R30
5154G20n16p30Q42O7q18J352j183m6Q1O34KP3j102J180O3O54j596M5J22l86R61
5175D19m42k33M46M01j085J30Q51j18r09L12M66l93K09j75q47L29K70M45K56r86
5195f54M77J00K07L51q58K37J30k48l17P87k10K56k88R2p26N95K76P1q5o16L09
5216a14J02O93q86P34m96P3m9l3K89n67J76j98j74J066n34K50l2m75P29n69o92
$$ plain form
5070 393 151 -294 -190 -316 -344 -411 -71 290 -150 187 470 -609 254 551 583 333 -1 -142 -271 -216 346
5091 346 -228 301 368 124 -404 8 130 468 -12 343 -11 -323 -98 -256 -698 168 10 -32 -500 49 -75
5112 -75 -322 -423 269 52 8 -211 -314 543 104 141 682 -136 -138 -557 34 185 -392 -142 -731 -79 -730 -210
5134 -210 -253 411 238 -587 183 338 -233 108 156 -1275 201 887 10 -53 -218 -471 -171 883 -210 720
5154 720 204 -526 316 383 -435 917 -266 -312 -231 403 405 478 -624 556 619 1273 -323 -278 -156 -542 419
5175 419 -23 -256 190 591 -494 -364 487 369 -540 -228 238 -155 54 -121 -968 -639 -369 76 332 -654
5195 -654 -177 -77 130 481 -377 -140 -10 -258 -575 212 2 258 -30 62 -664 -69 207 278 193 -423 -114
5216 -114 -12 681 -205 529 33 106 57 24 313 -254 -78 -276 -450 616 82 332 300 -175 554 -15 -707
5237g07K11j2L99N95l0p04Q48p18j58o00J011j64m3P38r17J90j64l19r02K112
5257F66o40J91N53p27n2m93N44J93J67r24Q2L87M35p76J212j797J091o65K8j29
5277f54R40l22K31p69O95j52j034J231Q9m94J72K99j33J67o5n11k6N1n52P44k71
5298c64K08K47J51n46L22l36K88k36M70k82j45J74l11M75k27l0M11k17j03M1L98
5319C88m03K18r9p6m69J070n05R5k52r8L17J57j77o9l33N82m31m22O16k64N9m02
5341d98Q12l12M27k29o62J012r25K55J43m46o8K71M5k22K04J1N8n0L06m10J85
5362i3K92j24l87K76l6P2j35M73p74j14L26J18k83M00N4K89o98K97L8J36n68M14
5384b7j26L92L8n24Q58k68Q0m55n3J17J13m65J24L4J83kl51Q41m12L75n60K31
$$ plain form
5237 -707 -496 -508 -109 486 456 -248 600 -118 -276 -876 135 -29 -72 666 -251 -61 -225 -544 -1446 666
5257 666 26 217 770 43 -9 -502 42 235 402 -522 -440 -53 382 -394 818 -979 112 -553 -525 -654
5277 -654 286 -36 195 -574 121 -31 -1065 166 255 -239 -67 232 99 266 201 -310 -336 -285 -837 -93 -364
5298 -364 -156 91 242 -304 18 -318 -30 -266 204 -78 -223 -49 -360 115 -112 -142 269 52 -51 -10 388
5319 388 -15 203 104 28 -441 629 124 219 -33 -131 186 343 166 97 -236 346 -85 -507 109 -155 -96 -498
5341 -498 314 2 429 200 -462 550 -375 -120 23 -423 -491 -220 -175 -397 -193 -182 -124 -174 132 -278 -93
5362 -93 199 75 -312 -36 -72 0 -135 338 -436 -550 -224 -106 -389 11 65 354 -344 -47 -9 127 -441 -27
5384 -27 -153 239 277 -247 611 343 423 -32 -85 32 145 -320 -196 -162 21 19 -332 509 97 472 -88 143
5406A43k53Q0L11o10P60q78Q62n35o89N32K73M28l28nk38O02m21k34P55j096Q28
5427B87l98Q4QK5m76Q0j16oN15N4J41j59N32q94O40m28n03M33K20K73l52q3R34
5450H11p43J47k54j61N29n82K77L64p01O1K14k93J17l8MJ92j54n51O81k52J165
5471H33p48k78l78R33q8n90J002l08k21p19N51P26k22j34k60l66J24M70O6k33
5491A60k87l48J055l43k28o38R97K01k96n70l28J84o1N54M52p80O68o15M13p26
5511e36L48J171j363K37j68P23r85M20P8l75J026p14M11p18Q67l9r29N68K61R30
5531A213j224J20k86J57P3l74K71m3J56P2j099L15Q91K7n68k13J169r09k0Q98
5551F26m65o73J245L82p56m72K97J87p44K78O22J14q28J18Q06J17k4j35n57J38
$$ plain form
5406 143 -110 -30 281 -329 431 -447 415 -120 -809 -277 -4 424 96 91 -147 455 34 -200 555 -541 287
5427 287 -111 -27 -19 6 -470 -390 -506 -512 3 57 198 39 571 -323 317 -111 -614 -181 39 312 -40 -123 811
5450 811 68 215 -39 -200 329 -253 24 388 -313 -252 -38 -331 -214 -252 -248 -56 -210 -761 -80 -332 833
5471 833 85 -193 -571 362 274 -316 686 378 157 -562 -11 715 493 359 99 -267 -143 327 393 160
5491 160 -127 -475 580 237 9 -629 368 569 273 -297 -625 -441 -502 52 504 -276 392 -223 190 -536
5511 -536 -188 983 -380 -143 -311 412 -573 -153 -75 -450 576 -138 273 -445 422 383 -546 22 283 1213
5531 1213 -11 109 -177 -20 53 -321 -50 -93 63 135 -964 -649 242 269 -299 -512 657 -252 -272 626
5551 626 161 -512 733 1115 359 -113 184 371 -373 -95 527 641 -187 -69 737 854 830 695 138 276
5571B76j77j89M40l8j045K48J302j007Q48K40n56m59lj49L59M14l17L72r56Q42
5591D45r08N79N26n65l46l42O58K31m81L73l72K72L47o9J47k40j86J18n81J16
5611b78O2J99J13O08p56K4K21j5m24L01j07k62Q06k79k66n5K54j6k06m5M26j15
5633A90KK16l17k34L99j97p5j41M69n12M59J16m48P08k10j14n04J28J63K9m86
5654c59M81J30k08M3l4k01O4J26o37J024n39K87j4j74J50j6M0r6k61O6J32M31
5676D35o13l00O44j48k9L13o20j61OL34P4L05M2r8j0p33M61K84J34l64K88o72
5698d28N29l80N22l04k87L66J1K4J00q6J07J62k79K55k09J0l65K07J00M04n20
5719f1k6Q8j40P22j92j27k19N00l67K09k20l91M95m15l36J71L72Q1q6J76k03J67
$$ plain form
5571 276 99 -90 350 312 -733 -485 817 -190 658 898 342 -117 -120 -269 90 504 187 559 -397 445
5591 445 -463 116 642 77 -269 -611 47 278 -203 170 -202 70 417 348 495 255 69 187 -394 -278
5611 -278 -216 -17 96 704 -52 -28 193 178 -246 55 -52 -314 492 213 -53 -108 146 130 -76 -121 305 190
5633 190 192 408 91 -143 256 59 -16 -157 312 -200 259 375 -73 635 425 311 -193 -65 98 127 -359
5654 -359 122 252 44 87 53 -148 -84 42 -595 429 -110 177 163 -11 139 123 163 67 -194 -128 4 435
5676 435 -178 -478 166 18 -11 302 -318 -479 -473 -139 -65 240 282 184 174 -559 -98 186 320 -44 244 -428
5698 -428 101 -279 243 -61 -348 18 29 53 153 67 174 336 57 312 103 113 -252 -45 55 459 -61
5719 -61 -87 1 -139 583 391 264 45 545 178 387 167 -224 271 -144 -480 -309 63 144 58 234 31 198
5741A98k55k36M26m65K36m4k39R41j088K12j65O11l86l37l5O74J01m3k25k3J14
5762b8M4kK29k50K50k44m5j50J74K7N7P0K9K8j85j76M12l07l7j52P58n82l00P68
5786C88k37n21O72J52o44P3N4K92Q1l55R1q8k27M40m30N31P0p47N53M5k28j15
5808a50l87L41K98j00p8j92j62O46NJ73o13J35K72n62L03K31o00M14L19l15J8
5829dL5L08n89N10l67k3M0L67m96N09k1l46m4K04q7p3q5k89N80l2q9J09J85l51
5853d9n1J11kk47K50M91r27k0L29j27M19j98m05L82m52M98O0p7k83j78P54m84
5875b06N83k13q7n1L09r3k6K11j06Nk83J24o16J39n3M81k18K92k9l59P7M51l25
5898GJ24J17o5n24K95N68o20J03%j90qM67n33K29N25l81jl15M08L18m45o6k66
$$ plain form
5741 198 -57 -293 133 -332 -96 -140 -379 562 -526 -314 -479 132 -254 -591 -626 48 149 106 -119 -142 -28
5762 -28 16 14 243 -7 243 -1 -46 -196 -22 5 62 132 161 189 4 -172 240 -67 -104 -256 502 -80 -380 388
5786 388 151 -370 302 454 -190 -117 -63 229 310 -45 46 -42 -269 171 -259 272 342 -405 148 193 -35 -150
5808 -150 -537 -196 102 2 -76 -268 -430 216 221 394 -219 -84 188 -374 -71 160 -440 -26 293 -22 -4
5829 -4 31 339 -250 260 -107 -130 -90 277 -219 290 269 -77 -121 83 -4 -77 -162 -451 129 97 8 117 302 -49
5853 -49 -100 11 9 -238 12 503 -424 -444 -115 -242 177 -21 -426 -44 -496 2 62 -15 -298 -476 278 -206
5875 -206 377 164 77 26 335 242 216 427 321 326 43 167 -449 -310 -363 118 -100 192 163 -196 -119 332 7
5898 7 131 248 183 -341 -46 522 -98 5 5 -185 -193 274 -259 -30 495 114 113 -202 206 524 79 13 -253
5921b53L02k26J18P6j60L7k03J004n19q1J65l30P13q69j26L76k47M67k38m19P50
5942C37j20Q9n75k32N63j18J26l39j44O50j38o5j97N00n71K48l93M13k2J26m04
5963b66J28J53j25K56m90O01m0n2k56J52j39j22j53L22k83J31O21j24l07j00j78
5984b71j02N15j96M15j71m7k05k2L49k42J11l26L93L34l13n16o35J193KJ92k9
6005D29m77j99J75N6l88M92l24L78j83L02j1j10j86L07K56n03j2m0m68P77J69
6026D40n35j06L2Q4k5K77m08J52k96M31o28J000o19L3q4J70k87M48l73O6R2O3
6048g3n5L35n19K78L44o17M50j71J86N2l33j94N89q3l5o12O06m90P24l91j52M00
6070B39M0m38Pm40M31L09n59N56k3j74l1M00l26k61K0N83o62L64n8M71n12k41
$$ plain form
5921 -253 49 -177 -59 17 -143 -106 -309 695 176 95 260 -70 643 -226 -352 24 -223 244 6 -413 337
5942 337 217 306 -269 -501 62 -56 70 -269 -413 237 99 34 -163 337 -234 14 -379 34 12 138 -266
5963 -266 -138 15 -110 146 -344 257 217 165 -91 61 -78 -200 -353 -31 -314 -183 438 314 7 -93 -271
5984 -271 -373 142 -54 361 190 143 -62 -84 265 23 134 -192 201 535 222 -294 -929 264 266 458 429
6005 429 -48 -247 -72 -16 -404 88 -236 142 -41 261 250 140 -46 261 517 14 2 -38 -506 271 440
6026 440 -95 -201 -169 -85 -110 167 -241 -89 -385 46 -582 418 -201 -168 -252 -82 -369 79 -294 -228 -136 -73
6048 -73 -128 207 -312 -34 310 -307 143 -28 158 210 -123 -317 272 189 154 -458 148 -342 382 -9 -161 239
6070 239 279 -159 -152 -592 -161 148 -411 145 122 -52 -83 317 -9 -270 -250 333 -329 35 -23 448 -64 -305
6092c05P41j19l99J60rk45j05J33L19J19k20k56P9l2r4K40k21n9j58K30K76m45
6114c70R63p11K0q5K75q7o8n6q9L68m15L57l43K03o5q6J80P53j262M37q8O16o47
6137b00R0o6k21M15Q2L05m61k92P91m81k69k18n02N42L97j78L41K24N7j90o72
6158e06M46j38k21P50l76q3j0M21l62j69j15N96l09k55L97j1Pk38K26M9j4o53
6180e68N91N6j95K00n35Q1K56L11J54q81M10K74n25K07M37K5n85M72K06m48M6
6201a1J10k14j07J00J97J75k70Q5l51K65Q1k56L17k68j90M47N7N2m23m58O81k3
6223dJ5J06k13L49J60j66n71K60L98m62M05j48j36M9l36K06N09m57K2J8L83o43
6245b56M11j04O2l94q2M04R4N6n4m55M23l45M01p8K63o13M13J14l52j80J16q0
$$ plain form
6092 -305 436 317 -82 78 69 -176 -281 -148 171 290 70 -186 -107 -139 -233 7 -214 -273 -431 -201 75 -370
6114 -370 593 -118 -98 -183 92 5 -63 -119 -208 160 -255 102 -241 -38 -103 -189 -9 744 -518 -81 -169 447 -200
6137 -200 -110 -176 -397 18 100 405 -56 -348 443 -38 -307 -525 -1027 -485 -88 -266 75 299 356 166 -506
6158 -506 -60 -198 -419 331 -45 -128 -138 283 -79 -248 -363 233 -76 -331 66 55 62 -176 50 99 85 -568
6180 -568 23 79 -116 84 -451 -370 -114 197 351 -530 -120 154 -371 -164 273 298 -287 185 391 -57 -11
6201 -11 99 -115 -222 -122 75 250 -20 65 -286 -21 60 -196 121 -147 -337 110 167 219 -204 -662 19 -4
6223 -4 11 117 -96 253 413 247 -324 -64 334 -128 277 129 -7 42 -294 -88 421 -36 -14 4 387 -256
6245 -256 155 51 113 -281 -363 41 135 191 137 -318 105 -240 161 83 346 -267 146 260 -92 -272 -156 -236
6267b36K30l01K09J25m19L70L26j91k78K26j85K40o68O25J0m6J40j60J70j91P5
6288G1j48p5j81N77j45K07m0l87J26j74J31K46J22l51j9N50k95m36K36L43o27
6309b69N33J38m26O3j03K75J75k13K71o25o2K01K57j94j5M9M2j03k59L30j2M09
6331D62o04J73K38j65l72L21o20R62r1j92p0n31K82L16K67j21n1k68p9N8J53L13
6353C81j64P5o14K81J02k90K23L90q4o05Q7Q26n71J9K75j49k0o87L63M14m34K20
6375C8K51o96J47N20J07Q0m74n2J13PM62l37j96k3J93j09l72P92r12M99K49l68
6397h1L93M45k12o00L55n99J94L66k34L17Ol46k04K47k48Q8N6j5j6J70J80n04
6419b42l08M32K95l48M55m21J28j51P5J96R1m22L36p0n27P83j75K13l90%k50k11
$$ plain form
6267 -236 -6 -307 -98 27 -392 -22 304 113 -165 61 -124 116 -552 73 83 37 177 17 187 -4 71
6288 71 -77 -152 -333 244 99 306 266 -121 5 -169 -38 208 330 -21 -40 510 215 -221 15 358 -269
6309 -269 264 402 -24 39 -64 211 386 173 444 -181 -243 -42 215 21 6 55 97 -6 -265 65 53 462
6331 462 -142 31 269 104 -268 53 -567 395 304 112 42 -489 -207 109 376 255 204 -64 -143 -85 68 381
6353 381 217 292 -322 -41 61 -229 -6 384 300 -305 -218 608 37 56 331 182 162 -525 -162 252 -182 38
6375 38 289 -407 -260 260 367 447 -27 -79 34 41 503 166 -30 -53 140 31 -341 451 -461 38 287 -81
6397 -81 312 757 545 -55 300 -299 -105 261 27 344 350 4 -200 47 -201 -113 -57 -72 -88 82 262 -242
6419 -242 -550 -118 177 -171 284 -137 -9 -160 -85 111 202 -220 116 46 -481 302 127 340 -50 -50 -300 -511
6441e11L45J88j88J45R0l24K74j39k8L65K5n82R95q59J52k26K49k11J80M43m36
6462e3j28N65o62O88p6j95p0m1m05K90K52n56N46J6N0K79n16K95k31J84j49k43
6484a60K08k92M73l61J78J90k24o8L33l07M9j38M10n80L58l6j1k92J21l8L44k60
6506a03j46K34K04m93j35O40k2l43L56n55M92J27l30O4o05M89j43Q0L57K84r79
6527e27L09J23J84j06m84N22j92j12N07l15J12l54N94J94p44L87k6l75J9K29J79
6548A24l6j91L72l27K90j2k39K33l09K42k70n8P6L7N9m6j27M09l92K84o2M6l90
6571b87k52N10n30J041n65j06p5j27L50K18k34l81J51M6Q43o74K47p99Q60n2K11
6592C95j77j74k52M33m84K96k16J94M13n17o8L73k44L4j48J82l47K74J20k90M2
$$ plain form
6441 -511 -166 22 -166 -21 69 -255 19 -120 -148 217 242 -340 655 -204 -52 -278 -29 -240 -60 383 -53
6462 -53 -181 384 -278 410 334 139 69 28 -377 -87 165 -391 155 171 221 500 -16 279 48 232 83 -160
6484 -160 48 -244 229 -132 46 236 12 -56 277 -30 19 -119 291 -289 69 33 22 -270 -149 -187 157 -103
6506 -103 -249 -15 189 -304 -439 201 179 -164 192 -363 129 256 -74 -10 -615 -126 -269 -189 168 452 -527
6527 -527 -218 -95 89 -17 -501 21 -171 -283 224 -91 21 -333 261 455 -289 98 72 -303 -284 -55 124
6548 124 88 -103 269 -58 232 220 -19 214 -95 147 -123 -181 -105 -68 -9 -55 -182 227 -165 119 57 103 -287
6571 -287 -539 -29 -559 482 -83 -189 -264 -391 -41 177 -57 -438 -287 -241 602 -72 175 -624 236 184 395
6592 395 218 44 -208 225 -259 37 -179 15 428 -89 -157 216 -28 6 -142 40 -307 -33 87 -203 -161
6613a61m7J20l64P29p0k05M26k63k06L55j67m17L81n7n7J08r9L30m31J47Q0q3
6635D9k33J93j95K19M0k58J30q4J84j96K4K00l35J0J65M32j44l53k47K42K26p4
6657en5k83l84N47L54j90K09j57k26J69k48j09O00n21K00K16K26K89q50K95m23
6678c46J98J31j71K44r7N2J16Q4j10k60L07k27J06K93l72rJ96n34Q0O78l51K41
6700B49k90L78k42L10n66N43m55L59k30K52J28p66R3P02q28N41M7l49RJ16J54
6721A55o30K53L75j93l45m19N67J72m37m0R38K51n38K26n85J16Q45o21K57J44
6741D91k50N5p39P79p40O32L33n92nR1p0j31l81P64P6l50J85l06K25M90q42P17
6763D32j3k9m19m4K25j06k61M52n3k20P2j14K54m4j5k50J42j53K75k5m9r4o6J37
$$ plain form
6613 -161 -208 -88 -452 277 207 2 428 165 -41 314 147 -270 111 54 -3 105 6 336 -95 52 132 49
6635 49 -184 9 -186 33 73 -185 -55 -139 45 -151 -127 73 -262 -252 -87 345 201 -152 -399 -157 69 -5
6657 -5 -60 -343 -727 -180 174 -16 193 36 -190 -21 -269 -378 222 -299 -99 117 343 632 -218 77 -346
6678 -346 -148 -17 -188 56 -41 11 127 211 101 -159 148 -79 27 320 -52 -61 135 -399 -319 359 8 249
6700 249 -41 337 95 405 -161 382 -73 286 56 308 436 -330 -237 465 -363 178 225 -124 -115 1 155
6721 155 -475 -222 153 -40 -385 -804 -237 -65 -502 -542 396 647 109 335 -250 -134 711 90 347 491
6741 491 241 296 -443 336 -404 228 561 -31 -36 55 -15 -146 -527 237 313 -37 148 -158 67 557 -285 432
6763 432 419 390 -29 -73 152 46 -215 237 184 -36 36 -78 176 132 117 -133 9 -144 131 106 57 -37 -103 34
6787C4k01K14j28j84J94J83n17O38l83K64j73J50k07j33K44%l52m4J45L64p6J62
6809A94j95k08j20L82m23O99L12n18O6m4n16L48P4K65k17k18L90k30j11L57J9
6830C06l43L63J9ro19K37M4K7K3m4l16O37l67M6k93j11P07J03o15Q3J43K84K04
6853E09o06J03P6K9k8p5O36m30k17K02r2j85K45K10m90J1J63k14P8n25J72N2N40
6876A64l29K49j23K37q1j17n24K13J47N16l84k10K30L50l76n1J78j48J89k74l1
6897a75J49r6K9J80j22Q2k06J52m20J64K10j72J17R34n61n31M4PM45l79L0l67
6919d86J94K26M77r05Q31j11P4k19lo4K09l78N60m91J34J65k75M0L27p19M7J51
6941b16n23N01K34J05k92o8R16m67m8M3k51R4m36p8J27L80k54K31j06J17K21k86
$$ plain form
6787 34 -167 47 -81 -265 -71 112 -405 233 -150 114 -59 91 -116 -249 -5 -5 -357 -401 -256 108 32 194
6809 194 -1 -209 -329 53 -370 329 641 123 189 145 -371 -23 51 316 99 -119 271 41 -70 287 306
6830 306 -37 326 345 336 -283 -46 -2 25 48 4 -312 325 -42 4 -289 -400 307 410 -205 -122 21 305 509
6853 509 -97 6 82 111 83 8 644 214 -3 199 107 -78 167 377 -113 -102 61 -153 -75 -600 -428 -376 164
6876 164 -165 84 -39 198 117 0 -524 -311 -164 352 -32 -242 -12 338 -38 -89 89 -59 130 -144 -175
6897 -175 -26 -122 -93 87 -35 47 -159 -7 -427 -263 -53 -225 -108 826 265 -266 -222 -215 230 -149 -119 -486
6919 -486 -292 -66 411 -494 337 226 300 81 78 14 223 -155 405 -86 48 213 -62 -22 305 -414 -367 -216
6941 -216 -739 -238 -4 101 -191 -259 657 190 142 185 -66 28 -408 -486 -359 21 -233 -2 -108 9 230 -56
6963e6K18j80M82K9o14J40j33k84N09m9R0k15J70K55q46R10q65N65O6n9o80M69
6985g8M58o46J43j97K93N6J02k54K40o2j16M28k84k1m76K00Q38m48J64m55L20
7006B05k72L69l16M0R8l0k09JL41j1l49M74m99j37R7P9m02M75j39J78l43M43n4
7029C9m11N98m88L51K9l51L80K15n33Rj67J55M22k96J32k6j88m30J031q47k04
7050e80Q44k20j61P7J88l53M14k35k55q2P14o96N02n58k6L39J35J79j72j89k24
7071c59K07k69O16j93J09J21l22K51n43R56k13n13k94M06J55j9j69j18K41m64
7091d14J67J17J08J86j43P8k35k98Q0N43l48O68q21L47l15l93O31K25j21j78R
7112a07K63n45K84p1P1%n3j90K36R9l23R4N28l28k71nJ41j13J28Q2O50n65j1j03
$$ plain form
6963 -56 162 -18 464 493 -121 19 -114 -398 111 62 152 -63 107 362 -484 426 -439 126 192 133 -547 -78
6985 -78 380 -266 -123 -320 -27 29 131 -123 117 55 -61 367 83 62 -414 -214 624 176 340 -115 205
7006 205 -67 302 -14 26 124 94 -115 -114 227 216 -133 341 -158 -295 -198 -119 -521 -46 -185 -7 -350 93 39
7029 39 -372 226 -262 89 118 -233 147 362 -171 -162 -329 -174 248 -48 84 58 -130 -560 471 -376 -580
7050 -580 264 44 -117 -40 148 -205 209 -26 -281 -363 351 -345 157 -401 -427 -88 47 226 54 -135 -359
7071 -359 -152 -421 195 2 111 232 -90 161 -382 574 361 -152 -446 -40 115 96 -73 -191 50 -414
7091 -414 -247 -130 -22 164 21 99 -136 -434 -354 189 -159 509 -312 35 -280 -673 -42 183 62 -116 -107
7112 -107 156 -389 -105 -176 -105 -105 -158 -348 -112 -13 -336 -242 286 -42 -313 -318 -177 -290 -162 -80 570 5 -6 -109
7136a09l1Ok37M73j62j6M16l03k35L34p40Q24l46L50m18K19L1o6p99O53M42l27
7158d1J26K77k68k21K68N17o79J46l02l63O95j21r1k25l31O22K04n67O59J94o99
7179b00K13J17k41MK02l9M07o80M37k95J71k53J40J64K40k84j85j35L24Nk86J1
7201a63K64j79j77J03n5L11k63km7K33j88J33J23l9L59l42K78P8n23M87m05K6
7223A2j48l9M70n54L33O7l81N91l16l57O4k30K78L15j98j6j53R9OK09j11lLJ42
7247H3j50j35J27J02nj25l73L65J08O2m1o5N7j6L78j02l19l93M03M69k37n35J13
7270b29L14J30o25N34J16l75j09K21R0K45p5L80n40R9k45N1j60K71j50K82j04
7291A21q6N6P9p99O65J05O8n57O58l71RJ13j22j01J12L46k39j2n6q4l91M06l23
$$ plain form
7136 -109 -140 -134 -371 102 -60 -76 340 37 -198 136 -604 220 -126 224 -194 25 56 -10 -809 -156 286 -41
7158 -41 85 362 94 -127 141 658 -21 125 -177 -540 155 34 -57 -282 -613 9 213 -354 305 499 -200
7179 -200 13 130 -111 -107 95 56 463 -217 220 -75 96 -157 -17 147 387 103 -82 -217 107 112 -174 -163
7201 -163 101 -78 -255 -152 -207 104 -159 -161 -208 25 -163 -30 93 54 413 71 349 427 -96 391 -14 12
7223 12 -136 -175 295 -259 74 141 -240 351 35 -322 -258 -488 -210 105 -93 -109 -262 -163 -157 52 -59 -62 -59 83
7247 83 -67 -202 -75 27 22 -103 -476 -111 -3 59 18 -47 10 -6 372 270 -49 -442 -39 430 193 -342 -229
7270 -229 85 215 -410 124 240 -135 -244 -23 67 312 237 617 77 176 -69 -18 -178 93 -57 225 121
7291 121 35 91 170 -629 36 141 209 -348 310 -61 -52 61 -61 -162 -50 296 57 45 -11 -95 -486 -80 -403
7314d03j05O88k71N0r3L62n40L46l45J93M4k9K69l78K5K46K93k48k9K69r89O50
7336EMm38N55J1k95P5n1J38j67J41L59p35P74j62o81R17l05j84k17L75o54J69
7358c66K55l51N87k29p78R09k44J02k23K62jL71l50q1K24N7o8R6n15K90j90L65
7380A22k10j06J065r24K32n41M9P07n18M70o03J46J10J88j11MR2k72o81J285p08
7401b04l7J27K58r7l43J84j28o4J63N23m91k39J5L21jj17J1J17l20L47j19k66
7423c60O98m85L95R6k08m17M51O01j005J72K18NQ7m36j82J63N4p9o0P63l69K3
7445A25l10J68K84l21K39J29k70n5k10N10k60j45j51K61j68L37n7J80l73L5o2
7466a14K4j59K15k57N04k05k16J54rL58o08M98l51N97m59p3K36m1N6k85p6m1J80
$$ plain form
7314 -403 -508 180 -91 -41 -134 228 -312 34 -311 -118 -74 -103 166 -212 -187 59 352 104 75 344 -645 5
7336 5 9 -429 126 137 -158 -83 -134 4 -163 -22 337 -398 376 214 -467 450 145 -39 -256 119 -535 -366
7358 -366 -111 -462 125 -104 -882 27 -217 -115 -338 -76 -77 294 -56 -137 87 144 76 172 -343 -53 -243 122
7380 122 -88 -194 871 -53 179 -362 -313 394 -124 346 -257 -111 -1 187 76 80 172 -100 -781 504 -204
7401 -204 -241 -114 144 47 -296 -112 -240 -304 -141 382 -109 -348 -333 -12 -13 -130 -119 -2 -322 25 -94 -360
7423 -360 338 -147 248 344 136 -281 170 771 -234 -62 156 161 248 -188 -370 -207 -153 -232 -292 471 102 125
7445 125 -185 -17 267 -54 185 314 44 -11 -221 289 29 -116 -267 -6 -174 163 106 286 -87 -52 -114
7466 -114 -90 -249 -34 -291 213 8 -208 -54 -63 295 -313 185 -166 431 -28 -101 135 94 150 -135 -211 -252 -72
7489g2L64j23K85o43J38kjp8K17K23m48J42l64M44J12k31K69o1j00K14l2J05l70
7512a2L60p1l73p3J96M4n36L24M06o59M57l6k01J01O7j76L9K35J80o4q4k43l0
7535a49N18l82J66k29J03l24L84j30j5J12K00j33j4M30l5o0l13n54N63Q2o37M86
7557F9J27j60p2p1O7r3q0l7J05M3k69O60j41m20K75J43m8l51p2K09J80k95n7M06
7581A18j04n7K39j16k02N01k21j9n43N06p7l47O37n16L41K16K36p95M01k26m13
7602d41L73J58L8L86m07J58J06m20J23j76Q5J2l19L58j04N20p69L54j89k72L69
7623e7L61o90p9P38j51j02k6k1m58P32R0J2l67M35o12Q11l96l94L98n73l25Q53
7645A79l21O12o61k46N59J95p40O36R4n01O38l08l94M02l22M20N4l49L51J9o05
$$ plain form
7489 -72 292 169 454 -189 -51 -53 -54 -132 85 308 -140 2 -362 82 194 -37 232 171 71 285 253 358 -12
7512 -12 348 277 -96 -169 27 71 -465 -141 265 -394 63 27 -174 -73 -6 -182 -143 92 272 208 124 -119 -149
7535 -149 369 -13 153 -76 27 -297 87 -43 -58 54 254 121 107 537 502 442 129 -425 138 220 -417 69
7557 69 196 36 -36 -107 -40 -133 -213 -250 -145 -102 -371 289 148 -272 3 146 98 -253 -325 -116 64 -231 -288 118
7581 118 14 -43 196 80 -122 379 158 139 -404 102 25 -322 315 -201 140 356 592 -203 198 -28 -441
7602 -441 -68 90 128 514 107 265 371 -49 74 -102 -17 -5 -324 34 -70 450 -319 35 -154 -426 -57
7623 -57 304 -386 -465 273 122 20 -6 -27 -485 247 337 349 -18 417 -195 616 220 -174 224 -349 -674 179
7645 179 -142 470 -191 -437 122 317 -423 213 307 -194 444 136 -258 144 -178 242 296 -53 298 317 -288
7666b88J23Q63o52o24R41o43N5K64n4l04M21J73n58L79k27R1J58m41L50l0Q0k87
7688b10L92l2K37n80L17J80k69j60P20l53j04Ol59M75k1J16j77j6k33J02n1l82
7710d02J36N30k92O63n38m7Q0p30R26J89o56J70M73o65J78K33j69K97j94j79L35
7731C38l64J32P6R5l34m46M55m4J09J28J33l04r3L92K8J3n20j19K68L14k61J88
7753A84N02p48K48j72j6J13k30J72J66k67Pj48M90N3m54J95m32Q1l42N96l05L22
7775A5k5Q4O73n04j22j10m32M29l22M64J03o46O84q49N96k36J80K61r61N26qM56
7797B56L7n37l3J80N40j28j01J48j21l57K30K82l23k43k66N25k7k54P5K12j55
7818f0j75K42K71k86M52j11K85m05o56J72k77J097n00O7j70N8J82m39M42j77L16
$$ plain form
7666 -288 -165 698 46 -578 363 -280 -225 39 -15 -319 102 275 -283 96 -131 -40 118 -323 27 -3 77 -210
7688 -210 182 150 387 -193 124 304 35 -125 595 242 138 144 -215 260 239 355 178 162 -71 31 -20 -402
7710 -402 -266 264 -28 635 97 50 130 -600 326 515 -141 29 502 -163 15 248 79 376 182 3 338
7731 338 -26 106 182 277 -57 -503 -48 -92 17 145 278 -26 -119 273 301 314 -206 -325 -57 257 -4 184
7753 184 686 -62 186 14 -2 111 -119 53 219 -48 -41 -189 301 354 -100 95 -337 -256 -598 -2 -307 15
7775 15 -10 74 747 243 121 11 -421 8 -314 150 253 -393 291 -558 38 -198 -18 243 -718 -192 -200 256
7797 256 293 -244 -277 -97 443 315 214 362 241 -116 114 396 73 -170 -436 89 62 -192 -117 95 -60
7818 -60 -235 7 278 -8 444 333 618 213 -443 -271 -548 549 49 116 -54 4 186 -253 189 12 328
7839C28k82K12m28K64j17L30j47l42L74K51m68M49j96k70m23L32r3N2k49L23K45
7860A45l73lj84P45k41l13r8q9L78Kk55M4L88O4m14K23o5j7J80j86M61o13L95
7883A74n27K29k85k97O83j08l39Q75l09j24O6j77R3L06k22j92N59N0l12l10M23
7904B56l28k71K37N84m7k28l15J07j23K93J97p10N13n99M75k45K97n80M92J88
7924A93l89J51m7J39J07k00j27N1Q16q20L56j94n08L63K31k85M5L7l89Q67p85
7945c88K68J52j49J39k38J85J11n0M15m44J47J93l14k49N34q05L90N03q29Q79
7965D50m20l49K08k77J54K78k8j03k02K93k44J94J0j79L01O5k39J23k26m06P36
7986A39n01L91l4l32N91j47k60K16k14K57J06n9k59M13p14K36K42J53j68J91n02
$$ plain form
7839 328 46 258 -170 94 -23 307 160 -182 192 443 -25 424 228 -42 -465 -133 -226 -174 -423 -100 145
7860 145 -228 -231 -415 330 89 -224 -322 -411 -33 -31 -286 -242 146 210 -204 19 -46 -63 117 -69 392 -221 174
7883 174 -353 -124 -409 -706 -23 -131 -470 405 96 -28 38 -139 -46 260 38 -154 405 455 143 -167 256
7904 256 -72 -343 -106 478 431 203 -112 -5 -128 165 362 -348 165 -434 41 -204 93 -487 5 193
7924 193 -196 -45 -92 47 154 -46 -173 -122 694 -126 230 36 -472 -109 122 -163 -118 -81 -470 397 -388
7945 -388 -120 32 -117 22 -216 -31 80 30 445 1 148 341 27 -222 312 -493 -103 400 -429 450
7965 450 30 -319 -111 -388 -234 44 16 -87 -289 4 -240 -46 -36 -215 86 151 -88 35 -191 -597 139
7986 139 -362 29 -5 -337 254 107 -153 63 -151 106 212 153 -106 307 -407 -171 71 224 56 247 -255
8007b55K64J4j86J84J30n44J19O1M41n03L57P9k94m45M29K63j82m47J02N73k15
8028e5L59l02m13N83J32k56m7K65n47K14K6K11n04N42j39K1k15J68J21o2J67m16
8050a47m18M68J88J26P0m34j52N23k51J03K03o9l0k54J79l4q5R4M17k16m05K92
8072A68k27J70j89j11N99m35L8M03j16p09M26m9L91j02K4p62O74J04o57O03k90
8093d7O38q12J00K91p25Q18k39j90K5j50N63j30L5j93k17j77L26P24l33k90j35
8114a18L31n68K10N34j62k46j4R5J18o28O25l70L97o45Q38k15J0m01J75K86o2
8135A90O9m89q4j96O60o1Q0r4M82n30K94l39L3j98LJ60j21J44P7k27r6K51K05
8158B13m01K14o57N14K23K11p07L08j50K30K29j19j77O16q7l04n17L08j51J63
$$ plain form
8007 -255 9 23 -163 21 151 -393 -274 -213 228 -275 82 161 -133 -578 -149 114 -68 -515 -413 160 -55
8028 -55 304 2 -411 172 304 48 1 266 -281 -67 -41 170 -334 208 69 90 -125 43 164 102 269 -147
8050 -147 -565 -97 91 217 287 -147 -299 224 -27 76 279 210 180 -74 105 71 -14 80 497 281 -124 168
8072 168 -59 111 -78 -189 410 -25 13 416 300 -409 17 -32 359 257 281 -481 193 297 -360 243 -47
8093 -47 591 -221 -121 170 -555 263 24 -166 -141 -291 272 142 177 -16 -233 -410 -84 640 307 17 -118
8114 -118 213 -355 -145 389 227 -19 -33 62 180 -448 177 -193 204 -441 397 182 192 -209 -34 252 190
8135 190 259 -230 -314 -510 150 89 169 75 557 27 321 -18 15 -183 -180 -20 -141 3 80 -147 -243 8 213
8158 213 -188 26 -631 -117 106 317 -390 -82 -232 -2 227 108 -69 547 460 156 -361 -53 -204 -41
8178d1qNL15m92L01j60J81l88K24j28L30k68L6
$$ plain form
8178 -41 -49 -44 271 -221 80 -80 101 -287 -63 -191 139 -129 -93
8191i3
$$ Imaginary data points
##PAGE= N=2
##DATA TABLE= (X++(I..I)), XYDATA
0@%%%%%%%%%%%%%%l2O4o4O4o4R6j28J28j60J92k24K83l15L52m16M80n49O42p34
33c85Q31r45J061j196J344j503J677j869K085k319K572k848L148l478L835m228
49b218M661n134N654o230O871p582Q377r273J0294j1468J2829j4433J6366j8739
63a0025K1728k5641L1004l8882N1742p7648K33609m11051Q5491M32569l95546
74a02650J74770L5774j65910Q1149P0788m9822q8577j5591J35783r7045K9035
85G704N6232j46177M4030R6548j00024L540J0726P144L0172l7591o56J0269n1847
98f9930P2250L0153j00226J3877N5871k2705J6703j1164l0925K2099K0122J1281
110G406l7872l4892Q2725J2801o8175K3913o49k6116N0009M071m5385J0258L7396
$$ plain form
0 0 0 0 0 0 0 0 0 0 0 0 0 0 0 0 -32 32 -32 32 -32 64 -64 64 -96 96 -128 155 -160 192 -224 256 -293 349 -385
33 -385 446 -499 562 -634 710 -793 884 -985 1100 -1219 1353 -1495 1653 -1825 2010 -2218
49 -2218 2443 -2691 2963 -3267 3604 -3978 4399 -4874 5420 -6048 6781 -7652 8714 -10025
63 -10025 11703 -13938 17066 -21816 29926 -47722 185887 -225164 -139673 292896 -102650
74 -102650 72120 107894 -58016 23133 93921 44099 -44478 -60069 75714 -21331 7704
85 7704 63936 -82241 -38211 58337 -41687 -38147 -27421 -20277 9895 -27696 -28352 -18083 -69930
98 -69930 2320 32473 -67753 -53876 1995 -20710 -4007 -15171 -46096 -23997 -3875 7406
110 7406 -30466 -65358 17367 30168 -38007 -14094 -14743 -40859 9150 13221 -32164 -21906 15490
123A5490l312l2481R733J2660k1722M4822K0132p7022K4210N8186m8303k141K4925
136B5177k0668J4081J2091o927j7824k1490M7216P148m9391K5304k815j8394L4519
149B8027j8222k6739J4950J1205R069k6485j0615K3417j5114J0549J2336l7627
161b5249M032L0293n592k2773o288K4735l37j4056J7504j7916j6810L9998o86
174F855l4676J6041R685j2373J2844J089k2727O487K3213l291k0012L398J2803
187f64n216J110J0134j7199l157K7824k349k1231N425J0730Q33J550J804j2203
201b609p21K5279n180j9930J0447P513n506O074k759j0725L881J2573M34j6164
215B607q53J3387o800j989Q627j4007m459K1945m004k0482M464J3049o338l564
$$ plain form
123 15490 12178 -20303 -10570 2090 -19632 25190 45322 -31700 -7490 50696 2393 252 25177
136 25177 4509 18590 30681 23754 5930 -15560 31656 38804 -10587 14717 11902 -6492 28027
149 28027 9805 -16934 -1984 9221 18290 -8195 -18810 4607 -10507 42 12378 -25249
161 -25249 -21217 9076 3484 -19289 -25577 -842 -1179 -15235 2269 -15647 -32457 7541 6855
174 6855 -27821 -11780 -2095 -14468 -1624 -535 -23262 -16775 6438 3147 -16865 -13467 -664
187 -664 -5880 -4770 5364 -11835 -14992 12832 10483 -10748 -5323 5407 6240 7790 9594 -2609
201 -2609 -3330 21949 16769 -3161 7286 14799 9293 15367 12608 1883 5764 18337 18771 2607
215 2607 1754 15141 8341 6352 14979 972 -3487 18458 14454 -6028 -1564 11485 5147 1583
229A583P720j2164m996J8876j464j9158K401J0803j769m214m34m589j877J2340
243C058Nj9219M498J3743r737n12K485p603j45J0137P25j0538j960J2474n25o130
259i244Q93j539K728O818k275o379P67O766N099p792J506K206l344R066K036j3070
275e758L031J0273j070k353j74k123K156O665r54q559Q35J0407k498m865M445
290I458l551j903R860k776j1507L041R869k693p239K030L56k388O604k823j0540
305d202N099O989n684j697p13j793K089k93J912n312m833J0115j961r303M340
320e247Q26k966M440j056m802n93M866Q93o865J494M258l477L281J555o334J035
336h692N158l56k246j218L878M09p12L342l621j605Q192j078m077K859P71K34
$$ plain form
229 1583 9303 -2861 -7857 11019 9555 -9603 -7202 3601 1832 -2382 -2816 -7405 -9282 3058
243 3058 3063 -16156 -11658 2085 -7652 -8164 -5679 -13282 -13427 -3290 -2565 -13103 -15063 -2589 -3114 -9244
259 -9244 -8351 -9890 -7162 -344 -2619 -8998 -8231 -1465 3634 -4158 -2652 -446 -3790 5276 7312 -5758
275 -5758 -2727 7546 6476 4123 3949 1826 3982 10647 9693 1134 1969 12376 9878 5013 9458
290 9458 5907 4004 13864 11088 -419 2622 12491 9798 2559 4589 4945 2557 9161 6338 -4202
305 -4202 897 7886 2202 505 -208 -2001 88 -205 1707 -3605 -8438 1677 -284 -9587 -5247
320 -5247 -4421 -7387 -2947 -4003 -8805 -9398 -4532 -3639 -10504 -9010 -4752 -8229 -4948 -3393 -9727 -8692
336 -8692 -3534 -3890 -6136 -7354 -3476 -3067 -3779 -437 -4058 -5663 2529 1451 -2626 233 1004 1238
352A238L287j481l138K014L549k83j949Q04P00q05L514q5n095K750L485k891K82
369E896l02l90J228k71l87j686j555M409j262m241K419p52k079K376j352k552
385e01j090K743K187p009K80M212m800M26K488n019m47L061M75k743j730K731
401d736n4j226K581l130j773N202o27k448M7N04J772j15m43Q3j000L201J464l819
419d517K27L343l78J164N91k188J253K151Q12o48j219J515K310p87M02k08m74
436C349K322K38j297R29r05J158Q88j209j204j48K244J837n064J35K661j846R02
453D990L60l928M16K807p94l301j021K506m29j893Q75k148j404L694m66m980J766
470b950J459q73q25o12K21j019Q79J702l497r69L500j125r41P57q09K53K10J871
$$ plain form
352 1238 4525 3044 -94 1920 5469 5186 3237 4041 4741 3936 7450 7365 2270 5020 8505 5614 5896
369 5896 5594 5204 6432 6161 5774 4088 2533 6942 5680 1439 3858 3106 1027 3403 2051 -501
385 -501 -1591 1152 3339 -3670 -3390 822 -3978 -3552 -1064 -6083 -6530 -3469 -2994 -5737 -7467 -4736
401 -4736 -4790 -6016 -3435 -6565 -8338 -3136 -3763 -6211 -6164 -5660 -3888 -4003 -4446 -4363 -5363 -2162 -698 -4517
419 -4517 -4290 -947 -1325 -161 430 -1758 -505 1646 2458 1810 591 2106 4416 3629 4031 3823 3349
436 3349 5671 5909 4612 5541 4636 5794 6682 5473 4269 4121 6365 8202 3138 3273 5934 4088 4990
453 4990 5350 1422 1838 4645 3851 550 -471 2035 1606 -287 588 -1560 -2964 730 264 -4716 -2950
470 -2950 -1491 -2364 -3189 -3801 -3580 -4599 -3720 -2018 -5515 -6484 -2984 -4109 -5050 -4293 -5102 -4849 -4639 -2768
488b768p03l034L293K366m080J442J482j350K345Q25j294p47J861K067r70j531
504g96K972j425R08K310k692J64L282j670P10j47r04J359N56K05r41j050K147
521D988L20j980J169j049l39K507j852j717R80O5M79j389m09K47j651J634k2l113
539a132L25J366j106n41o34K13l66q88J397j821k090K955K00k478M69Q54j785
556e062J056J468k152q13J698K199k928k45K495j785M8K924k105q19L099N15j515
573a922j32J421k07J63J736j067o60K296J49q98Q22J4O26N79m15O54k00K41Q93
592D093j65j041N54Q39J84l15o29p5M37K22n17r24K78J40k3j23j275o12J381m42
612A987j994K42J35o57o11Q42r76j217J876j10k680Q17P14j641M30P65j577n64
$$ plain form
488 -2768 -3471 -6505 -3212 -846 -4926 -3484 -2002 -3352 -1007 -182 -1476 -2223 -362 1705 735 -796
504 -796 2176 751 1659 3969 1277 1441 4723 3053 3763 3616 2712 4071 4627 4832 3891 2841 4988
521 4988 5308 3328 4497 3448 3109 5616 3764 2047 3027 3092 3571 2182 1773 2020 369 2003 1981 -1132
539 -1132 -807 559 -547 -1088 -1722 -1509 -1875 -2763 -1366 -3187 -5277 -2322 -2122 -4600 -4131 -3277 -5062
556 -5062 -4006 -2538 -4690 -5503 -3805 -1606 -4534 -4779 -2284 -4069 -4021 -1097 -3202 -4021 -922 -407 -1922
573 -1922 -2054 -633 -840 -677 1059 -8 -668 1628 1777 879 1701 1715 2341 2920 2505 3159 2959 3200 4093
592 4093 3928 2887 3441 4280 4464 4149 3520 3445 3882 4104 3587 2663 2941 3081 3058 2935 1660 1048 2429 1987
612 1987 -7 235 370 -287 -898 -56 -1032 -2249 -373 -483 -3163 -2346 -1632 -3273 -2843 -2078 -3655 -4219
630d219J269K61j580k23J768q33l94Q53q68K18J590j00o34o69J297P27n14n6R63
649a144m04N55J465j093j11J201N88r30K3J637j21o6J185j058j7R75O25o96N27
668C141L8n7P22l36p65K71O71m89k95O77j006k46R69o35p42L57M05j225K49l91
688A313j330L58O11j002l60K76j26o75n93M94j005R3O32j282n76M58P09j22j302
707c429N5J575k462Q68J225j465L57R67K4j043O72J90j37L93R97q70l89J643K82
726e47j142P67J327r46M54M68M81l06L61M20J44m41J932o97p5O02r86J012m48
745B380N70L53q88N84J88q72P14J4l87L54j361M60r7J12K64q3j169K34l62O67
765A675l62l42n24k22n59l2K16p80j93J72o47J57m52L94k68q93R01j607N56P60
$$ plain form
630 -4219 -2950 -2689 -4269 -4492 -2724 -3557 -3951 -3098 -3966 -3748 -2158 -2258 -2892 -3561 -2264 -1537 -2051 -2107 -1144
649 -1144 -1548 -993 472 -621 -732 469 1057 127 150 1787 1666 1600 2785 1727 1710 2685 3310 2614 3141
668 3141 3179 3122 3844 3508 2743 3014 3685 3196 2901 3578 2572 2326 3295 2660 1918 2275 2680 1455 1704 1313
688 1313 -17 341 952 -50 -410 -134 -260 -935 -1528 -1034 -2039 -1946 -1314 -2596 -3172 -2714 -2005 -2127 -3429
707 -3429 -3374 -1799 -4261 -3393 -2168 -3633 -3276 -2309 -2285 -3328 -2656 -2466 -2603 -2210 -1213 -2083 -2472 -829 -547
726 -547 -1689 -922 405 -541 -87 381 862 556 917 1337 1481 1040 2972 2275 2200 2802 1816 2828 2380
745 2380 2950 3303 2415 2999 3187 2315 3029 3043 2656 3010 1649 2109 2012 2124 2388 2305 1136 1370 1008 1675
765 1675 1313 971 447 225 -334 -366 -150 -930 -1123 -951 -1598 -1441 -1893 -1499 -1767 -2660 -1759 -3366 -2810 -2050
785b050o61o62O33J49n07Q01k15l66RJ101l0l71n4J283q39J95Q40p1q4O30Q09
806E40n87q4J236m8n22N45O15q92Q07J169o77M45m02r4J83k78R83m50k20Q41r34
827B176K2N20l50Q0o23J91K51q09J61L32j072K54P8o82K33l14k51p0m55k75K70
848c33n78J26m37L14p80m4J34m93m52O67L12q64r5O42r87R59K61j455O18M80K48
869a757o82o91J210J51m92J759q03K21L00M55Q9l90P10L90n72k63J450K4j31M42
889A420j93k88J15R99l32k08Q26l45q3J80L74j043N31N39r4k65k23Q87j158K96
909A935K0p99N08r5o57J31j37J93l61m69K26p51J83m08J70m01j51R4n34k68k15
930a786j41N54m57m6L7p70P72m10L38K82m47L25j5r75N84N56J27m76R72J05p90
$$ plain form
785 -2050 -2711 -3373 -2740 -2591 -3098 -2297 -2512 -2878 -2869 -1768 -1798 -2169 -2223 -940 -1779 -1584 -744 -815 -899 -269 540
806 540 -47 -131 1105 1057 535 1080 1695 803 1610 2779 2102 2547 2145 2051 2234 1956 2939 2489 2269 3110 2176
827 2176 2198 2718 2368 2448 1825 2016 2267 1458 1619 1951 879 1133 1211 529 762 448 197 127 -328 -603 -333
848 -333 -911 -785 -1222 -908 -1688 -1732 -1598 -2091 -2543 -1876 -1564 -2428 -2523 -1881 -2868 -1909 -1648 -3103 -2485 -2005 -1757
869 -1757 -2439 -3130 -1920 -1769 -2261 -502 -1305 -1084 -784 -329 -240 -630 80 470 -102 -365 1085 1109 978 1420
889 1420 1227 939 1054 2053 1721 1513 2339 1994 1911 2091 2465 1422 1953 2492 2398 2133 1910 2797 1639 1935
909 1935 1955 1156 1664 1569 912 1043 906 1099 738 269 495 -256 -73 -481 -311 -712 -863 -769 -1303 -1571 -1786
930 -1786 -1927 -1373 -1830 -1876 -1839 -2609 -1837 -2247 -1909 -1627 -2074 -1749 -1764 -2739 -2155 -1599 -1472 -1948 -976 -871 -1661
951a661P24K72n68L06R05m65r2J279l9m33j95J354q51l62J210L7j76K24M13n34
971A348j08J070l80p7M19q7j04k06L98n42K1K44P9k11J80M22j270j2j82lk97J33
993H35m50l2k22q8l01m63J12j86J24j02o67O8Q3J0k40N98o14k88J67M04p90J55
1015a887N60l16n10O36j56q57J340l63J20l26J123p60j33Q06N73n56J91R92j217
1034g40L27P39J47l69K44N37j07p7O14n79J07N47M40l90O09l91K34n19L97K89
1054B059p21P35J68n60l18m5N5m67O66k35l41m11L66L22r84O49n59q28N92k25
1074h2j050R12l55l57k07j02K56J47m74k26j44P2j98K34N76j166M49J21J97l70
1094a767j5P72p14L04J40K02m82N87l4k01K04L97k67j64Q34N77l02n81R13L91
$$ plain form
951 -1661 -937 -665 -1233 -927 -22 -487 -579 700 661 228 33 1387 536 174 1384 1421 1245 1469 1882 1348
971 1348 1240 2310 1930 1853 2272 2185 2081 1875 2273 1731 1752 1996 2075 1864 2044 2466 1196 1184 1002 999 702 835
993 835 385 353 131 43 -258 -721 -609 -795 -671 -773 -1440 -1372 -1289 -1279 -1519 -921 -1535 -1823 -1656 -1252 -2042 -1887
1015 -1887 -1327 -1643 -2153 -1517 -1673 -2530 -1190 -1553 -1433 -1759 -636 -1396 -1529 -723 -150 -706 -515 477 -740
1034 -740 -413 326 473 104 348 885 778 701 1315 736 843 1390 1830 1440 2049 1658 1892 1373 1770 2059
1054 2059 1338 2073 2241 1681 1363 1318 1373 906 1572 1337 996 585 951 1273 289 938 379 -449 143 -82
1074 -82 -1132 -220 -575 -932 -1139 -1241 -985 -838 -1312 -1538 -1682 -1610 -1808 -1574 -998 -2164 -1715 -1594 -1397 -1767
1094 -1767 -1782 -1010 -1724 -1420 -1280 -1078 -1560 -973 -1007 -1208 -1004 -607 -874 -1038 -204 373 71 -510 403 794
1114G94m04O91L35r80J87M98M23r70R85r8k52L81K19k20m14Q38l08m45M01j08
1134A553l37J91N6m73K57K31k68l04M8m39l45L84m56L56l85m65M47o74J40m86
1154i69M3K27j91J50m68O8L35n92k3J03m58R9ML51j64R7k35J97N57k32j09M14
1176g96J0n74O62K45k31L5Q50n73p3M25KK67J21K02q6J42Q51p00m1R6N13pJ28
1199A468J07l3k53N48o43m5M77k84J64mj98N50j049L38J4k22m67L78K00j66n13
1220C67K58j54m06Q1l41k93O69m88k16R4N74m28q12K04j83K70r4n09M00l9j96
1241a242K23m2l79r9L32M18o37K94j48o5O57j22n7j82P93K54q40P74k92N0L32
1262B2N2K8J54M48k70l30K85P27J18n56L43J52m17M62K96o53K87P83o33m42L21
$$ plain form
1114 794 390 1081 1416 436 623 1121 1544 574 1559 1461 1209 1590 1809 1589 1175 2013 1705 1260 1661 1553
1134 1553 1216 1407 1463 990 1247 1478 1210 906 954 515 170 554 98 454 69 -396 51 -623 -483 -969
1154 -969 -926 -699 -890 -740 -1208 -1140 -805 -1397 -1420 -1317 -1775 -1676 -1672 -1321 -1485 -1388 -1623 -1426 -869 -1101 -1210 -796
1176 -796 -786 -1360 -698 -453 -684 -649 201 -372 -445 -20 -18 249 370 572 486 628 1479 779 738 834 1347 1340 1468
1199 1468 1575 1542 1289 1837 1194 1149 1626 1342 1506 1502 1304 1854 805 1143 1157 935 468 846 1046 880 367
1220 367 625 471 65 146 -195 -488 181 -307 -523 -429 145 -283 -1095 -891 -1074 -804 -898 -1407 -1007 -1046 -1242
1241 -1242 -1019 -1061 -1440 -1539 -1207 -789 -1426 -1132 -1280 -1345 -688 -810 -867 -1049 -256 -2 -842 -68 -360 -310 22
1262 22 74 102 256 704 434 104 389 1116 1234 678 1021 1173 756 1218 1514 861 1148 1931 1298 856 1177
1283A177M33m01l20K1L08o9kk35n85R9M24j23k70k18k42N63o45Nk83n14J25L58
1305c94k78j26J48j07q6k09J64L3K6m89J61k36M45l57j82L95J0K46l10j88M70
1326h64p18O47m1K82J86p2J16k56N29l60R71p74L89P38m38k53J29L5O27k93N65
1347A145o52M37L68p38M92J19k84k9L55K2q15J036L24m70j242R03O6R10r58J56
1367A145l78m72L76l39n19L20K12J2k28l20R22j485O4J62K42j53K46n72k7q70
1387a662J461q51q3O02m81J28m79P19k91J57p05J132j177J271l70m70o96J184
1405f11j29Q9j87K76N33p9P2k77J09J53M71j95j83Q82p11M24j76q9Q63L66l7o44
1427I20j9j70J63O08l98L56k88R3k10K84n26P06r24N01l19K13j23K44l29L26j11
$$ plain form
1283 1177 1610 1209 889 910 1218 1149 1147 912 327 426 850 727 457 239 -3 560 -85 -80 -363 -877 -752 -394
1305 -394 -672 -798 -650 -757 -843 -1052 -888 -855 -829 -1318 -1157 -1393 -948 -1305 -1487 -1092 -1082 -836 -1146 -1334 -864
1326 -864 -1582 -935 -976 -694 -508 -580 -464 -720 -191 -551 420 -354 35 773 335 82 211 246 873 580 1145
1347 1145 493 930 1298 560 1052 1171 887 858 1213 1235 420 1456 1780 1310 68 971 1037 1947 989 1145
1367 1145 767 295 671 332 -187 133 345 357 129 -191 731 -754 -690 -528 -286 -439 -193 -765 -792 -1662
1387 -1662 -201 -1052 -1135 -533 -1014 -886 -1365 -646 -937 -780 -1485 -353 -1530 -259 -629 -1099 -1795 -611
1405 -611 -740 -651 -838 -562 -29 -108 -36 -313 -204 -51 420 225 42 924 213 637 461 372 1235 1601 1564 920
1427 920 901 731 894 1502 1104 1460 1172 1265 1055 1339 813 1519 595 1096 777 990 867 1111 782 1108 997
1448I97k45p25N70k11m87L80o10NK72K5o03k81N70l30l2k0L5J8k68Q8M05l53O7
1471g33r48J005m79l84J119p65O50n53P01k49J94m44M53k85O65m7q66O14Q61n58
1491d9N53J7l6m2l33N37RO1K95p37L66N8N27n76Q0j61P85j65p73Q76m74k44N74
1514A148K09l32p71K19M48no94M59o52L4q1J43j98l50L66p06Q85n15L20o93N73
1535a93p33K86o0L44o50J34O7l26J70K28n2m6j2j22k49M42J36j3j70l60N88j34
1557g25J45j46L85J42L09m7l80P65l34L94o09N25l13K52J22l96M35j8k59J99L59
1578H05J2Q9o1l1m23K94j33L33K35K11l14k51j05m41L08M38Jk37l03J93l57J78
1600D41m26l82J16K85nj28j52N0M36q06K66J79l94q4K61j83l00J87k26J21J48
$$ plain form
1448 997 752 27 597 386 -101 279 -331 -326 -54 -29 -632 -913 -343 -673 -705 -725 -690 -672 -940 -852 -447 -800 -733
1471 -733 -1681 -676 -1155 -1539 -420 -1185 -535 -1088 -387 -636 -442 -886 -433 -718 -53 -100 -966 -352 509 -49
1491 -49 504 521 485 443 110 647 656 717 1012 275 641 699 1226 650 730 569 1354 1189 416 1292 818 574 1148
1514 1148 1357 1025 254 473 921 916 222 681 29 63 -18 125 -73 -423 -57 -763 122 -393 -73 -766 -193
1535 -193 -926 -640 -700 -356 -1006 -872 -805 -1131 -961 -733 -785 -831 -843 -965 -1214 -772 -636 -649 -819 -1179 -591 -725
1557 -725 -580 -726 -341 -199 110 63 -317 448 114 508 -101 424 111 363 485 89 524 506 247 446 805
1578 805 817 906 845 814 391 685 552 885 1120 1331 1017 766 661 220 528 966 967 730 427 620 263 441
1600 441 15 -367 -251 34 29 -99 -251 -201 235 -571 -305 -126 -520 -604 -343 -526 -826 -639 -865 -744 -596
1621e96J46n69N15k28j47n9l6N06k2L14k29j54M9J03R4k4J52j72M01l90M54L3
1643A41j6j18l04N14L1J62j97J67L61j57j89L3J82n36R43P8m0l47J84l82J15M0
1665F65J71j20Q4J77o22K31J23n1j6l17Kn40L06K24k00J63M5r71J90K88k8k46
1687d42J83J83n23K18r8l3K30j72Q0l53l6l8M5j86J11K66l72J30J83L70n75N44
1709b85j56o8L38L84o33O54n61L46L32k97M5lK4O4k59L64k29M02n71O71l53L48
1731E57j10J41J2Mq30R75L07l7j50k01Q5j16J95n09L04j81M08m85j04O64l42o52
1753f5O83n26J37q6N62o26n82L43J76m9m56J77K09l93q6J64J65j33j07n05mN32
1775d70m53M33l03M06L36j82k30m72O27r1k96K3l67P98Q3N58p44N50l37k28O83
$$ plain form
1621 -596 -450 -1019 -504 -732 -879 -938 -974 -468 -490 -176 -405 -559 -510 -407 -313 -337 -185 -357 44 -346 108 141
1643 141 125 7 -297 217 248 410 213 380 741 584 395 428 610 74 1017 1095 1055 708 892 510 625 665
1665 665 836 716 800 977 355 586 709 658 642 325 327 -213 93 317 117 280 325 -646 -456 -168 -196 -442
1687 -442 -259 -76 -599 -381 -479 -512 -282 -454 -374 -727 -763 -801 -756 -942 -831 -565 -937 -807 -624 -254 -829 -285
1709 -285 -441 -509 -171 213 -420 234 -327 19 351 54 99 96 120 184 -75 289 60 462 -109 562 209 557
1731 557 447 588 600 604 -226 749 1056 1019 869 668 753 637 832 323 627 446 854 369 265 929 587 -65
1753 -65 618 92 229 143 705 79 -503 -160 16 -33 -489 -312 -103 -496 -582 -418 -253 -386 -493 -998 -1002 -470
1775 -470 -923 -490 -793 -387 -51 -233 -463 -935 -308 -399 -695 -672 -1039 -241 -158 400 -344 206 -131 -359 324
1796C24m93M59l4r3Q1m0M57m32M52k79L83j96n50R12l57j53N47k52r7j20K67l92
1818C94J15K72P9j94p10K85J78Q1l01k1M14o4p01K58j12P69q45l6o9J35k37K80
1840c0k01l40j59K49o5M4j82M00n50J13j55K83m56K50K35l1N6j92M46r7j32N02
1862a2j31J48k33j56O1l86L43K72j51K60k2J05l58J75O91k87Q0j19L79j95M8R6
1884F08m65j0K36K41R7m45L34j68kP4N39l60n80K07L68o64L61k90J47m1M09p14
1906a18J24J5Q4N16j45l86k37K31q9k38J18m32Q11p62J77k73L02k5n5M23k40k72
1928d71K9J78m21L94k40K47K8l65j32J51J5N0M94p61O55M6k42K28j61M58J80o23
1950b63M73k59N2M18k52j7Q39l98k12n5k77P80k47j33PL13p60N11o6O7k37K7k9
$$ plain form
1796 324 -169 290 256 163 244 204 661 229 681 402 785 589 39 951 594 441 988 736 639 519 786 394
1818 394 509 781 860 666 -44 241 419 500 199 178 592 528 -173 85 -27 742 -103 -139 -208 -73 -310 -30
1840 -30 -231 -571 -730 -481 -546 -502 -684 -284 -834 -721 -876 -593 -1049 -799 -564 -595 -539 -731 -285 -382 -514 -12
1862 -12 -143 5 -228 -384 -323 -709 -366 -94 -245 15 -7 98 -260 -85 606 319 399 280 659 464 512 608
1884 608 143 133 369 610 707 262 596 428 426 500 1039 679 99 306 674 10 371 81 228 187 596 -118
1906 -118 6 21 105 621 476 90 -147 84 -5 -243 -125 -557 254 -508 -331 -604 -302 -327 -382 41 -199 -471
1928 -471 -442 -264 -685 -291 -531 -284 -256 -621 -753 -602 -587 -537 -43 -804 -149 -103 -345 -117 -278 180 360 -263
1950 -263 210 -49 3 421 169 152 991 593 381 326 49 829 582 449 456 769 9 520 454 521 284 311 282
1973B82J89k3L59n27j76L55l68J48kL21j36k69N82m37J40k81p01j8K17m01J187
1994D41r52K83l9J18m22N16l88L30l86L57m65M58j40m51O38n8j12k7l75M25J68
2015h1m69K56L17p34P36K17p99R8O63K2k39J8N6L87j84p0Q8q5q0M80k44K51l08
2038B96J87J06R6o06M42k41J20m07N65p3l56J96K21k96l2l77l34J066o78j53L86
2059A28j74N38n08N40q28O03L4p95M56n20J38L24j87J16l01J45j32n71P29n89
2079h54O60n30J42N62l12P7lm84J59L93j72m47R1O23L70p95N19K27l42M30J16
2100D30o38L65L64m07k26j10N83K58M17n47n69K53K83j38L80k31K82m06j47J37
2120C33l42N36k67P8j31J34l5l86O23l30j91K44L6J22l93J12J45m46K0o24P36
$$ plain form
1973 282 471 448 807 280 104 459 91 239 237 558 422 153 735 298 438 157 -544 -562 -345 -746 441
1994 441 -511 -228 -267 -149 -571 -55 -443 -113 -499 -142 -607 -149 -289 -740 -102 -160 -272 -299 -674 -249 -81
2015 -81 -550 -294 23 -711 25 242 -557 -459 204 226 -13 5 61 448 264 194 282 197 117 597 353 604 296
2038 296 483 589 685 79 521 280 400 -7 558 485 129 325 546 250 218 -159 -493 573 -105 -258 128
2059 128 -46 492 -16 524 -304 299 333 -462 -6 -526 -388 -64 -251 -135 -436 -291 -423 -994 -265 -854
2079 -854 -194 -724 -582 -20 -332 -255 -258 -742 -583 -190 -362 -809 -718 -95 275 -520 -1 226 -116 314 430
2100 430 -208 157 521 114 -112 -222 361 619 1036 489 -80 173 456 318 698 467 749 343 196 333
2120 333 -9 527 260 338 207 341 306 -80 543 213 22 266 302 424 31 143 288 -158 -138 -762 -26
2141b6j43p4J45K1N1j02J12k77j61N19l72KL03l02k93L36m77M90J12n82Q09m50
2163c59N6k01K94J30q9l2j32Q2L26j06J21k58N35m64O07l18J05K01j67K71J09
2184G11n32m77R82l1n35r1K56K74l23m6M27n23N43n81j14L03j97J87k25p0J56
2205I4o6L66k13J01m57J97K90J14m68L37p3n32L78m13O92q12k44N35j39l2K96
2226d9l94L32j15o2m36N44N6K86n63l8K28m94K52k06N41m52P67m02jJ32l88M16
2248d6n68K62J40K58R5p36O19J81j74Ml43N32l51J42M07l89O73r8p9n02M93j79
2270C41k44N80q3l38J76j88l05N78l55m34M23o9m5k75P84m97M78n59K65J38o7
2291C04o4n03N32n17J66J3m8j32L28n6l3k4k55N9j03P4k43K27K07j53o2O41q81
$$ plain form
2141 -26 -169 -243 -98 -77 -26 -128 -16 -293 -454 65 -307 -305 -2 -304 -597 -261 -738 -248 -136 -718 91 -359
2163 -359 -303 -504 -210 -80 -169 -201 -333 -251 75 -31 90 -168 367 -97 510 192 297 498 331 602 711
2184 711 179 -298 684 653 118 27 283 557 234 188 615 92 635 54 -60 243 46 233 8 -62 94
2205 94 28 394 181 282 -175 22 312 426 -42 295 222 -310 68 -345 347 -465 -709 -174 -313 -345 -49
2226 -49 -443 -111 -226 -288 -724 -180 -124 162 -401 -439 -211 -705 -453 -659 -118 -570 197 -205 -206 -74 -462 -46
2248 -46 -614 -352 -212 46 141 -595 24 205 31 35 -308 224 -127 15 422 33 706 608 529 27 520 341
2270 341 97 677 594 256 432 244 -61 517 162 -272 151 82 37 -238 546 49 527 -32 233 371 304
2291 304 240 -263 269 -248 -82 -69 -117 -249 79 23 -10 -34 -289 -230 -333 -259 -502 -275 -68 -221 -283 358 -523
2314e23M20J53k63L78q49P9M65j83o05O49L66r4k03O17k29L09j20J4J52j84j50
2335A99J67o53Q30J94p81J28M52M33m06l58ln93P76K66l07m44j23M1L53N71j43
2356E99o72M9K47K58k61p83N31o7J38K83r0j612Q95O47j93J07p95M84M55p02R8
2377c84O64l26L17j054M03l96O13n09o5P1L08J8J64O94j227M94k19J12o31R92
2397C9p74K43L56JL01n49l56R91K03P4o71M68m90J82j28J76j02K51K65n63M14
2418C31j22K60o55M64j93M8L27m25O45k82j06m24P26k40l78O31l33l94M6J46l26
2439b54K94j17Q6K46p11L9K22l03K52K52M9K01n13q0J59j89j14L77l18J96J03
2460a23l52P8L72p3o2o9j00M6p70M58K9r1O76k57m11L15N26M79k245J817Ol04
$$ plain form
2314 -523 -103 50 -213 165 -684 -605 -140 -323 -928 -279 87 -7 -210 407 178 487 367 381 533 349 199
2335 199 366 -287 543 737 -44 84 536 969 563 205 202 -391 385 651 344 -100 -223 -182 171 742 599
2356 599 -73 -24 223 481 220 -563 -32 -99 39 322 232 -1380 -485 162 -31 76 -719 -235 220 -482 -384
2377 -384 280 -46 271 -783 -380 -776 -163 -672 -737 -666 -358 -340 -176 518 -709 -215 -434 -322 -953 39
2397 39 -735 -492 -136 -135 166 -383 -739 252 455 529 -142 326 -164 18 -110 66 -36 215 480 -83 331
2418 331 209 469 -186 278 85 133 460 35 680 398 292 -132 594 354 -24 607 274 -120 -74 72 -254
2439 -254 40 -77 9 255 -456 -417 -195 -498 -246 6 55 256 -257 -337 -178 -367 -481 -104 -422 -226 -123
2460 -123 -475 -397 -25 -98 -160 -229 -329 -283 -1053 -595 -566 -657 19 -238 -649 -334 192 671 -1574 243 249 -55
2482e5Q9j33M44o70L97P73n14j72n66K24o47O88k36N51K54k56M75m35l91O31K21
2503F72p09j06l05Q02r90P27k26N84j25l08M45r44K25o47J463n09k47r2N06l18
2523a02k67O82j33q23L63K0M27l89R1J97k79n19M68Q5K2N12l43l52K61J73n19
2544d25N02m22O80j48l9K73m00K50n94Q05k51j89j85K85K30o58j05N23L65k06
2564B91J6k34N49j3m23K45k65J85j61j19N86o24J68j67N03q14k33J060J01n69
2584H2L43o60q8N28qm60O1K07M45j037J213k8j83J28q5j011l0l41M85O99l15M43
2606C88n76M4K7k31J03l51P29k57q0j25n7J98j42O04o3n50o7l03P65n32N19l34
2628b91Q3J6J44k17K23M89m83M59n42O19m82K75k32l9J80l17J96l54M19Q1l6o0
$$ plain form
2482 -55 34 -99 345 -325 72 845 331 159 -407 -183 -830 -142 -378 173 427 171 646 211 -180 451 672
2503 672 -37 -143 -448 354 -636 91 -135 449 324 16 461 -483 -258 -905 558 49 -198 -290 216 -102
2523 -102 -369 313 180 -643 -280 -260 167 -222 -131 66 -213 -732 -264 -179 -157 355 12 -340 -79 94 -425
2544 -425 77 -345 335 187 148 421 21 271 -323 482 231 42 -143 142 372 -286 -391 132 497 291
2564 291 307 73 622 609 186 431 166 351 190 71 657 33 201 34 537 -277 -510 550 651 82
2584 82 425 -235 -323 205 197 -263 -202 5 450 -587 626 598 415 543 458 -553 -583 -924 -439 260 -55 388
2606 388 -188 -144 -117 -348 -245 -596 133 -124 -204 -329 -386 -188 -330 274 211 -339 -406 -709 56 -476 43 -291
2628 -291 -208 -192 -48 -265 -42 447 -36 423 -119 500 18 293 61 22 202 -115 81 -273 146 227 191 131
2650A31M9m8K24m17L78n6p5j77M38K1n1j30k69K34j48M49q89K04K55J41q69L33
2672b72o9l1L06m4o49L40Mj35O71j55l5J61m98N40oj28M93r16K46Q9j05m11O63
2695E9n25J10L62N5l87L89k89M71l17j53M04n36K99p13P68J04J42m53N44m88J40
2716a4L43k52l80P42l09Q21o81K9l0l11pj12O92p34P41p66N9P06l86m8r5K56P
2739B71J91n01L95m55p6J82K88j2o85J252r05n7rk77J18M87p4m77k2KQ7J46k04
2762c35K70J29j052O24j21M56k0J47k13J17l70j34O10l89P8k79N13o52N58p3K22
2783H6j62Q4j77K51m1M38l24K59k51k37m4P11k37j43l47lM30J10J61n43M7N0k44
2806a26N7M88n45l13M05p9J048q49o4L49j49l5K02j71l97J92j91K92j62K86o23
$$ plain form
2650 131 180 132 356 -61 317 261 186 9 447 468 417 287 18 252 104 553 -336 -132 123 264 -605 -272
2672 -272 -341 -372 -66 -110 -759 -419 -415 -550 121 -34 -69 92 -406 134 128 0 493 -423 -177 -88 -193 -604 59
2695 59 -466 -356 6 61 -326 63 -226 245 -72 -225 179 -357 -58 -771 -3 101 243 -210 334 -154 -14
2716 -14 329 77 -303 439 130 951 270 299 269 -42 -49 -161 531 -203 538 -228 -169 537 151 103 8 264 271
2739 271 462 -39 356 -99 -175 7 295 283 -402 850 -55 -112 -121 -398 -280 207 133 -344 -366 -364 -277 -131 -335
2762 -335 -65 64 -988 -364 -485 -29 -49 98 -115 2 -368 -502 108 -281 -203 -482 31 -621 -63 -136 86
2783 86 -76 8 -169 82 41 479 155 414 163 -74 -118 593 356 213 -134 -137 293 403 564 21 68 118 -126
2806 -126 -69 419 -126 -439 -34 -113 935 86 22 371 222 187 389 218 -179 13 -178 114 -48 238 -385
2827c85M54P1L2n26Q8j42K64j50N27j74J22o0P5K46o45R3j3J80j24l92L04K19
2849F4K08J52n80N30n91J67j81k56N49M0k84N09k66l70L80j07l44M99m3mk78M82
2871B76j75j43L00l20M43M4r75Q62p9j27J40l91K80N8j23L94k35j0j05O6p9N1
2893A52j51J99J09J41R8o93l3K8K7l96M55q2k2n0L50r6m03L39k85L17l62l57Q90
2916A75P2o43O21m32K91j2j58j40oJ68p2K23j52J92n48K07K60q11P15j63L59P0
2938B16j30j03K96k57o6j6M87n00J54JK42m94L98k50J55k51q1N74l26l5J41M8
2960B03M3K6m22M86n70L90k3J49j86j12j24J31l39K38r6M91m84j32R5o1O14j54
2982A63l2p5P3k16K61N28r78N13j08k23L32o33O3M64j96J08P5k30N9l43L9L06
$$ plain form
2827 -385 69 140 172 -354 -266 -408 -144 -294 233 59 181 121 196 442 -203 -110 -123 57 -67 -459 -155 64
2849 64 272 424 -156 374 -217 -50 -231 -487 62 102 -182 327 61 -309 71 -36 -380 119 76 72 -206 276
2871 276 101 -42 258 -62 381 425 -550 312 233 106 246 -145 135 193 70 464 229 219 114 180 101 152
2893 152 1 200 309 450 548 -145 -178 -150 -123 -519 -64 -146 -168 -218 132 36 -367 -28 -313 4 -358 -715 175
2916 175 247 -396 225 -207 84 72 -86 -226 -232 -64 -136 87 -65 127 -421 -214 46 -765 -50 -213 146 216
2938 216 86 -17 279 22 -44 -60 427 -73 81 82 324 -170 228 -22 133 -118 -199 375 49 14 155 203
2960 203 246 272 -150 336 -234 156 133 282 96 -16 -140 -9 -348 -110 -206 285 -199 -331 -236 -297 317 163
2982 163 131 56 129 -87 174 702 -276 237 129 -94 238 -395 -332 132 -64 44 119 -111 -52 -395 -356 -50
3004e0m43L84j42N54l97J66j53L01m16J77j00M9K79N6l46P4J06K42l08K34j47
3025A20J56m00K02M90n30K5J69K39m60K45Q7p02M42K79m12mr7M69n24L51j38J4
3047B1k58n6N15l50j81J28L89l81o54M50N35j46N09m80q27L42L99O8j63j60l7
3068c37O37m85j37M31q8p3J78j33J24m01J23J45n72R93l17l4k21j20O52k40k9
3089I6J09j86k81N80o35M13j84J54m12O4M50J53j76n4J26k01K62k10K60l89J04
3110D3K77k12p2K33K18k93k27K60N3j69p42Q08j33k6k04L75m16L64n3P2n81Q2
3132c43q0K06K68m24N90j93J08k45m7J13j48O4J36J93q26K47N92l04O3m7K94j57
3154F0K0j37k9M12o13k1N53l70J68o6KN6n79N67K38j00Q9j64j72l84O14j54N93
$$ plain form
3004 -50 -493 -109 -251 303 -94 72 -81 220 -196 -19 -119 -70 209 265 -81 -7 99 341 33 267 120
3025 120 276 -124 78 568 38 63 232 471 11 256 343 -359 83 362 -50 -54 -151 318 -206 145 7 21
3047 21 -237 -293 222 -128 -309 -181 208 -173 -827 -377 158 12 521 41 -786 -444 -45 23 -140 -300 -337
3068 -337 300 -185 -322 109 21 -52 126 -7 117 -284 -161 -16 -588 405 88 54 -167 -287 365 125 96
3089 96 205 19 -262 318 -317 96 -88 66 -346 -282 168 321 145 91 217 16 278 68 328 -61 43
3110 43 320 108 36 269 487 194 -33 227 280 111 -631 177 44 18 -186 189 -227 137 84 156 -425 -343
3132 -343 -423 -217 51 -373 217 24 132 -113 -160 -47 -195 -131 5 198 -628 -381 211 -93 -30 -77 217 60
3154 60 80 -57 -86 326 -287 -308 245 -125 43 -23 -21 35 -544 23 261 161 250 86 -86 -470 144 -10 583
3177E83n64M19o02k63OO68J40M43p73N67q57j54r3K5L37L79q42M55J91l53K60
3198b8J55J51n11pJ57J45r0k95N07m42J74K70j53Rj46N81l42j66j26Kk00K04k10
3221c61m00O10k46M80l3J97m6l10J01K16o34N53L1k57l43J33j0J45N42m84K82
3242A66l06J36j3K45J60j25m34K05j00K80m2k34L76m76J42j29j05P31p69P08o91
3263b75J03N3L92l25k69N72J35l94k82K45k17M79n02L68L9j56k29J31k37m0M00
3284iJ08l09L88k15l76O94n71o41R43L7P4J1k15j14n73Q84k62M6O07n06k6m24
3306d49L22n38P36k60j0K44j42K24q86J128O5l88q7N05m03K58q1K32m41k68M96
3327B57k69J6j36N67m97K50N41r52M54n34M12J08n09K20N9n1k11L02k43N31qN00
$$ plain form
3177 583 19 438 -164 -427 -421 247 387 830 57 624 -233 -387 -480 -455 -118 261 -581 -126 65 -288 -28
3198 -28 127 278 -233 -240 -83 62 -28 -323 184 -258 -84 186 33 42 -104 477 135 -31 -157 -155 -355 -151 -361
3221 -361 -761 -151 -397 83 50 247 201 -109 -8 208 -426 127 158 -99 -442 -309 -319 -174 368 -116 166
3242 166 -140 -4 -17 228 388 263 -171 34 -66 214 172 -62 314 -162 -20 -149 -254 477 -292 416 -275
3263 -275 -172 -119 273 -52 -321 251 386 -8 -290 -45 -262 217 -285 83 122 -34 -263 -132 -369 -409 -9
3284 -9 99 -210 178 -37 -413 281 -290 -931 12 49 123 134 -81 -195 -768 116 -146 -100 507 1 -25 -449
3306 -449 -127 -665 71 -189 -199 45 -97 127 -759 369 434 46 -41 464 61 319 238 470 29 -239 257
3327 257 -12 4 -132 435 -62 188 729 -223 231 -303 109 217 -292 -72 -13 -64 -275 27 -216 315 307 807
3349H07m83l5k08K00l45Q2p7k91O51k68k47p8L88J68k44k87k27L36R5J32l9k92
3371b62L85L20l8K1n82N77o32j75j92j09Q19J50l86L20k93p1K6O4O5L19L2J6j69
3394B05J20l76k97N10M8j48k30N50j40m04k6M48n64M58j12k99J35L26j81j11k41
3415c29j22O50k35J14N8o5m89J49J251p35j71J84K67o44r7n9O2R1p73J28O37L17
3437A89L02n02K67J15p66L20j2K24m94O58k9m22K49J77p85K6M84J17j58K67l22
3458i5N4l31J76n0j84Q39k29O09j138J23K56K45J69k97RJ20m67L99j16J52l14
3479g0K26k33m30J100l47m61M4M79j53j22M94o52j61L56l07P0j5k3J60O4J02j98
3501g7Ml70O29m95K19J5O7Qj54N55l85n82K54L32k25n17P96J86m08n6n8K15K19
$$ plain form
3349 807 324 289 81 281 -64 18 -59 -350 301 33 -214 -292 96 264 20 -267 -494 -158 -63 69 30 -262
3371 -262 123 443 405 426 -156 421 -211 -386 -578 -687 132 282 -104 216 -77 -148 -122 -58 7 326 358 374 205
3394 205 325 -51 -348 162 210 62 -168 382 242 -162 -188 260 -304 154 42 -257 -122 204 23 -88 -329
3415 -329 -451 199 -36 78 136 71 -418 -269 982 247 76 260 527 -117 -214 -273 -211 -120 -893 -765 -128 189
3437 189 491 -11 256 371 -395 -75 -87 137 -357 301 272 -150 99 276 -509 -483 1 118 -40 227 -95
3458 -95 -41 -372 -196 -246 -430 409 180 789 -349 -226 30 275 444 147 156 276 -191 208 92 244 -70
3479 -70 156 -77 -507 593 246 -215 -171 308 155 33 527 -125 -286 70 -237 -167 -182 -205 -45 19 121 -77
3501 -77 -73 -443 186 -309 -90 -75 -8 0 -154 401 16 -566 -312 20 -205 -722 74 260 -148 -204 -262 -47 172
3524A72o5M8m49R2P10l81l75P8m5L18j51K76J5o1J30m33J71POj72M97p04K33J76
3548I3P6m56M12k92J88J76J35o11Q56o99K14p4L64J30j87l85K48o3l43K30K8L17
3570C57o35K05K17j42mm23M32N06o58K98o6m08L15k10L46l3j46J25K76m84L20
3591A88m79j01L95q8J0l05K26M19o68M44l12L13j95q9Q66k73k65j67K18L4n17
3612c46L37K70j026O05J48o45N77M22o63M92J44J19j83r1l08K39o01N86n32O39
3632A83M24m10l20n5M52p4l18o43J173Q0r3q2r0n79K82Q13q19J24l2n76R3J05
3654c62K40K59N03o98k55J7O1K55l07J42J86l36N80j44p33R77r52P8K58L38M12
3675E19m57j08l44J80N80n16R2n6J69n27L77O75p52R09r45O41l18m3m64J7O56
$$ plain form
3524 172 107 155 -294 -202 508 127 -248 -170 -215 103 -48 228 243 182 312 -121 50 57 63 -109 388 -316 -83 93
3548 93 169 -287 125 -167 21 197 332 -279 577 -122 92 18 382 512 325 -60 188 125 -218 12 40 357
3570 357 -278 -73 144 2 -2 -425 7 513 -145 153 87 -321 -6 -216 130 97 -49 76 352 -132 188
3591 188 -291 -392 3 -85 -75 -380 -154 265 -403 41 -271 42 -153 -242 624 351 86 -81 137 171 -346
3612 -346 -9 261 -765 -160 -12 -657 -80 342 -321 171 315 434 251 160 -148 91 -510 76 -456 183
3632 183 607 197 -123 -178 274 200 -118 -761 412 492 399 317 227 -352 -70 743 -76 48 16 -560 -467 -362
3654 -362 -122 137 640 -58 -313 -296 -235 20 -287 -145 41 -295 285 141 -592 385 -567 -489 -231 107 519
3675 519 62 -46 -390 -210 370 -146 -54 -110 59 -468 -91 584 -168 741 -204 437 119 76 -388 -371 285
3696B85J85j74k20L00j54j18j27P8l6k13Q16o34K72R2p83N39J25k03L74k35j92
3717b3K51o34M22M03o63K38N1K2J55l10K05j63J11n36M72J30r3m20N19M4m66L1
3739b54J11J62o3p1J04O9K56p3l41L50p4O6p56Q42m79L02m7j90J71m73N06q4J0
3762D4Pm7J68NK14k95M5j57M41n22O5M04n5on76K29l67lm0P41j148J344m93qk52
3787b62O1K57k12k08J85N3m37N79k92K09J22J31j35l02J84K6J22k55K0J2L98m24
3809a68j54M28m6J66j86q2k46K06P4K90L7o23K39j39j91J72O44r28J84K15J02
3830fj69k48P72l24k26L71K87l33J17j96n22P33r00O35J43K93l00M78l65j62K88
3851C66j47k11j73P45o49l61O43j99Q3K34n31L91P1o16O34k0k60l8j9j91j45M49
$$ plain form
3696 285 470 296 76 376 222 104 -23 55 19 -194 622 -12 260 352 -431 108 233 30 404 169 -23
3717 -23 228 -406 16 419 -244 -6 45 67 222 -88 117 -46 65 -471 1 131 38 -382 137 181 -285 -254
3739 -254 -143 19 -44 -115 -11 58 314 241 -100 250 176 242 -514 328 -151 151 104 -86 85 -388 118 34 44
3762 44 51 4 172 177 391 96 141 -16 425 -97 -32 372 317 311 -265 -36 -403 -406 -446 295 -853 491 -2 -10 -262
3787 -262 -201 56 -156 -364 -179 -126 -563 16 -276 -67 55 186 51 -251 -67 -41 81 -174 -154 -142 256 -168
3809 -168 -322 106 60 226 40 -42 -288 -82 -8 282 319 -304 -65 -204 -395 -223 421 -507 -323 -108 -6
3830 -6 -175 -423 349 25 -201 170 457 124 241 45 -477 256 -644 -9 134 427 127 605 240 78 366
3851 366 219 8 -165 580 -69 -430 213 14 97 331 -200 191 262 -354 280 260 0 -38 -57 -248 -393 56
3873E6j50L97m86J21N5k77M25J38n82L31q0K81o3K5m0n37K84K20J10l89L66o85
3895d80L82J04q2N9P3J60m05L78j98j89L35n33J31l85K35P59q31P1J13K22J07
3916B6n80P29l8K1O3m96K05J56j10j9K28J91n50N43n48K47M55l51j50o1K24l94
3938b09L69l72p9p8M12j84k26K42J45K41Rk48J58k91J2n0o0K81j77j60J05P3n17
3961f04N19J42K59n97J73M45o52r2n9L14k6j20L48N92q22j27M29J3l82m16P83
3982A20J03P0j60j73J55l78J04K06j92K25j21j60K15m42O35K72m18l48N63p06
4002d30R03l50q6l60J15k53j5J93M10L37M49j123K66n13M34j88Q43j38M1L27p58
4023A04j30M58j132J272m64m91R02r15p9m00j8J050K94j590J387q0m22K86P3m40
$$ plain form
3873 56 -94 303 -183 -62 -7 -284 141 279 -303 28 -52 229 166 191 151 -386 -102 118 228 -161 205 -480
3895 -480 -98 6 -76 -17 56 216 -189 189 -9 -198 137 -396 -265 -650 -415 344 -487 -416 -303 -81 26
3916 26 -554 175 137 158 221 -275 -70 86 -24 -43 185 376 -174 369 -179 68 523 172 22 -39 185 -209
3938 -209 160 -212 -291 -369 43 -141 -367 -125 20 261 270 22 180 -111 -99 -149 -209 72 -105 -265 -160 -87 -604
3961 -604 -85 57 316 -281 -108 337 -315 -407 -466 -152 -178 -298 50 642 -180 -307 122 135 -247 -663 120
3982 120 223 293 133 -40 115 -263 -159 47 -145 80 -41 -201 14 -428 207 479 61 -287 276 -430
4002 -430 473 123 37 -323 -208 -461 -476 -283 127 464 913 -210 56 -457 -23 -211 632 494 535 862 104
4023 104 -26 432 -700 572 108 -383 519 -396 -475 -875 -893 157 451 -1139 248 168 -254 32 105 -335
4043c35L92m95M46k48j49k4N16K86q45O81l21l44Q74m59j01K69m23j74N27J48
4063B21J7j75j5j24K73k33M4k22K63K52J10q79M55K07J23m29M26k39l51K07m7
4084a16r9L97J23n34L55n10M43o28k72P73P33k05l45k61L20m80O14k17k50M88
4104C29r75N38l1L28l05R8l71l75J270p50M9K16j69K37l78l78O36J9p0j28l33
4125e43O27K08k7k79Q0k03K76P0o33J044n46L11o12M16M5k38M06n9o69J53R0j85
4147b68N79n07m9j4K65k23K58L67k65j32m2j71O39n53j10K79p6J20m06O14J08
4168D13k24K21n65L83lk61q7o5M09n45m17O74kj99L23k17m60O15k34K7K33m57
4190d38M38K28l03q38O96K40m61K0L21P0J70j97P69m17j88j98P5J65j73r0j89
$$ plain form
4043 -335 57 -438 8 -240 -389 -413 103 389 -456 225 -96 -440 434 -25 -126 143 -280 -454 73 221
4063 221 238 63 48 -76 197 -36 8 -214 49 301 411 -468 -13 194 317 -112 314 75 -276 -69 -116
4084 -116 -215 182 305 -229 126 -384 59 -569 -841 -68 665 460 115 -146 174 -306 308 91 -159 329
4104 329 -646 -108 -139 189 -116 -18 -389 -764 506 -244 -195 21 -148 89 -289 -667 -31 -12 -82 -210 -543
4125 -543 84 292 265 -14 66 -137 139 209 -424 620 74 385 -227 189 234 -4 402 343 -326 -173 -83 -268
4147 -268 311 -196 -245 -259 6 -217 41 408 143 11 -31 -202 437 -116 -226 53 -23 97 -309 305 413
4168 413 189 410 -155 228 225 -36 -123 -188 221 -324 -741 -67 -69 -268 55 -162 -622 -7 -241 -214 19 -438
4190 -438 0 228 -75 -913 -217 23 -438 -418 -97 -27 143 -54 715 298 110 -88 -13 152 -21 -111 -300
4211c00j77N62L15j94n49L29P90p44m1K0j08J015q2j472L12R31n39n53N51n08
4231d42M25K58j63J46j47L33j9l37j39j27K29J75J39n7l34j23J23K82j8j32L51
4252D23j85j60p26M69K11J52K14n97K81K3k19J30p6J86m41L87l67N20j22j91k
4273i0K54j60J36m89K38Q6k80O93M3r06K96j84J43J56L09N8l35r9l9l27M45j20
4295a72n8K00pJ73n00J88r3L83j76L04k79L41o5k41j55J81l4J50l50J61K54m0
4317A65l30K29N2J68j91K26j34M13n08n25O34K1p10O71M4l59M06p6k65j36l10
4338e15j76P86l02J11L55J18n33q3J86j80K97l36L00M9k42M70o06L98k14m0J39
4359a8L39n19j26P63o65R6L08M2l91K40l09L53l66Q7l23P55j68N02k36N3l89n40
$$ plain form
4211 -300 -477 85 400 206 -343 -14 776 32 -9 11 -97 918 836 -636 -324 607 68 -485 66 -442
4231 -442 -17 241 78 224 77 410 391 54 -85 -212 17 192 331 274 -60 -183 -60 222 204 72 423
4252 423 238 78 -648 -179 32 184 398 -199 82 105 -114 16 -60 126 -315 72 -295 225 103 -88 -90
4273 -90 164 4 140 -349 -111 -25 -305 388 431 -475 -179 -363 -220 -64 245 303 -32 -131 -170 -497 -52 -172
4295 -172 -230 -30 -37 136 -364 -176 -269 114 -62 242 -37 304 239 -2 -157 24 -10 140 -210 -49 205 165
4317 165 -165 64 116 284 93 319 185 598 90 -435 199 220 -490 181 225 -134 272 196 -69 -205 -515
4338 -515 -691 95 -207 -96 259 377 -156 -239 -53 -233 64 -272 28 77 -165 305 -301 97 -117 -157 -18
4359 -18 321 -198 -324 439 -226 -130 178 220 -171 69 -240 113 -253 -166 -489 266 98 600 364 417 28 -512
4381e12O68rm28L93rm9K17l59J95p1J48m02L90O8l77Q3R0K69m44J81N3k62R31
4404G64m52q6j64R1j5j79J39N3p9j31P2J46j08j19j08J07j59J81O4k03P1n29L74
4427b70L85k75N4O64o98J4k6j49M00l81m6j25L92l07K91j9M61o87L22R0l83M10
4449A17j51K44p4M32o77K89n13N03K09l01J26k32q0K64j08j65J97J6K66N21p38
4470A45P4l58M62m36N35j66m7J38l75j47K71L71k71j6L46m71o44K26L42L10m50
4491a61K34j3Lk03j92J85j07N88n65L03l72J91o4o4Q0J67q3j19K57l01K17m4m4
4514a07k5r2k01O94k05m19P61m04l35K40Q7K16n73L19L09q0M4K02o32J19K5K59
4536B02l3n37P81j28m10j83J13j94P82k34L25l48j28M05k04k37K36j83n26K18
$$ plain form
4381 -512 156 147 -281 112 103 54 271 -88 107 36 184 -218 172 240 -137 -54 36 305 -139 42 95 -167 764
4404 764 312 226 62 153 138 -41 98 151 72 -59 13 159 51 -68 -176 -69 -228 -47 17 -186 -115 -644 -270
4427 -270 115 -160 -106 558 -140 -126 -152 -301 99 -282 -328 -453 -61 -368 -77 -96 365 -322 0 90 -293 117
4449 117 -34 210 136 568 -109 180 -333 170 379 78 204 -28 -108 156 48 -117 80 96 362 883 145
4470 145 219 -139 323 -113 422 256 209 347 -28 -175 96 467 196 180 526 55 -589 -363 -21 289 -161
4491 -161 73 60 63 -140 -332 -147 -254 334 -231 72 -300 -109 -173 -237 -157 10 -73 -192 65 -236 -19 -63 -107
4514 -107 -132 -224 -425 269 64 -355 406 2 -333 -93 -6 210 -363 -44 265 185 229 431 -201 -82 -57 202
4536 202 169 -368 413 285 -125 -308 -195 -389 393 159 484 136 8 413 209 -28 208 25 -501 -283
4556b83K13p9m3l74N75l1J58m68r7j1L58k79M08l94o5k04M16N50p76K53j8Q4N66
4579D59p67N15j01p93R46k8k71l80l7l08O45j19N52J60l75o17%M38Q7j52k7k92
4601d65O22q1J07Jj20n1j1O99q16N4j4J46L39l41j96L61J9k78J7n00O09M44l11
4624B34j20k52L90j43K17l38k54L02j50P8m0J08k01K39l63L96k54J96k53R3K77
4645A62r9L7m00J19k78J29K0K4j43J50L26O02m62N3n85P8N73k24j40K44k95O8
4667d1O8j5J51j31l11K31K58j15j79l48P7L19r2%m51K65M85J94j62l81K51N39
4689F12p67L12L96m86p6l33L30L44l25M16k38l71R2K02j36J23ol1k66J55N07n14
4711f0L7J4M32o43K63m69L89K49l31j65N5K16l17K44k43L72l73M20j36Kl29M40
$$ plain form
4556 -283 -70 -149 -192 -566 9 -22 136 -332 -429 -440 -82 -361 47 -347 -412 -616 -200 350 -426 -173 -191 -107 459
4579 459 -308 207 106 -687 259 231 -40 -420 -457 -765 -120 -239 313 473 98 -519 -519 -81 6 -146 -173 -465
4601 -465 157 76 183 184 64 13 2 701 -115 -61 -75 71 410 69 -127 234 253 -25 -8 -508 101 545 234
4624 234 114 -138 252 109 326 -12 -266 36 -114 -36 -76 32 -169 70 -293 103 -151 45 -208 -115 162
4645 162 63 100 -300 -181 -459 -330 -310 -286 -429 -279 47 649 187 240 -345 -267 306 82 -58 186 -109 -41
4667 -41 27 12 163 32 -279 -48 210 95 -84 -432 -355 -36 -128 -128 -579 -314 171 365 203 -178 73 612
4689 612 -155 157 553 67 -9 -342 -12 332 7 423 185 -186 -94 108 -28 95 89 58 -208 -53 454 -60
4711 -60 -23 -9 423 -220 43 -426 -37 212 -119 -284 -229 -13 -330 -86 -329 43 -330 90 -46 -44 -373 67
4733F7k94K49j90J88J9l78L74l67J71j13O54k74k69N34l12j9R7j82j47K49J19
4754A76l01j8J09J17Q4k6K05n31M06j15l80N80m93M18j5k95K67k50j83Q4J2M50
4776C01l85J15J14j47k16k42Q70m42k49L99q15J185p48K23o1J85j33K66m33K48
4796C5n80N44j20J26K18n90K23j17J25j18K35M88p70N24o79q4M31N8L08m8m7j71
4818ik20K18r8L33k28l53P19l50m08K63j01L24k6K22l36J49L14p49K37J57K41
4839B99L85j035M53j27r1N66m61m36Q50m61J25K28l56L19L63n23k54l2J63O97
4859F72p08J36Q0J55p10J76J51M81J39o27p6L19n33M24j05k73Q33j124M43m79
4879f26N00k29O88m38J55k07O76o56l29O87q7mk47j85k02M66j18K40Po04R48o21
$$ plain form
4733 67 -227 22 -168 20 39 -339 35 -332 -161 -274 380 106 -163 371 59 40 137 -45 -192 57 176
4754 176 -125 -143 -34 83 167 141 346 -185 221 106 -274 306 -187 231 216 -79 188 -62 -245 -161 -149 301
4776 301 -84 31 145 -2 -218 -460 410 -32 -281 118 -697 488 -260 -37 -98 87 -46 220 -213 35
4796 35 -545 -1 -121 5 223 -367 -144 -261 -136 -254 -19 469 -301 223 -456 -540 -109 -51 257 209 162 -9
4818 -9 -229 -11 -109 224 -4 -357 362 12 -396 -133 -234 90 64 286 -50 99 413 -336 -99 58 299
4839 299 684 -351 102 -25 -116 450 -11 -447 403 -58 67 295 -61 258 621 98 -156 -188 -25 672
4859 672 -36 100 180 335 -375 -199 -48 433 572 -55 -131 188 -345 79 -26 -299 534 -590 -147 -626
4879 -626 -126 -355 333 -105 50 -157 519 -137 -466 221 134 130 -117 -302 -504 -38 -156 84 91 -513 435 -186
4901a86R5k69O46k77L71m06L29o45K27k42M0N48K47p3o37O29l96o66J115l56q80
4922g86Q84M89J83j085J024p64j23J73M7O42m73l07L29K7o50K89P5J39j99m29
4942e15K83K93j81K02j90q8j17M98K62o21K68o13P20l04m0M17r7j16j38L0K88
4963B41m65M47n73M28p6p9K65m35L81J19L01p20j9L47k63L20J41l99O71n59K8
4984A01k89N59j60l12L6Q8P0L22m33L73l33O5m15K38J98L3l8j49K44J30J83n56
5006d5k50N59k13j61N86k63j77J12n9l4j97j34J54M78k6m34j27k71R89j004L11
5027b06N18m13k89M38k66N4N65o80L41j36R1j09J60p46J001k03k30rL27p10K3
5048d79L39q54Q02P77m89m07q1M92N1M59j289k9Q00l78J2L21qL18J40p52l7O19
$$ plain form
4901 -186 -91 -360 286 9 380 -26 303 -342 -115 -357 -317 231 478 405 -232 397 1 -665 450 94 -786
4922 -786 98 587 770 -315 709 -55 -178 -5 42 684 211 -96 233 260 -390 -101 -26 113 -86 -515
4942 -515 -232 61 -120 82 -108 -196 -313 185 447 -174 94 -519 201 -103 -143 274 177 61 -77 -47 241
4963 241 -224 223 -350 78 2 -77 188 -247 134 253 554 -166 -185 162 -101 219 360 -39 632 73 101
4984 101 -188 371 211 -101 -65 23 93 415 -18 355 22 87 -328 -90 108 141 103 -46 198 328 511 -45
5006 -45 -295 264 51 -110 476 213 36 148 89 55 -142 -276 -122 356 330 -104 -231 -502 487 -517 -206
5027 -206 312 -101 -390 48 -218 -164 401 -279 62 -74 17 -92 68 -678 323 120 -110 -119 208 -502 -479
5048 -479 -140 -994 -192 585 96 -311 -392 100 151 610 -679 -708 92 -286 -274 47 39 357 497 -255 -292 327
5070C27n82m63J159M67n24n06M9N21k49J16j1K03j20l29M56l79k16L35r6J92L
5091C53j42L63l89K04o15M52l24O4l41L68L60m57M63l54M26n01Ml53J22j068J098
5112b67R8J98k59J10M1M74j85P85j303O11m81j71j93N27q0J29m45O38l11q5N30
5133C61j67Q9p02m75M3O68M07n64P94j0r53N68j45N6n05Q89q80Q60K0q15L22K1
5155a18N75n44L32q49J198q93K97n16N02L66J95n93M51O7m76k43K66K17o26j83
5175e75JO27m41M20k25M28j051R72M24k21n70L80l96J058p95j2n17J36K46l5p9
5196b25m63P2L78M94n90R17o09n09J0J262k15r48Q43j72j23j74q9K24O7r6m19
5217c65P44m98Ql04L62M7N4l49M89L10n9q35J322j037K36O04j242J04J280n83
$$ plain form
5070 327 -255 -718 441 908 384 -122 -73 448 199 315 304 507 387 58 514 135 -81 254 158 350 353
5091 353 211 574 185 389 -226 226 -98 -34 -375 -7 353 -104 359 5 431 -70 -66 -419 -297 -1365 -267
5112 -267 -169 29 -230 -120 -79 395 210 995 -308 303 -178 -349 -542 -15 -95 34 -411 227 -84 -169 361
5133 361 194 283 -419 -894 -851 -183 224 -340 454 444 -509 59 -86 -30 -535 354 -526 334 354 -461 -139 -118
5155 -118 457 -87 245 -604 594 -299 -2 -518 -16 350 545 -48 403 470 -6 -249 17 234 -392 -575
5175 -575 -574 53 -388 32 -193 235 -816 156 580 359 -211 169 -227 831 36 24 -493 -357 -111 -146 -225
5196 -225 -688 -616 -238 256 -334 583 -26 -535 -525 737 522 -426 417 245 122 -52 -141 83 150 54 -365
5217 -365 379 -119 -111 -415 -53 -6 48 -301 188 498 439 -396 926 -111 125 729 -513 -409 871 288
5237B88M87m58o8p6p26J136o73k39k04M87p04J341j033J46k04P12p50L03j54P99
5257D10L25r41N58j448N31N23n4O04j114K45M67k95J93j90P16m48n7k08o9k35
5277d87K71P98l89L5l94K93Q1o19P02m00L07l86K75K24n3j02n23N25L95o78Q6
5298c9N4M93o07L77l95K29m04M6M49J09n88J7O91l37j58k1k76J09N23j12l60R4
5320a06K52j33j80L53n2l25J69L18J92p86N48m09L45k17L6L21k61l95L51M42q45
5341c82K1J75N2l1K91j81j27J66L09l85k01lO10n19L06j90M79l51J5K0o57M51
5363a32j80R4kJ51k69O41l11K65m53L2K66l22M79J53m64K89R1K49l02j89q8N2
5385E0R7J88m13Rj81K70j56J2L58n89K04O6L21n67M0j88L05K74JJ06j27k0o18
$$ plain form
5237 288 775 317 249 173 -553 583 -90 -329 -533 -46 -750 591 -442 -296 -500 212 -538 -235 -389 410
5257 410 735 -206 352 -1096 -565 -42 -96 508 -606 -361 106 -189 4 -186 530 82 25 -183 -252 -487
5277 -487 -216 582 193 228 -166 127 208 -411 291 -109 198 -188 87 311 258 156 -367 158 553 -125 -39
5298 -39 15 508 -99 278 -117 112 -292 -246 203 312 -276 -259 432 95 -63 -84 -360 -251 272 160 -200 -106
5320 -106 146 13 -167 186 134 -191 -22 296 488 -298 250 -159 186 -31 5 326 65 -330 21 463 -382
5341 -382 -361 -186 -134 -165 126 -55 -182 -16 293 -92 -293 -296 314 -205 101 -89 390 39 54 74 -583 -132
5363 -132 -312 -218 -220 -69 -338 303 -8 257 -196 -164 102 -220 259 412 -52 237 328 577 275 86 -2 50
5385 50 147 335 -78 -69 -250 20 -136 -124 234 -355 -151 -85 236 -331 -291 -479 -174 100 101 207 80 60 -558
5408e58N97l07j41J96j69L52n64J63L61j86K17M8m05J37R4M1j77K52K85j60k37
5429a61M46n34J42K75p3k62J6K30l74L47j57l85L60PK69L4n6o71R31l86K04K14
5451D16m49j48m47Q34j79J64o78K24j49R11n84L4J72J45K16l03Q8j93J10k70N75
5472D89l81k19r45O24M63j43L11k6j45l85O45o9P7j93K01l49M44n99K11M5j07
5493e1P84p99j28M61j30k21m97J08O06p92J012l34q4K10o45J065o12P1L49N2k49
5514A76k55J68q9K88O7O5l8J93lp43o2M40M48p22N1k98n18P81L42j36K74O1j307
5537h17Q41j37J105q31l73M95L14r41j33M42n06l83L49O62j78J309q23l42L81
5556D34k83M96q82M14j222P94M7PN7M25j43Q9j455K17O86n62J269k72J11j005
$$ plain form
5408 -558 39 -268 -409 -213 -382 -30 -594 -431 -70 -256 -39 9 -396 -259 -165 -124 -301 -49 236 76 -161
5429 -161 285 -249 -107 168 95 -167 -151 79 -295 52 -105 -490 -130 -123 146 180 124 -547 384 -2 202 416
5451 416 -33 -181 -628 206 27 191 -487 -263 -412 499 -85 -51 121 266 482 179 267 74 184 -86 489
5472 489 108 -111 -1056 -432 31 -112 199 173 28 -357 288 219 296 103 304 -45 399 -200 11 56 -51
5493 -51 733 -66 -194 267 137 -84 -581 -473 133 -659 353 19 -65 145 -500 565 -47 24 373 425 176
5514 176 -79 89 0 288 355 420 382 575 572 -171 -233 207 655 -67 -16 -314 -832 -51 291 155 429 490 -817
5537 -817 24 -113 992 161 -212 283 597 -344 -477 -35 -541 -924 -575 87 -91 1218 395 53 434
5556 434 151 647 -235 179 -1043 -249 -202 -195 -138 287 144 233 -1222 -1005 -319 -881 388 116 227 -778
5576g78Q48K35K09p61R7j297K262j384M52K8Q8O30o36L97r5l3m37J61N26m40K23
5597B95J79n78J57r2l28M11N34q53O24k38K14l87L63l24L01M2m60K19o7O36q67
5618b19L60R8j01j82J08m4oj68k4K56L10r15O14j33J0j74Q2K08l73M22k25Q1M19
5641D04p22K0K38JO4j52n2L35J14Q3m67N4L25j20n5k08r1q3p5M47j31n1O7M3j02
5666a14K23m83L52L23q3l68J10K50k29l89O68m2L3J4n90M43m45K50K8p3L0J64
5688G2L9J62l15K23k15R1r5K3n3k22J14L20m12J08l2L65m18p8P87k91k71L75n27
5711b50J46L17r6n15M30J9j29O32o21K39K31p66J68j9M92p82K29J91k82O04k65
5732b7O7n37L09M92l20P8k0J37j86k56O68k78L24J46M93j260j09L77n75L65P04
$$ plain form
5576 -778 70 305 514 -247 -150 -1447 815 -569 -117 -89 -1 629 -7 390 295 262 -175 -14 512 72 295
5597 295 474 -104 53 -39 -367 44 578 -275 349 111 325 -62 301 -23 278 320 -140 79 12 648 -219
5618 -219 141 239 138 -44 64 20 14 -154 -178 78 388 -527 87 -46 -36 -210 -128 80 -293 129 -96 -15 404
5641 404 -318 -298 -60 -59 5 -147 -199 136 250 333 -134 -80 245 125 70 -138 -229 -312 -387 60 -71 -122 -55 -12 -114
5666 -114 109 -374 -22 301 218 -150 -40 210 -19 -408 260 218 251 265 -325 118 -327 -77 -49 -122 -92 72
5688 72 111 273 -42 181 -34 57 -38 -15 -68 -290 -176 144 -268 -160 -192 173 -245 -323 464 173 -98 277 -250
5711 -250 -104 213 117 -398 32 51 -78 554 -67 172 403 -363 -195 -214 278 -504 -275 -84 -366 238 -27
5732 -27 40 -497 -188 304 -16 62 42 179 -7 -263 405 127 451 597 1090 -170 -279 98 -477 -112 592
5753E92n73m50O33O98n71r14R28j36O08p83k29l51J06J23N03J94r31L40J41N2
5773b0j27L43J18q18O28M4k49R3k14J74N5K41J47o52J13R7M8j82k89O08L1J38
5795C27p44N97j74m00K23j06P2o2R3K87j65r7j42N90k75k60M66n82N3Q9n27P20
5817a7K4k26J74J55K7J13l1k90r4l04O13qM5m71j07M34L65j27m79O35p31J47O90
5840E37n01j12J68n30P02m65J80k98L33M4j87K68m60K36m70K54J93J73L32l07
5860I0k03M51j91p5J2J9r2k10q4l33N83M28m38N5J08l15K5J3j28L70k11K05n73
$$ plain form
5753 592 19 -431 202 900 329 -585 343 207 815 32 -197 -548 -442 -319 184 378 -553 -213 -72 -20
5773 -20 -147 196 314 -504 124 168 -81 12 -202 -28 27 268 415 -237 -124 -27 21 -161 -450 158 189 327
5795 327 -417 180 6 -394 -171 -277 -205 -267 -174 113 -52 -149 -291 299 24 -236 230 -352 -299 -210 -737 -17
5817 -17 7 -219 -45 110 137 250 219 -71 -165 -469 144 136 181 -290 -397 37 402 275 -204 431 -300 -153 537
5840 537 36 -76 92 -438 264 -201 -21 -319 14 58 -129 139 -321 -85 -555 -301 -108 65 397 90
5860 90 -113 338 147 72 84 103 11 -199 -283 -616 -33 395 -43 12 120 -195 -170 -157 -285 85 -126 79 -494
$$ [...]
8191b27
##END NTUPLES=NMR FID
##END=
