##TITLE=1H_SL59-Dau(bat1)-f4-f6
 CDCl3, 32 sc, 
 1.06.2021
##JCAMPDX= 6.0         $$ Bruker NMR JCAMP-DX V2.0
##DATA TYPE= NMR FID
##DATA CLASS= NTUPLES
##ORIGIN= UXNMR, Bruker Analytische Messtechnik GmbH
##OWNER= root
$$ XWIN-NMR		Version 3.5
$$ Tue Jun  1 11:06:52 2021 Russian Standard Time (UT+4h)  she@DPX200
##.OBSERVE FREQUENCY= 200.131506
##.OBSERVE NUCLEUS= ^1H
##.DELAY= (6, 6)
##.ACQUISITION MODE= SIMULTANEOUS
##.ACQUISITION SCHEME= undefined
##.AVERAGES= 32
##.DIGITISER RES= 18
##SPECTROMETER/DATA SYSTEM= spect
##.PULSE SEQUENCE= zg30
##.SOLVENT NAME= CDCl3
##.SHIFT REFERENCE= (INTERNAL, CDCl3, 0, 15.7039)
##AUDIT TRAIL= $$ (NUMBER, WHEN, WHO, WHERE, WHAT)
$$ ##TITLE= Audit trail, XWIN-NMR		Version 3.5
$$ ##JCAMPDX= 5.01
$$ ##ORIGIN= Bruker BioSpin GmbH
$$ ##OWNER= she
$$ F:/spectra/data/she/nmr/H-F/1/audita.txt
$$ ##AUDIT TRAIL=  $$ (NUMBER, WHEN, WHO, WHERE, WHAT)
(   1,<2021-06-01 11:05:37.25 +0400>,<she>,<DPX200>,
      <continue with go, POWCHK disabled, PULCHK disabled
       configuration hash MD5:
       00 E9 B6 7A A2 85 ED C7 34 08 36 98 17 FE 4E 26
       data hash MD5: 16K
       D1 A1 A1 79 88 5B 68 F3 BB 91 89 9B 0E D2 E1 A0>)
$$ ##END=
$$ 
$$ hash MD5
$$ 1F CD C4 68 DF 60 E2 7E 8F 96 94 23 5E A6 D4 F3
##$RELAX= 
##$RELAX= 
##$RELAX= 
##$RELAX= 
##$RELAX= 
##$RELAX= 
$$ Bruker specific parameters
$$ --------------------------
##$DU= <F:/spectra>
##$EXPNO= 1
##$NAME= <H-F>
##$PROCNO= 1
##$TYPE= <nmr>
##$USER= <she>
##$AMP= (0..31)
100 100 100 100 100 100 100 100 100 100 100 100 100 100 100 100 100 100 
100 100 100 100 100 100 100 100 100 100 100 100 100 100 
##$AQSEQ= 0
##$AQ_mod= 1
##$AUNM= <au_zg>
##$AUTOPOS= <>
##$BF1= 200.13
##$BF2= 200.13
##$BF3= 200.13
##$BF4= 200.13
##$BF5= 200.13
##$BF6= 200.13
##$BF7= 200.13
##$BF8= 200.13
##$BYTORDA= 1
##$CFDGTYP= 0
##$CFRGTYP= 5
##$CHEMSTR= <none>
##$CNST= (0..31)
1 1 145 1 1 1 1 1 1 1 1 1 1 1 1 1 1 1 1 1 1 1 1 1 1 1 1 1 1 1 1 1 
##$CPDPRG= <>
##$CPDPRG1= <>
##$CPDPRG2= <>
##$CPDPRG3= <>
##$CPDPRG4= <mlev>
##$CPDPRG5= <mlev>
##$CPDPRG6= <mlev>
##$CPDPRG7= <mlev>
##$CPDPRG8= <mlev>
##$CPDPRGB= <>
##$CPDPRGT= <>
##$D= (0..31)
0 1.2 0 0 0 0 0 0 0 0.06 0 0.03 0 0 0 0 0.0002 0 0 0 0 0 0 0 0 0 0 0 0 
0 0 0 
##$DATE= 1622530994
##$DBL= (0..7)
120 120 120 120 120 120 120 120 
##$DBP= (0..7)
150 150 150 150 150 150 150 150 
##$DBP07= 0
##$DBPNAM0= <>
##$DBPNAM1= <>
##$DBPNAM2= <>
##$DBPNAM3= <>
##$DBPNAM4= <>
##$DBPNAM5= <>
##$DBPNAM6= <>
##$DBPNAM7= <>
##$DBPOAL= (0..7)
0.5 0.5 0.5 0.5 0.5 0.5 0.5 0.5 
##$DBPOFFS= (0..7)
0 0 0 0 0 0 0 0 
##$DE= 6
##$DECBNUC= <off>
##$DECIM= 32
##$DECNUC= <off>
##$DECSTAT= 4
##$DIGMOD= 1
##$DIGTYP= 9
##$DL= (0..7)
0 120 120 120 120 120 120 120 
##$DP= (0..7)
150 150 150 150 150 150 150 150 
##$DP07= 0
##$DPNAME0= <>
##$DPNAME1= <>
##$DPNAME2= <>
##$DPNAME3= <>
##$DPNAME4= <>
##$DPNAME5= <>
##$DPNAME6= <>
##$DPNAME7= <>
##$DPOAL= (0..7)
0.5 0.5 0.5 0.5 0.5 0.5 0.5 0.5 
##$DPOFFS= (0..7)
0 0 0 0 0 0 0 0 
##$DQDMODE= 0
##$DR= 18
##$DS= 0
$$ [...]
##$SUBNAM2= <"">
##$SUBNAM3= <"">
##$SUBNAM4= <"">
##$SUBNAM5= <"">
##$SUBNAM6= <"">
##$SUBNAM7= <"">
##$SUBNAM8= <"">
##$SUBNAM9= <"">
##$SW= 16.9725357007746
##$SWIBOX= (0..15)
0 0 2 0 0 0 0 0 0 0 0 0 0 0 0 0 
##$SW_h= 3396.73913043478
##$TD= 16384
##$TD0= 1
##$TE= 0
##$TE2= 300
##$TE3= 300
##$TEG= 300
##$TL= (0..7)
0 120 120 120 120 120 120 120 
##$TP= (0..7)
150 150 150 150 150 150 150 150 
##$TP07= 0
##$TPNAME0= <>
##$TPNAME1= <>
##$TPNAME2= <>
##$TPNAME3= <>
##$TPNAME4= <>
##$TPNAME5= <>
##$TPNAME6= <>
##$TPNAME7= <>
##$TPOAL= (0..7)
0.5 0.5 0.5 0.5 0.5 0.5 0.5 0.5 
##$TPOFFS= (0..7)
0 0 0 0 0 0 0 0 
##$TUNHIN= 0
##$TUNHOUT= 0
##$TUNXOUT= 0
##$USERA1= <user>
##$USERA2= <user>
##$USERA3= <user>
##$USERA4= <user>
##$USERA5= <user>
##$V9= 5
##$VALIST= <valist>
##$VCLIST= <CCCCCCCCCCCCCCC>
##$VD= 0
##$VDLIST= <DDDDDDDDDDDDDDD>
##$VPLIST= <PPPPPPPPPPPPPPP>
##$VTLIST= <TTTTTTTTTTTTTTT>
##$WBST= 1024
##$WBSW= 4
##$XGAIN= (0..3)
0 0 0 0 
##$XL= 0
##$YL= 0
##$YMAX_a= 342201
##$YMIN_a= -267568
##$ZGOPTNS= <>
##$ZL1= 120
##$ZL2= 120
##$ZL3= 120
##$ZL4= 120
##$ABSF1= 10
##$ABSF2= 0
##$ABSG= 5
##$ABSL= 3
##$ALPHA= 0
##$AQORDER= 0
##$ASSFAC= 0
##$ASSFACI= 0
##$ASSFACX= 0
##$ASSWID= 0
##$AUNMP= <proc_1d>
##$AZFE= 0.1
##$AZFW= 0.1
##$BCFW= 1
##$BC_mod= 2
##$BYTORDP= 1
##$COROFFS= 0
##$CY= 11.3945322036743
##$DATMOD= 1
##$DC= 2
##$DFILT= <>
##$DTYPP= 0
##$F1P= 15.9154993809931
##$F2P= -4.1035820241983
##$FCOR= 0.5
##$FTSIZE= 0
##$FT_mod= 4
##$GAMMA= 1
##$GB= 0.15
##$INTBC= 1
##$INTSCL= 1
##$ISEN= 128
##$LB= 0.24
##$LEV0= 0
##$LPBIN= 0
##$MAXI= 10000
##$MC2= 0
##$MEAN= 0
##$ME_mod= 0
##$MI= 1.114404
##$NCOEF= 0
##$NC_proc= 0
##$NLEV= 6
##$NOISF1= 3.799351
##$NOISF2= 2.8
##$NSP= 1
##$NTH_PI= 0
##$NZP= 0
##$OFFSET= 15.70392
##$PC= 1
##$PHC0= -11121.75
##$PHC1= 16.60099
##$PH_mod= 1
##$PKNL= yes
##$PPARMOD= 0
##$PSCAL= 0
##$PSIGN= 0
##$REVERSE= no
##$SF= 200.130013532006
##$SI= 16384
##$SIGF1= 3
##$SIGF2= 2
##$SINO= 400
##$SIOLD= 16384
##$SREGLST= <1H.CDCl3>
##$SSB= 0
##$STSI= 0
##$STSR= 0
##$SW_p= 3612.71676300578
##$SYMM= 0
##$S_DEV= 0
##$TDeff= 0
##$TDoff= 0
##$TI= <>
##$TILT= no
##$TM1= 0
##$TM2= 0
##$TOPLEV= 0
##$USERP1= <user>
##$USERP2= <user>
##$USERP3= <user>
##$USERP4= <user>
##$USERP5= <user>
##$WDW= 1
##$XDIM= 8192
##$YMAX_p= 0
##$YMIN_p= 0
$$ End of Bruker specific parameters
$$ ---------------------------------
##NTUPLES= NMR FID
##VAR_NAME=  TIME,          FID/REAL,        FID/IMAG
##SYMBOL=    X,             R,               I
##VAR_TYPE=  INDEPENDENT,   DEPENDENT,       DEPENDENT
##VAR_FORM=  AFFN,          ASDF,            ASDF
##VAR_DIM=   8192,          8192,            8192
##UNITS=     SECONDS,       ARBITRARY UNITS, ARBITRARY UNITS
##FACTOR=    0.0002944,     1,               1
##FIRST=     0,             0,               0
##LAST=      2.4114304,     0,               0
##MIN=       0,             -267568,         0
##MAX=       2.4114304,     342201,          0
$$ Real data points
##PAGE= N=1
##DATA TABLE= (X++(R..R)), XYDATA
$$ [...]
2231b06Q24r75L17Q5p44J172n22o04O59m94O5N21o87P37P8r57R67j049J67P28
2251H2p42M92m08J05P76m55l05J069j270L37P90q59O20j95l66K21m9O53m58o95
2271f57J169m55j55J067q27k07O33n90M52K17n10M97p25N22Pp53M55P01j245J045
2291F41k77K03k71o41K8P56j046L99L79o99N05M0P3Q4l60L56K04j097P64m05N03
2312A39n5o49N93o20JQ23m17k40L30n02M68m56k12Q22J13o59L68o47L86O44m22
2333a92M03j87l82K30j84N63l5q93Q29L39r23M20L89p30M26J38k41O34n24J19
2353A99m49l09R46l02j97R08o21J72J63m95Q48r03J06oM9n72J256r25M08k01m08
2374c33P83m94m99Q12o88L98P58r32O99k18m45J35j39J72L6p54O00l8j42J15J26
$$ y = [-206, 618, -357, -40, 45, -699, 473, -49, -653, 6, -488, -423, 98, -589, 148, 226, -731, 236, -813, -646, 82, -660, -168, -576, -471, 305, -150, -455, 614, -656, -319, 471, -388, 232, 37, -329, -108, -157, 496, 38, -657, 512, 57, -98, 969, 142, -65, 568, -22, 430, 647, 137, 634, -91, 431, 438, -315, 140, 841, -404, 641, 364, 567, 296, -345, -317, 439, -607, -208, 171, -528, -23, 17, 90, 174, -186, 170, 374, -723, 41, -364, 139, 84, -565, 28, -592, -591, 232, -185, -425, -95, -597, -129, -585, -797, 25, 138, -521, -153, -800, -414, 230, -192, 211, 24, -358, -128, -312, 251, 216, -677, 152, 491, -432, -12, 377, -353, 73, 211, -30, 604, 80, 199, -250, -559, 387, 85, -112, 796, 175, 347, 510, 15, 863, -40, 66, 60, 109, -463, 793, -132, 276, 75, -333, 450, -44, -543, 269, -419, -21, 737, -195, 504, 286, -159, -24, -163, 9, 45, -709, -109, -147, -289, -174, -48]
2395d8P4l41q7N20m60k09K51R0k25Q98r74J09J26P6L84j93m55P95k89K50j46m63
2417c17L48Q1m36O97p6m72L78l33P58q08j8R15n01k81M15l72L0K26l32N52l82
2438G2J41L33m75Q1O31q99J56L98M22j76p45j51K93k41J22K40n52L33l23M11n80
2459e09K05J61M79J23l33k83l81J146n62m7o99j49P20P7j68J37o75j04R07q82
2479h37N54M97l08k18l83R09k72k89N63j37l01L06j74n3P65r58R15p14o14J076
2499C27m4l73O58p64P00o68N14Q6o10Q23j038L65M05J01p77o3P68m36N21K87m79
2520C03k43n43J070j110o6J083M19o17o4l37M9o5N49p55L26j49q1L52j87N28j254
2541g92M82m70O62p20N53J69m39L65m00R78p08o72J219n39L4r8L26o59O44o8L17
$$ y = [-48, 26, -315, -402, 118, -342, -551, -300, -210, -435, 463, -511, -402, -276, -200, 184, -9, -464, 331, 42, 292, 146, -317, 31, 112, -324, 373, 297, -175, 203, -130, 628, -180, -198, 717, 216, -65, 350, -22, 8, 234, -98, 454, 72, 213, 546, 71, 152, 783, -116, 40, 438, 860, 684, -61, -212, 81, -160, -38, 202, -350, -17, -340, 71, -509, -304, -143, 336, 459, 126, -157, -538, 608, 46, -1, -700, -849, -129, -52, -220, -83, -758, -862, 45, -837, -283, 214, -94, -312, -695, 214, -58, -347, 216, 79, -222, 84, -90, -143, 622, -336, 579, -135, -749, 327, 283, -90, 568, -196, 504, -164, 350, 436, -174, 649, -389, -24, 381, 482, -295, -358, 410, -26, 495, 782, 303, 60, -483, 587, -523, -589, 494, 913, 296, 232, -105, -56, -121, 428, -327, -1, -150, -231, 121, -66, 462, -792, -310, -780, -118, -838, -285, -116, -555, -190, -590, 388, -320, -992, 227, -312, -278, -376, -50, -709, -65, -133, 184]
2562A84j09RP86m10l99j03j34j07m91M62N36p81M55L33o65j80N85J09p30M24L02
2583G6j57k01L81P3M65p35L62L13o61K22J48L32q63O25l05j71M26j93P8m53J617
2604A379r69j88O9l27k69L84k39K54q8j94L54l22m69o15J223J58k63n30J056j074
2624f70L33k56N30M74n71K91n68L69K40M0k45n5j74J56L22L7p32O13j49j66NN4
2646a22o3P1K27j47N3m98P92l75J99l40Q62n63LK66l5p4O8j86Q7k10J37N3j63
2669D2O3k50L82k18K64l61K19O29o16k98J98L86m81k91M31M00m31%l70k14P93
2690B77o16L22j89l18P07m08j29K09K3M97m22J49n77M66k98M79n77K80L08o53
2710d70O37j84k12M10r4m46L29J04j45k11J00L13j88K31j2k4k04N9j0M86n71K8
$$ y = [184, 75, 84, 870, 460, 61, -42, -176, -283, -774, -312, 224, -557, -102, 231, -434, -614, -29, 80, -650, -226, 76, -81, -282, 99, 172, 637, -98, 264, 577, -84, 138, 286, 618, -245, 380, 75, -96, 330, 137, 215, -238, 1379, 410, 222, 291, -36, -305, 79, -160, 94, 6, -188, 166, -156, -625, -1240, -17, 141, -122, -652, 404, -670, -337, -593, -63, 411, -160, 131, -437, -68, 172, 212, -33, -88, -262, -106, 216, 253, -479, 134, -15, -181, -176, -122, -185, -114, 113, -34, 19, -479, 313, -62, 137, -203, 659, 96, 99, 365, 330, 256, 324, 138, 225, 15, 152, 205, 42, 105, -145, 237, 19, 283, -78, 141, 770, 154, -144, 54, 440, -41, -332, 99, 499, 68, 68, -302, -516, 277, -339, -17, -206, -524, 183, -225, -354, -145, -122, 375, -47, 102, -475, -9, -307, 172, -405, -125, 183, -470, 167, -17, -229, 181, 87, -359, -30, 74, -71, -282, -182, 131, -57, 174, 162, 138, -66, -7, -17, 469, -102, -74]
2732g4N11m33K52k65j81j4M21K31K70r68M33O96r74oR87j060K36L2J36n5m19L58
2754A14N40p97k19O28n4K00m85j82M57q09M68M53k44K06j54m78K80M8l3K76l12
2775i7q4k18J88K73Q9n23K31o7L46l19j60L89j12n77O40j8k65l42L25O58k56j04
2797cJ71m19R4k0K91L36rj14L2p13j56P00p68J004M5n50R7J96j81p9m56L62N70
2820D30m39K8L27o37N35J30l01J44k20N83p22k76N25o78P79Kl54P3Q6m48Q94n37
2842g6p7J17j92K62L08k62N2m65k88Q39o90P0J88k30M07K25o77J54m03R69m86
2863b55j40L64L8J12k33J61j62L1m28L92l2L76P8k09j99N26k8k66M55o36O0M89
2885D94m61O39m31k17K52OL11m53Q2O4K3n80J80O45m24L85p82Q12r37R23l98q7
$$ y = [-74, 437, 4, 256, -9, -190, -204, 217, 448, 718, -250, 183, 879, -95, -101, 886, -174, 62, 94, 230, 175, -244, 114, 654, -143, -362, 266, 212, 412, -73, -255, 202, -607, -139, 314, 70, 276, 122, -356, -76, -28, -61, 215, -97, -181, -399, -211, 62, 151, -372, -141, -208, 138, -181, -341, 48, -64, -641, -1, -19, -284, -626, -301, 357, 101, -3, 168, -251, -157, -177, 114, 450, 441, 327, 359, -354, -510, 190, -578, 426, 471, -79, 18, 214, 33, -46, -502, -140, 430, -9, 19, 346, -291, 244, 374, 73, 217, -3, 580, -142, -418, 107, -571, 208, 210, -144, -71, 15, -433, 461, -76, -153, -36, -228, 34, 342, 80, 132, -333, -621, 218, -472, -402, -214, -444, -37, 188, -489, -335, -738, 231, -255, -395, -31, 7, 119, -114, 47, -115, -84, -512, -120, -152, 224, 302, 93, -106, 420, 392, 126, 581, -55, 5, 494, 33, 672, 241, 24, 276, 282, 593, 140, 222, 286, 309, -271, -91, 554, 130, 515, -267, 545, -392, 531, 133, 46]
2907D6l84J018p71n6M98j292J543L49m90m1k54K55k84r62J764r16l48J78p36Q5
2927g98Q31J75m42N61n14K44p43M60Q3J57J11l91m88N04J41k57K10j41M96j96
2947Co31J094l60J67k00K6k35K41k18j96Q69q50K14O72o16J18r6Q1k39M19N5j61
2969A57K3L70j036M24J60m23N37k48K96L28q35L93J69k90k76K98O5k81l40o8N61
2990a6k89K31j28jN00l04L75l38k60M31k77m32J61K19j63L46m3L0q6k42P22r24
3012d88j7O54l72K20J66m42K22k22J88J70J0Q7k22J0N49n68m27N97m10L97rN0
3034A43L83m05n56L43M64k14L14j71m02K43m94M17N58l63J55m82N2K99m95PK58
3055E4j73l91N92k32N75k24l87n14O80K56k40j63R0P57j214N60R7Ml1m7n39O25
$$ y = [46, -338, 680, -91, -147, 351, -941, 602, 951, 461, 420, 166, 421, 137, -825, 939, 23, -325, -147, -883, -798, 33, 208, -234, 327, -187, 57, -686, -226, -143, 14, 125, -266, -754, -250, -109, -366, -156, -297, 199, 3, -628, 466, 106, 273, 73, 99, -136, 105, -113, -309, 560, -290, -76, 596, -20, 98, 2, 83, -156, 263, 318, 157, 180, 550, -486, -62, 98, -325, 212, -36, 260, 588, -247, 146, 315, 25, -251, 47, 112, -169, -509, -577, -16, -305, -74, -202, -203, 297, -7, 368, 30, -230, 201, -76, -508, -347, -128, -291, 55, 12, 42, -44, -286, 436, -488, -505, 149, -223, -3, 163, -279, -57, -279, -91, 79, 89, 176, -46, -36, 513, -55, -482, 115, -295, 102, 93, 143, 526, 121, -435, -92, 372, 158, 472, 301, -101, 142, -352, 65, 623, 260, 415, -67, -15, 284, -211, -204, 54, -119, -510, 82, -150, 425, 201, -186, -700, -20, 236, -4, -167, -77, 680, -534, 26, 123, 127, 96, 49, -490, 135]
3077A35m07M37m42K17M64j080N76k07L98j65J66l05M84j38Q3m85P3l9R54p05n6
3098d2L47n86MM54j44j16j27J27k40m9L67r6r0K32k53J70q5K18O17m46Q2L0p84
3121d10P22j99l22N19n38M31M69l78k12J98m58L48k74m30M30J35m3J75o09P82
3141C36r35P39k04j48j02K90J32K82j48k95j02q6J57k93L3j00N6M45l44K6N00
3162B39n33K35M49n05j62L70J04n9j92K95m43J18J82n91O60m69L82l4j46l4M15
3183B81n17k70O41O2R6m91L46L1n16M16r2L8j27O18m47J56P8R8m15M13n39N13
3205C73Jn43l1K66l13L43P9j03l02Q0N44m07k7j49k64L32K01J08J64Q1m45k92
3227c04P4J029j014J75k86k34L92K80m38N3K34p3p6J5Qj36P10j60r6k84M52l50
$$ y = [135, -272, 165, -277, -60, 404, -676, -100, -307, 91, -74, 92, -213, 271, 133, 216, -269, -196, -235, 719, 14, -42, 305, -281, -277, 177, 33, -83, -210, -83, -323, -372, -5, -101, -191, 41, -212, -42, -127, 91, 708, 262, 344, 374, -410, 312, 113, -209, 310, -228, 203, 672, 294, 82, 280, -178, 170, -104, -534, -104, 31, -12, 163, -446, 336, -599, 140, -64, -212, -314, -24, 108, 390, 242, -53, -155, -241, -84, -377, -344, -444, -388, 57, -287, -261, 239, -294, -59, 390, -115, -277, 93, 197, 138, -54, 241, -202, -84, 98, -493, 167, -302, 80, 46, -100, -134, 281, -236, -506, 135, 197, 293, -198, 148, 179, -337, 79, -13, 25, -102, 516, 69, 225, 303, 401, -14, 399, -140, 373, 374, -169, -200, 66, -247, 96, 175, 72, -230, -150, 394, -13, -40, -189, -453, -121, 80, 188, 352, 433, -12, -304, -230, 799, -215, -40, -326, -560, -168, 112, -326, -273, -39, -112, -188, -173, -165, -301, 409, 249, 153, -131, 321, -29]
3249b9K34k42K64n98K80l0Nq7L7K61k25q8Q30o15M66j77L7k12j20k6L00k46O10
3272F29n39Q8j3j90M02l2j06l96M2p7K18j6j28j66P95k70R9k53j98j03Q4Q9m39
3295d80J67j98q5O70L99p93J38l06K63M91n37N74k81k12L9j17K92P9l38L28j69
3316g6j00P7k01J72L76m65M71n31j43O31l03o8J93k0k54O04q91N59l2P8J83k44
3338A6j21M51l86j31O02o96K46M1L55Q5l02o52M47R3R43j022J89J03m46P8L99
3359B92l96K30k64qN06l24N04k86m32J73N87q06R7k81M90k34q0j6M29j55N8k51
3381a67N14j89n77QP02l27o9m31j9M00J65j14N37m05oM10n25K16o9p8K08l79J92
3404cm8J45K7O7j84L57k22j99J08K63r5m38P5L68J01n74M26n2l31K82Q1m27P85
$$ y = [-29, 205, -37, 227, -371, -91, -121, -116, -203, -166, 95, -130, -218, 612, -3, 463, 286, 323, 111, -9, -35, 265, 19, 629, 90, 178, 165, -25, 377, 345, 239, -157, -115, -192, 26, 10, -118, -284, 511, 241, 340, 87, -111, -214, -130, -41, -480, -313, -511, -596, 74, 473, -320, -182, -488, -225, 266, -271, 303, 22, -190, -151, -268, 24, 103, -235, 93, -76, -176, -99, -300, -128, 248, -217, 254, -277, -420, 211, -92, -160, 33, 13, -241, 363, -528, 31, -1, 77, 260, 16, -105, 346, -40, -171, 431, -265, -19, 22, 377, 462, 160, -492, -45, 48, 991, -31, 158, 261, -185, -107, 292, -104, 126, -138, -146, 360, 36, 540, 254, -178, -5, 582, -224, -127, -408, 82, -152, -232, -248, 181, 26, 84, -167, 347, 158, -419, -411, 291, -36, -105, -536, -555, -155, 10, -104, 433, 28, 22, 432, -93, 123, 54, -24, 184, -195, -3, -51, 94, 121, 188, 4, 361, 139, -60, 48, 311, 216, -222, -147, 221, 322, -252, 174, 122, -209, 73, 154, -273, 512]
3427E12J64m0p64l3L84k71J74J25l51L84m28J04o1P2r3N88n97P0L09L7o07l2N70
3450B16k9j01m50M80k56M28j84k09k30M86j95o8r3N3P9N21p91P79j87k01K50m55
3472a57l0o5M41l15n5m61M54M2M0O1L82L01n63L19l53j40N24o01J30K05j32l41
3494c14N0J093o93r0K22l57L48K46n3j49l27J11J7L38m0j8p1m31O74l42l0j46
3516C8N0o34O38l43j2K0r2J27j28P24n83Q0n3M44j68J5o48L21P9o5po7K99j68
3540a33m31Q64k56rj33M5j32M03o51L27L45m23K43k92L37k84J49L39j58l88j68
3561d06L95N57m12Q6l59K90l42O19q61O68J49o55K88L42o26O53l49n08M60M8M4
3582H1m17K04M60j73k72N02Q0L9n09j90j3K37k20N73m88R5J43j70k44M47J63q54
$$ y = [512, 676, 636, -128, -161, 223, -48, 126, 251, -100, 284, -144, -40, -101, -29, -122, 466, -131, -61, 248, 285, -322, -354, 216, 187, 86, -364, 116, -140, 288, 104, -105, -335, 151, -44, -112, -205, -152, -73, 448, -343, 436, 249, 48, 298, -157, -187, -252, 189, -126, -181, -642, -188, -146, -106, -45, 337, 638, 75, 394, 41, -99, 425, -176, -46, 159, 27, -314, -264, 829, 136, 46, 268, -89, 259, 505, 452, 303, -24, 87, 104, 442, 402, 384, 313, -118, 556, 214, 184, 38, 88, -546, 92, -251, -263, -243, -335, -208, -336, 388, -195, -115, -168, 276, 108, 123, -525, -204, -125, -190, -197, -264, 35, -133, -564, 300, 44, 35, -98, -53, -185, 218, -433, -106, 239, -184, 59, -233, 104, -180, -31, 308, 150, -238, -406, -11, 546, 134, 220, -139, 151, -191, 428, -433, 235, 384, -271, 17, 359, -267, 386, 37, -471, -11, 37, 81, -336, -132, 328, 155, -117, 385, 465, 504, -5, -195, -208, 29, -191, 382, -106, -11, 132, -38, -282, 165, 328, -526]
3604e26J94O9M43q63Q18q70Q85J46o13L52n33l61O59r9L70l48K76p36J106j91
3624A78m70J5K28N89J9m94L48o71r1Q67q59R53N77r27Q3n76P12o00L9L62m86M12
3646B08l81K58n3L6N5Nn1l70M22R7k78K13j81O01n47M68k51k83l42M12o29L56
3668b35J58l56L20J30m92O3M13l15M58k2j30K26l38l86M12MJ12k61L3J51M1j36
3690a50NR2k6k46J06PL6k95M93J29q5j26J1K21m71O92m22L79l60nO51p11J88j54
3714d1p3K15k24k81N4M20m26M31rq5O2L84j54L0o49L41J51p4N9n52K08K53p0j24
3738a54j80J57K98o2k8N6k03J29l74kO99p09O99o62O21n66L44r3j00r7m99Q00
3760G4k30J04j63m11K29L67j74K21o09k04R22m63K91l41K02P8K21J9l73J02L99
$$ y = [-526, -332, -263, 180, -683, 135, -735, 150, 296, -317, 35, -498, -859, -200, -299, 71, -277, -1, -737, 369, 178, -292, -277, -49, 540, 559, 65, 413, -258, -349, 518, -341, 612, 1189, 262, 345, -231, 481, -119, -80, 282, -204, 208, -173, 85, 32, 68, 123, 128, 77, -293, 129, 226, -52, 161, -20, 581, 34, 502, 251, -32, -374, 38, -591, -235, -77, -433, -113, 17, -475, -412, 1, -314, 144, 122, -8, 218, -120, -506, -94, -90, 22, -239, -206, -55, -14, -150, -145, -53, -79, -325, -219, -212, -176, -471, 22, 151, 66, -60, -49, 172, -299, 393, -29, 350, -10, -15, 636, -75, 113, -41, -114, 101, -123, -404, -350, 70, -356, 75, 66, -19, 43, 427, 273, 303, -346, -5, 146, 72, 131, -421, -213, 40, -30, -154, -334, -177, 121, 59, 31, 87, -116, 13, -361, -363, 336, -373, 326, -336, 285, -281, 63, -30, -130, -227, -726, 74, -156, -52, -215, -626, -397, -30, -204, 17, -592, -796, 126, -337, -46, -387, -185, -107, 114, 133, -240, -138, 261]
3781B61k86QQ2l63l3N90p6n65Q92p33L64l03j07Q44n40K55j56o1J76m36j4L77
3803A76Nk1K64m63N08m23J53n2o4N8l52N99RM5k97K42J87r04L55J62J65k66j24
3826c8k52R8M55m54K46j23Q0n25O57J59m25K56n81O89n01L88K2l7o73Q12n62K39
3848g0O4J50J37J65o44L28l88M57ll06L67m83L10J58j2k38r2l85O98n09J08K97
3870A09K09k11K03J34m65L32j61kl86J60M29n54P83m74k12L39J69m32J33j76J39
3891F6J4N5K06J08n55K89o26K26n7k40M85j25j48M1M52l61j37k07J72L02k12K20
3913c2q6n88Q77J37k02J46m15K48j96J8o6K18q41O12L5J74K27p0m82M1J56J68
3935G9j94j47P65j08p95P03n75k60O54j15Jj58N9K78p0j33n9r3M10m65Q6O15l08
$$ y = [261, -25, -17, 65, -298, -331, 259, 183, -382, 510, -223, 141, -162, -269, 575, 35, 290, 134, 73, 249, -187, -201, 176, 181, 160, 424, -39, 469, 46, 199, 147, 83, 141, -211, 388, 397, 442, 145, 387, 574, -330, 25, 187, 352, 86, -38, -290, -192, 263, -191, 55, -68, 12, -513, 144, 303, -122, 134, -447, 242, -259, 129, 151, 114, -559, 253, -309, -70, -6, 144, 281, 446, -198, 130, -258, 199, 196, -110, 257, -226, 84, 242, 230, -8, -100, -485, 213, -296, -188, 109, 318, 107, 310, 444, -21, 311, 150, 148, -238, -78, 351, -203, 580, 106, -106, 233, 402, -30, 103, -73, 66, 80, 135, 341, 449, -106, 183, -443, -217, -274, -514, -29, -154, -302, -261, 191, -170, -307, -514, -342, -40, -252, -32, -118, -706, 171, 308, 106, 252, -163, 85, -111, -93, -159, 59, -782, -170, -135, 39, 266, 196, -286, -245, -89, 79, -115, -262, 503, 395, -400, 303, -272, -532, 122, 7, 8, -150, -91, 187, 117, -16, -75, -168, 242, -223, -137, 478, 170]
3958A70l28M62Q0m63j36M70l27K83j57MO1j41J20k69J35n9Q3m4r3L19j01p5P7
3981G1K42k62j01k81N93o51m35J282q34J02K84j29j49J48j7q8l79J62N29k16K84
4002A55j21p3p4M13k65K26J82n80M98o97L44l19K14M36k01q1oO0j36J39o2J08
4024A60M5n43n4N22L43j50l25n7k38O48l61J20j53N1j62N44k37j21K81l82L74
4045C05k26k03L72J80j85m10q1L82Mk52j78J61J22N2l08L55J82n62J12J45j02
4066a35L06m25j90J76L02l83L26L13l42n72P12l01M95m10J51J41L7l13l5N91k26
4087B18j81J22J58k92j66K40k22L0J8k24L80m38M08k30J92M18o29J10K67o2K84
4108D01n96P13k63r5K36n26L88L6l88N4M6K41m16L29M92r68q1P49m48K12O6l17
$$ y = [170, -158, 304, 384, -79, -215, 255, -72, 211, 54, 58, 119, -22, 98, -171, -36, -95, -12, -56, -149, 170, 69, -6, 71, 313, 51, -50, -331, 262, -389, -824, 458, -376, -274, 10, -119, -268, -120, -137, -225, -604, -442, 87, -129, 155, 34, -39, -113, 300, 35, 261, 443, -137, 361, -336, 8, -311, -97, 339, 138, 57, 51, 111, -25, 114, 52, 160, 205, -338, -392, 130, 473, 323, -2, -59, -297, 351, -10, 110, -43, 8, -154, 390, 153, 32, 313, -69, 305, 79, -124, 248, 428, 243, -167, -248, 134, 138, -114, -292, -131, -9, 43, -265, 90, 272, -290, -178, -33, -135, 171, -254, -444, -268, 34, -349, -23, 290, -52, -624, 88, -213, 282, -128, 23, 164, 201, -112, -147, 444, 218, 37, 159, 317, 25, -141, 99, -123, -93, -75, -299, 81, -357, 51, -179, 13, 431, -198, -88, 179, 117, 401, -195, 518, 255, 160, 396, -130, 258, 294, -94, -40, 6, 247, -169, 160, 652, -316, -397, 352, -96, 116, 182, -135]
4130a35K11k8l49j11N54l78l46O93l9l48J27O7j53k10M20l83J74k96M56J07j20
4151h7Q7m4j44L24m41N52m74K39l00J18J0K18L82l72N7J76k94K12j94L31l03J97
4173B50J08k51k93k84K57O35m48rM17m20j56M15M2K43k49k61L9j23M8l9L85n9
4195B47m69K95L52k27Q2MJ8j65m03M96j94j71K1l73P5K18K53P9j54K54m23K50
4217F5k0J0j19j57O0J93m91O27N2l18p9L15oj54L27l35L9j56J02r7J24m19Q09
4240C72p01L70J18J02k59O44r08m7O99j9n19J82K53k81P6K0l4M01k83l26N9L21
4262B40j82n16Q73o3l8o9k77j8L07l08J98m6j04K42l10j14R0k16K32j58N64M6
4284C73k51k28k45lN12r50M85K96K97Km32J47j10K79j16J00k60R8K92p59M09j12
$$ y = [-135, 76, 48, -301, -412, 142, -236, -582, 111, 72, -276, -149, -82, -235, -445, -25, -408, -234, -530, -74, 33, -87, 0, -44, -188, 136, -305, 247, -227, 12, -288, -170, -160, 58, 440, 68, 125, 301, 7, 219, 25, 356, 53, 250, 358, 107, -186, -470, -213, 422, -26, -35, 382, -38, -194, 221, 263, 506, 257, -4, 35, -88, -40, -79, 306, 247, -222, 73, 425, 198, 280, 284, 302, 137, -266, 230, 36, -135, -114, -487, -412, -194, 59, 138, -16, 238, -185, 65, 45, 55, -64, -221, -161, 32, -459, 168, 220, -98, -177, 138, 132, -22, 305, -30, 9, -147, -45, -142, -18, -437, 372, -329, 41, 159, 261, 2, 646, -262, -309, 390, 371, -148, 34, 287, 6, 82, 102, 68, 469, 186, -140, -81, 240, 58, -458, 415, 352, 314, 245, -32, -50, 257, -51, 147, 101, -3, 239, -71, -185, -95, -311, -79, -237, 327, 373, 122, -106, -351, -354, 158, -792, -307, -11, 286, 288, -144, 3, -107, 172, 56, 156, -104, -6, 286, -473, -64, -176]
4306a76N0k9J6K87n73K30K31N4l38J08K86J49k84J92j78n09N56L47L72n55j19
4327A17K25m13K09p3J05L36p02N90m95N01o23J62O0k37L81j85J76K43m47M21k79
4348G2j75J75k79M27k33j15j66O84k09m38K71j78J58K49o00K49m52K22M91o99
4368e46N11o3K19k26j56R0K09K53m62J14N3j83K9j69M23j29J41J47k98K65q4m75
4390c37M44j99Q7J2j08K96j00r2N12m10j0j53M58Q2p96K14K23q8J23J23n04j1
4412b34N37l74M89r40K75L56P5K35k51k38j08M92m55K18l42M40l15J83J67m9k55
4433i4N03j47o23J97k16L27L58l02l73O2k56L24K50n31M19j42L41j67m48J4k96
4454h00P09M89O7o76N35o97Q75m98r4k73K91L23n34l08P29j94M65n4l57L98p03
$$ y = [-176, -126, -155, -139, 148, -425, -195, 36, 90, -248, -140, 146, 295, 11, 203, 25, -484, 72, 419, 791, 236, 117, 342, -71, 138, 65, 170, 506, -196, 394, -101, 400, -223, -61, -1, -238, 143, -42, 134, 377, -70, 351, 72, -103, 72, -207, 220, -13, -128, -294, 390, 181, -257, 14, -164, -6, 243, -357, -108, -560, -338, 153, -546, -35, -98, 121, -105, -261, -171, 38, 291, -171, -57, -4, -187, -158, -327, 96, -33, 108, 255, -43, 222, 138, -337, 107, -92, -5, 7, -101, 195, 95, 3, 515, 105, 95, -58, 400, 482, -314, -100, 123, 35, 158, 281, -223, -234, 303, -71, 418, -522, -247, 109, 184, 419, 168, -70, -178, 314, -141, 77, -265, 175, -140, 43, 210, 161, -94, 409, 262, -361, -164, -380, -53, 305, 3, -370, -308, -564, -240, 10, -521, -102, -244, 97, -70, -518, -504, -800, -91, 398, 465, -211, 324, -373, 502, 4, -90, -363, -72, 251, -283, -591, 138, -56, 409, 355, -2, 396, -307]
4475c07M12Mn14M55j5k58J30M33l76L90l45%k44J26O3L34K4k54k69k93J033r44
4497d15R89o2m22m52K34L72k70Ro03M64k28Q76l71j35O8M6k00K73K78m47l79P20
4519C45k46k57j52O23o12j58N25J04j61k30M13j88j48NL09o40O62m71K76j4j00
4540a15L60q7l47N01m48Q3j7N63j73n1m12K52J18j05m2j42L84k6k42K71n67J81
4562f1J63J38j43rp87J251l97j68J92l52K90K19m86P6L22m52p0M00k73K46m43
4583c44J99J38m38J46L30l08J96k40K52l25M59n19J025r16J12L58l1K03r1o76
4603d70J74j15j28Q39l63P2k64J96l6J64l41L88n71M40j75k85O00L71n72mK85
4624B05m76K24M51q17R01m81R9k98M26k54j95J44J81j70N32q4k28j72J20k73N
$$ y = [-307, 105, 109, -405, 50, 35, -223, -93, 340, -36, 354, 9, 9, -235, -109, -46, 288, 312, 58, -211, -504, 529, -415, 574, 512, 90, -362, -128, 244, -26, -17, -620, -156, -384, 492, 121, -14, 54, 100, -100, 173, 451, 4, -375, 345, 99, -158, -310, 313, -299, -457, 68, 172, 11, -219, 194, 6, -142, -137, 172, -468, 194, -277, -1, -15, -115, 245, 158, -189, 312, -136, -53, -70, 493, 320, 269, -143, 109, 227, 122, 80, -62, 322, 296, 54, 325, -242, -61, 102, 240, 97, 88, -699, 552, 155, -13, 179, -173, 117, 336, -150, -74, 248, -204, -274, 126, -147, 99, -344, -145, -7, -445, -299, 31, -277, -81, -321, -69, -394, 65, -454, 571, -345, -233, 125, 94, 297, 206, -470, -296, -411, -539, 300, -63, 9, -255, -59, -95, 69, -272, 116, -455, -15, -190, -475, 125, 496, -76, -80, 205, -271, -47, 404, -413, 488, 7, 106, -192, 234, -20, -215, -71, 110, -60, 472, 388, 160, -12, 108, -165, -160]
4645a60R4L59n09L23j36J26k95L05K3n5j88K34m66P28q92Q49m86L67j90j84K07
4666E4j39no5K96k47O1m51P77q34P10p14J78P6M33o72Q32n52J04J54mL25J91p46
4689b38M20k92J60j47M06K69j04o6k29j55m04J37m9PK56q8L77K8L1m3n07M73j3
4712B29m71J97J68L25o33L50j8m16L56p22P56K4j96Qk58Q94o21M85K12m97m47
4733b75M15J09K00l13j19o14k54J099K93p08l02L71n17N83n51N52N24j96k9q18
4753e50J14L69j97M94o35K95K30K74k30K38l50k92L38j71m4Q8n27P77J0J28R4
4774D53J44r68L21J25j3j79N6K42m7k6K10k31m7M39k72o00N07n3J30M20n64O8
4796A15K5L54o61K91m77M77j68J61k56j01O24m14k81L69l11qj28J03N20r4n70
$$ y = [-160, -66, 293, -216, 107, -29, 97, -198, 107, 130, 75, -113, 121, -345, 383, -509, 340, -146, 221, 31, -153, 54, -85, -90, -155, 141, -106, -45, -496, 281, -553, 157, -557, -379, -303, 130, -542, 290, -262, -158, -4, -8, 317, 508, -238, 182, -110, 50, -97, 309, 578, 474, 408, 179, 24, -380, -243, -292, -285, -29, -117, 260, 288, 319, 276, -231, 242, 229, -242, -45, 123, 448, -185, 165, 147, -269, 87, -635, 121, 145, -51, -43, -301, 593, -28, 457, 669, 172, -275, 140, 249, 449, 136, 17, -597, -851, 248, 541, -167, -469, -98, -615, -32, -583, -31, 493, 297, 268, -550, -436, -67, -264, 230, -405, -110, 120, 394, 164, 402, 52, -240, 98, -73, -117, -29, -556, 221, 231, 359, 453, 597, -371, -50, 75, 62, -117, -61, 181, 134, 108, 318, 87, 40, 479, 207, -393, 114, 61, 191, 611, 47, 115, 140, 494, -167, 124, -353, 124, -44, 117, -139, -240, 384, -30, -311, 58, -253, -261, -389, -286, 234, 140, -430]
4817d30K66K14k85M35N5k22K2j65n92J87J83N9q7K1O74k79K76j70K95m99K12o00
4839d30M48L2K4P4K50k69J63L0p89K82L14KJ99m92J56j24m83P05j9J05j54m64
4861d40M25N7p9K78O4k78k6M82l32l62K75k90K86L75Q8n79M7m24J40J096j068
4882b65P17l64J45m30J97j70m52J054Ro76O18k19k78L28n58j30K30N50l13P4n37
4903d70O15j83L42q52N82o64O61k30j12L20k90L51n13O01l30J39R4j32k97L11
4923e7o5M5O7M79l21j82M18k65n6N37r23N8p9k13K59K61J15k03P0J50j49M34l92
4946a2N05l86K31j85M5k28J79K40k17j37J10m9M31m56n03N43J9PP5j11j22K5j10
4969a06K61p12J02Q35o87R7M4L22m1mm00M6M70l75J95J48m58L65J34m55N8K08
$$ y = [-430, -164, 50, -235, 200, 255, 33, 55, -110, -702, -515, -332, -273, -360, -339, 335, 56, 332, 162, 457, -42, 170, -430, 18, 50, 74, 148, 398, 129, 292, 322, -467, -185, 129, 131, 330, -162, -6, -130, -613, 92, 73, 178, 24, -440, -15, 42, -37, 241, 305, 27, 1, 483, 151, -211, 64, -226, 60, 435, 523, -56, -9, -433, -293, 803, -265, 452, 88, 233, -197, 0, -170, -622, 432, 441, -235, 383, 164, -114, 214, -344, -474, -244, 306, -7, 67, -470, 145, -38, 304, -548, 34, -630, 31, -199, -311, 9, -281, 70, -443, 158, -172, -33, 61, -71, -368, -57, -122, -77, -10, 469, 148, -34, 384, 119, 63, 600, -323, -265, -344, -557, -298, -37, 78, -125, -55, 95, -54, 380, -12, 493, 107, 338, 153, 198, -30, 149, 389, 172, 35, 145, 96, 527, 71, -432, 111, 130, 137, 212, 101, -21, 4, -106, 155, -557, -455, 380, -307, -210, -166, 156, 115, 111, -289, -243, 227, -148, 47, 195, -263, 102, 236, -219, -161, 47]
4991D7k97L79l5k08l51O32L48p26j23j33Q95o85J52N06r83J312p92j93K15qM4
5012dJ67r8M46p7k67P7l21J46L09k58j08l7m82Q20j78l6k20L8N46j62m90J3nM78
5036B97j02p08L84J60J45J97m21J7m7j48N91k51K37o16P4O7k81N11kj40k33J03
5058a66k92J85P1K29K10m38M6p9K50n10M28M23k45M44q13j05N64l73M6J37K89
5079C01m25L69j73J12L59n92K73n76L45J65k6Q8k12L79l29k3K22O7L60p02R8m80
5101d00K60J40J83k60L52n00K16k6j22K16K18P4p76L37m0l56O52L14n30j13n1
5122b12M06m36M76n70L19Q1K53l65k87k52L18q1J74J31K09j89p6Q8K37M4k40J0
5144C8K37j78P5m15K31j11J37K50m55l6KM59j07k6k52J6L85k67k01M97o4j38O7
$$ y = [47, -250, 129, 94, -114, -465, 167, 515, -211, -334, -467, 428, -257, -105, 401, -582, 730, -62, -255, -40, -48, -4, 163, 65, 511, 434, 167, 244, -77, 69, 378, 120, 12, -25, -507, 313, 135, 99, -121, -83, 463, 301, -189, -176, -181, 297, 195, -513, -129, 31, 176, 373, -48, -31, -78, -226, 365, 114, 351, -265, -191, -124, -405, 106, 104, -36, -269, -166, -458, -273, -202, 27, 237, -201, -155, -234, 16, -494, -66, 357, 112, 556, -257, -362, 202, -171, -125, 12, 301, -124, 245, 72, 184, 543, -49, 224, -352, -7, 158, 132, 220, 8, 387, 58, 35, 257, 324, 684, -18, 80, -400, -140, 0, 183, -77, 275, -225, -9, -35, -157, 59, 277, 351, -425, -88, -128, -484, 168, 482, -48, -161, -212, 194, -242, 234, -336, -17, 64, 317, -48, -335, -587, -269, -350, -176, -45, 164, -25, -101, -13, 224, 268, 28, 38, 275, 97, 172, -243, -12, -123, 14, 264, -191, -227, -225, 234, 127, 101, -151, -135, 250, -17, -218, 279, 215, 77, 144]
5167A44O0l29N62k06J05J12p71L62k10l76N61l61L27P2L72m47J21r0K51l48P0
5188a9n93O54r6L59j30k05K83j62Pn02L77J9p30N45k02L69k97J14M09N8k03l25
5210b70m6K29j63J39J63n2p4N7JrN67n2k36l13J45J36j19K12J93o28M20j7j14
5233A69J28l7j27o2l12L73k45n14P75L8J64l80N80o71j56L65n42q1L41P8J41o5
5255d0j13P3k14R60q47L22L4k1J34o88P3M05j42n05K63n0J92J24K31l32j47M05
5277A17m63N01j8k42O8L03m87N84m26k00Q7r3n4L49l00p8k6M27m83J24N60m19
5299a69j30J25l23O62m53K68J00o2N7o7J72N67p19K90n05p3Q30p01k99K70k22
5320c82O46l79Q90r76J97k62N1J08m69N45j77K36L77Pl90K33n18N87l83j8J93
$$ y = [144, 204, -125, 437, 231, 336, 448, -323, 39, -171, -547, 14, -347, -20, 52, 424, -23, 98, 8, 259, -89, -19, -612, 42, -54, 305, 175, -30, 253, 91, 98, -404, -27, -8, -738, -193, -395, -26, -323, -209, 200, 258, 55, -270, -316, -87, -250, -111, 52, 0, -74, -17, -16, -25, 542, 490, 254, -59, 86, 222, 103, 315, 508, -120, 300, 283, 169, 297, 260, 133, 71, -241, 132, -113, -627, 148, 186, 350, -30, 550, -121, -277, 88, -454, -535, -194, -116, 25, -40, -153, -80, -294, 666, -181, 141, 175, 154, 288, -400, -327, 78, -64, -569, -306, -356, -164, -40, 191, -141, -288, 117, -346, 155, 137, -105, -37, 266, -221, 363, -63, -263, -176, -269, -323, 26, -274, -352, -378, 49, -434, -310, 250, -169, -299, -174, -497, 165, -288, -20, 80, 18, 75, 8, 180, 747, 28, 318, -187, -260, 570, -131, -430, -160, -382, 264, -115, 775, -201, -4, -266, -215, -107, -576, -31, -208, 28, 405, 412, 22, 255, -263, 324, -59, -77, 116]
5341A16l46q0m2l79J065j39J23k78N3N0l08k73O09l34n19k3J284n20O59o74k53
5362b09M19j311P58M94mKk38j85j20j16M77l4K27N27k07m54O26p90J207l36p01
5383C2K03r4j06k2R8j39k44K77o7M12p54N13J32n88L78K42l00r9Q77o16N56j091
5405d00R39n65p80J227l79l20N81k09L24r18K12Q8k08M13J16M6l88L89l98J66
5425f4j89K69m43K7Q26j16o94j29P47m02L0j21K32l52N25p39M09L65l99Ok2N61
5447C27J37m76j01K81k05K85l19L3J05n03M45k35Q1K73n10M32mR8l21M66j97K41
5469C33l71p7rL67n6r9L45m59m92N24J80j73Q5M1L27l67J2J3k39l6M95l1o64L73
5493B2j2k37M83p7r19J159o09P0j48J62J72j20J6k22NM23n22R04k82m41J46R3
$$ y = [116, -230, -310, -352, -731, 334, 195, 318, 40, 93, 143, -165, -438, 171, -163, -682, -705, 579, 59, 718, 44, -209, 210, -1101, -343, 151, 147, 149, -89, -274, -394, -510, -33, -67, 160, 687, 480, 26, 652, -138, 1069, 733, 32, 235, 141, 35, 13, 111, -28, -272, 5, -62, 350, -404, 109, 241, -347, 31, 273, -27, -126, 751, 135, 691, -400, 539, -26, -806, 421, 42, -278, 303, 94, 418, -500, -288, -200, -408, 5, 121, 167, -221, 168, -230, -64, -253, 16, -427, -400, 426, 310, -384, -513, 234, -168, -138, -259, -27, -379, 146, -593, -184, 181, -218, -212, -234, 327, 464, -12, -113, 168, -37, 248, -71, -38, 67, -436, 9, -226, -145, 128, -382, 50, 46, 144, -177, 289, 92, 333, -38, -115, -124, 243, 187, 88, 433, -26, -518, 6, 186, 13, 98, 139, 466, 99, 111, 124, -115, -151, 344, 313, -351, 22, 10, -227, 256, 179, -740, 419, -190, -120, -268, -106, 66, -54, -38, -260, -255, 168, -354, 550, 268, -173, -27, 66]
5515F6j60j36N77l98j0K76J27o15n6O63j87p66N67L82m01K07Mn44O06l62J99J17
5537A56k25N70r5k67J70n94j84Q55o66J26J43K78m73J89j63J29Lj66Q2K88k1k3
5559A12J49o75M60l5N1M23l43k47j4l26L62J63o86N06J15K48l62L8J90r1k35j96
5581c93J86K23j08J17Q2R1o66N53l28L93o55Q68n10m22N76k96M78j91k21J99l93
5602d17J27O26k98J1l4K21k91J62j33pm55k58J477n50L43l58j23k8J1M94l01q3
5624A36K71m94J55L48n77J68k32M66k04L66k44N22j107L88N37k33j49j75M38k47
5644A33N1l4j67K9K35K95p22J70l36o9L38J2r8O21l88L01j87j86j13O11m73j71
5666a48J16M1l45J72J84O4n24P81k80j68j23L02k78RK12L46j66k22K42p35N29
$$ y = [66, -94, -230, 347, -51, -61, 215, 342, -273, -329, 334, 147, -619, -52, 330, -71, 136, 140, -404, 202, -160, 39, 156, -69, 501, 406, 139, 309, -285, -469, 386, -280, -154, -11, 267, -206, -17, -180, -51, -48, -214, -132, 156, 135, 112, 261, -414, 46, 11, 62, 485, 142, -105, -119, -445, -83, 80, -606, -100, 15, 263, -99, -61, 129, 38, -197, -393, -207, 16, -92, 25, 107, 198, -468, 85, -243, 150, -505, 363, -147, -569, 7, -289, 189, -2, -223, -24, -417, -290, 336, 38, 49, 15, 236, -55, 107, -26, -33, -488, -746, 731, 181, 524, 166, 43, 15, 26, 520, 219, 136, 407, -87, 68, 416, -161, 7, -225, 241, 37, 403, 159, 681, -426, -38, 499, 266, 117, -58, 380, 133, 184, 150, -17, 12, 247, 542, -180, -10, -346, -415, -77, -65, -163, 458, 70, 371, 184, -2, -115, 496, 23, -148, -32, 9, -336, -164, 20, 84, -440, 341, 61, -107, -230, 72, -206, -197, 15, 361, 195, -27, 215, -520, 9]
5687Il2L49Lk77J76J21p81N37K29j92k85L86j81J83K46J2o40Om54L74K24L38l57
5710fj23K17p18M77j51J57L48J91k68k73j77Q5M22l29L98J30j044P61l49K89k85
5731b48o5j10q3J69L57k78P3K22o05L71J20O63j47p43J85M07K25k73k97j05j65
5752c27J97m0Q08q05M26j87p10K46M78q00O06M60p7k6m55M00l54R5K36k19l70
5773d18R47n98k64L96M20J08n96k19N68M7m61L64l86K25o65O26L41P0n44m45N42
5794E8J04J0l31m5N29m90L63k49R3J56o20P76r06j34R27j36m15mO27j86k35O5
5816d3l37O8K52p8J6j87pJ85M42m15L7J25l58M24j15J39L34p72N13M12o96L78
5838C17k34L2r32J180m39K78J40l73J40l65K9n9l80J153n91J12q5l15K19L2K68
$$ y = [9, -23, 326, 329, 52, 228, 349, -432, 105, 334, 142, -143, 243, 62, 245, 491, 503, -137, -131, -585, -211, 13, 351, -6, -129, 88, -630, -153, -304, -147, 201, 392, 124, -149, -326, -241, 181, -148, 250, 380, -664, 97, -252, 37, -248, -313, -423, -506, -337, 20, -258, -185, 37, -568, -197, -77, 586, 439, -304, -119, 288, 513, 240, -57, -162, -327, -130, -170, 638, -167, 259, 72, -638, -392, 86, -714, -108, 352, 275, 249, -206, 194, -160, -65, 171, -48, -418, 529, -69, -333, 63, 483, 591, -5, -224, 344, 391, -70, 294, -92, 133, -532, 94, 435, 505, -39, -484, 58, 162, 172, -159, -204, 325, -165, 198, -51, 42, 198, -422, 354, -552, -686, 241, 105, -310, -314, 313, 127, -108, -43, -380, -312, -60, -138, -122, -309, -316, -131, 311, -104, -67, 58, -300, 124, 9, 148, 482, -290, 223, 635, -61, 317, 83, 115, -817, 363, -76, 202, 342, -31, 109, -256, -227, -286, -666, 487, -104, 8, -77, -392, -173, -141, 127]
5859A27K85j20q2m7k14n1L79m93N6j10J62K27j81K93m55J62j44M13m03L9J78M9
5881G0q6q4J02o6J27K59k22o1j2j46lK29m31K73k44M61k7k67J54N6n67O25j71
5904c1L50L1qm2m28n3j85L37K21n72M27j14K08l64O39M7j049Q52r60N90M0j09
5926a73n1m3J96P5q7M85k11k27M30m69o5Q5l3j10L69n77L87J34k90j87O30Nk52
5949B1lM63n25j04L19j0j85K00pp42K60K19P5J54k12j8k62L18k88L77k85J13L98
5972B76j95Mp3j06KK71l96nL10j14J83k74L31J19o97J068p73j88M89n2m8k21L16
5995B27m93P8L82n04L01L11n14J87o0Q13n26j8O5j08l79K29J32j36k03P36l75
6016A45r00O78QQ8J13L46n88J69m26N49r2k28K08O8K69k62m77PJ9N43n06L79p7
$$ y = [127, 412, 292, 210, 163, -51, -102, 277, -216, -160, -270, -108, 119, -62, 231, -224, -62, -206, 207, -196, -157, 21, 70, -16, -100, 2, -64, 63, 322, 100, 39, 27, -119, -122, 107, -324, -51, -295, 166, 139, -128, 26, 82, -485, 140, -31, 319, 350, 342, 300, -128, -181, -366, -29, 192, -380, 47, -67, 141, -223, 416, 463, -586, 266, -694, -104, -64, -173, -224, -267, -71, 4, -83, 402, 191, -36, 394, -75, -140, -55, -88, -198, 171, -406, -19, 115, -175, -362, 268, 273, 21, 18, 481, -44, -148, 171, 161, -24, 176, 169, -573, -313, -94, -19, 135, -77, -95, -357, -39, -327, 50, -235, -122, 276, 81, 85, 12, -94, -92, 179, -217, -222, 88, -26, 157, -117, 214, 333, -364, 704, -69, -257, 232, 180, 132, -89, 227, -266, -188, 194, -310, -9, 302, -212, -25, -85, 728, 202, 184, 249, 141, -238, -9, 123, -13, -216, 520, 145, -755, -77, -69, 19, 132, 478, -110, 59, -367, 182, 90, -138, 70, 138, 407, 145, -332, -325, -306, 237, -269, 110, 33]
6039C3k29L88n49K42l65L93k07M15kl30o3L59K36n72J60M23k60k15J02J41Lm7
6061E6j86J15J50l09K89J15j57n1j55k3L05j67J99J7k73qK96k59k05K22Kl15R9
6084b43K32k8j73P64q55P1M79n91N49k31M77k85N3j67p6Q5q8L58k94j73L12l62
6106a86J19J30NJ9o86O17L44n63M39m06Q9K4J05j29k76L70K21k27J97m04J78K38
6128B18l29J73n11O40k96O47p52J34j81N12l4j30O3l23K58k22L12k31n9M72n44
6149a83L85j33j79M53j9n18M05J67o21P55l83k99M27J89n95k48M10J97R7l04K12
6170B15k81l44L59j04J94O74r50k79O50P9o4m71J93M49j74k45O51n90J12j10J38
6191A02j92J96o28N87j44j90N41n85L92j11K7M31m70m58L52j68N78l67N37l39
$$ y = [33, -196, 192, -357, -115, -480, -87, -294, 121, 119, -211, -274, 85, 321, -251, -91, 332, 72, -143, -41, 100, 103, 56, -130, -15, 135, -174, 115, 230, 73, 22, -133, -156, 149, -18, 181, 198, -75, -83, 213, -46, -251, -29, -27, -342, -243, -11, -39, -212, 552, -303, -232, 247, -344, 205, -26, 451, 166, 219, 52, -24, 61, -27, 331, 37, -136, 176, -186, -67, 63, 68, 87, -599, 18, 362, -201, 238, -168, -79, -55, 50, -79, -355, 15, 236, 9, 206, -198, -20, 218, -111, 62, -449, 191, -105, 542, -210, -76, -257, 255, 221, 91, 154, -169, 89, -133, 179, -52, -111, 361, -183, 202, 69, -110, 343, 324, -194, 211, 378, -243, 512, 129, -170, 257, 446, -149, -397, 13, 210, 307, 3, 215, -66, -410, -51, -155, 39, 713, -237, -516, 134, 213, 149, -322, -129, 320, 146, -99, 552, -38, 74, -36, 102, -90, 106, -522, 65, -79, -269, 272, -313, 79, -32, -5, 426, -44, -502, -150, -318, 260, -107, 430, 91]
6211I1J49R6n73L31k85L42k31j88M39J42k87j06R46r65K19K60m08k49K32j69J11
6232a03M91m32M6J05k18J90k31N68j8m74M37J09o83k26P88k94l31M33k9J19l20
6253g3J75j50J5n8MM1o4K9K62k26K68r8l22P2q2N10n53M68l62L66o27J10L91M3
6277A39m64l3J47l8l4J20N3O6m68M00M12j79n71M49N56m76J07K16k76J11J74j91
6299B20O1j21l03N09k83K02o27M00K85m52K38k10j35JM97m15k22K60K01Kl02k5
6321b19L20k1O04p25k04L37NK19p10J59P32o24K01o1j49R8r7J98J02m68K89l68
6343c82N83l90J76j95K82k10K63j60j0k29j27L38N3J62m09J72k5kj15Q7L13J1
6365A86L2k2r0l7k43K23k11l52N25k91J75J47m5K82j58k71J47K85k17j37K79J17
$$ y = [91, 240, 336, -237, 94, -191, 151, -80, -268, 171, 313, 26, -80, 866, -99, 120, 380, -28, -277, -45, -214, -103, 388, -44, 2, 107, -111, 79, -152, 416, 398, -76, 361, 470, -213, -439, 349, 55, -276, 157, 128, 247, -73, 102, -48, -33, -91, -87, -46, -110, -81, 181, -45, 223, 125, -197, -125, -207, 303, -250, 218, -144, 222, -405, -295, 96, 139, -325, -358, -211, -249, -283, -163, -110, -44, -512, -112, 300, 121, -450, -1, 555, 79, 186, 402, 126, 237, 411, 220, 281, 160, -143, 366, 83, 285, -342, 58, 343, -109, 129, -81, -216, -215, 282, -133, -355, -95, 106, 108, -194, -219, 101, 80, 684, -41, -245, 92, 97, 316, -394, -235, 497, -127, 74, 13, -136, -38, -135, 63, 165, -303, -14, -382, 201, -189, -13, -208, 74, -136, 127, -33, -43, -272, -399, -61, -8, 154, -255, -83, -108, -110, -225, -138, 175, 186, 218, 196, 106, 69, -174, 49, -162, -514, 11, -280, -105, 42, -3, 279, 121, -150, -3, 282, 65, -72, 207, 324]
6387C24k31K47k48J65j06k15P29m79m87O27n47N41m65M04j70j4l15j32P28k21
6407A35l23j98K85K4j49P1j88P48n48l18n1P17k20M47q8j066N35O7k88N76k72
6428a04n54L26J62Q6N1J51n3k19O38j81p5J62o19l7R55p39M83p51L3J57N03k96
6450G9k39N02o87L49l25N45J26m45J14k28R1L55R2n30J59J3J34m0J24L44n09k93
6472b69P9P17m15l29J6M20k09M04j36q6jk04j2K33J0n97J57J58O9j2j9M01o57
6495b82P93q63J39L64l07L16k38l37M44L26m71J28m19N92k91J71j66j08m9R3K44
6516G9K76k50l01K75q6L3K04j26K92p6k02m39k90L64Q01m32L79n4m24J77l90J32
6538e8RJ40q5m58M22L6p7j46K2L38n07Q38o53K00J63m10M45N7l28N4Q1KJ30l19
$$ y = [324, 93, 340, 92, 257, 151, -64, 665, 186, -301, 326, -221, 320, -145, 259, 89, 75, -240, -372, 356, 135, -188, -386, -101, -77, -226, -155, -343, 405, -143, -461, -512, 205, -15, 432, 344, -722, -187, -120, -408, 168, -104, -658, -332, -170, -84, -33, 118, 65, -154, 484, 303, 228, 390, -229, -266, 689, -50, 433, -318, -285, -128, 375, 79, -160, 342, -345, 4, -321, 224, 350, -95, 19, -209, -118, 237, 329, -201, -42, -29, 105, 65, 189, 533, 24, -269, -190, 527, 112, -217, -201, 219, 10, 414, 278, 192, 191, -13, -25, 208, 218, -379, -222, -64, 5, -7, -26, 375, -282, 511, -352, -213, 151, -156, 160, -78, -415, 29, 355, -116, 12, -407, 185, -106, 65, -101, -209, -258, -165, 79, 355, 105, -196, 79, -7, 26, 230, 104, 396, 320, 118, -321, -611, -247, 554, 122, 501, 447, 23, 200, -190, -58, -49, 91, 6, -452, -30, 6, -71, -217, -195, 143, -364, 474, -179, 21, 184, -226, 219, 276, -52, 2, 83, 85, 215, -104]
6562a04j03ql2j67K52j54L77J7j71L85q44J183o23O3M40p82J91l15k31P48j80
6583e8m0Q6PK5J95k57j99j24L87L2kj96K90m44N53j65k07N28k25k96L27O1j02
6606A76o10M5K44N52m61m32L05l5L22L24j88k18K19l86l33P64l16L3J18j38k3
6627c8n85L97M71j05m02J39M4K59k22k85L44L36o85N21l07O16n74j71K61n43N42
6648A3j80M01k42Q0k38L95l04k5m27O05k67N15m79k41L67J21j02K5K01k05j29
6669a16J05N2P9k0J89Pn27r1K32O9M66l29J14m21O29n25N54l57O9k18L46q6o40
6692d19O57m90p1j61L60J15K70l12j11J20J0n4j89O40n01J54j95P1n9O4L5O8O9
6715G1m22K33n2J54K28j65l18m1M95n11J04L47l9k99J48K07n12N06l11J96m49
$$ y = [-104, -207, -215, -247, -414, -162, -316, 61, 78, -93, 292, -552, 631, 8, 71, 511, -271, -80, -395, -626, 122, -58, -98, -12, -5, 20, 215, -42, -241, -365, 22, 54, 52, -144, 146, -298, 255, 90, -117, 411, 186, -110, 217, 278, 176, -434, -389, -145, 407, -54, -486, -181, -216, 106, 430, 242, 24, 243, -143, -476, 288, -28, 5, 123, -15, -38, -623, -226, 245, 140, -262, -123, -79, 180, -42, -327, 17, 353, -332, 189, -118, 498, -76, -247, 14, -529, 13, -167, 234, -8, 72, -166, 229, -75, -100, -527, 78, -189, 326, -153, -394, -27, 94, -8, 17, 218, 13, -116, -11, 41, 120, 100, 289, 296, -231, -322, -90, -21, 445, 116, 230, -191, 438, -87, 467, 110, 179, -39, 307, 221, -419, 238, -252, -323, -484, -124, -9, 261, -51, -162, -42, -32, -86, -275, 365, -136, 18, -177, -106, -165, -101, -66, 2, 71, -351, -118, -170, -16, 212, 47, -271, -312, 183, -328, -224, 123, 84, -215, -67, 140, -372, 134, -177, 19, -430]
6736d30L13L79O1o82M51r5L08m84k57M87M90l39m07j68K18j15M98n87Q30l28k90
6757a47J48o7J78p00K13J56M15k24lk13K64K33k97K9M9j93K48m27P8J82J87k8
6779H1Q7j69K51l53L72m52K05j54K03k12o0K53L41n02n2k89N81J0J69j66k77L23
6801A90j06k73K0J86M1q6P3K53p6k14n73J38J70r4M63N4K1k28O2J13k76N24k32
6824A50k2n4p25O62k20K12K19l47L50m41L48k87J20L12o54j21Q26m65k9N10l61
6845a7L01k67r4n8J25K0m3P0K79m42j16J77m63Q39p6m35K32q6L97o64J62O2P6
6868b1n24J33R9M24m32M06j0N61n13nl92K7r9M59L02p2n23J5P11r19L33k81j68
6891d89R06j79l75L50l04O8Ll14N61m07M18J33o83O44j94o08Q4Q5O15j58m63p5
$$ y = [-430, -117, 262, 323, -359, 92, -3, 305, -179, -436, 51, 541, 202, -205, -373, -155, -270, 228, -359, 471, 143, -147, 1, -66, 112, -588, -375, -219, 196, -28, -31, -244, 20, 253, -44, -15, 34, -159, 89, -338, -260, -78, 109, 81, 168, -1, 250, -103, 269, -183, 22, -132, 71, -141, -201, 52, 393, -109, -161, -450, 131, 141, 310, 144, -133, 190, 84, -189, -169, 17, 58, -28, 45, 298, 222, 8, -565, -427, -257, -351, 112, 166, 187, -41, 21, 134, -142, 382, 150, 128, 74, -651, 11, -209, 3, 222, -125, 225, -216, 132, -155, -35, 277, -377, -498, 328, -137, -166, 344, -17, 284, 17, -77, -135, -10, 10, -33, 37, 316, -126, -242, -65, -528, 311, 235, -200, 32, -54, 343, -321, -159, -97, -21, -545, -412, -313, 111, -321, 85, 75, 636, 123, 118, -274, -247, -346, 113, 415, 343, -180, -165, 546, -373, -40, -321, -489, 417, 238, -137, 213, -91, -23, -20, -334, 227, -180, 238, 371, -312, 332, 138, -470, -386, -301, 314, 156, -307, -382]
6913c82K18J57L8k13j09R20l58J0L64o25M36n35K95j24p76R30o32P4R59j153m51
6934i57J780j173O0m4K87n72M21M96j014J109l60o73N52l1q69P03J4O2Qj16K20
6955i7N9j26N72J98l83l78l84M57Lk18J44m4l61J025k39J36j65p05O94o30R40
6976D98k39j28N71n80O4j91q6M75p47K18l49Q84l62l07M91m98M67k04L93l04J17
6997A83r1l99L60J01O3j90M25j35p35P19j90j48j04k78K95n66M63L90p41M60M14
7018B96j06L31o96J64J28M1l46Q8l14j3J19J39J44M48n32J0J80l55j93N10o0%
7040a7N87p42O9J39L59n35N48k58L15m12J58j15l07K96m28K35L60k07J66J50J26
7061D87j91l04K5n05P5K81J77K02l73R8k11O7J43o4M33n55k25O47j01K87r42N29
$$ y = [-382, -164, -7, 31, -182, -291, 629, 271, 281, 645, 20, 456, -79, 216, 92, -684, 246, -386, -312, 647, -506, -957, 823, -350, -290, -334, -47, -619, -198, 298, -716, 393, 33, -640, -88, -119, -988, -285, -271, -209, -201, -317, -97, -38, -164, 408, 606, 223, -155, -539, -82, -79, -297, -153, -197, -558, 467, 228, 364, 199, -506, 188, -442, 498, 259, 131, 702, 122, 186, -5, -91, 384, -363, -145, -494, 390, 28, -279, 212, -286, 181, -23, 370, 66, 183, 92, -307, 53, 154, 217, 27, 452, 317, -418, 301, 111, -37, -141, -419, -124, -690, -227, 163, -578, -118, 296, 190, 521, -175, -11, 117, 158, -188, -100, -414, -427, -308, -169, -25, 423, -109, -99, 81, -274, -467, 43, -17, -17, 570, -172, -103, 36, 395, -140, 408, 150, 465, 53, 211, 96, -211, 85, -343, -108, 252, 45, 211, 361, 487, 296, -8, 17, -488, -413, -132, 45, 247, -126, -28, -239, -172, -29, -93, 340, -215, -440, 207, 106, 393, -549, -20]
7083b0K98j22L88o00M39j065J221n18N84j028o2l77O61l55K61o0L19K77n86R16
7103E71q42n02P22K15p22O10j17%M02l37k35L20q6q7j38J17k86L98n91M05J64
7124a9K46j71j88O9j53K00K03l14n69O80J32jj86j11K56l58K02L85L5K37p60R14
7146G29j273N76K19k17q8J51l94R98n75R1L02j387O01o74J127m68Q60p36O3l8
7166a33K52k26Q0K69N0n88K38L04j80k26mq1J05q8J01pl36M93n98N54M4K18j52
7189H9k46K20l21L6p5J94M36l19K6j86l67J47N67k45N96m91j13M4M5kK21l47M22
7212C31n78K17M33n18P01l14L64l95j31O2m30L29k28N2P5q48J078o0l58L17q3
7233A6L7m20N35M1j1j03k81k18J26L14J5j27k60L35k88P27p53L96l28O08l69m61
$$ y = [-20, 278, 156, 544, -56, 383, -682, 539, 21, 605, -423, -485, -862, -201, -556, -295, -355, -36, 241, -345, 571, -271, -773, -51, 164, -558, 52, -65, -65, 337, 0, -235, 85, -1, -88, -226, -109, -395, 3, -588, -183, -19, 227, 56, -132, -63, -216, -16, 187, -127, -696, -16, 116, 115, -71, -182, 74, -284, -82, 303, 338, 575, -185, 729, -544, 32, 251, 34, -54, 97, -297, 701, 126, 217, 519, -868, -267, -941, 186, -282, 578, -158, -95, -133, 119, -107, -27, 242, 292, -296, -58, 246, 66, -160, -164, -245, -140, -228, -127, -134, -470, 23, -575, -21, 23, 241, 89, -157, 63, -258, -222, -297, -103, 333, 14, 40, -146, -513, -366, 201, -44, 552, 61, -52, -8, 37, 35, 256, -91, 331, -247, -30, 403, -115, 586, 272, 636, 241, 110, 172, -258, 71, -157, -105, -30, -878, 200, 140, -218, 99, 16, 53, -367, 168, 209, 198, 95, -186, -404, -278, 36, 51, -76, -336, -1, -289, 438, -315, 81, -247, 361, -8, -469]
7255d69O15o21J252p79L35J05q88O83k8l97K93q3k67O5k63K92O6n37M08M12j83
7276A1J5K8K87j20m91N33j04r4j35L55l73J56qj05J43k13R4k34O86l95J26k03
7298d1J41j71L39l14j51O55l70L62k64m62k66N64J75l15k80O20p41K19J15o8N74
7319C21j04l40m06P86k43l72J91kK84q9m1O8k44K61K7j00P8m12j1K46K0M70n44
7342a56Q1L48l67K46J60L6P4n39L68o85N78J61p39M94L16k72o5P5j76K62k05J82
7364A77o0j38q1L13J0j96M43m60L6M58o48M0J30K47k41mK26k8j00k22P4J78p0
7387H4M00l28l65j39J42R9j0K13j91L50k18k6O4p2J97l7k83N2R9r7m09M23O45
7410E93o88k2m80L81J89R3K98o30L16j4k58K86k81J85j11j00m5J34L16q1M5l52
$$ y = [-469, 146, -475, 777, -2, 333, 438, -450, 233, 205, -192, 101, 18, -249, -184, -447, -155, -89, -626, -218, 194, 11, 26, 54, 341, 221, -270, 263, 159, 65, -70, 285, -88, 68, 60, -45, 98, -115, -21, -255, 431, 36, 162, -41, 100, -71, 268, -46, -197, 458, 88, 450, 186, -276, -542, 22, 197, -118, -398, 222, -519, -300, -185, -253, 321, 217, -123, -529, 257, 14, -358, -167, -169, 115, 26, -15, 53, -191, 70, 97, -3, 75, -337, -348, -102, -82, 388, -156, -75, 273, -94, 152, 312, 348, 422, -117, 251, -434, 144, 305, -434, 60, 376, 104, 39, 114, -62, 200, -5, 177, 117, -21, -102, 211, 221, 25, 468, 8, 44, 502, -146, -106, 24, 271, 30, 26, 252, 224, 124, -98, -24, 154, 84, 484, 156, -209, -348, -206, -107, -117, 96, -95, 255, 37, 11, 75, 3, 200, 163, -120, -68, 31, -66, -475, -52, 593, -95, -117, -597, -216, -27, 66, 364, -266, 50, 36, -222, 64, -217, -32, -143, -243, -288, -154, 162, 81, 126, -226]
7432b26R0K98k16Q9j91L92j32l29K85P9J31l79j82M67m29O06n71L60j32J30l50
7453b10J37L71k84L29p79K94K87n85N02j50r4j57n0N74l3j16J43l13N99n58M82
7474C89M7m92kn1j12J92n89P62m31L27L5o9J03J79k54j17l89J85J83L07Ml68L62
7497B01k85l07K25L31l20L48J88m06o88J081j09r36M80M95m63j3K71J38l85K45
7517I1k29L71l9Q2l57M13m56M49k98j51L37R6m7n21j25N33j46j07q8K33o5J49
7539A25K55n10lL00k29L7K23o32O81q6Q2k03m77K94k84K82J84k03k37K59P3l43
7561d12K44k6L1L9K06o5j28K90n95N20j51L60q6J23p53P00n61P30m43K35o02L99
7583E5j20J84K92o21K67n9q6K07m26K04n5J59O23k80j85J83n4J1J42n24l4L99
$$ y = [-226, -136, 162, -54, 35, -156, 236, 104, -225, 60, 139, 270, -109, -291, 176, -253, 353, -218, 142, 10, 140, -210, -73, 298, 14, 343, -436, -142, 145, -440, 62, -88, -182, -339, -389, 185, 152, 36, 179, -134, 465, -93, 389, 436, -56, -58, -109, -221, -29, -618, 144, -287, 40, 75, 6, 109, 288, 34, -83, -472, -287, -104, 203, 207, -161, 201, -84, -391, -166, 165, -155, 193, 381, -25, -713, 368, 259, -677, -197, 298, -165, -178, 93, 231, -154, 91, -138, 233, 194, 276, -81, 332, -124, 325, 27, -124, 213, 309, 262, -259, -384, 149, 3, -104, -192, 41, -24, 125, 380, -130, -133, 167, -62, -25, 198, -434, 247, 161, 243, 40, -437, -143, -427, -145, 39, -164, -401, -142, -69, -412, -168, -194, -163, -124, 82, 17, -111, 179, -416, 104, -47, 313, 227, 350, -403, 297, -264, 466, 23, 258, -344, 55, -65, 119, 411, -210, 57, -2, -88, 119, -307, -103, -158, 1, 624, 344, 159, 342, 288, 299, 441, -83, -117, 282]
7605B82k88L35m64O46m83J22j84K56R9l65P4n5J28m98P43j134P47M94k93l66k71
7626d75L25J86L00l3n98O31m6n04j91M93k40L28k68J04J20P2J97m83J08l16L83
7647I3k78M24k89M31J07j010R41j03m4o89J41K08M79o59M5L41j28O8J78k36j00
7668h0N9M22r4l52P5L3l94P8J96kJ63p0Q68j310N62m5m78J50M66m55L21k82K4
7691a45K23L86n40M08q42R80NJ8o19M1M43l50J65p15Q95o42M93m40P57o26m25
7712e30O07MJ65k8j03k84L66J13o05L43N4J24p3%K3l45R7K55m72l0M41k50J20
7735hr4R9n5k11M2M71k10L30k67l42M11k63k98L89K56l07K8k21j35N22j11o0K66
7758B32k08n55J42O63k27o8l03N91m90J23J66J1k70L66j61m82O26l42L22q2Q4
$$ y = [282, -6, 329, -135, 511, 28, 150, -34, 222, 321, -44, 30, -25, 103, -395, 348, -786, -39, 455, 162, -204, -475, -150, 36, 336, 303, -295, 336, 290, -214, -405, 88, -152, 176, -92, 12, 132, 204, 401, -82, 26, -290, 93, -185, 239, -50, 381, 488, -522, 419, 316, 272, -417, -276, -68, 411, -248, -203, 138, 10, 78, 256, 20, -80, -21, 401, 307, -45, 30, 63, -331, -253, -57, -59, 104, 34, 902, -408, 154, 109, -369, -219, 247, -208, 113, -169, -145, 78, 464, -76, 332, -510, 470, 475, 493, -126, -85, 358, 8, 173, -542, 353, -289, 204, -236, 521, -105, -530, 77, 81, 246, 218, 115, -169, 197, 310, -295, 48, 102, 226, 153, 153, 176, -169, -72, 183, -289, -319, 122, -128, -8, -102, -3, -58, -269, -227, 244, 34, 364, 97, -245, 166, -97, -395, -6, 250, -57, -29, -250, -385, 137, 26, -34, 232, 24, -531, -389, 274, 47, -21, -324, 267, -223, -100, 66, 77, -193, 173, 12, -470, 156, -186, 136, 54, 138]
7779A38j50m21J05K27M48k39k53K76m72N84o1k65L45l77j17K4M08l14N90k27l70
7800a21j5J20L33J85q0j87n43O08j05OR0l26Q6r7L90k03L31p55M08n47M79M21
7822D78j38J29p23N45q9M18n58m51N54j70k54O30k92q39R17k48N58k0m30j51M45
7843C11m43L20n13M76n88N50L73m49m16R73k13r0l18n11N09m11K88L57k41J27
7863I1r18O86j83K47L91m03m69N03j61K02K74m00J64m51n64Q70Q2N6k34K51l56
7884c22p1N73j51k83m61M99k08P06j55j00j16j62k26P93m59J47J44J84k52j51
7904g1j25K31l73M58j77O2k59j38N56k29M6jP9m48O77o62L4K17N5j19L73l9k21
7927g4n4jO4K59L24l49M8k96M15m96J49k00k36k2Q84m77m38j37O63k06P40j066
$$ y = [138, -12, -433, -328, -101, 347, 108, -145, 131, -341, 243, 182, -83, 262, -115, -232, -208, 200, -114, 476, 249, -121, -136, -16, 317, 502, 422, 235, -308, 300, 195, 201, 291, -35, 51, -46, 344, 141, 472, -283, 125, -422, 57, 478, 340, 469, -254, 291, 202, 620, 62, -389, 165, -5, -259, 371, 79, -760, 157, -91, 467, 447, 17, -134, 311, -132, 188, -325, 151, -437, 113, 486, 37, -379, 594, 381, 291, -27, -538, -29, -440, -152, 205, -36, 91, -827, -141, -324, -77, 314, -89, -558, -55, -216, -14, 260, -140, 24, -427, -991, -121, -39, 17, -217, 34, -322, -393, 180, 29, -254, -715, -216, -424, 282, 127, 27, -89, -251, -477, 316, -143, 4, 148, 332, 80, -71, -196, 35, -338, 120, -57, 5, -254, -392, 164, -65, -19, -20, 59, -389, 288, -374, -340, -123, -68, -187, 186, 147, -74, -128, -129, -65, 194, 518, 169, 217, -79, 336, -160, -11, -211, -447, -469, 415, -62, -500, -637, 26, -180, 560, -506]
7949e06M49J056j676J251j397J645q89L23n3j195N0J908j570M8J169n97n7M40
7967C99q24O66o24N00l48M16M7k01J52K04q20L96l18O53l53l44R93r74K13QN10
7988C51k79J2l4m86J026k56m25l87M23k18M59k3K10l51l05L12J42n47O21n3J58
8009C50j65M19n32M14m33k45K85m09N03l07M48j93k88k5L3j02l86N55j04K68j83
8030i7j13J87N3m97j34Q52J0j95O8J35j58l13L01K81j07l33M78m06M79k92J26
8051C25k90J31n05j39Q02m66O68n82K75n89J035j165M36J95m64Q43n22q2l9j11
8071b44K61M5K71n02M35M0k02j84k65N65l17N88m74L46l16j15k50Q4K20k98n2
8092c64J57j48m71M21P05L06J8m00j69J8n66J36J34q70J142l71J078p41j20j28
$$ y = [-506, -57, 999, -677, 574, -823, 822, -67, 256, 203, -992, -942, 966, -604, -556, 613, 16, -41, 399, -425, 241, -383, 117, -231, 185, 232, 31, 183, 387, -433, -37, -355, 298, -55, -399, 594, -380, -167, -159, 351, 72, 84, 50, -436, 590, 334, -91, -478, -55, -273, 186, 163, 373, 22, -283, 29, 171, -376, 245, 192, 350, 185, 604, 72, 486, 53, -192, 93, -316, 187, -120, 328, 135, -153, -178, -145, -247, -633, -78, -182, 86, -97, -210, -23, 30, -467, -601, 251, 261, 66, 134, 269, 111, -202, 99, 380, 273, -60, 418, 12, 491, 199, 325, 35, 166, -339, -478, 324, -142, 526, -56, 219, -370, 665, -500, -64, 131, -333, 510, -12, -94, -133, -244, 17, 62, 333, -169, 266, 306, 104, -80, -345, 220, -97, 491, 17, 363, 47, -68, -318, -234, -14, -312, -364, -207, -355, -826, -405, 300, 606, 624, 224, 55, 73, -493, -357, -223, -1093, 49, -322, 756, 15, -105, -233]
8112b33M66k79nJ80J33k44p8k51Q37n66J22k26l50Q39L26o06q0k51M94k93Q9p8
8134e4K24j36O1M28m31j97M54j41m82J58J38K82J49m00j25LK5k49J68K54o03M72
8156bn59K72K25q6j7k9l3J93O3K84k3k18j02j53k6k91P27j81k85J95L16J70l49
8179I1J49n48P41p36J61m2ql00P06j3J5K09
$$ y = [-233, 233, -46, -51, 129, 262, 18, -60, -311, 526, -40, 82, -144, -494, 345, 671, 65, -15, -266, 228, -65, 24, -54, 170, 34, 95, 523, 92, -105, 349, 208, -274, -116, 22, 304, 453, 53, -72, -69, -44, -293, -125, 129, -474, -2, -561, -289, -64, -150, -167, -196, -229, -36, 27, 311, 288, 70, -32, -185, -211, -502, 225, 44, -241, -46, 270, 440, 91, 240, -308, 433, -303, -142, -184, -192, -492, 214, 201, 216, 425]
8191D25
$$ Imaginary data points
##PAGE= N=2
##DATA TABLE= (X++(I..I)), XYDATA
0@%%%%%%%%%%%%%%l2O4o4O4o4R6j28J28j60J92k24K64k96L52m16M80n44O19p15
33c84Q12r10J028j160J306j465J638j830K033k260K513k777L069l391L738m123
49b163M541n001N515o074O692p383Q158r033J0031j1176J2503j4067J5943j8252
63i766K1163k4962L0164l7804N0259p5265K24791m00328R3008M07934l91126K03589
75I1657K0944j87472J05889P3052n1687r2017k8243J50772j07963L7302O3406
86G5640j96528Q7210J03466j53855Q0181j9087m0150J14402r0255j6214O9295
97A4105j11463J01508N0341j46731N9188L6996l0943N1309o2482p764L7740j3041
109b1237M9697o8850m1269J26644l7054m9603L4994m4445L3082L5400l0532O922
$$ y = [0, 0, 0, 0, 0, 0, 0, 0, 0, 0, 0, 0, 0, 0, 0, -32, 32, -32, 32, -32, 64, -64, 64, -96, 96, -128, 136, -160, 192, -224, 256, -288, 331, -384, 428, -482, 546, -614, 692, -773, 865, -965, 1068, -1192, 1321, -1456, 1613, -1778, 1960, -2163, 2378, -2623, 2892, -3182, 3510, -3873, 4285, -4748, 5283, -5893, 6610, -7457, 8486, -9766, 11397, -13565, 16599, -21205, 29054, -46211, 178580, -221748, -128740, 279194, -111932, 91657, 112601, -74871, 31018, 104070, 52383, -39634, -67877, 82895, -25068, 12234, 75640, -120888, -33678, 69788, -84067, -3886, -22973, -63123, 51279, -38976, -55190, 14105, -97358, 4150, 54491, -92240, -33052, 3944, -26999, 24310, -38172, -45936, -8196, -21237, 28460, -40390, -81659, 44985, 7931, -41672, -6678, -51123, -18041, 17359, -13173, -6251]
121f251k2204L6046K1883p9724M4280K3859n1295Q2840j3528q8717O9913K4189
133D1291m2956J1841M845J1804o665o840J9289m9938m563P7797k7811l1943K3216
146A9367k0690Q886J4602k3564j1723m410M3594P039o8261J9851K1251k1449L4332
159A8825j8420l2954K4276R215J2280l6283k0046O2344k2241k1904M0068m0021
171b4861n860M5643j5227k0145m32J5839K415j0291K0781k5007j2254N2122k1324
184A399k9873K1116o8J3286L687j6405j725p477K7189P037m0083K2168K0736j8465
198B522J0259o747j6407J4551J6703K525k4076J340K5792k0658k717J9826k3600
211f87P253K7199k0178j4890O463L937j62o62R170j6868q628L7920j6527m0009
$$ y = [-6251, -28455, 7591, 29474, -50250, -5970, 17889, -33406, 49434, 35906, -52811, 17102, 41291, -1665, 10176, 15021, 26825, 20160, 13320, 32609, -17329, -21892, 55905, 28094, -3849, 19367, -1323, 7563, 22165, -1399, -13122, -17532, 26062, 33101, -35160, -15309, 5942, -15507, 18825, 405, -32549, -8273, 942, 13222, -23061, -43107, 19237, -3004, -24908, 15160, -24861, -30721, 14922, -305, -20450, -20882, -5043, -2628, -12919, 7862, -17145, -29399, 22723, 1399, -28474, -7358, -7426, 5860, 9547, -6858, -8583, -16060, 11129, 18166, -21917, 251, 20987, 2522, 12781, 6034, -10373, 4178, 20881, 23406, -670, 670, 26462, 5804, 3087, 22913, -687, 6566, 33765, 13587, -1303, 5160, 9097, 8935, 8273, 17443, 575, -8053, 29867, 13340, -26669]
225b6669L3115J1261k1732J1257n525q915P773Q10J0325j8970j3857L6322p263
238G932k3210J4611p857L45J6244j1114j2012j039J9845K605k8570J6845M165
251a210k4889K9943l233k8661K4214K284o411O169j6412P206P277j922J5689k1852
265a1808m962K9596j2787r407Q106k486J1231J036l382n606r988K2888K077k0531
279f023J2738K9l817J5501j6069j0721J7772M330m351p150M624L328j1276J1828
293A0743O265k3564P678J9480j2671r367N341r1n13N072n31j3627N38J9137n891
308G999j9853R050Q214j1178M319N385j6351J616K0888q772k0088J1553R759j4509
322a1968O517Q350k0295O048J8040j4676p964R506P94K295j839j548k460k846
$$ y = [-26669, 6446, 17707, -4025, 7232, 1707, -7208, 565, 1375, 11700, -7270, -21127, 15195, 7932, -15278, -667, -8524, -8179, 8065, -3049, -15061, -16100, 3745, 6350, -22220, -5375, -1210, -26099, 3844, 611, -28050, -3836, -1552, -7963, -1794, -18206, -11000, -3723, -5645, 10044, -11808, -16770, 12826, 39, -9368, -1262, -3748, 7483, 8519, 5137, -469, -10457, 12431, 14508, -6023, 6715, 6744, 2927, 18428, 2359, -8362, 9410, 13740, 9389, 2239, 6863, 10191, -1085, 10743, 17008, -6556, 1122, 20602, 7931, -1436, 3905, 3814, 3301, 8373, 7842, -5785, -5247, 13890, 7999, -11854, -2804, 5410, -5768, -1449, 3936, -12415, -10799, 10089, 1317, -18771, -7218, 2541, -11968, -5451, 2899, -17396, -11348, 6692, -7984, -15948, -6442, -5648, -3353, -5192, -6740, -9200, -12046]
336a2046J0865J198j1284L741Q212j202m612P75k10k658J2667J688j5142N863
350b145Q484p295M571r47p244P787R516p307r146N712P966m981K67Q4n851P219
366F690L701o385l579L027O399m728j036L628q343L120J0403j0025n876O992K759
381F747k307m517N396m444p910J6705l862j9594R935J0901q880m071K177j31l852
396g707P149l29j5258J0389R273j3155J260K453j768L175P18J817m843m581J4022
411B615k845j0722Q925J85j957O645k260o216J406R621j047j0086Q554J961q281
426c502R053K9j1233Q573N607m322l83k862M128M035l472n44j726J033R279p324
442F369k203N860o570L140O393r966r11M230K493j051j0813O543M787j2245Q990
$$ y = [-12046, -1181, 17, -11267, -7526, 686, -516, -5128, -4353, -4563, -7221, 5446, 7134, -8008, -2145, 6339, -956, 3615, 2668, -4576, 3211, 12727, 5420, -3726, 1986, 9952, 4971, 5238, 5322, -529, 6690, 10391, 4006, 427, 3454, 9853, 5125, 4089, 7717, -626, 2494, 12897, 2872, -3004, 3988, 6747, 4440, -77, 5319, 875, -7035, 9670, 5808, -13786, -3851, 7050, -1830, -5901, -3724, -3855, -7707, -558, -887, -16145, -5756, 3517, -9638, -8378, -5925, -7693, -4518, -3800, -1983, -6826, -11407, 2615, -230, -10952, -2027, -1842, -3799, 2846, 586, -5630, -4224, 5397, 4350, -5736, 2818, 4779, -3502, 5551, 5580, -5653, 2920, 8527, 4205, 3822, 960, 5088, 9123, 5651, 5107, 3381, 4414, 13693, 6369, 4166, 10026, 3456, 6596, 12989, 3023, 2112, 6342, 8835, 7784, -3029, 3514, 8301, -3944, 5046]
457E046K4j4130J2178J091q714K639l078M594k836l216J0499j4573R31J8076j7192
472h661j414J0659r362P503j432p079P896p565Q204L499j9025J3830O535j3891
486a0303Q717k344n146P620j597M333q115k549J8015j2107l807J4196j4009N187
500a909J1246j3855N508M78k485J0343r677p14P899q250R153l7j3162J1872j21
515F289l436N852r480L588M173n505O309q809j825J4020j0440r39P352j3273Q899
530B775O641j3769L499J072P89L614r875N874N15p752J4593q561j1990J7820n415
545a70n680P196p772N240N8m249Q392j1825K277J3974j5378K266O746r134P129
560i30j75l537K397n703J1534k383j3829J6184l024q136J4223r290k608R655m623
$$ y = [5046, 5070, -9060, 3118, 4209, -4505, -1866, -4944, -350, -3186, -6402, 4097, -10476, -9545, 8531, -8661, -10075, 584, -8778, -1275, -2707, -9786, -1890, -9455, -1251, 2248, -16777, -2947, 3588, -10303, -1586, -3930, -9076, -1456, -3053, 1280, -6835, -9384, 8631, -3476, -7283, 6913, -7096, -1909, 9337, -4518, 990, 1468, -1017, 9326, -351, -1065, 6834, -1416, 7737, 7700, -5462, 6410, 6289, 2853, 8705, -775, 2813, 6986, 1481, 7790, -1019, -2844, 11176, 736, -203, 7149, -6124, 2775, 9416, -4353, -854, 218, 1007, 4621, -5254, 620, 1135, -6617, 7976, -585, -12575, 5245, -170, -5850, 1346, -6426, -1186, -1128, -5377, 3015, -8810, -6533, 7441, -7937, -5671, 1075, -8059, -930, -1105, -4642, -2245, -7948, 3586, 1203, -12626, 3558, 534, -7602, 6621, -2669, -5277, 4378, -245]
575b45K756l811r79R827p840J535N473j1673Q840M868r247J949j160M469L729
590H491r647M206P21l877R911p369n592J0031m359R54K348p959M502L072k519
605B914R29o742N948K958q799O711j969p677J0719j972p133L785k515K690M41
620B88m656L975m935J246Q904j2182o10Q708n092J853o51l271M811m181N560J68
636f5j1735J2799P51j1227J1160l435n511R896l887p08l16j100R135p721k719
651d683J0195q075K267N722q688M451M06l62N163j0039O133N124j1336R890j047
666E121r547J2407l732m887O555n475L157J782m758N003n834J893O913j0776L572
681A394L620p844Q790l108p529P792l338N87K156p700P132j221n355Q035o990
$$ y = [-245, 2511, -1300, -2279, 7548, -292, 1243, 6716, -4957, 3883, 8751, -496, 1453, 293, 4762, 8491, -1156, 3050, 3771, -106, 9805, 2436, -3156, 6875, 2516, 3470, 5818, -2141, 2361, 5433, 2914, 3843, -2899, 3049, 6007, -2792, 3919, 1950, -5727, 4992, 3020, -4113, -328, -2843, -153, 288, -4368, -393, -5328, -4082, 4822, -7360, -7970, 738, -4354, -2501, -3152, -6423, -1612, -5793, -233, -65, -11800, 999, 1750, -9477, 1683, -1752, -7263, 2633, -1254, -1962, -2278, -3378, 5757, -1964, -4683, 5512, -2563, -296, 5426, -3262, 1189, 1595, 1233, 6396, -3643, 2490, 7614, -3722, 6168, 5121, -4426, 7981, 4249, -638, 5917, 442, 3599, 5381, 623, 5626, -208, 1685, 8598, -2178, 1394, 5014, -2830, 5960, 2852, -4677, 3115, -223, 364, 2520, -5180, 1952, 731, -4624, 3411, -3579]
696c579k164R096o426p9J983m157N236l444Q1M579r835O562O190j2753N682M022
712I94q038O300p17k977L171k367N359l063n975J0563m160m560J0404p392j44
727b602O148m758L162k478j179P599p649K836N023j0157O827L797q912N167J18
742B942j389L431n416M160k20m126P222m365l361P293n397J057K563n720M230
757B904k69k324L183n412K240L253n866L975j462m413O760k536l452L129j394
772a684J584j127k143L411l516R32M760p661Q77O231n597J204J908k814Q23M52
788b360J862j191l332N556k72m659N354k327k415N135j431j539M07Q24L331l921
804i78j119O430n128j82O473n729m82M546j220j161o31J872P64k991L990j141
$$ y = [-3579, -5743, 3353, -3073, -3152, -1169, -5326, -90, -3534, -3453, 1126, -8709, -2147, 4043, -8710, -3028, 994, -7044, -744, -1461, -4438, -1267, -3634, 1725, -1338, -7313, 3250, -910, -5470, 4934, -2458, -2602, 3546, -1212, 1950, -528, -1707, 5892, -1757, 1079, 6102, -4055, 2772, 6569, -2343, 2824, 2942, 1553, 4984, -432, 3728, 3508, -618, 6604, 2239, -1122, 6171, 774, 1831, 4394, -1326, 2904, 2635, 311, 3494, -1918, 322, 3575, -2291, 1684, 222, -4191, 2569, 33, -3419, -290, -1684, -100, -1227, -3370, 41, -3475, -2543, 2217, -5444, -4567, 1664, -3933, -2729, -821, -3635, -2812, -2360, -498, -1689, -5021, 535, 263, -4396, 958, -1369, -3784, 1351, -80, -1619, -1212, -388, 2943, -978, -2097, 4333, -795, -977, 5496, -233, -715, 3831, 2611, 1450, 819, 2691, 3455, 464, 4454, 3313]
820C313m743O292r19m138L241j790O21J735k525J022j557q2L698m721L46K240
836B033k719J297R1k461J713l95P46j01k961L180j354j538L233m264l26M695l439
853b570n91J828j181J80K88L56j096j343L742Qm345K666J231j865J150P22j092
870a912o56K218P89k626J54L009j488j081L403j664j742L589M72l737J071K993
886B792j317j536K380n43k698L032J539l051J12K509o03j378K39Q47r67L71J183
903B911j003k524K707R19k907R53R38j890J638K14j893o03J534J35r87m21J68
920a11l24N55q6k017K03J729j232q36J250j255M12J201r80j037Q3Q91M76k012
938c090R31R32k297L479q53l017K856L30K37p44o45J950j344Q57K079l374r7N145
$$ y = [3313, -1430, 4862, 3943, -195, 3046, 1256, 1877, 3612, 1087, 2109, 552, 470, 4168, -553, -207, 2033, -686, 611, 702, -1759, -46, -441, 305, 204, -2757, 423, -931, -2469, 764, -3500, -3826, 869, -2570, -3161, -1333, -2514, -2334, -2046, -1690, -2786, -4129, -387, -379, -4724, -2058, -827, -2692, -1542, -820, -1912, -2568, -350, 439, -2187, -2033, 976, -512, -1593, 1810, 146, -1596, 1993, 2465, -1272, -201, 2792, 1475, -61, 2319, 1776, -922, 2110, 3649, 598, 710, 3219, 2616, 1238, 1477, 2324, 1357, 1728, 2911, 1908, -616, 2091, 3010, 103, 1056, 1994, 104, 1742, 1956, 63, -540, 994, 1129, 142, -279, -111, -435, 120, 34, -1983, -1780, -51, -1283, -2119, -869, -2124, -1712, -511, -1491, -2528, -2445, -1554, -1078, -3090, -2159, -1227, -3524, -45, -898, -3915, -1059, -729, -492, -1236, -1881, 69, -1275, -418, 1661, -1713, -1810, 3335]
956C335k941j639L083j221m17J107N65q36j881M132j31m703L673P50k541K401
972B736n14j213N44L32J985k805j258L939k932q00L523l277K8K690k303J39j041
989b27K13J479j916J285m44k395K817o66k272J649r65O03J049k691M11N07l65
1006a928J648j932j068L615l531N98J556k847K155J016p92o74j49J240P75k409
1022b727L488j894j894N234k789k823M795j756n57K016j790J228j773J936K702
1037C396n641K632L347m431K665O02l020K808r92Q21m25k993M850o28m063N055
1053C983k690j846M445k893n24R28n08K222l703Q95K755m572K505J504n251L205
1069D55L00k517K100k301J370J144l261K526r85j873L674k247j020K517k974K165
$$ y = [3335, 394, -1245, 1838, 617, 200, 1307, 1872, 1036, -845, 3287, 3156, -1547, 2126, 2876, 335, 2736, 2222, 1009, 1553, 1885, 3870, 1065, -193, 3746, 814, 14, 3537, 260, 288, 2978, 675, 814, -227, -14, 1465, -451, 834, 390, -2005, 812, 146, -2126, -477, -1442, -839, 210, -2481, -2070, -1563, -1928, -280, -2212, -3280, 335, -3196, -2598, -1042, -3889, -1734, -718, -1510, -2184, -2333, -1093, -318, -2727, 761, -1133, -3027, 2207, -582, -3405, 1390, -366, -923, 1093, -697, 531, -1242, 694, 3396, -2245, 387, 3734, -697, 1968, 2570, -450, 2358, 1366, 2187, 1762, -1231, 3619, 2991, -1072, 3983, 1293, -553, 3892, 999, 475, 1403, 895, 3117, -586, 309, 3064, -1508, 997, 2501, -2750, 455, 755, -1762, 338, -1963, -593, 551, -2710, -184, -1169, -3042, 632, -1615, -2635, -118, -3092, -927]
1085i27J388l450J875r67O02K020m175K181J237l775M339j175l170N016j486j047
1101a514K036k322K461k93j106K667l197M49M727n152J087L154m183K925m7j612
1117H0J795k183K531Q15n152M737N65m412M060r23k066K681j397J312j471j796
1133h24M863m176j002N163n574J769K697m412K106n20p18K901l883Q56J997m163
1149b920L851n00m190M995j897j081K472l366K139P0k711L285k492m13M000m229
1165b987J581J966l863L337q85j714K935j801O43J293k308K200o10k492M997l229
1181i37p77M376l942R60J904k528K873j914J17K146k752J717J908m480K829J319
1197B819l750L180r67k57Q82k215L338j232l512N322l236j664M773l834O04J498
$$ y = [-927, 461, -2989, -1114, -2081, -1479, 541, -3634, -1453, -216, -3991, 348, -827, -3997, 1019, -467, -1514, 522, -1800, 661, 368, -738, 1929, -1268, -819, 3908, -1244, -157, 2997, -1186, 1739, 1692, 80, 1875, -308, 2223, 3038, -2114, 2623, 3188, -1224, 2836, 1913, -153, 2528, 1131, 2443, 972, -824, 4039, -137, -1139, 4024, -1550, 219, 2916, -1496, 610, 90, -628, 2273, -1610, -754, 1243, -2920, 931, 431, -3759, 1236, -661, -1742, 730, -2636, -497, -427, -3138, 147, -2345, -2758, 1242, -2987, -1406, 560, -3303, 34, -851, -2565, 370, -1431, -788, 505, -1803, 397, -213, -2705, 2292, -937, -1714, 2662, -1280, -320, 1584, -944, 1929, 15, 132, 2278, -474, 1243, 3151, -1329, 1500, 2819, -931, 2249, 1282, 1025, 1907, -308, 3030, 1798, -1714, 3608, 372, -1292, 3481, -353, 251, 1749]
1213A749j582J123j532O3K730m545K254K233n265L050N68k823L099k664Q49Q91
1229A98k532K847j263k394M161l129q59L456l020K137N54l021J906q29q76L052
1245C88k629R44J296j757K475j803j526K997j247q6J457j870J061N67r04K793
1261B156k673l42L137k312j81K448k973J986o50r8J232j001J404j209j533L287
1277B678p44l575N232k123j543K520j541l46P13j270J738k112K10K591l546R85
1293a33K817l732J482l58m43Q46j758R52N20k155K177l02k680L050q95j352J877
1310h7j903J155j99r07J875j349j035L124k799N52R57j653K043J65j554J645k334
1327b304J101J577k513K738n43j051J867r82k3J822j851Q58K27j384Q34K44K76
$$ y = [1749, 167, 1290, -242, -179, 2551, -1994, 260, 2493, -2772, 278, 846, -1977, 1122, -1542, -693, 198, -2334, 513, -750, -3144, 1017, -2112, -2971, 485, -2535, -398, 156, -2865, -959, -1788, -2664, 388, -2241, -1297, -1, -1758, 717, -1086, -2612, 385, -862, -948, 509, -1361, -300, 267, -637, 2156, -517, -859, 2278, -34, -215, 2233, -740, 1246, 596, 498, 1730, 729, 2133, 924, -609, 2678, 1934, -1641, 3591, 1468, -75, 2445, 904, 558, 1271, 1, 1739, -373, -163, 2428, -1118, -133, 2684, -1048, 434, 76, -367, 479, -1279, -327, 193, -1962, 215, -87, -2767, 283, -612, -1964, -87, -1990, -835, -1034, -1941, -66, -1415, -2450, 674, -2125, -1573, -616, -2269, -226, -61, -1615, 30, -2304, -1203, 374, -2139, 599, 56, -995, 872, -110, -133, 1689, -162, 696, 923, -461, 373, 617, 893]
1344H93M81j674J633O00k229K054k32j642J908l29p97J28j02R29q57k88J523j492
1362E07o30J840j514l50R04l07m07n37O11Q22k193J739J9k685J739P49j320L71
1380f42R5m91j21j68J226j103k38J338j124j156K310q98l79P00j086Q74K6m52
1398a289Q62o85J61J111p73M33K19n65O73K09o03L10j19N92l70L70J2p40P29P35
1418A272j333N47O13r70O45M13o53j68R18m6k11o07J085p96k34R99q04k6L45L75
1438A364r70k1N87m42m99K37J43n95J71J271r24j115Q18M05j621M20R86j421O94
1457e12M28r27K38O02k7j290O7J198q37j25Q80p75m90Q74M18m69m64P18Q8m90
1477h95Q10j84l24J49k3O06k73R5k2O10q76O73l0k12M97j13l13Q34p52J22Q58
$$ y = [893, 1374, -300, 1333, 1933, -296, 1758, 1526, -116, 1792, 1463, 666, 794, 692, 1621, 764, 476, 1999, 507, -123, 1717, 203, -147, 757, 450, 43, -494, 117, 939, -1254, 485, 504, -2181, -442, 307, -1013, -642, -547, -1038, -1159, -1327, -101, -1204, -1442, -104, -1228, -2384, -74, -972, -1351, -651, -1737, -863, -837, -1289, -427, -1112, -951, 160, -613, -180, 39, -526, 147, 356, -247, 63, -56, 536, 166, 536, 548, -192, 537, 1272, -61, 486, 1099, 129, 774, 1187, 534, 366, 1284, 1238, 1027, 420, 1505, 709, 475, 1474, 670, 644, 989, 1364, 394, 373, 960, 518, 19, 256, 399, -196, -25, 1246, 322, -793, 25, 430, -1191, -771, 215, -1206, -512, -84, -1011, -773, -171, -198, -1488, -1421, -223, -1060, -1185, -305, -1080, -1570, -696, -278, -747, -1211, -493, -405, -895, -85, -269, -593, -444, -467, 139, -134, -39, -61, 549, -327, 346, 316, 104, 601, 488, 175, 1009, 257, 379, 1237]
1498A237q68J52R89q76O48l06o28N12j6L46k83j148J739n58j229J582r28n84N07
1517B88N0K37r22P24P39k151P77J348k012Q78j66r17N51L18k15l64R1J016p85
1536e15j245J896p76j064J344p40K25O59r25J243j041J89O29j171L83J320j515
1553a104K31O06p3J65j38L45L00j022J278j26j334J714p81L2J201r77J05M48q30
1572D0R91o05%J192r70O9O08j034P17o1q32Q03j7k50k59L3l03L14J99J78j349
1593e36L57J523j243k78R89j164J0N35O4k53r99Q19J7o33R98k34j660K250p34
1612a72j312J514r11K4J180k226J726m38j330K767k164M3J735j233L79k48N3O91
1630G8j624J784j39j232K053p17j318K205j952j01J942j158J252j29j398J698
$$ y = [1237, 369, 521, 1510, 634, 1282, 976, 348, 860, 844, 1190, 907, -241, 1498, 940, -289, 1293, 365, -219, 288, 338, 575, -347, 377, 1116, -1035, -258, 1090, -922, -44, -210, -1127, -576, -258, -473, -837, -746, 270, -515, -1760, 136, -640, -1704, -360, -1100, -875, -216, -1141, 102, -939, -750, -121, -1292, -909, 411, -1104, -873, -267, -340, -175, -313, 32, 332, -690, 588, 462, -872, 842, 61, 93, 1294, 317, 422, 870, 40, 1031, 426, 426, 1618, 648, 717, 1325, 291, 1008, 947, 115, 918, 901, 651, 392, 425, 122, 436, 635, 813, -536, -179, 1344, 101, -177, 812, -352, -342, 193, 257, 4, -995, -176, -159, -792, 206, -28, -1688, 562, -172, -1484, 30, -881, -857, 323, -1903, -177, -615, -1945, 822, -1342, -1299, 436, -797, -418, -666, -613, 78, -1546, 238, 99, -1133, 920, 203, -1115, 1090, -862, -963, 979, -179, 1073, 944, -454, 1244]
1646A244o17r18J049k56J17P98j103J152q00o03J427j161p4J303j419K59L98r30
1664a34J405j031l68J237j400K99J001j284Q20p12M83k0j042R39N21j710J117
1681A21N75k183J543k16m51J00n42J223n94j253J905q91m83J430q78m58J011j256
1699a297J378r18Q7J356k216J050Q35k034J178P30j049J380m63j86P51j254J447
1716G75j8q81J210p38n24Q93j186O32R93j097J146p35r08J859j606R50M18j468
1734b85J379n01r75J181m61j41J026j779J392l80p98J406j554R0Q23j498J335
1751B60M31j881J338O02j186J188k068J144J35j195J708j063j30J098p51j303
1767a673J784m49j82O9p65J569j367k98K110j515J37Q98j527J245m20k16O40o26
$$ y = [1244, 627, -291, 758, 502, 619, 1417, 314, 1466, 666, 63, 1490, 329, 255, 1558, 139, 398, 796, -134, 1271, 240, -128, 1109, -291, 8, 1009, -275, 545, -167, 316, 296, -746, 193, 714, -996, 121, 696, -1487, 56, -160, -611, -511, -1053, 170, -424, -1677, 228, -663, -1146, 284, -594, -1052, -41, -1297, 81, -837, -750, 606, -1610, -560, 275, -1759, -581, 149, -900, 480, 17, -169, 582, -672, 775, 757, -124, 1086, 348, -176, 717, -469, 163, 1156, 59, 1205, 470, -438, 1421, -185, 765, 1183, -285, 1094, 593, -382, 799, 338, 197, 1223, -556, 836, 456, -342, 1064, -490, -400, 423, -1075, 260, 691, -1190, 148, 750, -436, 752, -1316, -172, -37, -1232, 476, -587, -717, 381, -370, -1673, 111, -338, -520, -451, -1216, 353, -1014, -1312, 798, -717, -580, 318, -1209, 36, -384, -600, 40, -586]
1785e86O20J48j289J657l39q75J203m03l59P96q11J098J95j780K238j072r90J818
1803A269j480P95N12r34J64q2M2J014j411M94N61j402J255J17j018O82o95K62
1821A45O73q86M79Lr54N83N0r6J06q43M65O35j165P93k33p89P27j09n6j2j90N68
1843a06k43k92Q70j581L68J618k004N83M44o47M02j17N07N62j568J093R42j831
1861a000J257j08k81K42k31J01j65o3J307m95j099J553r2j049J192j170K24R74
1879A097o37K35o19M40N83o63L02L34j206O37n11j40J147m87j71L71o04P18m09
1898D17o33P03l70m87O07m62l1N91o97L60j9k73J95n22K95k0p37J023q56n5J221
1919B50r31k48P60m61K63n51L38Q08r01o9Q57p57K7J119p94l29Q60m38j64j06
$$ y = [-586, 34, 182, -1107, 550, 211, -664, 539, 136, -223, 573, -238, 860, 1055, -725, 1513, 441, -549, 1269, -211, 584, 1096, 162, 326, 244, 286, 1300, -111, 383, 944, -458, 797, 914, -104, 578, -117, 145, 818, -68, 411, 414, -540, 43, 93, -3, 103, -740, -275, 360, -805, -12, -245, -1034, -307, -416, -472, -484, -674, -106, -349, -641, 229, -1352, -984, 634, -1370, -787, -343, -990, -588, -705, -198, 364, -1204, -111, 831, -1000, 257, 149, -132, 110, -121, -20, -185, -248, 1059, 564, -535, 1018, 926, -123, 1069, -101, 123, 1097, 460, 695, 76, 516, 1099, 436, 738, 1072, -134, 503, -8, -148, 999, 512, 341, 712, 108, 826, 417, -216, 487, 117, -370, 237, -225, -256, 335, -362, -2, -21, -294, -99, -621, -326, -346, -1083, -60, -916, -971, 250, -681, -929, -169, -630, -367, -918, -580, 228, -673, -742, 115, -642, -615, 504, -290, -619, 241, -197, -361, -467]
1939d67L72o4l66N19j0j38M83M5m59K78N27m75Kj8M06o24K78K3J22o4J6J05K14
1962G05n4j41n5o89N45l25j99P35j37o61J209n97o1K1k68N93m25l74K56L0J82
1983B90m79k68Qq6O4J73m40O27j6J38l34k07k77K56J44k39N27l91j65M2m9J76
2005e06K56l99K13N10Q8q2n03Q22n32m76P44K1j36l58O77l31q3Q47k53l88Q4O42
2027H57p15k64Q56O93j182R7r8M09k13j47N36p96Q4K46j20k09P75l94m19Q0N8
2048A34K89k1l52O7K61q0L1K09o70L95l39Mk92JK48l7m05K55j97N80m72K72k51
2071c70K41j77k04p6l17Q50m93LJ52l0J24L11p16L72K72K5L24o50Q04l31n89J026
2093E51n27o86J132k9n80J10L86J58n65j16M51l58k09P76p01M2N12l20O92q74
$$ y = [-467, -95, -159, -525, -6, -16, -154, 329, 374, -85, 193, 720, 245, 247, 229, 635, 11, 289, 312, 434, 370, 386, 491, 705, 651, 510, 455, -234, 311, -14, -213, 522, 385, -276, 933, 336, 275, 296, 28, 621, 196, -178, 78, 108, 290, -189, -457, -449, -535, -471, -298, -738, -111, -127, 11, -323, -530, -807, -551, -407, -646, -119, -510, -675, -633, -682, -506, -250, -649, -436, 74, 162, 80, -423, 399, -133, -609, 135, 156, 20, -338, 339, 8, -75, 772, 519, 131, 215, 857, 142, -122, 734, 1427, 245, 342, 244, 653, 440, 293, 829, 33, 117, 363, 243, 34, 809, 415, -4, 76, 134, 423, 402, 50, 117, 378, 298, 329, 538, -132, 263, -76, -72, -364, -363, -115, -152, -557, -302, -499, 81, -391, -119, -370, -129, -306, -510, -586, -903, -53, -546, -543, -391, -421, -297, 14, -702, -330, -58, -33, 291, -359, 445, 114, -475, 551, 24, -662, 470, 441, -139, -29, 357, 515, -50, -166, 285, -73, -282, 494, -207, -165, 347, 27, 719, -155]
2113a55J97Q25p56P67k13p71j13R38q87L47L7N1N72q74P55o72k4j12L4k53M66
2134A59n16k88J040o08j2l8n07R81q59m0M80m3J27L60p15J20m18Q6Q01m11k09
2155e10M34l94L98j73l15Q53o50M65o9k88Q9M83p42O00J48p71K31l2K67j70j50
2176b96J380j106j10L32K73m20M83n44N35o99K44P41o55m15R99p09L76m11J2O89
2196F99l48K07J6q94N89L74r87J029p04l14P11m70o2L34o45J87M32m17O38n73
2216a98J6O52p20p2k21O8P16k41o14P90n95K74l63o17J653q47j05L70o69K14N46
2237C7m92N59K03r75L96n46Q19Q86j407Q79k17o06O59j66j43K49k75K21N98n58
2257A21R12r00o21J901j467j40P84m19M07J80p67R21p71L88P5q14Q21L49j505
$$ y = [-155, 42, 867, 111, 878, 665, -106, -219, 719, -168, 179, 216, 267, 839, -35, 720, 48, 24, -88, -54, -307, 159, -357, -645, 395, -213, -225, -263, -770, 211, -648, -688, -208, -251, -124, 236, -479, -359, -777, -691, 110, -301, -510, -76, -470, -72, -245, -560, 293, -357, 108, 39, -249, -160, 323, -419, 181, 329, -442, -211, -243, 24, -146, -296, 1084, -22, -132, 200, 473, 53, 536, -8, 527, -172, 72, 813, 158, -257, 742, 33, 409, -2, 10, 699, 351, 558, 574, -320, 269, 643, -344, 685, -19, -333, 378, -92, -154, 180, -465, -278, 154, -263, 375, -198, -182, 470, -250, -322, -543, -475, 241, 0, -614, 176, -419, -145, -508, -1125, 528, -319, -424, -54, -723, -509, 37, -455, 104, 307, -668, -272, -818, 1, 887, -520, 359, 142, -464, 195, 29, -114, 135, -140, 81, 679, 121, 1033, 133, -488, 1413, -54, -194, 590, 171, 578, 758, -9, 912, 141, 529, 604, -210, 611, 960, -545]
2276e45J146j72o39L69m30N51j04n70J373j146o95J346j488Q21R1m70N15P2m47
2295d22O66m52k9K84o67M98o46J13O78l32k59N62o39R51k97m95R43j01l29j75
2315a48m44K46K10m35O15m8l88O17q39N13Rn49R90m10m2O85m86m45N91l41J37
2336C8L79j95P0J02M1J82m46n22J360j150L98N07j007M01K0K28m21o81J205o17
2356a08l54N54j22rL72m40j75L93l4L5l16k3N08n35L50No38L41M93q86K45J01
2378b43J51Q8k89ML83q08Q57n5l86Q8j44O6L92l00j29M90k77M94m55j7M13q46
2400e23Q82k40n53Q40r34M45L48j73J04K86Lk1r7n83Q92o32l32P37p66O67J70
2421E20m91R3p5O20j73m76N35q22L50O67o02l32N70o94L15k85N3O77j009P92p
$$ y = [-545, 601, 429, -210, 159, -271, 280, 176, -394, 979, -167, -862, 484, -1004, -183, -92, -562, -47, 25, -422, 244, -208, -237, 47, -620, -122, -768, -655, 23, -309, -568, -6, -645, 306, 9, -486, 457, 356, 27, -148, -592, -346, -136, -571, 44, -4, -392, 225, -614, -101, -92, -641, 349, -61, -103, 582, 96, -349, 242, -99, 38, 417, 222, 292, 394, 435, 617, 171, -351, 1009, -141, 257, 764, -243, 158, 178, 406, -15, -696, 509, -108, -462, 92, -30, -39, 333, -107, -282, 111, 77, 112, -204, -227, 281, -254, 96, 101, -537, -196, 297, -589, -344, -243, -92, -4, -293, -289, 94, -714, 143, 88, -298, -210, -354, -288, 104, -196, -325, 165, -112, 382, -73, -90, 323, -523, 359, 119, -434, 406, -528, -83, 265, 92, 196, 482, 485, 464, 367, -216, 676, 44, -288, 449, -317, 350, 520, 29, 122, 47, 667, 494, 18, 553, -269, 81, 748, 146, -186, 384, -310, 5, -280, -227, 450, -559, 233, 226]
2442B26o35Q6m7L02K68n49M5L87o07R7O71l07k87j1k76O74l87j58Q7R4N41K28
2464D42m08m48L60k91K09m96M28K57l14O09q0j01j90M6m09O94r0j07L6m58P3K45
2486Gj30N90m66m2p5nL07l60J265p30o41Q14m13l55M05l16K28M53J89k81N05p98
2508A51P6l38M03J69j12n51Q9J95n5j63pk55L46q4L24j40j26N15l30j60m44n3
2530e50N7L77l26J90o04P76k72L07m98M34k26M58j52P7q71M42K65m45L72J28L1
2551c0j28R15j176J156P7q66L14l67j17L85j31r9N73o06K10J92j019J329o15j26
2571a29M7N07q86N31P13j292J51J218m39o15Q33j185N2M29o6O52j140O39K67J6
2591C03n58M04o18l92J286m76l14O35r04R12M0k33PJ82m60K53j39n76J264o33
$$ y = [226, -409, -323, -370, -68, 200, -349, -304, 83, -524, -427, 244, -63, -350, -361, -637, 37, -350, -508, -421, -327, 214, 442, 34, -414, -54, -345, -136, -632, -204, 53, -261, 348, 268, 167, -23, 23, -386, 308, 218, 111, 147, -311, -238, 7, -123, 467, 1, -41, -116, -121, 186, -174, 1091, 361, -280, 534, 121, -234, 171, -145, 83, 536, 725, 444, 949, 151, 227, -111, 292, 461, 349, -202, -113, 82, 27, -136, -143, -398, -52, -136, 188, 48, -78, 437, 107, -53, -497, -550, -493, -116, -442, -252, -856, -80, -352, -45, -543, -109, -335, 123, -29, 48, -823, -381, -116, -561, -189, -61, -30, -158, 757, -419, 737, 814, -52, 262, -105, -222, 163, 32, -67, 506, -100, 110, 302, -717, 612, -3, -129, -82, 425, -461, 70, 783, -509, -358, 860, 421, -194, 639, -546, -494, -65, -131, 521, -619, 20, 287, 303, -255, 149, -469, -861, 425, -51, -365, 270, -634, 278, 318, 85, 92, 274, -186, 67, -72, -648, 616, -17]
2611a7r83O05k84R8J651j564j7k25j07K25O52M01n46M69j54j81K92l29k4K51M7
2632B60J76r29O98J01q1lj86Q7j22k07K89L04m21P5J65k66O93n47J06K64p72P53
2654D37j45Kk8rk17K55k22L98r8k86mj17m9R0l18L63o54O28p2j41J09Kj81J09
2678a48K3k01N48p39K98J37M15k40R7m79L24l97k2N16m96qQ62m29l70J59k4L0
2700a44j42J58R4k5P45q08k99Q23j11m82N07n95M23O29q34J92J7R8J85n88K45
2721H8K42l95R0L67k11J15j80k24L76k62J12j46J57K87l86l05M38m31N54j14n53
2742c81M60m32j77J062J5o22M48n40m0M26k55J88m50p1L92k87M29m31M1Q43p61
2763a43j74J42M86j94k71j44mN4n4L50K29j23J8k5j59J26l11K97m98O10J11k83
$$ y = [-17, -1000, -395, -679, -581, 1070, -494, -511, -736, -843, -618, 34, 435, -111, 358, 204, 23, 315, -14, -38, 213, 260, 436, -493, 205, 306, 225, 222, 36, 123, 1, -206, 83, 387, -34, 41, 206, -60, 633, 86, 192, 456, -316, 437, 292, 294, 266, 257, 40, 295, 73, 471, 373, 87, 83, -34, -83, 7, -311, 52, -602, 26, -46, -187, -78, -76, -257, -148, -125, -326, 222, -517, -219, -82, 333, 93, 190, -289, 35, -362, -384, 132, -364, -372, 490, 61, -309, -150, -174, -144, -286, -128, -34, -59, 686, -122, -421, 402, 291, -191, 316, -279, 144, 773, -61, 131, 148, 246, 431, -157, 88, 330, -65, 25, 392, 181, 296, 116, -108, 268, 6, 118, -28, 129, 416, 30, -275, 163, -268, 286, 172, -381, 79, -353, -530, 532, 547, -75, 373, -167, -207, 219, -36, 152, -298, -369, 23, -264, 165, -266, -225, 618, -143, -317, -175, 311, 117, -154, -298, -302, -248, -302, 48, 277, 154, 172, 147, -12, 114, -197, 100, -398, 212, 323, 40]
2785D0K59j1k38N65n75J35J92r39P19K16l47L67K0l48K33p93P65j90k12L19L76
2806E53l62q1n4m38M12J11J95k60M7l41k21l68J175l62L37p24J88K73k68O3M03
2827B78l98J32l0n05M06n1j08M17o20M38j05k75M97k78M0QL01m39O75m63Kp8j9
2850a75L29k27l21Q09n19k53J98o3L08m90K63N26n43J89P9m08K20L86m23O34k84
2871B35r8j35k55M70J76m99L05l00J92Q33j414N05Q3m48J8N17q73R32j45l11M4
2892a68L12K4l19N5k73J50L85o74N39l11K6j12L60O07j001K17L88n38j7L10M5
2913EM5o56L17N65m85p9m56P07m60N95l21L83K27q37R3O89m00l9k00K07L83R0
2935C73m30k8L84m34k06Q19l47K53o62L18L52j6m60L44j08r4K70P4j8n50K94J14
$$ y = [40, 299, 288, 50, 615, 40, 175, 367, -572, 147, 363, 16, 383, 403, 55, 288, -505, 260, 70, -142, 177, 553, 191, 110, 56, -382, 30, 141, 336, 76, 123, -218, -439, -807, 368, 6, 343, -381, -193, 80, -188, -125, 278, -120, 12, -18, -523, -117, -168, -276, 141, -479, -41, -146, -421, 76, -202, -162, -154, 147, -292, 383, -80, -78, -156, -175, 154, -73, -394, 415, -104, -357, -159, -222, 86, -404, -141, 385, -158, 31, 110, -298, -78, 308, -115, 519, 235, 137, 2, -253, 217, 393, -106, 199, -101, 91, 924, -490, 15, 98, -350, -332, 185, -688, 244, 99, -212, -168, 144, 168, -151, -96, -369, -219, 166, -508, 31, -280, -254, -366, -6, 601, -400, -183, 205, -333, -350, -40, 5, 50, -606, -289, 276, -209, -288, -744, -37, -497, 98, -223, 160, 387, -450, -357, 332, -68, -107, -307, -100, 283, 373, -57, -85, 299, -135, -341, 478, 131, 384, -278, 40, 392, 376, -84, 260, 152, 58, 328, 402, 384, -166, 128, 242]
2957B42Q9J73m38j73n1K71R0l40L86j4n10J32L41j02j5j87n4J23j92J85k55K59
2979d0k20L63l67j58J57k9K82j93J59l36K14j53J17L55k20K98l46N47m29q5j99
3000b83j16J89O0j58N96l14j86j23O31n63Q37n25l75L81j4l1j47M45j47J21l99
3021a21M54l3M18n00l98M32j71J20j68L47R9o13L22j5J78o31L60j04N66n39L38
3042C41J28n37N07p55J93j17OO66m54k99L35n22J80J38K76o30P33rl04q8P5l71
3064e08M53r2O48p90K59J21m44P6k36K24k4LK85N9%J47j86K76k47Q7N9k43L8K23
3088A88n64M12k15K61R4L40k66k2M22n71JL6j42K75J96K85o83L20J23q13Q34l51
3110A60l80Q44j39n87J82k31O18q34N95N6m81K81k69L67l42J7K20k92L65K13n67
$$ y = [242, 331, 504, 66, -107, -158, 113, 203, -137, 249, 235, -275, -143, 198, 96, 81, -106, -160, -37, -229, -44, -299, -40, -260, 103, -264, -422, -265, -294, -12, -205, -46, -382, -168, -321, -204, 151, -69, 229, -117, 430, 1, -84, -283, -399, -210, -150, -308, 288, -26, -212, -335, 296, -267, 570, 45, -330, 51, 37, 6, -141, 304, 157, 278, -121, 333, 300, 718, 218, -180, 252, 81, 201, 33, 380, 479, -134, 188, 173, 351, -280, 80, -24, 542, 3, 341, 469, -68, 439, -316, -123, -240, -234, 432, -22, -321, 14, -508, -328, -190, 86, -544, 189, 180, -124, -212, -137, -508, -55, -147, 501, -289, -30, 91, -353, -277, -513, -289, -313, -310, -25, 34, 34, 181, -5, 271, 24, 111, 170, -73, -35, 188, -376, 36, -179, 82, 176, 516, 250, 228, 650, 79, 80, 116, -26, 249, 445, 730, 47, 367, 490, -323, 511, 160, -220, 624, 485, -102, 80, -151, 467, -367, 228, 284, -197, 84, -185, 182, -160, -143, 77, -215, 150, 363, -204]
3131b04J63O7R7k52j14M59j30k76J03j4N2k56N72j86j97M6N7q5K41k84M3j40K67
3154B9j07L5K3j74J27K70p0m12Q00l36l66L81j34j83M1rJ27J54k47j06K06N38
3176E87M32r06l5l19l47Q11m87O47N7p73N71m9k0K74l42k5j54K84J83o5m00P8
3198BN08r92R89n20l9K6q40P49j50J83o14K20L86Q6k51N02k19m81K70N25j66l14
3220a40L06m55k4M89m87N50l86J00L92n17K02K17n27N89J55k66l66K16K33l94
3240a13L41J04m51N1m6K3J71J70m66M32L54j34o36j16R17l07n39O44j82m7P4j96
3262D8K07l03M79L33m16o23K66R8K93k57k10l75L98N0K73p09M19r2L28l27J0M1
3284f9J7l99j91J70N40J60k03j47J35p5j91L72l70J63L12o80L77j36K6O22p85
$$ y = [-204, -41, 26, 123, -129, -243, 216, 86, -190, -87, -101, -49, -305, 267, 81, -116, -70, -13, -98, 143, -141, -98, -238, 29, -78, -43, -20, -194, -67, 203, 133, -279, 521, 185, -181, 200, 66, -117, -76, -85, 42, 196, -51, -157, 49, 587, 1019, 113, 78, -241, -588, 223, -264, 383, 440, -333, 238, 189, 169, 443, 101, 76, -78, 206, 389, 324, -76, 2, 510, -482, 507, -13, -52, -26, -866, -117, -267, -84, -698, -478, -92, -6, -257, 245, 26, -455, -185, 340, 174, -140, 166, -289, -313, 176, -311, 239, -147, -47, 345, -172, 30, 247, -280, 309, 464, 198, -168, 48, 281, -113, 228, 332, -119, -68, -114, -91, 80, 250, -216, 216, 570, 436, -200, -316, 601, 294, -245, 399, 217, 170, 244, 48, 255, -48, 431, 764, 348, -275, -9, 89, 382, 125, -85, -460, -62, -12, 261, -448, -29, -121, 207, -120, -110, -69, -52, -451, -642, -472, 68, 228, 25, -122, 13, -62, -253, 119, -251, -88, 224, -456, -79, -215, -189, 433, -352]
3305c52O33o76K17L02J51o01L02N56j23m65K2L58m03n02R24k37L97Q0o16J64n58
3326d27M11o3M00l09o1L13k02M85r18N76k0l96K61j34J71j50n6L94l6m85O2j40
3348c24N3K01q2j1M49o5o62L29L93q84L24o8k39L02J15K96k86m78l9K23N43k8
3370F2p45L96K22M2j35k38K9K48j14N15l42N02l46l4j43j54K28l88M79m25Q05
3391D64n23J04jj06P3J16N7j79q4P8j06K9oJ59n5m5r7j78r4P3Q94o36NL07n50
3416c01J76J64j81l30P26k19K47m21L89k42q0J2j90J06J55Jr6J2%k4k59N02j34
3439A3n42M89K72k73J61j72m29N18mJ87l82o4K35m51K30Q7j9L21j60j79k38M49
3461D9n28Q57k72J74j66o46R13k65K89l19Q5j45J77k59P32l92k40j68J70k59N00
$$ y = [-352, 281, -395, -178, 124, 275, -326, -24, 532, 409, -56, -34, 324, -79, -581, 343, 106, 503, 583, -33, 131, -427, -16, -79, 321, 12, -49, 264, 62, 547, -371, 205, 185, -211, 50, -84, 87, -63, -119, 275, 239, -246, -184, -324, -271, -70, -152, -163, 286, 221, -441, -112, 281, -603, -279, -347, -586, -284, -169, 127, -159, -637, -676, -453, 90, 62, -683, -287, -65, -23, -158, -396, -367, -119, -233, 282, -60, 442, 96, 62, -81, -235, -7, -395, 84, -341, 464, -59, 45, 44, -62, 11, 127, 184, 5, -79, -1, -107, -78, -84, 75, 20, -25, -122, -300, -394, -321, 573, -63, -58, 249, -301, -125, 39, -142, -472, 254, 35, 282, -139, 250, 8, -72, -60, -250, -144, 11, 12, -84, -72, -72, -96, -355, 147, 13, -529, -40, 232, -41, 120, -52, -481, 37, 33, 220, -162, -226, 9, -442, -212, -125, -144, 177, 17, -162, -400, 49, -479, 378, 106, 280, 114, -532, 381, 116, 405, 86, 171, 26, 203, -56, 676, 284, 44, -124, 46, -213, 287]
3482B87n24n9M89k80j73K04Q3K57k23l63J61L22k04Ll79Q9K26k38J79K62q64N29
3504b16j0J96N9L7l72L67J82l11j08o4K46j21L54m80L36k51K85k76M32k86p2O
3526f7j73N10m50J81l52O26k25j04L89k82o5l72J23L30L27m74J94J84o2k89K38
3547A87j90j52K20j21J70K51n72J11O0j37O14J09j93j70n4K83p47J14M14p07M64
3568d6J80k50L0P5L0M85n01M26p87j9N93j8j27k72L63j59M7j50O7J42r1Mk81j65
3592d24P88n83M9O42k84M3P2k18k87L54l27n93K37P54M85j188O47k6J02l41N48
3613D50o91Q82l45r0m01j82J87N17l49J66J26m12j09J36m92O94O59j673J057M35
3633E65p03p0O53k65k7K66l56m64N05l24j8q1J000o54l11N71l76J99N6m22k7p0
$$ y = [287, -237, -296, 193, -87, -260, -56, 27, 284, 61, -302, -141, 181, -23, -20, -399, -310, -84, -322, -143, 119, -745, -216, -226, -30, 29, 66, -306, 61, 243, -68, -176, -240, 6, -115, 239, -241, 95, -156, 129, -147, 285, -1, -73, -67, -240, 270, -180, 1, -351, 275, 50, -54, 335, 53, -12, -384, -261, 69, 396, -78, 116, 300, 238, -51, 187, -3, -155, 65, -56, 114, 365, -207, -96, -36, -173, 441, 550, 357, 187, 133, 416, -331, -217, 197, -510, -46, 134, -116, -86, -11, 19, 504, 3, 429, -358, -377, 216, 198, 71, -201, 162, 3, 50, -100, -33, 109, 18, 22, -259, -424, 364, -219, -170, 472, 188, 231, 303, 85, -202, 152, -175, -768, -531, 223, 708, -480, 167, 141, 243, -98, 450, -241, 641, 296, 206, -195, -377, -190, 327, -22, 144, 270, -142, -251, -115, -607, 87, 746, -927, 130, 565, -138, -208, 445, 180, 153, 419, 63, -401, 104, -220, -238, -319, 681, 27, -284, 287, -89, 110, 166, -256, -283, -353]
3655c53L80n17J015o00l16J96Qk11J86J33P07r15J36j29j59O25p63N72l78O43
3675B60j56J08l68M51l61l79k44R57k9p37N98M50m62p5L82n51j15L90j51K58p4
3696A52k21p0k7J76M25o48J03k4M68m88l91N25K35l9l55r1rj81N95j61O6P5%m69
3720c54Q10m56j72O3Q0L76p25J83L42J15j28l05j3K08R1j61K08j58k97K50l12
3741c55O99k74m01k6lN15k6q31Q52M2l35ML99l56j52K65j14K17J1K59l43J48n13
3764c18L22rq2J17j5N0l95N80j39q9j32K05n7K89J80n79K22K8l37K21k1M2K0j19
3788a6N6L26l66J34K20m80L13N3n41N62m25j9L79q2J39m4l95M3L26q9m82L46q
3811e0k14L20n66K42O32p19j14N34k91N91m19L8K63l49m7O6O4k78L48m03R4L95
$$ y = [-353, 27, -490, 525, -75, -391, -195, -187, -398, -212, -79, 628, -287, -151, -280, -439, 186, -577, -5, -383, 260, 104, 212, -156, 295, -66, -445, -689, 268, 239, -498, 100, 550, 88, 13, 395, -156, -271, 119, -32, 226, 152, -69, -139, -166, 10, 435, -213, -110, -134, 334, -154, -545, -20, 215, 176, -179, -270, -279, -460, 135, -26, 40, 115, 115, -354, 456, 0, -172, -109, -29, 347, -378, -195, 147, 262, 134, -171, -184, 24, 115, -46, 162, 4, -293, -43, -355, 344, 70, -331, -357, -360, 155, 129, -702, 150, 192, -143, -139, 260, -96, -248, 17, -97, 120, 131, 390, 47, 195, -318, 4, -5, -87, 30, 15, 65, -330, 250, 111, 22, -110, 95, 38, 327, 507, -72, 150, 178, -159, 62, 41, 83, 103, -16, 40, 366, 0, 134, 354, -126, 187, 240, -301, 261, -164, -183, 196, 114, 253, 209, -186, -143, 183, 94, -388, -42, -50, -264, 56, -510, -268, 364, -355, -469, 65, -226, 365, -54, -16, 247, -102, -149, -83, -19, -297, 51, -352, -258, 137]
3833A37m28L45K15j02j04j46k6J82K30m98K90J64K01k24l37QJ70J7k69l19J23
3854c71N82K19j24p50K57K97J28Q6k70J31m07K19R1m52M30R7o5qL53m68L17l06
3876a4L18l30oj2Km4J98j30R8k30J16o4j81K08K7l12J13L44p0o7J17J04k67J75
3900I3k89M25l75K55j76k9N21m68J16l65K61l1k27J58L15o3l35L33j38L57m68
3921a30J03M9j5m3J015r56K26J49m57K88O8R6m64K79j17M17p18M27l7m8j64L04
3943B72l38q8J35m22N46K30j12j66j8l6j98K79j87j27L61j46K33o88L07q8Q67
3964F16r06J39N7j17L45p27O41j10J95M0L3q10N80N88m88p2l9lj1k02j76M34k29
3987b22J92L00r8m69QK79o7J36q2k28K03K28j5k43M49k87L3j4l75M37L65o11K4
$$ y = [137, -291, 54, 269, 167, 63, -83, -109, 73, 303, -195, 95, 259, 460, 236, -101, -93, 77, 94, -175, -494, -371, 211, 430, 306, -444, -187, 110, 238, 324, 54, 185, -222, -3, 88, -364, 66, 163, 98, 90, 443, -25, 292, -14, 304, -26, -32, -44, -42, -86, 112, -18, 80, -150, -34, -98, -279, -71, -44, -356, -243, 101, 31, -36, 81, 185, -82, 93, -196, 229, -146, 109, -67, -96, 425, -43, 73, -292, -31, -62, -289, -131, 184, 121, -214, 119, -19, 338, -130, -27, 22, 7, -36, 979, 23, 249, 398, -59, 229, 297, 393, -71, 208, 91, 508, -210, 217, 180, 132, -32, 272, -66, -154, -19, -441, 105, 335, 223, 57, 39, 3, -195, 84, -103, -230, 131, -15, 218, -470, -163, -251, 616, -290, -151, -94, -211, 134, -593, 48, -62, 133, 173, 206, -604, -24, 564, 76, 4, -35, -38, -49, -251, -427, 7, -222, -30, 270, 172, -297, -289, -10, -77, 59, -23, -251, -48, 180, 165, -78, 371, 84, 117, 103, -272, 165, 530, -81, -57]
4010e7r9J43L88m92j08l1r9Q22p18J61L16o25P36r8l66l38N52p30J105r19K19
4031b38P3R3l85J024n80O1j58j32P29k62k82o8J80pQ0o5r4k2m22K65j51M47q5
4054Aj70K55qn11M99k74K43j05p2O89o86k57P02r25O74j06n1K93j71J37k76k19
4076c38O80m34M61j69k16l64J53O28M1l73%p0n37M48p9P2N67m55J0K32l23o61
4098g27P70l2K1k33N29m60K40N5j02K03p61R16n88J71k65m0N97m90N5N0L23m51
4120b19J82j92q5K68N42p57l62J03N28l1j97l93L31K55J75o01M00J51j98J30p6
4141d6N1m85L05K42J67k30r4J76K47j37l09J0R2j87K2L12k08K4J52M49n12q7M08
4164C62m39L26m66J88l23P54k58Q4j43O9j78L9j6j75K94m72J02K54l3L36p22O97
$$ y = [-57, -156, -13, 375, -117, -225, -256, -355, 467, -251, -90, 226, -399, 337, 239, -127, -465, 87, -643, 462, -457, -238, -165, -72, -457, 567, -13, 48, -110, -242, 487, 225, -57, -125, 55, 48, 128, 63, -31, -53, -475, -210, -361, 86, 1, -169, 86, 78, -433, 66, -208, 35, -70, -142, 547, -139, -396, 306, -619, 55, -51, -102, 191, 20, 157, -119, -338, 342, -92, 369, 200, -16, -380, -227, 401, 442, 69, 69, -1, -538, -90, -169, -97, 470, 15, 25, 257, -66, -727, 43, 11, 32, -201, 328, -132, 108, 163, 61, 264, -497, 419, -169, 2, -263, -303, 294, -196, -141, -91, 232, -219, -37, -229, -314, -46, 496, -261, -623, -520, 8, -23, -220, -613, -282, -27, 148, -453, -53, 98, -100, 30, -46, 5, -480, -175, 67, 234, 4, -90, 86, 333, 196, -113, -103, -11, -198, -176, 136, -72, -48, 104, 553, 41, -46, 362, -77, 249, -217, -29, -352, 402, 144, 228, 85, 154, -24, 15, -1, -176, 118, -354, -252, 2, -31, 305, -417, 280]
4186B80m14j66L11l4K10l04p4J60N1k16M27k78K8J95n83M63O5j68j36m94M67O
4208b04m6J23k8m16N54k15K30j6m33L85J62J8J48n09N50o55L85J9n16O32L15m22
4230F1J86qL7l07K01L0k70k36M06K55p4M08l51m54O09o09J21j33mM41l96P73p88
4253a02N31p35N3N49j07l52J84j82j19O60l57k27j8L1Nr3K76M56l88p3k34K06
4275c6l27m89P98K21jn7k91O76o43N44l89K38m05j6K44m99L00l20N90l23P57o90
4297a18lJ33k77L61o7k3j03j74N45n24K06J30n24J47L20j23J99p07J08P9N33l8
4319H0O05k20m46R0j56M44j53k70K45k23k06K5K97m2J13k44l95M14M66l3n86J10
4341h5N81m60M37p77M3K46l11k10M75K3p8n70N88J74n10K32l34O82K38n40O19
$$ y = [280, -134, -300, 11, -23, 187, -117, -191, -31, 20, -196, 231, -47, -19, 176, -407, 56, 121, -47, -183, -677, -210, -204, -250, -127, -155, -571, -17, -232, -2, -18, -451, -66, 96, 114, 262, -247, 303, -352, 33, 52, -464, 168, 483, 61, 247, 239, 276, -31, 170, 200, -70, -306, 100, 355, 281, 689, 338, -116, 493, -116, 5, -128, -132, 309, -87, 686, -102, 429, -306, -253, 296, 189, -163, 21, -161, -280, 380, 23, -204, -222, -191, -186, -279, -3, 453, 65, -8, -242, -36, -363, -852, -54, 167, 166, 109, -182, 494, -149, 395, 6, 244, -161, -177, 67, -432, -132, -452, 138, -185, 572, -118, -121, 12, -265, 96, 29, 6, -97, -271, 274, -250, -44, 86, -438, -291, 29, -94, 105, -602, -494, -415, 118, 80, 685, 465, 19, 109, -47, 397, 244, -26, 219, -4, -210, -185, 112, 70, 183, -61, -456, -42, 424, 391, -195, -85, 496, 36, 473, -304, -261, -15, -326, -536, -61, -38, -116, -686, -98, 76, -434, -202, -536, 146, 384, -156, 463]
4362D63r44J81L38L53j64k21J79j77K00l68N9J47o2L87n26L01k57M9J97k8k46
4383a39j49L08L62m0m77J36N01n56N36m01l52R24o72o1j37P01n98L98m95J60j12
4404a63j0L38k16k25K45M2k17M38n25j48M88o84R66J6j23j54q7J08Q3r9J5j68
4426h0k68O1r5K85k24L46m35M43K40m49K4M74k84n54N17j34k1N65n48M90K4o90
4448c13P2K32P73p81O3j49K55j87Q7m42J17j44Q23p08K22j76K38O7J5L83l81K61
4470C27q0j18q1L56l05k05m14N21K18l6K66m56J91j43J68M7r5j29ML44q55K78
4492a97K08n02K21M23l40J96k00OM48j16K2l06J09j54K60n76K02K26J45K56o35
4513c04M62j96k57L51J5L15m51J00L06P9k83R6Q6R4k40l89N37o4lq69O55J37l24
$$ y = [463, -481, -300, 38, 391, 227, 6, 185, 8, 208, -160, -101, 46, -16, 371, -155, 146, -111, -62, 135, 107, -139, -288, 20, 382, 342, -135, 1, 502, -54, 482, 81, -271, 653, -19, -80, -217, 484, -114, 284, -211, -51, -163, -173, 165, -51, -276, -31, 11, -206, 232, -293, -441, 47, -637, 329, 345, 222, 68, -19, 89, 172, 73, 88, -80, -348, -287, -382, -97, -321, 25, -410, 33, 273, -176, -152, 322, 38, -516, 1, -133, -154, 411, -137, 353, 377, -313, -241, -9, 764, -17, 46, -103, 152, -35, 52, -390, -273, -417, 406, -302, -80, -256, -18, 49, 64, 447, 66, 327, 247, 129, 48, 404, 99, -106, -520, 1, 219, 183, 449, -7, 184, 41, 209, 256, 161, 32, 36, 380, -475, -197, 11, -491, -270, 153, -187, 9, -191, -185, 263, 147, 169, -137, -28, -182, 78, -498, -296, -70, 75, 331, -304, 158, -38, -295, 56, 71, 386, -65, 35, 341, 420, 137, 233, 319, 413, 173, -216, 321, 257, 254, -615, 40, 177, -147]
4536a47M7P1J42m9k02K62j69K76l49j36L25j21L28k51j32K7O0j9K94j61j01m40
4558d45K06J43j90J74j70J10k12O03m25M29K6p29N76j96j43M25l86j11K19J02
4578FJ78l44K54J54o03O51m20L20k02m66J98j02M49j78J21l87O46k62j82M93p94
4599d70K80m92P87J83l66M70l57J46k0J26o74P90m18M30m11k4J28l9L7J07l83
4620a70Q0K58J43r98P92J60m79qN01p3k10M14m94L30mm03J65L15m49l27O65k80
4642g2K73l18J72k64Kl38lN78l86M07j57j09k37P43l66O84m67m65M78k49J70k42
4664a66n5N07l64j04K27K5M1JN1r4M6j29L5k6L64J51m41L83j47j09l66K72K84
4687C86j56K37k26l41J09L65k95l17M71l54M04q1m45K14L42l61P9k77J69P9J6
$$ y = [-147, -100, -29, 113, 64, -138, 124, -45, 231, -118, -254, 71, -50, 278, 27, -105, -78, -18, -37, 257, 96, -5, -445, -239, -96, -286, -112, -282, -172, -384, 219, -206, 223, 249, -480, 96, -100, -243, 182, -204, -315, -96, 6, 184, -160, 94, 248, -355, 296, -124, 196, -6, -472, -274, -376, 73, -105, 16, -371, 275, 13, -169, 324, -470, -190, -682, 105, 288, -78, 392, 35, 181, 161, 287, -387, 403, -15, 415, 4, -20, 108, 69, 106, 213, -170, -90, 168, 311, -687, 105, 265, -214, -222, 279, 206, -4, 410, -84, 246, 242, -161, 4, 319, -130, -457, 208, -72, 201, -117, 55, -209, -207, -545, -548, 30, -356, 51, -106, -215, -452, 291, -75, 609, 142, -323, 155, -94, 76, -166, -221, 286, -78, -182, 45, 70, 111, 112, 163, 69, 115, -14, 21, -5, 359, 510, 69, 452, 305, 196, -170, 102, 386, 230, 467, 241, -100, 9, 374, 79, -238, 233, -121, 283, 202, -243, -29, 313, -48, 31, -246, -77, 2, 18]
4708A8J3J33q9j99m02N11j22QO08o98j16P69m80J40M3N4l90l24J32Q21o93J75
4730h8q3m63K37L14o75J325n04j01P80p48N0k03Q90j107O27k75L96o36K22M06
4750C64J98m38l02L54o2k77P7J32k9j33K07L48o32Q5QL65n40K89J26k08r6L52
4772A88l75L23k8N29p65j49P2J80k78q4M74Ro5k30J99j57J00k24K98k58K68l86
4794c59K11l2q6K58j14j85L38n1j25J29l63L8L84K1k71m4m7l36J96%M54k03n08
4817f95K34p9P2J03N36l38j27M47k7L48o63L28m10P8N67l88K44o48R73J84m70
4838B69j5n36N0O38j086R45L6K88j27o83J62j22R3N78L29o44J127j366L44J0l76
4859h6r9n34J88n71R67l67Q42n46Q90j409O26O66o48O59j052K08o6k89J083J40
$$ y = [18, 31, 164, 75, -124, -526, -15, -137, -129, 479, -219, -335, 434, -46, 94, 137, 191, -199, -523, -391, 430, -263, -88, -171, -634, -397, -83, -758, 567, 63, -38, 742, -6, 44, -159, 731, -376, 251, -24, 372, -264, -42, 364, 562, 124, -178, 176, 114, -163, -86, 46, 17, -116, 91, 439, -193, -108, -100, 265, -275, 14, 140, -68, -164, 188, -187, 136, 108, 637, -128, -277, -205, -25, -303, -387, 87, 96, 31, -199, 0, -157, -57, -281, 17, -241, 27, -359, -148, -180, -266, -8, -122, -307, 31, -20, -145, -16, -379, -341, 43, 64, -207, -251, -298, -634, -438, -438, 16, -187, -695, -461, -540, -468, -365, 171, -167, -294, 153, 126, 474, -189, 139, -271, -193, 374, -14, 230, -418, 555, 739, 269, 254, -282, -232, 406, -680, 265, 301, 589, 462, -221, -59, -181, -88, 490, 819, 175, 1302, -64, 280, 290, -86, -185, -719, -531, -1102, -135, -502, 340, -206, 684, -725, -99, 567, -81, 578, -474, -266, -332, -621, 462, 602]
4879F02l72l89J84l92K52L18m44J55P6n7k60J22K51J36k52q55Q13P06m04k47N23
4900D66j89j82O5m1m65O85k15k28L28l11K28K38l16j39K43q5l30J39j81K31L49
4921B90j90K68k79k15p7L40K52l48j82j00J36J82K22K17m32M6l74K42KJ58n65
4942d07M96L97n20K26J02Kk50k25K11lj88L8J74J47m33j6m0n0K45p1P2L60m61
4965a94j42N67j310J041K23p83O67k28K83l52M52k06l90J20M52o06K68r4L63J04
4985B35o37M00l36L28j51o7K01O03n43L37l9j011J305j649R1R37L50Q0l70r5J06
5006G5J25J90r06M43J04J52k9k27n88N78J08M3m7Q5L24r37Q42j78k46l6j7L2K41
5029A31j86j42K54Q6j99l13J13N55m13J81L20q40P73q14J81N65k72J16K29m24
$$ y = [602, 230, -159, 25, -367, -115, 203, -241, -86, -10, -67, -327, -205, 46, 182, -70, -925, -112, 594, 190, -57, 466, 277, 95, 160, 119, -346, 339, 124, -104, 224, -87, 141, 379, 63, -76, 167, 82, -248, -109, -290, -59, 290, 100, 368, 89, -126, -203, 137, 389, 41, -141, -241, -105, 77, 299, 516, 84, 130, -244, -2, 0, 158, -407, 89, 486, -34, 192, 294, 296, 46, -179, 32, 29, -159, -121, 53, 200, -233, -249, -289, -339, -94, -165, -93, 267, -194, -336, 231, -1079, -38, 185, -598, 69, -159, 124, -228, 224, 18, -372, -252, 200, -406, -138, -232, 131, 235, -402, -2, -338, -10, -161, -228, -27, 576, 33, 370, 331, -680, 625, -1024, -933, 4, 354, 434, 64, -31, 75, 200, 390, -516, -73, 31, 183, 154, -73, -661, -83, 25, 68, 21, 106, 430, -507, 335, 157, -89, -125, -142, -110, 131, -55, -197, 57, 143, -56, -369, -256, 299, -114, 67, 387, -453, 320, -494, -313, 252, -20, 96, 325, -99]
5049i9m90N28j22O73j70m26L51J69m31R5o8J2O45o97K88k18K94j04K21n2p95M55
5071E9m6J16M85n46J05J1m3o70K33L82J20lJ7n78L32k48L85N1k69M35m21K71m34
5094b56L58m78O65m92k9L46J99l55j79K40j76J35n22P84k18k5m43O00o84L1M72
5115b7l40K22J10R4k27j96N42o49Q38p29J80L8K44M00k69p4m36K00r6M14M6k91
5137fL8K51j27J91r3j79k16K38j8M08m58j25M13l56L99N8n00K19K26l99jJ90J72
5160C25m89M9O7l62P50q57O42r4K41k4j59L08m24O36p01l7N84n70L10j58p7m05
5182d45M14K32n70n5M46j97K35j99M45o56K41L42j74n4P2m53M90p29N51M21o40
5203b83L43K33q30J077q49M11P3m89K61J53r9J19j13j37K71Q2p8pM91k65m74N2
$$ y = [-99, -589, -61, -183, 490, 320, -106, 245, 414, -17, 78, 10, 22, 667, -30, 258, 40, 334, 230, 451, 399, -396, 59, 13, 129, 614, 68, 173, 184, 141, -529, -296, 86, 206, 203, 220, -358, -26, -274, 111, 162, -107, 328, -93, 178, -256, 102, -376, 289, -203, -232, 114, 313, -42, -221, 19, -157, -22, -544, 240, 22, -3, -446, 154, -530, -499, -27, -367, -145, -35, 59, -168, -364, 178, -471, 367, -362, -182, -144, 100, 500, 231, 157, -279, -79, -175, 239, 285, -6, 32, 283, 156, 347, 254, 75, -141, 97, 79, 487, 29, -96, 317, -39, 360, 418, -82, 137, 363, -36, -37, 153, 325, -164, -115, -48, -410, 340, -517, 125, 31, 272, 248, 89, 397, -27, 609, -92, -129, 455, -115, 195, 37, -40, -445, -31, 201, -369, -424, 22, -175, 60, -139, 306, -350, -109, 233, 59, 5, 77, -376, 114, -615, -64, 357, -283, 60, 293, -537, 540, -309, 102, 175, -314, -53, 100, 1, 120, 7, -130, 141, 223, 145, 138, 629, 364, -110, -58]
5225e8L12l90K05P1Q1j67K9K54j85l60N37R0j73m54J68j87O69j26q7k57k81J63
5247a46K83J0l28P7P5k91K38J01j96j54L96j47j98N12j80M2m43M87m61J61K34
5268G2J43l37l41L77j61R7N45o80L63J46j59J94n91R6P6m0NK2R5J29j46L00m4
5291A61j34r4L16n74K09J20j45J34k2K10J90l7k17M62m05M01o96K98J03k08q7
5312a5J4K43j87O73j65m08q5MJ95J08p73K83K68J97k5o21r6L63j09J1M87j037
5334f75L73Jj4R61o03l40K87j81M31k20O1N31m26m32Q5K52j88j3M5Q0Q19o91n29
5357c86M65l46P07O7J19p65l59M91K67m17K58J25k18L8n39P31o93N04K32k70K88
5378B99J3j020l55P77N1j68n9O28Q2pK27j38n15R17j300J072j25j158O59L40q25
$$ y = [-58, 254, -136, 69, 140, 221, 54, 83, 337, 152, -208, 329, 419, 246, -208, -40, -227, 442, 316, 229, -28, -309, -146, 137, 147, -181, -104, -29, -320, -82, 19, -177, -331, 65, -82, -280, 232, 52, 94, -349, 138, -323, -162, 72, 215, -122, -463, -86, -247, -150, 395, -285, 78, 224, 65, 259, -332, -236, -160, -200, -195, -173, -78, 51, -95, 205, 161, 27, -67, 249, -325, -116, 4, -141, -7, -29, 181, 371, 334, 117, 579, 174, 575, -121, 177, 280, 72, -15, -1, 242, 55, 728, 563, 155, 70, 74, 269, 377, -396, -113, 155, 352, 327, -294, -390, -27, -136, -125, 362, -675, -302, -301, -315, 646, 43, -297, -10, -191, 240, 20, 81, 612, 186, -246, -161, 91, -97, -110, -65, 15, 834, 143, -386, 79, -267, 440, 507, 626, -139, -498, -7, 260, -157, 101, 226, 8, 46, -493, 238, -455, 49, 281, 11, 299, 312, -708, -1063, -286, -235, -403, -462, 166, 248, 241, 468, 330, -185, 732, -568, 504, 379, -779, -120, 220, -605]
5399f05K86M55p40K75Q9k71J11O8N63m38j27J46j53K97P05j584N04J0L86L34o7
5420B44j43O4q67M21M03k50M16j01k34K17l63J93N7j3k21O86o09J10j4J01l74
5441b77J60L93n75M89k44J32M34l95K0J57l7K1k13m33O38j55J63k31J48j37L04
5462C62R4m78J82n42J24K5J10j48M12J35k43K51q2l71L02k94N36k24k34k65M1
5483c07K05L55j56m14j30K42L71k5n90J59J26J30l9J23j48k32Q00l20m90N01l42
5504a81J34Q5J25j98J04r4l20M0J73M16m03K34j43j1L12j59k93J57M41l06k69
5525a56j5M46l59M56n89j48P40p2m42N29n38K80J46j84J39j77M7J95Om65J40m07
5547d28K24O6l06N91J45l68N56q43j14M03J17O1j09l79N36J15p74O6P51n33l22
$$ y = [-605, -319, 136, -604, -329, -240, -511, -400, -332, 231, -207, -334, -188, -341, -44, 661, -923, -419, -409, -23, 311, 244, 101, 165, -702, -281, 122, -128, 288, 187, -47, 170, -193, 0, 57, 44, -177, 509, -100, 10, -4, 97, -277, -117, 276, -299, 190, -54, 78, 512, 117, 137, 294, 257, 278, 65, -368, 270, 115, 278, 47, 195, 58, 362, 456, -22, 160, -382, -258, -233, -123, -271, 141, 276, 33, 284, 202, -169, 133, -161, 375, 151, -83, -348, -307, -102, 253, 97, -317, -447, -205, 166, 141, -449, -290, -164, -34, -73, 50, -98, -330, 470, 150, -340, 161, -181, -47, 38, 163, -35, 69, -25, -345, -305, -132, 284, -119, 115, -28, -39, 273, 114, -179, -22, 419, 113, -156, -171, 275, -84, 372, -217, -365, 375, 303, -139, 390, -148, 132, 278, 94, 233, 56, 103, 298, 304, -161, -21, -428, -204, -138, -444, 147, 292, -76, 480, -363, -477, -74, 43, 104, -5, -384, 152, 267, -507, -441, 310, -223, -545]
5568e45L65k17M75k12J48l17j25R63n51m34J65J30q7P8P02n68l51L02M80p06J99
$$ y = [-545, -180, -397, 78, -134, 14, -303, -428, 535, -16, -450, -285, -155, -242, -164, 538, -30, -381, -79, 401, -305, -106]
$$ [...]
8191A3
##END NTUPLES=NMR FID
##END=
