##TITLE=1H_SL59-Dau(bat1)-f1-f2
 CDCl3, 32 sc, 
 1.06.2021
##JCAMPDX= 6.0         $$ Bruker NMR JCAMP-DX V2.0
##DATA TYPE= NMR FID
##DATA CLASS= NTUPLES
##ORIGIN= UXNMR, Bruker Analytische Messtechnik GmbH
##OWNER= root
$$ XWIN-NMR		Version 3.5
$$ Tue Jun  1 11:16:01 2021 Russian Standard Time (UT+4h)  she@DPX200
##.OBSERVE FREQUENCY= 200.131506
##.OBSERVE NUCLEUS= ^1H
##.DELAY= (6, 6)
##.ACQUISITION MODE= SIMULTANEOUS
##.ACQUISITION SCHEME= undefined
##.AVERAGES= 32
##.DIGITISER RES= 18
##SPECTROMETER/DATA SYSTEM= spect
##.PULSE SEQUENCE= zg30
##.SOLVENT NAME= CDCl3
##.SHIFT REFERENCE= (INTERNAL, CDCl3, 0, 15.7039)
##AUDIT TRAIL= $$ (NUMBER, WHEN, WHO, WHERE, WHAT)
$$ ##TITLE= Audit trail, XWIN-NMR		Version 3.5
$$ ##JCAMPDX= 5.01
$$ ##ORIGIN= Bruker BioSpin GmbH
$$ ##OWNER= she
$$ F:/spectra/data/she/nmr/H-F/1/audita.txt
$$ ##AUDIT TRAIL=  $$ (NUMBER, WHEN, WHO, WHERE, WHAT)
(   1,<2021-06-01 11:14:14.62 +0400>,<she>,<DPX200>,
      <continue with go, POWCHK disabled, PULCHK disabled
       configuration hash MD5:
       00 E9 B6 7A A2 85 ED C7 34 08 36 98 17 FE 4E 26
       data hash MD5: 16K
       74 BA 20 93 FD 93 77 A5 94 0E D7 95 8E B9 3C 78>)
$$ ##END=
$$ 
$$ hash MD5
$$ 0B A8 64 16 B9 C5 60 6C 59 F6 2B 4F 8C FD 19 86
##$RELAX= 
##$RELAX= 
##$RELAX= 
##$RELAX= 
##$RELAX= 
##$RELAX= 
$$ Bruker specific parameters
$$ --------------------------
##$DU= <F:/spectra>
##$EXPNO= 1
##$NAME= <H-F>
##$PROCNO= 1
##$TYPE= <nmr>
##$USER= <she>
##$AMP= (0..31)
100 100 100 100 100 100 100 100 100 100 100 100 100 100 100 100 100 100 
100 100 100 100 100 100 100 100 100 100 100 100 100 100 
##$AQSEQ= 0
##$AQ_mod= 1
##$AUNM= <au_zg>
##$AUTOPOS= <>
##$BF1= 200.13
##$BF2= 200.13
##$BF3= 200.13
##$BF4= 200.13
##$BF5= 200.13
##$BF6= 200.13
##$BF7= 200.13
##$BF8= 200.13
##$BYTORDA= 1
##$CFDGTYP= 0
##$CFRGTYP= 5
##$CHEMSTR= <none>
##$CNST= (0..31)
1 1 145 1 1 1 1 1 1 1 1 1 1 1 1 1 1 1 1 1 1 1 1 1 1 1 1 1 1 1 1 1 
##$CPDPRG= <>
##$CPDPRG1= <>
##$CPDPRG2= <>
##$CPDPRG3= <>
##$CPDPRG4= <mlev>
##$CPDPRG5= <mlev>
##$CPDPRG6= <mlev>
##$CPDPRG7= <mlev>
##$CPDPRG8= <mlev>
##$CPDPRGB= <>
##$CPDPRGT= <>
##$D= (0..31)
0 1.2 0 0 0 0 0 0 0 0.06 0 0.03 0 0 0 0 0.0002 0 0 0 0 0 0 0 0 0 0 0 0 
0 0 0 
##$DATE= 1622531548
##$DBL= (0..7)
120 120 120 120 120 120 120 120 
##$DBP= (0..7)
150 150 150 150 150 150 150 150 
##$DBP07= 0
##$DBPNAM0= <>
##$DBPNAM1= <>
##$DBPNAM2= <>
##$DBPNAM3= <>
##$DBPNAM4= <>
##$DBPNAM5= <>
##$DBPNAM6= <>
##$DBPNAM7= <>
##$DBPOAL= (0..7)
0.5 0.5 0.5 0.5 0.5 0.5 0.5 0.5 
##$DBPOFFS= (0..7)
0 0 0 0 0 0 0 0 
##$DE= 6
##$DECBNUC= <off>
##$DECIM= 32
##$DECNUC= <off>
##$DECSTAT= 4
##$DIGMOD= 1
##$DIGTYP= 9
##$DL= (0..7)
0 120 120 120 120 120 120 120 
##$DP= (0..7)
150 150 150 150 150 150 150 150 
##$DP07= 0
##$DPNAME0= <>
##$DPNAME1= <>
##$DPNAME2= <>
##$DPNAME3= <>
##$DPNAME4= <>
##$DPNAME5= <>
##$DPNAME6= <>
##$DPNAME7= <>
##$DPOAL= (0..7)
0.5 0.5 0.5 0.5 0.5 0.5 0.5 0.5 
##$DPOFFS= (0..7)
0 0 0 0 0 0 0 0 
##$DQDMODE= 0
##$DR= 18
##$DS= 0
$$ [...]
##$SUBNAM2= <"">
##$SUBNAM3= <"">
##$SUBNAM4= <"">
##$SUBNAM5= <"">
##$SUBNAM6= <"">
##$SUBNAM7= <"">
##$SUBNAM8= <"">
##$SUBNAM9= <"">
##$SW= 16.9725357007746
##$SWIBOX= (0..15)
0 0 2 0 0 0 0 0 0 0 0 0 0 0 0 0 
##$SW_h= 3396.73913043478
##$TD= 16384
##$TD0= 1
##$TE= 0
##$TE2= 300
##$TE3= 300
##$TEG= 300
##$TL= (0..7)
0 120 120 120 120 120 120 120 
##$TP= (0..7)
150 150 150 150 150 150 150 150 
##$TP07= 0
##$TPNAME0= <>
##$TPNAME1= <>
##$TPNAME2= <>
##$TPNAME3= <>
##$TPNAME4= <>
##$TPNAME5= <>
##$TPNAME6= <>
##$TPNAME7= <>
##$TPOAL= (0..7)
0.5 0.5 0.5 0.5 0.5 0.5 0.5 0.5 
##$TPOFFS= (0..7)
0 0 0 0 0 0 0 0 
##$TUNHIN= 0
##$TUNHOUT= 0
##$TUNXOUT= 0
##$USERA1= <user>
##$USERA2= <user>
##$USERA3= <user>
##$USERA4= <user>
##$USERA5= <user>
##$V9= 5
##$VALIST= <valist>
##$VCLIST= <CCCCCCCCCCCCCCC>
##$VD= 0
##$VDLIST= <DDDDDDDDDDDDDDD>
##$VPLIST= <PPPPPPPPPPPPPPP>
##$VTLIST= <TTTTTTTTTTTTTTT>
##$WBST= 1024
##$WBSW= 4
##$XGAIN= (0..3)
0 0 0 0 
##$XL= 0
##$YL= 0
##$YMAX_a= 464592
##$YMIN_a= -423126
##$ZGOPTNS= <>
##$ZL1= 120
##$ZL2= 120
##$ZL3= 120
##$ZL4= 120
##$ABSF1= 10
##$ABSF2= 0
##$ABSG= 5
##$ABSL= 3
##$ALPHA= 0
##$AQORDER= 0
##$ASSFAC= 0
##$ASSFACI= 0
##$ASSFACX= 0
##$ASSWID= 0
##$AUNMP= <proc_1d>
##$AZFE= 0.1
##$AZFW= 0.1
##$BCFW= 1
##$BC_mod= 2
##$BYTORDP= 1
##$COROFFS= 0
##$CY= 11.3945322036743
##$DATMOD= 1
##$DC= 2
##$DFILT= <>
##$DTYPP= 0
##$F1P= 15.9154993809931
##$F2P= -4.1035820241983
##$FCOR= 0.5
##$FTSIZE= 0
##$FT_mod= 4
##$GAMMA= 1
##$GB= 0.15
##$INTBC= 1
##$INTSCL= 1
##$ISEN= 128
##$LB= 0.24
##$LEV0= 0
##$LPBIN= 0
##$MAXI= 10000
##$MC2= 0
##$MEAN= 0
##$ME_mod= 0
##$MI= 1.114404
##$NCOEF= 0
##$NC_proc= 0
##$NLEV= 6
##$NOISF1= 3.799351
##$NOISF2= 2.8
##$NSP= 1
##$NTH_PI= 0
##$NZP= 0
##$OFFSET= 15.70392
##$PC= 1
##$PHC0= -11121.76
##$PHC1= 14.00099
##$PH_mod= 1
##$PKNL= yes
##$PPARMOD= 0
##$PSCAL= 0
##$PSIGN= 0
##$REVERSE= no
##$SF= 200.130013532006
##$SI= 16384
##$SIGF1= 3
##$SIGF2= 2
##$SINO= 400
##$SIOLD= 16384
##$SREGLST= <1H.CDCl3>
##$SSB= 0
##$STSI= 0
##$STSR= 0
##$SW_p= 3612.71676300578
##$SYMM= 0
##$S_DEV= 0
##$TDeff= 0
##$TDoff= 0
##$TI= <>
##$TILT= no
##$TM1= 0
##$TM2= 0
##$TOPLEV= 0
##$USERP1= <user>
##$USERP2= <user>
##$USERP3= <user>
##$USERP4= <user>
##$USERP5= <user>
##$WDW= 1
##$XDIM= 8192
##$YMAX_p= 0
##$YMIN_p= 0
$$ End of Bruker specific parameters
$$ ---------------------------------
##NTUPLES= NMR FID
##VAR_NAME=  TIME,          FID/REAL,        FID/IMAG
##SYMBOL=    X,             R,               I
##VAR_TYPE=  INDEPENDENT,   DEPENDENT,       DEPENDENT
##VAR_FORM=  AFFN,          ASDF,            ASDF
##VAR_DIM=   8192,          8192,            8192
##UNITS=     SECONDS,       ARBITRARY UNITS, ARBITRARY UNITS
##FACTOR=    0.0002944,     1,               1
##FIRST=     0,             0,               0
##LAST=      2.4114304,     0,               0
##MIN=       0,             -423126,         0
##MAX=       2.4114304,     464592,          0
$$ Real data points
##PAGE= N=1
##DATA TABLE= (X++(R..R)), XYDATA
$$ [...]
2261c82j51j70N65k23J03O12j051M22p6Q4j86k0j58Q67m79M48R6p74M43K74m19
2282a75L82l80j13P05o55J99O4q6R18p07j16Q33k95k83K34n69O84k15J5N05r17
2303B8J59M02k92M00k50n11O59l14L67p5j077R86l6m62L39o12L05l96J18K95m1
2324ho71J332o06m73L68p0j23K4j93K05k65l08M47l82K47P31l33m73K83L83j01
2345A4l75j33K20Q0j80J43O6j13L69j58J37P0j55M1l11R02p34NP4M44m92N92p91
2368b85M16Q36q63O44o58L54Q0J07n83P44o9n07k94N18k61K0j11K0k5O76l62q17
2390d20J094q55K74L61q50M68N3l15N07m86K15l51L34J06m43l97M87J91p32J53
2410f06q4P07k14l83N15j1l62j34L27M9k79J74K93m6o81L61J05K36j46j98L07
$$ plain form
2261 -382 -533 -703 -138 -361 -258 354 -697 -275 -351 -267 -453 -473 -631 236 -243 205 301 -473 -30 244 -175
2282 -175 207 -173 -286 419 -236 -37 27 -59 859 152 36 869 574 291 525 -44 640 425 440 945 28
2303 28 187 589 297 697 447 -64 595 281 648 573 -504 482 446 -16 323 -289 16 -380 -262 33 -8
2324 -8 -679 653 47 -426 -58 -128 -251 -227 -420 -215 -480 -788 -341 -723 -476 255 -78 -551 -268 115 14
2345 14 -361 -494 -274 -194 -374 -231 -165 -278 91 -67 70 140 -15 26 -285 617 -117 -112 -38 406 -86 506 -285
2368 -285 131 967 104 748 90 444 524 631 48 792 723 216 -78 440 179 199 88 108 83 759 397 -420
2390 -420 674 -181 93 454 -396 72 125 -190 317 -169 46 -305 29 135 -308 -705 -218 -27 -759 -606
2410 -606 -690 17 -197 -580 -65 -76 -438 -572 -245 -196 -475 -301 -8 -54 -735 -374 -269 -33 -179 -377 -70
2431g0L43p2l14L02n50J146k17j66l22l99M61K25l64P25p19J95O93n47o42O95
2451D03J23J88J25m14n1n0Q8n58O95n33J00M80L1O9p88N56n64J0K13j40j47k46
2473d10R45l58n47P46n89j11M66kn16P5m7J66K92q6n55K00K00pn56M86p6j15K05
2496a94M23o45O23j64k42n76m83K005j525J35N97p05O26K27k1k51J24J1L44M2
2516C51l94k25R36o09j22o0l80L00O94l21J3K79j66K29k55o9k42k35Q03J95o16
2537A06K80L99o24r8l8M08k28k09j50L97l39lj37n2p1O25n61K67j62O1N9nl37
2560d12K79p6n78Q41n98P05p16K08k02M81l68p9J98j30Q62j410J442r98M83j21
2580a89l39K00l8K7R35j511O94J89l43L45n6N86j69J4j05K80j4k94k96N39l09
$$ plain form
2431 -70 273 201 -113 189 -361 785 568 402 80 -319 142 367 3 728 9 204 897 350 -292 403
2451 403 526 714 839 425 374 324 412 -146 549 16 116 596 627 696 -92 464 -100 -90 123 -17 -164 -410
2473 -410 535 177 -370 376 -213 -324 142 140 -376 -301 -348 -182 110 24 -531 -331 -131 -138 -694 -208 -284 -399 -194
2496 -194 229 -416 207 43 -199 -775 -1258 747 -778 -643 -46 -751 -125 102 81 -170 -46 -35 309 351
2516 351 -43 -268 668 59 -63 -123 -503 -203 491 170 183 462 296 525 270 201 -41 -276 527 722 106
2537 106 386 785 161 63 25 433 205 -4 -154 243 -96 -99 -236 -288 -359 266 -295 -28 -190 -129 -70 -75 -412
2560 -412 -133 -209 -787 54 -544 161 -555 -347 -549 -68 -436 -515 -317 -447 415 -995 447 -551 -68 -189
2580 -189 -528 -328 -366 -339 596 -915 -221 -32 -375 -30 -86 500 331 345 240 520 506 212 -84 455 146
2601A46k35J03M80l51J21L50k33K97l05j53L69m44On81N02K07j97j20J11O02o80
2622ej9K33j09l57J44J76j51J22K42o31L94k52K54k63O4j75L93k7j95l14p6M01
2644a51k27q4L2M77om17K20j45j58J7j5M88p63N49J90M66r5r44N23J80l21J22
2666f2M49k74JK0l53n04J092k05p9J82l02N0J17M30m22L57j36m76P88o25J61k15
2688fJ00K66K34m47o7l28N72K43n14r9k58O83l46n95P83m9k31j72l1l72L19m8
2710c63J60l57Q6M39l78J24Qk30M47J88m48Q9o43Q43j11r8L69r22Q53K10n24k13
2732d71N03j05J51Km80N21k63l28L26p6O01n0m22J03O9J76J29m72J85J8P0K06
2754C93k67L77m46J01J43nk09J91Qk08J23R2l42P93n95m75M94J07m66N50k08k52
$$ plain form
2601 146 -89 14 494 143 264 614 381 678 373 220 589 145 151 -430 72 279 82 -38 73 675 -5
2622 -5 -24 209 100 -257 -113 63 -88 34 276 -355 39 -213 41 -222 -158 -333 60 33 -162 -476 -552 -151
2644 -151 -378 -462 -430 47 41 -376 -156 -301 -459 -442 -457 31 -732 -183 7 473 378 -566 -43 137 -184 -62
2666 -62 387 113 114 134 -219 -723 369 164 85 267 -35 15 132 562 140 497 361 -115 673 48 209 -6
2688 -6 94 360 594 147 80 -248 324 567 53 -46 -304 379 33 -562 221 172 -59 -231 -262 -634 -315 -363
2710 -363 -203 -560 -474 -35 -413 -289 -281 -511 -64 124 -324 -235 -878 -35 -146 -244 125 -797 56 266 -258 -471
2732 -471 32 -73 78 80 -400 121 -142 -470 -144 -220 381 331 -91 12 81 257 386 -86 99 117 187 393
2754 393 126 503 57 158 301 296 87 278 286 78 201 293 -49 744 149 -326 168 275 -191 359 151 -101
2776a01J76k34J26m23Q96m53J68J22o28L47J59l27j56M54j07K40n05j8K38q85
2796i11N06K30o25O57j28K28J80n07oL10k68K93k82K51J44N87p04m04J48K54L33
2817B86l88k48K07j6K73m14N56L17p66M11j77l00N28Opj63L44j23k0n29O99j89
2839B87n38J52R9N02n2k3l70pJ7j06L30j4k14n69L21N96k48p99Q02k02J5o53P36
2862F2J22j95m7k36K2K81m40K54K75l40J89k15j12j54P57n09P83j020P09L84k55
2883C15m91j64P71l87K53l61O28p79K91J6n47Q55n41L50K5k09J43m6j49L61k63
2904G1k46M66p44P06Q6l10K59q0N46n95J49l16r4J96R9j20n4J36k36J51K62n23
2926a91M81Q9m69Q2O4l6J68n98N39Ql28l74O52k00k17K06k24k3n13Q17M89p47
$$ plain form
2776 -101 75 -159 -33 -456 440 -13 155 277 -351 -4 155 -172 -328 126 19 259 -246 -264 -26 -911
2796 -911 -405 -175 -800 -143 -271 -43 137 -370 -376 -66 -334 -41 -323 -72 72 659 -45 -449 -301 -47 286
2817 286 -102 -350 -143 -159 114 -300 256 573 -193 218 41 -259 269 275 268 105 449 326 306 -223 476 287
2839 287 -251 -99 0 502 450 427 57 50 67 -39 291 277 63 -506 -185 411 163 -636 166 -36 -21 -674 62
2862 62 184 -11 -58 -294 -272 9 -431 -177 98 -242 -53 -268 -380 -534 223 -286 497 -523 186 570 315
2883 315 -176 -340 431 44 297 -64 564 -215 76 92 -455 400 -141 209 234 25 168 122 -27 334 71
2904 71 -175 291 -453 253 339 29 288 208 754 159 308 -8 -102 94 193 73 19 155 -81 70 332 -191
2926 -191 290 379 -90 -8 56 20 188 -410 129 137 -191 -565 87 -113 -330 -124 -348 -371 -884 -67 422 -325
2948c25L91k99q3K83l37m02O94%J0j85J21N07o91N12j10j98J34k97Q92o54k47
2969b84O54j059L22k84Q12k37N07q19M43m31O36M0N48j020O75j87r1k04K39j4
2989B46j9k53N64k18p48N20M59k58Rl03K04j9n4M01n49j12K38l87K17N6m15R09
3011D88k89k27p4r0l03j46N39j48M45m97L3L20Q5k08J47j72J82m17k74N06j57
3032b57O04l90j61k27P60n26R8L42j31l0J43m26O13J1m35k71K97r3L02J08p67
3053d36M47j5l11O48r8J20j99jR5m2k9m3k34L79j20Nj09J18N5m6M5L36j48l4k51
3078A32N23m98m29N48q2j27L35l51K35n30M03l02K18J17n23J61J86J4r1K1KJ73
3100A35l91L77l14L84l81K11l20L91r5q0lm65N44k31J85P2j10J02k9l15J15M65
$$ plain form
2948 -325 66 -233 -316 -33 -370 -772 -78 -78 -68 -253 -132 375 -316 196 86 -112 22 -275 617 -37 -284
2969 -284 370 -689 -367 -651 161 -76 431 -388 55 -376 260 300 848 -172 503 316 225 21 260 246
2989 246 227 -26 538 320 -428 92 551 293 302 -1 203 184 130 531 -18 -130 108 -279 -62 -6 -421 488
3011 488 199 -28 -102 -192 -495 -641 -102 -250 195 -302 -269 51 136 -72 75 -97 85 -332 -606 -100 -257
3032 -257 347 -43 -204 -431 329 -197 -99 243 112 82 225 -201 412 423 -12 -283 14 -79 223 331 -436
3053 -436 11 -4 -315 333 235 355 156 155 250 208 179 136 -98 281 161 166 57 175 230 184 229 565 417 383 132
3078 132 655 157 -272 276 194 67 402 51 286 -244 159 -143 75 192 -331 -170 16 30 -61 -40 -38 135
3100 135 -256 121 -193 191 -190 21 -299 92 -3 -83 -86 -551 -7 -238 -53 19 -91 11 -18 -333 -218 247
3122B47k19j64M96r57M45M28q4J00J72o00O32N3j97j29L1j53k03L30N1l61M74
3143C92l67p5M89n07P3L98j34k07q5K82j63n89L64k30P11j79k25R0j30L47l82
3164a27r1R1m97R08k40j50q9K1K39m60L02L58n84K85j53j09K8l56R87j05k82l39
3186c63L63l35K40J99m48M19k56q1J95l30K69K93m7J57m88K9L80J48l69J10M2
3207A27j40J49l17J62O66n49J72K42n78M25J47k13K07n41N9K71l66j21l3N35m37
3228a33Q06r65K04L10p80M32N71l38K26m39K3k66K92j84M30n49Q54n72j41J05
3248a14K42M36m09l85K23p4L10k62Qk8k58J65p8j25K03L09r1O18j003J23Jo7K60
3271Dj06M11J79k74m35N4L42n68K58L68n45J73k4O60m23J73n9j28k26J033n97
$$ plain form
3122 247 28 -136 360 -597 -152 276 192 292 464 -136 496 549 352 223 254 101 -102 228 279 -82 392
3143 392 25 -50 439 -68 5 403 269 62 -23 259 96 -493 -129 -359 352 173 -52 38 -92 255 -127
3164 -127 -218 -127 -624 284 44 -106 -195 -174 65 -395 -93 265 -319 -34 -187 -296 -268 -624 363 258 -24 -363
3186 -363 0 -335 -95 104 -344 75 -181 -262 -67 -397 -128 165 118 275 -213 -184 196 344 -25 85 127
3207 127 -13 136 -181 -19 647 98 270 512 -66 359 506 293 500 -41 18 289 -77 -198 -231 304 -133
3228 -133 673 -292 -88 222 -558 -126 445 107 333 -106 -83 -349 -57 -241 189 -360 494 -78 -219 -114
3248 -114 128 564 155 -230 -7 -81 229 -33 -25 -53 -311 -146 -224 -349 -146 163 72 690 -313 -190 -189 -256 4
3271 4 -102 309 488 214 -221 -167 175 -393 -135 233 -312 -139 -163 497 74 247 188 60 -166 867 270
3292B70J24n23j87N61l20K29N62j55n77k67O3P09l06L35p25O51m60r5M5k88L37
3313a7j40L60m73L02L00j21m85K3j80M91j38j93J79L4K53j36m89N98K28m06n08
3334e18K81L93m69K00M64n94J89K63p26Q30K57j366N62K42N16p36L93l81M45j2
3354B33j63J3l8m72L52p%j37O1Q0J4R6M27k66q8K61l83K17k70O9J40L4k85R82
3378H70r23K02K1j11J32K19n6j13J96p77K22M3K51k59Q1r3j95J01K75k01pj65
3400b87j61O91n82O58m88J04L92l75o51M27P22o09m53lQ41k94M1Q6R4l1l6L54
3422D40n25k75K96J14j86J65L7k6o9l10N91l09k61L69k81L47j36J60q7J26k14
3443c4j39M26j61L15j3r4j31k56L8r1Q3K34J96l67J58J08l31J54kj41L03l26k37
$$ plain form
3292 270 394 -129 -316 245 -75 154 716 561 -16 -283 -220 489 183 518 -207 444 -16 -111 -66 -354 -17
3313 -17 -157 203 -270 32 332 211 -274 -251 -431 60 -78 -271 -92 -58 195 59 -430 168 396 -10 -518
3334 -518 -237 156 -313 -113 351 -243 -54 209 -517 313 570 -796 -234 8 524 -212 181 -200 245 233
3354 233 70 83 45 -427 -75 -82 -82 -219 -158 -78 -64 32 459 193 105 366 -17 200 -70 -1 139 173 -112 870
3378 870 -53 149 170 59 191 410 354 241 437 -340 -118 -75 176 -83 -2 -95 -290 -189 86 -115 -122 -287
3400 -287 -448 243 -339 319 -169 -65 327 -48 -699 -272 450 -159 -612 -615 226 -68 -27 59 153 122 86 440
3422 440 -85 -360 -64 50 -136 29 66 40 -29 -339 252 -57 -318 51 -230 117 -19 141 54 180 -34
3443 -34 -173 253 92 407 394 300 169 -87 -49 -140 -57 177 373 6 164 272 -59 95 93 -48 255 -71 -308
3466c08K43l1M75l90J37J53o37M5J70R3K24J86m61J03M5l93L29k98K81j29J73
3487A0j78l72L82oN8j64L68l46K09J88L1m9q6J04j16J20k14m07L11l5L4k00o3
3510d21P4J61P9K96n37O28q42N64k89m5K0L81J33J87l21J60K22m17L28l49L09
3531C21n02L04K17n06K58k73O07j66n8J4o60P8L52L38n69L37o4J06n58L36o27
3552g15R18k06o6n3n0L06n64O11k57k08j34N42n35M22m02K93J64k10m76N32j47
3573b35R3K85k44J08k43k3L31j52P2J10o7m3l3M29k91l49M89r78O51j4J61L9L4
3596A30k38J44l4l70K66O72n04Q2o4M80q18O65n4l47N69k88k00K96l46r3K96k95
3618e1j00L43K5k68l31P00k37m23m90Q48j51l28N42K80j57r47J259q80Q30p7l16
$$ plain form
3466 -308 -65 -96 379 -11 126 279 -358 -313 -143 -50 174 360 -101 2 47 -346 -17 -315 -34 -163 10
3487 10 -168 -540 -158 -164 -106 -270 98 -248 -39 149 180 131 45 149 33 153 -61 -468 -157 -192 -158 -358 -421
3510 -421 -347 -186 -107 189 -348 280 -562 2 -287 -332 -312 69 202 389 68 228 450 33 361 12 321
3531 321 -181 123 340 -166 92 -181 426 260 202 216 -444 -366 -14 324 -245 92 28 134 -424 -88 -715
3552 -715 203 -3 -69 -122 -172 134 -430 181 -76 -284 -418 124 -411 11 -391 -98 66 -144 -620 -88 -235
3573 -235 -142 143 -101 7 -236 -259 72 -80 -8 102 35 -8 -41 388 97 -252 237 -741 -90 -104 57 96 130
3596 130 -108 36 2 -368 -102 570 66 148 84 564 -254 411 357 10 579 291 91 387 41 -52 244 -51
3618 -51 -151 192 217 -51 -382 318 81 -342 -832 16 -135 -463 79 359 202 -745 514 -366 464 387 71
3639G1K1m29L21r6K50j93J56l54J1J66P3k33L55j66m16N37j96J28P2K30K07l76
3661A39o7k54J87J06M07m60k5L18l52oj21O7J46o5n32N54j40L81L86p39j8k7Q
3684a07O44n23L67j03J90m81j16J27M20J41j66j93l23N85j23n23L0K33K54o63
3704c30L89J53o98J40L54j99K41j3J7P01q27k96J14J75l44P82o19p0J81p3K32
3725A0J37P7n99P82o63k1M74k11n69O98l35L70l86J13K19o96J54M13k6M6M92m28
3747E1J35j94j90L64j48k14L89j89K60k12L40n91jM52k43o80Q27p4l07QJ122q62
3769D3K68k42p3J36J159j813L57L8R29j077J74K74j54j96o29J802j124m06K52
3788b82K98K40q71P27M55m22m82N31M24n07L57m69M94j75l19J089j042o57N17
$$ plain form
3639 71 92 -337 -16 -112 138 -55 101 -253 -242 -76 -3 -236 119 -47 -463 74 -122 6 78 308 515 139
3661 139 72 -182 5 111 518 58 33 351 -1 -7 -128 -61 85 20 -512 42 -98 283 669 -70 -88 -115 -107
3684 -107 537 14 381 278 468 -13 -129 -2 418 559 393 200 -123 462 339 -184 -154 79 333 -330
3704 -330 59 212 -486 -346 8 -191 50 37 54 755 -72 -368 -254 -79 -423 359 -260 -330 -149 -222 10
3725 10 147 224 -375 407 -256 -277 197 -14 -583 115 -220 150 -236 -123 96 -600 -446 -33 -59 -13 479 51
3747 51 186 -8 -198 166 18 -196 193 4 264 52 392 -199 -200 252 9 -671 156 82 -225 -217 905 43
3769 43 311 69 -4 132 1291 -522 -165 -127 802 -275 -101 173 19 -177 -806 996 -128 -534 -282
3788 -282 16 256 -615 112 567 145 -337 194 618 111 468 -1 493 318 -1 1088 46 -611 -94
3807i4K98p06M48L09k34Q3nl56P05R6k46j14L38m57M67q17N53q62Q16O57n77k57
3829D5j82O62r28K28M97l58K04kO14n02N19j683J628j241P62J66r32j41O79N11
3849E46J29J54j160n17J018Q5l20l17J036N66j539K17P31p84M97j358J79J040
3867B03o45M55m48L75j93N7K65n54M40K20m7l67l03K50j04N75M79j314O19p0k11
3888c18P3N53n36K92N81l34J92p58L32Rn46K65N87q15Q51r27O72N15m84j89o5
3909e0l13M29L22K88o71o46L99Q66m49n87J04M52l71k61Q52l4j60L38Oq07q8P80
3931C99j7j20k83K55L75o43j2N78r58P01j16K7j71j73K60L6L41q19K23M24m38
3952a31L71m13m43O17K22K55l87jk80J157r73m91K38L84j1J3l10O24o97K57j28
$$ plain form
3807 -94 204 -502 -54 255 21 104 99 -257 448 544 298 184 522 65 532 -285 268 -594 222 879 302 45
3829 45 -137 525 -403 -175 322 -36 168 166 780 278 797 -886 742 -499 263 429 -503 -644 35 546
3849 546 675 829 -331 -848 170 255 -65 -382 654 1220 -319 -102 629 -155 342 -1016 -837 203
3867 203 -442 13 -435 -60 -253 -196 69 -485 -45 175 128 -239 -542 -292 -396 179 658 -656 -37 -107 -318
3888 -318 -245 308 -228 64 645 311 503 -255 77 86 -460 -195 392 -423 428 -499 173 688 204 15 -50
3909 -50 -363 66 388 676 5 -641 -242 624 175 -412 -308 144 -227 -488 364 330 170 508 514 -293 -381 399
3931 399 382 262 -21 234 609 -34 -46 532 -426 275 159 186 15 -158 102 138 479 -340 -117 307 -131
3952 -131 240 -173 -616 1 223 478 91 90 -190 967 -6 -497 -259 125 114 127 -183 441 -256 1 -127
3973a27K52n43L13m9J28j19J5j02N5M51N6j44J56L73n71K72m59N54r17O25k34
3994a5k14M42j60O78j182O41Q38o77r23J540l40j038N92j34K51n03O11p97k8J00
4014c18K89Q0N93j393R39l56L56k31o19O99K92q04J331n07l38N6l28L6o15N56
4034b82J4K66l72J77L30JJ01j62r2J05o13P35N6l45J77n22R40m28LK12l29K2J025
4057A019j269K06j69o5P26m39J22j80j24Q39p05J20k11L05r59J223J23l39l41
4076a18R1m57R02j025M62J80L3M35p15R15k37j75p57O31j45j8k8j42J047j178
4096b99K68K01o03M76J40n27K86O70p75n05Q54o1n3K02J43q98P44l34L33P1l78
4117d5l07K99m94J103o11J53K3J19Pj055O56L78k2l84J32l7K40J52l07J75P4n41
$$ plain form
3973 -127 125 -418 -105 -154 -26 -145 -130 -232 -177 274 330 186 342 715 144 416 -43 511 -406 219 -15
3994 -15 -229 213 53 731 -451 190 1028 351 -572 968 628 -410 182 48 299 -204 407 -390 -418 -318
4014 -318 -29 51 644 -749 190 -166 190 -41 -660 39 331 -473 858 351 13 69 -259 -223 -838 -282
4034 -282 -268 -2 -374 -197 133 134 235 73 -19 86 -527 208 264 -81 96 -426 514 86 89 301 -28 -6 1019
4057 1019 -250 -44 -213 -278 448 9 131 -49 -173 666 -39 81 -130 175 -784 439 562 223 -118
4076 -118 -27 -484 418 -607 -145 35 68 503 -212 703 466 291 -466 165 20 2 -26 -168 879 -299
4096 -299 -31 170 -433 43 183 -344 -58 612 -163 -668 186 125 72 274 417 -481 263 -71 262 333 -45
4117 -45 -352 -53 -547 556 -55 98 121 240 247 -808 -152 226 204 -180 -48 -85 155 307 0 175 249 -292
4139b92R0PN19q2L36k27k63j47K57k90L33l40n2M81m3J02m86J76j75l5P5O11o40
4162h5R36o98n70P7r1P82m09k77K15R97j696mL2J186n47j42L32O00j75n11J85
4183A37o12O34j00m26M54K10k89m52R59q62L72l0m82Q17j28n75L4j93P44n14J61
4204a41L48K44L40m94p4o05Q20k40j57N93o09M02m51o7P4Q1m04K34j45J28M13
4225B90o78r7O55lk04l38L49pJ94k83Q7j67K25M97j17m1p23P55k09o6m55O15m19
4248a40m4L01k62K19o42N26N33o00P8j55J92l03L66q53M20M62j70M7K52M8j68
4269A07k72K92p06M1O96K67o97L85K7Q6J3j37j02l40L65j64q8j00L63m6M22l67
4291D5k61L84m67K9N50o74L65K75K41k30l48K18j91O2L84k65j38R2j95q5K70K91
$$ plain form
4139 -292 -202 -195 324 242 578 351 88 -59 198 -92 241 -99 -151 330 287 389 -97 79 -96 -131 -56 555 -85
4162 -85 851 153 -417 -340 -431 351 -58 -335 -120 877 -819 -823 -791 395 -152 -294 38 638 463 -48 137
4183 137 -475 159 59 -367 87 297 8 -444 515 -347 25 -5 -487 330 202 -373 -339 -532 212 -302 -141
4204 -141 207 451 791 297 223 -382 438 198 41 634 25 427 -24 -91 -17 64 -340 -106 -251 -123 290
4225 290 -388 -485 170 167 -37 -375 -26 -33 161 -122 -35 -202 23 520 403 362 -361 394 185 119 -336 279 -140
4248 -140 -184 117 -145 74 -568 -42 491 -109 -31 -186 6 -297 69 -784 -364 98 -72 -25 227 275 107
4269 107 -165 127 -579 -538 158 425 -272 113 140 226 239 102 0 -340 25 -139 -227 -327 36 -10 412 45
4291 45 -216 168 -299 -270 280 -394 -29 246 487 257 -91 127 -64 -2 382 117 -21 71 -124 -209 61 352
4313C52n02Q7l5j20k55L04n66L46l1N84j83j19PK21O9k22M01o38N73p07L85j06
4335a55O2O3j32j85K28J40j17L6%O5l28K55K52m17O09m73k1J12K67k41j22k62
4357c64J29k24jJ13O62j98M8l61K20J59j02K17J8r1l25K66J28%l85J04r9R9J07
4380A20J83m43j36q0P83n04rJ84M50q47N05j40P1j31J16l92n3p3Q77o79k16J46
4402b68K51r5J85k58L72p66P59l51O9p0K73p6k1j55P5l73N5L05k90K69O4n17N29
4425c4q8j56K94j61J13j5K73m81J90l24P09Q3q53O77J67l05q4J33L67p96J067
4446G76N7n24M25p07l79L43P81p06m49N79j050J710q89K82l25O08q42L26r0l27
4466d01N12K13J97j87j86q24n19J051o43j35L42R39n89R51r74M88j97k79m64M8
$$ plain form
4313 352 -150 -63 -98 -218 -473 -169 -735 -389 -420 164 -19 -138 -131 90 159 -63 338 -300 273 -434 -49 -155
4335 -155 -93 -30 -162 -347 -119 21 -96 -60 -60 5 -323 -68 184 -233 376 -97 -118 -6 261 20 -102 -364
4357 -364 -235 -459 -460 -347 315 117 165 -196 24 183 81 298 316 225 -100 166 294 294 -91 13 -86 13 120
4380 120 303 -140 -276 -356 427 -77 -86 98 548 -299 206 66 137 6 122 -270 -323 -396 481 -198 -414 -268
4402 -268 -17 -112 73 -185 187 -579 180 -171 -102 -172 101 25 4 -151 -76 -449 -394 -89 -379 -110 -46 -563 -34
4425 -34 -122 -278 16 -145 -32 -47 226 -255 -65 -389 320 403 -450 227 394 89 5 138 505 -291 776
4446 776 833 309 734 27 -352 -9 772 66 -383 196 -854 856 -33 249 -76 532 -310 16 -74 -401
4466 -401 111 324 521 334 148 -676 -1195 -144 -787 -922 -580 359 -230 721 -253 235 38 -241 -705 -657
4486f57R72k54j74Q4K27m63O8j94L88ML26j33k12L13M20r72J00J28K17k82j21
4507b15J87N1k96PL21m94N4J016r0l52K88o36O43n03l37J98J99m9O7K42J70J88
4529F59o06K50L18k45n62K98j53K94k83J95Qm74K08r9M70j53J74n19L78j1n9l55
4551b67K46Q0N28p0q67l0L98l30P9L62l64j42O41n78K36K19j70k44j55K16m9J34
4573a27M26m58n5L25K15n98L57P21o88j71N9j31L67R3K12j306J071j15l01M70
4593C66n32P56q98M57j46k31N61k70L20k70j10PJ53J72J19m17j36K95L17k07j17
4614A89N2P9k22l87K22m5J87K92k85j04r2L30j21j82j19K66K07j22j55m69L34
4635a45O20n95k37N54l85m07N33j57L60j38l69L21j45N11n01k34K11l02L2L56
$$ plain form
4486 -657 315 61 -113 -29 198 -265 -197 -391 -3 1 327 194 -18 295 715 -257 -157 -29 188 -94 -215
4507 -215 -28 23 -273 -266 55 -439 -385 631 541 189 477 -159 484 -19 -356 -158 41 -8 59 301 471 659
4529 659 53 303 621 376 -186 112 -41 253 -30 165 173 -301 -93 -192 278 125 299 -220 158 147 88 -267
4551 -267 -21 59 587 517 -350 -380 18 -312 -233 129 -235 -377 264 -314 -78 141 -29 -273 -428 -212 -261 -127
4573 -127 299 -159 -214 111 326 -272 85 806 118 -53 6 -125 242 335 547 -759 312 197 -104 366
4593 366 -166 590 -308 149 3 -228 333 63 383 113 3 10 163 335 454 37 -99 196 513 306 189
4614 189 241 320 98 -289 -67 -112 75 367 82 -22 -114 216 95 -87 -206 60 267 145 -10 -479 -145
4635 -145 475 -120 -357 197 -188 -595 -62 -219 141 3 -366 -45 -190 321 -180 -414 -203 -505 -473 -117
4655a17J93l01M99l09M60n79K55L8M0j55l15O1N88j78o63O74l4j71L99j99L20
4676E06q70K59N92m66l76L79L8n7M0j64K13k54N73k08m86O79n16M46m83N29m89
4697a15J72L38p22M00n27L78J93j32R2k64K5K98l54L35k18j57n0q1M84j59q3M10
4719B63k59m55L32k28N8L20j77mm33P73j46n24M44j8Q0j73M02r06L35o41R94o94
4741f57M09J5M21k60lM74j37k48j02J6K79K9J85o15O27o16L07j23J88J07k23J22
4763A95J02m73q7N4M80k1l38K49l62O68n44J94j00K05k9L0L5l28K94q67M38J16
4785h9K14l47lL44Q7j84p8o64P62n01M39L99k09m2k19M06n02o4k91N11L77k32
4807A14m10J74J55L05j013J211k03m69N98m96O1J73j94K51l15M17j32J72k74K34
$$ plain form
4655 -117 76 -225 274 -35 425 -154 101 139 179 24 -291 -230 358 180 -483 191 157 -14 385 186 506
4676 506 -364 -105 487 21 -355 24 62 5 45 -119 94 -160 413 205 -281 398 -118 328 -155 374 -115
4697 -115 57 395 -327 73 -454 -76 117 -15 77 -187 -162 136 -218 117 -101 -258 -308 -389 95 -64 -147 263
4719 263 4 -451 -119 -347 -289 31 -146 -150 -583 190 44 -480 -36 -54 26 -147 255 -651 -316 -957 37 -657
4741 -657 -248 -233 188 -72 -75 399 262 14 -88 -72 207 236 421 -194 433 -183 124 1 189 296 73 195
4763 195 297 -176 -263 -209 271 250 -88 161 -201 467 -77 117 17 222 193 223 258 -70 224 -643 -205 -89
4785 -89 125 -222 -225 119 206 22 -56 -720 42 -459 -20 379 170 128 -91 315 -187 -251 -542 -31 346 114
4807 114 -296 -122 33 338 -675 536 333 -136 462 -34 27 200 6 257 -58 359 227 399 125 359
4827C59o08J92O0k76M12J26j14l74M49k07P1O21j115N56l40R9j90N62M4m72L52
4848B07j52n54N93o68P79R0l53M76o07L91j98O7K45m0l15j80L70L22l7o74k07
4869d45J02K86J52O59o26m52N08J77P4m2j025Q39n99m14L77l35L34P7O28l93L84
4890B66r5j95j47J26J9K68q34O01L40nr9m49L81j17k66O3J97O6l69K19N0K3K32
4913B75l92o4L20l74m7K04N32J0m95J55k22ro3l12P04j48r8j17N4n34L70K36K12
4936A97l07k97P51N8k82q1K43j42j36J99k84J00m40J65L07j2K57k6l31O1k57M03
4958A46M34o15L10k2k10N5j94R2p93l34M36Q52p07J416o90o62Q42K5j30l37M99
4979D13j027N14J34m72K7L8J779j706M67j11k51n2K74J72j15l71j15L82L81o28
$$ plain form
4827 359 -249 -57 3 -273 139 265 151 -223 226 19 90 711 -404 152 -188 -89 -279 283 327 -145 207
4848 207 55 -499 94 -574 205 295 -58 418 -189 202 4 71 316 276 -39 -219 151 473 436 -238 -445
4869 -445 -343 -57 95 754 128 -324 184 361 435 393 -632 207 -392 -806 -429 -764 -430 -353 275 -118 266
4890 266 171 -24 -171 -45 -26 242 -592 9 349 344 245 -204 177 60 -206 -143 54 120 -249 -30 20 43 275
4913 275 -117 -181 139 -235 -282 -78 454 464 -31 124 -98 -107 -170 -482 222 74 -24 -141 -87 -621 -251 -15 197
4936 197 -110 -407 344 402 120 39 282 140 4 203 -81 19 -421 -256 51 39 296 270 -61 0 -257 146
4958 146 580 -35 275 253 43 98 -96 -4 -797 -1131 -695 157 -550 866 176 -486 356 381 251 -86 413
4979 413 -614 -100 34 -438 -411 -373 1406 -300 167 56 -195 -247 27 199 84 -287 -402 -20 361 -267
4999b67Q0j02j2Q41n2K94q83O93j455O56K69j84p79P09k50K10K68K3K64J14l55
5020H2k93Q3J78q2k08N23j14m05M15R8R9m64J42J2m43M55K71j012O00N50j298
5041h11J024l77P6j13K03N0n1p5J59n49L83k3J09j30O93q07L7L98j98J59P5o60
5063d28J159p03P46n44n13K02N60o23K50K11k9l76j03M28m92N86r86J5M24K06
5083a0L13l77J07m4m36L02l4k28M22k06J89m38Q69N08n15o82j49J40M15k00Pj26
5105a73M00J38l73j61l75N84k93N83q24K9P77q9k2j33m81L47N10p5k76j35N86
5126E44m87j53J80L26o88K34l45Q27k05m41k18L89J35L82j96l41N28k55j4m9N8
5147B11l64k52M24L63n29O11k99M05o10L79m72K20n13n2K09N13j70n83P88J48
$$ plain form
4999 -267 -187 -289 -301 540 488 782 -101 592 -863 -207 62 -122 -901 -192 -442 -232 36 59 323 437 82
5020 82 -211 -128 50 -32 -240 283 169 -236 179 277 376 -88 54 66 -377 78 349 -663 -63 487 -811
5041 -811 213 -164 -88 -201 2 52 1 -74 85 -464 -81 -104 5 -125 568 -239 -202 196 -2 157 232 -428
5063 -428 731 28 774 230 -283 -81 479 -144 106 317 288 -88 -191 237 -255 331 -655 -640 -216 -10
5083 -10 303 -74 33 -11 -447 -145 -179 -407 15 -191 -2 -440 429 937 422 -260 -409 -269 146 -54 -47 -173
5105 -173 227 365 -8 -169 -544 40 -253 330 -494 -465 312 223 201 68 -413 -66 444 369 93 -42 544
5126 544 57 -96 84 410 -278 -44 -389 438 233 -208 -426 -37 98 480 284 -57 471 216 202 153 211
5147 211 -153 -405 19 382 -147 464 165 570 -40 339 -133 87 -426 -478 -269 244 74 -509 279 427
5167D27j30m35J14j2k06r3l7M11k06L6J64J4k9Q0k71j71K96J79J04m18J96l83
5189c70j1J65K93k13J39j10j5K12l4j20K69l76o1Q11n77J59j71K86l16M18m14
5210c6J52K44k71o2K45m69K11O6M7q3j83o5K3N57m73L26l48O7k94K18l5M38n5
5233B20o6J29j92l08n2M05k39P0j0r2m00Q46j41o86P06m68j91N78J27l01K2r8
5255a41k62M99l41N19n38j97L09N76k81j34P8N8k2m62K13J61j5j3K63q7j99K00
5277A84m72J76M25o72K88L19l71L2J31K54m75M21k60L8m5j59L45k01n7J63o3%
5299AO0J54k07L29N4l94L33k33n9J01P54n03j34l69j20P5J56J74K40j71j97n5
5321a1J53k92ll81L52M04k94K01k0n26N25l9K34n02PK31j07K33m59l77M78pL3
$$ plain form
5167 427 297 -138 -24 -36 -242 -335 -372 39 -167 -131 33 47 18 98 -173 -344 -48 131 235 -183 13 -370
5189 -370 -381 -216 77 -136 3 -107 -122 90 56 -64 205 -171 -232 579 2 161 -10 276 -40 378 -36
5210 -36 116 360 89 27 272 -197 14 80 127 44 -139 -204 -181 376 -97 229 -119 -52 -346 -128 -163 275 220
5233 220 154 283 91 -217 -269 136 -103 -33 -43 -135 -535 311 170 -516 190 -278 -469 109 236 -65 -43 -141
5255 -141 -403 96 -245 274 -264 -461 -152 424 143 9 87 145 123 -339 -126 35 20 7 270 183 -16 184
5277 184 -288 -112 313 -359 -71 248 -123 -91 40 294 -181 240 -20 18 -27 -186 159 -42 -99 64 1 1
5299 1 61 215 8 337 391 -3 330 97 38 139 893 390 256 -113 -233 -158 -2 172 412 241 44 -11
5321 -11 142 -150 -153 -534 -182 222 -72 129 109 -417 108 69 303 -199 -192 39 -68 165 -294 -671 -193 -200 -167
5344a67j81L45j97m7K92J37Q0K52k71n6o61K65M71l25j4Q7K3L01K0n95K95K04
5366B58o64O52l30J23j47N65m61J85m73J20O20n54k24l90J059N2K60j439J073
5385B85m77M39r20M55L72j19l02L82q3J84k45Q0K10n93N12J71l95o5P94l03k62
5406A20r39Q46n31k7p6qQ54M61k76rm8k08L06r43Q53m08J182q34m79K72N28j33
5428E03K44n22N09j111L61O82q11K25K91n74R82q50K67N2o48O01l40r8J29J10
5448BJ90M5j45J87m25O76n02l83M40J44m09R8j73J73K31O2m13J75K46K1o3j37
5470D0L25j86Jk84K59J00o26j30N92j37L34n60p2Q60m20j39K31o36L48Q1J73l29
5492a75M03n79Q17l6L1j46m12j38l02N39J01Rl53O48l18J33j49j40N39k20rk10
$$ plain form
5344 -167 -348 -3 -200 -247 45 182 262 514 243 187 -474 -209 262 -63 -77 10 33 334 354 -241 54 258
5366 258 -406 246 -84 39 -108 457 -4 181 -292 -172 448 -106 -330 -720 339 391 651 -788 285
5385 285 -192 247 -673 -218 154 35 -267 115 32 216 -29 51 261 -332 180 351 -44 -109 685 382 120
5406 120 -819 27 -504 -531 -607 -615 239 700 424 415 367 159 465 -478 375 -33 1149 315 -164 108 636 503
5428 503 747 225 734 -377 -16 666 -145 80 371 -203 779 -71 196 248 -400 201 -139 -237 -108 2
5448 2 192 237 92 279 -146 530 28 -355 85 229 -180 -82 -255 -82 149 211 -202 -27 219 240 177 40
5470 40 365 179 180 -104 155 255 -371 -501 91 -46 288 -272 -344 516 96 -43 188 -448 -100 -19 154 -175
5492 -175 228 -351 466 430 461 315 -97 -235 -537 2 103 112 -241 407 89 222 73 -67 472 252 243 33
5514C3K54q6m9L78p28J92j09N5L7m7j99L38J92j0K59r32N28l17L59R3j44M2o49
5537e10M22R7K93j87j80j59k85M34j50L27Q7K11r10N93J2l39Q9l79O49n15L53
5558d7m07J69J59P8M42j2l86J11m16M86m93K01k78M40k45j72L89M8m78L54j19
5579a76l9J55M8q4m28J045o75N17k89l33L73J97q6K96m85J37K48l31K11l18K60
5600B43r8m7o7m0J9J94k81M53k90K86l57N20j94j71J19j79RM0k65j34M78K84p36
5623b14q4L95k92L98l82R5N77l05r5l68o09R48l4J0Lr7L25k67P4J91m54Q4j98
5646b99M06N7j67J7K33n93L80L09m11M76j21K64m45LR7k90J43m74L21O7R7j76
5668a06o8K38k67N58K84m51j81L50o15M67j17k40M55l41R1L69j19q9Q0O7l22m98
$$ plain form
5514 33 287 201 152 530 -198 -6 -115 -60 -23 -70 -269 69 261 251 510 -422 106 -211 148 241 97 139 -510
5537 -510 -88 9 302 115 -65 -224 -509 -75 -225 102 189 400 -510 83 95 -244 -155 -534 115 -400 -47
5558 -47 -454 -285 -126 -48 394 382 -4 107 -309 177 -316 -115 -393 47 -198 -370 19 67 -411 -57 -176
5579 -176 -215 -60 -12 -96 -524 521 -154 363 74 -259 114 311 225 521 36 173 421 90 301 -17 243
5600 243 145 98 31 -9 10 204 -77 376 86 372 15 535 341 170 289 110 119 159 -106 -240 238 522 -214
5623 -214 -298 97 -195 203 -179 -84 493 188 93 -275 -884 64 30 40 43 -54 271 4 78 269 -185 -101 -299
5646 -299 107 164 -3 14 247 -346 34 343 -68 408 287 551 106 109 206 -84 59 -415 -94 -27 70 -106
5668 -106 -174 64 -203 355 639 188 7 357 -258 209 92 -148 307 -34 57 426 307 218 298 365 43 -455
5690d55L56J26N4qpJ59n21L60J03Mn31J65P4J89j35L42N9j99l40L88l58K29j86
5713a32L29L6k03j44K00%pj78M31n46N44q9l53J89j05K57K77l88p6k47Or7K39
5736e7R6j86J63k63K95K7L36J0l10m96O01J88l13J1R7l08qL85k73P31q41m44O48
5759H9O9m41L91m63Q11j64l34l95K19M35k53q0L40M0n09N42l86J92m02J79o4j5
5781a99m3l12O44J48k59M9K2L06n49N8J81J3j69N51p51l80R12rn04N08m17m8L11
5804F3M78m56J86k30j02l06M30M78l91J15k98M93k73n4M8m2qk64Q02q05L04J70
5826C38j48k08K47m35L98m3n72Q99r39J35M84J35k11rl0L12j53j34L5k70J75L29
5848C35k47k1k3l12m3M23l25J50j66M95o53J05J03L88m14l47K08N8N34R7K20k66
$$ plain form
5690 -455 -99 27 81 73 66 225 -296 64 167 171 -360 -195 -121 68 -67 275 334 135 -205 183 -175 54 -132
5713 -132 197 233 30 -114 86 86 79 -99 332 -214 330 241 -112 77 -28 229 506 118 42 -205 -199 -296 -57
5736 -57 39 -147 16 -247 48 75 411 421 111 -385 216 404 91 102 199 -109 -117 268 -5 726 -115 -559 89
5759 89 158 -283 108 -355 456 292 -42 -437 -218 217 -36 -116 224 264 -245 297 -89 103 -299 -120 -184 -199
5781 -199 -242 -554 90 238 -21 28 50 356 -193 -135 46 59 -110 441 -310 -690 222 213 -291 217 -200 -248 63
5804 63 541 85 271 41 -61 -367 63 541 150 265 -33 460 187 133 181 139 131 -133 669 -136 168 338
5826 338 190 -18 229 -206 192 149 -423 476 -463 -328 156 291 80 71 41 353 200 66 101 -169 6 335
5848 335 88 67 44 -268 -311 112 -213 -63 -229 266 -387 -282 -179 209 -205 -552 -344 -286 248 345 565 299
5870B99m54j77O22j56J43o25M70j08k6J02l25J94J65k16j43j28O55k36Q1j44r1
5891i8L84k92K28k79J45l51P20q20L19o34J041l68k7J40M7O1qqq4J03r0Kj62L9
5915Hl96j18K30l1L65m91N10k14q9P2O01m60J64Q1k74j36k79L90r6r3ok79L16
5938b25K36J20k48k90K49J53k7J22k41l68M94L5l32J69l12N73j45J26K68l97k57
5959b97L14m3N6M36n23j37N16j02N5k07o01Q34k52p2L77l72qj26K09j74N3k85
5981c49K34K51l62P23l34n36N68K05n34l15O32m79P22k12m06Q8m67O04O4j3k79
6002a95L85P8K51m90k28J12l99J85M38K62k06l34m21R89p25Q47k89k3K64n69j28
6023a96O94r99R34k74m37qO92n92j31K66N18m07l23N39j0r00Q26L06p61M76J24
$$ plain form
5870 299 -155 -332 290 134 277 -348 122 14 -12 90 -235 -41 124 -92 -235 -363 292 56 137 -7 -98
5891 -98 286 -6 222 -57 88 -263 457 -363 -44 -678 363 -5 -32 108 155 216 208 200 116 219 129 131 -31 8
5915 8 -388 -506 -276 -307 58 -433 77 -137 -226 -154 447 -13 151 232 -42 -178 -457 -67 -163 -256 -262 -541 -225
5938 -225 11 131 -117 -407 -158 -5 -32 90 -151 -519 -25 10 -322 -153 -465 108 -37 89 357 -40 -297
5959 -297 17 -26 30 466 -57 -194 322 220 275 68 -533 301 49 -23 354 -18 -26 -152 57 -117 -64 -349
5981 -349 -115 136 -226 497 163 -373 195 400 -134 -449 183 -296 426 214 -192 -104 -571 33 97 84 -195
6002 -195 190 268 519 29 -199 -87 -486 -301 137 399 193 -141 -562 427 -298 549 260 237 501 -68 -196
6023 -196 498 -501 433 159 -278 -286 406 -186 -317 -51 467 60 -263 276 266 -634 192 498 -263 213 337
6044C37q7j66p5Q6J01nm11R86q60j31K88m73J140m15k7k88J08m38j77O46q5J18
6066A72k23M67l70L36p80L49M67n41L09j39J63MN0q1l5m45P5K23M58o82l3M55
6088A99l46k7j9l14O32j46j57k57L04k49J18k95M47N2j72O3J30k51Q4J60j69N29
6110C16o87N92l66M44j30j64K44j73k18M71k43k72R8O4K54n83L51L26o64K43K46
6131A49J03L13m16p9O3j22k20O9q1R3j29K94k07J61N07m13j66k92J3O97k79k25
6153a67N04j98K9l7l46J08K43P4k06K48o32J98J25Q2n89O90k47L14l4k53j9j86
6175b99N45m49L50q12N56K29j33j33J1J38K70m94K93j01o3L35N1k09L77o54K43
6196E1J11J97m63R3J31j30M8J57m42J80O7k5M93L4l00m00M86j26j1j0j0j10k81
$$ plain form
6044 337 250 84 9 95 196 191 -220 766 -94 -225 63 -410 730 315 288 0 108 -330 -507 139 54 172
6066 172 -51 416 46 382 -398 -49 418 -123 186 47 210 214 264 183 148 -297 -222 1 459 -223 -256 199
6088 199 -147 -174 -193 -507 125 -21 -178 -435 -131 -380 -262 -557 -110 -58 -230 -167 -37 -288 -204 -44 -213 316
6110 316 -371 221 -145 299 169 5 249 76 -142 329 86 -186 -88 -24 230 -353 -2 324 -340 -97 149
6131 149 252 565 149 70 133 11 -209 -140 -221 -128 -257 37 -170 -9 498 85 -81 -373 -360 337 58 -167
6153 -167 337 139 168 131 -215 -107 136 210 4 252 -380 -182 -57 25 -564 126 -121 193 159 -94 -113 -299
6175 -299 246 -203 147 -665 -109 120 -13 -146 -135 3 273 -221 72 -29 -92 243 294 85 462 -192 51
6196 51 162 359 -104 -11 120 -10 38 195 -247 -67 0 -25 468 502 202 -198 288 162 151 141 131 21 -260
6219b60K17K06o06N19p5M25k23n87M68p6J59l15L12J72l99j00J59p6P9j27J51
6240B3j8M18o14L94l00k97L63J54n33M50r9j53L06J59o14J403j262K44J52O84
6260H60n48j08Q7K93o2k03p02J48R72k40j074L70j58M85N80R7j035J44R6O40q73
6281b31L1M11J9J36n42M77k79M0n97O79L31r78L54j67K2M55r36N85K80N2L1o2
6303A11k27M27p02K16M3L77l77J93O7r5k23M92p14j3P91Q6o4k43m3Ll51L7K70
6326F1J02l77J06J88K16K14r52K5k6O05L2j38M01l5o78J2N23n79O84m12%n5K29
6349A46j59L87l87l88O53j50N72j083N46j96j01K86j56o18K19N99O67j271L23
6368a11N22p39J92j00N78j91J37J85k91p94L72P10r11O86L35n4j398l0K61R91
$$ plain form
6219 -260 -43 163 -443 76 1 426 203 -384 84 8 167 -148 164 336 -63 -163 -4 -80 -1 -128 23
6240 23 5 423 -191 203 -97 -394 -31 123 -410 40 -59 -212 94 253 -361 1042 -220 24 176 860
6260 860 312 204 291 584 522 319 -383 -235 737 497 -577 -207 -365 120 700 797 -238 -94 2 642 -231
6281 -231 -200 211 230 366 -176 301 22 62 -535 144 475 -503 -149 -316 -294 161 -775 -190 90 142 173 111
6303 111 -116 311 -391 -175 -132 245 -132 61 128 33 -190 302 -412 -425 366 452 388 145 102 105 -246 -209 61
6326 61 163 -214 -108 80 296 510 -442 -417 -443 162 194 56 457 422 -256 -244 279 -300 384 -28 -28 -83 146
6349 146 -13 374 -13 -401 252 102 674 -409 137 -59 -160 126 -30 -648 -429 170 837 -434 -111
6368 -111 411 -328 -136 -236 342 151 288 473 182 -612 -240 470 -441 245 580 526 -872 -902 -641 350
6388C50O54n75kj230O12J45O96l37M9l05M08K1o67j30N60k27m41O98K62m15K7
6409A53j5o8m07K54R81j261O91k88l99K64j12j36O42q04J454j102P60l95Kj10
6429A04J59l27M50n05k59Q06j65q2l70Q0j99N63n22K18j50L05J73o02K04l0N94
6450D45Q9k91L7j52p4j20P8K03k25J05m1J07k96K74J58o63N15j28q3k34L76j30
6472e0m09J59O26l44K75k74k72L35R9J08k36j06J91J35k59j33J24N41r13j68J304
6493G33r55Q24r67j54j7j91J104j147J386j41q75L06K01l44Q4K77j81M96j56p16
6513d33N60l42k27R34q30K73n37Q62R5n32J34k38K37K30r7m39N64K79n97l5j01
6534b40L10K63k68L97l13l36J89L40p41L99L9K62j43o88N35J27q06N68L27j87
$$ plain form
6388 350 1004 429 427 -803 -191 -46 650 313 362 57 465 486 -181 -311 249 22 -419 279 541 126 153
6409 153 138 70 -337 -83 898 -363 328 40 -359 -95 -207 -343 299 -505 949 -153 607 212 214 104
6429 104 263 -64 386 -119 -378 428 263 181 -189 -109 -308 255 -267 -49 -199 106 279 -323 -119 -149 445
6450 445 534 243 280 128 54 -66 12 215 -10 95 54 161 -135 139 297 -366 149 21 -62 -296 80 -50
6472 -50 -459 -300 326 -18 257 -17 -289 46 145 253 17 -89 102 237 -22 -155 -31 510 -403 -571 733
6493 733 -222 602 -365 -519 -536 -727 377 -770 616 475 -400 -94 107 -237 -153 124 -57 439 283 -433
6513 -433 127 -215 -442 492 -338 -65 -602 260 355 -177 -43 -281 -44 186 89 -350 214 493 -104 -139 -240
6534 -240 70 333 65 462 149 -187 2 342 -399 0 39 301 158 -530 5 132 -674 -106 221 34
6554C4L79j73r7K84l23jq9j71K47m94K93M8L5l5P00k46m49m78L06J36o0J19k7
6577f2j63K60J28Q6k45J9J70q2R5J5n46K11M50k55j88k72Q57k72m1k97L35J6l81
6600a62P59m84n2J6J02o56Q89o09N50l62l53N37m3k4q56N82K49m10N73j52m80
6621c86O18l26J31j10m08P14k8m01k83K39K20K32l41J03R0m16K20K05k0k94MM68
6643B31N8k75P2J50k35j39K3J66K30m36J86j4L29m08q2L10o99P14L05k18k33j98
6665a63J83J76p03M21l19M00k82L04l04L92L52r75J45N17k37R6Q8r1Q9K59k18
6686A30m12N1Q54n89j39L22k74J54n07N16m72M13l38P35m04L5M2k87L0J59j90
6707a71L19j01J81o1l34K28M1j04n4r0lJ07L17M7l75R2j05k74L13M00p00M19k40
$$ plain form
6554 34 413 240 143 427 104 103 14 -157 90 -404 -111 -63 -28 -63 637 391 -58 -536 -230 -94 -154 -35 -62
6577 -62 -225 35 163 249 4 23 193 111 206 221 -325 -114 336 81 -107 -379 478 206 165 -132 203 219 -162
6600 -162 597 113 61 77 179 -477 412 -197 353 -9 -362 175 132 108 -748 -166 83 -327 246 94 -386
6621 -386 232 -94 37 -73 -481 233 205 -196 -479 -240 -20 212 -129 -26 64 -352 -132 73 53 -241 -237 231
6643 231 289 14 86 236 1 -138 -115 51 281 -155 31 17 346 -62 -144 166 -533 181 486 268 35 -163
6665 -163 20 196 -507 -86 -405 -5 -287 17 -287 105 457 -518 -373 144 -93 3 91 0 89 348 130
6686 130 -282 -231 623 34 -105 217 -57 97 -410 106 -366 47 -291 444 40 75 117 -170 -140 19 -171
6707 -171 148 47 228 167 -167 61 102 -2 -56 -146 -149 -42 275 322 -53 39 -66 -340 -27 373 -327 92 -148
6730a48K51m05K59k71L64J63J03k68n20M02P22q15P13m82K96K14j035M13k3M10
6750C43j77j05l30O11L2o02J57k34O77m18m91J85K69J10M11p33Q5M94k02m67O75
6771B90l77j01j41L45J22N59j257J22Q97n00j10M08o31K08L96m17J2K56L43j018
6791e94R03l79J31j87O0O98p26K50j58M11K9o43l10N79l1L69j17m77K67K7J27
6812B29p2m1k81L74j88J92j98J15L7p3K70n7p41O62m06J83L09k16L20J95j90m25
6834bJ42q9L58k87k1j1l66L17P2L7l83j04L47k71J44L25o3m12O3K03J85o2Q1k65
6858f2j6J0K71n2k90m1J16l96N30P7n2k74j79K43L44j37o37N36k95K9N8M2L77
6881B02M27m94mJ59m9K80q20M96j87N63p45J75N38q54Q75p55L32J34k26nk61M48
$$ plain form
6730 -148 103 -302 -43 -314 50 213 316 48 -472 -70 652 -163 550 68 364 578 -457 -44 -67 343
6750 343 166 61 -269 342 374 -228 -71 -305 372 -46 -537 -352 -83 27 438 -295 -210 284 82 -385 290
6771 290 -87 -188 -329 16 138 697 -560 -438 459 -41 -151 257 -374 -166 230 -187 -175 81 424 -594
6791 -594 309 -70 61 -126 -66 632 -94 156 -2 409 438 -205 -515 64 33 402 285 -192 75 102 229
6812 229 157 116 -165 209 21 213 15 130 167 94 364 307 -434 228 -178 5 314 98 418 613 423 -2
6834 -2 140 51 409 122 101 90 -276 41 113 150 -233 -337 10 -261 -117 208 145 -267 -204 -1 184 122 203 -62
6858 -62 -78 -68 203 151 -139 -180 -64 -460 70 147 95 -179 -358 -115 229 92 -545 -9 -304 -275 -217 -175 202
6881 202 629 135 131 290 241 521 -299 197 10 573 -172 3 541 -313 562 -193 139 273 47 42 -219 229
6903B29m04L86j12j15j33R9L03l12J63K51m87J52k10L58k73L85j65j74L00j09
6923A32m69M9Q88n87K76l78M46o90L10K29K0k65k41K53J44J38m45O10m30O3k15
6944a62M93o85m4M33K98L20o78o5l64M90M6m36J62K47j64M16j34m73p6N85J1m06
6966a86l3O90n75M45l13Q5J54L66j40p60O70n25p8M6M79k37Q9p59L68M08l06J68
6988E6k24o26J225j14N8m83J2k54M30l55K33k35k81Q17l25K24l17M44o42K95J57
7009I5q06Q36p3K90m93J48j11R0J4j93j46P58M69r09j9M12n88O1J77L2N5J26k14
7032A1j57O81p14O41l89K9p70M23M24pL82m62j36K60m84N43j21K52m02K63nl09
7054d7K21O0R8j68K79m57J89k39J26J56l21J03j39L46k83r8K82J86j021k17J160
$$ plain form
6903 229 -175 211 99 -16 -149 -50 253 -59 104 355 -132 20 -190 168 -105 280 115 -59 241 132
6923 132 -337 -288 600 13 289 -89 357 -333 -23 206 226 -39 -280 -27 117 255 -190 420 -10 53 -162
6944 -162 331 -354 -398 35 333 653 -25 -90 -454 36 82 -354 -192 55 -109 307 173 -300 -376 209 220 -186
6966 -186 -219 471 -104 341 28 113 267 633 493 -267 403 -122 -200 -154 325 88 177 -582 -214 194 -112 56
6988 56 -168 -794 431 317 375 -108 -96 -350 80 -275 -42 -277 -558 259 -66 158 -159 285 -357 -62 95
7009 95 -711 125 52 342 -151 -3 -114 -24 -10 -203 -349 409 878 -31 -50 362 -226 -165 12 44 99 225 11
7032 11 -146 535 -179 462 73 102 -668 -245 179 172 554 92 -44 216 -268 275 154 406 4 267 262 -47
7054 -47 174 234 332 164 443 -14 175 -64 62 218 -103 0 -139 207 -76 -174 108 294 -727 -944 216
7075B16o4k52k63m95J168k11k67M45p89M09q6K92l98N72k64k73K12m2M09N9k33
7096A45k31J54j47N8K78j24L67o11k60N13l1l48M38L69o61o9Q9n72P35l12L27
7117A07k37l2L93L4kj57J6j82o8o9M4L62q3l40M11l75J40J20o8m38K49N7K29k03
7141i2J89k97L91k11L8K46o34N78N4m90o8K97k24L23j24J54l11N21Mj92q6J28
7163A94J15p15k0p6O2O37k47m4J36Nj6J50n19M17J52j78K47k98K57m58l8P94p90
7186b33L01n4m39Q38p28N80k61k03P25q33L78r4J18Pl3k79L91j78J94k94O9L62
7208C34n48J80K61O6l85O36k97l19l5K87J07l11Q0m01K69L29n42J79J5k54K60
7229h9j12r0l2J60N29J57p18j92J34J3j74O8K95l0K12n86P35m51K69j26K50M5
$$ plain form
7075 216 152 -100 -363 -858 310 99 -168 277 -512 -103 -189 103 -295 277 13 -260 -48 -90 319 378 145
7096 145 -86 68 -79 -21 257 133 500 -111 -371 142 111 -237 201 570 -91 -160 -71 -643 92 -220 107
7117 107 -130 -162 231 265 263 106 122 -60 -128 -197 -153 209 126 -214 197 -178 -38 82 14 -424 -175 -118 111 -92
7141 -92 97 -200 191 -20 18 264 -370 208 262 -228 -296 1 -223 100 -24 130 -181 340 344 152 66 194
7163 194 309 -406 -426 -502 -440 197 -50 -94 42 47 31 181 -338 79 231 53 300 2 259 -199 -237 557 -233
7186 -233 68 14 -425 413 -315 265 4 -199 526 -307 71 -23 95 102 69 -210 181 3 197 -97 -28 334
7208 334 -214 -34 227 293 -92 544 247 -72 -107 180 287 -24 56 -345 -76 253 -289 -110 -95 -349 -89
7229 -89 -201 -291 -323 -163 366 523 -195 -387 -253 -240 -414 -346 -51 -81 131 -455 280 -171 98 -28 222 267
7251B67jp57O80q8J93k63k24J52L09J02o49K84j64k44L29K63M9m79K91J10n30
7272c70N43k12J18j41j84L34n03K62l7K82k89K42j1M4m9M50j67m48k9N60l88m6
7294c9l12M98m4k35J40J61M27m32m82J59M40n43K66k82K77L87j019o09J055l9
7314b26L77N95r55m55P92M6q61R55j274O4J385j81j277Q41L46k30k01M64j87m57
7334d39Q45P1n63N38m85J59m5j02L37m27J90j53L75m62L21M7j43j67p0n0j80J64
7356b39JN1N84o59N35m61J52k14J31K4J42J48j3o6n9KJ87l3j54j81L3M04m33j94
7380c12QJ47K36l90L60k9j82M51m19J38p8n4k7n0J94Q0L1P4m41j27L37K91j99
7403C9J42m61M91r3J34r4j76J11l27k9M09k90j02N41K82q77M75j89J08k74K68
$$ plain form
7251 267 266 -491 189 101 294 31 -193 -41 268 370 -279 5 -159 -403 -74 189 238 -241 50 160 -370
7272 -370 173 -39 79 -62 -246 88 -415 -153 -190 92 -197 45 34 78 29 479 312 -136 -165 395 7 -39
7294 -39 -351 147 103 -132 8 169 596 164 -318 -159 281 -262 4 -278 -1 386 -633 -1242 -187 -226
7314 -226 151 746 -209 -664 128 174 -687 268 -1006 -942 443 262 -1015 -174 172 -58 -259 205 18 -439
7334 -439 406 477 -86 452 -33 126 81 -21 316 -111 79 -74 301 -161 160 207 64 -103 -173 -223 -403 -239
7356 -239 -238 -187 397 -262 273 -188 -36 -250 -119 -95 47 195 182 116 57 59 246 213 59 -122 -89 315 -118 -312
7380 -312 -304 -157 79 -311 49 20 -162 289 -130 8 -70 -124 -151 -201 -7 73 104 178 -263 -390 -53 238 39
7403 39 181 -280 211 118 252 158 -18 93 -234 -263 146 -144 -246 295 577 -300 175 -14 94 -180 88
7424H8J16J06l16M6k49K44L2m03J62k58M59K52o43L15J2O6j15M24K08l38j11m67
7446c70k01J76l28Q73M8l50n6o8M46n19K2K17L39J38p67R1M32j51n7j01q6Q80
7468F08k19n30k2P1J54K04m56J98k39J22J90m54Q08l80L34q25M14L57m20J09L12
7489C36m00J3K72Q8l73P5J40m99K86L40l85OL54l4k98J21lp9p8j46M97n27J89
7512a05l65K00N13j20N65m80j11l05J97K86l27J22p08Q11m5l88K5M25J16n19O03
7533C90l96j14L15l53M56k17k22K00j74M24p6k50k17M20J01m43O0J8j65O09p31
7554c65L11J06o76M75N71o99J48K16m89K23J23k92O82l70K77k50K66m73K20j53
7574a49J44l62N77J24m10M22m7K57o70o9L87j7n37K92l77Q8j6M77P1m45j34J05
$$ plain form
7424 88 204 310 -6 40 -209 35 67 -336 -174 -432 27 279 -364 -49 -37 29 -86 338 546 208 97 -370
7446 -370 -571 -395 -723 150 198 -152 -208 -276 170 -349 -327 -110 229 367 -400 -309 123 -28 -85 -186 -272 608
7468 608 389 -141 -163 -92 62 266 -190 8 -231 -109 81 -373 435 55 389 -436 -22 335 -85 24 336
7489 336 -64 -51 221 309 -64 11 151 -348 -62 278 -107 -101 253 219 -79 42 39 -40 -118 -264 233 -294 -105
7512 -105 -470 -270 243 123 688 208 97 -208 -11 275 -52 70 -638 173 128 -260 -235 190 306 -213 390
7533 390 -6 -120 195 -158 298 81 -141 59 -115 309 233 -17 -234 186 287 -156 -96 -78 -243 366 -365
7554 -365 -54 52 -624 -149 422 -277 -129 87 -402 -179 -56 -348 334 -36 241 -9 257 -216 4 -149
7574 -149 -5 -367 210 334 -76 346 299 556 -114 -183 204 187 -350 -58 -435 -347 -363 114 185 -260 -394 -289
7596b89Q16n03k29L76l01j82pj72M40lJ28K36m76M36o10M10m36N33j76M1R1m6
7618G7O8o19O06j13K80n02K82o29N14K29j73J73k64L6m7L03m74K28J34j11J35
7639A33L00o86J2k58N61k56O99n91K59K93n33J87l22Q1K24L08j89m32M54Om71
7660b21M68k13k22J01N09o50L66k69k52m55O86M12Pj31j0Q0K9J35n18L01j18k47
7682b12J10O3J28K03m86M25j59l11M42k34l47K30N19k72k96L9k23J62K40O5N5
7703A41M7k02K19k99J33J56n23P53m06N37p42j41K00k0mM61m6j02k34j2M68j30
7725B54l8l68k75K94n0J33R8j41M4k1j31O34n84N6j52O72k30k98O97o64N9K37
7747B26k70j97M9K01j19k17K22O0l90O33J19m97o7K53o6K11k94M9l22M55j49m5
$$ plain form
7596 -289 527 24 -205 171 -130 -312 -319 -491 -51 -54 74 310 -166 270 -340 70 -366 167 -9 32 123 77
7618 77 145 -474 132 19 299 -203 79 -550 -36 193 20 193 -71 -35 -82 221 -253 -25 109 -2 133
7639 133 433 -253 -241 -499 62 -194 505 -86 173 466 -67 120 -202 -121 103 411 222 -210 244 250 -221
7660 -221 247 34 -188 -87 422 -228 138 -131 -383 -838 -152 260 267 136 126 206 235 370 -148 153 35 -212
7682 -212 -102 -39 89 292 -194 231 72 -239 203 -31 -378 -148 371 99 -197 -158 -381 -219 21 86 141
7703 141 188 -14 205 -94 39 195 -328 425 19 556 -186 -327 -127 -147 -151 310 264 162 -72 -84 384 254
7725 254 216 -152 -427 -133 -183 -50 48 -93 -49 -70 -201 433 -151 -95 -247 425 195 -103 594 -70 -11 226
7747 226 -44 -241 -192 9 -110 -327 -105 -45 -435 198 317 -180 -247 6 -60 151 -143 -94 -416 39 -110 -155
7769a55K69k03j56q7JL18K48k82k7R8j78M42L6n93N37o71L35K0m4P3l67K28q5
7792b43J56j16jK93n68K73J74l3O78n42l9L10Po23J71L10k4m01N06o8k76J84l38
7815b10N62j83Q6n63L17P3l08N86l00P5m61j18Q09l21l43J69o5J59j48J80j90
7836a94p4N36K67l53J27l10n7l38M80N41m30k07O2Jp8L10j25m83K45K13j52n9
7858g8K86K04p74L29J71k90N24l80J02j09K95l51k65N98K8k90K35q7j39j6K22
7879B15Q2m95m6K42k84P73l54r0o8L97j85j62j00L69j07j72K57m06k67N85l54
7900a70J79K80n64L31J46m77L02J07l64K07J19j13n9K64m21K18j82p2L31J21k02
7921a9K2P1Kj54M11j40m07N73l01k55n2N19q5K38j62p5p01P42q4l47J55m66M57
$$ plain form
7769 -155 114 -89 -245 -332 -331 -13 235 -47 -74 24 -154 288 324 -269 268 -403 -68 -48 -92 -19 -386 -158 -243
7792 -243 -87 -203 -204 89 -479 -206 -32 -65 613 71 32 342 349 -274 -103 207 183 -218 288 220 -56 128 -210
7815 -210 352 169 255 -308 9 82 -226 360 60 135 -326 -444 365 44 -299 -130 -195 -36 -184 -4 -194
7836 -194 -268 268 535 182 309 -1 -58 -396 84 625 195 -12 50 51 -27 283 158 -325 -80 133 -19 -78
7858 -78 208 412 -362 -33 138 -152 372 -8 94 -15 280 -71 -336 262 290 0 235 148 9 -7 215
7879 215 297 -198 -244 -2 -286 487 133 43 -25 372 187 25 -75 294 187 15 272 -134 -401 184 -170
7900 -170 9 289 -275 56 202 -275 27 134 -230 -23 96 -17 -76 188 -233 -15 -197 -269 62 183 -19
7921 -19 3 74 76 -78 333 193 -214 359 58 -197 -249 270 185 423 261 186 -515 227 143 -204 -49 -515 -58
7944e8l8J73j62k28j6J78L24n40J67O8L55n6l54j63L32R80j157L59p87J189j10
7965D56l29k68L43k63l02K22L52j82L00j97p0L30m21O9L84n32N24l67k4O2p6K33
7987B44l39L64p3m55N25l45O2l25J88N04l84k25J50L96j31o48L4N79k96o3M92
8008B54k48j10J46J23o61K47j67J88L36M7J87k25m4p05Q29Jl53N56l84K04j70
8029E1j74L03p2k36L90m51J51j49K92j64M19k59nj52k71R11m17k99MN12m62K19
8051A41L55o26j72L53j51P5n3l06N05L77l01j74P4J37J27o24K13K25k04l14O70
8072C27k83r0J57M14n90j97L47J00M68j008L09J13j26k84L87n77K97K60M36r45
8092d85M29M37m88L5N12p03O7N0K02L2K70n56J38M7J60l60L92N23p43K62j48m48
$$ plain form
7944 -58 -96 77 -85 -313 -329 -151 173 -367 -200 -132 223 167 -187 -350 -18 962 -195 164 -623 566 456
7965 456 127 -141 202 -61 -363 -141 211 29 329 132 62 392 -29 40 424 -108 416 49 25 87 11 244
7987 244 -95 269 196 -259 266 -79 -17 -342 -154 350 -34 -259 -109 287 156 -492 -458 121 -175 -238 254
8008 254 6 -104 42 165 -496 -249 -416 -228 108 155 342 117 73 -632 197 198 -155 401 17 221 51
8029 51 -123 180 108 -128 262 -189 -38 -187 105 -59 360 101 96 -56 -327 584 167 -132 -128 384 -78 141
8051 141 496 -130 -302 51 -100 -25 -78 -384 121 498 197 23 97 234 361 -263 -50 175 -29 -343 327
8072 327 44 -46 111 525 -65 -262 85 185 653 -355 -46 67 -59 -343 44 -533 -236 24 460 -485
8092 -485 -56 381 -107 -72 440 -263 -196 -146 56 88 358 -198 -60 -13 147 -213 179 702 -41 221 73 -375
8114c75L1J72j67l30N31P7K35K95l27k08J1L11k48N0l8o6nL3L9L25m61j06L55
8137A34J23l92L99k09J19j13K13n46J27PK41k13j01K00J13l77K90j95L44l05k28
8158c69N92J03k26J32k89j54O60k17ko14N97m53J28J48L80n86l21P31J04l65L14
8179B93J8n34J64J75l03K04J38k87M31q05N08M59
$$ plain form
8114 -375 -344 -172 -339 -669 -138 -61 174 469 142 -66 -55 256 8 58 20 -46 -51 -18 21 346 -115 -221 134
8137 134 257 -135 264 55 174 61 274 -272 -145 -138 103 -110 -211 -11 102 -275 15 -180 164 -141 -369
8158 -369 223 326 100 232 -57 -211 449 232 230 -384 213 -240 -112 36 416 -170 -491 240 344 -21 293
8179 293 311 -223 -59 116 -187 17 155 -132 299 -506 2 461
8191D61
$$ Imaginary data points
##PAGE= N=2
##DATA TABLE= (X++(I..I)), XYDATA
0@%%%%%%%%%%%%%L2o4O4o4O4r6J28j60J92k24K57k89L52m16M80n58O54p53Q50
32D49r62J102j259J422j597J798k013K243k504K788l097L437l806M211m653N133
48B692n663O241o868P563q334R188j0137J1201j2402J3762j5327J7150j9294K1864
62A1636k5021K8995l4176M1257n1602O8359j01599K91948n78400J66957N92139
73D10493n65605K90436l711k63442K23559N4702j34936m8358k8961J39491j03764
84c0096M5131N0865j58803O3622M9451p7103O6492p6571K7885O8938q7125N7840
96E26K118j29304J43135O3241j61182Q233Q0597k8758K9723m748o8813L4349N4076
109B3193j3166n3986n3581J06648O6805j16090O136M0117o9662N3877N2741q4706
$$ plain form
0 0 0 0 0 0 0 0 0 0 0 0 0 0 0 32 -32 32 -32 32 -64 64 -96 96 -128 129 -160 192 -224 256 -302 352 -401 449
32 449 -513 589 -670 752 -845 953 -1060 1183 -1321 1467 -1630 1807 -1999 2212 -2441 2692
48 2692 -2971 3270 -3598 3965 -4369 4819 -5318 5883 -6519 7243 -8084 9066 -10228 11636
62 11636 -13385 15610 -18566 22691 -28911 39448 -62151 229797 -348603 -181646 410493
73 410493 -155112 135324 131613 -131829 91730 146432 11496 -36862 -65823 73668 -30096
84 -30096 15035 65900 -92903 -29281 20170 -56933 9559 -67012 -39127 29811 -57314 526
96 526 2644 -126660 16475 79716 -81466 -73233 7364 -21394 8329 3581 -65232 -30883 23193
109 23193 10027 -43959 -97540 9108 75913 -40177 -34041 6076 -63586 -9709 43032 -41674
121d1674q573Q7644m268p3606L8503J3193q6697R7984P2660j44619L3328Q2549
133F6424q8867K9047L4156n9696L1582K7549L582k6172n8846O6896K5277o4593
145a3661L1113j9463k1053N8915l2954l0376R313M305M0310l8389l4562L6177
157a0325j7173K3488K9350o0288j3744N2892K6801n9096k9300P1688p694j9935
169a3336L6845n1250k0884N8431J746l4537j088K6412j5989l545L2366n1594j1648
182d8071O5829j2764j2942m088j1482K0820r18K1059j2594n6739P0173L7196o8119
195a2640j609Q802J1883L2726k2480k7790r07K9060K6971m4325j9948L9887M721
208B4351j6142L069n615j4703K1354K3783l3102j2879K9486j5591j4207L9022
$$ plain form
121 -41674 -50247 37397 33129 -40477 -1974 11219 -75478 22506 95166 -49453 -16125 66424
133 66424 -22443 6604 40760 -18936 12646 40195 43777 17605 -41241 25655 50932 -13661
145 -13661 17452 -2011 -23064 35851 2897 -27479 -18166 -13861 26449 -11940 -46502 -10325
157 -10325 -27498 -4010 25340 -34948 -48692 4200 31001 -28095 -57395 14293 6599 -13336
169 -13336 23509 -27741 -48625 9806 11552 -22985 -24073 2339 -13650 -17195 15171 -36423 -48071
182 -48071 17758 4994 -7948 -12036 -23518 -2698 -3616 17443 4849 -51890 18283 55479 -12640
195 -12640 -14249 -5447 6436 39162 16682 -11108 -12015 17045 44016 -309 -20257 19630 24351
208 24351 8209 11278 5663 -9040 12314 36097 2995 -9884 19602 4011 -10196 28826
220B8826j3333m8460M5111L2905n7852R47K6366k3679J8937J9560k9511k0487
232b0670K2799L5972l4278l6558L8726J0508o894R59l1353J659L4968k650k6929
245a3741q002K0819N05q238P627j6392p994K3976J0902j4800k5709J7205K3421
258I579j9227M414O316k3501J3058K6918j5179k7405J5393K5788j5441L344r52
271C105l1131L2002K6955l7316o835J7821P655j453j0641K2n256J3820K3102l1447
285D03j5514L3004p71j3238N144n542o608J8155J2583l0044j2319K7372N391j1487
299F529m452l450L299N200O304o296j6943R771J2560n996l714n344n535R290J7589
314A8812j0237l2764J6666K5053k1189j369J095j2928J8528P024j5659j1976L715
$$ plain form
220 28826 15493 -32967 12144 45049 -12803 -11856 14510 -9169 9768 29328 -183 -20670
232 -20670 2129 38101 3823 -32735 5991 16499 9605 10564 -20789 -19130 15838 13188 -13741
245 -13741 -21743 -924 -419 -8657 -1030 -17422 -25416 -1440 9462 -5338 -31047 -13842 9579
258 9579 -9648 -5234 1082 -22419 -9361 17557 2378 -25027 -9634 16154 713 4057 3105
271 3105 -28026 3976 30931 -6385 -13220 4601 12256 10803 162 184 -5072 8748 31850 403
285 403 -15111 17893 17122 3884 9028 3486 -3122 15033 27616 -2428 -14747 12625 18016 6529
299 6529 2077 -1373 1926 7126 13430 7134 -9809 -38 12522 6526 2812 -2532 -8067 1223 18812
314 18812 8575 -24189 -7523 17530 -3659 -5028 -3933 -16861 1667 8691 -6968 -18944 -15229
327a5229K5150r093k0471J6717n546k048J9113j6792j1189J5545R718o585j1873
340a2583R148J736p416J9035q446j9227J8012P237n457j936m778L213J662J1563
354A1763J097k8779Q010L0463r852j4805J056J905J0788Q542j5221j8648K1554
367G873J8852j9848r712P696J902L129m51n349p073N677R978r271o945N902k805
382d45l062P435K257j7337l203K2117m894j4739M632k967N969P393j0511p739
396a5094k14J8992M205k7581M933J4845o314P369m721j5343J2143J4285p783j6504
410a6782O544J3868j0076J357N318j5812P630J3424j0494m636K726K488J868J527
424a050K04q404K632J4600k213j0620K334M925K873M768m972j0510P171J3551
$$ plain form
327 -15229 9921 828 -19643 -2926 -8472 -10520 8593 -8199 -19388 -3843 5875 -710 -12583
340 -12583 -3435 -1699 -9115 9920 1474 -17753 259 7496 2039 103 -4675 -1462 200 11763
354 11763 12860 -15919 -7909 22554 12702 -2103 -1047 858 11646 20188 4967 -13681 7873
367 7873 26725 6877 -2835 4861 6763 9892 9441 4092 -2981 2696 12674 3403 -3542 2360 -445
382 -445 -3507 3928 6185 -11152 -14355 7762 2868 -11871 -7239 -10206 -4237 3156 -7355 -15094
396 -15094 -15308 3684 7889 -19692 -14759 86 -6228 1141 -3580 -18923 -6780 7505 -278 -16782
410 -16782 -10238 3630 -6446 -5089 229 -15583 -7953 5471 -5023 -9659 -6933 -4445 -2577 -1050
424 -1050 -846 -9250 -6618 7982 5769 -4851 -2517 2408 5281 10049 5077 -5433 1738 15289
438A5289n838j0128j358O783N696l770l990n950m55J4557j950j5883L313P998
452D314k69j066l380l250K11J0805j13j5622O495J0133q460K700O26q606P347
467A865O030n458m588j029P364K03n789L096n417k372J3359k405j3964K727N672
482g06L581k251q507r22N872O043pj4477k164J7825l72j0557N34K318K154O860
498E224l424o827J779P793P70o843L934J103q215J1402L532j5542P146K120k353
513A599P611q851m958R743J375L048j0833m215J7164k116m733J168r269J2486
527I219O712j2038l14j946O638P220j2956k635N079p99L585m798m559k00P84P574
543F566p548p266Q904n930M61J0541j1596q474J3495J131o828J386j404k806Q619
$$ plain form
438 15289 9451 -677 -2035 4748 10444 6674 2684 -3266 -3721 10836 8886 -6997 -3684 4314
452 4314 4045 2979 -401 -3651 -3440 7365 7252 -8370 -1875 8258 -202 2498 3124 -5482 1865
467 1865 7895 2437 -2151 -3180 4184 4387 -1402 1694 -3723 -6095 7264 4859 -9105 -6378 -706
482 -706 2875 624 -7883 -8805 -2933 3110 3103 -11374 -13538 4287 3915 -6642 -6108 -3790 -1636 5224
498 5224 1800 -5027 -3248 4545 5315 -1528 2406 3509 -4706 6696 10228 -5314 1832 3952 1599
513 1599 9210 359 -4599 5144 6519 9567 -1266 -5481 11683 9567 4834 6002 -3267 9219
527 9219 15931 3893 3579 1633 8271 15491 2535 -100 4979 4180 7765 2967 -1592 -1792 -1008 6566
543 6566 -982 -8248 656 -5274 -4813 5728 -5868 -14342 -847 284 -6544 -5158 -6562 -9368 -749
558g49K403j0762k858J0712L786r415M94L563l751P918O77j2930O642N011j319
573e78K81n596J930L783p2K332p859J148Q782m920K487k959m527J4260o485l388
589a381Q648j0551M819Q741r138J816m15K066L059k301K073p714N82J5165j3129
604B340o270J1136p303M935M232j5909K732J0183j469o303n774Q128L223p043
618c162L622n006l153J4035o683q426J0127m757q53P034p408Q01J47k500Q126
633A944n051m589L888k898Q916l786r867J0046k820L874M592j7883J0430R602
647F398j1614P092n105m747J4829n033m306l96j006J1235o847n252Q784p057N796
662B771N834j3498N490M495m622N154l232k442K864J18L769k400n391M292N34
$$ plain form
558 -749 1654 -9108 -11966 -1254 2532 -6883 -6389 -2826 -6577 1341 2018 -10912 -4270 741 -578
573 -578 -297 -5893 -3963 -180 -252 2080 -5779 -4631 4151 -769 1718 -1241 -5768 8492 2007 -1381
589 -1381 7267 -3284 1535 10276 1138 2954 2539 4605 7664 5363 7436 -278 304 15469 2340
604 2340 -3930 7206 -97 4838 9070 -6839 -4107 6076 4607 -1696 -7470 658 3881 -3162
618 -3162 460 -4546 -7699 6336 -347 -8773 1354 -3403 -4256 2778 -4630 -3829 -3682 -6182 1944
633 1944 -3107 -7696 -3808 -6706 2210 -1576 -11443 -1397 -4217 -343 4249 -13634 -3204 6398
647 6398 -5216 1876 -3229 -7976 6853 1820 -2486 -2882 -3888 7347 500 -4752 4032 -3025 2771
662 2771 8605 -4893 597 5092 470 5624 2392 -50 2814 2932 6701 4301 -1090 3202 3736
677C736J342J533q799J401R170l959k003k001l499Q924R59r377K270J333J050
692B080L388p544k045N233o69J065m421j158M432m374L226j186p403Q651L29o153
708f549N331k989j697M956k004o74j346J205M651m151K42K170m947O854J684q011
724e275L918Q16j151M811n025k519M205J764J032l246k745N263J053J058l484
739D75m136P936n2l269K592l541J688N165l872j573J7J885J584l513J626L83k611
756G84M667k889j521L304l304J614K988l747j251R17J130J394l995M39j447K327
772A410L405p884k328O593l76r81k666l146N042K193l629l111J570L604m88k747
788c539L0P17O90Q38j986n5J836j933L89K574o96k784P70K332R68o00k459P35
$$ plain form
677 3736 5078 6611 -2188 -787 8383 4424 2421 420 -3079 5845 6804 -2573 -303 1030 2080
692 2080 5468 -2076 -4121 1112 443 1508 -2913 -4071 361 -4013 -787 -1973 -9376 -725 -396 -6549
708 -6549 -1218 -4207 -5904 -948 -2952 -3626 -4972 -3767 884 -3267 -3025 -855 -5802 1052 2736 -5275
724 -5275 -1357 -541 -1692 3119 -1906 -4425 -220 1544 2576 -670 -3415 1848 2901 3959 475
739 475 -3661 4275 4223 954 3546 5 1693 6858 2986 1413 1430 3315 4899 1386 3012 3395 784
756 784 5451 2562 1041 4345 1041 2655 5643 1896 645 1562 2692 4086 91 530 -917 1410
772 1410 4815 -3069 -5397 1196 820 -161 -2827 -5973 -931 1262 -2367 -5478 -3908 -304 -792 -3539
788 -3539 -3509 -2792 -2102 -1264 -3250 -3305 -1469 -3402 -3013 -439 -1135 -3919 -3149 -817 151 -449 -2908 -2173
806b173M247R16m333j439M052K036j695j205j381L294K489k522k514R37K421J667
822D797k882j443J617J271l3r47j074R26p4M34M07j546l20J288l30n73R6j327
840B87J22J044P02l461j447K909N3j599M18k524Q08L435j512l321Q1K843J382
857B20l041o58N78O76J685j853k331K384J51M02k23j524M67L27J987n56k516J604
875b221J260r87J464j773r31L624k85j705J284N9N61L93O27m02o75J333N57l67
893A816L69j847J53L017n75k914J601j44J948m93l898J856L365k84l459j140J696
910A067K049j446r92j083J209K598k739j586L143j835j308J404R66j618j106J423
926A46M23K42m50k394M76L207j061k745k5J748J151j274k746O51K349J9k810p53
$$ plain form
806 -2173 2074 2990 -1343 -2782 1270 3306 1611 406 -975 2319 4808 2286 -228 709 3130 4797
822 4797 1915 472 2089 3360 3327 2380 1306 2232 2158 2592 2999 1453 1133 2421 2091 1518 1614 287
840 287 409 1453 2155 -1306 -2753 156 209 -1390 -972 -3496 -2688 747 -765 -4086 -4005 -1162 220
857 220 -2821 -3479 -2901 -2225 -540 -2393 -4724 -2340 -2189 -1787 -2010 -3534 -3067 -2740 -753 -1309 -3825 -2221
875 -2221 -961 -1948 -484 -2257 -3188 436 151 -1554 -270 -211 350 743 1370 968 293 1626 2183 1816
893 1816 2185 338 491 3508 2933 19 1620 1476 3424 2931 -967 889 4254 3970 511 -629 1067
910 1067 3116 1670 678 -405 804 3402 663 -923 2220 385 -923 481 1447 -171 -1277 146
926 146 569 811 361 -2033 -1557 1650 589 -2156 -2181 -433 718 -556 -3302 -2651 -302 -283 -3093 -3846
944c846J831J756q94k243r6K176J07j090J7Q71n9M23N83l64O82m40m4J310M89
963A169n36j993K767J694k291k20J12n1L235j491l384J793L197r55j683p15J671
980B319Q8M20l32j735J679Q95j826O35q60K7J431k172J275r23j409J599j4q76
998B21p61k26K108j491J67l29k321K793J245m427J054J661j302j17J092j291j570
1015c494K944j29k599O43N19q38J696j87j812l02L219o25j391R70o61P62J722
1032D37k253o68K288M21L58j632O77J222p94J449j892L63K674l154K564M61k256
1049B65K624j542J94J692j883j44R55Q99L26l891K548J741l233L159k023l270
1065a583M599k48l289M74J557O8k020N66M36j373K412r12l719L557J126m143J882
$$ plain form
944 -3846 -2015 -259 -1153 -3396 -3492 -1316 -1209 -2299 -2282 -1411 -1470 -1047 -464 -828 -146 -586 -630 680 1169
963 1169 633 -1360 1407 3101 810 590 702 651 3886 2395 -989 804 4001 3046 1363 648 2319
980 2319 2407 2827 2495 760 2439 3334 1508 2143 1283 1310 2741 569 1844 921 -488 1111 1097 221
998 221 -540 -766 1342 -149 18 -311 -2632 161 1406 -3021 -1967 -306 -1608 -1725 -633 -1924 -3494
1015 -3494 -550 -679 -3278 -2635 -2116 -2954 -1258 -1445 -3257 -3559 -340 -965 -2356 -1386 -2047 -1285 437
1032 437 -1816 -2484 -196 225 583 -1049 -372 850 56 1505 -387 -24 2650 -504 2060 2521 265
1049 265 2889 1347 1541 3233 1350 1206 2161 3060 3386 -505 2043 3784 551 3710 1687 -1583
1065 -1583 3016 2768 -521 -47 1510 1578 -442 124 560 -813 1599 687 -3032 525 1651 -2492 -610
1082f10P54j933Q43P89k020J090k27j363M42J296K5r82m71P68R98m11j486m70
1100b968L551m50l674K669l7r99L740m243q54M698j727j01q00oK861j830P84N42
1118A156k860M177k224k356N985k067k428L471j463n49J096j317J871n75k07L90
1134B100j996K348J030l337J278N20j569K786k461j061K492j543M70l89k438L065
1150A295j68j874J135j158O97J59j730J754j244j131L446l064q3L081m534R13
1166b506L323l465O3J243m20P57n44M9J47r13K924j450k725L805j370r3K235l756
1184b696J880J780k230P87K35j345K900j286l6J88r88L568j718j946K781j286
1200E88J105J417m120L243J290l302K675j333r68J048m60J119j152l84J848k294
$$ plain form
1082 -610 144 -1789 -946 -157 -2177 -1087 -1314 -2677 -2235 -939 -914 -1896 -2367 -1599 -601 -1012 -2498 -2968
1100 -2968 583 133 -3541 -872 -909 -1908 1832 -2411 -3265 1433 -294 -395 -1195 -1201 1660 -170 614 1156
1118 1156 -1704 2473 249 -2107 3878 1811 -617 2854 1391 842 1938 621 2492 1917 1710 2100
1134 2100 104 2452 3482 145 1423 1943 374 3160 699 -362 2130 587 1057 668 -1770 1295
1150 1295 1127 -747 388 -770 -73 86 -1644 110 -1134 -2265 1181 -1883 -1966 1115 -3419 -2506
1166 -2506 817 -2648 -2585 -1342 -1762 -1005 -1549 -1500 -1353 -2266 658 -792 -3517 288 -1082 -1175 1060 -2696
1184 -2696 -816 964 -1266 -479 -244 -1589 1311 25 -11 177 -811 2757 1039 -907 1874 588
1200 588 1693 3110 -1010 2233 3523 221 2896 1563 595 1643 1183 2302 1150 766 2614 320
1216C20J906J093m720K673J495l185J937j18j200J205L74k106l04N78J333k392
1232a111j56J985j718P23k47j490O74J988k527N74J047k453J563p89J16N35O40
1249f46j006L83k62J390j635q78K809r49M6L21j964K501N31k850J728P92J0N47
1267H68k262J537J39J096k82k276K306K093l990J889R24k444K607q92j427J453
1283A339Q50r57l15Q35N17k556J736R23j860J510q02j134J667q4j894R72J64l49
1301E62k44r8o55M87j47M90j062m73P18k20P0l34p23P67N82j471O52K5l85J291
1321a68q59j089J457P1n10l64K96M9n33O12P53j611J448Lj239J782j97p45M85
1340c59K04M17n92m81J138MK53j85j485J807R23j389J25j5K91N58q50L08m9R83
$$ plain form
1216 320 2226 3319 -1401 1272 2767 -418 1519 1401 201 1406 1780 -326 -630 -52 1281 -1111
1232 -1111 -1267 718 -1000 -277 -524 -2014 -1340 648 -1879 -1305 -258 -2711 -1148 -1937 -1821 -1286 -646
1249 -646 -1652 -1269 -1531 -141 -1776 -2654 155 -794 -748 -427 -2391 110 641 -2209 -481 311 321 868
1267 868 -1394 143 282 1378 1096 -1180 1126 3219 -771 1118 2042 -402 2205 1313 -114 1339
1283 1339 2189 1232 917 1752 2269 -287 1449 2372 512 2022 1220 86 1753 1669 -225 747 911 562
1301 562 318 220 -435 52 -95 395 -667 -1140 -422 -642 -572 -906 -1629 -862 -280 -1751 -1099 -1074 -1459 -168
1321 -168 -1027 -2116 -659 -588 -1098 -1462 -1166 -1117 -1650 -1038 -285 -1896 -448 -445 -1684 98 -99 -844 -359
1340 -359 -155 262 -330 -811 327 331 584 399 -1086 721 1644 255 380 365 656 1214 364 672 623 1606
1360A606K80j353K42Q71k95n5o29L16N43j056R54P1p80N68q58L55N71m77n15o17
1380b58J014Q54k400O32K13m89O56j097l18R18K81m21j763J284Q38j282l04N63
1398a079q16R08l59n19M38K8M16p03P32J5r8j52N7N81J4l26L96M9N45j61p87P80
1420d1J70j81o8k06P88O02r18O58l18l08J343j081J15J66K93Q81j288j49J279
1439A737j299Q52l0j130J792N26j590J60p73J71L17j191J776j708M9O66p54k65
1457f94J661j437L27L88r03l7L32j15L46j37j533N31R50K95j195o94O17Q55o45
1476a088l36k7M08O21m69j76n87Q65P22r39r50J521L96k92K35n32Q57o56K31n3
1496b49K17L81J17m87N62P88j021n04K51M62l43J92J029j67O37j518L46n34J902
$$ plain form
1360 1606 1886 533 775 1646 1351 1296 667 983 1526 470 1424 1495 715 1283 425 780 1351 874 359 -258
1380 -258 756 1610 -790 -158 55 -434 222 -875 -1193 -275 6 -415 -2178 -894 -56 -1338 -1642 -1079
1398 -1079 -1895 -987 -1346 -1865 -1427 -1399 -983 -1686 -954 -939 -1037 -1189 -1132 -551 -537 -863 -467 -418 127 -34 -821 -41
1420 -41 129 -52 -120 -326 462 1064 146 804 486 178 1521 440 555 721 1014 1895 607 458 1737
1439 1737 438 1290 1260 130 1922 2448 858 1018 245 416 733 -458 1318 -390 -341 325 -429 -694
1457 -694 967 -470 -143 245 -658 -695 -363 -478 -132 -269 -1802 -1271 -321 -26 -1221 -1915 -1298 -443 -1088
1476 -1088 -1424 -1451 -1043 -422 -891 -1067 -1654 -789 -67 -1006 -1956 -435 -39 -331 -96 -628 229 -427 -196 -249
1496 -249 -32 349 466 -21 541 1329 308 -196 55 517 174 366 1395 1228 1865 347 693 159 2061
1515B061j163m1J148n50q38J058j342n71J376N89M32j339J017j810k37j93R05
1532E02o51k40J189j643J314j35R1m94N78o75o94n69J049j08j475o4J910p80R80
1551H5K2j742O26M82J20j216L3J003n74m82J549q51j63J872k369L59J411K99p51
1570b87l27K24R87j265J722n11j595J913o57m07J793r62j99J75r78K315j455m95
1588iJ270j01R18r24l95M39J146j221n28M15j039J682p92l70P03p75Q36L5j918
1607f28O26Q03j051K69n78Q63K62j090J378j670p9R60j684L26J410j862O90J094
1625C9j552J326m34m0N51j700J844j080j089L107j102q91o30P23P97q78o83J372
1643c20r97R30O48j544J405K65k53p2n21Q07K0m61O33M66j138J228n44j49J151
$$ plain form
1515 2061 898 857 2005 1455 617 1675 333 -238 1138 1727 2159 820 1837 27 -210 -403 502
1532 502 -149 -389 800 -843 471 336 427 -67 511 -164 -858 -1427 -378 -486 -1961 -2025 -115 -895 85
1551 85 107 -1635 -1009 -527 -407 -1623 -1590 -587 -1161 -1643 -94 -945 -1108 764 -1605 -1246 165 464 -287
1570 -287 -614 -390 597 -668 1054 543 -1052 861 204 -203 1590 628 429 604 -374 1941 486 -9
1588 -9 1261 1160 2078 1154 759 1198 2344 1123 595 1010 -29 1653 861 491 1194 419 1255 1290 -628
1607 -628 -2 801 -250 19 -559 304 566 -524 854 -816 -895 65 -1619 -1293 117 -1745 -1055 39
1625 39 -1513 -187 -621 -661 -110 -1810 34 -1046 -2135 972 -130 -1021 -1651 -928 -131 -1009 -1692 -320
1643 -320 -1317 -387 261 -1283 122 387 134 62 -459 348 368 -93 540 1006 -132 1096 552 403 1554
1662A554j03k344K146jn70J04n85J177r27N02J02j238P89J402k983R39J428j342
1680E0O77p06m37J525j980P91J76r91J562l61q88J015o49k15R36j654J124o25
1698f50l08K024k761J541J43k149J457J134k489M82N52R84J48j422L95l4K05J420
1716F72j917p37L518j565j377Q18n28O45k0M51M72p69P50N52r30J4L28J86L08
1735H71K21o98M49o31Q77O64p88J208p70r02J126p00m67R59j077R12J94j609J100
1754I39n8j26Q04k335J210K152k877n6O86r66J448j259j38q9K5J305j497N5J076
1773B99j002n50K199j852M86J116j956Q6j9J468j085j19M07P92j346j61N58k08
1791h87N70p95O85Q5J45M22j193M53J540j576o8M45K65M45M16j569K02P92r3n28
$$ plain form
1662 1554 1451 -893 1253 1252 682 786 201 1378 451 953 1055 -183 606 2008 -975 -36 1392 50
1680 50 727 21 -416 1109 -871 -80 96 -895 667 306 -582 433 -216 -431 505 -1149 -25 -650
1698 -650 -958 1066 -1695 -154 -11 -2160 -703 431 -2058 -1576 -1024 -40 108 -1314 -919 -953 -748 672
1716 672 -1245 -1982 1536 -29 -1406 -588 -1116 -471 -491 -40 432 -337 413 965 35 49 377 563 871
1735 871 1092 394 843 212 1089 1753 965 2173 1403 501 1627 927 460 1419 342 1254 1448 -161 939
1754 939 881 755 1559 -776 434 2586 -291 -347 339 -627 821 -438 -576 -665 -640 665 -832 -777 299
1773 299 -703 -1253 946 -906 -420 696 -1260 -1174 -1193 275 -810 -929 -522 270 -1076 -1237 -679 -887
1791 -887 -317 -1112 -427 -342 -197 225 -968 -515 1025 -551 -619 -174 91 536 952 -617 -415 377 284 -244
1811b44J76Q99m00j018P23J250j610J356o08R0P43j145J33O09Q60m89j624R13
1829F14P43o54r98O76J36P31m96j330M40O99N33m78j200J141K33j515P87J03r77
1848h12N52oj3j60k48M67j62k04R66r76j41Q0n30J390q77J3J16k84J103q44P8
1869d92L77o31P76o57N01l22O5L63j68k85N83j07n19Q81L93p42L94n39O10J42
1889F23J19K98p21J18K57q91N80O04n51M09O68m27o63j13R59r59J34N23m37l76
1909A54O47o18l76Q62K05p41qk70m9O4J21K41q11j2O06m03j52j8l12M09O03n85
1931d43l57N82l70k04R2n4Q49p76M45j86J83J63o49L27J81K16nj300J424m5j096
1952a023R72M82r84N52m21L53M93M9k28j23j82P85n94Q55p01j78L72N51j17r20
$$ plain form
1811 -244 -68 831 431 -587 136 1386 -224 1132 524 614 1357 212 345 954 1814 1325 -299 614
1829 614 1357 703 -295 381 517 1248 752 -578 -138 561 1094 616 -584 557 790 -725 62 165 -812
1848 -812 -260 -266 -279 -439 -687 -220 -382 -586 380 -596 -737 -657 -1187 203 -674 -661 -545 -829 274 -570 -492
1869 -492 -115 -746 30 -627 -126 -448 -383 -20 -188 -473 110 3 -516 365 758 16 410 -129 481 623
1889 623 742 1040 319 437 694 -197 383 987 436 845 1513 1086 423 310 1269 310 444 967 530 154
1909 154 801 183 -193 669 874 133 125 -145 -194 -130 -9 232 -579 -591 15 -388 -540 -558 -870 -461 142 -443
1931 -443 -800 -218 -588 -792 -700 -754 95 -681 -236 -422 -239 -76 -725 -398 -217 -1 -6 -1306 118 73 -1023
1952 -1023 -51 431 -553 -1 -422 -69 424 473 245 122 -60 725 131 986 285 107 479 1030 913 -7
1972gP58J15j53m61k6J155o57m55Q50r12P71n24o08O14l4p5j56j82J003j314p72
1993a070J261J19j126J366o08n20Q93o44l15lR19m13k88K42q4n50L88l15k99O63
2013c84Q7K47r38N62P7J57n04R08j284L22M69n52Q30r46Q28o7o6K70Q7k18J53
2034C8k06k07O43k55Q93n07L89n68k23J487r76n81M16N60q44L23J81l33k18J000
2054A012o23k32J47J89l51J52M49q04J21O51m10K1p1L35r34P20j45r2L03p29j32
2075d23m4J81j61j91N38k3m08k60Q86j01k38m16K05N6L16l43l83M05J82M71j072
2096h23qJ040m36q25R40K06m89N4l09l45J150L22l54j81K82N7n52J35N37m1q1
2117B79K34l56M15l96J15K57o7o0l36M08J4m57Q84l85n4o8K17n76K82K75j70J66
$$ plain form
1972 -7 751 866 713 252 226 1381 724 269 1119 207 978 454 -154 460 426 351 195 13 1016 -298 -1070
1993 -1070 191 310 -816 550 -58 -578 315 -329 -644 -647 272 -141 -429 -187 -271 -821 -433 -748 -1047 -384
2013 -384 -297 -50 -988 -426 -349 -192 -696 212 -1072 -750 -281 -833 -3 -949 -121 -188 -254 16 103 -115 38
2034 38 -168 -375 268 13 906 399 788 220 -3 1484 508 -73 343 903 59 382 563 230 12 1012
2054 1012 389 157 304 493 142 294 743 -61 60 711 301 322 251 586 -348 372 227 135 438 -291 -423
2075 -423 -467 -286 -447 -638 -100 -123 -531 -791 95 -6 -244 -660 -455 -399 -83 -426 -809 -404 -222 249 -823
2096 -823 -831 209 -227 -1052 -112 94 -395 -341 -650 -995 155 477 123 -58 224 281 -271 -136 401 360 279
2117 279 513 157 572 176 291 548 481 421 85 493 507 50 934 549 495 427 644 68 350 625 455 621
2139F21n06n8M11p99J34N35l12l13O6m5M5O31m67J76n74K45K51p49J122j080O92
2160B6p89L08R9J8L83k05j65k83P12l70l80L26m37K73j3k26N48m00O21J61j107
2181i00Q96L44j158Q58K54l75L40K2k31p5J98J52l70J86O16j109O47M15o82J28
2201A56Q3R7K85k35R4p4k99N43j72j97L69o68J99K74n78j22O46j28Q2m60k11Q14
2223D98m98N23m98J2K40k63m18R61o55m6r2l99M07R0n60J044p34k94J302j178
2243e58J16M01m64O35r63N41K84o62L70j22l01O81l56l38O54j69r1Q19j030L55
2263a98j52l02J326m34j86J21m34Q03k44m5L89m16k7O22o31L18k2o28N79k66J38
2284C11N90l75o83Q10n20K62j72l36K30O7j95K64j184Q32N10o08J29k84K65J48
$$ plain form
2139 621 115 57 468 -331 -197 338 26 -287 -221 -266 -221 410 -57 119 -455 -210 41 -708 414 -666 26
2160 26 -763 -455 -356 -338 45 -160 -325 -608 104 -266 -646 -320 -757 -484 -497 -723 -175 -575 46 207 -900
2181 -900 -4 340 -818 40 294 -81 259 281 50 -25 173 325 -45 141 757 -352 295 710 28 156
2201 156 239 336 621 386 480 406 107 650 478 281 650 -18 181 455 -123 -245 401 273 355 -105 -316 498
2223 498 0 523 25 37 277 14 -404 557 -98 -144 -236 -635 -228 -138 -698 346 -388 -682 620 -558
2243 -558 -442 -41 -505 130 -833 -292 -8 -670 -300 -422 -723 -42 -398 -736 -82 -251 -342 477 -553 -198
2263 -198 -350 -652 674 240 54 175 -259 544 300 255 644 228 201 823 192 510 488 -140 439 173 311
2284 311 901 526 -157 653 133 395 223 -113 117 184 -11 253 -931 -99 411 -197 -68 -352 -87 61
2304F1k67q8j64M0J90K38l72J27n78P12K32r18O60k19k72K95L11l12L78n58N81
2325G7j9q61O02l58L17k61j3N5J203j263K02M72o23O26r2n04N81K0L77p09m25
2346e96J538p06j40O64o58o3M05n47L92l7J26K63q19P13J21r11R44p1J11j70l78
2367A81k17Q67j126M38K23l72K29Q1P1j42Oj84J1l88M03K80q29K28l01N80N5j26
2389c2N8l32m12O52o6j34K37m65O9rK01j03j27J63j14J51Q8jj41K3N64j263M76
2412e17L74l19M97K8j91L40k50J06n2p2k92J093p98o9Q20r8n6p79L62P07m04o27
2434a97L09J2M21l59M41p19N01O34o07n98j43L10K03j184J840l84q99L93Qn8J73
2455I7N83j023J10j90J95o93O82k87K22L50qr5Q4m51L88k82k4m11Q45k33k44M68
$$ plain form
2304 61 -206 -294 -458 -418 -228 10 -362 -235 -813 -101 131 -787 -127 -346 -618 -323 -12 -324 54 -504 77
2325 77 58 -803 -201 -559 -242 -503 -516 -461 742 -521 -319 153 -470 156 64 -440 141 161 538 -171 -596
2346 -596 942 236 96 760 102 39 444 -103 289 252 378 641 -178 535 656 -255 689 618 729 559 181
2367 181 -36 831 -295 143 366 -6 223 304 375 233 239 55 66 -322 81 361 -468 -240 -541 39 94 -32
2389 -32 26 -306 -718 -66 -132 -266 -29 -494 -425 -434 -233 -336 -463 -300 -414 -263 -175 -176 -317 -294 270 -993 -517
2412 -517 -143 -462 35 63 -128 212 -38 68 16 -56 -348 745 -53 -122 698 600 544 -235 127 834 430 -197
2434 -197 112 124 545 186 627 -92 409 1043 436 -162 -305 5 208 -976 864 480 -419 -26 -18 -76 97
2455 97 680 -343 -233 -423 -228 -921 -239 -526 -304 46 38 -57 27 -424 -36 -318 -342 -753 92 -141 -385 83
2477H3j43k25r2j82L10j8j49J09j84K51k34k8N98q3L55j54n95K29J07j02L26r6
2499H3l96L1J79M09k65J01L38j31k70J54m79O81L06l78K04m66o3M91q54N23k16
2520a8JO0l86J76M49k79k15M74l15K40n10L04k12q1M23o18N3J058j018J7J21J96
2542h0L25q60K32j26N60o37K24m85J72O89l18M2M64n61K75j74L2M16k96Q1p2%
2564i7j8L25q89N70J02l44M44J90Q3n01L68j12m72O86K10j95l04P38p18M47l68
2585A45J10J30J9j6j23Nk4j55K60K9m7j74L94l44j62K75L89l78K54k47j44k94
2607i8l38L03k54N03j10J26m78J93K98q33P89m40K55J25k88L4K32l97q4L65j84
2628b81j37N39j59k60K74Q4p29Q85pj35k49kn8L55n09M17J74m62M87k12K25J71
$$ plain form
2477 83 -60 -285 -377 -559 -249 -267 -416 -307 -491 -240 -474 -502 96 13 368 214 -381 -152 -45 -147 179 83
2499 83 -313 -282 -103 306 41 142 480 349 79 233 -246 435 741 363 567 101 38 529 -325 198 -18
2520 -18 -17 43 -343 -167 282 3 -212 262 -53 187 -323 -19 -231 -312 111 -507 -454 604 -414 -397 -276 -80
2542 -80 245 -615 -383 -509 51 -586 -362 -847 -675 14 -304 -262 202 -359 -84 -258 -226 190 -106 -25 -97 -97
2564 -97 -115 210 -679 -109 -7 -351 93 283 366 -135 233 121 -351 335 545 350 46 784 66 513 145
2585 145 255 385 404 388 265 270 246 91 351 380 333 159 553 209 47 322 711 333 587 340 196 -98
2607 -98 -436 -133 -387 116 6 132 -346 -153 145 -688 101 -339 -84 41 -247 -213 19 -378 -462 -97 -281
2628 -281 -418 121 -38 -298 -24 60 -669 216 209 74 -175 -177 -235 120 -389 28 202 -260 227 15 240 411
2650D11l00k16J00K03j33l12K43M90l57p4l57N21k63j10K02P3o04O71n51N32K11
2671C80l04K92m62L27jl81l15L61L65o6n65L41K11k7l58rj40K33m40M82k89m0
2693d05J92k62N68lj42l3l80P6K18Mm44O47r17J08O75m67M49k85j43N61k18o2
2715b63L38o7o1K57J05r46L90M42l64O09m38j27K42l36O32l76J11L3K26J2l36
2736H3K11N17q30P96m78l4rj90q3r9J30J06J30k61K7j5L54k08l2oj46K41l68K42
2760G8l76J96L27k31n5QM24o11m5L12l04l50P81q66O33J48l40N76l89l73L69j21
2782b09K94n01J6o7j2M27K47n00q4J51J40M5lL75o10J37n7N93m05O12q01J09k04
2805c07M88L55l09n14P91k67k01Q07l61j00n5K32l18o04L78M48n73ON45l44j55
$$ plain form
2650 411 111 -105 -5 198 65 -247 -4 486 129 55 -302 219 -44 -154 48 121 -483 188 -363 169 380
2671 380 76 368 -94 233 232 -149 -464 -103 262 196 -369 -28 183 156 -202 -211 -351 -118 -558 -76 -365 -405
2693 -405 -213 -475 93 90 -52 -85 -465 -389 -171 -167 -611 36 -881 -773 -98 -565 -116 -401 -544 17 -201 -263
2715 -263 75 8 -53 204 309 -637 -247 195 -169 440 2 -125 117 -219 413 37 148 181 407 419 83
2736 83 294 811 -19 777 299 265 256 66 -17 -116 14 120 250 -11 16 1 355 147 115 109 -37 204 -164 78
2760 78 -298 -102 225 -6 -61 -53 371 -240 -285 27 -277 -627 154 -712 -79 69 -271 305 -84 -457 -88 -209
2782 -209 85 -416 -400 -467 -479 -52 195 -305 -389 -238 -98 -53 -56 319 -291 -154 -211 382 -23 589 -212 -103 -307
2805 -307 181 536 227 -287 504 237 36 843 482 382 327 559 241 -363 15 463 -110 -104 441 97 -58
2826e8J76m26K4O41l33n1K84p5K45l43j57O25q18L83j23k29J26m8l39L9L10k27
2848c74j44M23p0J5m16P50l32j50PL14L93l06J52o06J05J38P5k60K1J10l30N53
2870F8J11l68O74o42L32R7j89J94k07k63M52l24J19mk8J70L96k51j66J8j55LR5
2893A32J5j14J96L5p2j69L32J9l08L92n42M35j35m74P01k86m02M04j51M4l50L87
2915H9k55l2r4J66L90m58k36M89M4o13M72l38K77N06o31N9lJ88k70K44m64L19
2937a51K32p24M59J22m03K30K7p0P2p2M01J56n86RM28k91O8m88N21J41j81M24
2959C24m38M85k63l89O92p1j55m6j41M93o70M6k57L62K85j089N24O96r48N06M51
2980C97j91K38q98R22j72l63L04M6m97J26K27k94k55Q56o86K48m60J36K1N32l01
$$ plain form
2826 -58 118 -308 -284 357 24 -27 257 182 427 84 -73 552 -266 117 -6 -235 -109 -157 -496 -457 -147 -374
2848 -374 -518 -95 -165 -150 -566 184 -148 -298 -291 23 416 110 262 -344 -239 -101 -26 -286 -265 -155 -485 68
2870 68 179 -189 485 -157 175 272 83 277 70 -193 259 -65 54 50 22 192 588 337 171 189 34 37 132
2893 132 147 33 229 264 192 23 355 374 66 458 -84 351 216 -258 443 157 -245 159 8 52 -298 89
2915 89 -166 -198 -292 -126 264 -194 -430 59 103 -510 -38 -376 -99 407 -224 -165 -168 20 -250 -6 -470 -151
2937 -151 81 -643 -184 -62 -465 -235 -208 -278 -206 -278 123 279 -307 -298 130 -161 -93 -581 -60 81 -100 324
2959 324 -114 371 108 -281 411 340 185 139 -2 491 -179 -133 -390 -28 257 -832 -308 388 -560 -54 397
2980 397 206 444 -454 468 296 -67 237 283 -214 -88 139 -155 -410 446 -240 8 -452 -316 -295 237 -64
3001f4k36%K21M03p53J20J5J49m53J116p00L43k99N6l32j77N29j04j42N8J75P9
3023DK50j45J09k66j99j28K60k00K97k87L94j20M9L55%l53n9R0j17L33l08k96
3045c37K59j42O39j57n87M17K11pn56J06PM2k52O08k2m5k86O1L07l84n7R0n39
3068f24N84j77M14k33Jj49J15K95l09J34j21j12K36K09k00m67O4O2J90l8j9j28
3090b73N93np07P00k22N6p21N87k57K06j68K28k14J95L93o48K64K12J38j26k19
3111A2n8j81K81J35l24J31M85m02K0M38p98J60N44o55J7L47l43N04l41j70M31
3132B33j34Q4j30J19j15j92O7K2m6q2J24R2K15n99NK66R7o8k19k72j61M25J8k70
3156e21K18L29L1p5L1K14n02pM61k24q0L81L9p31M13j42q57J245p15L56K74j45
$$ plain form
3001 -64 -300 -300 -79 324 -429 -309 -294 -145 -598 518 -182 161 -138 -82 -414 -591 -62 -166 -308 -250 -75 4
3023 4 254 109 218 -48 -247 -375 -115 -315 -18 -305 89 -31 18 373 373 20 -39 51 -66 267 -41 -337
3045 -337 -78 -220 419 262 -325 92 303 296 -260 -154 -147 -105 -357 251 229 184 -102 -41 266 -118 -175 -85 -624
3068 -624 -40 -217 197 -36 -35 -184 -69 226 -83 51 -70 -182 54 263 63 -404 -340 -278 -88 -126 -145 -273
3090 -273 320 315 -392 308 86 142 -579 8 -249 -43 -211 17 -197 -2 391 -257 7 219 357 231 12
3111 12 -46 -227 54 189 -135 -4 481 79 99 537 -261 -101 443 -212 -195 152 -191 313 -28 -198 233
3132 233 99 183 53 172 57 -135 -68 -46 -92 -174 -50 42 257 -342 -337 -71 26 -42 -261 -533 -694 -269 -251 -521
3156 -521 -303 26 57 -18 13 227 -275 -282 179 -45 -125 256 295 -436 -23 -165 -1022 223 -492 -136 138 -7
3178gK05l98Q0J85N71m72k65j58R5O78q01K57N61o22M48l29M88r5n89P21k57J52
3200D48j42n27L05n52P85K50j77k05J13o33O41l85K16p7j9n8Q2J91P8k87j97k5
3222a75O2L65n00J18K0L42l30J5P6O4K27l14O1q1m40O61j35m12M68j88k57K80
3244g3k41j5K14k86n5N19M08o79j30K73J25Mj1l29P1J42N14n94K24L34n48M05
3266B72n8l8K03k27K91L2l40p7j57R5J93j93K41J17k94L95o60J50J85m44Q8J80
3288d6L05M05p75N17n7n71J8N4K48l59r4L52O60p27J84n57N19q0j41k90O32o20
3310d23L29K04l74kO0j05L68p6n48M07m15O84j2k80M18J12n10lK46n4k89R1l46
3333e18N12k95M29o73O18N18k78p48O98N14q26M01r3J84k78N88n23m67O84l18
$$ plain form
3178 -7 198 -200 -120 65 636 164 -101 -259 -164 514 -287 -30 531 -91 357 28 516 421 -168 553 296 448
3200 448 306 -221 84 -468 317 567 390 185 298 -335 306 -79 137 60 41 -17 65 256 334 47 -150 -175
3222 -175 -113 252 -248 -130 -110 232 -98 -83 -7 57 284 -30 31 -50 -490 171 36 -376 92 -96 -353 -73
3244 -73 -314 -329 -115 -401 -456 63 471 -208 -338 -65 60 64 53 -276 -205 -63 451 -143 81 415 -133 272
3266 272 214 176 379 152 443 475 135 58 -99 -4 189 -4 237 354 60 455 -205 -55 130 -314 -226 -46
3288 -46 259 664 -111 406 349 -222 -204 -150 98 -261 -355 -3 657 -70 114 -443 76 -4 -145 -435 197 -423
3310 -423 -94 110 -264 -266 -206 -311 57 -19 -567 -160 -575 109 97 -183 235 347 -163 -166 80 26 -263 -172 -518
3333 -518 -6 -301 128 -545 73 591 313 -435 263 777 -49 352 259 443 165 753 230 -237 447 129
3353A29rn8R0r1L0n83P59R0k45j63Q6O7L1k40k23K82KK92j03n85M5K54R3m17M86
3378A9L20o6n28L88m69J57L24p39J065n34o25P90k48r0O74m81j67L00l55K03J8
3399d4l30j8J85M35o25L23m9r0N2O9M32p78P69m78L40Jk42K19o12M3M24j55K68
3422A39K80m46K80Q5m21K73k07q2L12l37k68L84L34n43n5Q9J32j84L48K10n7P3
3444C39j81J51M65l53n62j2r7O31L36n57k6p9m83K42L87l11k57M39M11q13J56
3465a74M08n72L30J76k12j49o6J21JK46l93L16p6j26K34M7L9j63p9PL2r4K71m17
3489b93Q81o39K8L76n13J7L12j01J67l82L60k70J32L43m94M86J50k40k56m69M43
3510C8L39p00L48J88m94M15k27M6N69l74J37J23n94K62m51N01L0j12n30O20r1
$$ plain form
3353 129 120 62 152 61 91 -492 267 357 112 -51 35 102 133 -107 -330 -48 -46 246 143 -442 -397 -143 -50 -467 19
3378 19 339 273 -255 133 -336 -179 145 -594 471 -63 -688 102 -146 -236 438 -43 -210 90 -265 -62 -44
3399 -44 -374 -392 -207 228 -397 -74 -123 -213 -161 -92 340 -438 331 -147 193 194 -48 171 -441 -398 26 -129 139
3422 139 419 -27 253 338 -83 190 -17 -99 213 -124 -392 -8 326 -217 -272 -183 -51 -235 113 323 266 339
3444 339 158 309 774 421 -141 -153 -250 381 717 160 134 55 -428 -186 201 -110 -367 72 483 -330 -174
3465 -174 234 -338 -8 168 -44 -193 -259 -138 -137 109 -284 32 -44 -170 64 111 150 -13 -92 -85 -53 -147 124 -293
3489 -293 588 -51 -23 353 -160 -143 169 68 235 -147 213 -57 75 418 -76 410 560 320 64 -405 38
3510 38 377 -323 25 213 -281 134 -93 -47 522 148 285 408 -186 76 -375 126 156 44 -486 134 43
3531D3l33O88l52l7l92nQ01l64k71n85K32L41J78J80l31Q0L66p07K09K50l05K97
3553a7k07L55l1k97K40j33K8k48j16P24k86L05j22o62k44P76j0j70P1J87K29j58
3575B14o69N10m4K59j06N47m80M8K33o78R9j6K70m91K08j95M86L82k51q4P1q65
3597e52L01Q2J13j70K22M5j96K22o23K54L06K1K8K80m00K78l42Q7K34l35K3P1
3619e1j09Q6M26mo25m13J120k55l90m0N15j171R8P48K67KM59q97N00o60k21M81
3641a34l7L30q1M54q53L34K19m20J18N37l00M0l14N3J47l43K79L97k30Q7k75L18
3663C26o06L32j05L45K50k93l63J59m7K92j21K9k60L16k24L04L9k50KJ9l60r5
3685c11M97j87Q4m36K12j50N40o09L23K19O0m70L48l22p9N29j98j82oJ90J46l21
$$ plain form
3531 43 -290 398 46 9 -383 -388 413 49 -222 -807 -575 -234 -56 124 -207 -127 239 -468 -259 -9 -314 -17
3553 -17 -224 131 100 -197 43 -90 -62 -310 -426 298 12 317 195 -467 -711 65 55 -115 -44 143 372 214
3575 214 -455 55 11 270 164 711 231 279 512 -166 -67 -83 187 -304 -96 -291 195 577 326 242 313 -552
3597 -552 -251 -169 -56 -226 -4 41 -155 67 -556 -302 4 25 53 333 -67 211 -131 -44 190 -145 -122 -51
3619 -51 -160 -74 352 348 -277 -690 430 175 -215 -255 260 -911 -813 -65 202 204 663 -234 266 -394 -615 -134
3641 -134 -171 159 78 532 -321 13 232 -188 -70 467 167 207 -107 -54 93 -250 29 426 196 283 8 326
3663 326 -280 52 -53 292 542 249 -114 45 -2 290 169 198 -62 254 30 334 373 123 125 144 -216 -311
3685 -311 186 -1 83 -353 -141 -291 249 -360 -37 182 242 -228 120 -202 -281 248 50 -132 -138 52 198 -123
3707a23L25l3q05O02k27j37l7O83Ro1K50o10o6O89n56N73n57l75M65L72m14J36
3729A03J93m92O34l92J44k20J90j5J16K80m31J57l54nJ29J26j067P61J43m63O05
3750A42m92R48r69L11l04J043p49K67J72r03P64J04N5p42k9L30N23j306Q21n8
3770g2L97l89N94p44j47l84P94l22L56n51Q94q6n13l88O71k02q46O64n99Q90P0
3791H7N69p23n55N95J100k67K35j223k64L55j25L22K6o54M38K2J5l33O40n80M22
3812A02K77p51K15K96q24J054p97N03k97O09k19m40k56K48K98j34m45L64p28J382
3832D57j395J281n32L84L96n61M2l27m9k32N00J19P39j46j008Q98m55k19Kk08
3852c14M39J98r46R49K31n17l51P16k27p62l39J324p7j006Q92l5q82Q87M82n84
$$ plain form
3707 -123 202 169 -636 -34 -261 -398 -435 248 257 196 446 -164 -230 459 -97 476 -81 -456 9 381 -33 103
3729 103 296 -196 438 46 190 -30 160 145 261 541 110 267 -87 -92 37 163 -904 -143 0 -463 142
3750 142 -350 598 -371 -60 -364 679 -70 197 369 -534 230 334 389 -353 -382 -52 471 -835 -14 -72
3770 -72 325 -64 530 -214 -361 -745 49 -273 83 -468 426 340 -173 -561 110 -92 -938 -274 -873 17 87
3791 87 656 -67 -622 -27 1073 806 1041 -182 -446 -91 -216 106 132 -522 -84 -62 -47 -380 260 -320 102
3812 102 379 -372 -157 139 -685 369 -428 75 -222 387 168 -272 -528 -280 18 -116 -561 -197 -925 457
3832 457 -938 343 -189 195 591 30 72 -255 -304 -536 -36 83 822 676 -332 566 111 -108 -106 -314
3852 -314 125 323 -623 326 557 40 -311 405 178 -584 -923 401 324 -682 210 175 -707 180 662 78
3872G8J80p25J054q13R06q76NM98n62P82j78K48k8m25l53M68k19j33J78m55P17
3893C47o51O29m23mON50n54J21j64l12Q01m63j98Q37K5o81J5L57l50L10j14P42
3915H26o44Q2o40J53k21j77K41N07m67P79m23R6M5R0n66K32L88j99L54l38j35
3936a7m36j55N41L37o72K58j86L94o87Q48M91q32O1n19O42k76L1Q7K12p67Q42
3957A97K27O66j278J65N9M25L88m86j42J59M91p82K70K28k8m44L55o27O35P7m73
3978H2L72l54L84k70j65l8L41l89k46k56N29J51K54M5k87l78K62p0N74o19o48
3999g26O37Q30j134j30J057j002j97Q97m3M2J4q17N32K06n25Q35o33M01j38k17
4019a11J16O61n34o0Q44r43J68k34K52j26n74J94J478k40j409P69q93Q56O3j334
$$ plain form
3872 78 258 -467 587 -226 680 -196 -191 307 -255 527 349 597 569 144 -209 259 40 -93 85 -370 347
3893 347 -304 325 -98 -102 -96 454 -100 21 -143 -455 346 -117 -315 522 547 -134 -119 238 -112 198 84 826
3915 826 182 264 -376 -223 -444 -621 -380 127 -340 439 16 112 157 247 -319 -87 301 102 456 118 -17
3936 -17 -453 -608 -67 270 -402 -144 -330 64 -623 225 716 -116 -55 -574 68 -208 -177 -90 122 -645 197
3957 197 424 1090 -188 -23 36 461 849 363 221 380 871 89 359 587 559 115 470 -157 478 555 82
3978 82 454 100 484 214 49 11 352 -37 -283 -539 -10 141 395 440 153 -225 37 -33 541 -78 -726
3999 -726 -89 741 -393 -523 534 -468 -665 232 189 231 245 -572 -40 166 -359 476 -157 244 106 -111
4019 -111 5 666 132 72 916 -27 141 -93 159 33 -541 -347 1131 891 -518 251 -642 214 277 -1057
4039a057O92N16n79O38K25m88J2N25j96j78m9K73K73k89p63P29N33j260R5l65
4059g13J029o92L93k10Q39m66p34N92J52J93p35pN69k41o00O50J64l16N88q14
4079c59o49J261m11R4k54j7P1q5N22m7m2l85J3J69M78m50j82M78l45M90n95k54
4101d99N33J40l12l9O53j042J70k22O58k36m52Q23j09L44LjK71r84M99O55o46
4122B07l1K56m96J02M8L24o84L24N39p04Q7M20p6m9j52j32Q97p44r37Q73n09L57
4144h0N34n67N07J1m7n26k26j32K75L79m9k15R56j346J430j244K16J38L3k26l56
4165e35N20q9k50R30n87k83Q35r22M19j48Q6m01O35l3M05o40q81R15k33M18l73
4186b12K48M6j76K93K55Kj4m06n73Q80j56k94K56L62l10k26N84j160K65J59K26
$$ plain form
4039 -1057 -365 151 -428 210 435 -53 -41 484 288 110 61 334 607 318 -445 284 817 -443 -348 -713
4059 -713 316 -376 17 -193 646 180 -554 38 190 383 -352 -359 210 -31 -631 19 183 -133 455 -359
4079 -359 -1008 253 -158 -64 -318 -335 -264 -349 173 126 84 -301 -288 -119 359 -91 -273 205 -140 350 -245 -499
4101 -499 34 174 -138 -177 476 -566 -396 -618 40 -196 -648 175 66 410 413 412 683 -301 198 853 207
4122 207 176 432 -64 38 86 410 -274 50 589 -115 -28 392 316 267 115 -17 880 136 -801 72 -437 -80
4144 -80 454 -113 394 405 358 -168 -394 -526 -251 128 79 -136 820 -526 904 -340 -124 14 47 -179 -535
4165 -535 -15 -104 -354 576 -11 -294 541 -381 38 -110 -24 -425 210 177 582 -58 -939 -24 -257 161 -212
4186 -212 36 82 -94 199 454 456 442 36 -537 343 187 -107 149 511 201 -25 559 -601 -336 -177 49
4207D9j62k15M21l58J30J32J16j84j07p8M99m06N3j80O95m58n5p6J26J14l45N58
4229B69m04K7K71l88L84j41J44l05K18k34j59O01m3l55Q6Nk3R5l16J41M13l99
4251a13Q5M25j85l61K4Q8QL3j19o1J51n8L46J81j95k83k24o4L26K89m21l7m3O03
4275C95k64Q1k53L32m98M16j07k90k32N90m21N26m7l45M73n75L0P2K98o4R4j87
4297B4M3K72j10j08n13M44m32K20J54l5L94l58O2l44K21k3l34P10P8l15R7l29
4319a82np3RL99J48j53l41O47r15M07r5KO05k60J6l29J0J70l83J47J02q6j46K37
4343f9L59o65J98O14n83J54j85k53K22M22o7qj72p7j55O98k76M9m50K9L16O1k2
4366A40m73J10L01j37m40O65l16k07N19j8n8p41Q69k04J10n3K48n55l0L11k25
$$ plain form
4207 49 -113 -328 93 -265 -135 -3 113 -71 -178 -256 243 -163 -110 -290 405 -53 -108 -184 -58 56 -289 269
4229 269 -135 -108 163 -225 159 18 162 -143 75 -159 -318 283 240 -115 -29 -24 -47 48 -268 -127 286 -113
4251 -113 -28 397 212 -149 -125 -37 -29 4 -115 -176 -25 -83 263 444 249 -34 -258 -322 4 293 -128 -165 -208 395
4275 395 131 212 -41 291 -207 209 102 -188 -420 170 -251 275 228 -117 356 -219 -189 -117 181 117 211 24
4297 24 67 339 229 121 -392 52 -380 -160 -6 -41 353 -5 57 -287 -66 -89 -423 287 365 50 147 -182
4319 -182 -187 -260 -251 148 296 143 -198 449 -466 -59 -154 -152 453 193 209 -120 -110 60 -323 -176 -74 -160 -306 -69
4343 -69 290 -375 -177 437 -146 8 -177 -430 -208 214 147 139 -33 -110 -265 433 157 206 -244 -215 101 162 140
4366 140 -333 -223 78 -59 -499 166 -150 -357 162 144 86 -655 214 10 120 67 315 -240 -270 41 -184
4387a84n5J42j78P8j41n3K08l64L33n1M06j45m33R8M0J53k42M65j93K31Q6l72
4409a71l5J84K60n54M36K84o93L29M19q03M93m3j77k49P08q82M04L18nk98J16
4430D1J25J08k61J56o07L98j12J32J05k02m30P70n63K73J78k3N88j049L22r82
4450a033N86J053n61k67j1M52J87m82l77L26mm21N52Q3o20P52p59M6l61j70J503
4471D74p41k73N11n45M57P39q58J84j39k50k4Q77K39n15k87M21l60R2r1N6N05
4492D72n05J46l37M90p2r6L79p16K50j20M98M84q61K4p8m30Q73m73j64j79j5R1
4514c39K12j08K00J53P2j97j18L54q3m05L38j55J01m4M49l51M61m22Jk45J91M6
4536A11n26Q05p0o00K18J55k21k15J87l4L56k94P4M31j46q08J52N11p9R2O8n4
$$ plain form
4387 -184 -239 -97 -275 -197 -338 -391 -183 -547 -214 -265 141 -4 -437 -339 -299 -146 -388 77 -116 115 201 -171
4409 -171 -206 -22 238 -316 120 404 -289 40 459 -344 149 106 -71 -320 388 -494 -90 228 223 -75 41
4430 41 166 274 13 169 -438 -40 -152 -20 85 -117 -547 223 -340 -67 111 88 676 -373 -51 -1033
4450 -1033 -447 606 45 -222 -233 219 406 -76 -453 -127 -131 -552 0 83 -537 215 -544 -498 -859 -1029 474
4471 474 -267 -540 -29 -574 -117 622 -236 -52 -191 -441 -465 412 651 136 -151 270 -90 2 -89 -33 472
4492 472 -33 113 -224 266 194 98 477 -239 11 -109 389 873 12 36 -42 -472 401 -72 -236 -415 -430 -339
4514 -339 -127 -235 -35 118 190 -7 -125 229 146 -259 79 -76 25 -19 430 79 540 118 119 -126 65 111
4536 111 -415 390 320 -280 -62 93 -128 -343 -156 -190 166 -128 -54 377 231 -577 -425 86 7 99 167 113
4558A13p5j26l15N35l63L60j32J53o9k43L84l10N04k25m47J70K61n55M0P14j58
4579B16k64P14l41k61R2M0l27P76p34L95n18L52K52m38K17p3j22M37j22J22J45
4600E58j238N56N32l48j01Lj17P4K9J56K40o24K53j66K31R9j81l0l19K86O5m25
4622d67K90K2j54k49L1J52L95O3k39K85k28j25J02m5o2K60j52J68l91L35J92m92
4644c09K62j19L59j13L82o91N82K72o70O3j46r3K20K86j93O8m86l72P37K53l11
4665a9L13o13K84K8L45l01r4M06m52K47o46Q70J36n52j98L92R7n58L59j36M6j8
4687f4k51O50n12M89%m65j69j62N50kl2q5m49L90r3k39L64k82j65N94J69l70M23
4710B89l84p8J65k08j64J92k70O55l19K07n03M49J33K8l75J81Q4j81M65p7j0K49
$$ plain form
4558 113 38 -88 -403 132 -231 129 -3 150 81 -162 222 -88 416 191 -256 -86 175 -380 -340 374 216
4579 216 -48 666 325 64 156 196 -131 645 -89 306 -212 140 392 -46 171 98 -24 413 291 413 558
4600 558 -680 -124 408 60 -41 -38 -155 -81 -52 104 344 -280 -27 -193 38 137 -44 -74 -393 -107 -42 -467
4622 -467 -177 -155 -309 -558 -527 -375 20 83 -156 129 -99 -224 -122 -167 -229 31 -121 47 -344 -9 183 -309
4644 -309 -47 -166 193 80 462 -229 353 625 -45 18 -128 -221 -1 285 92 160 -326 -698 39 292 -19
4665 -19 294 -319 -35 -7 338 37 -57 349 -103 144 -502 368 504 -48 -246 146 243 -315 44 -92 -46 -64
4687 -64 -315 335 -177 312 312 -153 -322 -484 66 64 32 -53 -502 -112 -205 -444 -80 -362 -527 67 236 -134 289
4710 289 -95 -173 -8 -216 -380 -188 -458 197 -122 85 -418 31 164 192 -183 -2 82 -99 366 289 279 528
4732E28M75l89p77M60m00j97P42j034J086k76K5Q0m93l28l9K44N21j36qO2N7K0
4754B23m27K43M52p88q7L23k5N1j07K89l16J98N6o33K61J57m03M10J28j58K12
4775E9K59k58p7m79K76j35M04r8K93j46k72r8P37r25M91k12k2MR2K72m47M80k51
4798e3K10O3k36O4k43O01l54N8J51j95n2M3N37j09m32K69kn65L75j49k83L91N81
4821F70q68J3J16k78R01r1l50l35J05k13K68L12m59n61P22k09q3J27J75J96N23
4842F81k34j194Q12L53n10O9k26J60J17l57q0P0Q0J63m7N38k33k33K70m39K73
4863C3k19M67o05Q17o13N86j062P84j65n74L68o8R29n99k07M59j180J312k36N2
4883B79P2k50L77r71O27L6Q50q95L89j130J41P76N07p53j64J65k41M70n16O36
$$ plain form
4732 528 1003 614 -163 297 -103 -300 442 -592 494 218 243 323 -170 -498 -537 -293 228 92 84 146 203 223
4754 223 -204 39 491 -297 -384 -61 -86 -35 -142 147 -169 29 85 -548 -287 -130 -533 -123 5 -153 59
4775 59 318 60 -17 -496 -220 -355 49 -49 244 98 -174 -272 465 -460 31 -181 -203 -199 -107 165 -282 198 -53
4798 -53 157 220 -16 48 -195 406 52 110 261 66 14 57 594 485 53 322 320 -245 130 -19 -302 89 670
4821 670 -198 -185 -69 -347 554 463 113 -222 -117 -330 -62 250 -209 -770 -48 -257 -340 -213 -38 158 681
4842 681 447 -747 65 418 -92 -23 -249 -89 28 -329 -409 -339 -259 -96 -143 395 162 -71 199 -240 33
4863 33 -186 281 -324 493 -120 466 -596 188 23 -551 -183 -251 678 79 -128 331 -849 463 227 279
4883 279 351 101 478 -493 134 170 1020 125 514 -616 -475 301 808 55 -109 56 -185 285 -231 405
4903D05n97P10m41r5k37N92l85l59M42l58n3N84j6m16O8P1J66q9J00m76R1K49
4925d4L9k13K61k11N13N0k37k29k61K3q8N39l68J88J90J50m32K01j00L57k23K88
4947C93k35j75K5J08k61k24Q64m05PK21n84K06R36p91J7q50N11j11N88l29m65
4968e54O62R10j236J91R34j573M87J14J10l82m08J057o65P08j06J42J8q61M10
4987d2Q15p76N69r40R0Q9L38j65l14K0o8J213j093O72j215Q47l1N8j4QNL00j257
5010h91N68J67j10J6J20J018j019M8RK05J36q01N63J86k4m63K17P26k63l40J07
5031A75m82M08p36J005K08o86Q26r58M68n62L52K28p53M04k70n8Q05p33O4N34
5051B39K80l71k44L55j61o74J6J080j088O22m49l3N54M15m55n28K48K35k05p8
$$ plain form
4903 405 -192 518 77 -18 -255 337 -48 -407 35 -323 -376 208 192 -224 -156 -85 81 -8 92 -384 -293 -44
4925 -44 -5 -218 43 -168 345 395 158 -71 -332 -309 -397 142 -226 -38 152 302 -130 71 -29 328 105 393
4947 393 158 -17 8 116 -145 -369 495 90 97 318 -266 -60 876 85 102 -748 -237 -348 240 -89 -554
4968 -554 108 1018 -218 -27 907 -666 -179 -65 45 -337 -745 312 -353 355 249 391 409 -452 -42
4987 -42 773 -3 566 -374 -284 -195 143 -22 -336 -316 -384 829 -264 408 -807 40 9 67 53 61 66 366 -891
5010 -891 -323 -156 -266 -250 -130 888 -131 -83 -74 131 267 -534 29 215 191 -272 -55 671 408 68 175
5031 175 -307 101 -635 370 578 -108 718 -240 228 -334 18 246 -507 -103 -373 -431 374 -359 -295 239
5051 239 519 148 -96 259 98 -576 -560 520 -568 54 -395 -428 126 541 86 -442 -194 41 -164 -242
5071b42M06j72P1N57p05k97M07l27j08n6k36Q89k88l34K67L0l3L54l00m58P06
5092A31j92K00Q7l17K01j50M16q5o60l0o23J579k00j055M62J79J13J81l11J12
5112C8J040j588l1L51M52j14n91J39L26m57K07O95j71q5j65Q9j03m46P26o54K58
5133h4K51j29M96q98J29J55j1K62k60N1N30n70K9K1J42O1k45j47K74l82r0J1K25
5156a79r7K30l2l16Q58o94K98K38k95K20n19M28m98M72O4J90q43L99L62j01l19
5177a34J44j91J7M25l6K00l1q08O34l54K51J63j85L06o23M06l44R5K25K18j7l65
5199dqL30M6n23K72J80J08k2n22K20K68m87M18j56J30m83N35l82K69O0l19j99
5221b69K89k42j18J08K97n8K20l49K86j97k95J0N75n81L82l1J00k32j35J65K18
$$ plain form
5071 -242 164 -8 63 620 -85 -382 25 -302 -410 -466 -702 187 -101 -435 -168 -138 -171 183 -117 -575 131
5092 131 -61 139 226 -91 110 -40 376 291 -369 -399 -1022 557 357 -698 -236 -57 56 237 -74 38
5112 38 1078 -510 -541 -190 262 148 -443 -304 22 -435 -228 467 296 211 46 135 32 -414 312 -342 -84
5133 -84 167 38 534 -364 -235 -80 -91 171 -89 -38 492 -78 -49 -28 114 175 -70 -217 57 -325 -415 -404 -179
5156 -179 -276 -46 -78 -394 464 -230 68 306 11 231 -288 140 -358 114 178 368 -475 -76 286 185 -134
5177 -134 10 -181 -164 261 225 425 394 -414 220 -134 117 280 95 401 -222 184 -160 -65 160 378 361 -4
5199 -4 -12 318 364 -159 113 293 401 379 -143 77 345 -142 276 120 250 -233 302 -80 189 249 -70 -269
5221 -269 20 -222 -340 -232 65 7 227 -122 164 -33 -328 -318 257 -324 58 27 127 -105 -240 -75 143
5242A43k47K89j65K3j51J49j00m98N47K62k29k18l1M17m09J21K86k41J89m50J76
5263a37M14k6k65j51JL19k87J28J35j49Q9m23M12J69k11J5j93q2J37J6K56j2o6
5286H9j21j88M17J17n92r8M97R0j1J67n1j87K53p08M63j17L41l62m66L75N8J67
5308A33K31j101P59M45k75J53p23N84j9m07R8l71R99R2k24N8l56K4j27K91j28
5329A36j30Pk79K16r5m70Q00k07j49K98k64J34J58j08J22J34n17P05j00m48J61
5350A04k61j11L25qJ12p9N3j88N57l25l5J97m19J91j09MK85O7n20QJ7M6J11nj68
5375a51O63m90q42R02k68K5j04J56L98p23K29L37L33r91R77k88r28Q01P18p86
5395c2K49m49k77N38j35J40k78j03r7M50o52O02q9n6N65k57r5j36m18N72j12J74
$$ plain form
5242 143 -104 185 20 43 -108 41 -59 -557 -10 252 23 -195 -226 191 -218 -97 189 -52 137 -313 -137
5263 -137 277 251 -14 -165 -164 155 -132 -4 131 -18 71 -352 60 229 18 33 -160 -242 -105 -89 167 155 89
5286 89 -32 -220 197 314 -278 -376 121 211 200 367 316 129 382 -326 137 20 361 -1 -467 -92 -34 133
5308 133 364 -737 22 467 192 345 -378 206 187 -220 -122 -493 506 598 374 432 76 100 -27 264 136
5329 136 6 13 -266 -50 -145 -615 185 -22 -171 127 -137 -3 155 47 169 303 -214 491 391 -57 104
5350 104 -157 -268 57 49 161 82 135 -53 504 179 144 341 -78 113 4 8 293 360 -160 -152 -135 -89 22 17 -151
5375 -151 512 22 -820 82 -186 -161 -265 -109 289 -434 -205 132 465 -526 451 163 -765 36 754 -32
5395 -32 217 -232 -509 29 -106 34 -244 -347 -444 6 -646 -44 -133 -189 376 119 24 -112 -530 42 -70 104
5417A04L64j087J073o88J97O18r40L06k34j70Q41J31p17Q26l69m86K54j26k47
5436c50N84mK74j85L9L64q37p5L53Qp7j94j37M70j37j33oL88l21r5Q8L81k90N0
5460A58q6j76K61M3n9j20O7J58j34j97l71K51l2j97J42J24j41M90%j79q5k1l43
5483d47O23j44K15p80P47l62r3Q25p75J24j67O11k91K5M29m54J45k16L95J96m78
5504A28L35k00o12O45o94K22K71J35k35p3K44k27J25m67k66M89N04Qo28O32j88
5525A48l06M53J25o1l41j57M08n1o62K12j52J45j40J52M20k46J18l67L44m65N20
5546I7l71p1K64J19K7n2PLm15N2N00n54K61m36M22J15r5lL40J88l13j20N5K52
5570B72n16P0L1K87m23J25L81m60j81P47J78k92l6l02J17j35KJ63k85J5Q2mL36
$$ plain form
5417 104 468 -619 454 -234 -37 581 -359 -53 -287 -457 384 515 -202 624 255 -231 23 -103 -350
5436 -350 234 230 504 319 358 722 -115 -190 163 171 94 -100 -237 233 96 -37 -43 345 24 -71 17 398 108 158
5460 158 72 -104 157 200 141 21 88 246 112 -85 -456 -205 -237 -434 -292 -168 -309 181 181 2 -83 -104 -447
5483 -447 176 32 247 -533 214 -148 -241 584 -191 -67 -234 377 86 111 540 86 231 15 410 606 128
5504 128 463 263 -349 296 -398 -176 95 230 -5 -78 166 -61 64 -403 -669 -180 324 332 -296 336 148
5525 148 -158 295 420 359 18 -139 269 218 -444 -232 -384 -239 -379 -227 193 -53 65 -302 42 -423 97
5546 97 -274 -345 -81 38 65 13 20 23 -392 -340 160 -394 -133 -569 -147 -32 -127 -130 210 398 85 -35 20 272
5570 272 -244 -174 -143 144 -279 -154 227 -233 -414 333 511 219 183 -119 -2 -137 -135 28 -257 -242 -160 -164 172
5593A72l50m6M54o00L62O99p11j79K33M3N0j86K0J08L61o60L04j14K40l00j33
$$ plain form
5593 172 -178 -224 230 -370 -8 691 -20 -199 34 77 127 -59 -39 69 430 -230 74 -40 200 -100 -233
$$ [...]
8191G0
##END NTUPLES=NMR FID
##END=
