##TITLE=1H_SL59(may2022)-pure
 CDCl3
 8 sc, 
 31.05.2022
##JCAMPDX= 6.0         $$ Bruker NMR JCAMP-DX V2.0
##DATA TYPE= NMR FID
##DATA CLASS= NTUPLES
##ORIGIN= UXNMR, Bruker Analytische Messtechnik GmbH
##OWNER= root
$$ XWIN-NMR		Version 3.5
$$ Wed Jun  1 14:14:40 2022 Russian Standard Time (UT+4h)  she@DPX200
##.OBSERVE FREQUENCY= 200.13135
##.OBSERVE NUCLEUS= ^1H
##.DELAY= (6, 6)
##.ACQUISITION MODE= SIMULTANEOUS
##.ACQUISITION SCHEME= undefined
##.AVERAGES= 8
##.DIGITISER RES= 18
##SPECTROMETER/DATA SYSTEM= spect
##.PULSE SEQUENCE= zg30
##.SOLVENT NAME= CDCl3
##.SHIFT REFERENCE= (INTERNAL, CDCl3, 0, 15.7039)
##AUDIT TRAIL= $$ (NUMBER, WHEN, WHO, WHERE, WHAT)
$$ ##TITLE= Audit trail, XWIN-NMR		Version 3.5
$$ ##JCAMPDX= 5.01
$$ ##ORIGIN= Bruker BioSpin GmbH
$$ ##OWNER= she
$$ F:/spectra/data/she/nmr/H-F/1/audita.txt
$$ ##AUDIT TRAIL=  $$ (NUMBER, WHEN, WHO, WHERE, WHAT)
(   1,<2022-06-01 14:13:34.76 +0400>,<she>,<DPX200>,
      <created by zg, POWCHK disabled, PULCHK disabled
       configuration hash MD5:
       00 E9 B6 7A A2 85 ED C7 34 08 36 98 17 FE 4E 26
       data hash MD5: 16K
       FE 23 DA C1 D0 40 4F 96 8E 75 41 C3 27 BC FB 53>)
$$ ##END=
$$ 
$$ hash MD5
$$ 50 3B 12 E5 5D 2B 6F C9 7B B0 88 FF B5 57 29 F7
##$RELAX= 
##$RELAX= 
##$RELAX= 
##$RELAX= 
##$RELAX= 
##$RELAX= 
$$ Bruker specific parameters
$$ --------------------------
##$DU= <F:/spectra>
##$EXPNO= 1
##$NAME= <H-F>
##$PROCNO= 1
##$TYPE= <nmr>
##$USER= <she>
##$AMP= (0..31)
100 100 100 100 100 100 100 100 100 100 100 100 100 100 100 100 100 100 
100 100 100 100 100 100 100 100 100 100 100 100 100 100 
##$AQSEQ= 0
##$AQ_mod= 1
##$AUNM= <au_zg>
##$AUTOPOS= <>
##$BF1= 200.13
##$BF2= 200.13
##$BF3= 200.13
##$BF4= 200.13
##$BF5= 200.13
##$BF6= 200.13
##$BF7= 200.13
##$BF8= 200.13
##$BYTORDA= 1
##$CFDGTYP= 0
##$CFRGTYP= 5
##$CHEMSTR= <none>
##$CNST= (0..31)
1 1 145 1 1 1 1 1 1 1 1 1 1 1 1 1 1 1 1 1 1 1 1 1 1 1 1 1 1 1 1 1 
##$CPDPRG= <>
##$CPDPRG1= <>
##$CPDPRG2= <>
##$CPDPRG3= <>
##$CPDPRG4= <mlev>
##$CPDPRG5= <mlev>
##$CPDPRG6= <mlev>
##$CPDPRG7= <mlev>
##$CPDPRG8= <mlev>
##$CPDPRGB= <>
##$CPDPRGT= <>
##$D= (0..31)
0 1.2 0 0 0 0 0 0 0 0.06 0 0.03 0 0 0 0 0.0002 0 0 0 0 0 0 0 0 0 0 0 0 
0 0 0 
##$DATE= 1654078414
##$DBL= (0..7)
120 120 120 120 120 120 120 120 
##$DBP= (0..7)
150 150 150 150 150 150 150 150 
##$DBP07= 0
##$DBPNAM0= <>
##$DBPNAM1= <>
##$DBPNAM2= <>
##$DBPNAM3= <>
##$DBPNAM4= <>
##$DBPNAM5= <>
##$DBPNAM6= <>
##$DBPNAM7= <>
##$DBPOAL= (0..7)
0.5 0.5 0.5 0.5 0.5 0.5 0.5 0.5 
##$DBPOFFS= (0..7)
0 0 0 0 0 0 0 0 
##$DE= 6
##$DECBNUC= <off>
##$DECIM= 32
##$DECNUC= <off>
##$DECSTAT= 4
##$DIGMOD= 1
##$DIGTYP= 9
##$DL= (0..7)
0 120 120 120 120 120 120 120 
##$DP= (0..7)
150 150 150 150 150 150 150 150 
##$DP07= 0
##$DPNAME0= <>
##$DPNAME1= <>
##$DPNAME2= <>
##$DPNAME3= <>
##$DPNAME4= <>
##$DPNAME5= <>
##$DPNAME6= <>
##$DPNAME7= <>
##$DPOAL= (0..7)
0.5 0.5 0.5 0.5 0.5 0.5 0.5 0.5 
##$DPOFFS= (0..7)
0 0 0 0 0 0 0 0 
##$DQDMODE= 0
##$DR= 18
##$DS= 0
$$ [...]
##$SUBNAM2= <"">
##$SUBNAM3= <"">
##$SUBNAM4= <"">
##$SUBNAM5= <"">
##$SUBNAM6= <"">
##$SUBNAM7= <"">
##$SUBNAM8= <"">
##$SUBNAM9= <"">
##$SW= 18.05172834244
##$SWIBOX= (0..15)
0 0 2 0 0 0 0 0 0 0 0 0 0 0 0 0 
##$SW_h= 3612.71676300578
##$TD= 16384
##$TD0= 1
##$TE= 0
##$TE2= 300
##$TE3= 300
##$TEG= 300
##$TL= (0..7)
0 120 120 120 120 120 120 120 
##$TP= (0..7)
150 150 150 150 150 150 150 150 
##$TP07= 0
##$TPNAME0= <>
##$TPNAME1= <>
##$TPNAME2= <>
##$TPNAME3= <>
##$TPNAME4= <>
##$TPNAME5= <>
##$TPNAME6= <>
##$TPNAME7= <>
##$TPOAL= (0..7)
0.5 0.5 0.5 0.5 0.5 0.5 0.5 0.5 
##$TPOFFS= (0..7)
0 0 0 0 0 0 0 0 
##$TUNHIN= 0
##$TUNHOUT= 0
##$TUNXOUT= 0
##$USERA1= <user>
##$USERA2= <user>
##$USERA3= <user>
##$USERA4= <user>
##$USERA5= <user>
##$V9= 5
##$VALIST= <valist>
##$VCLIST= <CCCCCCCCCCCCCCC>
##$VD= 0
##$VDLIST= <DDDDDDDDDDDDDDD>
##$VPLIST= <PPPPPPPPPPPPPPP>
##$VTLIST= <TTTTTTTTTTTTTTT>
##$WBST= 1024
##$WBSW= 4
##$XGAIN= (0..3)
0 0 0 0 
##$XL= 0
##$YL= 0
##$YMAX_a= 429365
##$YMIN_a= -437937
##$ZGOPTNS= <>
##$ZL1= 120
##$ZL2= 120
##$ZL3= 120
##$ZL4= 120
##$ABSF1= 10
##$ABSF2= 0
##$ABSG= 5
##$ABSL= 3
##$ALPHA= 0
##$AQORDER= 0
##$ASSFAC= 0
##$ASSFACI= 0
##$ASSFACX= 0
##$ASSWID= 0
##$AUNMP= <proc_1d>
##$AZFE= 0.1
##$AZFW= 0.1
##$BCFW= 1
##$BC_mod= 2
##$BYTORDP= 1
##$COROFFS= 0
##$CY= 11.3945322036743
##$DATMOD= 1
##$DC= 2
##$DFILT= <>
##$DTYPP= 0
##$F1P= 2.36226072786647
##$F2P= -0.459571619588291
##$FCOR= 0.5
##$FTSIZE= 0
##$FT_mod= 4
##$GAMMA= 1
##$GB= 0.15
##$INTBC= 1
##$INTSCL= 1
##$ISEN= 128
##$LB= 0.24
##$LEV0= 0
##$LPBIN= 0
##$MAXI= 10000
##$MC2= 0
##$MEAN= 0
##$ME_mod= 0
##$MI= 1.114404
##$NCOEF= 0
##$NC_proc= 0
##$NLEV= 6
##$NOISF1= 3.799351
##$NOISF2= 2.8
##$NSP= 1
##$NTH_PI= 0
##$NZP= 0
##$OFFSET= 15.70392
##$PC= 1
##$PHC0= -18040.31
##$PHC1= 15.40074
##$PH_mod= 1
##$PKNL= yes
##$PPARMOD= 0
##$PSCAL= 0
##$PSIGN= 0
##$REVERSE= no
##$SF= 200.130013532006
##$SI= 16384
##$SIGF1= 3
##$SIGF2= 2
##$SINO= 400
##$SIOLD= 16384
##$SREGLST= <1H.CDCl3>
##$SSB= 0
##$STSI= 0
##$STSR= 0
##$SW_p= 3612.71676300578
##$SYMM= 0
##$S_DEV= 0
##$TDeff= 0
##$TDoff= 0
##$TI= <>
##$TILT= no
##$TM1= 0
##$TM2= 0
##$TOPLEV= 0
##$USERP1= <user>
##$USERP2= <user>
##$USERP3= <user>
##$USERP4= <user>
##$USERP5= <user>
##$WDW= 1
##$XDIM= 8192
##$YMAX_p= 0
##$YMIN_p= 0
$$ End of Bruker specific parameters
$$ ---------------------------------
##NTUPLES= NMR FID
##VAR_NAME=  TIME,          FID/REAL,        FID/IMAG
##SYMBOL=    X,             R,               I
##VAR_TYPE=  INDEPENDENT,   DEPENDENT,       DEPENDENT
##VAR_FORM=  AFFN,          ASDF,            ASDF
##VAR_DIM=   8192,          8192,            8192
##UNITS=     SECONDS,       ARBITRARY UNITS, ARBITRARY UNITS
##FACTOR=    0.0002768,     1,               1
##FIRST=     0,             0,               0
##LAST=      2.2672688,     0,               0
##MIN=       0,             -437937,         0
##MAX=       2.2672688,     429365,          0
$$ Real data points
##PAGE= N=1
##DATA TABLE= (X++(R..R)), XYDATA
$$ [...]
1926B086l985J048M117l521l040M205J678n410P05L886k503k141K774n9j707J172
$$ 2086 -1899 -851 3266 -255 -3295 910 2588 -2822 -2117 1769 -734 -2875 -101 -160 -1867 -695
1942f95R04j267J579Q37k086J034J911j712j462K549O84l244L9K637j108l261
$$ -695 209 -1058 521 1358 -728 306 2217 505 -957 1592 2276 -968 -929 1708 600 -2661
1958b661J713K312k472j506K972P85l112P20K604j778j121K180K18j559J837j18
$$ -2661 -948 1364 -1108 -2614 358 1143 -1969 -1249 1355 -423 -1544 636 854 -705 1132 1014
1974A014j941J769P98k805Q85L332k523k431L858R25n027R74L756k502k567K799
$$ 1014 -927 842 1640 -1165 -280 3052 529 -1902 1956 2881 -2146 -1172 2584 82 -2485 314
1990C14J344k595n16K193p4j477R5J506n97J02M17o41P4J016j119j358K236K99
$$ 314 1658 -937 -1453 740 666 -811 -716 790 193 295 712 71 145 1161 42 -1316 920 1219
2008A219k871N41L691k460k896L633J594m414O15M169k068k738K797J073k778
$$ 1219 -1652 -1111 2580 120 -2776 857 2451 -1963 -1348 2821 753 -1985 812 1885 -893
2023h93K24J694j839j21J203r00m68J429o33j588J485J182k027K10K430p83k432
$$ -893 -669 1025 -814 -935 268 -632 -1100 329 -304 -1892 -407 775 -1252 -1042 1388 605 -1827
2040a827J520K493k378j927L044J161l201J25L089j345k252K000Q87k478M29Q82
$$ -1827 -307 2186 -192 -2119 925 2086 -1115 -990 2099 754 -1498 502 1389 -1089 -660 222
2056B22r38Q3O07j258k50K086j479j297K429J592l454O21L244j025k764K248J763
$$ 222 -716 -633 -26 -1284 -1534 552 -927 -2224 205 1797 -1657 -1036 2208 1183 -1581 667 2430
2073B430k500q38K475k59j737L32R34j051m97N44M18p04L04K14j206J311N79j771
$$ 2430 -70 -908 1567 1308 -429 -97 837 -214 -711 -167 251 -453 -149 65 -1141 170 749 -1022
2091a022J95K533j403j874K577J281l461N24L222j614k622K154J732k863k25K145
$$ -1022 -827 1706 303 -1571 1006 2287 -1174 -650 2572 958 -1664 490 2222 -641 -866 1279
2107A279p16j526J068L92j167Q39J66r39O99Q53j264n06K241m60k127Q02K093
$$ 1279 563 -963 105 497 -670 169 335 -604 95 948 -316 -822 1419 959 -1168 -366 1727
2124A727j693j780K470J011l279K57K794j269k167J808J204k188K18J733r75o03
$$ 1727 34 -1746 724 1735 -1544 -1287 1507 238 -1929 -121 1083 -1105 -887 846 -129 -732
2140g32J261p72m93J532J2j890J443J336k478m79K547o57k696J797J401k151j130
$$ -732 529 -243 -736 796 808 -1082 361 1697 -781 -1260 1287 630 -2066 -269 1132 -1019 -2149
2157b149K446M45k593M10K222q37j512J559O49r45j2R69l48O5L83o88o94J771
$$ -2149 297 742 -1851 -1441 781 -56 -1568 -9 640 -305 -317 652 304 369 752 64 -630 1141
2175A141o02j907J457J474k689l44K559m01k854K083J538k026q09K002q6j403
$$ 1141 539 -1368 89 1563 -1126 -1470 1089 688 -2166 -83 1455 -571 -1380 622 536 -867
2191h67O88R53n33l15P38l26j79O97o61p59J584j6j567N23J570j164j751J841
$$ -867 -179 774 241 -74 664 338 159 856 195 -564 1020 1004 -563 -40 1530 366 -1385 456
2209D56J016k755l2K590n81k077J663J258j790m09J800l38j354R83J27p13K47
$$ 456 1472 -1283 -1315 1275 694 -1383 280 1538 -252 -661 1139 801 -553 430 557 -156 91
2226I1K59j005M85J097j690k68J710j68k044J061K050j770j187K072P59k695O85
$$ 91 350 -655 -170 927 -763 -1031 679 511 -1533 -472 1578 -192 -1379 693 1452 -1243 -558
2243e58K109j172j578J515O37j424J96N50l11n88P55m06m99R50n34j080J256N63
$$ -558 1551 379 -1199 316 953 -471 -275 275 -36 -624 131 -275 -774 176 -358 -1438 -182 381
2261C81j428n51K399k00k176J408J912k086p61K053N06k249M21J528r06j131J008
$$ 381 -1047 -1598 801 601 -1575 -167 1745 -341 -1102 951 1457 -792 -371 1157 251 -880 128
2278A28L33r96P6L36l52J31K97j037L43J189o18j213J832R76k348L5K407q59j645
$$ 128 461 -535 -459 -123 -475 -344 -47 -1084 -741 448 -170 -1383 449 1425 -923 -888 1519 660 -985
2297i85J331J379j863m88J606J32j591K97J158j063j91L51J07j68K26l19n99J045
$$ -985 346 1725 -138 -626 980 1112 -479 -182 976 -87 -278 73 180 12 238 -81 -680 365
2315C65K02j583Q47J438r44j426J930O21k237O5K111n20k189J598J079j694k80
$$ 365 567 -1016 -169 1269 325 -1101 829 1450 -787 -722 1389 869 -1320 278 1357 -337 -617
2332f17J298l22p49K49M01j28J18K88q70L10L91o99k85J257r4j441L01J864j453
$$ -617 681 359 -390 -141 260 132 250 538 -332 -22 369 -330 -615 642 548 -893 -592 1272 -181
2351a81j302J615O90j869j25K189q10j451J290P96j328p1J049k60o42Q62n65l85
$$ -181 -1483 132 822 -1047 -1172 1017 207 -1244 46 842 -486 -557 492 232 -410 452 -113 -498
2369d98J110l51j143J021O45j426l41J916o76j665Q76J353j392j081J780L75j156
$$ -498 612 261 -882 139 784 -642 -983 933 257 -1408 -532 821 -571 -1652 128 503 -653
2386f53j8J336k30p84O65M31m83k90L24j64nL02p97q4R55n05j132J228R05j767
$$ -653 -671 665 435 -349 316 747 264 -26 298 134 129 431 -366 -450 505 0 -1132 96 1001 -766
2406g66k61K257p55j391Q89J389j732m32J600j39r62L67N31l86l1K41l05p2K75
$$ -766 -1027 1230 475 -916 -27 1362 -370 -802 798 659 -303 64 595 209 178 419 114 42 317
2425C17k49k26M52n4q10j0J201j044m10J123N97j414L0J579k67j557J263J007
$$ 317 68 -158 294 240 -570 -580 621 -423 -833 290 887 -527 -497 1082 815 -742 521 1528
2443A528j480m2O91l30p12M15Q3m80M73R8j211P95N70j179k7J510n60j004P99
$$ 1528 48 6 697 367 -345 70 153 -327 146 244 -967 -172 398 -781 -808 702 142 -862 -63
2462f3J237j197p82J352O2r89M1J056k05j126O27Q15p80l10O68l61l38J78k32
$$ -63 1174 -23 -805 547 609 -380 -339 717 512 -614 13 828 48 -262 406 45 -293 -115 -347
2481c47l09L49l16o51O13Q68j134j30J931n07j488J424J069j488m50J317n5r19
$$ -347 -656 -307 -623 -1274 -661 207 -927 -1057 874 367 -1121 303 1372 -116 -566 751 696 -223
2499b23J06P81n15m30K26K24j49l09n2n4N22o4n54K78O05n58q81J063Q02j394
$$ -223 -117 664 149 -281 -55 169 20 -289 -341 -395 127 63 -491 -213 392 -166 -1047 16 818 -576
2519e76j00J197K4j527O96J465j378n51J623M5j278N82M32l42l36L80m87J72M32
$$ -576 -676 521 545 -982 -286 1179 -199 -750 873 918 -360 222 654 312 -24 356 -131 41 473
2538D73o12j76R53l85j064Q80P93j056m45J153K48j368K67P78j95j003N75R37
$$ 473 -139 -315 638 253 -811 69 862 -194 -639 514 762 -606 -339 439 244 -759 -184 753
2556G53q89m53R66J25p83L05K10L2J20k7l98O1M28q64l40J036j59j143M75J401
$$ 753 -136 -589 377 502 -281 24 234 266 386 359 -39 22 450 -414 -754 282 123 -1020 -545 856
2576H56j372o10J379K44j257L80Q81o75m30O57L85o14J30J00l8j07P3J87j37N2
$$ 856 -516 -1126 253 497 -760 -380 501 -174 -604 53 438 -176 -46 54 16 -91 -18 169 32 84
2596H4j46l72N53L79r16n06J238J69j544N68J139j026p71J388J68j048M5J399
$$ 84 -62 -434 119 498 -418 -924 314 483 -1061 -493 646 -380 -1151 237 405 -643 -598 801
2614H01n52m79N91Kl25K45k18k14L96k19l48K49O23p73l43O24M11q22m3J184l45
$$ 801 249 -230 361 363 38 283 65 -149 247 28 -320 -71 552 -221 -564 60 471 -351 -394 790 445
2635D45r19L82O69l42r34R44J22m60l53Q60m49m3K03Q9q3M91l44n14P02j86p71
$$ 445 -474 -92 577 235 -699 245 367 -93 -446 414 -35 -78 125 214 131 622 278 -236 466 280 -491
2656d91L79R36q18p55J190K96j350M52R04j44r29K16Q52q26k88M50j27k01J87
$$ -491 -112 824 6 -749 441 737 -613 -161 743 599 -330 -114 738 -88 -376 74 -53 -254 -67
2675f7k08R2ll0m7K51J91l74j92O62Pn96J97J174r22p71Q79M01j035l57J119n00
$$ -67 -275 -183 -186 -216 -263 -12 179 -195 -387 275 282 -314 -117 1057 135 -636 243 644 -391 -748 371 -129
2697a29m54M09N16p54K54Q1j13j20K96k31J78J70k21n58N07M48q43K38P38J31
$$ -129 -583 -174 342 -412 -158 -77 -190 -310 -14 -245 -67 103 -118 -676 -169 279 -564 -326 412 543
2717E43r78O90O76q38l99N65O44j334O6O20m57l33M68J15l89K18l7p7M43K49p09
$$ 543 -435 255 931 93 -306 259 903 -431 -365 255 -202 -535 -67 48 -341 -123 -160 -237 206 455 -254
2738b54J96N77n11o04P47L12o32j86Q74l16p03O60N25p84k82O93Rk95j85O18l82
$$ -254 -58 519 8 -596 151 463 -169 -355 519 203 -500 160 685 -99 -381 312 321 26 -159 459 77
2759G7j25M7J22j59j2j52j68N84L3n41K20Q89o21n96O68N15j178j07Q58j66j103
$$ 77 -48 -1 121 -38 -50 -202 -370 214 247 -294 -74 815 194 -402 266 781 -397 -504 354 188 -915
2780i15M90N74k71k73O05K18m46L82J9k32M14k60m25J43K87m09j44L05K65q10
$$ -915 -425 149 -122 -395 210 428 -18 364 383 151 565 305 -120 23 310 -99 -243 62 327 -483
2800d83J01P13l78o69J029K86j139K96O26j77m49L97K9m63K0L55m0j58J57L2J13
$$ -483 -382 331 -47 -716 313 599 -540 -244 382 205 -244 153 182 -281 -261 94 54 -104 53 85 198
2821A98L27j3o63L72Q5n59k31P67%j072M67P25o86l06Q19J14m35k31M94k35n5
$$ 198 525 512 -151 221 306 -253 -484 283 283 -789 -322 403 -283 -589 230 344 -91 -322 172 -63 -118
2842a18J64J21k78p1K48l86L57J69n84J50O77k83p07O80L88o01m4M70p5p56K82
$$ -118 46 167 -111 -182 66 -320 37 206 -378 -228 449 166 -541 139 527 -74 -118 352 277 -479 -197
2863a97Q54o48k69J71J07j31J42J98m84K84Q2j17J40J41l1k59L04q8l57j29P54
$$ -197 657 9 -260 -89 18 -113 29 227 -257 27 109 -8 132 273 242 -17 287 199 -158 -287 467
2884D67m46n41P22J04m28j34O60J47o56J49O35n80l24P9k0k72K01J02Q6r8n8k18
$$ 467 21 -520 202 306 -122 -256 404 551 -105 44 679 99 -225 -146 -166 -438 -237 -135 -49 -147 -205 -423
2906d23M90O5k30j00P63l08l67L32L08m57n69N49J39o40J63P84l06n77L26R1k18
$$ -423 67 132 -98 -198 565 257 -110 222 530 73 -496 53 192 -448 -285 499 193 -384 -58 33 -185
2927a85PJ49k1j71J10M8j66J70j64j57L97K74m90k1O89j77l95n2P51l97m90M10
$$ -185 -178 -29 -50 -221 -111 -63 -229 -59 -223 -380 17 291 -199 -220 469 292 -103 -155 596 199 -291 119
2949A19K62o78P5J60j73j59K8L47K64R1l48N1K7J97n13J23L11k20m50L67J79n07
$$ 119 381 -297 -222 -62 -235 -394 -366 -19 245 336 -12 39 66 263 -250 -127 184 -36 -486 -119 60 -447
2971d47n9P19q4o37Q71K2k61k41M72J27o17J13K3j14J79k21p4K06J3Q2m27M91
$$ -447 -506 213 129 -508 363 385 124 -117 355 482 -135 -22 1 -113 66 -155 -229 -23 -10 72 -355 136
2993A36J47l71K22J36k64n77O23L14p53k29O76j08l10K72J08R9k90L92p6j56J99
$$ 136 283 -88 134 270 6 -571 52 366 -387 -616 60 -48 -358 -86 22 121 -169 223 147 -9 190
3014A90k82L13R0k63k27K35J1l76L4L41J32m54J16L60j54l66L97L13o95R5K94
$$ 190 -92 221 311 48 -179 56 67 -309 -275 66 198 -256 -140 220 66 -300 97 410 -285 -190 104
3035A04lm95L88K64l52j44K94J33m4M0j55j35L85j82k62O17k78m76R2M36j26o06
$$ 104 101 -394 -6 258 -94 -238 56 189 145 185 30 -105 280 98 -164 453 175 -301 -209 227 101 -505
3057e05L21M59k77j89K18L06m27o6M14j8l87J55J76k89K3j41K40J06k5j58L50
$$ -505 -184 275 -2 -191 27 333 -94 -160 254 236 -151 4 180 -109 -86 -227 13 119 94 -64 286
3078B86j22J65m34L81L36m01m55M07P9n78K03K24l37k31J74L57m3j61K10R1k70
$$ 286 164 329 -105 276 612 211 -244 163 242 -336 -133 91 -246 -477 -303 54 11 -150 60 151 -119
3099a19J27k16J91k0P5k97M25O2p40N56K87j22k51j95L27n6j54M50k36o5k10J84
$$ -119 8 -208 -17 -37 38 -259 166 228 -512 44 331 209 -42 -237 90 34 -120 330 94 29 -181 3
3121CMm06K83j6k82M83l83J9L33m4o8n8K25r8n0N05k12n22J75L38k12k75K13J25
$$ 3 7 -399 -116 -132 -414 69 -314 -295 38 -6 -74 -132 93 -5 -55 450 238 -284 -109 229 17 -258 -45 80
3145H0n6j18M84k49k26J64R7j85K90k84J13O3l32K52j54RP3k95M45j10L5m03P98
$$ 80 24 -94 390 141 -85 79 176 -9 281 -3 110 173 -159 93 -61 -52 21 -274 171 61 96 -307 491
3168D91Q4p50O3M19l80k25J98N7l0k34L77j32j2j37M54j93j8j36M84n18L58j86
$$ 491 575 -175 -112 307 -73 -298 -100 -43 -73 -307 70 -62 -74 -211 243 50 32 -104 380 -138 220 34
3190C4o9R2j36m09M59K36j39j95j2K25l07N6M35p5j78K43k07j09J78l1O0j8l03
$$ 34 -35 57 -79 -488 -29 207 68 -127 -139 86 -221 -165 270 195 17 260 53 -56 122 91 151 133 -170
3213a70Q0j9K14M4m44O41j54l38K12J18l20j68M06M3l10k05M59l6k81P5N09j16
$$ -170 -90 -109 105 149 -295 346 192 -146 66 184 -136 -304 102 145 -165 -370 89 53 -228 -153 356 240
3235B40l43L93J9j78p5l0q6K38k20l57M33q7j9q6LL10m20L03K7j90j06L26O0m48
$$ 240 -103 290 309 131 56 26 -60 178 -42 -399 34 -53 -72 -158 -155 155 -265 38 65 -125 -231 95 155 -293
3259b93J57J17J14l03L07r4j4o7J96J31J34r5o52M21r0K46j19k50K95j76j78J84
$$ -293 -136 -19 95 -208 99 5 -9 -76 120 251 385 290 -362 59 -31 215 96 -154 141 -35 -213 -29
3281b9K95p19L36J14q4j37L14N1k25p8L28J4j50j99Pj95L48k9j70M21K6l36k7
$$ -29 266 -453 -117 -3 -87 -224 90 141 -84 -162 166 180 30 -169 -162 -357 -9 -38 -208 213 239 -97 -124
3304a24K07L6j02K51k3l14K07m5J61l23LK52j75k95J93M10k34J25k75J16J44j83
$$ -124 83 119 17 268 245 -69 138 93 254 -69 -66 186 11 -284 -91 319 85 210 -65 51 195 12
3326A2L9j29J95k48j91L98o2k18k7L91k00j88J55N03l23k79L72n2l20J19J60m51
$$ 12 51 -78 117 -131 -322 76 14 -204 -231 160 -40 -228 -73 430 107 -172 200 148 -172 -53 107 -344
3348c44J41J37n0N1K5N1R4p1K46j54k97L91k80K63k07K76m49l2L68k86m5J17K69
$$ -344 -203 -66 -116 -65 -40 11 105 34 280 126 -171 220 -60 203 -4 272 -177 -209 159 -127 -172 -55 214
3371B14r3p5K37J15m18Q0r2K18m9j02K52j28j32k81L35n1J27m69K71L60m4k11
$$ 214 121 46 283 398 -20 60 -32 186 137 35 287 159 27 -254 81 30 157 -312 -41 319 275 64
3393F4l8J60j46L6q3p6m1R4J18j83J04m9J01R1k60r3L35L5n2o7L4N8j48r4J57
$$ 64 26 186 40 76 -7 -83 -124 -30 88 -95 9 -40 61 152 -108 -201 134 169 117 50 84 142 -6 -100 57
3418E7k6m6o4P9j38p8L43Lj03m1J43J14m77J61k6J83j86n0Q9r0K47l05L34o8n1
$$ 57 31 -15 -79 0 -138 -216 127 130 27 -14 129 243 -234 -73 -99 84 -102 -152 -63 -153 94 -211 123 55 4
3443DJ22n2M5k40J08J74k97j90K20K64l18J36k12K88j38r5L05P3K1j09K9j26J48
$$ 4 126 74 119 -121 -13 161 -136 -326 -106 158 -160 -24 -236 52 -86 -181 124 197 218 109 138 12 160
3466A60k29r4J37M4k64K42p8k57P6L04J86n1l82J95P5k47K05J03J92n44J47K39
$$ 160 -69 -163 -26 18 -246 -4 -82 -339 -263 41 227 176 -206 -11 64 -183 22 125 317 -227 -80 159
3488A59k55J76j58R8Q3j57j46N81m50q1K98J49j03k62K71j73j22m0J38O5j82o4
$$ 159 -96 80 -78 20 103 -54 -200 381 -69 -150 148 297 194 -68 203 30 -92 -132 6 71 -111 -175
3510a75N12l20k0J59l8K4j40J66O7l30q3L16k46k11L45k96L52j72J63k61L99o6
$$ -175 337 17 -3 156 118 142 2 168 235 -95 -178 138 -108 -319 26 -270 82 -90 73 -188 211 145
3532A45q5j61L53l15M6p3M37l48l3K7j05j8L9N2K94n69K60L15m0l15j31n6K99
$$ 145 60 -101 252 -63 -17 -90 347 -1 -34 -7 -112 -130 -91 -39 255 -314 -54 261 221 -94 -225 -281 18
3555A8J76m54L04l0k13n3L32L8j87j55J39J25j12j00L78l59O3K61j39r6j02Q9
$$ 18 194 -260 44 14 -199 -252 80 118 -69 -224 -85 40 -72 -172 206 -153 -90 171 32 -64 -166 -77
3577g7l4K14L1l3N6j78n5J69J69j75j10k64L39J31l74J76K20m4PJ17l08r5K32
$$ -77 -111 103 134 101 157 -21 -76 93 262 87 -23 -287 52 183 -191 -15 205 161 168 285 -23 -118 114
3600A14l7k51k8J05K12k69K01j89K31q2j64n4K85J44j96p8K96j28j39o1K07k01
$$ 114 77 -174 -202 -97 115 -154 47 -142 89 7 -157 -211 74 218 22 -56 240 112 -27 -88 119 -82
3622h2OK5J53k89L7L76P8l38J49j25L6m0L10L1l67k3J96o2p9p1J23k82L81m50
$$ -82 -76 -51 102 -187 -150 226 304 -34 115 -10 26 -14 296 327 -40 -63 133 71 -8 -79 44 -238 143 -307
3646c07K91K19k06j35L73j02k19j18Q6J52k5j58J57J26l31r4K78K51j51k08J72
$$ -307 -16 203 -3 -138 235 133 -86 -204 -118 34 9 -149 8 134 -197 -291 -13 238 87 -121 51
3667E1j04K3R0j32K32l86J27J81j19k92M13m5J21n0k95K88n5L1jj50J10R8m2K7
$$ 51 -53 -30 60 -72 160 -226 -99 82 -37 -329 84 39 160 110 -185 103 48 79 78 -72 38 136 94 121
3691A21j21p8p0J47o7n2k6P0Q4j41J64K20l24N8J09M45m18j34K06j06j18K98m8
$$ 121 0 -78 -148 -1 -68 -120 -146 -76 8 -133 31 251 -73 -15 94 539 121 -13 193 87 -31 267 219
3714B19j54j16J5L22k41J43J19j47K44m82j8K57k17n5NkJ24j13J40j27p2J39M5
$$ 219 65 -51 -36 286 45 188 307 160 404 -78 -96 161 -56 -111 -106 -108 16 -97 43 -84 -156 -17 28
3737B8J20k4p7nj12O2O5k13K08k17K6J41r4J65r6J65k00K3J29j56K32j23L9J14
$$ 28 148 124 47 42 -70 -8 57 -156 52 -165 -139 2 -92 73 -23 142 -58 -35 94 -62 170 47 86 200
3761B00k67J13L2k35J32k62M01j06o5Q5oL79l76J85l30J48K89m10m0K10p8j5K37
$$ 200 -67 46 78 -157 -25 -287 114 8 -57 28 22 401 25 210 -120 28 317 -93 -133 77 -1 -16 221
3784B21k64j36O7K06J08j62J8K28k09k3j76L48k97l02L02J1j3J12j94J76J92L4
$$ 221 -43 -179 -112 94 202 40 58 286 77 54 -122 226 -71 -373 -71 -60 -73 39 -155 21 213 247
3806B47m53L14J31l64l0J01m4j4k2J25k8j60J13J46m0l00K33R8k4j81K39p7N2
$$ 247 -206 108 239 -125 -155 -54 -98 -112 -134 -9 -37 -197 -84 62 22 -278 -45 53 29 -152 87 10 62
3829F2O4p3k47J43j11l9L83k52n7L53r2J36k63K57k06n0j28L68m90n6L31k01J48
$$ 62 126 53 -194 -51 -162 -201 182 -70 -127 226 134 270 7 264 58 8 -120 248 -242 -298 33 -168 -20
3852b0k01M33k23p8n5L5L54k34j37J76M1j56R1R4k41q1Q0n0Q1M7q9K17K62l60
$$ -20 -221 212 -11 -89 -144 -109 245 11 -126 50 91 -65 26 120 -121 -202 -122 -172 -91 -44 -133 84 346 -14
3876a4r0L64k34l9J38J04k90O6J3l5l3j36L63j04j12p5R5K62j57j7k48L03k28
$$ -14 -104 260 26 -13 125 229 -61 5 18 -17 -50 -186 177 73 -39 -114 -19 243 86 69 -179 124 -104
3899a04R1N7k30K01l81L06J45j14L91j56J51k78K8QQ0j95K16Kl34l5q4N05m26
$$ -104 -13 44 -186 15 -366 -60 85 -29 362 206 357 79 107 115 195 0 216 218 -116 -151 -235 270 -156
3922a56K97L0n6j37j14K15J15j64j58L33j46N0l13L75k04J80o2K80k99j45J25
$$ -156 141 171 115 -22 -136 79 194 30 -128 205 59 109 -204 171 -33 147 85 365 66 -79 46
3943D6j17K7K58j91Q4Q3j1l36P3O9j17J06K07l37J73L8o8o6k32L60J82J3l22K51
$$ 46 -71 -44 214 23 107 190 179 -157 -84 -15 -132 -26 181 -156 17 55 -13 -79 -311 49 231 244 -78 173
3967A73K4l67K47r4q0R1J24n5k32L59k18J04jK04l59j59K23J06j96Q9J57j93j18
$$ 173 197 -170 77 -17 -97 -6 118 63 -169 190 -28 76 75 279 -80 -239 -16 90 -106 -17 140 -53 -171
3990a71K68k96J31M9r6JJ27J17O1k42P9Kq1J38j16OJ8J86k81q7M50l23k6L73l39
$$ -171 97 -199 -68 -19 -115 -114 13 130 191 -51 28 30 -51 87 -29 -23 -5 181 -100 -187 263 -60 -86 287 -52
4015e2o3J24L15l42N6j86K28j16kp9K15l1k84J19M02k32j45q1R6j4j20J00m2J4
$$ -52 -115 9 324 -18 38 -148 80 -36 -38 -117 98 67 -217 -98 304 72 -73 -154 -58 -72 -192 -92 -134 -120
4039a20J3J93L31k37k65K82K02k44k42J5M4Q8J32n0R4k22k13K43q3o3j11K68J24
$$ -120 -107 86 417 180 -85 197 399 155 -87 -72 -28 60 192 142 236 14 -199 44 -39 -102 -213 55 179
4062A79k70K02j91J07k8k8M22k40m2n9J75k08j93L0L45k84J78j78J72j32jJ00
$$ 179 -91 111 -80 27 -1 -29 393 153 111 52 227 19 -174 -144 201 -83 95 -83 89 -43 -44 56
4084E6j42K1P7l55L87j31j22L9K56j25N3k42K58m0k54L91J02k8m12K12q2J38r0
$$ 56 -86 -65 12 -343 44 -87 -209 -170 86 -39 14 -228 30 -10 -264 127 229 201 -211 1 -81 57 -33
4107c3J53l5k59J78J22o9m3k85R7J3J65n3L4J02m12K98J18k79K79j56K44k17J50
$$ -33 120 85 -174 4 126 57 14 -271 -174 -161 4 -49 -15 87 -325 -27 91 -188 91 -65 179 -38 112
4130A12J67m48J64q3J65J96k31j17J74m6j06P0j24K59m4j74q0J49Qk12J74P4j00
$$ 112 279 -169 -5 -88 77 273 42 -75 99 53 -53 17 -107 152 108 -66 -146 3 11 -201 -27 47 -53
4153e3j11L49nk28j9J36p7j53P9J77n4J45j9j40l04L03J72j3J37j80k79J12P6
$$ -53 -164 185 180 -48 -67 69 -8 -161 -82 95 41 186 167 27 -277 26 198 185 322 142 -137 -25 51
4176E1k24K60j32J4j25K09J12j44l52K08L35k56L2L32k78l35L52J25k96M1J7J32
$$ 51 -173 87 -45 -31 -156 53 165 21 -331 -123 212 -44 -12 320 42 -293 59 184 -112 -71 -54 78
4198G8k56O34l33m0q7k30R6J34jO8k7K3m5j82K14r3Q1k63Q6M9j51k2L64k3j59
$$ 78 -178 456 123 83 -4 -234 -138 -4 -5 63 36 59 14 -168 46 -47 34 -229 -143 -94 -245 -267 97 74 -85
4223h5R7KJ04l74M6M47Rk64O7p3Q8rk26P5J40j03Q3M05k79k35P5j30K0Nj5L16
$$ -85 12 14 118 -256 -210 237 246 -18 49 -24 64 55 -171 -96 44 -59 24 429 150 -85 -10 -140 -120 -115 -130 186
4249A86k36o3J90Pj5k98K47R9j48L4N6R0kl32K63j95j96J13L67k03k3M6j12L17
$$ 186 -50 -113 77 84 69 -229 18 117 -31 3 59 149 147 -185 78 -117 -313 -200 167 -36 -59 -13 -125 192
4273A92k63O0L17m26o2M19j63k3j3o9J12L6k20j35K47K41l47R3O8J49p1n8L59
$$ 192 -71 -11 306 -120 -182 237 74 51 38 -31 81 117 -103 -238 9 250 -97 -4 64 213 142 84 443
4296D43m83n6J05J07j48K58j06l12L3N7J56N5m3k8O4m5K8k17N6qn9K50j58J35
$$ 443 -40 -96 9 116 -32 226 120 -192 -159 -102 54 109 66 38 102 57 85 -132 -76 -84 -143 107 -51 84
4320H4l51L28L45l08r3k8J78l00kL34j9j15q9J31m2l95K57l0J2o4J64KJ14M1l96
$$ 84 -267 61 406 98 5 -23 155 -145 -147 187 168 53 -36 95 53 -342 -85 -115 -103 -167 -3 -1 113 154 -242
4345b42K31P2q3o9K62k74j1L3K51p1l42J88L71n04K4K03K17l96L10k04K12l53
$$ -242 -11 61 -22 -91 171 -103 -114 -81 170 99 -243 -55 316 -188 -164 39 256 -140 170 -34 178 -175
4367a75N8j1M11k55J26jj02k7R4k5j3k46J32K52o4k30J7K1J57j10J9K7j29J11
$$ -175 -117 -128 283 28 154 153 51 24 118 93 80 -166 -34 218 154 -76 -59 -38 119 9 28 55 -74 37
4391C7mm2j48J10O2j14K99j06oJ43j66J16q1J1l37K8O6R0k7J45n9K68m60K63k09
$$ 37 33 -9 -157 -47 15 -99 200 94 88 231 65 181 100 111 -226 -198 -132 -42 -69 76 17 285 -175 88 -121
4416a21J63j1j6o4R7j68K70o4J5p3q6j7Pj81RL90k69m0J12L57j33l91N5M28l86
$$ -121 42 31 15 -49 48 -120 150 86 101 28 -58 -75 -68 -249 -240 150 -119 -159 -47 310 177 -214 -159 269 -117
4441a17J53K12j10m55L69j35J71J09l64J55o3k1l8J27J78m38J99J94R3l08J77
$$ -117 36 248 138 -317 52 -83 88 197 -167 -12 -75 -96 -134 -7 171 -267 -68 126 219 -89 88
4462H8K57j92m09N35j99o5k02o0L26n5j40K45k3l10K99r6K31l13k3J71r9p6J79
$$ 88 345 153 -256 279 80 15 -187 -247 79 24 -116 129 106 -204 95 -1 230 -83 -106 65 -34 -110 69
4485F9J70l00J74l93K54J87q6Q6P7k22j74L85j39Pl26J93L1L4j3JK9m2m8J17k11
$$ 69 239 -61 113 -280 -26 161 75 161 238 16 -158 227 88 95 -231 -38 -7 27 14 15 44 2 -46 71 -140
4510a40K80o4j1N7k19O8J15J86l79M3L98k86m25K91K89j75j01j81L92k28KJ57
$$ -140 140 76 65 122 -97 -29 86 272 -107 -64 334 48 -377 -86 203 28 -73 -254 138 -90 -88 69
4532F9O3j75pq6PJ93j37q2p6J65j64J47q5J94j15N1J52k39R4k15K92k76k0L23
$$ 69 132 -43 -50 -136 -129 64 -73 -155 -231 -66 -230 -83 -168 26 -89 -38 114 -125 -31 -246 46 -230 -250 73
4556G3j41lP4J19j77j74k8K25K85l67j50M94Qk37j39j19O96q17J03M55l75J37
$$ 73 -68 -71 3 122 -55 -229 -257 -32 253 -114 -264 230 238 1 -138 -257 439 -378 -275 180 -195 -58
4578e8R4K05l34K32K8O8l86K49l6l5o6k4m5K08k91L1lN24m67J10l1j35L22j01
$$ -58 36 241 -93 139 167 235 -151 98 62 27 -39 -63 -108 100 -191 -160 -163 361 -106 4 -27 -162 160 59
4602E9p6M5J78l56J76j15j77p0K33K62k26K00l9jj28j99L33l2Q4k7R4n64K09J77
$$ 59 -17 28 206 -150 26 -89 -266 -336 -103 159 -67 133 94 93 -35 -234 99 67 151 124 218 -346 -137 40
4626D0k50L09l71K38L01k41j60R8L0j36K72o9J14l44J52Lk1K15j36o7p3k6K61
$$ 40 -210 99 -272 -34 267 26 -134 -36 -6 -142 130 61 175 -169 -17 -14 -35 180 44 -23 -96 -122 139
4649A39P3j71k54J70Q1J13j86j28J60l1m1QJ51J37o54L07K05j15J42p9N9j13J94
$$ 139 212 41 -213 -43 38 151 -35 -163 -3 -34 -75 -67 84 221 -433 -126 79 -36 106 27 86 -27 167
4672A67Kl23O3N6R5k4P6k68K52J18l13K35J73k61R1l1o9jj94J76P4k04K01L7j18
$$ 167 169 -154 -91 -35 60 36 112 -156 96 214 -99 136 309 48 139 108 39 38 -156 20 94 -110 91 128 10
4697A0j24L1J87n2L6j05k4J48k04k06M42J0j02k51K37k64J54k08L23k01J48p7
$$ 10 -114 -83 104 52 88 -17 -41 107 -97 -303 139 149 47 -204 33 -231 -77 -285 38 -163 -15 -92
4719i2M60l55M5k6J8J5j15N9J83o6k16Q4J31q3j06J66J75l89k00L71k89L0n2L05
$$ -92 368 13 58 32 50 65 -50 9 192 126 -90 -6 125 42 -64 102 277 -112 -312 59 -230 -200 -252 53
4743E3j93J98k55K75J77j76j91Q8j60N01k05j30p2j45K94n9J19j55k0q2L00j61
$$ 53 -140 58 -197 78 255 79 -112 -24 -184 317 112 -18 -90 -235 59 0 119 -36 -56 -138 162 1
4765AQq1J20j64L60j70M5N7j39Pj41m9K13R7k07P3j87J18K66l43K57n2k0o8J52
$$ 1 9 -72 48 -116 244 74 119 176 37 44 -97 -146 67 164 -43 30 -157 -39 227 -116 141 89 69 1 153
4790A53k20k50M25k70J17P6j30M0K35l91Q5K18k5o3P6K59j86j84N2K2k1J05J65
$$ 153 -67 -317 108 -162 -45 31 -99 -59 176 -215 -130 88 63 0 76 335 149 -35 17 39 18 123 288
4813B88j77K0K5j57J09J82j33k59J08K24m45J36K09k12j19K45j25kn5L17n8k78
$$ 288 111 131 156 -1 108 290 157 -102 6 230 -215 -79 130 -82 -201 44 -81 -83 -138 179 121 -157
4835a57K41L05o34O3J12o3J93j9J80k77o2J6J78q6k9N0J47r1k6l06O2J65k93N1
$$ -157 84 389 -245 -182 -70 -133 60 41 221 -56 -118 -102 76 -10 -39 11 158 67 41 -265 -203 -38 -331 -280
4859b80L20k9r7k45K45L58r8l77M07l15J29m7P5Q5j55j86K3M88l43j64N49j09
$$ -280 40 11 -86 -331 -86 272 174 -203 204 -111 18 -29 46 131 -24 -210 -187 301 -42 -206 343 234
4881B34k27K23Jj11j12J64j74K38l39L70j65j78Q9OLj46qK21k73J18J1K44l6%
$$ 234 7 230 231 120 8 172 -2 236 -103 267 102 -76 13 19 22 -124 -132 89 -184 -66 -55 189 153 153
4905A53j37j73K39j58O9K13k5m6l5j53oK2NJ16J21Jm76K26j64M23l70K01K75l91
$$ 153 16 -157 82 -76 -7 206 181 135 100 -53 -59 -37 -32 84 205 206 -270 -44 -208 215 -155 46 321 -70
4929g0j7M1m1j04J23L14m31p2K96J23l65L04O2m48K04rK70k8j08J24j90J43j74
$$ -70 -87 -46 -87 -191 -68 246 -185 -257 39 162 -203 101 163 -285 -81 -90 180 152 44 168 -22 121 -53
4952e3J33m7k4J05j60P0j12k61K35L4O7r2j66J00K53l24M6K83L5m88L30J68N4
$$ -53 80 33 9 114 -46 24 -88 -349 -114 -80 -13 -105 -271 -171 82 -242 -196 87 122 -366 -36 132 186
4975A86j69J00n2Q1j19K29r6l19K72J3o2j21J66qL0l54k7K05j07J34p9j3L78o64
$$ 186 17 117 65 146 27 256 160 -159 113 126 64 -57 109 101 131 -223 -250 -45 -152 -18 -97 -110 268 -396
4999c96K77P2M3L3p9P7N6l33K18K89k23J30j53J57j41J4J4Nj18J71j40J21j50
$$ -396 -119 -47 -4 29 -50 27 83 -250 -32 257 34 164 11 168 27 41 55 60 -58 113 -27 94 -56
5022e6NJ76k01k8k81O63k61m1N5j71K39j97K28J38k05Q1K11j71j97l18M31j85
$$ -56 -51 125 -76 -104 -385 278 17 -24 31 -140 99 -98 130 268 63 144 355 184 -13 -331 100 -85
5044h5J73j72J06J58j34k8j50R9j00K36j42O9k6J5J11l4l52K50K3J03l12J70P0
$$ -85 88 -84 22 180 46 18 -132 -33 -133 103 -39 30 4 19 130 96 -256 -6 17 120 -192 -22 48
5067D8o3l8J75M4K3k51J14o0P4Ok03L49L5k07k41J63NJ19j91L2L19l30J73n2k2
$$ 48 -15 -53 122 166 189 -62 52 -8 66 72 -131 218 253 46 -195 -32 -27 92 -99 -67 252 -78 95 43 21
5092B1N5o8N0j42KQ8J32k66J52R6j3j5L6k45J40O5j25L05Q8k39j29J40j48j11
$$ 21 76 8 58 -84 -82 6 138 -128 24 120 107 92 128 -117 23 88 -37 268 356 117 -12 128 -20 -131
5116a31J67L81k96k17J76n0M5J93l9j96l1r3K2J71m23J90K06m6r4jq8J85j97J09
$$ -131 36 417 121 -96 80 30 75 268 229 33 2 -91 -69 102 -321 -131 75 29 -65 -66 -154 31 -166 -57
5140e7nJ22r6P8o7J4p1K7M02o13L34N4L2k46l5j2J35j49J42J04K7m04K30Q8j4
$$ -57 -62 60 -36 42 -25 -11 -82 -55 347 -266 68 122 154 -92 -127 -139 -4 -153 -11 93 120 -284 -54 34 20
5165B0N1p9J81j91J33j89K23Oj84J7J72p3k92J60J4M4j59j82L03j61J42j32J68
$$ 20 71 -8 173 -18 115 -74 149 155 -29 -12 160 87 -205 -45 -31 13 -146 -328 -25 -186 -44 -176 -8
5188hm0n1O9L9q6PJ79r2rK5K26l58Q9J31r7J95m5J68l27J45k3j65J37o1k07L80
$$ -8 -48 -99 -30 9 -77 -70 109 17 8 33 259 -99 -10 121 24 219 174 342 15 160 137 -28 109 48 -159 221
5214B21j94j3j50L05k08PJ8j76K78j08j37L41j50k51K08J42k49J01j27K06k37
$$ 221 27 14 -136 169 -39 -32 -14 -190 88 -20 -157 184 34 -217 -9 133 -116 -15 -142 64 -173
5235a73K52p3J27R4l61L3j6M3L13k17r7J84k16K35j6L26p56R3L04j03l7P3J95
$$ -173 79 6 133 227 -134 -101 -117 -74 239 22 -75 109 -107 128 112 438 -318 -225 79 -24 -61 12 207
5258B07k15j34K83o2k19Q0J94o2m9j04q7K3j00J47nOK3K99l16J46O4o7m1K20k68
$$ 207 -8 -142 141 79 -140 -60 134 72 23 -81 -168 -145 -245 -98 -103 -97 -74 225 -91 55 119 52 11 231 -37
5283c7M4M1k58K78k98L16k91J92r8K27q3N7J78n4nr0O4j61Q3k11j19J83J22k90
$$ -37 7 48 -210 68 -230 86 -205 -13 -111 116 33 90 268 214 209 119 183 22 105 -106 -225 -42 80 -210
5307b10K47Q5l4O7q7J15j17J80j63j53Q2%K8J16j99q4K27l23K80O2j40K1MJ13
$$ -210 37 122 88 155 68 183 66 246 83 -70 12 12 40 156 -43 -127 100 -223 57 119 -21 0 4 117
5331A17j09K55j12j31J80l32J32k58L95n0k8J95k40j16J52P0j60J5j01L37q0R9
$$ 117 8 263 151 20 200 -132 0 -258 137 87 59 254 14 -102 50 120 -40 -25 -126 211 131 230
5353B30k71J39j41LQ1j67m3K34j19j7J01q9O3J00j61k73J26L02j81O3p3K4J17
$$ 230 -41 98 -43 -40 41 -126 -169 65 -54 -71 30 -59 4 104 -57 -330 -204 98 -83 -20 -93 -69 48
5376D8j05R4j31K42k76K20%p4k63M12r1q5L30k97j8j86K81l43L40J37o57M16k08
$$ 48 -57 37 -94 148 -128 92 92 18 -245 167 76 -9 321 24 6 -180 101 -242 98 235 -422 -6 -214
5399b14K57J2L0k4N4j04J6J96m22J84M0m7N0jQ8m8r7J37j54rn4j24L27j21p1n
$$ -214 43 55 85 61 115 11 27 223 -199 -15 25 -22 28 27 115 67 -30 107 -47 -56 -110 -234 93 -28 -99 -104
5425a04J41kq5M93l57l39N3K43K82l47j91M09l82R4K10k68J18j1j94K84P0l71
$$ -104 37 35 -50 443 86 -253 -200 43 325 -22 -213 196 -186 -92 118 -150 -32 -43 -237 47 117 -254
5447b54J57K05j98J37j18K16M7n17M06k14J08j17J5L14j86q2j27K69l48J89J16
$$ -254 -97 108 -90 47 -71 145 192 -325 81 -133 -25 -142 -127 187 1 -81 -208 61 -287 -98 18
5468A8O7J35l1l18jj84K57m1J21o1j09N1J6K8j55M42p5j48k01K73j2k35R4J12
$$ 18 85 220 189 -129 -130 -314 -57 -98 23 -38 -147 -96 -80 -52 -207 235 160 12 -189 84 72 -163 -69 43
5492D3K63k63j13l2L72k54q1J16p3l02L14O3m4K8k18L27j58j23M73l33N3L3l8
$$ 43 306 43 -70 -102 270 16 -65 51 -22 -324 -10 53 9 37 -181 146 -12 -135 338 5 58 91 53
5515E3J21l56K06J17j16Q0j88K21J86m07K39k48J71k59J73K04j92l7K56J18m98
$$ 53 174 -182 24 141 25 105 -83 138 324 -83 156 -92 79 -180 -7 197 5 -32 224 342 -156
5536a56J80j43K22l10k5M06q8j42j96J86J07l23Q5K19lL9j67L32j10n2J88j24
$$ -156 24 -119 103 -207 -232 174 86 -56 -252 -66 41 -282 -197 22 19 58 -109 223 113 61 249 125
5558A25j1M6k16J64l28J00M38l22J46J69j59l29O9K00l04K28k22J41L2j66R1J4
$$ 125 114 160 -56 108 -220 -120 318 -4 142 311 152 -177 -108 92 -212 16 -206 -65 -33 -199 -108 -94
5580i4K88l03j6J86j09m0J40m2K00o02L55m5R0J6r6M1j18L3K08k40pM64q2j33
$$ -94 194 -109 -125 61 -48 -88 52 10 210 -392 -37 -82 8 24 -72 -31 -149 -116 92 -148 -155 309 227 94
5604I4k08J89l59J64np3J94p1O0m9N4R0j4k02J27oN0j50R4K8P0q3q0j59L92j89
$$ 94 -114 75 -284 -120 -125 -198 -4 -75 -15 -64 -10 80 66 -136 -9 -15 35 -115 -21 7 77 -6 -86 -245 147 -42
5630d2j6J58k53Q4j78J86J76n2m1q8K01j25j88J24O7n9L7J44j28p4K02k1j94K0
$$ -42 -58 100 -153 -69 -247 -61 115 63 22 -66 135 10 -178 -54 13 -46 -9 135 7 -67 135 114 -80 -60
5654f0J24j59K04N7k82L97l10J01j43L83j56k85R8P9j72P1J07J52j40j89K04n7
$$ -60 64 -95 109 166 -116 281 -29 72 -71 312 156 -129 -31 48 -124 -53 54 206 66 -123 81 24
5676B4K70l36M1mj73K23J87k21k20J42J06R0j40q0p8K18k29L46m91K46J4j1j10
$$ 24 294 -42 -1 -5 -178 45 232 11 -209 -67 39 129 -11 -91 -169 49 -180 166 -325 -79 -65 -76 -186
5699a86l5J65n0p0j27K18N7J40l07L83j39j86P1q1J99K64l12l9J93j8l13L09j08
$$ -186 -221 -56 -106 -176 -303 -85 -28 112 -195 188 49 -137 -66 -147 52 316 4 -35 158 140 -173 136 28
5722B8j85J85q2J69l32K38R8q6k67L38l1n3PP0M9l9p9l41M55j26n9J76j56J62
$$ 28 -157 28 -54 115 -217 21 119 33 -234 104 73 20 27 97 146 107 28 -313 142 16 -43 133 -23 139
5746A39j90j54L81j3r1k92M1J95j9M1N3L6j65L11j53r9j68L32m3k85J41R2L7j09
$$ 139 -51 -205 176 163 72 -220 -179 16 -3 38 91 127 -38 273 120 21 -147 185 142 -143 -2 90 127 18
5770A8j01J46j53L86l10n5K11N7k38l0J33m5j43L4J99j61L3M7j26MK01l5rr0p5
$$ 18 -83 63 -90 296 -14 -69 142 199 -39 -69 64 19 -124 -90 109 -52 -19 28 -98 -94 107 72 63 -27 -102
5795a02L0K01%l78K94m6O9j42J3j79J29J8K59l16Q4O8r5J26j15Q5O5k54K66J0
$$ -102 -72 129 129 -249 45 -1 68 -74 -61 -240 -111 -93 166 -150 -66 2 -93 33 -82 3 68 -186 80 90
5819I0P7m42J87r3l1M6P3J54j65L11j47Jp2Q6k13L8J45k51K23q1L8J41j52O0l1
$$ 90 167 -275 -88 -181 -212 -166 -93 61 -104 207 60 61 -11 75 -138 -100 45 -206 17 -64 -26 115 -37 23 -8
5844hk49J59L40r6k7M4j31O6J34l43J44j4m4J44L9j50jJ54k69m8J63O8p5r7K77
$$ -8 -257 -98 242 146 119 163 32 98 232 -111 33 19 -25 119 158 8 7 161 -108 -156 7 75 0 -97 180
5869A80k7k09o5nM76k34p9j45N5J34j94K43%k0j87o0k8K80j66K2j28K16k56L45
$$ 180 153 -56 -121 -126 350 116 37 -108 -53 81 -113 130 130 110 -77 -137 -165 115 -51 -29 -157 59 -197 148
5893A48l28L03j2q0Nk24J48J30k57L22m72M12q6m8j06J28K6l55M53l82J8M69k54
$$ 148 -180 123 111 31 36 -188 -40 90 -167 155 -317 95 9 -39 -145 -17 9 -346 107 -275 -257 212 -42
5916d2J37j59Q2j38r2L49j68k6j4Q0J73l26O8K4j93J69J84l39J55J45L7k79N5
$$ -42 95 -64 18 -120 -212 137 -31 -57 -71 9 182 -144 -76 -52 -245 -76 108 -231 -76 69 106 -173 -118
5939a18o9J04J58m18M39j26Q3j53M24l60o5K67k93r8J64K56k2l18L24j59j4L1
$$ -118 -187 -83 75 -343 96 -30 53 -100 324 -36 -101 166 -127 -225 -61 195 173 -145 179 20 6 37
5961C7J57k53J37LP3j27Q8j21J19j21O3K9k18K22q5K42k93q5J67K31k77J48M0
$$ 37 194 -59 78 81 154 27 115 -6 113 -8 55 84 -134 88 3 245 -48 -133 34 265 -12 136 176
5984A76j30N1J54n6q4j71M9M8J93l6l66J44j20K61l15K00Q3n24L62K26k16L09
$$ 176 46 97 251 195 111 -60 -11 37 230 194 -172 -28 -148 113 -202 -2 81 -443 -81 145 -71 238
6006B38m52K82j22L0J12r0J3%K80l12k2M7m9j02J52k53L20q6k40Oj3L30j22j34
$$ 238 -214 68 -54 -24 88 -2 11 11 291 -21 -43 4 -45 -147 5 -248 72 -14 -254 -248 -261 69 -53 -187
6030a87K35p3k88J12L10j61p8J59l6j62K86K2p2p3J81r3p6m7J83q8j47j5K89q6
$$ -187 48 -25 -313 -201 109 -52 -130 29 -7 -169 117 139 67 -6 175 82 6 -41 142 54 -93 -108 181 95
6054I5j87J17R2k93J99j29N8R3M8l0L3K2q3j38P8O6k7K1J4j54j6L9J07P7K99k25
$$ 95 -92 25 117 -176 23 -106 -48 45 93 63 96 118 35 -103 -25 41 14 35 49 -105 -121 -82 25 102 401 176
6080A76l28L05J0K10n39O1K46j09J90k51kP0L5j6j32nR1J10m3Q1Pk14J08k68K20
$$ 176 -152 153 163 373 -166 -105 141 32 222 -29 -31 39 74 58 -74 -79 12 122 79 160 167 -47 61 -207 13
6105A3J29j63%K2K3q8K18l34J39M06m13L7j08J46O0k36N3J24K43l82k01K11j13
$$ 13 142 -21 -21 1 24 -64 154 -180 -41 365 -48 -11 -119 27 87 -149 -96 28 271 -111 -312 -101 -214
6128b14J66m21L64J66k9j39J96j79l3J44QJ3j17K26n4k57P1P3L32l31J15O4j57
$$ -214 -48 -469 -105 61 32 -107 89 -90 -123 21 29 42 -75 151 97 -160 -89 -16 316 -15 100 164 7
6151GJ04j53O4o7K5l9J09%q0oR1J72k69j55Q0j52K98j04J6Q5K6L5OK20m41J66
$$ 7 111 -42 22 -45 -20 -59 50 50 -30 -36 55 227 -42 -197 -117 -269 29 -75 -59 26 52 87 93 313 -128 38
6177C8Q5j63q9P6M1j18K09K72k44o8j18K3L74m99K70l6n6j7L4o5l0j19j9K85J04
$$ 38 123 -40 -129 -53 -12 -130 79 351 107 39 -79 -56 318 -181 89 53 -3 -20 14 -51 -81 -200 -219 66 170
6202A70j47o1N8MNq4L67l14K18m31K32k3O3K21k03k42L3J65K5j00J1q6M04j96
$$ 170 23 -38 20 24 29 -55 312 -2 216 -215 17 -6 57 278 75 -167 -134 31 56 -44 -33 -119 285 89
6226H9k65J58j64J90J52k09M7j34j3M65k06j48k37L78l50L68j40n6m7r5J28L05
$$ 89 -176 -18 -182 8 160 -49 -2 -136 -149 316 110 -38 -275 103 -247 121 -19 -75 -122 -217 -89 216
6248B16j00j22j45J44pj1K3k14M02j93J85k09L0J0J0j28M5j56J99q3j31J39j3
$$ 216 116 -6 -151 -7 -14 -25 -2 -216 186 -7 178 -31 -1 9 19 -109 -64 -220 -21 -104 -235 -96 -109
6271a09Q3J60k92K03J38j40j24LJ7K43k26L7j13l7L01k4j59k36Q5J19K85k22L48
$$ -109 -26 134 -158 45 183 43 -81 -78 -61 182 -44 -7 -120 -157 144 120 -39 -275 -190 -71 214 -8 340
6294C40m44J49l35L92q4mJ38j19j5j97J97J16j88%J63m7Np3KK58l36r9J39J69
$$ 340 -104 45 -290 102 18 14 152 33 18 -179 18 134 -54 -54 109 62 67 -6 -4 254 -82 -181 -42 127
6318A27qj12K03j92Q0j83J8K46l4k33Q9J30j17n5K2Q9L3j09n4R1m0J05k62J9J12
$$ 127 119 7 210 18 98 -85 -67 179 145 -88 1 131 14 -41 -19 70 103 -6 -60 31 -9 96 -166 -147 -35
6343c5O0j79K62j23l07N04j93J59j87m9l9L0r9J25J05j90J28K10k37J81j82J6
$$ -35 25 -154 108 -15 -322 182 -11 148 -39 -88 -127 -97 -196 -71 34 -156 -28 182 -55 126 -56 -40
6365d0r6K26k10O5M4L7n2N4K4j65J50l2M3p6M44m86n9J63j6m5L0r9j3J79N4j43
$$ -40 -136 90 -120 -55 -11 26 -26 28 52 -113 37 5 48 -28 416 -70 -129 34 18 -27 3 -96 -109 70 124 -19
6391a9j76M07Jk59J79k18j26K89K62m46K19l22K03Mq1K99j10k00J45j72J08J40
$$ -19 -195 212 213 -46 133 -85 -211 78 340 -106 113 -209 -6 -2 -83 216 106 -94 51 -121 -13 127
6413A27l26K57k72K70k69L60m4k00J00J08mp7j1jj57N3J67r2q6M9K20j69k8j0
$$ 127 -199 58 -214 56 -213 147 103 -97 3 111 107 30 19 18 -139 -86 81 -11 -97 -48 172 3 -25 -35
6437c5J43l11l8N0K83p3m4MLk0k9K50L3l05j33L86j14j61j34Q5P2L5l1l4o2J80
$$ -35 108 -203 -241 -191 92 19 -25 -21 -18 -38 -67 183 216 -89 -222 164 50 -111 -245 -160 -88 -53 -84 -118 -180 0
6463@L1j1J30j21l1j8J54m01K84l09K93j7P5q5k17M20j33k27L26k68j05K10k9
$$ 0 31 20 150 29 -2 -20 134 -267 17 -292 1 -16 59 -26 -243 177 44 -183 143 -125 -230 -20 -49
6486d9R4k62L11J11j15J31R3l81J3J71l1k12N3J35l15N54m51K08l4r5K22j16k82
$$ -49 45 -217 94 205 90 221 314 -67 -54 117 86 -126 -73 62 -253 301 -150 58 24 -71 151 35 -247
6509b47M11j88l9m2L5P4k24J56R8Q7j46J53j80j42N9K3K36l77J31J8L8N6J28o6
$$ -247 164 -24 -63 -105 -70 4 -220 -64 34 121 -25 128 -52 -194 -135 -112 124 -253 -122 -104 -66 -10 118 52
6533E2q8K1J83k38rJ61k49K78J68l53k2j60O15k79o5k9k4J38j74K10j3l29J91
$$ 52 -36 -15 168 -70 -79 82 -167 111 279 -74 -96 -256 359 80 15 -14 -38 100 -74 136 123 -206 -15
6556a5j5j13L06k52K74j30l9J1JQM9j64L5N3Q8j24q6J14M2n0J10L8r9j02K79l62
$$ -15 -30 -143 163 -89 185 55 16 27 28 36 85 -79 -44 9 97 -27 -113 1 43 -7 103 141 42 -60 219 -143
6582a43J63p9O0K0O7o2k31J35Q8p2j16K36j59O0j16N7K47Lk92J67k52K64L3mj86
$$ -143 20 -59 1 21 88 26 -205 -70 18 -54 -170 66 -93 -33 -149 -92 155 158 -134 33 -219 45 78 74 -112
6607a12j2L18j62p3j5p7j65K47LL5K22k07j05M8RK67l22K95j48j72K0J99M3j56
$$ -112 -124 194 32 -41 -56 -133 -298 -51 -48 -13 209 2 -103 -55 -46 221 -101 194 46 -126 -106 93 136 -20
6631b0J40m1p4m8O9o3P9k48K61l1k11J32j17J59nQ6k19L12j03M3k80K41j35N2
$$ -20 120 79 5 -43 26 -37 42 -206 55 24 -187 -55 -172 -13 -18 68 -151 161 58 101 -179 62 -73 -21
6655b1mN4m3j63L34l85K10k39L50M0j53K08j55J61k17J12j76J59j43J89n3j90
$$ -21 -25 29 -14 -177 157 -228 -18 -257 93 133 -20 188 33 194 -23 89 -87 72 -71 118 65 -125
6677a25J48j46k44K12R7j51N56m05R3j88P4N2m5L5J91k95J02J97r3l2p7R7j9R5
$$ -125 23 -123 -367 -155 -58 -209 347 -58 35 -153 -79 -27 -72 -37 154 -141 -39 158 65 33 -44 53 34 129
6701A29k19J60l8j61q5J87r9lK31l43M39j18q7m7j65J26N0R0O3N0k68N4q4q3N9
$$ 129 -90 70 32 -129 -214 -27 -126 -129 102 -241 198 80 -7 -54 -219 -93 -43 47 110 160 -108 -54 -138 -221 -162
6726a62L02j40p9J4K62k57J7O0k23K52n8J63K6r4m82L68J81l31k0J73N2n0O9j7
$$ -162 140 0 -79 -65 197 -60 -43 17 -206 46 -12 151 177 83 -399 -31 150 -181 -201 -28 24 -26 43 26
6750B6R5K2L5j01j01k38L59k55K69q1Q0j57r6N7N1J04j29J00j84p4K15k9j54l2
$$ 26 121 143 178 77 -24 -262 97 -158 111 30 110 -47 -143 -86 -35 69 -60 40 -144 -218 -3 -32 -186 -218
6774b18K53R1j84J89mn3Nk91L79m0j46j33N7O2o4J97j27j2J02l5R7r3j89L10j31
$$ -218 35 126 -58 131 127 74 79 -212 167 127 -19 -152 -95 -33 -97 100 -27 -39 63 28 125 32 -157 153 22
6799B2k3q1O0ojq8K12j51K22j17j72K68K4p7m3P5k17M1J22o9k4L05k86l4L8p1
$$ 22 -1 -82 -22 -28 -29 -117 95 -56 166 49 -123 145 169 92 49 124 -93 -52 70 1 -23 282 -4 -38 0 -71
6825g1%J62J17j16k48J3J54l23K00J4J20oK1J16p3Q8j87k8r3J17K65k02J17j95
$$ -71 -71 91 208 92 -156 -143 11 -312 -112 -98 22 16 37 153 80 168 -19 -47 -140 -23 242 40 157 -38
6849c8k8P4pp5K27K27m00Q9K8K3j71M9J59k28j1lJ79j83k49L36K48j22k36J1J75
$$ -38 -66 8 1 -74 153 380 -20 69 97 120 -51 -2 157 -71 -82 -85 94 -89 -338 -2 246 124 -112 -101 74
6874G4Q2r6J30k94J56K1J30j40j65J99K8k1k84J87r1p5J31O7l26J23K01R2k2k29
$$ 74 156 60 190 -104 52 73 203 63 -102 97 125 104 -180 7 -84 -159 -28 39 -287 -164 37 129 107 -122
6898a22J21J46l1Q3k21j10l6J47K04k29R9q1m9pP4m2J41j32j49J75M1j30j00J33
$$ -122 -1 145 114 197 -24 -134 -170 -23 181 -48 51 -30 -79 -86 -12 -54 87 -45 -194 -19 22 -108 -208 -75
6922g5p8j17M27k36N7r0J48j88l2J28J29k20J72N0K04l75j0Q1k30J52J40j78K1
$$ -75 -153 -270 157 -79 -22 -112 36 -152 -184 -56 73 -147 25 75 279 -96 -106 -25 -255 -103 37 -141 -120
6945a20J36j6J29k30L01n7J14l80p2K06K2J01L2j71J06N6l13j19K47MK13k12M5
$$ -120 16 0 129 -101 200 143 257 -123 -195 11 33 134 166 -5 101 157 -156 -275 -28 -24 189 -23 22
6968B2q6o7k40K31K93l40P7J02N2n1N6P4N8k68J56j93mK09J21n0j14l55M62k57
$$ 22 -64 -131 -371 -140 153 -187 -110 -8 44 -7 49 123 181 -87 69 -124 -128 81 202 152 38 -317 145 -112
6992a12J14P0Oq1J11j42Q5j4O7k3n7k41K62K12k62R4k20n2J22J17P3j55l0J76
$$ -112 2 72 78 -3 108 -34 51 37 104 81 24 -217 45 257 -5 89 -131 -183 -61 56 129 -26 -56 120
7016A20k04K84r5j98K96l89N48l39k67J39L86n7j4k01O7k18J28K12k11R8Mj35
$$ 120 -84 200 105 -93 203 -186 362 23 -244 -105 281 224 210 9 76 -142 -14 198 -13 85 89 -46
7038d6P4p5N0j47J00r5K5J42j34J99J13l57J54j10K95j45N8p8j27j00J81J2j71
$$ -46 28 -47 3 -144 -44 -139 -114 28 -106 93 206 -151 3 -107 188 43 101 23 -104 -204 -23 -11 -182
7061a82L32j88j5P9j12q3M04k88K15j40j08L53j26Jk48K83m63J03L62P6o39N06
$$ -182 150 -38 -53 26 -86 -169 235 -53 162 22 -86 267 141 142 -106 177 -286 -183 179 255 -384 122
7083A22L9l44K73j36m5K69j29j07J52k48K87j01n9j24K22k49P6l8J45j71j15L60
$$ 122 161 -183 90 -46 -91 178 49 -58 94 -154 133 32 -27 -151 71 -178 -102 -140 5 -166 -281 79
7105G9L2Oj34J27j80R5J34j9j22k5QL1k80J14J51j92M38n37J41J48L9j72J30J35
$$ 79 111 117 -17 110 -70 25 159 140 18 -7 1 32 -248 -134 17 -175 263 -274 -133 15 54 -118 12 147
7129A47k07R5j97K8R6j19K38k6K1j81J21j7r4J87k06Q6J08j34J11o3j03R2J44
$$ 147 -60 35 -162 -134 -38 -157 81 55 76 -105 16 -1 -95 92 -114 -28 80 -54 57 -6 -109 -17 127
7152A27j28k49M08j42k06lO6J29qj33L94j79l0l6p8J11k31L68j13O8k89j38M11
$$ 127 -1 -250 158 16 -190 -193 -127 2 -6 -139 255 76 46 10 -68 43 -188 180 67 135 -154 -292 119
7175A19P0j49j64J5k27K21Q9N7q6k38K63M2j45j5j8J43Q1l15J65o9j9J68J14l5
$$ 119 189 40 -124 -109 -336 -115 -26 31 -55 -293 -30 12 -133 -148 -166 -23 58 -257 -92 -161 -180 -12 102 67
7199F7k28K85o6j26K37j88J38J44j64p6R8j46J22J6r6L1nK05j25Nk56P7k87P5
$$ 67 -161 124 58 -68 169 -19 119 263 99 23 121 -25 97 113 17 48 43 248 123 128 -128 -51 -338 -263
7223b63N3J49k9k2O9P0J39l59L34j93J17J5k09J85l14K42Qp4J94k02P8k8J54j85
$$ -263 -210 -61 -90 -112 -43 27 166 -193 141 -52 65 80 -129 56 -258 -16 -8 -82 112 -90 -12 -40 114 -71
7247g1R0J00n8J01K6K3j19L5k49j09K85j07r2K80k61L6L00j29M0R3k62J22k06
$$ -71 19 119 61 162 188 211 92 127 -122 -231 54 -53 -145 135 -126 -90 210 81 121 214 -48 74 -132
7270a32J47J00l14J86p9J06o1k30M06j1j14J74j25M1J4j79J23R7l22QJ50k3J06
$$ -132 15 115 -199 -13 -92 14 -47 -277 129 118 4 178 53 94 108 -71 52 149 -173 -165 -15 -38 68
7293F8j10j16k24L98K62j94p8J53r0%p0j47N22m32Q1L1K0j5j26j43J37J55L3p3
$$ 68 -42 -158 -382 16 278 84 6 159 69 69 -1 -148 374 -58 23 54 74 59 -67 -210 -73 82 115 42
7317D2l3r8Q4M3j44K91k8k69k8L40k12K7o8J80j34p5J46j39K3j95%J9K34J5OJ27
$$ 42 9 -89 -5 38 -106 185 157 -112 -140 200 -12 15 -53 127 -7 -82 64 -75 -52 -247 -247 -228 6 21 27 154
7343A54j70L00k84L85l35K4K94m44J6K96l11M1O9J02L8j58J78r2Q1l69K38%J72
$$ 154 -16 284 0 385 50 74 368 -76 -60 236 -75 -34 35 137 175 17 195 103 184 -185 53 53 225
7366B25l36J28K14j34n2J35n1P5l19O6o6K27k27O8J64l11J32K70l35J29l0N4k56
$$ 225 -111 17 231 97 45 180 129 204 -115 -49 -115 112 -115 -47 117 -194 -62 208 -127 2 -28 26 -230
7389b30J08K68l8j02J41j74K52p9j44q6J5q9J44P3m6lj37K24k15K95k10Q1km6
$$ -230 -122 146 108 6 147 -27 225 146 2 -84 -69 -158 -14 59 13 10 -127 97 -118 177 -33 48 46 0
7413@mJ32j60QN9nl4L4rj40J56p6N5L6J87k51N0j23J15J07j54K20r9l32K79P1
$$ 0 -4 128 -32 -24 35 30 -4 30 21 -119 37 -39 16 52 239 -12 38 -85 30 137 -17 203 104 -228 51 122
7439A22J7o2K41n61L20l05J96J12j05K38o6k15k8J16oq7K3J59p6J16j22l7R3j35
$$ 122 139 77 318 -243 77 -228 -32 80 -25 213 147 -68 -96 20 14 -73 -50 109 33 149 27 -10 83 -52
7463e2K22j12j58J72J1j65J69p7Q6j87J39J28l25K02j83J17JJ10j06J6k8o8J34
$$ -52 170 58 -100 72 83 -82 87 10 96 -91 48 176 -149 53 -130 -13 -12 98 -8 8 -20 -88 46
7486D6k28R3Q4R2M2j60o4L1L66j33j57Pj4J0J87p7j44J03j44J81j17P8J25l12
$$ 46 -182 -89 -5 87 129 -31 -95 -64 302 169 12 19 5 15 202 125 -19 84 -60 121 4 82 207 -105
7510a05J14l2l0J94j77K14p9l38K24Rml6M0k0j01J21R2k30n7R1R0N2J6k2p2O2
$$ -105 9 -23 -53 141 -36 178 99 -239 -15 -6 -10 -46 -6 -26 -127 -6 86 -144 -201 -110 -20 32 48 26 -46 16
7536A6L8k38L05l5r1j51J99J49q8k93J81J72k21j8p5J17J35p4l1M2L2q2m0j17
$$ 16 54 -184 121 86 -5 -156 43 192 104 -189 -8 164 -57 -75 -150 -33 102 28 -3 39 71 -11 -51 -168
7560a68L6j03K9QK68j8j24J82j8L0R6k06p6qO0L5k1pP0K30j48k23j03J15j60J88
$$ -168 -132 -235 -206 -198 70 52 -72 110 92 122 218 12 -64 -72 -12 23 2 -5 65 295 147 -76 -179 -64 -224 -36
7586c6L00j07L7j30k52L00r3j25O2J98l29J31j23K44R2j30J41o6k02J22j19N5
$$ -36 264 157 194 64 -188 112 19 -106 -44 154 -175 -44 -167 77 169 39 180 114 -88 34 -85 -30
7608c0n7K0K78k64K05j74K33k93J74p7Jj30L15j57M8j82K07j81m3J60pm5m8l0
$$ -30 -87 -67 211 -53 152 -22 211 -82 92 15 16 -114 201 44 92 -90 117 -64 -107 53 46 1 -47 -77
7632g7J72k7j67K76k6r0k54K79R6k0j26K04j27o8l7j5j76Q0K85j75K6j57j2J30
$$ -77 95 68 -99 177 151 61 -193 86 182 162 36 240 113 45 8 -7 -183 -103 182 7 33 -124 -136 -6
7656fr5J03K6j27n1o5L54l9j27j28J25N6J04m82N45j63J90k81j1M1K4o2J35J2
$$ -6 -101 2 28 -99 -150 -215 139 100 -27 -155 -30 26 130 -352 193 30 220 -61 -72 -31 -7 -69 66 78
7680G8K0m6k84N02l18J5J86p9k79oK24j72q9K38K24k26l9j37K82j20k50M10j22
$$ 78 98 52 -232 270 -48 -33 153 74 -205 -211 13 -159 -248 -10 214 -12 -51 -188 94 -26 -276 134 12
7703A2j4J27k45L98k99J06Rk58J03k21M33k08K25k2j26J9k59K09j16jJ24j9J94
$$ 12 -2 125 -120 278 -21 85 94 -164 -61 -282 151 -57 168 146 20 39 -220 -11 -127 -128 -4 -23 171
7726A71k5M3k26O6J91k93R8j36K64l43K2J14P3j14K78k71j17K46J44k0r1K71n11
$$ 171 146 189 -37 29 220 -73 25 -111 153 -190 -168 -54 19 -95 183 -88 -205 41 185 165 74 345 -166
7749a66K64Q7l66K10O1K6j02j78K05L6j2k55M40l15j10Q3L28l94K50j03O6n1J41
$$ -166 98 185 -181 29 90 116 14 -164 41 77 65 -190 250 -65 -175 -92 236 -158 92 -11 55 4 145
7772A45n4K40l33j98M13k41Q8o5j70j2M91l63P5k81N30j53l46L12l96L97K11k83
$$ 145 91 331 -2 -200 213 -28 60 -5 -175 -187 304 -59 16 -265 265 112 -234 78 -318 79 290 7
7794GP4o3p7K6j10L00j07Q2j29k26L68j57M7j5k31N55m00J69k20J04r4J59l0j05
$$ 7 81 18 -59 -33 -143 157 50 132 3 -223 145 -12 35 20 -211 344 -56 113 -107 -3 -97 62 32 -73
7818g3L34l83K99j77qJ21j96J5K30l91M09k79k7K40r3l0j33M6K78l37m7M37j30
$$ -73 261 -122 177 0 -8 113 -83 -68 162 -229 180 -99 -126 114 21 -9 -142 -96 182 -155 -202 235 105
7841A05j95L26n5l4l18o1K81j39L50j63n3k4j32K04L4O1j26R3k10L5j07k6K86
$$ 105 -90 236 181 147 -171 -232 49 -90 260 97 44 20 -112 92 126 187 61 154 -56 -21 -128 -154 132
7864A32k36N4Nk8O5p9m5J35M8k49N7J54J4K8J34j06k08J53J25k73J60k65M79j03
$$ 132 -104 -50 -45 -73 -8 -87 -132 3 51 -198 -141 13 27 55 189 83 -125 28 153 -120 40 -225 254 151
7888A51j78N1o7m0M0k4j30M19k78J26j82L51k6n4k91J3M5Q8k61M02j34l2j9K02
$$ 151 -27 24 -43 -83 -43 -67 -197 222 -56 70 -112 239 213 159 -132 -119 -74 14 -247 155 21 -11 -30 172
7912A72j35k19K8n5K48j81M16j39K5J19l10J53r4Kj12K25nn0j64j8j61L44j0R5
$$ 172 37 -182 -154 -209 39 -142 274 135 160 279 -31 122 28 30 -82 143 138 88 -76 -94 -255 89 79 174
7936A74l19K15j59j21L72J08j96j22N5M7J65q1k85KL5N7K1l8J8j35M11l33L9J62
$$ 174 -145 70 -89 -210 162 270 74 -48 7 54 219 138 -147 -145 -110 -53 -32 -70 -52 -187 224 -109 -70 92
7960I2j26K16j48k04O2K11n2j60q5L62O7k4jk46J12j28J20mJ20j89K9r0j8J81
$$ 92 -34 182 34 -170 -108 103 51 -109 -194 168 235 211 210 -36 76 -52 68 64 184 -5 24 -66 -84 97
7984I7l2P5j74q6K97k34RJ17P8o8o9p3k64N06k40K0k79M98k36R9j43Q1j46K93
$$ 97 65 140 -34 -120 177 -57 -48 69 147 79 10 -63 -327 179 -61 -41 -320 178 -58 41 -102 -21 -167 126
8008A26p5j32MJ16lk59J56J45j2j62n4J41K86k14k65K04Q1j36K60L0j35J35m73
$$ 126 51 -81 -77 39 36 -223 -67 78 66 -96 -150 -9 277 63 -202 2 83 -53 207 237 102 237 -236
8031b36L43m7J77r1N5j99p9J28j49k18J05L85m03K22J30j75j43J57m8J24o6J20
$$ -236 107 60 237 146 201 2 -77 51 -98 -316 -211 174 -229 -7 123 -52 -195 -38 -86 38 -28 92
8053I2Q6j88k14L62m7J12j28j35J3L08k71j9J03K4L2l4p3J27m9k17J79J10k95
$$ 92 178 -10 -224 138 91 203 75 -60 -47 261 -10 -29 74 98 130 96 23 150 101 -116 63 173 -122
8076a22J64j2l4k8r0JP8J48l98L51L8K43n66K34mK42o4q6j09J04r6M7q1P0j89
$$ -122 42 30 -4 -32 -122 -121 -43 105 -293 58 96 339 -227 7 3 245 181 95 -14 90 -6 41 -40 30 -159
8101a59N4J17J23j51J00o4j84k8J75p0q3K82k21J03LK17m75K67k10J66L0p8q8
$$ -159 -105 12 135 -16 84 20 -164 -192 -17 -87 -170 112 -109 -6 -3 214 -261 6 -204 -38 -8 -86 -174
8124a74lL16l36k17L44J01k85K09m9L7lo0J33O5N5l45J93J21k08KL74j81r9L8
$$ -174 -177 139 -197 -414 -70 31 -254 -45 -94 -57 -60 -120 13 78 133 -212 -19 102 -106 -104 270 89 -10 28
8148B8j35rJ44pK6j57M3mJ37n6k09J43k3J1J86o8P2P4Q9m45J2K25j41J2j84l4
$$ 28 -107 -116 28 21 47 -110 -67 -71 66 10 -199 -56 -79 -68 118 50 122 196 285 -160 -148 77 -64 -52 -236 -270
8174b70P8K94M1k99M7K6K88m24K19M6p2q8R8L3Q7p8j64
$$ -270 -192 102 143 -156 -109 -83 205 -219 0 46 -26 -114 -16 17 104 26 -138
8191a38
$$ Imaginary data points
##PAGE= N=2
##DATA TABLE= (X++(I..I)), XYDATA
0@%%%%%%%%%%Qj6J6j6J6k4L2l4M2n3O1p2Q8j04J20j41J65j90K19k50K87l27L70
$$ 0 0 0 0 0 0 0 0 0 0 0 8 -8 8 -8 8 -16 16 -18 24 -29 32 -40 48 -56 64 -77 88 -102 117 -133 154 -173 197
33A97m18M69n28N93o64P42q28R22j023J133j253J387j533J690j862K051k259K488
$$ 197 -221 248 -280 313 -351 391 -437 485 -538 595 -658 729 -804 886 -976 1075 -1184 1304
51A304k742L023l336L690m089M541n064N675o399P272q349R717j1514J3991j7628
$$ 1304 -1438 1585 -1751 1939 -2150 2391 -2673 3002 -3397 3875 -4474 5243 -6271 7720 -9908
66i908K3476l4339O0817k35424k42559O97050j20455n34238L03637L23368l76560
$$ -9908 13568 -20771 40046 -195378 -437937 259113 138658 -395580 -91943 231425 -145135
77a45135m1975K96548q7598j16595J74650k5069j23169Q4708L4844j22930j836
$$ -145135 -187110 109438 21840 -94755 79895 54826 -68343 16365 51209 -71721 -73557
88g3557P6033r992n5478J7327N6094l1059o4849P4478K7479j22772O1634J52900
$$ -73557 2476 -7516 -62994 -45667 10427 -20632 -85481 -11003 16476 -106296 -44662 108238
100A08238j58961q9490K45405l0192k65628J53856J85394k17701k5109K26981
$$ 108238 -50723 -140213 105192 75000 -190628 -36772 148622 -69079 -94188 132793
110A32793q2396r7191J50574n2777j25069J54197j724k04227J15773J41640k15475
$$ 132793 50397 -46794 103780 51003 -74066 80131 78407 -125820 -10047 131593 -83882
121h3882o0683K09562n5036j78819J15993J32827j07141m9165J43063N2735j27843
$$ -83882 -144565 64997 9961 -168858 -52865 79962 -27179 -76344 66719 119454 -8389
132h389j7507J48163k6036j58217Q7231J26669j52741n7571J61574o5165j33486
$$ -8389 -25896 122267 96231 -61986 25245 151914 -827 -58398 103176 38011 -95475
143i5475J36539J8196j58136J16145J11098j92814J3288K01127j41117j38732
$$ -95475 41064 59260 -98876 17269 128367 -64447 -51159 149968 8851 -129881
153a29881J97329J4559j83837R3851J10867j28819k268J06578p0552l5641R1072
$$ -129881 67448 82007 -101830 -7979 102888 -25931 -28199 78379 7827 -27814 63258
164F3258k6580n1425O7966K453o9772J8128J8972n4026k2316L0660J0014l3265
$$ 63258 36678 -14747 53219 55672 -14100 4028 23000 -31026 -53342 -22682 -12668 -45933
176d5933j0347O6510J3723r1397L3518J21410q5968q8903J60775L1520j80028
$$ -45933 -56280 10230 23953 -67444 -33926 87484 1516 -87387 73388 104908 -75120
187g5120N4754J30786j47437o6923J43566m9147j03259J14439J7940j13686P8714
$$ -75120 -20366 110420 -37017 -103940 39626 -9521 -112780 1659 19599 -94087 -15373
198a5373O4955j25180K0277J22745q4717o4958J23650Q077j14539L2617P6118
$$ -15373 49582 -75598 -55321 67424 -17293 -82251 41399 49476 -65063 -32446 43672
209D3672n7812n3695N6364M4870m4278k8462O3061K4051p6133j201P1434m6200
$$ 43672 -14140 -67835 -11471 33399 -10879 -39341 23720 47771 -28362 -29563 41871 -4329
221d329n3498P2146l44p5327N3854L1789q9104L3885Q1714q5811q930J31575m8273
$$ -4329 -57827 14319 13975 -61352 -7498 24291 -64813 -30928 50786 -35025 -43955 87620 39347
234C9347r0851J20252K9435j42912L4638J03614r5013n6216R4147p088p1658L0258
$$ 39347 -51504 68748 98183 -44729 -10091 93523 -1490 -57706 36441 29353 -42305 -12047
246a2047K3125l0234J4279J5600j6076K2574K8592k2755j5568K6402J1620l6702
$$ -12047 11078 -19156 -4877 10723 -5353 17221 45813 23058 7490 33892 45512 8810
258H810k5611M2895J9942o6445l842Q1951l5951p9758P7703M3288j05536J7746
$$ 8810 -16801 26094 46036 -20409 -24251 57700 21749 -58009 19694 62982 -42554 -24808
270b4808J04082p3388o2110J02489o156j03437N3013N3640q0615Q911P1820m9569
$$ -24808 79274 5886 -56224 46265 40109 -63328 -10315 43325 -37290 -28379 43441 -6128
282f128j9422P5603k7921o0657O7566K8473q4704P99P4074l2952p3634K9523M7230
$$ -6128 -25550 50053 22132 -38525 29041 57514 -27190 -26391 47683 14731 -58903 -29380 17850
295A7850m8768m6729N4745L7953n5956n994P1946j0673m9506M4239K5114m9462
$$ 17850 -30918 -77647 -22902 15051 -40905 -46899 25047 14374 -35132 9107 34221 -15241
307a5241J5317L2880m6390O13M1846n5377k4458P5693l1812p6648Q3228M7580
$$ -15241 76 32956 -13434 -12821 29025 -26352 -50810 24883 -6929 -83577 -349 47231
319D7231j08726Q204J11106n4829q1645Q1465L8839q2401J344O4950k2930l4903
$$ 47231 -61495 -53291 57815 2986 -78659 2806 41645 -40756 -39412 25538 2608 -32295
331c2295L2650J4762k5128Q121K5505j1828j1073K6361K900l6653O297K8532l7155
$$ -32295 355 15117 -10011 -1890 23615 11787 714 27075 29975 -6678 -381 28151 -9004
344i004k7957M8268m003n9066L9244M9823o7099j1361R2845j9418p3848O6464
$$ -9004 -36961 11307 7304 -51762 -12518 37305 -29794 -41155 51690 32272 -41576 24888
356B4888N5802p6586j6194O8393j9768n1383K2533J1285k4547O989O59j8818K1547
$$ 24888 80690 4104 -12090 56303 36535 -14848 7685 18970 -5577 1412 2071 -16747 4800
369D800J6561l5230j44M6818r705m1188K5884L6123l5811k7825L8800J0385m6288
$$ 4800 21361 -13869 -14013 32805 23100 -18088 7796 43919 8108 -19717 19083 29468 -16820
382a6820M255M2801k1624k9485L8995J1213m1680J1983L1046l4904j3630L5725
$$ -16820 -12565 30236 8612 -20873 18122 29335 -12345 -362 30684 -4220 -17850 17875
394A7875k0708l2055L6253K63m8729K8544L9653n0823p992P0585j2822n5302M6827
$$ 17875 -2833 -34888 1365 1628 -47101 -18557 21096 -29727 -37719 32866 20044 -35258 11569
407A1569M1819n7839j6827N4961j3021n2810J9630K4767l6428j5231K6657m062
$$ 11569 53388 -4451 -21278 33683 20662 -32148 -12518 12249 -24179 -39410 -12753 -16815
419a6815j9914J7188J0679j4086J2069J8969j9307j650L3282j3513l3268L1292
$$ -16815 -36729 -19541 -8862 -22948 -10879 8090 -11217 -12867 20415 6902 -26366 4926
431D926K3041n0300o476N5031j7420m9843M0016L4761n0140r192N1330j4268l9171
$$ 4926 27967 -22333 -28809 26222 8802 -41041 -1025 33736 -16404 -25596 25734 11466 -27705
444b7705K7888J5286l6483M240K4558k4545p357L3250j1303k3156L8399J6560
$$ -27705 183 15469 -21014 -16774 7784 -16761 -24118 9132 -2171 -25327 13072 29632
456B9632m0287J3540M7966l0928l4182M6098J1801n8883L440M5772l1119l9637
$$ 29632 -10655 2885 50851 19923 -14259 31839 43640 -15243 -11803 33969 2850 -36787
468c6787L7161J6638m1094M549L7587j2013j5188K7245O507j8438J3180R802k3648
$$ -36787 374 17012 -24082 -19533 18054 6041 -9147 18098 24605 6167 19347 29149 5501
481E501K823K1732k5238k0119L4001M37m4449J6132M0724l5834k6279N0204P628
$$ 5501 8324 30056 4818 -15301 18700 19137 -25312 -9180 31544 -4290 -30569 19635 27263
494B7263n1235J5827M1427l5217k4981L8969p41l5051J8807J9589k4531L419K5843
$$ 27263 -23972 -8145 33282 -1935 -26916 12053 11312 -23739 -4932 14657 -9874 -6455 19388
507A9388j7293r363K9789o719k9385K2361J7161l9896j0899L5588j3440m2754
$$ 19388 2095 -7268 22521 15802 -13583 8778 25939 -13957 -24856 10732 -2708 -45462
519d5462K0204L1201l2423j7850M3748J0196l6839J4330L8129k1201j8139L1743
$$ -45462 -25258 5943 -26480 -44330 -582 9614 -27225 -12895 25234 4033 -14106 17637
531A7637J265k9358J4649J0618l0128L252K0761k8243r242L7367j3060l1691L6845
$$ 17637 18902 -10456 4193 14811 -15317 -12065 8696 -19547 -28789 8578 -4482 -36173 672
544F72J8726m6101M964M6369k5135l4151L7806J6990l9529l0L3509r981k0852
$$ 672 19398 -26703 -21739 24630 -505 -34656 3150 20140 -19389 -19419 14090 4109 -16743
557a6743J6600J3552j0976R91J1750n131m730J0783p488j8607J3740J0955l0336
$$ -16743 -143 13409 2433 3424 15174 10043 5313 16096 8608 -9999 3741 14696 -15640
570a5640m620L6764j3160l5400L3879K5911m2641K494N0886k0933l3047M2692
$$ -15640 -20260 16504 3344 -32056 1823 27734 -14907 -12413 38473 17540 -15507 27185
582B7185J1290m8629R443L2241l1716j8328L0029m940k2217J7323N632j8346J2829
$$ 27185 38475 -10154 -711 31530 -186 -18514 11515 6575 -15642 1681 7313 -11033 1796
595A796J4667j9774l16K8345o178k6733J4129K2734k4210k3221K6747J4074l4940
$$ 1796 16463 -3311 -3627 24718 18540 -8193 5936 28670 4460 -18761 7986 22060 -12880
608a2880l368L6004j0622l0264K3764J4678l1928M164K5491k2996j1121K8897
$$ -12880 -16248 19756 9134 -21130 2634 17312 -14616 -10452 15039 -7957 -19078 9819
620I819j2711k5003K8487N192l3148K0392K8500l2438l275M3342j4418l4400K9567
$$ 9819 -2892 -27895 592 5784 -27364 -6972 21528 -10910 -14185 29157 14739 -19661 9906
633I906J7495l7554o855K8439r153k5792O561J2558j2032r766J1263O097p025
$$ 9906 27401 -10153 -17008 11431 2278 -23514 -16953 -4395 -16427 -26193 -14930 -8833 -15858
646a5858O395J1718p854M57J8687j0084j6527K4579O027l3670J1658L0061l2921
$$ -15858 -9463 2255 -5599 -5142 13545 3461 -13066 11513 17540 -16130 -4472 25589 -7332
659g332j6784M2219q601m0877L0871K6440m2632k821M0974j7780k8301K4593P216
$$ -7332 -24116 18103 9502 -31375 -504 25936 -16696 -19517 21457 3677 -24624 -31 7185
672G185k1704P529J0674j0498P358J1438j3072K0K0510l490j7567J0348J7311
$$ 7185 -14519 -6990 3684 -6814 544 11982 -1090 -1070 19440 15950 -1617 8731 26042
685B6042j3391j9243J3050J3372k5814j4183K7498M24l0018J4382K5734k3698
$$ 26042 12651 -6592 6458 19830 -5984 -20167 7331 7755 -22263 -7881 17853 -5845
697e845o301L1066p813j9053K4308M654k4183J5076J1504k8416M666K2215k7873
$$ -5845 -12146 18920 11107 -7946 16362 21016 -3167 11909 23413 -5003 -337 21878 -5995
710e995j1601L4545q034l3174K5222K1716l3200p288L1460m246k5596J0437J8281
$$ -5995 -17596 16949 8915 -24259 963 22679 -10521 -17809 13651 9405 -16191 -5754 12527
723A2527j1753j2851J2355Q779j3485k840J4844k659q922J1807K366j4741Q726
$$ 12527 774 -12077 278 9057 -4428 -7268 7576 4917 -4005 7802 10168 -4573 4153
736D153P600k4169J341K3258k3460j9431L4737K68m0475K0891L2304l3824j0623
$$ 4153 11753 -12416 -11075 12183 -11277 -30708 4029 4297 -36178 -15287 17017 -16807 -27430
749b7430M2271l501k9022K1856J6600k3114j619J4314r698p444P927n017n815
$$ -27430 14841 11340 -17682 4174 20774 -2340 -3959 10355 657 -6787 1140 -3877 -9692
762i692P394j016j0003M551R791o321q693J2478J1550j6695p310K5111o36k9447
$$ -9692 -2298 -3314 -13317 -8766 1025 -5296 -13989 -1511 10039 -6656 -13966 11145 10509 -18938
776a8938J2726K7143k5011j4124L4192j210k9170J8651J6121k6245K560K1372
$$ -18938 -6212 20931 -4080 -18204 15988 14778 -14392 4259 20380 -5865 -3305 18067
788A8067j8861q494K3413j1609j9607K1816M055k6949J1799K2520j9639p490K6880
$$ 18067 -794 -9288 14125 2516 -17091 4725 8780 -18169 -6370 16150 -3489 -10979 15901
801A5901O98k0860Q930J6849j1493j3353J1483Q525j5836q227J3222m40j5740
$$ 15901 16599 -4261 4669 21518 10025 -3328 8155 16680 844 -7383 5839 5399 -10341
814a0341M853R618j0060K059J2199j0700k004K0320r789j7914K3389P743l1031
$$ -10341 -5488 4130 -5930 -3871 8328 -2372 -4376 15944 6155 -11759 11630 19373 -11658
827a1658Q103K7132k4645j5415L0534l176k8964J6818J7997k4241m609K2191o986
$$ -11658 -3555 23577 -1068 -16483 14051 10875 -18089 -1271 16726 -7515 -12124 10067 3081
840C081j6281R857N131j0526P68N754n038J98Q891k778q246R946J1565j4152q060
$$ 3081 -13200 -3343 1788 -8738 -7970 -2216 -7254 -7056 1835 -943 -9189 757 12322 -1830 -9890
855i890K2406L815k8534M022K6003j8942k2486K3292O451k6647P252J8678j7283
$$ -9890 12516 16331 -12203 -8181 17822 -1120 -23606 -314 6137 -20510 -13258 5420 -11863
868a1863l506K1385q571j2096K0521K774j8490J1215J1998j7078j083J5439j0909
$$ -11863 -15369 6016 -2555 -14651 5870 8644 -9846 1369 13367 -3711 -4794 10645 -264
881b64j1215J6390J672j8660N101J7967j0470j4421J3873J1853j6357p808J7943
$$ -264 -11479 4911 6583 -12077 -6976 10991 521 -13900 -27 11826 -4531 -12339 5604
894E604L306j7473L943J3487q742m686J1991m049o435J4500j123j6498J3503J1531
$$ 5604 8910 -8563 -4620 8867 125 -4561 7430 3381 -3054 11446 10323 -6175 7328 18859
908A8859k3583k292K3295j2876k0165K0114P025k4356M596K0535j2598j0890J8272
$$ 18859 -4724 -7016 16279 3403 -16762 3352 10377 -13979 -9383 11152 -1446 -12336 5936
921E936N193j3121M001J1182m289m402L087o93k235O71l002n157L860L746j0150
$$ 5936 11129 -1992 2009 13191 8902 4500 7587 6894 4659 5330 2328 -2829 1031 4777 -5373
936e373m971J2847J722j7140M580J8704j1224j3476J7754P080k0192L738J6994
$$ -5373 -10344 2503 4225 -12915 -8335 10369 -855 -14331 3423 10503 -9689 -5951 11043
949A1043j1646q142J6690p55j3619R991O299j2751J736R831j0994m724J2022o547
$$ 11043 -603 -8745 7945 7190 -6429 3562 9861 -2890 -1154 8677 -2317 -7041 4981 -1566
963a566j2932J1840N451j8259k29J9776o193j6619J4676J5582j5715p172K0590
$$ -1566 -14498 -2658 2793 -15466 -15695 4081 -2112 -18731 -4055 11527 -4188 -11360 9230
976I230K259j7541M362J3646j0009q155R737j344r252N688J060r341O282P199
$$ 9230 11489 -6052 -1690 11956 1947 -6208 3529 2185 -7067 -1379 -319 -9660 -3378 3821
990C821j2683P28J6804q325j3813J7589P342k1068K169K1134j0212j6094J6545
$$ 3821 -8862 -8134 8670 345 -13468 4121 11463 -9605 -7436 13698 3486 -12608 3937
1003C937R255j8358j162J6856n333j1415Q780N634j0290l43P418n934l767P611
$$ 3937 13192 -5166 -6328 10528 5195 -6220 2560 8194 -2096 -2439 4979 -955 -4722 2889
1017B889k425p532R102M999j2449L123J5079q105j1297J5976O227j8829J156J7177
$$ 2889 464 -7068 2034 7033 -5416 -2293 12786 4681 -6616 9360 15587 -3242 -2086 15091
1031A5091r773j4844J2037N889j5759l24J1761n768o209Q416J109n967O070L234
$$ 15091 5318 -9526 2511 8400 -7359 -7683 4078 -1690 -7899 517 1626 -4341 1729 4963
1045D963p363M629P863r232l626J2774k556j4608P728J1173j4558p400J7303p43
$$ 4963 -2400 2229 10092 860 -2766 10008 7452 -7156 572 11745 -2813 -10213 7090 6347
1059F347j7212O281J3018j2258p618J3005J72j1646N457O411q093O77Q822n844
$$ 6347 -10865 -4584 8434 -3824 -11442 1563 1735 -9911 -4454 1957 -6136 -5459 3363 -2481
1073b481m031J2063l40j1436P840J0570j3160o468J5912j874j7963O860J2819
$$ -2481 -6512 5551 5211 -6225 1615 12185 -975 -7443 8469 6595 -11368 -4508 8311
1086H311j4508p758J5570m1j4729P539J0486j0016j826J1411k198o288Q012Q02
$$ 8311 -6197 -13955 1615 1574 -13155 -5616 4870 -5146 -6972 4439 2241 -4047 3965 4767
1100D767q299N922M433j1201Q48J1640p847j0384J2622N567j5510j64J5821m698
$$ 4767 -3532 2390 6823 -4378 -3530 8110 263 -10121 2501 8068 -7442 -7606 8215 3517
1114C517j3678R945R793j2390m420J3246j159j0792O815O396q114j71Q284n030
$$ 3517 -10161 -216 9577 -2813 -7233 6013 4854 -5938 877 7273 -841 -1012 7272 2242
1128B242m340R113k593r466Q825M221j4650J398J4511j0725j1679J5568N595j7179
$$ 2242 -2098 7015 4422 -5044 3781 8002 -6648 -5250 9261 -1464 -13143 2425 8020 -9159
1142i159K914J6513o961j0012J1415O106j0106m41P493k693m502K630m08l957
$$ -9159 -6245 10268 3307 -6705 4710 10816 710 269 7762 5069 567 3197 2789 -1168
1156a168J925m6n832J848O159o500n339J1075K051j3412M046J4090r402j0245
$$ -1168 757 711 -5121 -3273 2886 -3614 -8953 2122 4173 -9239 -5193 8897 -505 -10750
1170a0750J5708M511j7005M008J4627r916q209J2405P65j0637M736M758p931Q02
$$ -10750 4958 9469 -7536 -3528 11099 1183 -7026 5379 6144 -4493 243 5001 -2930 -2128
1184b128M837o947j781P686m251p671Q460M468r830k14J1564j787r785O751R145
$$ -2128 2709 -4238 -6019 1667 -2584 -10255 -1795 2673 -7157 -7371 4193 2406 -7379 -628 8517
1199H517p676n969J0392K678j1993Q33R914o560p291P825R31p813M102L464p085
$$ 8517 841 -5128 5264 7942 -4051 -3218 6696 136 -7155 670 1601 -6212 -2110 1354 -5731
1214e731L531O498q457m25J2758o344j0193J2924N194j5460J575J4432p796r862
$$ -5731 -2200 4298 -4159 -4584 8174 1830 -8363 4561 9755 -5705 -4130 10302 2506 -7356
1228g356J0064M497j0188k39P061k447m679K846J797l057N17J908k159l89M326
$$ -7356 2708 7205 -2983 -3222 3839 1392 -3287 -441 1356 -1701 -1184 724 -1435 -1824 2502
1243B502j626m091O194M223q953k3J2216n306j1415J0924O619j5554j190J4273
$$ 2502 876 -3215 2979 7202 -1751 -1774 10442 5136 -6279 4645 11264 -4290 -5480 8793
1257H793p445j1733J0832L774j1860K331Q493n659j748O941k202k741O027l89
$$ 8793 1348 -10385 447 4221 -7639 -5308 3185 -2474 -4222 2719 517 -2224 3803 3414
1271C414n481N241L864p482j596P928j564q671K530P783o004p693P889M898j0580
$$ 3414 -2067 3174 7038 -444 -2040 5888 4324 -4347 -1817 5966 -38 -7731 158 5056 -5524
1286e524k128J0982k801r169O771M950p790J095O559m933m08P567n737k995J0478
$$ -5524 -7652 3330 529 -8640 -1869 3081 -4709 -3614 2945 -1988 -2396 5171 -566 -3561 6917
1301F917l046j0396R474O150j4078j045J3217o365j0882R242N249j0073j119Q697
$$ 6917 3871 -6525 2949 9099 -4979 -6024 7193 828 -10054 -812 4437 -5636 -6755 1942
1315A942j572n333L704L778k624r85L554K3k445J516J274m065R30M715n908l125
$$ 1942 370 -4963 -1259 2519 -105 -1090 2464 2487 42 1558 2832 -1233 -303 4412 -1496 -4621
1331d621Q869j972j0593P573Q613j2993l142J5634l454j3015R734Q202j1869j320
$$ -4621 4248 2276 -8317 -744 7869 -5124 -8266 7368 3914 -9101 633 8835 -3034 -4354
1345d354J0367l079n641N483Q35m022L083L0m441K915K574n515j532N924j219
$$ -4354 6013 2934 -2707 2776 3611 -411 2672 2702 -1739 1176 3750 -1765 -3297 2627 1408
1360A408o807K558O017l756o029O691N347p903j798J0854j491r200O262O368r105
$$ 1408 -5399 -2841 3176 -580 -6609 82 5429 -2474 -4272 6582 5091 -4109 2153 8521 -584
1375e84j631Q446m380n358O171j486o060N778J207r329M635P695r464k833J2166
$$ -584 -2215 6231 1851 -3507 2664 1178 -4882 896 2103 -7226 -2591 5104 -4360 -7193 4973
1390D973k013j0708O729Q346q831l393Q496J171p372J082N795k305m954K896L392
$$ 4973 2960 -7748 -1019 7327 -1504 -4897 3599 4770 -2602 -1520 4275 1970 -2984 -88 3304
1405C304m176j733L845j284k805K792q59l011M025P56o291L968O963q068l258
$$ 3304 -872 -2605 1240 -44 -2849 -57 -916 -3927 98 854 -5437 -1469 5494 -2574 -5832
1420e832J1888j695j1092O946Q303j0335k697R425k417p159M393K190n135J219
$$ -5832 6056 4361 -6731 215 8518 -1817 -4514 4911 2494 -4665 -272 1918 -3217 -1998
1434a998K807l521M14L650k181k282M657J179m328J302M891k218n175M555M066
$$ -1998 809 -2712 -2298 1352 -829 -3111 1546 2725 -1603 -301 4590 2372 -2803 1752 5818
1449E818p106k985Q961j205r731M245P868q385m108Q935m05p240M080L881m931
$$ 5818 -1288 -4273 4688 3483 -6248 -2003 5865 -2520 -6628 2307 1902 -5338 -1258 2623 -2308
1464b308J583L097l794R74N160m653k558P514k25p868M125N507o572l497O486
$$ -2308 -725 2372 -1422 -448 4712 59 -2499 5015 4790 -3078 1047 6554 -18 -3515 2971
1479B971n6o503J381M485l517l430L457J418l516N35L884j749j278M090k77l598
$$ 2971 2915 -3588 -2207 2278 -1239 -4669 -1212 206 -3310 -2775 1109 -640 -1918 2172 1895 -1703
1495a703M106K088o454K161O414o633m213R081o80j0699M602Q194r056m291J0017
$$ -1703 2403 4491 -1963 198 6612 -21 -4234 4847 4167 -6532 -1930 6264 -2792 -7083 2934
1510B934l32q532L966N604n420j753N536r66l417L285Q93l021J643K487l675p20
$$ 2934 2602 -5930 -1964 3640 -1780 -3533 2003 1037 -2380 905 1798 -1223 420 2907 -768 -1488
1526a488M283j198m926L283M245o020k690P095j05q143L249P302n998l841P522
$$ -1488 2795 1597 -3329 -46 4199 -1821 -4511 2584 2479 -5664 -2415 4887 -1111 -4952 2570
1541B570M16o379L500L694m699L99M333l504j852M953k487m820N058J909p735
$$ 2570 2986 -3393 107 3801 -898 -499 3834 330 -1522 3431 944 -3876 1182 3091 -4644
1556d644J261O832m281n208O435L273p436N04P427j916n832M594M277n515j316
$$ -4644 -3383 3449 -832 -6040 395 3668 -3768 -3264 4163 2247 -3585 1009 5286 -229 -1545
1571a545N107p26m459K883J318l879P20K421l923m29M317k817m043N725K134p596
$$ -1545 3562 2836 -1623 1260 2578 -1301 -581 1840 -2083 -2512 1805 -1012 -5055 670 2804 -4792
1587d792J401P910m423n854P744K985p530N57P185k782m606M079J740m055Q4K279
$$ -4792 -3391 4519 96 -5758 1986 4971 -2559 -2002 5183 2401 -2205 1874 3614 -441 -357 1922
1603A922j728j238J771j679j431K612m34m049L031L597m298k407O761L15p211
$$ 1922 194 -1044 727 -952 -2383 229 -205 -4254 -1223 2374 -1924 -4331 2430 2745 -4466
1618d466L883N805m919l888O957Q33p136J844N194m127k753L939L36l432J860
$$ -4466 -583 5222 303 -3585 3372 4205 -2931 -1087 4107 -20 -2773 1166 1502 -1930 -70
1633g0R82k805J285K300l872N8N259k101m776M795L550o418j472P440j199p208
$$ -70 912 -1893 -608 1692 -2180 -2122 3137 1036 -3740 1055 4605 -1813 -3285 4155 2956 -4252
1649d252L739M988n041l221N435J84m942J555L278k824n84K530r34j132K375o68
$$ -4252 -513 4475 -566 -3787 1648 1832 -3110 -1555 1723 -1101 -1685 845 -89 -1221 1154 486
1665D86j989K791J606m439J191M773l480l731M369J932o561J28N915k404n446
$$ 486 -1503 1288 2894 -1545 -354 4419 939 -2792 1577 3509 -3052 -2924 2991 587 -4859
1680d859L857L525n188p45M373j027k759K702J389k547J603J881l000O18L511
$$ -4859 -1002 2523 -2665 -3410 963 -64 -2823 -121 1268 -1279 324 2205 -795 -177 3334
1695C334k881k269M762K1n578J790M840m556l917N440J395n896L15N694k601l762
$$ 3334 453 -1816 2946 2967 -2611 -821 4019 -537 -4454 986 2381 -3515 -3200 2494 -107 -3869
1711c869L325K397l402k13K900o59n55J940j189r76K194k81l366J982L281m272
$$ -3869 -544 1853 -1549 -1762 1138 479 -76 1864 675 -301 1893 1612 -1754 228 3509 -763
1727g63k126N449m57o061K988M126m709j997N653k60n007K854L185l385j154L547
$$ -763 -2889 2560 2103 -3958 -970 3156 -1553 -3550 2103 1843 -3164 -310 2875 -510 -1664 1883
1743A883o29k409K343L74k215R05J300k823j8L214j636l338L339K612n077j313
$$ 1883 1254 -1155 1188 1562 -653 252 1552 -1271 -1289 1925 289 -3049 290 2902 -2175 -3488
1759c488O523q41o210L363N325n075k513N559R0m974K207K475l127o6K645k223
$$ -3488 3035 2194 -4016 -653 4672 -403 -2916 2643 2733 -2241 -34 2441 -686 -752 1893 -330
1775c30j292L048j677l156L454J258m680J017M787k631l449M468J984m696N3M677
$$ -330 -1622 1426 -251 -3407 47 1305 -3375 -2358 2429 -202 -3651 817 2801 -1895 -1842 2835
1791B835r45l589K583K976l601j871L620n06l439J269J873k416l41J747j910p90
$$ 2835 1890 -1699 884 3860 259 -1612 2008 1502 -1937 -668 1205 -1211 -1552 195 -1715 -2505
1807b505L101j415k662M178J020m420J614M928l488l454N130J395n170R57M198
$$ -2505 596 -819 -3481 697 1717 -2703 -1089 3839 351 -3103 2027 3422 -1748 -791 3407
1822C407k317k507K509N13k362k21J105n90MN98r11m33J357m32j674J376K300
$$ 3407 1090 -1417 1092 1605 -757 -978 127 -463 -459 139 -772 -1205 152 -280 -1954 -578 1722
1839A722k098j800M363P44m624J299M241l047l614M828J197m954Q80L477k982
$$ 1722 -376 -2176 2187 2931 -1693 -394 3847 800 -2814 2014 3211 -1743 -863 2614 -368
1854c68k051K716l04k030K033M55j826K002Q01k613O88K906j854k549L388J708
$$ -368 -2419 297 -7 -2037 -4 451 -1375 627 1428 -1185 -497 2409 555 -1994 1394 3102
1870C102l937n91L567j192l296J510L040k583k177L115R17l494O09K521j301j209
$$ 3102 -835 -1426 2141 949 -2347 -837 2203 -380 -2557 558 1475 -2019 -1410 1111 -190 -1399
1886a399K227o61j066K002n36k574K874J350m299O37M723k519l731M161J912n514
$$ -1399 828 167 -899 1103 567 -2007 867 2217 -2082 -1445 3278 759 -2972 1189 3101 -2413
1902b413J64M353k241k861K389J960k765j94J716p7q86M32P58k69L26L38o10R5
$$ -2413 -2249 2104 -137 -2998 -609 1351 -1414 -1608 108 31 -855 -423 335 66 392 730 120 215
1920B15R35j182j663K500Q12l570L77L713k202l546M215J948m726L28M688j958
$$ 215 1150 -32 -1695 805 1617 -1953 -1576 2137 -65 -3611 604 2552 -2174 -1846 2842 884
1936H84k886K783J209k774M17J105j103M02Q67j748Q2K244j174k320K603J098
$$ 884 -2002 781 1990 -784 -367 738 -365 37 904 -844 -762 1482 308 -2012 591 1689
1952A689k721k95L300p48l017J057L074k184k241K775J614l266L54L280j515k140
$$ 1689 -1032 -1327 1973 1225 -1792 -735 2339 155 -2086 689 2303 -963 -609 2671 1156 -984
1968i84K182N3k021R23Q36j998O85J468k846j13K992j602k929L704K007m289M65
$$ -984 1198 1251 -770 153 989 -1009 -324 1144 -1702 -1815 1177 -425 -3354 350 2357 -1932 -1467
1985a467M380j554l379K853K081k903p36K265L19k236r2J130p35j051M55q1k94
$$ -1467 2913 1359 -2020 833 2914 11 -725 1540 1859 -377 -469 661 -74 -1125 -670 -751 -1045
2002a045N40p2j222J670P80k659j56L719j196l161K819K702m125m74M518j380
$$ -1045 -505 -577 -1799 -129 651 -2008 -2164 1555 359 -2802 17 2719 -1406 -1880 2638 1258
2018A258l064K826J458k937j77K192j233j410J384m68j276J149K6j666J045J428
$$ 1258 -1806 1020 2478 -459 -636 1556 323 -1087 297 -171 -1447 -298 -272 -1938 -893 535
2034E35k069j63K423K8k406J328K673j607k349K611J547l047r49L357p14l045
$$ 535 -1534 -1697 726 754 -1652 -324 2349 742 -1607 1004 2551 -496 -1445 1912 1198 -1847
2050a847J819J604k239l50J901r86l13J269r38n11J968p85j953J959J291k929
$$ -1847 -28 1576 -663 -1013 888 -98 -411 858 -80 -591 1377 592 -1361 598 1889 -1040
2066a040m77L615j042k897J973K000k409j231K466K05k027M12J627r59r83J050
$$ -1040 -1517 2098 1056 -1841 132 2132 -277 -1508 958 1163 -864 -452 1175 216 -767 283
2082B83J56m19N1M10o29M69P94j149o32K111m78k669K023J669l038q06L564j045
$$ 283 439 20 71 481 -148 321 1115 -34 -666 1445 967 -1702 321 1990 -1048 -1854 1710 665
2100F65l458K263K085k693r05K681l26j571J285M85j060N04M11m38K10R45r92
$$ 665 -2793 -530 1555 -1138 -2043 638 312 -1259 26 511 -549 -45 366 -72 138 1083 91
2117I1o20J542j3k157N40K128j595j980K044J125k679l46K826n01k605J556J911
$$ 91 -529 1013 1000 -1157 -617 1511 -84 -2064 -20 1105 -1574 -1920 906 405 -2200 -644 1267
2134A267k185j35J629n64r15J266J60j156J204K37j515O82J783k235o44K127N8
$$ 1267 -918 -1053 576 12 -903 363 523 -633 571 808 -707 -25 1758 -477 -1121 1006 1064
2151A064k921J400K170k020j796K601P90k532K7K656p58j913J314Q23p59j32O44
$$ 1064 -1857 -457 1713 -307 -2103 498 1288 -1244 -1217 1439 681 -1232 82 905 146 14 658
2168F58k02l67N15m87n36J009j12j638J338J421k258p54K844n63k312J338K278
$$ 658 456 89 604 117 -419 590 478 -1160 178 1599 -659 -1413 1431 868 -1444 -106 2172
2185B172k079j278K282N46k331M61J225p59p30R05k00l89M08j67p01R91Mj489
$$ 2172 93 -1185 1097 1643 -688 -227 998 239 -491 414 214 -175 233 66 -635 356 360 -1129
2203a129M33J471p02j722K009J183k211n66K772m87k497J519J736j811j003J765
$$ -1129 -696 775 73 -1649 360 1543 -668 -1234 1538 1051 -1446 73 1809 -2 -1005 760
2219G60J08j842M65Q93q56M6J96n95K49O81r35p97J861L41j863N57K179j198k111
$$ 760 868 -974 -509 384 -472 -426 -230 -825 -576 105 -830 -1627 234 575 -1288 -731 1448 250 -1861
2238a861K453R54k456l43K623o44j875J296J035j505n66J127k22o70O03j18l20
$$ -1861 592 1546 -910 -1253 1370 726 -1149 147 1182 -323 -889 238 16 -654 -51 -169 -489
2255d89N93N9j051P94Q65j295p37K029M37k475P58K313j542j991K402P19k149
$$ -489 104 163 -888 -94 771 -524 -1261 768 1205 -1270 -512 1801 259 -1732 670 1389 -760
2272g60q5K176p90j827J447Q32j421K94O78l57oL31l91r3R85n68j106J088J009
$$ -760 -845 1331 541 -1286 161 993 -428 -134 544 187 181 512 121 28 1013 445 -661 427 1436
2291A436j928n23K233o15k049J192J399j819o49J965J83j688L86J258l43q42O97
$$ 1436 -492 -1015 1218 603 -1446 -254 1145 -674 -1323 642 825 -863 -477 781 438 -404 293
2308B93L65o84J62M51q01O80N37j462P1J354n80j997J715J224k224o30K334o23
$$ 293 658 -26 136 587 -214 466 1003 -459 -388 966 386 -1611 104 1328 -896 -1526 808 185
2326A85k273J557J278j542k92J738k80q66P68Q4m05L65K76l37j87M67o01n86J105
$$ 185 -2088 -531 747 -795 -1087 651 371 -495 273 357 -48 317 593 256 69 536 -65 -651 454
2345D54O9j681L80J422r33j475J748O58j911j59K344n84j739J285J174j376n85
$$ 454 523 -1158 -778 644 -289 -1764 -16 642 -1269 -1428 916 332 -1407 -122 1052 -324 -909
2362i09J513k14p96M33L87m01L78J67j021M90R68j364n05J528k17j745O91J581
$$ -909 604 390 -406 27 414 13 391 558 -463 27 995 -369 -874 654 437 -1308 -617 964
2380I64j169j237J472Q68j674M6J786l91j085J006K65n90j73M78m53j36K61l60
$$ 964 -205 -1442 30 898 -776 -730 1056 665 -420 586 851 261 88 566 113 -23 238 -122
2398a22j80O08r2j184R20J010j468k76J756j76j669Q20J614j685o25J295K90j158
$$ -122 -302 306 214 -970 -50 960 -508 -784 972 796 -873 -53 1561 -124 -749 546 836 -322
2416c22P4J100o21o02L80K5J8K77l25j97N10j67p64M12R00o62j192J118J009j494
$$ -322 -248 852 231 -371 9 34 52 329 4 -193 317 150 -614 -202 698 36 -1156 -38 971 -523
2436e23l10J481%j686Q40J539j362p07J402j68r77M21K50m14j95O05q33J22J159
$$ -523 -833 648 648 -1038 -198 1341 -21 -728 674 506 -471 -50 200 -214 -409 196 -637 -515 644
2455F44q93m20J104K74j545N52J146q32j242J233N30j592n9J196n6p17M39Q79
$$ 644 -249 -669 435 709 -836 -284 862 30 -1212 21 551 -1041 -1100 96 40 -677 -238 641
2473F41o23m78L90N61o92K72J67l98J75N05q58M30O97j046n09J399J26j802Q70
$$ 641 18 -460 -70 491 -201 71 238 -160 15 520 -338 92 789 -257 -766 633 759 -1043 -173
2492a73J097j023j035J669k4j363N9J117n73k83Q09L03k90L29j43j53J88L50p21
$$ -173 924 -99 -1134 535 511 -852 -793 324 -249 -532 277 580 290 619 476 323 511 861 140
2511A40K24N08l76j158P76N26j041o38J410J40j709P25J335r88j245J558P11j414
$$ 140 364 872 496 -662 114 640 -401 -1039 371 511 -1198 -473 862 -126 -1371 187 898 -516
2529e16K86J117n40n18N75n8j17J89r9k77N70L12j251L19O05o18j074J283M0j010
$$ -516 -230 887 347 -171 404 346 229 418 319 42 612 924 -327 -8 597 -21 -1095 188 228 -782
2549g82m53J347m09p26L77Q57o83l47J293k97l19J64L81k13J8L09m37j80M50o30
$$ -782 -1235 112 -297 -1023 -646 211 -472 -819 474 177 -142 22 403 190 208 517 80 -100 350 -280
2569b80m69J057K21j623N18J525j035j049J557n1j055J20J116o60n69O97K90n57
$$ -280 -749 308 529 -1094 -576 949 -86 -1135 422 371 -684 -564 552 -108 -677 20 310 -247
2587b47k85N51J26l85L47k1j9M98k75m98L90J1r1p07Q70J20p91k54J496o15j269
$$ -247 -532 19 145 -240 107 86 67 565 290 -208 182 193 102 -605 265 385 -406 -660 836 221 -1048
2608a048J345O47j201r2J273n64p68L47M35n07K41K04o07L27L46p39L08O87m69
$$ -1048 297 944 -257 -349 924 360 -408 -61 374 -133 108 312 -295 32 378 -361 -53 634 165
2627A65m25M52P32q16l20O68M0j013K95R64o58p45O79O15j108J64Q06k94n58P46
$$ 165 -260 192 924 108 -212 456 496 -517 -222 742 84 -661 18 633 -475 -311 495 201 -357 389
2647C89j42o28M23J69n74M11K78q13J39P90l64p49Q99R55j496p5J187m92p45K92
$$ 389 247 -381 42 211 -363 48 326 -487 -348 442 78 -671 228 1183 -313 -388 799 307 -438 -146
2667a46O54m55l72L0L84m70l1K73J99k13J28l23K15M84n32l21R11k13p32K07Q10
$$ -146 508 53 -319 -289 95 -375 -406 -133 66 -147 -19 -342 -127 357 -175 -496 415 202 -530 -323 487
2688D87o26q67Q92N46q05j81J002l5p41O53K56o26q7M29k83m9K24k31k48L54P7
$$ 487 -139 -1006 -114 432 -373 -554 448 413 -328 325 581 -45 -132 297 14 -35 189 -42 -290 64 141
2709A41o17N38N77q29k57Q46K79j353L03R91n41p44R40N03j145l1O30J73q79O48
$$ 141 -476 62 639 -190 -447 399 678 -675 -372 619 78 -666 274 777 -368 -399 231 404 -475 173
2729A73J89m56J41J22Q5N8J29l93l04O84m42p25O96O54j323N9Q72j49p06N69O47
$$ 173 362 -94 47 169 254 312 441 48 -256 428 -14 -739 -43 611 -712 -653 219 70 -636 -67 580
2750E80q19q9O94J53q59M08L7k6j29O3J09j80L76k84j12M78m7n49J01L62k99p16
$$ 580 -239 -328 366 519 -340 68 105 79 -50 13 122 -58 318 34 -78 400 353 -196 -95 267 -32 -748
2772g48N88M57p83n3P37o7n71Q3P54n77k33M75K71l62M0k6K8j23L2j91J98M30
$$ -748 -160 297 -486 -539 198 131 -440 -357 397 -180 -413 62 333 -29 11 -15 13 -110 -78 -269 -71 359
2794C59m57l43N92R6o16K01O88l83p33O62M23r23J4P22k26o22L05N48l57n2K91
$$ 359 -98 -441 151 247 -369 -168 520 137 -596 66 489 -434 -420 302 76 -546 -241 307 -50 -102 189
2815A89j55j27J2j58K7N27k00m44K72N53o28o13R31m1o54N15Q65n93n54N53K55
$$ 189 34 -93 -81 -239 -212 315 115 -329 -57 496 -132 -745 186 145 -509 6 871 278 -276 277 532
2836E32o35N7J79L6l57Q9K36p6k91l5o7K27K52n08K06L67r2l77L05L94o43j37
$$ 532 -103 -46 133 169 -188 -99 137 61 -230 -265 -332 -105 147 -361 -155 212 120 -257 48 442 -201 -338
2858c38O88po66K64L28k14m43R02l4o49K26J52j85K0q2J7k49L34j11j46n8K19
$$ -338 350 343 -323 -59 269 55 -388 514 480 -169 57 209 24 44 -38 -21 -270 64 -47 -193 -251 -32
2880c2l17M1O52m05l53N59O16r80Q8N74j03n42K78J51l86k45L41K66l93J08M1
$$ -32 -349 -308 344 -61 -414 145 761 -219 -131 443 340 -202 76 227 -159 -404 -63 203 -190 -82 -41
2901d1k9J14R0NP1Q4m09p7L81j81l27K28K02j53k92L82L19o89J2O61qm50J96J65
$$ -41 -70 44 134 139 210 294 -115 -192 189 8 -319 -91 111 -42 -334 48 367 -322 -310 351 343 -107 89 254
2925B54j18l28J58k82K62n1j46q4P02k32l66L46N56o85k49N96J58p48J60L99l63
$$ 254 136 -192 -34 -316 -54 -105 -251 -335 367 135 -231 115 671 -14 -263 333 491 -257 -97 302 -61
2946f1o76O41L66k27m18N39J20p67P51K21l87J19j37j14K11p6l28J90J23k43m86
$$ -61 -737 -96 270 43 -375 164 284 -483 268 489 102 221 84 -30 181 105 -223 -33 90 -153 -639
2967f39O31M56q00M4P78n3n92L64J41k29l42k0M96j32k28J1J82l4m2J11J88k5
$$ -639 -8 448 -352 -308 470 417 -175 189 330 101 -241 -261 235 103 -125 -114 68 34 -8 103 291 266
2989B66k43o3L98J63q48k9P87l04n81L06K45o09k89J464k91p29K74L43l60k91
$$ 266 23 -40 358 521 -327 -356 431 127 -454 -148 97 -512 -801 663 372 -357 -83 260 -100 -391
3009c91L34J54M3l31RN5K46k43J33p3N4J8m01N33K05l34J09M57m14n44M49L74
$$ -391 -57 97 140 -191 -182 -127 119 -124 9 -64 -10 8 -393 140 345 11 120 577 163 -381 68 442
3031D42n31m33N79P7n10L34J12k3j44K22j91O2J89k05l6J82R4o71N82K15l56l02
$$ 442 -89 -522 57 134 -376 -42 70 47 -97 125 -66 -4 185 -20 -56 126 220 -451 131 346 -10 -312
3053c12M62j34k40K22K46j79m56O52K84n15l8l7ro3j8Np2R2p8Q5P4M33m54M6J89
$$ -312 150 16 -224 -2 244 65 -391 261 545 30 -8 -45 -54 -117 -135 -130 -202 -110 -188 -103 -29 404 -50 -4 185
3078A85J62l71O4J17l44j14M39O8l84R0N29m40k68L10JK18n10M06k03J14k19K14
$$ 185 347 -24 40 157 -187 -301 138 206 -178 -88 441 1 -267 43 44 262 -248 158 -45 69 -150 64
3100F4j86R1o9j39K90j4l96J15P28l36l46L55M82n34m73P86r5n26J26K73r0m21
$$ 64 -122 -31 -100 -239 51 37 -359 -244 484 148 -198 157 639 105 -368 418 323 -203 -77 196 106 -315
3122c15M49k64j19L44lk26L65M5m32J89L70n86j45L89j04l53K07L16j44l54N60
$$ -315 134 -130 -249 95 92 -134 231 276 -156 33 403 -183 -328 61 -43 -396 -189 127 -17 -371 189
3143A89k31J26r9P8R7l62L9K31j31J01N3j61k3J79O0k88K02Mk11L07K51q95M5
$$ 189 -42 84 -15 63 160 -202 -163 68 -63 38 91 -70 -93 86 146 -142 60 64 -147 160 411 -484 -439
3166d39N85J12o96r2O01o4k96M42M9n56K74J97j5N1m3L48l77L0k8M2L98n97KJ30
$$ -439 146 258 -438 -530 71 7 -289 153 202 -354 -80 117 102 153 110 458 81 111 83 125 523 -74 -72 58
3190E8J8j69J9K4L91l85n7J94J14m07J77K77k24j16j37J80j74K60k34K45j5qr8
$$ 58 76 -93 -74 -50 341 -44 -101 93 207 -200 -23 254 30 -86 -223 -43 -217 43 -191 54 39 31 -67
3213f7K7L37l80m2L95k72j19J58K75l77m54N57K21m25k27J42N65m34O5K26j23
$$ -67 -40 297 -83 -125 270 -2 -121 37 312 -65 -519 38 259 -166 -393 -251 314 -120 -55 171 48
3234D8K7k13k3M8P6J48j15k39R1j0L0K62k60r9L66K21n29J73M90l71k13J14J21
$$ 48 75 -138 -161 -113 -37 111 -4 -243 -152 -162 -132 130 -130 -229 137 358 -171 2 492 121 -92 22 143
3257A43k79Jo3j36J30j86N92P0m64L90j45J30j33QqJ2k4l55J84J66L0n36N44L79
$$ 143 -136 -135 -198 -334 -204 -390 202 272 -192 198 53 183 50 58 50 62 38 -317 -133 33 63 -473 71 450
3281D50k79p3N01k93k40k78M78l06P6l4j38l16J16J03J54J06j27j4P2N69m72J41
$$ 450 171 98 599 306 66 -212 266 -40 36 2 -136 -452 -336 -233 -79 27 -100 -114 -42 527 55 196
3303A96O1n6l81J19L78m49l44N25J29k11J01r1M6n2p2K98M5l52K63R6j70n5l11
$$ 196 257 201 -180 -61 317 -132 -476 49 178 -33 68 -23 23 -29 -101 197 242 -110 153 249 79 24 -287
3326b87J97O4k98O0K58q8J95J00r1R7l19MN13l94j04K18J65n31J97j73K76J7j51
$$ -287 -90 -26 -324 -264 -6 -94 101 201 110 207 -112 -108 405 11 -93 125 290 -241 -44 -217 59 76 -75
3349g5O7P2n1n1M94n56M34n18K72j83J71j17l08K83L6l95L06J59k23J57K57q8
$$ -75 -8 64 13 -38 456 -100 334 -184 88 -95 76 -41 -349 -66 -30 -425 -119 40 -183 -26 231 143
3371A43k84L40L48n73M8K32N9m56K19j45r6n2k0M47k44J47k80L6M95j99k77J66
$$ 143 -141 199 547 -26 22 254 313 -143 76 -69 -165 -217 -237 210 -34 113 -167 -131 364 165 -112 54
3393E4K25m78j88M56j07m7k12M29J3l86L23J16J5l87J03J59j00j66J68j20J38
$$ 54 279 -199 -387 69 -38 -85 -297 132 145 -241 82 198 213 -174 -71 88 -12 -178 -10 -130 8
3414Hj73j50L50N1j83j78N08l54L06q2j37j13P5K75p3q4j67Q6J05l61L69j18K20
$$ 8 -165 -315 35 86 -97 -275 233 -121 185 103 -34 -147 -72 203 130 46 -121 -35 70 -291 78 -40 180
3437A80k77PN67l01K30o08L79J00l17J26k0k05l5q8M99Q8o25R1N55l92rJ63Q6
$$ 180 -97 -90 477 176 406 -202 177 277 -40 86 66 -139 -174 -262 237 325 -300 -209 346 -46 -55 108 194
3460A94Q8k40K8L0j79p1R2K8J37J1j21M5K05k44J0L20N3n16M9K13k63j46R0K28
$$ 194 282 42 70 100 -79 -150 -58 -30 107 118 -3 42 247 3 13 333 386 -130 -81 132 -131 -277 -187 41
3484D1k60K15q6J32K5Mm6n6p3K85m4K04l09k0l2J48l26j83M68j60k94M52J7k2
$$ 41 -219 -4 -90 42 67 71 25 -31 -104 181 137 341 32 12 -20 128 -198 -381 87 -73 -367 85 102 80
3508H0k92L51Kk29K91k61J28j85NL53k38k84J94j69J84j22J91n5MN0p2J39J31
$$ 80 -212 139 141 -88 203 -58 70 -115 -110 243 5 -279 -85 -254 -70 -192 -1 -56 -52 -2 -74 65 196
3531A96l09m8L62j48k11P4N17m76R2o8J45l28J70K86k96K28k48M1L7q6L8O7j75
$$ 196 -113 -161 201 53 -158 -84 433 -43 49 -19 126 -202 -32 254 -42 186 -62 -21 16 -70 -32 35 -140
3554a40K08j84k1M78j34m18K82k9L3k51K94n8m40R2N47l73j02J58n8j04L43K39
$$ -140 68 -116 -137 341 207 -211 71 42 75 -176 118 60 -380 -288 259 -114 -216 -58 -116 -220 123 362
3576C62l00j14Q9j77K07L5k35J70J37j60j61P4Q6l35N4N08j88qp5J1K54m74J31
$$ 362 62 -52 37 -140 67 102 -133 37 174 14 -147 -73 13 -322 -268 240 52 44 -31 -20 234 -240 -109
3599a09J85q3j03q3K71k86J41j02L11q3n9q1K80Qk95N5K82l26j5j33K95k8j41
$$ -109 76 -7 -110 -193 78 -208 -67 -169 142 59 0 -81 199 207 -88 -33 249 -77 -92 -225 70 42 -99
3622i9q3L19m30K41J65J31l87R6K14j43k24L43J26j74k09K16M2k93l1mJ41J49
$$ -99 -182 137 -293 -52 113 244 -143 -47 167 24 -200 143 269 95 -114 102 144 -149 -180 -184 -43 106
3644A06O5j64J91k15j26N31k5l54l2k1L1j66QJ38LJ13M1p9K5o7r3Q6R0k8j26j09
$$ 106 171 7 198 -17 -143 388 363 9 -23 -44 -13 -179 -171 -33 -30 83 124 45 70 3 -90 -4 86 58 -68 -177
3670a77K03j49nj41J80O9q3R5kk27K21K73k35kk9L17k27k54O7j85J53L21J00j47
$$ -177 26 -123 -128 -269 -89 -20 -103 -8 -10 -237 -16 257 22 20 -9 308 81 -173 -106 -291 -138 183 283 136
3694A36J36k24j90M48n44k2P4J83K82l92J12oq0j03L75%m66Q3K63r7Oj64K27K62
$$ 136 272 48 -142 306 -238 -260 -186 -3 279 -113 -1 -7 -87 -190 185 185 -281 -198 65 -32 -26 -190 37 299
3718B99m18J54N2O9p0l28L90J73l36J18J98j87m01R7L60j9k00mK08J09k10J7m1
$$ 299 -119 35 87 156 86 -242 148 321 -15 103 301 114 -287 -190 170 151 -49 -53 155 264 54 71 30
3741C0k45j59m9M78k17J11k7p0J33OM0L95o11Q5J43q5K79l85N7L08l12j8K85j11
$$ 30 -215 -374 -423 55 -162 -51 -78 -148 -15 -9 31 426 -185 -100 43 -42 237 -148 -91 217 -95 -113 172 61
3765F1k49K95p8qr1rM2J69j06Op6J46j97j22J53L00j50O8q5J4Q9pl3J57k61J57
$$ 61 -188 107 29 21 -70 -79 -37 132 26 32 -44 102 -95 -217 -64 236 86 154 69 83 172 165 132 289 28 185
3791A85O6n56K08K08k09J96k06K32j33n3J46J54m1k53O3J04j38J11j82J03r6j59
$$ 185 251 -305 -97 111 -98 98 -108 124 -9 -62 84 238 197 -56 7 111 -27 84 -98 5 -91 -250
3813b50K25l8J49j57L8Q0m3j01J61L08n21K46n3j5j39J51j5j59on1K24m7K39k53
$$ -250 -25 -63 86 -71 -33 47 4 -97 64 372 -149 97 44 29 -110 41 26 -133 -139 -190 34 -13 226 -27
3837b7Lj77L07m01J98J55r1k51K50J62l81pK21l22J7K99m3K17j87O0K8K34k15
$$ -27 -24 -201 106 -295 -97 58 -33 -284 -34 128 -253 -260 -39 -361 -344 -45 -88 129 -58 2 30 264 49
3860D9j29J10l18K16k0K17j36j61K15kJ55m96M84j97k66K19M06l75q9k4J95r6
$$ 49 -80 30 -288 -72 -92 125 -11 -172 43 41 196 -300 184 -13 -279 -60 346 -29 -118 -142 53 -43
3882d3k00M60j86J2R8n0Q2j02O4Oj09j23j56L85l4Q0k76r8Q7J55j68J12K87k73
$$ -43 -243 217 31 43 141 91 173 71 135 141 32 -91 -247 138 104 184 -92 -190 -103 52 -116 -4 283 10
3906A0j2J39m8k54K02k32J63Q4k19J46M6k67J53J67K6k31J50p0p3j70K50K8k90
$$ 10 -2 137 89 -165 37 -195 -32 52 -167 -21 25 -242 -89 78 104 -127 23 -47 -120 -290 -40 -12 -302
3929c02K51K79k49k40J91J82l42k2L10Q3j89k20K66rJ22k03R7K22m20K34r0j9
$$ -302 -51 228 -21 -261 -70 112 -230 -252 58 141 -48 -268 -2 -11 111 -92 5 227 -193 41 -49 -68
3951f8J26r9PR4J23l31N2J11J82o05M83r0J96l07K04mm64L19j8J27k53K27K55
$$ -68 58 -41 -34 60 183 -148 -96 15 197 -408 75 -15 181 -126 78 74 -390 -71 -89 38 -215 12 267
3974B67m07K30J66k42L03l69n4r1K56l2J07k16K93j75K8r3J94k55J00K02l46O
$$ 267 -140 90 256 14 317 -52 -106 -197 59 27 134 -82 211 36 64 -29 165 -90 10 212 -134 -128
3996a28R2K2L2l01J33j11K27j43J57K8m4p0L53Lj19k06K12O9j13j42qJ04m5M5
$$ -128 -36 -14 18 -283 -150 -261 -34 -177 -20 8 -36 -106 247 250 131 -75 137 206 93 -49 -57 47 2 47
4020D7P0j09k96K78P4M6J05k29K67j81J02j69l59L56j72K83r5j14k23J6K07O2
$$ 47 117 8 -288 -10 64 110 215 -14 253 72 174 5 -354 2 -170 113 18 -96 -319 -303 -96 -34
4042c4j61K81K13k33m9J7rj57K60N0k40J53k52Jj94L07N9J86%l72L04J7j8j20
$$ -34 -195 86 299 66 17 34 25 -132 128 178 -62 91 -161 -160 -354 -47 12 198 198 -174 130 147 129 9
4066Ij17J20j07j16n4N48l68j72J99K20m5k02K11K1R1p3l95K59n9P1j91K00m75
$$ 9 -108 12 -95 -211 -265 283 -85 -257 -58 162 117 -85 126 147 238 165 -230 29 -30 41 -150 50 -425
4089d25L13o0L42k67j40J36N8j19J75k43N81m00J53l9o6n7k23L33p2j33K04J49
$$ -425 -112 -172 170 -97 -237 -101 -43 -162 13 -230 351 -49 104 65 -1 -58 -281 52 -20 -153 51 200
4111B00j24j07N0L26j8k24k04K70j49q7j38K3J96L8j91L43k26p7K90j42j67O1
$$ 200 76 -31 19 345 327 103 -101 169 20 -67 -205 -182 14 52 -139 204 -22 -99 191 49 -118 -57
4133e7J87j0j93J27r8K71j34J43k70J67j9k98r5N87k15j77L18j64l7K0J71k16
$$ -57 130 120 -73 54 -44 227 93 236 -34 133 114 -184 -279 308 93 -84 234 70 33 53 224 8
4155HK2k63J49p9K36j33K40k99J15j29K00m8k24N64l68M3l3R9k60K09k09J71L30
$$ 8 30 -233 -84 -163 73 -60 180 -119 -4 -133 67 19 -205 359 -9 34 1 100 -160 49 -160 11 341
4178C41k72j7Q9N0k7K8o6j23j80j00N14l11l8j25O1M21m29J85n8R3K7J7j20J44
$$ 341 69 52 141 191 164 192 126 3 -177 -277 237 -74 -112 -237 -176 245 -184 1 -57 36 63 80 -40 104
4202A04j42K72l73Mm5J83P7j93j91M38m7j85Q6J89r9p3j21K25q2j63r6J07L92
$$ 104 -38 234 -139 -135 -180 3 80 -113 -304 134 87 -98 -12 177 78 5 -116 109 27 -136 -232 -125 267
4225B67m46O4J44m4J03Jj70M6m9J57o8M3r5J85O1m56L16o6O9k3k35N6N54m04r1
$$ 267 -179 -115 29 -15 88 89 -81 -35 -84 73 5 48 -47 138 199 -257 59 -7 62 39 -196 -140 414 10 -81
4250h1J98k87M53l86j9J16o9K29O1j31k31J34nJ58k95K02k3q1K28j33J9L2j51
$$ -81 117 -170 283 -103 -122 -6 -75 154 215 84 -147 -13 -18 140 -155 47 24 -57 171 38 57 89 -62
4273f2J39N4L4o5mO5l18J77j17L29l13R6o8K04j86j5J18m0k7n70N63n9j22K13
$$ -62 77 131 165 100 96 161 -157 20 -97 232 -81 15 -53 151 -35 -50 68 28 1 -569 -6 -65 -187 26
4297B6P1p5p2j93K48J01j50j91K99j20J28l57N22k10j29J34k9k79R3K12J1J15
$$ 26 97 22 -50 -243 5 106 -44 -235 64 -56 72 -285 237 27 -102 32 3 -276 -183 29 40 155
4319A55j63J92l07N9p8n2K65l17K53J19k44P6j9J88m1K18j84K6j19K02l27K58
$$ 155 -8 184 -123 -64 -142 -194 71 -246 7 126 -118 -42 -61 127 86 304 120 146 27 229 -98 160
4341A60P4j64n4j37j33J25o1K14J69j89J23l4N3o5M2R3k20j90L79J76m96k9K26
$$ 160 234 70 16 -121 -254 -129 -190 24 193 4 127 93 146 81 123 216 -4 -194 185 361 -135 -164 62
4364F2J38j10l93K68L46k45j23R3K42l59J44J45k36qp3J1j5J6Jj0J38J8n2J9K86
$$ 62 200 90 -303 -35 311 66 -57 36 278 -81 63 208 -28 -36 -109 -98 -113 -97 -96 -106 32 50 -2 17 303
4389C03k23Q1p5j91%K30Kk77K08l6r0J26Oj4K07j22k69J42Q1J84j66k0j63Q6J33
$$ 303 80 161 86 -105 -105 125 127 -150 58 22 -68 58 64 50 257 135 -134 8 89 273 107 87 -76 10 143
4414A43j61J86q6q3L69m94J44n9J19N7m79N15J4k16j8j41K22J73k00J00j39j47
$$ 143 -18 168 82 -1 368 -126 18 -41 78 135 -344 171 185 -31 -49 -190 32 205 5 105 -34 -181
4436a81J19J94j23mk35K84Q3op8J9J1l41J98J12j75k87M84M3k08P3K5j09K10k01
$$ -181 -62 132 9 5 -230 54 137 131 53 72 83 -258 -60 52 -123 -410 74 117 -91 -18 7 -102 108 -93
4460i3l6K07R2K9j15J41k63l27M00J53p3j90J33M2l1M7j22J51l69J29m6J12O5
$$ -93 -129 78 170 199 84 225 -38 -365 35 188 115 -75 58 100 69 116 -6 145 -224 -95 -141 -29 36
4483C6m3o5K96m16J36l1J27n0p0J94q2r9K53j58j04k27M98j3l04J38J62j60k34
$$ 36 -7 -72 224 -192 -56 -87 40 -10 -80 114 32 -67 186 28 -76 -303 195 182 -122 16 178 18 -216
4506b16J86K93j60p0k43L02k78L68j81o3J10j48l8O8L3L35k73j35M3OJ2K35J37
$$ -216 -30 263 103 33 -210 92 -186 182 1 -62 48 -100 -138 -70 -37 298 25 -110 -67 -61 -49 186 323
4529C23n26L36N4k18j49M23k82K20k19J15P7l03M8J10J1J30j94k14K61n5j96k7
$$ 323 -203 133 187 -31 -180 243 -39 181 -38 77 154 -149 -101 9 20 150 -44 -258 3 -52 -248 -275
4551b75K62j41J03J65J81m68K60MM2J28lj04%k03o5K86K4j61l2j53J11J21k81
$$ -275 -13 -154 -51 114 295 -173 87 91 133 261 258 154 154 -49 -114 172 196 35 3 -150 -39 82 -199
4574a99L35j90p0O4J69j19N3MJ21j44j51L49L1k0k80J26N0l89J17J53k1j63q1
$$ -199 136 -54 -124 -60 109 -10 43 47 168 24 -127 222 253 233 -47 79 129 -260 -143 10 -11 -174 -255
4597b55L38P9j12k57N37n59N40l21J31l7k07K99m1K01l75KR0N9q0j10L03k23n8
$$ -255 83 162 50 -207 330 -229 311 -10 121 84 -123 176 135 336 -39 -37 53 112 32 -78 225 2 -56
4620e6l9O0j77J50o7L58j41R4j48q8J24l63K01L12l31k69L31J41l41K1L36l15
$$ -56 -95 -35 -212 -62 -129 229 88 182 34 -54 70 -293 -92 220 -111 -380 -49 92 -249 -228 108 -207
4642b07J02j61L80m4k27K06k25L20j03R5L0n0k17m8K47n7q1j45L69j74j03J27
$$ -207 -105 -266 114 70 -157 49 -176 144 41 136 166 116 -101 -149 98 41 -40 -185 184 10 -93 34
4664C4J83k34J25p9J74j21l62M11j82J53j69K07k58J06k7j39M35k24k11J41j07
$$ 34 217 -17 108 29 203 82 -280 131 -51 102 -67 140 -118 -12 -39 -178 257 33 -178 -37 -144
4685a44P6rj05K45j30K56l43j46K82lJ46l10K74K67l83J2J10Kp6j9Q5j32N4j43
$$ -144 -68 -77 -182 63 -67 189 -154 -300 -18 -21 125 -185 89 356 -27 -15 95 97 21 2 87 -45 9 -134
4709a34j05J95J73j91j31J30K16m21J79J15P7j29L2o6J17J4j6n6l3j46j67K91
$$ -134 -239 -44 129 -62 -193 -63 153 -268 -89 26 103 -26 6 -60 57 71 55 -1 -34 -180 -347 -56
4731e6K01k57l2L27o8k50M4K89l81Q7N7J49j09J5%R9j69k9j10K41k23K73j47m0
$$ -56 145 -112 -144 183 115 -135 -91 198 -183 -96 -39 110 1 16 16 115 -54 -83 -193 48 -175 98 -49 -89
4755h9L75k91RL00j44J2k0l9l7j08P3m7kj01N6Q3j6J1N6j12K4Q3L1l39J32J71
$$ -89 286 -5 4 304 160 172 152 113 76 -32 41 -6 -8 -109 -53 30 14 25 81 -31 -7 76 107 -232 -100 71
4781G1N8q2m4L5J92j26j4K18l00k17KR8J51p6O7j04K28m13K89O3k9l33J97J04
$$ 71 129 47 3 38 230 104 90 308 8 -209 -207 -109 42 -34 33 -71 157 -256 33 96 67 -266 -69 35
4805C5p0p3k92N90k12O2k44L19k87L38q1J52j44J4o0mJ81l41K28j78J89k33J78
$$ 35 -35 -108 -400 190 -22 40 -204 115 -172 166 85 237 93 107 47 43 224 -117 111 -67 122 -111 67
4828F7L22m65N9K43k30p2q0P7R7j87P8L2J6j00K74J05k3l40O4j11R6p0o4N42l57
$$ 67 389 -76 -17 226 -4 -76 -156 -79 18 -169 -91 -59 -43 -143 131 236 213 -127 -63 -174 -78 -148 -212 330 -27
4853b7k83K70K01l45J71J74k40L53n15K24L69l29R1J75n11p4M69k0k14j2O3K27
$$ -27 -310 -40 161 -184 -13 161 -79 274 -241 -17 352 23 114 289 -222 -296 173 153 -61 -73 -10 217
4875B17k13O1k23J69O4j48n4J67J81l56J0J69k3k82K58Q4j39k13L13P8p5j42K97
$$ 217 4 65 -158 11 75 -73 -127 40 221 -135 -125 44 21 -261 -3 81 -58 -271 42 120 45 -97 200
4898B00r1p9K14r5n2j34j5Q8P9k10j24J41K40k22qr9Q0L30l85L56Rm59R9J2j36
$$ 200 109 30 244 149 97 -37 -52 36 115 -95 -219 -78 162 -60 -68 -167 -87 243 -142 214 223 -236 -137 -125 -261
4923b61J83L7L52m09o8J20o8K55j70j5K32k04J27l27k2L58j69Q5j2m6L47l08l6
$$ -261 -78 -41 311 -98 -166 -46 -114 141 -29 -44 188 -16 111 -216 -238 120 -49 36 24 -22 325 17 -19
4946a9Q0j04J12j67k2K68n8J41l19J45O1l79J85j04J43J60k7j41J70n8l03J90
$$ -19 61 -43 69 -98 -120 148 90 231 -88 57 118 -261 -76 -180 -37 123 96 -45 125 67 -236 -46
4968d6O1q2j75M23l21k9L9j07N16l61j58K15K63k16PJ10m5l1k70K72J45k64K13
$$ -46 15 -67 -242 181 -140 -169 -130 -237 279 -82 -240 -25 238 22 29 139 94 63 -207 65 210 -54 159
4991A59k92M6Q8p5l0J19j67q7M05o8l99J00J35J99m3p8j53N4J94k11K15j89J55
$$ 159 -133 -87 1 -74 -104 15 -152 -239 166 98 -301 -201 -66 133 90 12 -141 -87 107 -104 111 -78 77
5014G7k09K85p9k18K38j40n6J8R6N8j00l1PJ50l71L33N2l2l28L04j87J39%j43
$$ 77 -132 153 74 -144 94 -46 -102 -84 12 70 -30 -61 -54 96 -275 58 110 78 -250 54 -133 6 6 -137
5038a37M32k67K5R3l08J67J26j5j3j98J09J26q4q8K48k51K27k17k8K79j62q0j23
$$ -137 295 28 53 146 -162 5 131 116 103 -95 14 140 56 -32 216 -35 192 -25 -53 226 64 -16 -139
5061a39J16qJ7j43K62l70J7K49p6nK77o8j21K5j22n6J87J82m83P7M24j8l74J64
$$ -139 -23 -31 -14 -157 105 -265 -248 1 -75 -80 197 129 8 33 -89 -145 42 224 -259 -182 242 224 -150 14
5085A4O3%k67L64l11J75k04Q5q2KL5j2J70j95Q3J53j17l2K9J97j40j1J64j99r2
$$ 14 77 77 -190 174 -137 38 -166 -81 -163 -161 -126 -138 32 -163 -80 73 -44 -76 -47 150 10 -1 163 -36 -128
5110a28m0p2L08p8j28L14l8r0j4J16J66m87m2J95o2L1Jk7J84l01J88Rk6k8n5Q6
$$ -128 -168 -240 68 -10 -138 176 138 48 34 150 316 -171 -213 -18 -80 -49 -48 -75 109 -192 -4 5 -21 -49 -104 -18
5136a8M0M0m3j44Q0k7Q4J88l03J73j2O4Rr9L74m52j5k26L17ok0J43o5m3k6O2j74
$$ -18 22 62 19 -125 -45 -72 12 200 -103 70 58 122 131 32 406 -46 -61 -287 30 24 4 147 82 39 13 75 -99
5163i9L12l1j14k8O0l9j14L3q9J30k5K43P6k70M2O5j79j40J02J93J28k41J66n3
$$ -99 213 182 68 40 100 61 -53 -20 -109 21 -4 239 315 45 87 152 -27 -167 -65 128 256 15 181 128
5187A28l93N4J87q1N9k30L24j00O5L5K4k05J4J05O4J3l70J74m2L91k32J44q6O5
$$ 128 -265 -211 -24 -105 -46 -276 48 -52 13 48 72 -133 -119 -14 50 63 -307 -133 -175 216 -16 128 42 107
$$ [...]
8191A24
##END NTUPLES=NMR FID
##END=
