##TITLE=1H_SL59(CuCl2-aq-Py-3d)
 CDCl3, 8 sc, 
 16.12.2020
##JCAMPDX= 6.0         $$ Bruker NMR JCAMP-DX V2.0
##DATA TYPE= NMR FID
##DATA CLASS= NTUPLES
##ORIGIN= UXNMR, Bruker Analytische Messtechnik GmbH
##OWNER= root
$$ XWIN-NMR		Version 3.5
$$ Wed Dec 16 10:24:20 2020 Russian Standard Time (UT+4h)  she@DPX200
##.OBSERVE FREQUENCY= 200.1315066352
##.OBSERVE NUCLEUS= ^1H
##.DELAY= (6, 6)
##.ACQUISITION MODE= SIMULTANEOUS
##.ACQUISITION SCHEME= undefined
##.AVERAGES= 8
##.DIGITISER RES= 18
##SPECTROMETER/DATA SYSTEM= spect
##.PULSE SEQUENCE= zg30
##.SOLVENT NAME= CDCl3
##.SHIFT REFERENCE= (INTERNAL, CDCl3, 0, 15.7039)
##AUDIT TRAIL= $$ (NUMBER, WHEN, WHO, WHERE, WHAT)
$$ ##TITLE= Audit trail, XWIN-NMR		Version 3.5
$$ ##JCAMPDX= 5.01
$$ ##ORIGIN= Bruker BioSpin GmbH
$$ ##OWNER= she
$$ F:/spectra/data/she/nmr/H-F/1/audita.txt
$$ ##AUDIT TRAIL=  $$ (NUMBER, WHEN, WHO, WHERE, WHAT)
(   1,<2020-12-16 10:23:01.98 +0400>,<she>,<DPX200>,
      <created by zg, POWCHK disabled, PULCHK disabled
       configuration hash MD5:
       00 E9 B6 7A A2 85 ED C7 34 08 36 98 17 FE 4E 26
       data hash MD5: 16K
       15 47 4E B8 D2 32 93 95 92 27 30 6A 1F F1 69 3F>)
$$ ##END=
$$ 
$$ hash MD5
$$ D7 17 42 21 CB C6 3F 05 DD 1E 5C 7B 3A 87 93 15
##$RELAX= 
##$RELAX= 
##$RELAX= 
##$RELAX= 
##$RELAX= 
##$RELAX= 
$$ Bruker specific parameters
$$ --------------------------
##$DU= <F:/spectra>
##$EXPNO= 1
##$NAME= <H-F>
##$PROCNO= 1
##$TYPE= <nmr>
##$USER= <she>
##$AMP= (0..31)
100 100 100 100 100 100 100 100 100 100 100 100 100 100 100 100 100 100 
100 100 100 100 100 100 100 100 100 100 100 100 100 100 
##$AQSEQ= 0
##$AQ_mod= 1
##$AUNM= <au_zg>
##$AUTOPOS= <>
##$BF1= 200.13
##$BF2= 200.13
##$BF3= 200.13
##$BF4= 200.13
##$BF5= 200.13
##$BF6= 200.13
##$BF7= 200.13
##$BF8= 200.13
##$BYTORDA= 1
##$CFDGTYP= 0
##$CFRGTYP= 5
##$CHEMSTR= <none>
##$CNST= (0..31)
1 1 145 1 1 1 1 1 1 1 1 1 1 1 1 1 1 1 1 1 1 1 1 1 1 1 1 1 1 1 1 1 
##$CPDPRG= <>
##$CPDPRG1= <>
##$CPDPRG2= <>
##$CPDPRG3= <>
##$CPDPRG4= <mlev>
##$CPDPRG5= <mlev>
##$CPDPRG6= <mlev>
##$CPDPRG7= <mlev>
##$CPDPRG8= <mlev>
##$CPDPRGB= <>
##$CPDPRGT= <>
##$D= (0..31)
0 1.2 0 0 0 0 0 0 0 0.06 0 0.03 0 0 0 0 0.0002 0 0 0 0 0 0 0 0 0 0 0 0 
0 0 0 
##$DATE= 1608099781
##$DBL= (0..7)
120 120 120 120 120 120 120 120 
##$DBP= (0..7)
150 150 150 150 150 150 150 150 
##$DBP07= 0
##$DBPNAM0= <>
##$DBPNAM1= <>
##$DBPNAM2= <>
##$DBPNAM3= <>
##$DBPNAM4= <>
##$DBPNAM5= <>
##$DBPNAM6= <>
##$DBPNAM7= <>
##$DBPOAL= (0..7)
0.5 0.5 0.5 0.5 0.5 0.5 0.5 0.5 
##$DBPOFFS= (0..7)
0 0 0 0 0 0 0 0 
##$DE= 6
##$DECBNUC= <off>
##$DECIM= 32
##$DECNUC= <off>
##$DECSTAT= 4
##$DIGMOD= 1
##$DIGTYP= 9
##$DL= (0..7)
0 120 120 120 120 120 120 120 
##$DP= (0..7)
150 150 150 150 150 150 150 150 
##$DP07= 0
##$DPNAME0= <>
##$DPNAME1= <>
##$DPNAME2= <>
##$DPNAME3= <>
##$DPNAME4= <>
##$DPNAME5= <>
##$DPNAME6= <>
##$DPNAME7= <>
##$DPOAL= (0..7)
0.5 0.5 0.5 0.5 0.5 0.5 0.5 0.5 
##$DPOFFS= (0..7)
0 0 0 0 0 0 0 0 
##$DQDMODE= 0
##$DR= 18
##$DS= 0
$$ [...]
##$SUBNAM2= <"">
##$SUBNAM3= <"">
##$SUBNAM4= <"">
##$SUBNAM5= <"">
##$SUBNAM6= <"">
##$SUBNAM7= <"">
##$SUBNAM8= <"">
##$SUBNAM9= <"">
##$SW= 16.9725356469052
##$SWIBOX= (0..15)
0 0 2 0 0 0 0 0 0 0 0 0 0 0 0 0 
##$SW_h= 3396.73913043478
##$TD= 16384
##$TD0= 1
##$TE= 0
##$TE2= 300
##$TE3= 300
##$TEG= 300
##$TL= (0..7)
0 120 120 120 120 120 120 120 
##$TP= (0..7)
150 150 150 150 150 150 150 150 
##$TP07= 0
##$TPNAME0= <>
##$TPNAME1= <>
##$TPNAME2= <>
##$TPNAME3= <>
##$TPNAME4= <>
##$TPNAME5= <>
##$TPNAME6= <>
##$TPNAME7= <>
##$TPOAL= (0..7)
0.5 0.5 0.5 0.5 0.5 0.5 0.5 0.5 
##$TPOFFS= (0..7)
0 0 0 0 0 0 0 0 
##$TUNHIN= 0
##$TUNHOUT= 0
##$TUNXOUT= 0
##$USERA1= <user>
##$USERA2= <user>
##$USERA3= <user>
##$USERA4= <user>
##$USERA5= <user>
##$V9= 5
##$VALIST= <valist>
##$VCLIST= <CCCCCCCCCCCCCCC>
##$VD= 0
##$VDLIST= <DDDDDDDDDDDDDDD>
##$VPLIST= <PPPPPPPPPPPPPPP>
##$VTLIST= <TTTTTTTTTTTTTTT>
##$WBST= 1024
##$WBSW= 4
##$XGAIN= (0..3)
0 0 0 0 
##$XL= 0
##$YL= 0
##$YMAX_a= 144540
##$YMIN_a= -161729
##$ZGOPTNS= <>
##$ZL1= 120
##$ZL2= 120
##$ZL3= 120
##$ZL4= 120
##$ABSF1= 10
##$ABSF2= 0
##$ABSG= 5
##$ABSL= 3
##$ALPHA= 0
##$AQORDER= 0
##$ASSFAC= 0
##$ASSFACI= 0
##$ASSFACX= 0
##$ASSWID= 0
##$AUNMP= <proc_1d>
##$AZFE= 0.1
##$AZFW= 0.1
##$BCFW= 1
##$BC_mod= 2
##$BYTORDP= 1
##$COROFFS= 0
##$CY= 11.3945322036743
##$DATMOD= 1
##$DC= 2
##$DFILT= <>
##$DTYPP= 0
##$F1P= 15.9154993809931
##$F2P= -4.1035820241983
##$FCOR= 0.5
##$FTSIZE= 0
##$FT_mod= 4
##$GAMMA= 1
##$GB= 0.15
##$INTBC= 1
##$INTSCL= 1
##$ISEN= 128
##$LB= 0.24
##$LEV0= 0
##$LPBIN= 0
##$MAXI= 10000
##$MC2= 0
##$MEAN= 0
##$ME_mod= 0
##$MI= 1.114404
##$NCOEF= 0
##$NC_proc= 0
##$NLEV= 6
##$NOISF1= 3.799351
##$NOISF2= 2.8
##$NSP= 1
##$NTH_PI= 0
##$NZP= 0
##$OFFSET= 15.70392
##$PC= 1
##$PHC0= -10763.47
##$PHC1= 15.40089
##$PH_mod= 1
##$PKNL= yes
##$PPARMOD= 0
##$PSCAL= 0
##$PSIGN= 0
##$REVERSE= no
##$SF= 200.130013532006
##$SI= 16384
##$SIGF1= 3
##$SIGF2= 2
##$SINO= 400
##$SIOLD= 16384
##$SREGLST= <1H.CDCl3>
##$SSB= 0
##$STSI= 0
##$STSR= 0
##$SW_p= 3612.71676300578
##$SYMM= 0
##$S_DEV= 0
##$TDeff= 0
##$TDoff= 0
##$TI= <>
##$TILT= no
##$TM1= 0
##$TM2= 0
##$TOPLEV= 0
##$USERP1= <user>
##$USERP2= <user>
##$USERP3= <user>
##$USERP4= <user>
##$USERP5= <user>
##$WDW= 1
##$XDIM= 8192
##$YMAX_p= 0
##$YMIN_p= 0
$$ End of Bruker specific parameters
$$ ---------------------------------
##NTUPLES= NMR FID
##VAR_NAME=  TIME,          FID/REAL,        FID/IMAG
##SYMBOL=    X,             R,               I
##VAR_TYPE=  INDEPENDENT,   DEPENDENT,       DEPENDENT
##VAR_FORM=  AFFN,          ASDF,            ASDF
##VAR_DIM=   8192,          8192,            8192
##UNITS=     SECONDS,       ARBITRARY UNITS, ARBITRARY UNITS
##FACTOR=    0.0002944,     1,               1
##FIRST=     0,             0,               0
##LAST=      2.4114304,     0,               0
##MIN=       0,             -161729,         0
##MAX=       2.4114304,     144540,          0
$$ Real data points
##PAGE= N=1
##DATA TABLE= (X++(R..R)), XYDATA
$$ [...]
$$ plain form
1855 -318 194 120 -304 181 178 -145 208 -288 -183 -14 -340 57 -1 -116 72 -53 -50 58 -105 -94 272 -290
1877 -290 -337 131 16 -61 193 -111 -101 209 -313 181 -23 -152 317 -215 -128 168 -246 188 387 -285 220
1898 220 64 -157 123 245 -147 404 -83 -103 -59 187 -209 414 -295 142 124 -301 -482 622 293 42 -51
1919 -51 -297 101 -43 -362 147 -115 46 264 -623 93 171 -587 -54 124 -235 68 -138 -394 180 -312 -19
1940 -19 164 -99 112 174 -217 -120 268 -164 188 -142 -1 270 -94 -137 184 -214 77 210 -119 25 285
1961 285 -92 -202 491 204 -76 -111 118 12 -197 -534 310 -124 175 35 -176 162 11 -166 252 -15
1981 -15 -66 169 -38 62 212 -173 172 275 -107 -65 -149 -167 -163 30 95 191 -54 -113 175 -283 -98 -108 -343 -117
2005 -117 -236 -299 88 111 -279 36 148 -18 243 -298 -338 82 -212 165 50 -269 2 17 -380 215 -185
$$ packed form
1855c18N12p4m24M85ll23L53m96J05J69l26L97n8j15J88j25LJ08j63J1L66n62
1877b90m7M68j15p7K54l04J0L10n22M94k04j29M69n32Q7K96m14M34J99o72N05
1898B20j56k21K80J22l92N51m87k0M4K46l96O23p09M37j8m25j81J104l29k51r3
1919e1k46L98j44l19N09k62J61K18q87P16P8p58N33J78l59L03k06k56N74m92K93
1940a9J83k63K11O2l91R7L88m32L52l30J41K71l64m3L21l98K91J33l29J44K60
1961B85l77j10O93k87k80l5K29j06k09l37Q44m34K99j40k11L38j51j77M18k67
1981a5n1K35k07J00J50l85L45J03l82M2q4j8MJ93O5R6k45n9K88m58J85j0k35K26
2005a17j19o3L87K3l90L15J12j66K61n41m0M20k94L77j15l19K71J5l97N95m00
$$ plain form
2026 -185 -153 104 -1 27 249 -219 -141 245 -285 224 131 -278 246 123 -122 240 48 -73 353 157 271
2047 271 293 -259 -43 330 -370 195 127 95 452 416 149 310 492 -88 491 57 78 220 -14 2 167 -138
2069 -138 96 131 -166 96 -88 -41 188 -158 -101 286 -210 170 -101 -328 -2 -142 -326 31 39 -139 135 -133
2091 -133 -251 -59 -405 -311 60 -402 -32 -56 122 161 -62 -138 85 26 -153 61 -282 126 110 66 62 217 -87
2114 -87 307 55 -20 -164 42 -108 229 37 262 84 97 33 -35 -81 271 105 -69 30 -202 157 316 44
2136 44 54 271 -76 178 188 -124 139 162 -55 67 -261 -90 57 -273 -118 -37 -340 -57 313 -279 -64 187
2158 187 -431 29 60 -78 -133 -220 -113 35 -185 -64 -103 -162 -180 -134 -325 -69 63 -197 267 27 -139 35
2180 35 65 -65 85 -175 -198 -18 -154 16 162 48 -148 69 -3 151 102 81 166 -260 -118 154 68 29 158
$$ packed form
2026a85L2K57j05K8K22m68P8L86n30N09r3m09N24j23k45L62j92j21M26j96J14
2047B71K2n52K16L73p00N65o8l2L57l6k67J61J82n80N79m34K1J42k34J6J65l05
2069a38K34L5k97K62j84M7K29l46N7L87m96L80k71k27L26j40j84L57Qj78K74k68
2091a33j18J92l46R4L71m62L70k4J78L9k23p6K23n9j79K14l43M08j6m4mJ55l04
2114h7L94k52p5j44K06j50L37j92K25j78J3o4o8m6L52j66j74R9k32L59J59k72
2136D4J0K17l47K54J0l12K63K3k17J22l28J71J47l30J55Q1l03K83L70n92K15K51
2158A87o18M60L1j38n5q7J07J48k20J21l9n9j8M6j91K56J32k60M64k40j66J74
2180C5L0j30J50k60k3J80j36J70J46j14j96K17p2J54m9k1Q5m26J42K72q6l9J29
$$ plain form
2203 158 -228 176 -200 71 217 39 19 128 83 2 387 188 60 191 -38 -29 -175 -35 58 142 -298 97
2225 97 -130 -276 72 -42 25 -113 -152 -52 -187 -130 362 -4 -132 -88 -51 -256 -55 -84 -211 165 -152 -89 -106
2248 -106 -18 -50 -25 -622 252 -45 -143 -122 -20 -3 323 -124 -21 185 -162 -52 52 -58 233 19 70 122 10
2271 10 37 209 30 -231 168 -159 -81 108 50 129 120 -210 84 -80 -70 230 -98 -40 232 -49 296 341 86
2294 86 76 75 -107 216 -5 -11 -71 -250 -30 230 -46 305 -101 -235 9 -201 -232 -156 26 43 98 -144 -112 -185
2318 -185 -199 150 -105 -228 -278 27 -123 79 47 -258 30 74 -78 131 -188 4 87 -77 78 7 -83 280
2340 280 197 -137 261 43 -85 272 -213 -25 88 -29 -144 -28 366 -152 -5 -282 155 -112 -102 235 180
2361 180 -210 59 120 -13 -15 23 -245 90 -132 -24 -9 -95 -92 -123 69 -67 -281 -28 104 -167 52 -15 -59 19
$$ packed form
2203A58l86M04l76K71J46j78k0J09m5q1L85j99j28J31k29Rj46J40R3Q4m40L95
2225I7k27j46L48j14O7j38l9J00j35N7M92l66j28M4L7k05K01k9j27L76l17O3j7
2248a06Q8l2K5n97Q74k97r8K1J02J7L26m47J03K06l47J10J04j10K91k14N1N2j12
2271A0K7J72j79k61L99l27P8J89n8P9rl30K94j64J0L00l28N8K72k81L45M5k55
2294H6j0jj82L23k21oo0j79K20K60k76L51m06j34K44k10l1P6J82J7N5k42L2p3
2318a85j4L49k55j23n0L05j50K02l2l05K88M4j52K09l19J92Q3j64J55p1r0L63
2340B80q3l34L98k18j28L57m85J88J13j17j15J16L94n18J47k77M37k67J0L37n5
2361A80l90K69O1j33kL8k68L35k22J08J5q6Ll1J92j36k14K53J32k71K19o7m4P8
$$ plain form
2385 19 -211 -155 156 -320 -152 -63 16 63 30 -19 -315 61 -100 -126 75 -185 228 -16 -165 -78 162 -191 101
2408 101 -182 -243 28 3 -106 0 -206 92 61 -55 282 216 -155 252 -27 73 192 -191 0 43 118 -86
2430 -86 -11 124 -180 39 17 222 184 337 151 45 33 77 -208 115 133 -25 176 -83 -60 -8 -74 -62 229 -127
2454 -127 128 274 -355 92 -92 -198 295 156 -196 41 7 -162 -79 34 -52 -303 -95 -8 52 -77 -259 -48
2476 -48 -231 -247 4 -282 -48 -44 -169 1 -105 -192 -183 98 120 73 -331 106 -35 -292 248 75 -83 53 59 147
2500 147 130 -38 41 117 0 -162 96 111 -97 107 41 232 -18 98 -148 -187 85 -27 70 42 -40 -40 -160 72
2524 72 102 113 -21 -11 -51 83 -158 -57 -10 67 91 -198 -95 153 -107 -4 -12 -8 -231 -142 -66 -56 -14 -49 91 -70
2550 -70 -40 -26 -135 123 -57 -250 -85 38 12 123 -124 18 -8 -40 137 -98 -100 -84 -155 -102 -101 26 42 -61 -8
$$ packed form
2385A9k30N6L11m76J68Q9P9M7l3m9k96L76j61k6K01k60M13k44j49Q7K40l53K92
2408A01k83o1K71k5j09J06k06K98l1j16L37o6l71M07k79J00J19l83J91M3P5k04
2430h6P5J35l04K19k2K05l8J53j86j06j2M4k85L23J8j58K01k59K3N2o6J2K91l56
2454a27K55J46o29M47j84j06M93j39l52K37l4j69Q3J13q6k51K08Q7O0j29j82K11
2476d8j83j6K51k86K34Mj25J70j06q7RK81K2m7m04M37j41k57N40j73j58J36OQ8
2500A47j7j68P9P6j17j62K58J5k08K04o6J91k50J16k46l9K72j12R7k8q2%j20K32
2524G2L0J1j34J0m0J34k41J01M7P7K4k89J03K48k60J03qMk23Q9P6J0M2l5J40j61
2550g0L0J4j09K58j80j93J65J23k6J11k47J42k6l2J77k35kJ6p1N3JJ27J6j03N3
$$ plain form
2575 -8 60 82 9 16 -14 -67 125 49 64 309 248 273 129 -193 -150 167 -245 -52 10 -45 -249 140 113 -104 157 -104
2601 -104 -60 -118 -106 -77 72 -24 -5 -138 -93 15 -150 -64 -92 -174 -71 -84 140 -41 -199 -47 241 -86 74 -48
2625 -48 3 -88 -79 -70 40 79 103 -18 -298 -198 -23 210 147 -83 117 46 -144 -33 -89 -75 -68 34 162 22 16 26
2651 26 77 28 -193 34 16 10 33 128 119 -56 225 98 102 94 -8 220 106 -78 100 -96 278 40 98 39 32 114
2677 114 61 -83 119 177 116 -81 48 -179 72 132 -194 308 -63 -92 -93 272 -154 -41 -1 37 -94 -121 -266
2700 -266 -103 -130 -16 -16 -139 204 -35 -120 -202 -102 93 -6 14 61 116 -161 178 -273 -221 91 195 55 -112
2723 -112 -177 -121 118 113 100 49 -90 -111 138 96 -45 -135 98 273 -21 -201 172 -91 72 165 62 79 258 83
2747 83 96 -56 62 31 147 155 -108 -186 -191 -7 -147 -428 77 202 -74 119 77 -246 -227 5 110 -4 -63 109
$$ packed form
2575hO8K2p3Pl0n3J92p6J5K45o1K5j44l22M3L17m12J93O2n5k04L89k7k17K61k61
2601a04M4n8J2K9J49r6J9j33M5J08j65Q6k8q2J03j3K24j81j58J52K88l27J60j22
2625d8N1r1RRJ10L9K4j21k80J00J75K33o3k30K00p1j90J11n6J4PJ02J28j40oJ0
2651B6N1m9k21K27j8oK3R5rj75K81j27Mqj02K28j14j84J78j96L74k38N8n9pQ2
2677A14n3j44K02N8o1j97J29k27K51O0l26N02l71k9jL65m26J13M0L8j31k7j45
2700b66J63k7J14%j23L43k39q5q2J00J95r9K0M7N5k77L39m51N2L12J04j40j67
2723a12o5N6K39nj3n1j39k1K49m2j41r0K33J75k94j80L73k63J63R3j03J7J79j75
2747H3J3j52J18l1J16Qk63p8nJ84j40k81N05J25k76J93m2l23J9K32J05j14n9J72
$$ plain form
2771 109 107 -103 170 -314 -282 17 -278 41 145 -138 96 -64 68 -158 -120 4 95 -4 -130 -232 -55 -26
2793 -26 -11 -243 0 -72 -311 277 -107 28 254 134 31 178 35 115 141 3 62 -77 -32 13 43 109 121 -97
2817 -97 -82 131 -235 45 13 -17 149 -50 147 302 160 108 -14 -18 -104 67 -227 -21 166 13 -69 -90 -127 145
2841 145 -109 -333 -138 7 223 63 -175 -217 92 -329 -191 23 -328 8 115 -165 -181 -194 168 -17 75
2862 75 25 209 -175 -264 -45 -45 -41 89 -75 189 93 -152 97 -7 62 -78 -85 17 176 -226 -95 237 -117 109
2886 109 -83 -48 11 22 -13 113 285 -60 239 85 206 -38 -106 -96 20 119 88 -33 -166 -35 182 -57 234
2909 234 -36 269 220 -24 341 -141 -145 88 256 -260 -9 18 -174 94 -145 140 51 -328 113 -125 -172 22
2931 22 49 -395 67 392 -216 133 62 -85 170 122 -46 -108 -158 -2 167 115 -41 -252 -55 99 35 -93 -64
$$ packed form
2771A09kk10K73m84L2K99k95L19J04k83K34j60J32k26L8J24R1r9j26j02J77K9
2793b6J5k32K43p2k39N88l84J35K26j20j03J47j43Q0K6j38N9j39M5M5L0O6J2k18
2817i7J5K13l66K80l2l0J66j99J97J55j42n2j22mq6J71k94K06J87j53q2k1l7K72
2841A45k54k24J95J45K16j60k38m2L09m21J38K14l51L36J07k80j6j3L62j85R2
2862G5n0J84l84q9K19%MJ30j64K64r6k45K49j04O9j40pJ02J59m02J31L32l54K26
2886A09j92L5N9J1l5J26J72l45K99j54J21k44o8J0J16R9l1j21j33J31K17k39K91
2909B34k70L05m9k44L65m82mK33J68n16K51K7j92K68k39K85q9l79M41k38m7J94
2931B2K7m44M62L25o08L49p1j47K55m8j68o2n0J56J69n2j56k11J97J54o4j28K9
$$ plain form
2954 -64 -17 65 147 46 -1 -40 -115 -195 -117 -99 166 110 3 283 41 37 95 134 98 -127 50 148 123 153 248 -136 -116
2981 -116 232 -250 -24 78 43 91 72 13 43 105 -202 -135 76 -107 154 172 -87 82 -15 -97 138 56 42 26
3005 26 -354 85 -333 -344 -91 -341 -319 128 -192 -206 -187 -249 -123 -155 -90 -36 -22 -8 -49 37 -168 -19 -373 -327 36
3030 36 164 25 212 78 101 -70 -55 192 -47 -16 112 -7 18 32 35 -47 219 -130 117 331 -170 124 143
3053 143 -42 11 -75 -119 130 16 -73 311 -30 -235 184 81 -56 162 -218 245 61 -61 -49 -242 -48 -133
3075 -133 -20 60 31 -111 19 -72 100 -229 8 -95 -91 -205 -39 281 -66 -269 -181 52 -270 46 21 -100
3097 -100 106 -48 -62 112 100 -278 -138 106 40 7 148 -82 -74 17 90 28 141 332 -93 215 81 -21 198
3120 198 163 114 365 70 -21 -36 183 397 -63 50 61 24 -161 171 -4 165 142 -36 98 82 -60 -88 225
$$ packed form
2954f4M7Q2Q2j01m7l9p5q0P8J8K65n6j07K80k42mN8L9l6k25J77R8k5L0R5l84K0
2981a16L48m82K26J02l5M8j9n9L0O2l07O7K11j83K61J8k59J69r7q2K35q2j4j6
3005B6l80M39m18j1K53k50K2M47l20j4J9o2J26l2O5N4J4J4m1Q6k05J49l54M6L63
3030C6J28j39J87j34K3j71J5K47k39L1J28j19K5J4Lq2K66l49K47K14n01K94J9
3053A43j85N3q6m4K49j14q9L84l41k05M19j03j37K18l80M63j84j22J2j93J94q5
3075a33J13Q0k9j42J30r1J72l29K37j03Mj14J66L20l47k03Q8K33l22L16k5j21
3097a00K06j54j4J74j2l78J40K44o6l3J41k30QR1P3o2J13J91m25L08j34j02K19
3120A98l5m9K51k95r1j5K19K14m60J13J1l7j85L32j75J69k3j78J34j6j42k8L13
$$ plain form
3143 225 129 229 49 -121 -119 -314 -36 36 -415 160 164 -153 -30 -87 5 -16 -284 -155 130 139 -62 -28 -378 -328
3167 -328 -1 -88 120 -25 236 -2 -4 110 -74 11 -202 90 112 -96 225 -33 199 -137 -44 -39 48 10 79 158
3191 158 29 51 -230 50 71 2 -66 -43 121 90 212 101 19 -170 -17 207 53 113 -236 -137 260 -124 264
3214 264 -232 315 -801 -177 80 -321 263 32 -17 241 -869 -332 207 -489 -142 -912 -61 -92 -881 -212
3234 -212 -482 -627 39 -482 -230 -440 -126 -256 230 -182 -135 22 0 -578 29 417 -49 -2 -260 179 446
3255 446 17 -205 -51 467 97 -10 -253 -129 247 -174 452 403 100 21 -266 77 -448 334 -202 -208 -254 -219
3277 -219 -64 -1 31 -84 -451 -96 -486 615 368 84 197 616 -268 95 -155 -388 230 -559 266 -519
3297 -519 -106 157 -348 -247 343 -416 -739 396 -376 670 -416 -87 -66 174 -45 -10 -233 84 -397 248
$$ packed form
3143B25r6J00j80j70Kj95K78P2m51N75Ml17J23n7R2k1k68J29K85Rk01L4l50N0
3167c28L27q7K08j45K61k38kJ14j84Q5k13K92K2k08L21k58K32l36R3NQ7l8O9P9
3191A58j29K2k81K80K1o9o8K3J64l1J22j11q2j89J53K24j54O0l49R9L97l84L88
3214B64m96N47j116O24K57m01N84k31m9K58j110N37N39o96L47p70Q51l1p89O69
3234b12k70j45O66n21K52k10L14j30M86m12M7J57k2n78O07L88m66M7k58M39K67
3255D46m29k22J54N18l70j07k43J24L76m21O26m9l03p9k87L43n25P82n36om6L5
3277b19J55O3L2j15l67L55l90J101k47k84J13M19q84L63k50k33O18p89Q25p85
3297e19M13K63n05J01N90p59l23J135p72J046j086L29K1K40k19L5k23L17m81O45
$$ plain form
3317 248 -169 -131 21 -171 -79 -228 -19 -164 65 -132 -125 94 42 22 -117 116 272 -312 196 -56 45 118
3339 118 106 -62 389 -51 133 236 39 21 22 43 143 148 7 33 136 -73 -24 184 141 72 105 -49 201 -81
3363 -81 60 12 2 47 134 86 213 172 -29 -290 16 -32 -76 -189 -275 284 75 80 94 -173 -85 -381 -108 60 -43
3388 -43 99 78 -63 -666 -451 244 -55 108 37 -80 -218 -837 700 -502 -10 554 -217 502 663 21
3408 21 159 161 -163 -277 -6 -180 -449 213 387 791 262 319 85 430 -216 5 477 -344 -275 -470 421 136
3430 136 819 -3 835 671 -25 -198 221 -165 -1085 -488 312 102 320 -161 264 -535 108 -693 -551 -180
3450 -180 -23 -574 509 -56 207 253 -186 297 279 -275 387 -714 -167 134 -911 7 209 -566 -249 -467
3470 -467 337 389 -370 -202 -335 4 103 191 165 399 4 276 285 -367 -194 183 -2 -116 450 -87 530 28
$$ packed form
3317B48m17L8J52j92R2j49K09j45K29j97PK19n2k0j39K33J56n84N08k52J01P3
3339A18j2j68M51m40J84J03j97j8JK1J00Nj41K6J03k09M9K08m3o9L3j54K50k82
3363h1J41m8j0M5Q7m8J27m1k01k61L06m8m4j13q6N59k09NJ4k67Q8k96K73J68j03
3388d3J42k1j41o03K15O95k99J63p1j17j38o19J537j202M92N64p71P19J61o42
3408B1J38Kl24j14K71j74k69O62J74M04n29N7k34L45o46K21M72q21O9j95Q91k85
3430A36O83q22Q38j64o96j73M19l86r20N97Q00k10K18m81M25p99O43q01J42L71
3450a80J57n51J083n65K63M6m39M83j8n54O62j101N47L01j045R18K02p75L17k18
3470d67Q04N2p59J68j33L39R9Q8k6K34l95K72Ro52J73L77j85j14N66n37O17n02
$$ plain form
3492 28 304 -8 20 123 78 -200 352 -342 -282 29 4 30 45 78 162 9 235 126 61 -112 -271 45 -115
3515 -115 -165 -263 -352 -70 77 -155 121 -145 175 -5 -176 -47 23 278 -194 -12 -51 186 -77 -435 22 45
3537 45 186 110 80 -248 -122 -24 -64 145 -60 15 -81 -280 107 -214 108 -110 -136 21 -37 -27 28 -3 -94 -46 11
3562 11 23 15 115 96 146 104 85 -30 -49 -115 -193 1 40 -62 79 -28 51 -199 94 89 -80 -31 195 34 -50 -275
3588 -275 -230 47 -166 22 9 -17 65 -91 -22 -179 -197 82 132 78 143 77 -99 100 -294 1 259 -22 14 -231
3612 -231 -254 -97 -373 107 36 -17 -230 16 -173 294 -194 -240 -53 -162 -35 -105 -162 230 -251 23 -47 -171
3634 -171 25 -139 9 237 -78 530 159 69 -79 -3 209 -260 -165 285 -22 111 20 -202 319 195 33
3655 33 521 8 -121 463 97 164 195 131 -63 -147 124 310 159 -301 140 209 -270 -135 76 58 405 -225
$$ packed form
3492B8K76l12K8J03m5k78N52o94O0L11k5K6J5L3Q4j53K26j09o5j73j59L16j60
3515a15n0r8q9K82J47k32K76k66L20j80j71J29P0K55m72J82l9K37k63l58M57K3
3537D5J41p6l0l28J26R8m0K09k05P5r6j99L87l21L22k18k6J57n8J0N5l1r1M8N7
3562A1J2qJ00j9N0m2j9j15j9o6p8J94L9j02J41j07P9k50K93nj69M9K26j61q4k25
3588b75M5K77k13J88j3k6Q2j56O9j57j8K79N0n4O5o6j76J99l94K95K58k81L6k45
3612b31k3J57k76M80p1n3k13K46j89M67m88m6J87j09J27p0n7L92m81K74p0j24
3634a71J96j64J48K28l15O08l71r0j48P6K12m69R5M50l07J33r1k22N21j24j62
3655C3M88n13j29N84l66O7L1o4j94q4K71J86j51m60M41O9m79J35K11j8L47o30
$$ plain form
3677 -225 287 138 -28 -321 -275 14 -108 125 -167 318 273 -136 258 199 -50 -181 -217 -559 457 -315 135
3698 135 117 59 -27 -26 528 472 -79 42 -198 194 412 957 -453 -117 153 479 -102 -548 260 -60 119 -110
3720 -110 490 -646 450 127 24 400 -212 -833 42 424 45 -424 -381 -3 -543 -88 -374 -89 -837 -363
3740 -363 -319 519 277 101 -262 162 9 -284 418 1003 833 -562 628 413 185 909 887 -462 -32 875
3760 875 1357 546 1209 613 837 -292 826 -239 -319 -120 -293 580 -494 -89 -1026 -321 -206 -206 -295 328
3780 328 -61 359 -11 243 -58 -243 -137 -92 7 -283 356 26 -195 -17 -28 189 -81 153 -23 485 -164
3801 -164 24 -297 295 104 104 -57 -66 -346 274 202 75 -404 127 534 -174 -277 116 291 -95 497 358 -90
3823 -90 -235 -182 -70 295 -166 436 -467 325 -76 -137 -68 -726 115 433 442 467 -594 278 -142 -348 187 44
$$ packed form
3677b25N12j49j66k93M6K89j22K33k92M85m5m09L94n9k49j31l6l42J016p72M50
3698A35j8n8q6JN54n6n51J21k40L92K18N45j410L36K70L26n81m46Q08l20J79k29
3720a10O00j136J096l23j03L76o12o21Q75L82l79m69M3L78n40M55k86K85p48M74
3740c63M4Q38k42j76l63M24j53k93P02N85j70j395J190k15k28P24k2j349M30R07
3760H75M82q11O63n96K24j129J118j065q0J99j73Q73j074M05r37P05J15%q9O23
3780C28l89M20l70K54l01j85J06M5R9k90O39l30k21J78j1K17k70K34j76N08o49
3801a64J88l21N92j91%j61rk80O20p2j27m79N31M07p08j03L93J75l86N92j39m48
3823i0j45N3J12L65m61O02r03P92m01o1O9o58Q41L18RK5j061Q72m20k06N35j43
$$ plain form
3845 44 23 399 -122 -103 65 55 8 -91 -315 -253 355 -493 117 244 -71 -592 -85 -440 2 380 -4 194
3867 194 214 411 -14 484 -135 261 558 -84 77 340 49 340 251 -291 -81 560 1 349 -164 -429 0
3888 0 -332 464 162 467 -456 783 -224 -261 310 -659 245 -438 -90 32 -36 -343 -442 -43 526 9 -98
3909 -98 621 385 304 -10 -143 -278 215 45 186 -326 -46 211 -349 -123 143 -141 149 -306 17 -527 -79
3930 -79 -121 -655 188 552 417 -708 -791 120 265 315 -558 0 464 676 -191 792 -347 202 -143 -759 112
3951 112 92 173 413 -101 -369 311 -208 -181 19 315 241 159 -81 -231 -110 -44 72 154 -255 -160 -168 166 -179
3974 -179 -55 41 19 154 -46 44 151 -273 -174 -30 -105 68 -40 137 81 229 43 291 173 -95 -36 -185
3996 -185 -66 -25 106 -43 -208 106 274 -41 -49 -20 -406 -82 -152 -219 -605 -436 341 303 -244 37 -187 -110 87
$$ packed form
3845D4k1L76n21J9J68j0m7r9k24O2O08q48O10J27l15n21N07l55M42L78l84J98
3867A94K0J97m25M98o19L96K97o42J61K63k91K91q9n42K10O41n59L48n13k65M29
3888@l32P96l02L05r23J239j007l7N71r69R04o83L48J22o8l07r9L99N69n17j07
3909i8P19k36q1l14j33j35M93j70J41n12K80K57n60K26K66k84K90m55L23n44M48
3930g9m2n34Q43L64j35j125q3R11J45N0q73N58M64K12q67R83j139N49l45o16Q71
3951A12k0Q1K40n14k68O80n19K7K00K96p4q2k40j50J21O6J16Q2m09R5qL34l45
3974a79J24R6k2J35k00R0J07m24R9J44p5J73j08J77n6J48j86K48j18k68N9j49
3996a85J19M1J31j49j65L14J68l15qK9l86L24p0o7l86J69P77l8n47K81k24P7J97
$$ plain form
4019 87 -146 191 71 -45 109 190 134 34 -56 191 331 110 -190 9 125 -153 -13 -26 108 -273 -166 8
4041 8 159 -58 64 58 -222 76 182 -176 115 -286 117 -107 -127 -74 -68 44 97 -248 -75 -190 62 -85 -21
4064 -21 46 -136 77 -33 67 133 -120 -296 51 -147 -46 -14 -19 -161 153 15 -2 307 196 92 -50 -26 19
4087 19 48 93 183 86 29 120 -2 39 35 -59 -106 74 -65 60 -34 211 88 -115 -22 -196 -163 319 250 -152 98
4112 98 90 -38 -78 -34 12 140 41 -163 98 44 308 -49 -204 143 -124 -104 -158 6 44 -211 153 -18 -117 -15
4136 -15 -100 4 -109 72 66 -102 -119 -247 -104 -60 118 -105 -50 -268 -34 195 -2 -33 198 -95 300 193 51
4159 51 -148 56 -37 -1 -47 -31 123 18 50 94 176 109 56 239 264 -25 -142 6 -141 -87 -358 -400 -624 -302
4183 -302 155 -65 -202 -15 303 15 88 -163 101 202 29 154 -119 110 71 23 185 -117 137 78 71 -34
$$ packed form
4019H7k33L37j20j16J54Q1n6j00r0K47J40k21l00J99J16k78J40j3J34l81J07J74
4041HJ51k17J22ok80K98J06l58K91m01M03k24k0N3OJ12N3l45J73j15K52j47O4
4064b1O7j82K13j10J00O6k53j76L47j98J01L2nj42L14j38j7L09j11j04j42K4M5
4087A9K9M5R0r7n7R1j22M1mr4m7J80j39J25r4K45j23k03R3j74L3M82o9m02K50
4112I8qj28m0M4M6J28r9k04K61n4K64l57j55L47k67K0n4J64L8k55L64j71r9J02
4136a5q5J04j13J81oj68j7j28J43M4J78k23N5k18K34K29j97l1K31k93L95j07j42
4159E1j99K04r3L6m6J6J54j05L2M4Q2o7n3J83K5k89j17J48j47N4k71m2k24L22
4183c02M57k20j37J87L18k88P3k51K64J01j73J25k73K29l9m8J62l02K54n9pj05
$$ plain form
4205 -34 -65 116 -192 81 69 101 13 -38 -120 -311 -118 -34 -146 -126 252 -170 4 -218 -127 -117 264 -229 -270 -18
4229 -18 119 269 315 202 365 2 -182 -262 -170 14 34 0 -37 -392 701 599 425 1042 -91 -12 -417 -201
4251 -201 -578 106 -257 256 -71 307 58 457 -540 -21 -459 -367 -534 -451 370 175 46 -457 253 -7 299
4272 299 -2 126 -98 -204 -129 -141 -58 -109 -269 149 51 22 -37 -18 36 108 -5 156 -131 -45 -30 -86 -251 192
4296 192 204 -320 -450 13 28 -128 176 -57 -63 261 -235 -37 -158 9 98 151 24 -51 250 23 -138 -135 703
4319 703 39 255 76 -108 476 -112 63 -157 554 -232 -38 -127 -254 64 270 -429 123 169 53 432 292
4340 292 -236 -408 111 -208 -495 412 -118 431 -106 -160 -83 201 15 -172 -111 371 -758 -207 607 -41 -180
4361 -180 -641 323 248 -661 -64 -178 -155 373 278 -622 171 -12 -242 38 -693 451 -276 185 -197 -678 513
$$ packed form
4205c4l1J81l08K73j2L2q8n1q2j91J93Q4j12K0L78m22J74k22R1J0L81m93m1K52
4229a8J37J50M6j13J63l63j84q0R2J84K0l4l7l55J093j02j74O17j133P9m05K16
4251b01l77O84l63N13l27L78k49L99r97N19m38R2j67Q3Q21j95j29n03P10k60L06
4272B99l01J28k24j06P5j2Q3n1j60M18r8k9n9J9N4P2j13J61k87Q6J5n6j65M43
4296A92J2n24j30M63J5j56L04k33oL24m96J98j21J67Q9N3j27p5L01k27j61LQ38
4319G03o64K16j79j84N84n88J75k20P11p86J94q9j27L18K06o99N52M6j16L79j40
4340B92n28j72N19l19k87R07n30N49n37n4P7K84j86j87O1M82j129N51Q14o48j39
4361a80m61R64p5r09N97j14K3N28r5r00P93j83k30K80p31J144p27M61l82m81J191
$$ plain form
4382 513 312 67 -227 571 28 -264 -241 -353 -121 63 -114 -148 838 4 -163 97 157 -309 69 -553 315
4403 315 131 -554 -291 -349 327 182 335 141 506 80 382 -115 -31 -581 -128 10 3 -95 28 -100 -302 322
4425 322 -196 -146 -17 -3 49 39 -443 31 3 180 -16 33 106 16 -88 90 -173 -206 -246 -60 -215 32 -9 38
4449 38 338 -56 -3 111 -136 -10 -187 59 -155 13 -206 202 309 -425 652 -87 -86 617 737 -169 -629
4470 -629 182 127 -299 24 -148 344 -172 394 16 528 -226 -400 254 810 145 -233 341 997 80 827
4490 827 -894 481 292 564 138 525 176 -15 -220 -564 432 182 19 524 179 177 108 456 53 332
4510 332 -107 -248 620 90 539 44 120 551 -705 -141 310 -486 510 169 153 354 -652 48 -274 285
4530 285 -30 271 233 287 500 -49 -301 352 123 -21 250 240 -53 -227 -177 -389 418 -119 370 597 261
$$ packed form
4382E13k01k45k94P98n43k92K3j12K32J84j77l4R86q34j67K60O0m66L78o22Q68
4403C15j84o85K63n8O76j45J53j94L65m26L02m97Q4n50M53J38pr8J23j28k02O24
4425C22n18N0J29J4N2j0m82M74k8J77j96M9P3r0j04J78k63l3m0J86j55K47m1M7
4449C8L00l94N3J14k47J26j77K46k14J68k19M08J07p34J077p39JP03J20r06m60
4470f29Q11n5m26L23j72M92n16N66l78N12p54j74O54N56o65l78N74O56r17P47
4490H27j721J375j89K72m26L87l49j91k05l44R96k50j63N05l45ko9L48m03K79
4510C32m39j41Q68n30M49m95P6M31j256N64M51p96R96l41j6K01j006P00l22N59
4530B85l15L01l8N4K13n49k52O53k29j44K71j0k93j74N0k12Q07n37M89K27l36
$$ plain form
4551 261 -126 452 463 -331 176 207 -157 -45 -4 162 148 54 -267 -36 -47 212 62 140 -108 -95 -598 138 188
4574 188 -217 -86 151 84 -292 198 -15 -28 -35 -71 -185 -24 -186 -170 63 58 -108 -215 -154 92 196 48 29
4597 29 -153 19 -11 1 -43 51 -113 -29 10 -72 0 -92 -116 93 -19 198 -181 7 47 153 78 8 104 -25 0
4622 0 28 -179 7 -52 -194 -84 242 274 47 145 121 292 62 68 127 -22 201 286 -83 178 -35 169 -298 81
4646 81 14 -117 39 -47 -166 -116 -103 -126 -70 77 117 -9 -124 95 -62 -38 -88 149 -156 81 -164 -27 56 -173
4670 -173 -71 95 20 129 -176 -59 164 -118 -39 -233 58 66 155 -177 -199 -20 80 190 -190 -62 -77 164
4692 164 -182 126 56 59 104 -182 53 -84 -97 159 -33 -69 21 100 167 43 42 34 -92 89 119 173 26 104 140 28
4718 28 96 18 -167 -529 -300 -113 -4 -151 477 233 206 212 46 -128 -260 109 137 -806 -731 -441 -308 -10 -293
$$ packed form
4551B61l87N78J1p94N07L1l64J12M1J66j4r4l21K31j1K59j50P8k48J3n03P36N0
4574A88m05J31K37o7l76M90k13j3pl6j14J61j62J6K33nj66j07O1K46J04j48j9
4597B9j82J72l0J2m4R4j64Q4L9q2P2r2k4K09j12K17l79J88M0J06p5p0R6j29K5
4622@K8k07J86n9j42J10L26L2k27R8k4J71k30ON9j49K23Q5l69K61k13K04m67L79
4646H1o7j31J56q6j19N0J3k3N6J47M0j26j15K19j57K4n0K37l05K37k45J37Q3k29
4670a73J02J66p5J09l05J17K23k82P9j94K91QQ9l32k2J79J00J10l80J28j5K41
4692A64l46L08p0LM5k86K35j37j3K56j92l6R0P9O7j24jqj26J81L0N4j47P8L6j12
4718B8O8p8j85l62K29J87J09j47O28k44k7Oj66j74j32L69K8r43P5K90J33K98k83
$$ plain form
4741 -293 -242 -136 -284 -441 -157 -54 -314 -156 -148 252 53 -119 -198 219 9 164 35 -213 -190 90 101 -117
4763 -117 -151 83 104 -88 193 -315 2 -63 -133 110 -130 82 162 -18 20 131 -23 43 -132 52 18 151 157
4786 157 -3 154 159 170 -38 342 126 212 -9 171 -43 105 -223 -129 -102 -42 -91 -118 -110 2 101 -38 -26 -61 -76
4811 -76 -146 45 -132 -116 127 34 80 226 -85 -208 42 -52 -196 -62 12 -85 -279 106 12 128 -80 218 -99
4834 -99 91 49 26 118 -10 125 81 232 118 91 -10 164 16 78 -256 -94 134 1 -28 301 92 -164 26
4857 26 291 155 99 276 -40 -26 41 247 -2 113 -94 -26 310 -239 20 62 -156 114 -18 -93 114 -88
4879 -88 186 -271 -357 -132 -263 72 84 196 7 160 -219 -139 -48 -62 -127 108 -187 88 -205 -46 100 -46
4901 -46 64 140 -281 105 50 -7 102 -238 15 61 153 233 78 -50 34 -183 -77 336 -32 -22 154 14 -22
$$ packed form
4741b93N1J06j48j57K84J03k60J58QM00j99j72p9M17k10J55j29k48K3K80J1k18
4763a17l4K34K1j92K81n08L17o5p0K43k40K12Q0j80L8J11j54O6j75J84l4J33O
4786A57j60J57NJ1k08L80k16Q6k21J80k14J48l28R4K7O0m9k7QJ12R9j39J2l5j5
4811g6p0J91j77J6K43r3M6J46l11j23K50r4j44J34P4r7j94L85r4J16k08K98l17
4834i9J90m2k3R2j28J35m4J51j14k7j01J74j48O2l34J62K28j33k9L29k09k56J90
4857B6K65j36n6J77l16J4O7K06k49J15k07O8L36n49K59M2k18K70j32p5K07k02
4879h8K74m57q6K25j31L35J2J12j89J53l79Q0R1j4o5K35k95K75k93J59J46j46
4901d6J10P6m21L86n5n7J09l40K53M6R2Q0j55j28Q4k17J06M13l68J0J76j40l6
$$ plain form
4924 -22 -35 240 106 -99 119 -123 68 192 203 17 -190 91 -186 -302 -153 -78 -113 -54 -7 -134 109 -159
4946 -159 130 36 19 -168 -80 48 -194 -35 116 -24 -134 -18 -67 -106 -10 -12 44 -182 56 69 46 -79 -34 -5
4970 -5 109 140 -8 130 -105 57 -49 39 -150 -131 -49 -105 -87 -47 74 -155 107 -40 -82 -157 -30 -29 -80 217 250
4995 250 547 -19 33 56 121 192 22 -134 -31 60 -26 139 111 158 -3 -30 -71 -59 135 124 -11 105 -163 113
5019 113 71 -14 3 -4 132 -55 -55 35 150 41 -140 -264 -270 -106 94 153 -249 -15 -392 -466 -89 141 -396 30
5043 30 538 -227 1175 -441 273 80 -546 -331 -291 -313 -7 340 216 -177 -374 44 -186 283 -354 -225
5063 -225 -517 -165 588 -79 214 -234 -505 -17 55 -221 10 -1 -37 372 172 3 523 499 -128 -91 -298 162
5085 162 132 -26 139 -90 319 206 -218 40 -79 154 -110 113 -163 -202 122 166 69 -22 -22 314 -158 -206 170
$$ packed form
4924b2j3K75j34k05K18k42J91J24J1j86k07K81k77j16J49P5l5N9M7j27K43k68
4946a59K89r4j7j87Q8J28k42J59J51j40j10J16m9l9R6kN6k26K38J3k3j25M5K9
4970eJ14L1j48J38k35J62j06Q8j89J9Q2n6J8M0J21k29K62j47m2p5J27Jn1K97L3
4995B50K97n66N2K3O5P1j70j56J03R1q6J65k8M7j61k7m1J2J94j1j35J16k68K76
5019A13m2q5J7pJ36j87%R0J15j09j81j24oJ64K00N9m02K34l77p4L77K30n37M26
5043C0N08p65J402j616P14j93o26K15M0k2L06L47j24l93j97M18k30M69o37J29
5063b25k92L52P53o67K93m48k71M88P2k76K31j1l6M09k00j69N20k4o27L7k07M60
5085A62l0j58J65k29M09j13m24K58j19K33k64K23k76l9L24M4r7r1%L36m72m8L76
$$ plain form
5108 170 -105 -96 103 104 -36 223 110 112 -59 -175 71 82 76 -140 -53 33 -171 -55 243 294 -340 -37 -267 70
5132 70 51 38 -135 27 -22 154 56 46 135 81 -154 -279 18 18 130 -198 -94 3 14 26 203 -65 -70 -67 22 231
5158 231 35 148 148 -128 -19 4 139 81 300 213 -92 140 -72 151 -58 98 -14 -49 -10 137 160 -6 -81
5181 -81 -216 -18 69 137 31 -51 -175 -152 42 -1 26 -241 -170 34 -22 -170 -121 117 -88 129 168 -272 31 -199
5205 -199 -36 -29 8 20 -105 51 63 80 -69 -59 -126 -105 217 -226 140 -102 16 10 328 -62 -315 -198 97 213
5229 213 -202 127 139 -153 146 -57 46 -9 -95 -38 -76 86 175 -87 123 110 -198 88 -307 151 305 158
5251 158 39 -17 52 -250 -398 -18 22 83 137 49 78 158 -225 -51 -92 -60 -35 -21 79 89 -151 -138 55 -147 3
5276 3 180 -69 -176 34 47 -37 -42 -222 -164 -78 166 104 52 -124 12 -43 324 -154 -110 212 -118 -152 -202 171 -154
$$ packed form
5108A70k75RJ99Jj40K59j13Kj71j16K46J1ok16Q7Q6k04J16K98N1o34L03k30L37
5132G0j9j3j73J62m9J76r8j0Q9n4k35j25K97%J12l28J04R7J1J2J77k68nLQ9K09
5158B31j96J13%k76J09K3J35n8K19q7l05K32k12K23k09J56j12l5L9J47K3j66p5
5181h1j35J98Q7O8j06q2j24K3J94m3K7k67P1K04n6j48M9K38k05K17L9m40L03k30
5205a99J63PL7J2j25J56J2J7j49J0o7K1L22m43L66k42J18oL18l90k53J17K95J16
5229B13m15L29J2k92K99k03J03n5q6N7l8J62Q9k62K10j3l08K86l95M58J54j47
5251A58j19n6O9l02j48L80M0O1N4q8K9Q0l83J74m1L2K5J4J00J0k40J3J93k02J50
5276CJ77k49j07K10J3q4nj80N8Q6K44o2n2j76J36n5L67m78M4L22l30l4n0L73l25
$$ plain form
5301 -154 -68 72 90 59 -11 -20 0 -163 -190 201 64 26 71 -40 112 -128 -34 -33 -65 -33 -42 200 -15 -45 118 -20
5327 -20 192 72 -231 -150 -156 -112 125 -45 -9 -207 -13 -61 -252 -94 3 -7 -81 113 154 175 -1 -151 -113 -125 -241
5352 -241 123 -553 -189 85 56 -29 -113 343 -192 -84 -66 237 437 70 -101 -73 -19 -237 -245 178 45 21 202
5375 202 -292 133 246 -103 368 278 210 485 656 251 -353 116 -25 226 156 -238 46 325 -62 -13 -326
5396 -326 788 415 3 327 141 27 -259 30 -191 153 271 -377 292 288 -47 -145 63 -260 -46 54 -74
5417 -74 -100 -631 247 -567 32 -429 -389 63 -504 -90 306 -106 1054 -181 -604 411 -250 -102 -681 40
5437 40 632 -186 -630 164 -284 596 -70 -9 -250 73 -90 -82 90 465 -264 -208 -47 -334 43 399 739 151
5459 151 -36 44 370 -156 173 681 48 -50 -250 389 87 349 139 -139 -5 -94 73 47 -420 -85 231
$$ packed form
5301a54Q6J40J8l1p0rK0j63k7L91j37l8M5j11J52k40R4Jl2L2rK42k15l0J63j38
5327b0K12j20l03Q1oM4K37j70L6j98J94m8j91J58R7j0p4J94M1K1j76j50L8j2j16
5352b41L64o76L64K74k9q5q4M56n35J08J8L03K00l67j71K8N4k18qM23j33k4J81
5375B02m94M25J13l49M71r0o8K75J71m05o04M69j41K51p0l94K84K79l87M9l13
5396c26J114l73m12L24j86j14k86K89k21L44J18o48O69ml35r8K08l23K14J00j28
5417g4k6n31Q78q14N99m61M0M52n67M14L96m12J160j235m23J015o61J48n79P21
5437D0N92q18m44P94m48Q80o66O1k41L23j63QJ72L75p29N6J61k87L77L56L40n88
5459A51j87Q0L26n26L29N08o33r8k00O39l02K62k10k78J34q9J67k6m67L35L16
$$ plain form
5480 231 -143 94 314 54 63 -48 55 79 -77 14 12 -61 -181 61 -76 -111 -201 -177 -38 -131 96 -226 150 67
5504 67 16 -171 1 -111 -205 -81 -32 -159 -13 -44 83 -67 -25 -241 -46 82 86 49 -268 -159 334 -58 112
5527 112 35 46 76 62 52 95 49 200 -81 -69 16 -235 1 117 -157 228 -29 210 20 -456 83 88 78 97
5551 97 -32 24 5 -262 -24 -99 -93 146 -149 -131 -96 -8 -224 -35 71 347 194 -159 231 -104 -31 -111 -56 -51 116
5576 116 -58 118 -324 26 52 -42 158 -189 178 25 92 -283 249 -105 -54 347 195 -123 -74 -12 7 182
5598 182 45 112 311 -41 117 -87 -130 138 -213 -170 121 199 83 -199 246 29 -40 116 -56 214 12 74
5620 74 150 -170 98 -257 158 7 -219 88 48 -189 136 63 52 373 244 238 567 121 331 167 123 -386 -136
5643 -136 -467 -471 -366 -256 777 -909 138 -27 57 -646 -272 825 28 -188 91 -267 186 96 -50 -205
$$ packed form
5480B31l74K37K20k60Rj11J03K4j56R1kp3j20K42j37l5r0K4J39r3K27l22L76q3
5504F7n1j87J72j12r4J24M9j27J46l1J27j50M2k16J95J28Ml7l17J09M93l92J70
5527A12p7J1L0j4j0M3m6J51k81J2Q5k51K36J16k74L85k57K39j90m76N39Nj0J9
5551I7j29N6j9k67K38p5OK39k95J8L5Q8k16J89J06K76j53l53L90l35P3q0N5NJ67
5576A16j74J76m42L50K6r4K00l47L67j53O7l75N32l54N1M01j52l18M9O2J9J75
5598A82j37O7J99l52J58k04m3K68l51M3K91P8j16k82M45k17o9J56j72K70k02O2
5620G4P6l20K68l55M15j51k26L07m0k37L25p3j1L21j29oL29m46K10j64m4n09K50
5643a36l31mJ05J10J033j686J047j65Q4p03L74J097p97k16K79l58M53r0j46j55
$$ plain form
5663 -205 -114 -64 -179 -190 6 142 -116 39 275 -24 -234 44 -28 -4 -61 165 -115 321 50 0 41 123 85
5686 85 -176 -54 319 -207 209 93 66 91 -17 163 33 -162 426 14 -29 -26 -115 106 -74 -65 -155 33 -88
5709 -88 137 20 109 -194 -11 -9 -56 -134 156 -17 -5 -171 -206 307 -118 -132 185 33 -95 33 -44 -147 -193 47
5733 47 -250 -147 42 -73 -180 -1 -87 54 -146 -238 36 14 -123 -60 64 20 173 -47 -23 -9 189 61 -98
5756 -98 -180 86 -42 16 -199 -11 -103 -104 215 -28 72 65 33 97 -39 72 129 45 -46 -137 31 11 23 22 3 104
5782 104 -9 -210 187 -84 -43 126 -19 -253 -101 -142 11 50 -27 120 72 178 190 33 377 -75 -217 -102
5804 -102 40 -79 -50 -41 31 -69 -156 -147 -15 -78 169 147 -288 -69 -133 -122 47 -148 -74 -118 -30 128 -117 -256 -35
5829 -35 -258 -43 -18 -125 -45 148 -155 -214 -171 76 91 332 90 94 2 90 88 -11 33 127 -34 -61 291 118 -8
$$ packed form
5663b05R1N0j15j1J96J36k58J55K36k99k10K78p2K4n7K26k80M36k71n0M1Q2l8
5686H5k61J22L73n26M16j16k7K5j08J80j30j95N88m12m3Lq9K21j80Rr0J88j21
5709h8K25j17Q9l03J83Km7p8K90j73J2j66l5N13m25j4L17j52j28J28p7j03m6K40
5733D7k97J03J89j15j07J79q6J41k00r2K74k2j37O3J24m4J53k20K4J4J98j28j59
5756i8q2K66j28N8k15J88r2jL19k43J00pl2O4j36J11N7q4r1r1J68k0J2jj9J01
5782A04j13k01L97k71M1J69j45k34J52m1J53L9p7J47m8J06J2j57L44m52j42J15
5804a02J42j19K9RP2j00q7RJ32o3K47k2m35K19o4J1J69j95P4m4Q8J58k45j39K21
5829c5k23K15K5j07Q0J93l03n9M3K47J5K41k42Mr2Q8kr9M4R4j61k7L52j73j26
$$ plain form
5854 -8 122 -115 -128 43 5 -19 -146 11 94 23 -250 -236 60 43 -116 61 66 -233 87 52 -8 127 -54 -97 194
5879 194 27 -50 62 -63 101 -283 -33 -219 118 -147 -57 126 162 49 102 -170 16 192 -123 200 -29
5900 -29 -352 96 181 -112 268 26 -13 92 46 -19 -109 141 51 -297 144 -70 138 113 78 -39 -48 130 60 -83
5924 -83 114 208 92 93 216 -246 -5 152 176 -33 -87 12 162 -58 330 -121 113 74 15 -140 65 1 209
5947 209 -44 -54 190 40 -130 -232 -42 -85 -152 -13 -187 -84 63 3 102 -71 -96 -96 117 -26 -189 -121 -129 77
5971 77 -73 117 171 -62 -85 -63 43 26 -206 -115 -7 126 89 -33 15 81 149 -26 275 114 97 -145 111 -115
5995 -115 -45 -210 29 -76 127 237 -270 44 208 288 122 90 -63 -193 -202 -19 -48 43 108 -55 -5 -23 93
6018 93 28 66 -5 -138 52 338 59 -149 -38 -146 1 -190 21 -85 -110 284 58 -137 -87 127 -101 81
$$ packed form
5854hJ30k37j3J71l8k4j27J57Q3p1k73J4K96j7j59J77Nk99L20l5o0J35j81m3K91
5879A94j67p7J12j25J64l84K50j86L37k65R0J83L6j13N3k72J86J76l15L23k29
5900b9l23M48Q5k93L80k42l9J05m6o5r0K50r0l48M41k14K08k5l5j17rJ78p0j43
5924h3J97R4j16JJ23m62K41J57K4k09n4R9J50k20L88m51K34l9n9j55K05o4K08
5947B09k53j0K44j50j70j02J90m3o7J39j74J03J47o0R9j73k5%K13j43j63O8qK06
5971G7j50J90N4k33k3K2J06j7k32R1J08J33l7j22M8O6O8j75L01j61j7k42K56k26
5995a15P0j65K39j05K03J10n07L14J64Q0j66l2j53j30rJ83k9R1O5j63N0j8J16
6018I3o5L8p1j33J90K86k79k08J11j08J47j91K11j06k5L94k26j95N0K14k28J82
$$ plain form
6040 81 104 -104 13 181 -34 -28 -43 96 315 -104 -61 -31 160 233 224 -153 37 243 -53 80 -37 -20 -82 90
6064 90 -32 173 81 28 -159 22 102 71 89 34 -31 172 -100 -58 201 -166 20 171 -22 6 67 -201 -163 123
6088 123 80 218 -149 -91 -54 -133 -58 -45 -79 20 -9 27 -68 -38 105 16 247 -189 -2 -290 -98 251 -23 468
6112 468 131 -218 148 139 97 8 -10 -20 -144 -93 -56 -86 150 -69 -59 135 -121 -134 62 -43 -92 207 -9 -225
6136 -225 -127 -59 -156 -56 -217 123 146 101 -42 61 141 32 -112 -11 57 3 -44 31 -198 -159 -146 -97 40 146
6160 146 81 94 -18 73 204 -137 -31 88 74 31 -94 -8 -133 -24 75 60 -9 -68 -25 -378 -79 -138 84 259
6184 259 96 36 -105 188 -14 -6 -7 -128 -106 -71 18 -6 45 142 -26 -34 -102 50 80 -106 129 -81 48 152 84
6209 84 281 -38 -6 -181 -47 -102 -7 -132 -4 -159 -80 -7 19 101 138 56 -38 -39 -140 -198 284 -124 100 110 -134
$$ packed form
6040H1K3k08J17J68k15Oj5J39K19m19M3L0J91P3rl77J90K06k96J33j17J7o2J72
6064I0j22K05r2n3j87J81Q0l1J8n5o5K03k72M2K59l67J86J51j93K8O1k68L8K86
6088A23m3J38l67N8L7p9P5J3l4R9k9L6r5L0J43q9K31m36J87k88J92L49k74M91
6112D68l37l49L66rm2q9j8j0j24N1L7l0K36k19J0J94k56j3J96j05m9K99k16k16
6136b25R8O8r7J00j61L40K3m5j43J03Q0j09j44J01O8n4m7P5k29L9J3M9J37J06
6160A46o5J3j12R1J31l41J06J19j4m3j25Q6j25J09R9j5o9n9M3l53K99n9K22J75
6184B59j63o0j41K93k02Qjj21K2L5Q9k4N1R7j68qo8J52L0j86K35k10J29J04o8
6209H4J97l19L2j75J34n5R5j25J28j55P9P3K6Q2L7q2r4jj01n8M82m08K24J0k44
$$ plain form
6234 -134 31 -182 -11 -9 117 -93 20 -132 20 -1 -151 -88 -117 -168 -188 17 3 -170 -134 68 -24 36 359 -35
6258 -35 -9 -20 93 -11 145 -124 35 -120 77 -27 2 -157 -81 -152 -87 151 -159 -41 -154 -132 289 -81 175
6281 175 -61 -126 69 -231 54 -96 109 -16 -100 131 -51 -193 -26 95 -189 -1 -65 110 -33 21 -51 -45
6303 -45 -41 171 67 1 -2 -47 86 48 26 -22 -141 290 -21 -13 137 127 -141 -48 -104 16 24 -56 -50 32 -73 -292 -109
6330 -109 112 11 -79 -45 43 -161 45 74 73 -36 77 49 -141 24 -206 -152 182 -11 -40 61 -230 90 -174
6353 -174 -90 23 202 83 42 90 -46 -88 5 46 -152 -45 -78 219 -56 38 126 -43 1 56 79 263 -30 24
6377 24 37 86 58 -52 -12 -28 -296 -68 69 -141 237 -99 -100 -196 -38 24 -233 102 -158 -224 -226 -94 -25 -15 -110
6402 -110 -43 54 170 -164 -161 116 1 -103 -215 -168 -118 214 133 60 -292 160 -45 -156 25 -74 -98 -28 224 97
$$ packed form
6234a34J65k13J71KJ26k10J13j52J52k1j50O3k9n1k0K05j4j73L6K02r2O0L23l94
6258c5K6j1J13j04J56k69J59j55J97j04K9j59P6p1O5K38l10J18j13K2M21l70K56
6281A75k36o5J95l00K85j50K05j25q4K31j82j42J67J21k84J88o4J75j43N4p2O
6303d5MK12j04o6lm5J33l8k2m8j19M31l11QJ50j0k68R3n6J20Qq0OQ2j05k19J83
6330a09K21j01r0L4Q8k04K06K9jj09J13k8j90J65k30N4L34j93k9J01k91L20k64
6353a74Q4J13J79j19m1M8j36m2R3M1j98J07l3K97k75R4Q8j69M4N5K3J84k93N4
6377B4J3M9k8j10M0j6k68K28J37k10L78l36jr6J58O2k57L35k60o6kJ32O9J0r5
6402a10O7R7J16l34LK77j15j04j12M7N0L32q1p3l52M52k05j11J81r9k4P0K52j27
$$ plain form
6426 97 -70 187 -25 -72 -29 88 -126 269 24 -266 15 -21 -152 -232 62 -53 227 -198 79 43 -97 -301
6448 -301 48 -110 193 -58 -145 -103 140 -12 14 261 56 55 -14 48 -70 -231 -68 -184 271 243 -202 -78 164
6471 164 -90 222 -108 -234 98 -108 -104 153 -17 -147 -47 195 -41 -230 87 -92 75 81 7 -106 -180 -12
6493 -12 -60 184 211 -47 7 -23 90 -36 -123 -26 86 -62 -34 -5 4 90 -350 -11 29 80 -100 -31 158 88 12 109
6519 109 -220 45 113 -52 -85 -249 56 -238 306 12 -84 229 57 82 277 -142 -14 69 150 5 83 -11 68
6542 68 7 95 49 -76 84 226 -64 -37 -13 10 19 -16 119 -39 -33 -345 -7 50 -78 -97 89 6 69 -75 8 -124
6568 -124 -31 43 146 8 -220 12 122 117 114 -107 -100 56 -138 -23 75 143 169 50 409 360 45 -26 102 -82
6592 -82 -116 25 -30 132 -36 29 41 41 199 -51 -159 24 -111 113 -25 -353 186 -2 85 -5 -75 32 139
$$ packed form
6426I7j67K57k12m7M3J17k14L95k45k90K81l6j31q0K94j15K80m25K77l6j40k04
6448c01L49j58L03k51q7M2K43j52K6K47k05jo9O2j18j61J63j16M55k8m45J24K42
6471A64k54L12l30j26L32k06MK57j70j30J00K42k36j89L17j79J67Op4j13p4J68
6493a2m8K44K7k58N4l0J13j26q7R7J12j48K8K9RQ6m40L39M0N1j80O9J89p0p6R7
6519A09l29K65O8j65l3j64L05k94N44k94r6L13j72K5J95m19J28Q3Q1j45P8r4P9
6542F8o1Q8m6j25J60J42k90K7K4K3Rl5J35j58Ol12L38N7j28j9J86q3O3j44Q3j32
6568a24R3P4J03j38k28K32J10nlk21PJ56j94J15R8O8K6j19L59m9l15p1J28j84
6592h2l4J41n5J62j68O5J2%J58k50j08J83j35K24j38l28N39j88Q7r0p0J07J07
$$ plain form
6615 139 105 -50 295 -55 113 -173 -32 -106 106 16 -128 -105 -22 8 51 288 12 -25 -132 -63 -220 -73 3
6638 3 -44 -85 81 -233 -91 132 202 3 -13 7 188 95 -167 -57 14 163 -269 35 -7 159 -48 21 -5 163
6662 163 -40 173 -25 55 -118 75 -138 -47 140 -142 255 100 -15 -3 84 12 -86 134 -133 14 81 -85
6684 -85 -7 -36 -120 56 128 30 184 28 44 -138 -94 112 157 69 -49 11 11 5 35 66 -176 141 -194 4 198 144
6710 144 -20 171 107 -119 77 -280 -34 -63 -50 108 70 -87 -43 155 -120 175 -145 6 7 24 83 -245 -252 -242
6734 -242 93 -48 -221 -111 78 -76 130 36 116 -133 -12 74 -137 -185 -13 -23 147 230 92 -61 16 -133
6756 -133 14 -62 -196 29 -276 318 325 -410 -76 -200 -344 -211 148 252 -57 -149 -32 390 -659 457 98
6777 98 173 -273 98 -5 -378 -51 -30 29 -117 660 -328 -173 278 196 -237 -339 -262 -511 71 167 -141 18
$$ packed form
6615A39l4j55L45l50J68k86J41p4K12r0j44K3Q3L0M3K37k76l7j07O9j57J47P6
6638Cm7m1J66l14J42K23P0j99j6K0J81r3k62J10P1J49m32L04m2J66k07O9k6J68
6662A63k03K13j98Q0j73J93k13R1J87k82L97j55j15J2Q7p2r8K20k67J47O7j66
6684h5P8k9q4J76P2r8J54j56J6j82M4K06M5q8j18O0%oL0L1k42L17l35J98J94n4
6710A44j64J91o4k26J96l57K46k9J3J58l8j57M4J98k75K95l20J51JJ7N9l28pJ0
6734b42L35j41j73J10J89j54K06r4Q0k49J21Q6k11m8J72j0J70Q3j38j53P7j49
6756a33J47p6j34K25l05N94Pp35L34j24j44J33L59J04l09r2J17M22j049J116l59
6777I8P5m46L71j03l73L27K1N9j46P77r88J55M51q2m33j02P7k49N82R6l08J59
$$ plain form
6799 18 -7 -27 -439 318 416 -260 -252 111 533 -169 -105 283 153 99 -219 218 -83 175 385 572 -101 -35 -545
6822 -545 -634 -147 309 352 -23 435 157 383 -84 124 58 -54 -197 -60 -211 -113 -170 -240 -32 -71 60 -68
6844 -68 79 136 4 41 -151 -102 -42 137 -351 -13 135 220 239 -118 -18 107 51 16 228 -53 -190 70 -236
6867 -236 37 -310 -60 -110 -125 -70 -157 -49 -184 160 175 353 -270 -147 190 -64 -166 -243 397 -279 -78 -113
6889 -113 -157 -13 -17 97 -127 205 -69 114 198 18 176 73 92 -188 24 -155 48 -319 52 -55 150 32
6911 32 84 -185 -9 -38 68 -52 72 -110 -109 141 -29 75 -43 47 -12 -58 48 -124 86 99 -50 -146 62
6934 62 -65 -153 -89 -190 70 -74 9 -28 47 26 195 174 -58 171 -12 -17 182 -52 30 294 39 77 34 54 39
6959 39 -133 -53 52 -59 -10 114 -28 189 -77 41 -186 25 -314 -69 -98 -210 -78 227 -214 183 112 -5
$$ packed form
6799A8k5k0m12P57R8o76QL63M22p02O4L88j30n4l18M37l01K58K10J87o73O6n10
6822e45q9M87M56M3l75M58k78K26m67K08o6j12j43J37j51R8n7p0K08l9J31j28
6844f8J47N7j32L7j92M9O0J79m88L38J48Q5J9l57J00J25n6l5K12k81j37K60l06
6867b36K73l47K50n0j5N5q7J08j35L44J5J78o23J23L37k54j02p7O40o76K01l5
6889a13m4J44mJ14k24L32k74J83Q4j80J58j03J9k80K12j79K03l67L71j07K05j18
6911C2N2k69J76k9J06j20J24j82JK50j70J04j18R0n9m6J06j72K10J3j49r6K08
6934F2j27q8O4j01K60j44Q3l7P5k1J69k1k32K29j83nJ99k34Q2K64k55L8m3K0j5
6959C9j72Q0J05j11M9J24j42K17k66J18k27K11l39K45k9j12J32L05m41L97p1j17
$$ plain form
6981 -5 -15 -67 -7 118 -211 43 222 -84 241 146 -175 25 240 -141 86 -149 -17 -22 24 16 -118 -461 -90 51
7005 51 151 -52 -32 32 98 65 166 205 105 71 70 -54 -63 235 -132 60 -28 61 133 -15 36 118 67 82 62 -57
7031 -57 5 76 180 155 -215 32 43 -175 -128 -264 36 20 -223 -32 -55 2 30 -75 172 -231 62 135 -58 -2
7055 -2 94 -70 -58 -147 104 -39 76 143 198 183 252 -48 -8 -113 -88 -74 36 -59 51 -104 -3 162 -132 47
7079 47 8 -156 -85 -153 -74 56 -15 99 184 81 126 21 -111 -16 -8 -236 -55 -52 147 -312 -12 315 -96 201
7103 201 -84 30 91 -105 -42 -116 -126 144 -109 -63 20 8 -205 29 48 34 -33 -107 -88 -312 197 -212 -45 -354
7127 -354 264 -107 173 -116 -140 139 -32 8 -118 -128 125 19 -98 98 -101 17 68 40 67 -111 133 166
7149 166 164 -55 -4 110 -82 84 72 21 56 53 210 -116 -56 -8 89 38 -50 162 23 136 48 -3 84 -75 74
$$ packed form
6981ej0n2O0J25l29K54J79l06L25r5l21K00K15l81K27k35J32nM6qj34l43L71J41
7005E1J00k03K0O4O6l3J01L9j00l4jj24rK98l67J92q8Q9P2j48N1Q2n1J5k0j19
7031e7O2P1J04k5l70K47J1k18M7j36L00j6k43J91k3N7K8j05K47m03K93P3j93N6
7055bR6j64J2q9K51j43J15O7N5j5O9l00M0j05K5J4J10r5J10j55J01J65k94J79
7079D7l9j64P1o8P9J30p1J14Q5j03M5j05j32R5Qk28J81LJ99m59L00L27m11K97
7103B01k85J14O1j96O3p4j0K70k53M6Q3j2k13K34J9j4o7p4J9k24N09m09J67l09
7127c54O18l71K80k89k4K79j71M0j26j0K53j06j17J96j99J18N1k8K7j78K44L3
7149A66kk19N1J14j92J66j2n1L5lJ57l26O0M8R7n1q8K12j39J13q8n1Q7j59J49
$$ plain form
7174 74 -19 -53 219 209 140 -172 -89 13 -58 68 -183 115 -61 88 47 -27 117 -172 133 -113 -160 192 59
7197 59 -55 169 241 -96 -87 109 297 99 -243 -110 -63 26 -50 131 255 50 -14 -31 -187 45 40 -172 -215 -31
7221 -31 -74 -126 -11 -69 124 -80 -181 111 20 224 -44 -73 -43 39 -45 -288 -165 -29 65 39 15 -70 116 64 -103
7246 -103 -315 103 -64 -286 -72 95 -124 66 40 104 109 -23 169 -39 254 105 -30 66 11 108 8 100 -68
7269 -68 -75 303 109 40 -129 -56 259 -84 305 -81 20 -9 -5 -138 -148 106 -113 -181 -89 17 -226 99 -224 124
7293 124 -50 134 76 -130 52 -111 137 13 16 -63 34 -145 18 -137 2 79 -36 -206 -61 33 -39 -117 -131
7316 -131 -4 132 52 215 -182 80 99 33 -6 102 41 -167 -55 -86 137 -92 -6 -53 -41 -13 -223 -249 -149 -171
7340 -171 11 -184 -35 -16 105 -105 25 -288 29 28 -33 -28 132 -8 78 -178 -92 -17 -185 44 -40 -121 -114 -112 -160
$$ packed form
7174G4r3l4K72j0o9l12Q3J02p1J26k51K98j76J49m1p4J44k89L05k46m7L52j33
7197E9j14K24P2l37RJ96J88j98l42J33M7Q9p6J81J24k05o4j7j56K32nk12m3J84
7221c1m3n2J15n8J93k04j01K92r1K04k68k9L0Q2q4k43J23J36R4k6k4q5J86n2j67
7246a03k12M18j67k22K14J67k19J90k6O4Nj32J92k08K93j49j35R6n5R7j00R2j68
7269f8pL78j94o9j69P3L15l43L89l86J01k9Mj33j0K54k19o8R2J06k43L25l23L48
7293A24j74J84n8k06J82j63K48j24Lp9R7j79J63j55J39P7j15j70J45R4p2p8j4
7316a31J27J36q0J63l97K62J9o6l9J08o1k08J12l1K23k29Q6m7J2K8k10k6J00k2
7340a71J82j95J49J9J21k10J30l13L17jo1NJ60j40Q6k56Q6P5j68K29q4q1PKm8
$$ plain form
7365 -160 190 290 -94 -90 48 -55 138 165 -173 -37 -82 -125 151 128 80 -24 -210 133 39 -10 52 -158 -34
7388 -34 -39 25 -17 71 -184 -134 -204 66 225 -139 47 -18 -183 -43 18 72 -4 -78 -88 -206 -22 -56 110 36 -177
7413 -177 -78 -8 91 -63 61 23 -107 12 -10 -3 32 194 67 -19 160 60 -31 -57 -7 -10 -94 -20 -61 -70 -45 -222 -61
7440 -61 80 -49 -111 103 130 -46 27 42 18 -158 118 157 -180 -91 -192 30 -105 327 48 -336 33 -78 169
7463 169 46 -139 -264 234 7 -64 -125 81 8 123 -30 27 -92 -44 -112 120 19 -74 -92 45 -219 68 112
7486 112 -73 93 2 -97 -88 98 152 -160 16 -110 38 62 -187 -136 -28 231 28 -64 12 -97 -81 113 -284
7509 -284 -14 288 1 85 -95 -170 1 -36 -71 159 53 27 -18 -147 -83 42 4 52 241 74 -41 96 -19
7532 -19 -4 47 -280 34 -7 -71 30 -82 157 86 91 176 252 -156 -89 97 -204 3 21 -98 -79 143 104 -43 -98
$$ packed form
7365a60L50J00l84MJ38j03J93K7l38J36m5m3K76k3m8j04j86L43r4m9O2k10J24
7388c4nO4m2Q8k55N0p0K70J59l64J86o5j65J40O1N4p6p4j0j18J84l4J66p4k13
7413a77R9P0R9j54J24l8j30J19k2PL5J62j27q6J79j00r1k6N0lq4P4m1rK5j77J61
7440f1J41j29o2K14K7j76P3J5k4j76K76L9l37Q9j01K22j35M32k79l84L69j11K47
7463A69j23j85j25M98k27p1o1K06p3J15j53N7j19M8o8K32j01r3j8J37k64K87M4
7486A12j85J66r1r9RJ86N4l12J76j26J48K4k49N1J08K59k03r2P6j09J6J94l97
7509b84K70L02k87Q4j80p5J71l7l5K30j06k6m5j29O4J25l8M8J89j67j15J37j15
7532a9J5N1l27L14m1o4J01j12K39p1NQ5P6m08O7J86l01K07J8j19J9K22l9j47n5
$$ plain form
7557 -98 -81 -13 -138 -62 132 -89 -182 -108 -7 84 -43 96 95 -82 -93 32 -54 -57 303 -153 52 -70 136 13
7581 13 -69 102 266 -80 72 113 17 187 145 17 -95 -131 26 -78 -13 -7 -3 -62 -63 -265 -124 38 1 138 131 87
7607 87 -205 -173 46 -38 -22 79 38 -48 31 -26 25 -80 108 122 200 142 -112 3 131 56 7 -257 199 101 7
7632 7 82 16 -168 122 37 -122 65 -42 81 -346 -137 -63 31 12 -4 -186 111 9 147 202 -91 -62 23 26 -76
7657 -76 -124 -23 -169 5 -91 2 80 93 91 -73 53 -45 -178 101 -165 -68 209 -113 -120 18 28 47 199 21 73
7682 73 -247 -4 67 79 118 310 0 -136 1 -72 -70 -30 84 222 -4 21 -99 20 139 -34 83 103 -96
7705 -96 118 234 110 120 128 -142 42 105 219 119 -15 191 176 -202 -29 -349 -118 -15 75 -304 91 309
7727 309 31 -91 -40 -51 -89 -62 -21 -32 139 -107 -102 213 -114 308 -152 -158 -52 69 319 -25 -8 -41 -85 -74 174
$$ packed form
7557i8J7O8j25P6J94k21r3P4J01R1j27J39jj77j1J25q6lL60m56K05j22K06j23
7581A3q2J71J64l46J52M1r6J70m2j28j12l6J57j04O5OMn9jk02J41J62l7J37pm4
7607H7k92L2K19q4J6J01m1q6P9n7N1j05J88J4P8n8k54J15J28p5m9k64M56r8r4
7632GP5o6j84K90q5j59J87j07J23m27K09P4R4j9j6j82K97j02J38N5k93K9Q5Lj02
7657g6m8J01j46J74r6R3P8J3kj64J26r8j33K79k66R7K77l22pJ38J0J9J52j78N2
7682G3l20K43P1J2L9J92l10j36J37p3KM0J14J38k26K5j20J19J19j73J17K0j99
7705i6K14J16j24J0Qk70J84O3J14j00j34K06j5l78J73l20K31J03R0l79L95K18
7727C09k78j22N1j1l8K7M1j1J71k46NL15l27M22m60oJ06J21K50l44J7l3m4J1K48
$$ plain form
7752 174 -100 63 198 49 -146 -167 46 101 -92 112 21 86 -89 -31 -47 -152 -141 30 66 32 114 -262 54
7775 54 130 -34 28 52 -58 50 -23 -240 105 130 -24 -136 -41 108 -132 -62 50 190 135 70 -220 -42 17 -123
7799 -123 190 81 -96 179 180 -4 159 -83 5 175 39 -96 69 109 74 -194 189 94 26 51 224 -253 -67
7822 -67 58 -51 264 68 29 -59 -213 177 -46 12 -108 -39 143 240 59 -70 191 100 -157 -309 28 32 184
7845 184 -185 -63 -118 36 -89 -77 40 82 -114 -3 236 52 -216 -9 9 92 259 38 85 -131 91 -223
7867 -223 21 -12 105 -217 56 -87 -96 -177 277 -79 -102 -219 -151 -248 -127 -49 139 -69 26 -7 -37 81 -127 51
7891 51 -122 -53 40 -195 41 -39 38 140 -76 108 -171 172 40 177 235 51 142 -312 136 166 -225 2 13
7914 13 -117 -244 -44 -43 129 -27 91 91 -56 -29 7 20 -169 146 -61 17 -84 -120 -17 -32 -94 122 -91 49
$$ packed form
7752A74k74J63J35j49j95k1K13N5j93K04r1O5j75N8j6j05J1J71L6l4Q2l76L16
7775E4P6j64O2K4j10J08p3k17L45K5j54j12R5J49k40P0J12J40n5o5k90J78N9j40
7799a23L13j09j77K75Jj84J63k42Q8J70j36j35J65M0l5k68L83r5o8K5J73m77J86
7822f7J25j09L15j96l9q8j54L90k23N8j20O9J82R7j81j29K61r1k57j52L37MJ52
7845A84l69J22n5J54j25J2J17M2j96J11K39j84k68K07J8Q3J67k21M7k16K22l14
7867b23K44l3J17l22K73j43rq1M54l56k3j17O8r7J21P8J88k08R5l3l0J18k08J78
7891E1j73O9R3k35K36q0P7J02k16J84k79L43j32J37N8j84R1m54M48L0l91K27J1
7914A3j30j27K00JJ72j56J18%j47K7L6J3j89L15k07P8j01l6J03j5o2K16k13J40
$$ plain form
7938 49 347 88 3 -72 -134 -49 86 349 -85 -128 -109 -35 98 123 -172 -37 -100 -18 -38 -25 -5 97 -34 -133 -15
7963 -15 -155 246 40 -111 -67 -28 197 8 56 -36 -168 210 184 -49 6 27 100 230 17 112 -64 -199 16
7986 16 199 -126 -66 215 -122 34 69 -228 32 -199 -66 -19 111 126 179 -119 -109 155 7 83 94 227 84
8009 84 220 -215 81 144 246 -37 236 -11 -108 -101 183 95 46 80 36 148 29 176 58 -82 -440 94 -211
8032 -211 239 -145 -16 112 -56 185 -236 -92 -151 43 -112 -174 -80 -649 -59 329 -69 208 -520 -291 -243
8053 -243 350 387 -205 -207 -180 -182 -353 -46 -540 -557 -219 220 -388 -4 -525 -603 -606 -692 603 -848 135 179 -130
8076 -130 -734 -940 -577 -115 563 420 -198 -637 245 274 -857 390 -347 -73 406 39 212 284 308 -103
8096 -103 -523 -465 -402 -299 328 347 -199 197 -26 174 500 -147 235 -49 166 147 -153 300 179 -23 77
$$ packed form
7938D9K98k59q5p5o2Q5J35K63m34m3J9P4J33K5k95J35o3Q2k0J3K0J02j31r9J18
7963a5j40M01k06j51M4L9K25j89M8r2j32L78k6k33N5K1P3J30k13R5j76j35K15
7986A6J83l25O0K81l37J56L5k97K60k31J33M7J30J5N3k98J0K64j48P6J1J33j43
8009H4J36m35K96O3J02k83K73k47r7PK84q8m9L4m4J12j19J47j18j40l58N34l05
8032b11M50l84J29J28j68K41m21J44n9J94j55o2R4n69N90L88l98K77p28K29M8
8053b43N93L7n92kK7kj71L07m94j7L38M39o08L84n21p8lq6J295j451R83M4l09
8076a30o04k06L63M62O78j43o18m39Q82K9j131J247p37K74M79l67J73P2K4m11
8096a03m20N8O3J03O27J9n46L96k23K00L26o47L82k84K15j9l00M53j21k02J00
$$ plain form
8117 77 199 151 169 -167 -73 -108 29 249 1 -43 126 -9 -12 115 23 -166 143 192 -137 -195 110 49 -279 -97
8141 -97 -27 83 173 -9 137 111 33 -49 -38 17 16 111 -135 -137 -166 -43 -141 104 -17 25 51 130 16 168 68 13
8167 13 1 159 -104 -183 86 -143 -110 -6 32 -145 -89 129 -75 -13 170 71 -99 -85 -135 91 -16 238 69
8190 69 10
$$ packed form
8117G7J22m8J8l36R4l5J37K20k48m4J69j35lJ27r2j89L09M9l29n8L05o1l28J82
8141i7P0J10R0j82J46k6p8q2J1N5jR5k46kk9J23r8K45j21M2K6P9j14J52j00n5
8167A3j2J58k63p9K69k29L3J04L8j77N6K18k04O2J83r9j70J4n0K26j07K54j69
8190F9n9
8191A0
$$ Imaginary data points
##PAGE= N=2
##DATA TABLE= (X++(I..I)), XYDATA
$$ plain form
0 0 0 0 0 0 0 0 0 0 0 0 0 0 -6 8 -8 8 -8 16 -16 24 -24 32 -38 40 -48 57 -70 80 -94 105 -121 140 -159 181
34 181 -205 230 -260 292 -327 364 -406 451 -501 555 -614 682 -753 826 -914 1007 -1110 1220
52 1220 -1343 1483 -1634 1808 -2001 2222 -2476 2771 -3121 3542 -4061 4713 -5568 6743 -8464
67 -8464 11271 -16928 57185 -124632 28191 98755 -161729 69269 12133 -71737 74988
78 74988 -13887 -18289 43506 -43137 13655 6006 -26040 20910 12237 -8167 13030 13107 -13243
91 -13243 -10105 3721 -34172 -1404 -7216 -31367 24365 -24961 -19582 39007 -43602 8690 37251
104 37251 -42013 29855 6842 -38180 21168 -32607 -16512 11419 -35703 21281 5440 -25124
116 -25124 30149 -16084 -22095 17974 -19755 -4159 24568 -355 7837 25348 -4352 -11641 15110
$$ packed form
0@%%%%%%%%%%%%oJ4j6J6j6K4l2M0m8N6p0P8q8J05j27J50j74J99k26K61k99L40
34A81l86M35m90N52o19O91p70Q57r52J056j169J296j435J579j740J921k117K330
52A220k563K826l117L442l809M223m698N247n892O663p603Q774j0281J2311j5207
67h464J9735k8199P4113j81817J52823P0564k60484K30998n7136q3870J46725
78G4988q8875m402O1795q6643N6792p649l2046M6950q673k0404K1197P7k6350
91a3243L138J3826l7893L2768n812k4151N5732m9326N379N8589q2609N2292K8561
104C7251p9264P1868k3013m5022N9348n3775J6095K7931m7122N6984j5841l0564
116b5124N5273m6233o011M0069l7729J5596K8727k4923Q192J7511k9700p289K6751
$$ plain form
129 15110 -22570 -17196 24900 -24785 4148 33652 -25979 23154 16166 -27454 33829 -9272
141 -9272 -10942 41078 -23305 12622 29489 -32624 21573 3392 -26446 23973 -11787 -6184 15486
154 15486 -20114 8765 4037 -11882 23728 4364 835 20339 -5487 -8452 1685 -14278 -14862
167 -14862 2169 -7603 -6928 16866 -7399 -4033 16002 -26087 -2849 11331 -27742 19974 13117
180 13117 -16138 29164 -9186 -17877 14105 -31151 -6370 8428 -26095 15531 5987 -14403
192 -14403 22427 -2476 -9212 17462 -6194 -3574 15277 -3639 -3250 10669 -7096 -7788 10773
205 10773 -7679 -1876 15042 -11616 4004 8843 -17630 14312 4926 -7738 29059 -1510 -273
218 -273 23235 -20656 -1364 6784 -28126 7965 2283 -13351 22646 -1255 -3476 15441 -14329
$$ packed form
129A5110l7680N374M2096m9685K8933K9504n9631M9133o988m3620O1283m3101
141i272j670N2020o4383L5927J6867o2113N4197j8181k9838N0419l5760N603K1670
154A5486l5600K8879m728j5919L5610j9364l529J9504k5826k965J0137j5963n84
167a4862J7031r772O75K3794k4265L366K0035m2089K3238J4180l9073M7716o857
180A3117k9255M5302l8350q691L1982m5256K4781J4798l4523M1626r544k0390
192a4403L6830k4903o736K6674k3656K620J8851j8916L89J3919j7765o92J8561
205A0773j8452N803J6918k6658J5620M839k6473L1942r386j2664L6797l0569J237
218b73K3508m3891J9292Q148l4910L6091n682j5634L5997k3901k221J8917k9770
$$ plain form
231 -14329 -2983 5296 -10866 7654 6255 -1434 8444 -2592 -5814 -1718 -14557 -8771 760 -9901
245 -9901 -1843 10439 -6558 866 11444 -11851 2047 8077 -13508 7819 392 -13515 8461
258 8461 -12517 -9085 10587 -15520 4800 10452 -14270 10472 847 -12317 11273 -4024 457
271 457 15988 -3155 8041 9829 -10527 450 -1452 -14957 -979 4743 -3336 8703 13836
284 13836 -169 6092 5580 -7383 3919 656 -2244 11467 -798 4292 9382 -10754 4201
297 4201 -506 -15341 8298 -4250 -7084 15988 -5258 1831 14582 -9640 4538 7609 -11063
310 -11063 5189 909 -11992 2259 -5402 -9827 3608 -3458 -3436 7762 -3657 -3769 5354 -10037
324 -10037 -3752 7014 -7381 4167 8950 -7661 5134 -1662 -14307 2093 -10394 -10584 9173
$$ packed form
231a4329J1346Q279j6162J8520j399p689R878j1036l222M096j2839N786R531j0661
245i901Q058J2282j6997P424J0578k3295J3898O030k1585K1327p427j3907K1976
258H461k0978L432J9672k6107K0320N652k4722K4742r625j3164K3590j5297M481
271D57J5531j9143J1196J788k0356J0977j902j3505J3978N722q079J2039N133
284A3836j4005O261n12j2963J1302l263k900J3711j2265N090N090k0136J4955
297D201m707j4835K3639j2548k834K3072k1246P089J2751k4222J4178L071j8672
310a1063J6252m280j2901J4251p661m425J3435p066K2J1198j1419j12R123j5391
324a0037O285J0766j4395J1548M783j6611J2795o796j2645J6400j2487j90J9757
$$ plain form
337 9173 -6574 2674 14848 -5696 3958 6610 -8488 1284 1798 -4718 4682 2277 454 3146
351 3146 -2418 -1191 230 -4150 716 4183 -1223 4615 6725 -1173 4802 5266 -1217 6404 2343
366 2343 -1369 4088 -5685 -3318 1788 -9157 3132 5146 -3733 10539 2831 -4001 6515 -4685
380 -4685 -3869 4947 -5739 2009 6781 -4500 4262 698 -10269 -930 -6351 -10525 2927 -1366
394 -1366 -902 9051 -306 -62 4217 -7103 -2300 353 -8003 1821 -481 -6733 3823 -4116 -5389
409 -5389 4144 -6305 -1460 4589 -6265 3065 4030 -4723 6045 1945 -3029 7054 -907 -2124
423 -2124 4281 -6187 -2773 1177 -6703 2165 4857 -678 8854 5485 -1184 6298 -922 -4426 4818
438 4818 -1311 477 8186 -294 2081 4046 -5656 -944 -460 -5933 2681 2369 246 7869 2855 1006
$$ packed form
337I173j5747R248J2174k0544R654K652j5098R772N14o516R400k405j823K692
351C146n564J227J421m380M866L467n406N838K110p898N975M64o483P621m061
366B343l712N457r773K367N106j0945J2289K014q879J4272p708o832J0516j1200
380d685Q16Q816j0686P748M772j1281Q762l564j0967R339n421m174J3452m293
394a366M64R953r357K44M279j1320M803K653q356R824k302o252J0556p939j273
409e389R533j0449M845O049j0854R330R65q753J0768m100m974J0083p961j217
423b124O405j0468L414L950p880Q868K692n535R532l369o669P482p220l504R244
438D818o129J788P709q480K375J965r702M712M84n473Q614l12k123P623n014j849
$$ plain form
454 1006 5117 -2681 -1744 1597 -5125 -521 1522 -5021 1042 9 -5895 2008 -1254 -4272 4789
469 4789 -2178 -1909 4353 -4923 -295 2310 -5134 3055 822 -5371 2743 -4749 -7471 321 -6764
484 -6764 -3013 4601 -1578 3253 5869 -2089 1501 816 -5910 -25 -255 -4050 3525 1964 -1507 4417
500 4417 -1302 -3458 1542 -4578 -404 4714 -1361 6856 5940 -1211 6653 113 -3412 4771 -2757
515 -2757 -1446 3732 -3531 490 2302 -2499 3255 2002 -234 3825 1388 -789 2218 67 -1857
530 -1857 2288 -227 -1306 3583 -1864 -1443 1942 -6967 -2167 306 -7446 3810 2721 -2809 8371
545 8371 240 -3184 3322 -7448 -2493 35 -6814 3130 -425 -3606 4945 -3977 -3798 2672 -5220
560 -5220 -1610 2809 -1908 2039 3703 -604 1471 1193 -2693 -63 -297 -4311 1734 -574 -3498 4179
$$ packed form
454A006M111p798R37L341o722M604K043o543O063j033n904P903l262l018R061
469D789o967K69O262r276M628K605p444Q189k233o193Q114p492k722P792p085
484f764L751P614o179M831K616p958L590o85o726N885k30l795P575j561l471N924
500D417n719k156N000o120M174N118o075Q217r16p151P864o540l525Q183p528
515b757J311N178p263M021J812m801N754j253k236M059k437k177L007k151j924
530a857M145k515j079M889n447M21L385q909M800K473p752J1256j089n530J1180
545H371q131l424O506j0770M955K528o849R944l555l181Q551q922J79O470p892
560e220L610M419m717L947J664m307K075k78l886K630k34m014O045k308k924P677
$$ plain form
576 4179 -698 -880 5892 -1679 3149 4748 -3155 5152 -83 -4310 6327 -2925 -1041 7784 -3333
591 -3333 1568 3603 -5223 1089 -490 -2671 4090 834 2561 5803 346 1513 1879 -3030 -1874
606 -1874 -299 -3624 -1390 2610 -2063 659 2553 -4503 1265 3 -5737 4209 -1355 -2888 6138
621 6138 -3717 -1556 3866 -6186 392 363 -6019 1748 -3615 -4553 2568 -3756 -455 4120 -1558 1901
637 1901 2714 -2355 11 -127 -3387 -813 184 -1753 2008 1849 -1968 2766 -1128 -3733 3028 -2387
653 -2387 -1211 6381 -237 3407 5539 -2410 3186 -147 -4280 2210 -2952 -497 4719 -1672 1997
668 1997 3240 -1760 1895 905 -565 2668 127 1262 1760 -294 1173 1029 -463 -583 224 -2095
684 -2095 -1085 1331 -2143 -192 1118 -2604 2272 1501 -1253 3432 118 -2417 1774 -4818 -2175
$$ packed form
576D179m877j82O772p571M828J599p903Q307n235m227J0637r252J884Q825j1117
591c333M901K035q826O312j579k181O761l256J727L242n457J167L66m909J156
606a874J575l325K234M000m673K722J894p056N768j262n740R946n564j533R026
621F138r855K161N422j0052O578k9o382P767n363r38P121o324L301M575n678L459
637A901Q13n069K366j38l260K574R97j937L761j59l817M734l894k605O761n415
653b387J176P592o618L644K132p949N596l333m133O490n162K455N216o391L669
668A997J243n000L655r90j470L233k541J135M98k054J467j44j492j20Q07k319
684b095J010K416l474J951J310l722M876p71k754M685l314k535M191o592K643
$$ plain form
699 -2175 851 -4381 1553 1538 -3556 2525 -1501 -3186 2092 -4095 -972 2511 -2243 2260 2684 -1771
715 -1771 1286 -413 -3962 -921 -1078 -2902 1349 141 -608 3459 410 -60 3213 -1858 554 2714
731 2714 -2694 3059 1632 -3535 4313 -795 -2441 5458 -2367 -409 4370 -3877 1361 2524 -3244
746 -3244 4597 1650 -625 5120 -161 -1323 2414 -2715 -1876 1138 -1789 276 1480 -331 80 767
762 767 -810 -418 -362 -2942 1581 -680 -681 3478 -943 -2240 1757 -3911 -2776 -579 -4265 1519 962
779 962 -2361 3050 -1368 -1263 2466 -2295 -245 900 -1953 286 -700 -1797 454 -615 -967 1477
795 1477 -620 -1041 968 -1167 -509 1818 -594 1190 2883 937 1926 2187 -1543 1010 -129 -3468
811 -3468 1887 -1096 -686 3479 -272 2156 2406 -1703 1921 355 -1655 2680 -471 -75 3347 -1193
$$ packed form
699b175L026n232N934j5n094O081m026j685N278o187L123L483m754M503M24m455
715a771L057j699l549L041j57j824M251j208p49M067l049m70L273n071K412K160
731B714n408N753j427n167P848n108j646P899p825J958M779q247N238J163n768
746c244P841k947k275N745n281j162L737n129Q39L014k927K065J204j811M11O87
762G67j577L92N6k580M523k261jM159m421j297L997n668J135K197l686N784n57
779I62l323N411m418J05L729m761K050J145k853K239r86j097K251j069l52K444
795A477k097m21K009k135O58K327k412J784J693j946R89K61l730K553j139l339
811c468N355k983M10M165l751K428K50m109L624j566k010M335l151L96L422m540
$$ plain form
827 -1193 705 2159 -2849 -695 -267 -2223 908 587 -348 1222 304 -286 818 108 -1052 169 -1684
844 -1684 -2137 1216 -3084 -1314 878 -2477 427 761 -2121 1226 -1528 -2979 1769 -2938 -1491 3295
860 3295 -1658 492 2701 -2793 -588 -570 -3611 -559 -667 -1318 1930 699 150 2413 -334 -1110 1678
877 1678 -1660 -718 2245 -1052 927 2710 -1599 1370 557 -2337 1953 -627 -1234 3377 -407 506
893 506 3564 -878 1400 2467 -1246 2021 196 -1812 1274 -1311 -1218 1751 -1232 213 2553 -1193
909 -1193 660 1016 -1688 407 165 -1532 1311 -285 -576 1890 -1366 -1334 576 -3319 -1504 -58
925 -58 -2701 712 1150 -1136 1465 -35 -1469 911 -1956 -1418 785 -1675 -131 1016 -1492 52
941 52 239 -1301 383 -506 -809 809 -925 474 1788 -1003 1344 1893 -1138 1334 898 -2667 899
$$ packed form
827a193J898J454n008K154M28j956L131l21r35J570r18n90J104p10j160J221j853
844a684m53L353m300J770K192l355K904L34k882L347k754j451M748m707J447M786
860C295m953K150K209n494K205J8l041L052j08o51L248j231n49K263k747p76K788
877A678l338R42K963l297J979J783m309K969q13k894M290k580o07M611l784R13
893E06L058m442K278J067l713L267j825k008L086k585R3K969k983J445K340l746
909a193J853L56k704K095k42j697K843j596k91K466l256L2J910l895J815J446
925e8k643L413M38k286K601j500j434K380k867N38K203k460J544J147k508J544
941E2J87j540J684q89l03J618j734J399J314k791K347N49l031K472m36l565L566
$$ plain form
958 899 -74 -2114 2207 187 -349 2966 607 658 2327 -873 391 944 -1439 1420 904 -392 2771
975 2771 315 -1113 1545 -1938 -1583 1233 -1700 616 2294 -972 1783 1423 -1640 1090 -384 -2121
991 -2121 668 -1032 -1476 933 -1275 -160 803 -1501 -65 4 -1660 486 -676 -1626 1279 -505
1007 -505 -1030 1421 -895 -825 984 -2226 -1451 176 -2281 -228 885 -1232 1688 1302 -1147 1430
1023 1430 -630 -1683 1351 -1155 -400 2043 -581 964 1514 -1284 744 201 -1731 1218 55 -644
1039 -644 2472 215 607 2510 -12 108 1241 -1328 366 846 -1373 1342 266 -885 1837 -554
1055 -554 -516 2073 -1181 -290 1793 -1984 409 866 -1817 1804 428 -1190 1637 -1485 -1452 583 -2528
1072 -2528 -655 788 -1537 1157 921 -947 1272 -633 -1653 571 -1524 -1446 851 -861 -403 1268
$$ packed form
958H99r73k040M321k020n36L315k359N1J669l200J264N53k383K859n16j296L163
975B771k456j428K658l483L55K816k933K316J678l266K755l60l063K730j474j737
991b121K789j700m44K409k208J115R63k304J436O9j664K146j162r50K905j784
1007e05n25K451k316P0J809l210P75J627k457K053J113k117K920l86k449K577
1023A430k060j053L034k506P55K443k624J545N50k798K028n43j932K949j163o99
1039f44L116k257L92J903k522J20J133k569J694M80k219K715j076j151K722k391
1055e54L8K589l254Q91K083l777K393M57k683L621j376j618K827l122L3K035l111
1072b528J873J443k325K694k36j868K219j905j020K224k095P8K297j712M58J671
$$ plain form
1088 1268 -1356 -502 744 -1913 69 68 -1510 1520 435 -742 2127 -509 -416 1661 -1825 -61
1104 -61 994 -2304 1190 906 -1168 2236 278 -598 2444 -216 -171 1843 -1040 444 1394 -877 797
1121 797 1448 -758 1183 664 -1186 893 -241 -1111 1756 -407 159 2393 -441 544 1557 -2070
1137 -2070 422 23 -2155 1454 -553 -1342 1732 -1087 -625 960 -1856 -256 100 -1881 745 154
1153 154 -1117 901 -640 -828 477 -1096 -1242 -63 -720 -929 323 -1020 -191 730 -820 576 936
1170 936 -1043 696 -115 -1478 1136 -762 -345 1902 -885 381 1329 -1535 672 88 -1438 1555
1186 1555 123 -19 2304 232 729 1437 -719 -9 516 -1289 82 792 -183 878 818 -223 1105
1203 1105 371 -765 1313 -465 -819 1753 -1038 166 1909 -1417 998 800 -2134 871 -795 -1875
$$ packed form
1088A268k624Q54J246k657J982jj578L030j085j177K869k636R3K077l486J764
1104f1J055l298L494k84k074L404j958q76L042k660M5K014k883J484R50k271J674
1121G97O51k206J941n19j850K079j134q70K867k163N66K234k834R85J013l627
1137b070K492l99k178L609k007p89L074k819M62J585k816J600L56j981K626n91
1153A54j271K018j541j88J305j573j46J179o57k09J252j343Q29R21j550J396L60
1170I36j979J739q11j363K614j898M17K247k787J266R48k864K207n84j526K993
1186A555j432j42K323k072M97P08k156P10N25j805J371P10r75J061o0j041J328
1203A105p34j136K078j778l54K572k791J204J743l326K415j98k934L005j666j080
$$ plain form
1219 -1875 1186 -974 -535 1259 -1274 490 520 -1717 218 -652 -1611 223 -660 -735 622 -502 -599
1236 -599 678 -988 -456 382 -1233 -124 612 -911 712 779 -823 1423 -573 -1033 865 -1207 -114
1253 -114 1161 -1302 831 894 -1170 1583 -134 -712 1477 -520 -235 1290 -952 728 1285 -448
1269 -448 966 525 -580 1042 97 -787 690 -234 -287 1035 -108 279 1572 -382 -216 867 -1394
1286 -1394 -130 528 -1385 994 448 -812 1019 -636 -912 761 -1573 -386 406 -1153 751 213
1302 213 -715 766 -495 -1120 199 -1375 -904 55 -955 116 523 -785 424 496 -966 -179 -176 -1272
1320 -1272 493 -51 -847 918 -242 -412 1247 -423 -178 855 -1116 214 463 -1135 1063 642
1336 642 29 1189 180 -85 796 -601 16 361 -89 657 856 343 853 627 -252 290 220 -535 326
$$ packed form
1219a875L061k160M39J794k533J764L0k237J935q70r59J834q83p5J357j124r7
1236e99J277j666N32Q38j615J109P36j523J623O7j602K246j996m60J898k072J093
1253a14J275k463K133O3k064K753j717n78K189j997K85J525k242J680N57j733
1269d48J414m41j105J622r45q84J477r24n3J322j143L87J293j954J66J083k261
1286a394J264O58j913K379n46j260J831j655k76J673k334J187P92j559J904n38
1302B13r28J481j261o25J319j574M71R59j010J071M07j308J209P2j462P87Lj096
1320a272J765n44p96J765j160j70J659j670K45J033j971J330K49j598K198m21
1336F42o13J160j009k65Q81j397O17L45m50P46J99n13N10k26q79N42p0p55Q61
$$ plain form
1355 326 191 21 882 36 163 744 -784 31 113 -1202 393 -183 -951 922 -676 -489 808 -938
1373 -938 26 202 -1159 -49 -72 -1261 489 -219 -601 596 -534 -512 121 -799 -523 76 -1048 125
1391 125 180 -265 405 199 -842 332 30 -903 221 -452 -337 641 -138 333 730 -716 694 130 -548
1410 -548 802 -61 17 989 -156 284 930 -239 653 382 -540 714 38 -376 763 -7 177 1274
1428 1274 160 120 616 -656 -171 508 -660 266 328 -525 602 143 -707 803 -458 -1172 547 -981
1446 -981 -353 846 -789 185 509 -1113 47 -338 -1370 94 -397 -531 326 -217 -327 393 -474 -46
1464 -46 61 -739 -159 -248 -252 200 -63 -222 497 -385 -323 653 -416 -138 475 -405 108 546 -192 631 363
1485 363 221 577 -99 -108 473 -484 515 427 -119 702 366 55 688 -63 -238 662 -244 -182 465 -26 396
$$ packed form
1355C26j35j70Q61q46J27N81j528Q15Q2j315J595n76p68J873j598J87J297j746
1373i38R64J76j361J110k3j189J750p08l82J197j130K2O33r20K76N99j124J173
1391A25N5m45O70k06j041J174l02r33J124o73J15R78p79M71L97j446J410n64o78
1410e48J350q63P8R72j145M40O46j169Q92k71r22J254o76m14J139p70J84J097
1428A274j114m0M96j272M85O79j168R26O2q53J127m59q50J510j261p14J719j528
1446i81O28J199j635R74L24j622J160l85j032J464m91j34Q57n43j10P20q67M28
1464d6J07q00N80q9mM52k63j59P19q82O2R76j069K78O13q80N13M38p38Q23k68
1485C63j42L56o76rN81r57R99q8n46Q21l36l11O33p51j75R00r06O2O47m91M22
$$ plain form
1506 396 502 45 318 346 -587 -8 -21 -342 378 44 -239 374 -203 -360 131 -651 -475 -99 -708 -163 164
1527 164 -799 228 -46 -260 270 -443 -630 -20 -816 -206 342 -601 336 302 -582 149 -244 -659 317 -325
1547 -325 -475 638 -309 234 721 -251 93 309 -521 177 396 -578 520 135 -102 894 -48 -29 770 -500
1567 -500 -103 565 -646 111 428 -650 530 343 -149 584 92 -99 394 -234 -297 522 -12 132 557
1586 557 -290 121 -40 -492 202 -96 -308 222 -578 -103 151 -412 -30 151 -628 -221 -185 -539 162 -325
1606 -325 -135 411 -100 -460 298 -127 -309 117 -648 -122 -97 -304 339 69 -254 186 -113 -362 -108 -347
1626 -347 -55 357 -500 218 352 -62 536 230 -73 150 146 -61 278 -2 163 627 185 256 313 -112 274
1647 274 -89 -355 467 -211 231 699 43 -37 591 -209 7 97 -439 89 185 -349 467 383 -103 504 -309
$$ packed form
1506C96J06m57K73K8r33N79j3l21P20l34k83O13n77j57M91p82J76L76o09N45L27
1527A64r63J027k74k14N30p13j87O10p96O10N48r43R37l4q84P31l93m15R76o42
1547c25j50J113r47N43M87r72L44K16q30O98K19r74J098l85k37R96r42J9P99j270
1567e00L97O68j211P57L17j078J180j87m92P33m92j91M93o28o3Q19n34J44M25
1586E57q47M11j61m52O94k98k12N30q00M75K54n63L82J81p79M07L6l54P01m87
1606c25J90N46n11l60P58m25j82M26p65N26K5k07O43k70l23M40k99k49K54k39
1626c47K92M12q57P18J34m14N98l06l03K23mk07L39k80J65M64m42P1N7m25L86
1647B74l63k66Q22o78M42M68o56q0O28q00K16R0n36N28R6n34Q16q4m86O07q13
$$ plain form
1668 -309 -180 -59 -421 -43 87 -311 440 207 -317 269 -32 -486 43 -249 -686 -14 -345 -319 369 -291
1688 -291 -136 188 -669 -293 -14 -542 63 -39 -180 440 9 -365 542 -300 -189 192 -480 105 122 -161
1708 -161 234 183 -69 606 113 -357 327 162 -45 347 11 66 395 -217 286 364 -130 368 -8 -130 634
1729 634 146 -73 51 169 544 253 -321 251 -62 585 820 67 -133 331 419 -113 594 -151 -180 -198 -523
1750 -523 213 -20 -35 -50 73 -101 164 -88 -402 75 -318 -283 87 -379 31 357 -191 -16 296 -404 70
1771 70 -34 -256 -25 -258 -208 527 -433 141 375 -323 376 -36 -38 225 50 -297 513 151 35 518 4
1792 4 191 41 -317 180 186 -354 310 222 -110 571 204 145 363 -166 6 307 -134 18 268 -115 328 -129
1814 -129 -131 84 -308 -269 93 -138 -171 143 -372 100 103 -360 -64 -130 -179 -142 -114 -276 211 -19 -231 64 -215
$$ packed form
1668c09J29J21l62L78J30l98P51k33n24N86l01m54N29k92m37O72l31K6O88o60
1688b91J55L24q57L76K79n28O05j02j41O20m31l74R07q42J11L81o72N85J7k83
1708a61L95n1k52O75m93m70O84j65k07L92l36N5L29o12N03P8m94M98l76j22P64
1729F34m88k19J24J18L75k91n74N72l13O47K35p53k00M64Q8n32P07p45k9j8l25
1750e23P36k33j5j5J23j74K65k52l14M77l93L5L70m66M10L26n48J75L12p00M74
1771G0j04k22K31k33N0P35r60N74K34o98O99m12kK63j75l47Q10l62j16M83n14
1792DJ87j50l58M97On40O64q8l32O81l67n9K18n29J72L01m41J52K50l83M43m57
1814a29kK15l92L9L62k31l3L14n15M72Lm63K96o6m9L7K8j62M87k30k12K95k79
$$ plain form
1837 -215 -244 249 -135 -45 225 -146 85 -24 -238 27 32 -208 12 -135 -211 71 -14 18 0 -83 13 176 -40
1860 -40 102 -273 -198 120 -176 101 141 -84 13 274 -132 129 150 -185 312 69 -97 287 30 249 215 -21
1882 -21 -171 236 50 -3 312 -176 -14 302 -393 304 -78 110 186 -61 -34 37 -337 -68 -53 6 266 33
1904 33 14 144 22 -185 -298 460 -52 -405 142 -252 207 -252 56 -118 -345 -110 -201 -611 -37 -267 -39
1925 -39 153 -157 -184 300 -211 30 189 -231 150 420 -75 302 287 -24 268 127 94 274 -47 -110 135 -215
1947 -215 211 74 -16 339 170 -67 133 125 -10 74 -41 122 387 45 169 -139 -590 807 -476 389 664
1968 664 23 -207 51 88 182 271 -311 158 2 -191 162 -262 -257 -169 -60 -148 78 8 -89 -30 -214 -321 150
1991 150 -14 92 233 -150 -106 41 -86 93 -156 -283 45 -132 -116 317 -107 31 256 -205 103 -239 -129
$$ packed form
1837b15k9M93l84R0K70l71K31j09k14K65Nk40K20j47p6K82q5L2j8q3R6J63k16
1860d0J42l75P5L18k96K77M0k25R7K61m06K61K1l35M97k43j66L84k57K19l4k36
1882b1j50M07j86n3L15m88J62L16o95O97l82J88P6k47K7P1l74K69J5N9K60k33
1904C3j9J30j22k07j13P58n12l53N47l94M59m59L08j74k27K35r1m10N74k30K28
1925c9J92l10k7M84n11K41J59m20L81K70m95L77j5l11K92j41l3J80l21o3K45l50
1947b15M26j37r0L55j69k37K00qj35Q4j15J63K65l42J24l08m51J397j283Q65K75
1968F64o41k30K58L7R4Q9n82M69j56j93L53m24NQ8J09q8K26p0r7N9j84j07M71
1991A50j64J06J41l83M4J47j27J79k49j27L28j77J6M33m24J38K25m61L08l42J10
$$ plain form
2012 -129 39 64 -111 12 -240 125 -118 63 28 223 -158 251 317 -181 307 176 74 405 -1 -276 245
2033 245 -20 -35 96 142 113 180 80 42 272 -237 295 30 -15 118 -8 -191 139 -259 -12 1 -285 567
2055 567 -74 281 564 513 723 528 605 -528 -192 -108 -382 318 -220 -126 -83 -260 289 29 -441 92 -41
2076 -41 -207 80 -268 -165 177 -219 -132 -70 -239 71 56 3 387 -77 -205 67 -384 -91 85 -235 445 142
2098 142 179 112 218 -93 347 201 -259 439 199 -63 365 201 71 323 -270 -89 155 -19 -32 107 -211
2119 -211 269 118 68 39 -205 76 83 -58 -151 -86 -366 -78 238 -267 -50 247 -240 -84 -129 -75 250 -13 -19
2142 -19 200 -384 -60 -141 -477 -147 42 -283 -2 2 -17 -48 78 -68 102 -85 -102 122 -277 -78 20 -184 -258
2165 -258 -18 -299 -53 -87 -18 196 -56 52 164 91 108 201 -117 176 -4 79 -33 -56 11 42 -41 203 145 29
$$ packed form
2012a29J68K5j75J23k52L65k43J81l5J95l81M09O6m98M88j31j02L31m06k75N21
2033B45k65j5J31M6k9O7j00l8K30n09N32k65m5J33j26j83L30l98K47J3k86Q52
2055E67o41L55K83n1K10j95P7j133L36Q4k74P00n38R4M3j77N49k60m70N33j33
2076d1j66K87l48J03L42l96Q7O2j69L10j5n3L84m64j28K72m51K93J76l20O80l03
2098A42L7o7J06l11M40j46m60O98k40k62M28j64j30K52n93J81K44j74j3J39l18
2119b11M80j51n0k9k44K81Pj41r3O5k80K88L16n05K17K97m87J56m5N4L25k63o
2142a9K19n84L24q1l36L30J89l25K81Mj9l1J26j46J70j87j7K24l99J99R8k04p4
2165b58K40k81K46l4O9K14k52J08J12p3J7R3l18K93j80Q3j12k3O7L1q3K44n8j16
$$ plain form
2189 29 -19 187 -63 29 138 89 310 112 59 34 158 112 180 -12 1 173 -193 -241 155 -129 329 13 -119
2212 -119 316 -130 -355 273 -196 -163 -199 -133 46 -318 -67 -25 -109 -437 -125 -170 -154 286 -12 -121 139 -271
2234 -271 -182 -81 -124 197 220 -168 -62 125 26 437 206 -204 81 2 173 461 -136 160 176 -66 82 172
2256 172 109 161 285 -5 107 134 -120 272 74 84 256 -206 311 136 -84 85 179 -188 -79 -97 -15 218
2278 218 -7 100 75 -236 165 -203 -286 224 -11 -199 61 43 -217 226 -169 -126 -221 -364 -168 -74 -266 -41
2300 -41 66 -194 -65 6 -207 92 -108 -184 70 -181 86 -28 -31 97 -112 -158 -29 -193 46 -86 -166 200
2322 200 153 -53 -33 211 -251 80 109 -72 250 146 -75 359 -25 10 252 164 182 79 -30 29 252 -277
2344 -277 259 178 7 250 37 74 18 207 50 34 -209 186 213 172 91 200 -65 201 -282 -251 -51 -72 -243
$$ packed form
2189B9m8K06k50R2J09m9K21j98n3k5J24m6O8j92J3J72l66m8L96k84M58l16j32
2212a19M35m46k25O28m69L3l6O6J79l64K51M2q4l28L12m5J6M40k98j09K60m10
2234b71Q9J01m3L21K3l88J06J87r9M11k31m10K85p9J71K88n97K96J6k42J48R0
2256A72o3N2J24k90J12K7k54L92j98J0J72m62N17j75k20J69R4l67J09j8Q2K33
2278B18k25J07k5l11M01l68q3N10k35j88K60j8k60M43l95M3r5j43J96R4j92K25
2300d1J07k60J29P1k13K99k00p6K54k51K67j14lJ28k09m6J29j64K39j32q0L66
2322B00m7k06K0K44m62L31K9j81L22j04k21M34l84L5K42q8J8j03j09N9K23n29
2344b77N36q1j71K43k13L7n6J89j57j6k43L95K7m1q1J09k65K66m83L1K00k1j71
$$ plain form
2367 -243 -25 -205 27 27 -100 51 -7 -84 40 139 -251 -97 -72 -33 131 -29 -208 23 -62 25 -78 -138 84
2390 84 188 3 -96 -164 -240 -63 19 -328 129 173 187 227 178 -110 -54 -129 18 -44 -51 296 294 -134 156 -122 107
2415 107 159 191 -37 -47 -253 153 36 177 114 -195 -163 235 -97 -218 9 -119 -46 420 185 -114 66 -299
2437 -299 -170 -119 -210 -56 -79 -291 24 44 -57 136 -99 115 -139 -133 181 -18 -329 -357 -99 -58 -214 -102 -239
2460 -239 83 -266 -38 -199 -138 -66 -9 -161 63 210 -4 124 99 150 -8 190 -122 47 29 -46 205 -47
2482 -47 42 -1 -38 -26 89 97 260 63 148 7 243 -186 84 112 -21 258 -49 298 -16 -188 139 176 -52
2505 -52 170 60 348 143 -78 -135 -99 -76 -14 -190 -84 -27 -313 -128 220 -101 -174 -74 -61 -89 140 -82 -54
2528 -54 201 -162 -64 -129 -107 167 -59 -107 178 -61 74 -57 -216 -58 -61 34 -36 56 -68 -52 -177 -130 134 -79
$$ packed form
2367b43K18j80K32%j27J51n8p7J24R9l90J54K5L9J64j60j79K31q5Q7j03o0K22
2390H4J04j85r9o8p6J77Q2l47M57M4J4M0m9k88N6p5J47o2pL47km28K90k78K29
2415A07N2L2k28j0k06M06j17J41o3l09L2L98l32j21K27j28P3M66k35k99J80l65
2437b99J29N1r1J54k3k12L15K0j01J93k35K14k54OL14j99l11k8K58M1j56J12j37
2460b39L22l49K28j61O1P2N7j52K24J47k14J28k5N1j58J98l12J69j8p5K51k52
2482d7Q9m3l7J2J15QJ63j97Q5j41K36m29K70K8j33K79l07L47l14j72L27L7k28
2505e2K22j10K88k05k21n7L6K3O2j76J06N7k86J85L48l21p3J00J3k8K29k22K8
2528e4K55l63R8o5K2K74k26m8K85k39J35j31j59J58lR5p0R2j24J6j25M7K64k13
$$ plain form
2552 -79 -81 212 162 12 -113 -203 145 46 -62 39 173 73 -19 -75 48 170 -186 105 122 112 335 -42 4 -153
2576 -153 81 -105 62 -43 -103 257 -113 5 121 222 -90 -56 -146 -14 -57 -26 160 -81 223 -114 -130 -99
2598 -99 38 -200 -59 -218 60 -195 78 -282 -32 -154 -287 300 -76 104 38 -54 -303 114 87 30 72 -184
2620 -184 -50 -67 -96 -103 -78 -268 73 -27 244 -78 76 84 293 -116 149 55 75 240 98 252 46 46 -63 116
2644 116 -350 20 -26 74 -17 21 48 120 6 -99 43 -106 22 36 -26 -166 105 -55 -38 60 27 56 74 -19
2668 -19 195 -145 -10 -91 -154 77 -189 -199 95 -116 -49 235 28 -276 -309 88 -35 -91 -131 -25 416 -20 -76
2691 -76 -33 -60 93 -78 -58 -133 -49 -135 203 197 154 -138 16 145 76 68 -90 132 30 44 376 161 168 -108 -50 105
2717 105 30 -107 287 -198 183 338 86 69 -72 -162 33 78 -123 -168 179 39 187 -2 32 93 -259 59
$$ packed form
2552g9kK93n0j50j25r0L48r9j08J01J34j00r2n6J23J22l56K91J7j0K23l77M6j57
2576a53K34j86J67j05o0L60l70J18J16J01l12L4r0J32m3L1J86k41L04l37j6L1
2598i9J37k38J41j59K78k55K73l60K50j22j33N87l76J80o6r2k49M17k7n7M2k56
2620a84J34j7k9pK5j90L41j00K71l22J54QK09m09K65r4K0J65j42J54k06%j09J79
2644A16m66L70m6J00r1L8K7P2j14j05J42j49J28J4o2j40K71j60J7R8l3K9J8r3
2668a9K14l40J35q1o3K31k66j0K94k11O7K84k07l04l3L97j23n6m0J06M41m36n6
2691g6M3k7J53j71K0p5Q4q6L38om3k92J54J29o9qj58K22j02J4L32k15Pk76N8J55
2717A05p5j37L94m85L81J55k52j7j41r0J95M5k01m5L47j40J48j89L4O1l52L18
$$ plain form
2739 59 -131 -131 -232 14 -15 -167 -108 -81 109 -13 50 291 172 -39 -208 -338 136 87 21 74 -182 -4 58 -443
2763 -443 53 -90 66 -168 163 314 -238 -6 -231 142 -34 -219 140 -7 -149 8 24 22 79 -233 79
2784 79 188 105 171 64 284 34 -23 -367 160 -41 33 258 247 146 189 112 -120 -86 114 372 256 19 61
2807 61 -12 83 62 85 -2 -99 122 323 85 -299 117 -176 -305 -239 -125 -20 290 232 -73 34 -232 81 -126
2830 -126 -223 -70 -92 -123 -95 81 -62 -119 -388 -158 -190 -255 -130 -177 -43 56 -213 -36 -206 -260 115 48 -42 79
2854 79 -146 -166 109 37 -82 34 -108 -85 -202 132 -10 102 -115 202 184 -71 250 -117 41 -111 131 54
2876 54 289 171 -52 -12 26 40 154 -217 -98 -91 -127 158 90 -81 25 -156 -79 26 4 -124 -90 -174 -58 192
2900 192 -126 -7 79 -69 -89 -87 212 101 -40 9 127 -164 -107 -296 -99 47 153 103 -85 -52 -114 244 -95
$$ packed form
2739E9j90%j01K46k9j52N9K7J90j22O3K41j19k11j69j30M74m9o6N3k56J78O2n01
2763d43M96j43J56k34L31J51n52K32k25L73j76j85L59j47j42J57J6kN7l12L12
2784G9J09q3O6j07K20k50n7l44N27k01P4K25j1j01M3p7k32L4K00K58j16k37M2
2807F1p3R5k1K3q7r7K21K01k38l84M16k93j29O6J14J05L10n8l05J07k66L13k07
2830a26r7J53k2l1K8J76j43n7k69K30l2o5J25m7J34R9k69J77j70n4L75o7r0J21
2854G9k25k0K75p2j19J16j42K3j17L34j42J12k17L17j8k55L21l67J58j52K42p7
2876E4K35j18k23M0L8J4J14l71J19Pl6K85o8j71J06j81P7J05k2j28L4q4J16K50
2900A92l18J19Q6j48k0KK99j11j41M9J18k91N7j89J97J46J06n0j88L3o2L58l39
$$ plain form
2923 -95 -106 -82 115 -21 211 -150 -165 -9 -20 213 47 133 293 79 -95 245 26 -155 149 134 71 45 231
2946 231 134 111 73 39 -140 -77 211 169 239 58 16 149 -111 -68 139 90 173 241 -6 88 90 -114 -71 69 -42
2971 -42 -53 -167 -34 -62 72 14 -103 219 -11 -108 -165 -32 -136 -71 -19 122 114 -113 -32 -40 88 -107 -224 -139 75
2996 75 -93 -150 -366 -23 -45 -155 -63 -48 -113 -54 -13 -5 85 -62 -99 143 43 -196 17 189 104 18 118 192 57
3021 57 7 182 74 9 129 64 67 339 103 186 220 -129 -48 1 -307 8 224 -3 40 18 60 -5 -39 -319 141
3046 141 15 -170 26 -173 -184 69 72 33 -214 -118 83 38 -182 42 -406 -160 -49 2 -91 127 -60 -192 -250
3069 -250 -67 -95 -178 78 -97 -76 -247 130 -62 96 17 -305 160 44 190 39 3 39 169 -171 -147 -19
3091 -19 -34 -21 71 -12 20 67 35 218 -103 191 128 -168 45 38 123 88 40 56 76 8 -3 260 82 48 42 141 -247
$$ packed form
2923i5j1K4J97j36K32l61j5J56j1K33j66Q6J60k14j74L40k19j81L04j5o3k6J86
2946B31r7k3l8l4j79O3K88m2P0j81m2J33k60M3K07m9Q3O8k47R4Kk04M3J40j11
2971d2j1j14J33k8J34n8j17L22k30r7n7J33j04O5N2J41qk27Q1qJ28j95j17Q5K14
2996G5j68n7k16L43k2j10R2J5o5N9M1QR0j47l7K42j00k39K13J72q5q6J00P4j35
3021E7n0J75j08o5J20o5LK72k36Q3L4l49Q1M9l08L15K16k27M3k2M2o5l4k80M60
3046A41j26j85J96j99j1K53Ll9k47R6K01m5k20K24m48K46J11N1r3K18j87j32n8
3069b50J83k8q3K56j75K1j71L77j92J58p9l22M65j16J46j51l6L6J30l40K4J28
3091a9j5J3R2q3L2M7l2J83l21K94o3k96K13pQ5l5m8J6K0o8j1K63j78l4oR9l88
$$ plain form
3118 -247 306 -107 108 -112 -298 267 250 -317 462 280 -295 79 -81 -36 99 88 -156 -110 -130 -100 0 -165
3140 -165 -110 36 42 151 -28 -103 -151 -66 88 102 -107 -36 -36 36 -276 96 -269 64 188 -224 148 -83 -130 -21
3164 -21 -102 -151 18 -81 235 110 11 -169 34 -181 225 -84 58 96 205 50 74 158 77 -6 -29 41 -12 -119
3188 -119 120 -14 46 311 -129 -220 46 -199 58 -1 184 -24 170 -215 -1 118 -45 -71 377 -102 258
3209 258 147 298 -158 486 -30 29 412 -234 -62 -187 247 -195 414 366 584 -167 560 -73 -129 -312 60
3230 60 -394 -453 371 531 403 50 -447 300 -331 313 208 29 -107 -309 0 -659 -227 426 818 56 -450
3251 -450 210 -141 203 525 -22 -436 -187 -362 -242 -240 -63 462 -217 232 -37 -158 -776 17 41 164 337
3272 337 299 88 -63 30 373 112 -285 71 172 -365 409 295 -389 -556 -662 436 -218 -954 -314 -81
$$ packed form
3118b47N53m13K15k20j86N65j7n67P79j82n75L74j60M5J35j1k44M6k0L0J00j65
3140a65N5J46OJ09j79p5m8Q5J54J4k09P1%P2l12L72l65L33J24m12L72k31m7J09
3164b1q1m9J69r9L16j25r9j80K03k15M06l09J42L8J09j55K4Q4q1q3k3P0n3j07
3188a19K39j34O0K65m40r1K66k45K57n9J85k08J94l85K14J19j63k6M48m79L60
3209B58j11J51m56O44n16N9L83o46J72j25M34m42O09m8K18p51P27o33n6j83L72
3230F0m54n9Q24J60j28l53m97P47o31O44j05j79j36k02L09o59M32O53L92p62n06
3251d50O60l51L44L22n47m14K49j75J20KJ77N25o79M49k69j21o18P93K4J23J73
3272C37l8k11j51R3L43k61l97L56J01n37P74j14o84j67j06J098o54p36O40K33
$$ plain form
3292 -81 -133 177 -1019 -330 -22 376 -120 -381 -1190 27 512 -528 181 88 -134 -2 -448 71 423 -81
3312 -81 219 172 -123 332 -172 106 347 19 351 1 158 131 -155 -101 188 204 237 206 98 -51 217 226 -117
3335 -117 -120 175 97 -216 129 -58 -103 -251 -17 -104 192 151 -235 118 -137 -160 137 212 -144 62 126 17 125
3358 125 99 -120 -68 -74 37 -69 12 69 -18 -109 204 241 -163 249 -46 -366 -114 98 163 -14 -135 159 -35
3381 -35 -151 223 193 171 -95 335 -309 29 -382 343 -30 -72 639 -719 -81 287 -467 -364 148 28 -331
3402 -331 -141 293 -116 -308 386 623 98 -50 -508 449 162 213 -226 -27 -44 -342 -331 593 139 410 16
3423 16 222 373 -193 123 801 340 -736 -213 182 -170 -722 -129 -509 -194 -179 -144 -175 -375 641 -228 -215
3444 -215 376 273 -665 553 -404 -1006 -171 343 -583 -687 810 -85 811 -744 -564 -231 -52 26 244
$$ packed form
3292h1n2L10j196O89L08L98m96k61q09J217M85j040P09r3k22J32m46N19L52n04
3312h1L00m7k95M55n04K78K41l28L32l50J57k7k86N4K89J6L3l1j08j49K68Rl43
3335a17lK95p8l13L45j87m5j48K34q7K96m1l86L53k55k3K97P5l56K06O4j09J08
3358A25k6k19N2oJ11j06Q1N7q7r1L13L7m04M12k95l20K52K12O5j77j21K94j94
3381c5j16L74l0k2k66M30o44L38m11P25l73m2P11j358O38L68p54J03N12j20l59
3402c31J90M34m09j92O94K37n25j48m58R57k87N1m39J99j7k98J1R24m54K71l94
3423A6K06J51n66L16O78m61j076N23L95l52n52N93l80L15J5L5l1k00J016q69J3
3444b15N91j03r38J218r57o02Q35N14r26j04J497q95Q96j555J80L33J79P8K18
$$ plain form
3463 244 -57 -440 373 380 396 -188 -205 346 6 -177 560 -177 -9 -4 -116 322 -222 -635 -705 -68 438 80
3485 80 209 170 174 -94 230 -389 -451 133 -147 -43 234 700 149 427 -139 109 -788 519 135 -93 174
3506 174 -230 161 -65 5 -152 81 -321 3 -502 -147 -269 -718 185 -150 59 -222 222 -174 156 170 -260
3527 -260 169 -37 65 -244 224 -5 -53 -123 -52 -160 -130 -13 -127 46 312 -37 113 124 124 219 -202 141 273
3550 273 -132 292 -2 38 77 -349 -259 -79 -182 223 -92 -28 14 15 -5 62 -28 -20 62 66 -116 -87 -43 36 -178 -62
3576 -62 -118 43 -80 155 -68 -328 -233 -42 -193 -2 24 -297 -79 43 -306 -65 -11 57 -29 -407 -126 -9
3598 -9 39 -25 -163 -234 -116 -131 6 9 -76 13 113 -137 -108 -223 -10 6 13 12 90 331 -8 218 132 122 373 3
3624 3 197 -42 -98 145 57 38 -168 -255 121 -16 87 120 132 318 7 78 58 42 -115 24 -61 68 -233 -59
$$ packed form
3463B44l01l83Q13PJ6n84j7N51l40j83P37p37J68Nj12M38n44m13p0O37N06l58
3485H0J29l9Mk68L24o19o2N84k80J04K77M66n51K78n66K48q97J307l84k28K67
3506A74m04L91k26P0j57K33m02L24n05L55j22m49R03l35K09k81M44l96L30J4m30
3527b60M29k06J02l09M68k29m8p0P1j08L0J17j14J73K66l49J50J1%R5m21L43J32
3550B73m05M24k94M0L9m26R0J80j03M05l15O4M2Jk0O7r0QQ2Mj82K9M4P9k14J16
3576f2n6J61j23K35k23k60R5J91j51J91K6l21K18J22l49K41N4O8q6l78K81J17
3598iM8o4j38p1J18j5J37Lq5Q9J00k50K9j15K13J6PjP8K41l39K26q6j0K51l70
3624CJ94k39n6K43q8j9k06q7L76j37J03L3J2J86l11P1k0j6j57J39q5J29l01J74
$$ plain form
3648 -59 -295 -139 91 -196 45 133 123 74 12 -40 41 79 -169 -67 -170 -56 -230 -208 115 -61 -362 336 156
3671 156 -122 -98 -476 79 202 -387 701 228 347 3 -170 39 301 -159 -53 70 -134 -96 81 68 -399
3692 -399 -839 62 218 72 -97 -12 -230 -268 -125 81 -236 134 111 -636 63 260 -232 77 79 -280 -94 -101
3714 -101 -64 -404 -318 -466 -107 65 324 144 70 384 -44 -330 250 -299 67 -224 236 -383 185 8 -188
3735 -188 -551 37 335 -1177 -31 -290 234 8 238 231 104 -636 -299 739 610 -461 2 -10 477 -465
3755 -465 376 901 -660 46 -153 -403 829 209 -226 653 223 1018 520 432 -510 -176 -491 -458 117 -71
3775 -71 -155 203 -171 -94 665 577 342 239 103 -15 639 405 147 -100 49 -181 62 14 454 85 160 -15
3797 -15 -278 299 458 178 299 516 -88 -62 -161 -21 -521 -9 -198 -228 200 -42 4 104 319 47 -251 -208
$$ packed form
3648e9k36J56K30k87K41Q8j0m9o2n2Q1L8k48J02j03J14j74K2L23j76l01O98j80
3671A56k78K4l78N55J23n89J088m73J19l44j73K09K62m60J06J23k04L8J77j3m67
3692c99m40R01J56j46j69Q5k18l8J43K06l17L70k3p47O99J97m92L09Kl59J86p
3714a01L7l40Q6j48L59J72K59j80p4L14m28k86N80n49L66k91M60o19N68j77j96
3735a88l63N88K98j512J146k59N24k26K30pj27p40L37J038j29j071M63j2M87r42
3755d65Q41N25j561P06j99k50J232o20m35Q79m30P95m98q8r42L34l15L3N75j88
3775g1q4L58l74P7P59q8k35j03j36j18O54k34k58k47J49k30K43m8M40l69P5j75
3797a5k63N77J59k80J21K17o04K6r9J40n00N12j89l0M28k42M6J00K15k72k98M3
$$ plain form
3819 -208 -420 -302 -113 124 85 -85 441 32 -347 -358 381 -490 145 -104 -198 -176 -215 30 -281 -297 -570 -250
3841 -250 -109 -2 467 100 -776 -2 -47 -24 -65 239 -26 -266 84 -501 59 52 45 137 63 498 324 -129 45
3864 45 87 -47 -107 392 264 -226 -51 91 -136 -230 -3 384 -145 -171 25 -209 279 389 460 -282 -381 -416 24
3887 24 -623 -99 -190 -215 -155 146 550 -157 -155 -40 -98 -49 -235 -459 -627 259 -125 320 -288 -141 26 51 -90
3910 -90 -295 -361 407 20 -252 12 -181 236 65 190 235 188 460 -103 -241 -207 246 265 127 327 -60 1621
3932 1621 180 464 -483 -106 621 220 -67 330 404 401 323 530 -605 6 246 119 -828 292 95 278
3952 278 -174 -175 494 235 -100 -141 70 -271 -283 -163 -136 -163 -16 -61 -65 117 -187 266 -31 -140 13 -233 338
3975 338 -16 201 -133 -224 -5 -94 -315 -226 63 -11 -101 6 487 164 324 464 55 -221 -154 151 126 95 -31
$$ packed form
3819b08k12J18J89K37l9j70N26m09l79j1P39q71O35k49r4K2l9K45l11j6k73L20
3841b50J41J07M69l67q76P74m5K3m1L04k65k40L50n85N60ppR2p4M35j74m53J74
3864D5M2j34o0M99j28m90J75J42k27r4K27L87n29k6J96k34M88J10P1p42r9l5M40
3887B4o47N24r1k5O0L01M04p07KJ15n8M9j86k24j68Q86l84M45o08J47J67K5j41
3910i0k05o6P68l87k72K64j93M17j71J25M5m7K72n63j38L4M53J9j38K00l87J681
3932A621j441K84r47L77P27m01k87L97P4lp8K07j135O11K40j27r47J120j97J83
3952B78m52jO69k59l35m1K11l41j2J20K7k7J47m5mJ82l04M53k97j09J53k46N71
3975C38l54K17l34r1K19q9k21Q9K89p4r0J07M81l23J60J40m09k76O7L05k5l1j26
$$ plain form
3998 -31 -194 -107 -68 147 -224 105 -95 508 480 365 -375 604 634 672 225 -6 241 -199 67 235 9 28
4020 28 -187 -36 -200 -183 -253 97 129 96 -48 -80 -91 66 138 -159 -197 -34 -66 -79 -107 -8 -58 -206 56 -220 -99
4045 -99 132 -139 120 -36 126 -117 -271 -215 36 -31 262 166 10 -75 149 -105 -137 6 -165 -33 34 53 -46
4068 -46 99 43 149 17 65 118 128 70 -176 128 204 -48 230 38 6 108 58 255 212 204 83 -43 242 176
4092 176 -87 -90 59 -62 48 -48 2 56 57 24 19 42 -186 269 78 -49 79 49 152 52 -51 -27 -97 -171 167
4117 167 191 -72 179 176 33 138 23 -84 -222 -54 -122 -4 43 94 -5 71 -91 115 50 -92 144 -185 0
4140 0 32 113 36 64 86 113 -39 -115 -157 -6 95 50 -302 174 -61 -45 168 -217 188 181 14 71 70 -171 93 -92
4166 -92 56 -136 -125 -231 138 -135 78 166 -11 -211 -267 -415 286 -265 20 9 -412 227 -185 -19 -44 -124
$$ packed form
3998c1j63Q7L9K15l71L29k00O03k8j15p40R79L0L8m47k31K47m40K66J68k26J9
4020B8k15J51j64J7p0L50L2l3j44l2j1J57P2k97l8J63l2j3k8R9n0j48K62k76J21
4045i9K31k71K59j56J62k43j54N6K51o7K93r6j56q5K24k54l2J43j71J32O7J9r9
4068d6J45n6J06j32M8N3J0n8k46L04P6k52K78j92l2J02n0J97m3qj21j26K85o6
4092A76k63lJ49j21J10r6N0N4Jl3nK3k28M55j91j27J28l0J03j00j03K4p0p4L38
4117A67K4k63K51lj43J05j15j07j38J68o8J18M7N1r9P6j62K06o5j42K36l29J85
4140@L2Q1p7K8K2K7j52p6m2J51J01m5l52M76k35J6K13l85M05pj67N7jk41K64j85
4166i2J48j92J1j06L69k73K13Q8j77k00n6j48P01n51K85j1m21O39m12J66k5q0
$$ plain form
4188 -124 -25 50 -53 15 -90 -86 -112 -104 2 -16 -159 106 -63 217 113 -130 142 -251 -46 41 -78 22 -108
4211 -108 -94 269 41 71 9 142 97 31 -62 -117 99 -171 -321 -296 -201 340 -299 154 78 -81 -152 21 187 275
4235 275 63 182 137 536 -262 1152 -368 -246 414 -392 422 -591 60 370 -136 -86 27 -189 -118 -166
4255 -166 -119 147 -369 95 66 -391 -112 439 -393 245 -25 558 70 764 688 94 -58 168 68 175 -68
4276 -68 -15 -232 -147 99 -161 -360 -169 95 -215 205 244 328 359 -1 -85 -169 -233 -320 226 507 -77 338 197
4299 197 -37 514 390 198 -237 -219 -148 -19 -6 -194 335 65 -8 -257 -254 171 33 -321 149 309 -35 541
4321 541 -24 204 -86 330 -176 -58 247 72 386 386 -402 61 -332 -274 -76 -64 197 -203 -206 -34 164 187
4343 187 339 70 40 -60 188 -205 207 -224 -60 -105 48 -194 -198 810 -149 -678 82 85 -239 -157 172 491
$$ packed form
4188a24R9P5j03O8j05Mk6QJ06j8j43K65j69K80j04k43K72l93K05Q7j19J00j30
4211a08J4L63k28L0o2J33m5o6r3n5K16k70j50K5R5N41o39M53p6j59p1J73J66Q8
4235B75k12J19m5L99p98J414j520J22O60q06Q14j013O51L10n06N0J13k16P1m8
4255a66M7K66n16M64k9m57K79N51q32O38k70N83m88O94p6n94j52K26j00J07k43
4276f8N3k17Q5K46k60j99J91K64l10M20L9Q4L1l60q4q4o4q7N46K81n84M15j41
4299A97k34N51j24j92m35J8P1J29J3j88N29k70p3k49LM25j38l54M70J60l44N76
4321E41n65K28k90M16n06J18L05j75L14%p88M63l93N8J98J2K61m00lJ72J98K3
4343A87J52k69l0j00K48l93M12m31J64m5J53k42mJ008r59n29P60Ll24Q2L29L19
$$ plain form
4365 491 62 329 -42 31 523 32 692 265 802 71 -214 -383 149 317 -427 -448 -152 -30 188 235 371
4386 371 -56 527 -212 -521 113 205 50 12 -93 -299 -125 -78 697 179 -148 -80 -112 -376 178 -395 324 -381
4408 -381 -136 -464 -416 280 -197 235 235 -218 647 -78 -310 -92 -66 -29 -273 203 -165 -262 36 -90 -254 443
4430 443 102 -313 215 243 148 -202 -187 -165 122 -34 7 421 26 327 113 107 -37 336 -500 -320 -83 -6 349
4453 349 -163 -453 -582 -298 85 -236 553 403 -222 526 343 -204 280 -345 661 467 -257 79 -476 -144
4473 -144 -406 -353 180 -494 -41 -528 -287 -47 -594 132 377 46 -378 496 -33 514 -1 -41 152 -99 -199
4494 -199 -128 673 -389 105 -130 -735 -444 -523 -144 46 -1249 201 72 107 -659 -913 -280 -5 -279 44
4514 44 326 -447 650 -5 -594 320 -48 -252 484 33 307 -537 -198 566 120 -544 -372 353 356 284 153
$$ packed form
4365D91m29K67l71P3M92m91O60m27N37p31k85j69N32J68p44k1K96J22K18M7J36
4386C71m27N83p39l09O34R2j55l8j05k06J74M7P75n18l27O8l2k64N54n73P19p05
4408c81K45l28M8O96m77M32%m53Q65p25k32K18K6L7k44M76l68r7K98j26j64O97
4430D43l41m15N28K8r5l50J5K2K87j56M1M14l95L01k14oj44L73q36J80K37P7L55
4453C49n12k90j29K84L83l21P89j50o25P48j83n47M84o25J006j94p24L36n55L32
4473a44k62N3N33o74M53m87K41K40n47P26K45l31m24Q74n29N47n15m0J93k51j00
4494a99P1Q01j062M94k35o05K91p9L79J90j295J450j29L5p66k54O33K75k74L23
4514D4K82p73J097o55n89R14l68k04P36m51K74q44L39P64m46o64J72P25Lp2j31
$$ plain form
4535 153 518 -83 -128 203 108 -37 181 147 -326 -32 183 -148 -163 390 157 -394 -26 400 15 514 341
4556 341 -26 314 180 78 -109 135 131 -223 -68 313 25 -8 -57 80 95 -131 -227 -84 -81 186 -263 -66 -198
4579 -198 62 -254 25 39 52 -55 226 -49 90 59 7 116 1 109 -57 325 76 119 -52 212 -43 20
4601 20 148 -30 132 144 110 87 -35 21 -48 -262 54 205 145 55 19 155 88 -15 -45 195 185 -54 148 20
4625 20 25 -7 81 68 119 -102 -8 309 16 -181 -38 79 -42 -9 25 279 148 -180 106 196 187 -81 0 -12 148
4650 148 119 -93 114 -11 -170 24 47 48 51 -46 -274 -13 63 -167 18 -18 17 -44 -256 -73 97 -65 67 -25
4674 -25 6 189 210 118 55 -145 -20 -215 -24 -17 -146 2 93 46 40 264 303 14 -96 121 93 84 173 -199 -63
4699 -63 30 -112 11 -175 11 20 -20 25 2 83 -211 -3 -169 -32 227 -118 -6 -88 -120 -59 -350 117 -194 145
$$ packed form
4535A53L65o01m5L31r5j45K18l4m73K94K15l31j5N53k33n51L68M26l85M99j73
4556C41l67L40j34j02j87K44ml54J55L81k88l3m9J37J5k26r6J43LK67m49J97j32
4579a98K60l16K79J4J3j07K81k75J39l1n2J09j15J08j66L82k49M3j71K64k55O3
4601B0J28j78J62J2l4k3j22N6o9k14L16J51o0r0l6J36o7j03l0K40j0k39K02j28
4625B0Nl2Q8j3N1k21R4L17k93j97J43J17j21L3L4K54j31l28K86R0rk68Q1j2J60
4650A48k9k12K07j25j59J94K3JLr7k28K61P6k30J85l6L5o1k12J83J70j62J32r2
4674b5L1J83K1r2o3k00J25j95J91Pj29J48R1m7oK24L9k89j10K17k8rQ9l72J36
4699f3R3j42J23j86J86Rm0M5k3Q1k94K08j66J37K59l45J12q2l2O1k91M67l11L39
$$ plain form
4723 145 -287 361 -102 -11 -437 -442 -99 719 -39 177 427 -273 309 136 246 -169 -378 321 116 -263 -303
4744 -303 215 -409 332 53 -33 109 -62 -33 39 -125 277 191 23 -13 53 199 -24 -145 167 1 -78 198
4766 198 -84 202 -41 275 2 21 301 26 33 -103 46 212 -122 -140 151 22 114 158 168 -101 63 -82
4788 -82 -127 -60 -380 -176 -93 -75 134 -46 -60 -38 -88 50 -133 -159 -138 -257 79 -33 -97 239 -221 -48 -49 8 -71
4813 -71 -156 171 -55 -270 3 69 15 -74 79 -249 -170 -174 194 77 9 -7 -65 89 -204 138 179 90 11 -7 185
4838 185 222 -4 -109 43 150 62 18 149 58 -107 18 94 23 329 -22 -57 -11 23 130 233 -8 150 143 5
4862 5 9 15 -99 -24 156 -47 -124 -338 4 -19 -77 -206 -18 16 65 13 159 -78 166 -183 -232 -122 -17 0 -178
4887 -178 -103 27 -54 142 188 -74 -116 16 -88 -34 39 55 -101 59 349 57 92 -17 54 -43 48 224 69 -227
$$ packed form
4723A45m32O48m63R1m26nL43Q18p58K16K50p00N82j73J10m15k09O99k05l79m0
4744c03N18o24P41k79q6J42j71K9P2j64M02q6j68l6O6J46k23j21L12j66p9K76
4766A98k82K86k43L16k73J9K80k75Pj36J49J66l34j8K91j29R2M4J0k69J64j45
4788h2m5O7l20K04Q3J8K09j80j4K2n0J38j83k6K1j19L36j12o4L36m60J73jN7p9
4813g1q5L27k26k15K73O6n4q9J53l28P9mL68j17o8j6n8J54k93L42M1q9p9j8J92
4838A85L7k26j05J52J07q8m4J31r1j65J25P6p1L06l51l5M6L4J07J03k41J58pj38
4862EMOj14P5J80k03p7k14L42k3n8j29J88L4M9n2J46k37K44l49m9J10J05J7j78
4887a78P5J30q1J96M6k62m2J32j04N4P3J6j56J60K90k92L5j09P1r7R1J76j55k96
$$ plain form
4911 -227 2 -153 -2 130 -63 10 -133 -41 75 136 -76 207 105 50 -44 -136 77 -100 37 -43 162 -18
4933 -18 -62 -110 74 -116 202 -174 122 -19 -105 94 -165 -38 220 104 50 -242 189 -2 -29 14 89 127 -322
4956 -322 -56 90 -154 24 6 -142 -196 49 140 -45 158 0 70 -133 114 22 40 -114 -27 -157 -36 -55 281
4979 281 104 0 87 -295 106 162 152 -2 77 -6 74 81 4 117 42 3 -79 221 -35 27 102 87 86 -50 116 12
5005 12 137 109 -181 -87 130 88 89 -137 -53 -218 161 186 59 -75 -43 -240 125 -174 -110 -102 79 -92 -126 -154 106
5030 106 -166 -72 -174 228 -258 -121 -279 1189 500 672 328 -20 -163 -19 255 -22 -291 -151 -323 129
5050 129 208 -75 125 96 -221 -56 -88 354 29 -94 148 165 498 975 -336 -324 58 -206 89 348 217
5071 217 150 40 -1 -148 185 494 -77 130 -732 384 185 -319 559 -193 26 350 112 -84 -313 -178
$$ packed form
4911b27K29j55J51J32j93P3j43R2J16O1k12K83j02n5r4r2K13j77J37q0K05j80
4933a8m4m8J84j90L18l76K96j41q6J99k59J27K58j16n4k92M31j91k7M3P5L8m49
4956c22K66J46k44J78j8j48n4K45R1j85K03j58P0k03K47r2J8j54Q7j30J21j9L36
4979B81j77j04Q7l82M01N6j0j54P9q3Q0Pp7J13p5l9q2L00k56O2P5j5jj36J66j04
5005A2J25k8k90R4K17m2Jk26Q4j65L79K5j27j34L2j97L65k99O4QJ81j71l4k8K60
5030A06k72R4j02M02m86J37j58J468o89J72l44l48j43J44K74k77k69J40j72M52
5050A29P9k83K00k9l17J65l2M42l25j23K42J7L33M77j311J2L82k64K95K59j31
5071B17o7j10m1j47L33L09n71K07q62J116j99n04Q78p52K19L24k38j96k29J35
$$ plain form
5091 -178 117 -307 -229 -148 145 112 230 -367 -164 -282 -92 42 -24 69 -94 252 96 -337 233 -4 -106 -189
5113 -189 -182 214 -85 -114 51 164 390 104 -13 99 20 68 -211 53 -314 63 -103 94 -91 22 -83 84
5135 84 148 -99 -43 -51 68 205 -163 -61 -48 14 -1 -148 -101 -33 100 -59 145 312 259 166 54 190 115 55 -35
5160 -35 -201 123 19 -71 246 -217 -131 -8 26 -59 -113 -107 12 167 71 -63 -102 101 122 -30 -143 336 32 146
5184 146 23 -261 -24 -250 4 78 -139 2 -372 110 133 -37 -6 -253 -65 -155 -113 -117 -23 69 -36 -187 97
5207 97 190 -117 42 256 141 -32 -24 -19 23 93 -25 -167 225 30 -145 -34 59 -147 81 103 244 48 17 -152
5231 -152 57 102 276 166 -150 4 -75 8 29 152 -8 -74 -8 48 -121 29 -109 80 46 166 -113 -47 -3
5254 -3 -79 -229 -12 12 9 32 52 40 223 183 -93 -35 -176 -52 197 64 128 -256 136 -268 30 79 95 -34 -47
$$ packed form
5091a78K95m24P8Q1K93l3J18n97K03j18J90J34o6R3j63L46j56m33N70k37j02q3
5113a89PL96k99k9J65J13K26k86j17J12p9M8k79K64l67L77j66J97j85J13j05J67
5135H4O4k47N6qJ19J37l68J02J3O2j5j47M7O8J33j59K04J67n3r3j12J36p5o0r0
5160c5j66L24j04r0L17m63Q6J23L4q5n4OJ19J55r6j34l9K03K1j52j13M79l04J14
5184A46j23k84K37k26K54P4k17J41l74M82K3j70L1k47J88r0M2mR4R2j05j51K84
5207I7R3l07J59K14j15j73QNM2P0j18j42L92j95j75J11R3k06K28K2J41j96l1j69
5231a52K09M5J74j10l16J54p9Q3K1J23j60o6O6N6j69J50j38J89l4J20k79O6M4
5254cp6j50K17K4lK3K0j2J83m0k76N8j41J24K49j33O4l84L92m04K98M9J6j29j3
$$ plain form
5279 -47 27 42 176 -128 -15 -153 -204 205 -3 156 -224 68 88 -203 -27 -50 68 -63 5 212 148 29 -98
5302 -98 -63 55 107 162 -297 14 86 228 5 -136 -148 218 -284 419 -82 -16 89 -20 28 -127 -190 -98 282
5325 282 -52 59 -83 75 3 -363 12 66 21 25 -92 43 -36 175 -180 -58 -140 46 109 -60 -186 -47 31
5348 31 -204 154 -197 236 84 -161 153 -77 91 68 165 -196 -438 -45 12 581 -290 404 9 332 -192
5369 -192 212 399 -45 247 169 -122 -146 237 -136 250 9 -346 51 133 23 10 153 374 318 557 12 447
5391 447 -133 -424 -233 -371 -373 343 209 -152 -664 211 51 96 -243 -13 -96 -354 76 36 -531 -396 -618 -128
5413 -128 165 596 132 -290 -232 -143 128 -155 534 -273 -887 -370 402 53 101 236 239 21 171 235 597 214
5435 214 287 127 -643 632 256 380 -339 80 129 532 444 459 283 209 -91 233 551 -349 328 -382 -426 -44
$$ packed form
5279d7P4J5J34l04J13j38n1M09k08J59l80K92K0k91J76k3J18j31O8K07o4j19j27
5302i8L5J18N2N5m59L11P2J42k23j41j2L66n02P03n01O6J05j09M8j55o3R2L80
5325B82l34J11j42J58p2l66L75N4m5Mj17J35p9K11l55J22q2J86O3j69j26J39P8
5348C1k35L58l51M33j52k45L14k30J68k3R7l61k42L93N7N69q71O94l95L23n24
5369a92M04J87m44K92p8k91k4L83l73L86k41l55L97Q2j10j3J43K21n6K39n45M35
5391D47n80k91J91j38kP16j34l61n12Q75j60M5l39K30q3k58M30m0n67J35k22M90
5413a28K93M31m64m22N8Q9K71k83O89q07o14N17P72l49M8J35Lk18J50O4L62l83
5435B14P3j60p70J275l76J24p19M19M9M03q8J5j76p4l00L24L18r00O77p10m4L82
$$ plain form
5457 -44 -122 -310 359 214 569 -420 -219 0 -520 9 -93 141 -617 254 -362 66 17 30 17 -118 44 -28
5479 -28 -212 -46 -396 -186 72 -194 -17 -50 -121 151 -159 -8 99 -106 107 257 -153 78 164 52 14 -90
5501 -90 243 -19 -89 -286 109 236 40 -213 287 -85 111 231 -57 -57 15 20 95 160 73 93 -81 -24 56 68 33
5526 33 4 -154 -68 80 -37 -28 -69 -237 42 -71 -90 54 29 161 -211 -136 -39 188 11 45 32 34 -44 -14 81 -103
5552 -103 -139 -274 -156 -38 23 -29 149 100 77 62 -6 71 -141 -121 -28 28 -52 0 70 -46 140 129 15 71 -49
5577 -49 133 -18 -14 176 -54 -180 108 96 -41 278 50 -73 79 -49 -144 -28 41 63 102 -88 219 -19 -214
5600 -214 188 130 359 126 33 -3 -38 -36 155 43 12 157 81 -157 -90 39 -25 56 -122 -108 41 -157 -127 -80 104
5625 104 -74 114 113 -20 161 -387 -55 -78 98 -108 -156 171 26 -298 165 240 173 568 -4 -55 379 300 -405
$$ packed form
5457d4p8j88O69j45L55r89K01K19n20N29j02K34p58Q71o16M28m9J3j3j35J62p2
5479b8j84J66l50K10K58k66J77l3p1K72l10J51J07k05K13J50m10K31Q6j12l8j04
5501i0L33k62p0j97L95J27j96k53N00l72J96J20k88%P2NP5O5q7K0j74N7Q0J2l5
5526C3k9j58Q6J48j17Rm1j68K79j13j9J44k5J32l72P5R7K27j77L4j3Kp8L0R5j84
5552a03l6j35J18J18O1n2J78m9k3j5o8P7k12K0R3N6q0N2P0j16J86j1j14N6j20
5577d9J82j51MJ90k30j26K88j2j37L19k28j23J52j28r5J16O9K2L9j90L07k38j95
5600b14M02n8K29k33r3l6l5KJ91j12l1J45p6k38O7J29o4Q1j78J4J49j98L0M7J84
5625A04j78J88jj33J81n48L32k3J76k06m8L27j45l24M63P5o7L95n72n1M34p9p05
$$ plain form
5648 -405 330 26 -755 707 358 447 269 -48 -59 131 148 -24 -91 -230 -147 234 146 10 135 26 262 -28
5670 -28 108 -54 2 141 -157 20 28 48 30 -17 155 -138 91 -9 -216 192 252 163 -121 -57 93 4 -105 -44
5694 -44 -9 50 -62 18 41 11 113 69 178 -113 -127 -43 69 -58 -123 26 -44 87 -5 74 -52 -25 26 14 47 96
5720 96 -62 -41 44 -154 28 6 66 -47 207 11 137 -16 -110 299 -111 142 9 150 38 -8 98 -13
5742 -13 119 -158 130 158 200 -39 -24 127 38 -69 222 -14 -87 -179 21 -31 67 -121 -153 -70 75 -55 -52 -81 -77
5767 -77 19 -39 -233 -186 9 135 -43 -222 21 0 166 201 -148 -21 175 -44 148 -215 62 -85 -243 -111
5789 -111 233 -86 -8 -405 -201 10 -201 79 20 -75 -4 -109 -100 147 -6 -138 -14 2 90 199 38 188 260
5812 260 270 191 -38 -71 154 227 253 45 -151 -96 43 74 -34 -118 35 20 -124 271 137 -178 -72 -40 150
$$ packed form
5648d05P35l04p81J462l49Q9j78l17j1J90J7j72o7j39Q3L81q8j36J25j09K36k90
5670b8J36j62N6J39k98J77QK0j8m7J72k93K29j00k07M08O0q9k84O4J50q9j09O1
5694d4L5N9j12Q0K3l0J02m4J09k91j4Q4J12j27o5J49p0J31r2P9j26K7N1j2L3M9
5720I6j58K1Q5j98J82k2O0j13K54j96J26j53r4M09m10K53j33J41j12m6J06j11
5742a3J32k77K88K8M2k39J5J51q9j07K91k36p3r2K00n2R8j88l2Q3J45j30Lk9M
5767g7R6n8j94M7J95J26j78j79K43k1J66L5l49J27J96k19J92l63K77j47j58J32
5789a11L44l19P8l97K04K11k11K80n9r5P1j05RK47j53j32J24J6Q8J09j61J50P2
5812B60J0p9k29l3K25P3K6k08j96N5J39L1j08q4J53j5j44L95j34l15J06L2J90
$$ plain form
5835 150 -86 -7 59 27 69 94 -125 97 -52 -217 -137 -237 -7 -18 -192 156 -97 90 102 -238 -4 -9 -203
$$ packed form
5835A50k36P9O6l2M2K5k19K22j49j65Q0j00K30j1j74L48k53J87J2l40K34nj94
$$ [...]
8191a26
##END NTUPLES=NMR FID
##END=
