##TITLE=1H_SL59(CuBr2-ahh-3d)
 CDCl3, 8 sc, 
 16.12.2020
##JCAMPDX= 6.0         $$ Bruker NMR JCAMP-DX V2.0
##DATA TYPE= NMR FID
##DATA CLASS= NTUPLES
##ORIGIN= UXNMR, Bruker Analytische Messtechnik GmbH
##OWNER= root
$$ XWIN-NMR		Version 3.5
$$ Wed Dec 16 10:30:54 2020 Russian Standard Time (UT+4h)  she@DPX200
##.OBSERVE FREQUENCY= 200.1315066352
##.OBSERVE NUCLEUS= ^1H
##.DELAY= (6, 6)
##.ACQUISITION MODE= SIMULTANEOUS
##.ACQUISITION SCHEME= undefined
##.AVERAGES= 8
##.DIGITISER RES= 18
##SPECTROMETER/DATA SYSTEM= spect
##.PULSE SEQUENCE= zg30
##.SOLVENT NAME= CDCl3
##.SHIFT REFERENCE= (INTERNAL, CDCl3, 0, 15.7039)
##AUDIT TRAIL= $$ (NUMBER, WHEN, WHO, WHERE, WHAT)
$$ ##TITLE= Audit trail, XWIN-NMR		Version 3.5
$$ ##JCAMPDX= 5.01
$$ ##ORIGIN= Bruker BioSpin GmbH
$$ ##OWNER= she
$$ F:/spectra/data/she/nmr/H-F/1/audita.txt
$$ ##AUDIT TRAIL=  $$ (NUMBER, WHEN, WHO, WHERE, WHAT)
(   1,<2020-12-16 10:29:45.79 +0400>,<she>,<DPX200>,
      <created by zg, POWCHK disabled, PULCHK disabled
       configuration hash MD5:
       00 E9 B6 7A A2 85 ED C7 34 08 36 98 17 FE 4E 26
       data hash MD5: 16K
       8F 9B 58 2F F6 70 75 14 C1 44 2F 06 3C 6B 06 CE>)
$$ ##END=
$$ 
$$ hash MD5
$$ 2A 76 48 FD 12 F6 69 36 6C DE 45 DF 66 D8 97 69
##$RELAX= 
##$RELAX= 
##$RELAX= 
##$RELAX= 
##$RELAX= 
##$RELAX= 
$$ Bruker specific parameters
$$ --------------------------
##$DU= <F:/spectra>
##$EXPNO= 1
##$NAME= <H-F>
##$PROCNO= 1
##$TYPE= <nmr>
##$USER= <she>
##$AMP= (0..31)
100 100 100 100 100 100 100 100 100 100 100 100 100 100 100 100 100 100 
100 100 100 100 100 100 100 100 100 100 100 100 100 100 
##$AQSEQ= 0
##$AQ_mod= 1
##$AUNM= <au_zg>
##$AUTOPOS= <>
##$BF1= 200.13
##$BF2= 200.13
##$BF3= 200.13
##$BF4= 200.13
##$BF5= 200.13
##$BF6= 200.13
##$BF7= 200.13
##$BF8= 200.13
##$BYTORDA= 1
##$CFDGTYP= 0
##$CFRGTYP= 5
##$CHEMSTR= <none>
##$CNST= (0..31)
1 1 145 1 1 1 1 1 1 1 1 1 1 1 1 1 1 1 1 1 1 1 1 1 1 1 1 1 1 1 1 1 
##$CPDPRG= <>
##$CPDPRG1= <>
##$CPDPRG2= <>
##$CPDPRG3= <>
##$CPDPRG4= <mlev>
##$CPDPRG5= <mlev>
##$CPDPRG6= <mlev>
##$CPDPRG7= <mlev>
##$CPDPRG8= <mlev>
##$CPDPRGB= <>
##$CPDPRGT= <>
##$D= (0..31)
0 1.2 0 0 0 0 0 0 0 0.06 0 0.03 0 0 0 0 0.0002 0 0 0 0 0 0 0 0 0 0 0 0 
0 0 0 
##$DATE= 1608100185
##$DBL= (0..7)
120 120 120 120 120 120 120 120 
##$DBP= (0..7)
150 150 150 150 150 150 150 150 
##$DBP07= 0
##$DBPNAM0= <>
##$DBPNAM1= <>
##$DBPNAM2= <>
##$DBPNAM3= <>
##$DBPNAM4= <>
##$DBPNAM5= <>
##$DBPNAM6= <>
##$DBPNAM7= <>
##$DBPOAL= (0..7)
0.5 0.5 0.5 0.5 0.5 0.5 0.5 0.5 
##$DBPOFFS= (0..7)
0 0 0 0 0 0 0 0 
##$DE= 6
##$DECBNUC= <off>
##$DECIM= 32
##$DECNUC= <off>
##$DECSTAT= 4
##$DIGMOD= 1
##$DIGTYP= 9
##$DL= (0..7)
0 120 120 120 120 120 120 120 
##$DP= (0..7)
150 150 150 150 150 150 150 150 
##$DP07= 0
##$DPNAME0= <>
##$DPNAME1= <>
##$DPNAME2= <>
##$DPNAME3= <>
##$DPNAME4= <>
##$DPNAME5= <>
##$DPNAME6= <>
##$DPNAME7= <>
##$DPOAL= (0..7)
0.5 0.5 0.5 0.5 0.5 0.5 0.5 0.5 
##$DPOFFS= (0..7)
0 0 0 0 0 0 0 0 
##$DQDMODE= 0
##$DR= 18
##$DS= 0
$$ [...]
##$SUBNAM2= <"">
##$SUBNAM3= <"">
##$SUBNAM4= <"">
##$SUBNAM5= <"">
##$SUBNAM6= <"">
##$SUBNAM7= <"">
##$SUBNAM8= <"">
##$SUBNAM9= <"">
##$SW= 16.9725356469052
##$SWIBOX= (0..15)
0 0 2 0 0 0 0 0 0 0 0 0 0 0 0 0 
##$SW_h= 3396.73913043478
##$TD= 16384
##$TD0= 1
##$TE= 0
##$TE2= 300
##$TE3= 300
##$TEG= 300
##$TL= (0..7)
0 120 120 120 120 120 120 120 
##$TP= (0..7)
150 150 150 150 150 150 150 150 
##$TP07= 0
##$TPNAME0= <>
##$TPNAME1= <>
##$TPNAME2= <>
##$TPNAME3= <>
##$TPNAME4= <>
##$TPNAME5= <>
##$TPNAME6= <>
##$TPNAME7= <>
##$TPOAL= (0..7)
0.5 0.5 0.5 0.5 0.5 0.5 0.5 0.5 
##$TPOFFS= (0..7)
0 0 0 0 0 0 0 0 
##$TUNHIN= 0
##$TUNHOUT= 0
##$TUNXOUT= 0
##$USERA1= <user>
##$USERA2= <user>
##$USERA3= <user>
##$USERA4= <user>
##$USERA5= <user>
##$V9= 5
##$VALIST= <valist>
##$VCLIST= <CCCCCCCCCCCCCCC>
##$VD= 0
##$VDLIST= <DDDDDDDDDDDDDDD>
##$VPLIST= <PPPPPPPPPPPPPPP>
##$VTLIST= <TTTTTTTTTTTTTTT>
##$WBST= 1024
##$WBSW= 4
##$XGAIN= (0..3)
0 0 0 0 
##$XL= 0
##$YL= 0
##$YMAX_a= 160123
##$YMIN_a= -186649
##$ZGOPTNS= <>
##$ZL1= 120
##$ZL2= 120
##$ZL3= 120
##$ZL4= 120
##$ABSF1= 10
##$ABSF2= 0
##$ABSG= 5
##$ABSL= 3
##$ALPHA= 0
##$AQORDER= 0
##$ASSFAC= 0
##$ASSFACI= 0
##$ASSFACX= 0
##$ASSWID= 0
##$AUNMP= <proc_1d>
##$AZFE= 0.1
##$AZFW= 0.1
##$BCFW= 1
##$BC_mod= 2
##$BYTORDP= 1
##$COROFFS= 0
##$CY= 11.3945322036743
##$DATMOD= 1
##$DC= 2
##$DFILT= <>
##$DTYPP= 0
##$F1P= 15.9154993809931
##$F2P= -4.1035820241983
##$FCOR= 0.5
##$FTSIZE= 0
##$FT_mod= 4
##$GAMMA= 1
##$GB= 0.15
##$INTBC= 1
##$INTSCL= 1
##$ISEN= 128
##$LB= 0.24
##$LEV0= 0
##$LPBIN= 0
##$MAXI= 10000
##$MC2= 0
##$MEAN= 0
##$ME_mod= 0
##$MI= 1.114404
##$NCOEF= 0
##$NC_proc= 0
##$NLEV= 6
##$NOISF1= 3.799351
##$NOISF2= 2.8
##$NSP= 1
##$NTH_PI= 0
##$NZP= 0
##$OFFSET= 15.70392
##$PC= 1
##$PHC0= -10764.84
##$PHC1= 17.40089
##$PH_mod= 1
##$PKNL= yes
##$PPARMOD= 0
##$PSCAL= 0
##$PSIGN= 0
##$REVERSE= no
##$SF= 200.130013532006
##$SI= 16384
##$SIGF1= 3
##$SIGF2= 2
##$SINO= 400
##$SIOLD= 16384
##$SREGLST= <1H.CDCl3>
##$SSB= 0
##$STSI= 0
##$STSR= 0
##$SW_p= 3612.71676300578
##$SYMM= 0
##$S_DEV= 0
##$TDeff= 0
##$TDoff= 0
##$TI= <>
##$TILT= no
##$TM1= 0
##$TM2= 0
##$TOPLEV= 0
##$USERP1= <user>
##$USERP2= <user>
##$USERP3= <user>
##$USERP4= <user>
##$USERP5= <user>
##$WDW= 1
##$XDIM= 8192
##$YMAX_p= 0
##$YMIN_p= 0
$$ End of Bruker specific parameters
$$ ---------------------------------
##NTUPLES= NMR FID
##VAR_NAME=  TIME,          FID/REAL,        FID/IMAG
##SYMBOL=    X,             R,               I
##VAR_TYPE=  INDEPENDENT,   DEPENDENT,       DEPENDENT
##VAR_FORM=  AFFN,          ASDF,            ASDF
##VAR_DIM=   8192,          8192,            8192
##UNITS=     SECONDS,       ARBITRARY UNITS, ARBITRARY UNITS
##FACTOR=    0.0002944,     1,               1
##FIRST=     0,             0,               0
##LAST=      2.4114304,     0,               0
##MIN=       0,             -186649,         0
##MAX=       2.4114304,     160123,          0
$$ Real data points
##PAGE= N=1
##DATA TABLE= (X++(R..R)), XYDATA
$$ [...]
$$ plain form
1919 -370 6 -152 -633 337 -440 -103 884 -200 -176 205 -385 -671 -26 -909 -70 104 -217 520 -49 -47 540
1940 540 -96 -431 -53 -545 -16 438 -267 560 557 -258 501 -33 68 323 123 -416 218 316 97 420 306
1961 306 362 453 -609 262 300 -267 450 239 -192 659 -209 -103 734 -474 -280 269 -685 -285 94 50 -34
1982 -34 -105 276 -18 76 -106 203 -14 34 450 -318 213 139 -1194 -15 -44 -421 72 -236 -82 84 18 -642
2004 -642 536 322 77 47 -1115 374 -567 -421 -380 -44 -666 -280 -87 -277 762 -538 -192 219 -210
2023 -210 -451 195 -343 -781 -239 -369 -35 -621 153 938 -507 -262 -312 -431 -94 -259 14 144 126 -343
2043 -343 207 -269 -135 629 -111 -401 -585 142 -13 732 -467 164 -56 -904 298 267 225 168 703 -446
2063 -446 1022 -347 -153 -618 -373 -212 18 -668 -598 -626 -802 224 51 -45 132 -191 -559 242 -658 252
$$ packed form
1919c70L76j58m81R70p77L37R87j084K4L81n90k86O45q83Q39J74l21P37n69KN87
1940E40o36l35L78m92N29M54p05Q27lq15P59n34J01K55k00n39O34R8k19L23j14
1961C06N6R1j062Q71L8n67P17k11m31Q51q68J06Q37j208J94N49r54M00L79m4q4
1982c4p1L81k94R4j82L09k17M8M16p68N31p4j333J179k9l77M93l08J54J66o6o60
2004f42J178k14k45l0j162J489r41J46M1L36o22L86J93j90J039j300L46M11m29
2023b10k41O46n38m38N42j30L34n86P74P85j445K45n0j19L37j65K73J30j8m69
2043c43N50m76J34P64p40k90j84P27j55P45j199O31k20q48J202l1m2n7N35j149
2063d46J468j369J94m65K45J61K30o86P0k8j76J026j73r6J77l23l68Q01r00R10
$$ plain form
2083 252 19 -236 241 -312 -343 294 -682 -166 180 -220 -191 -367 -340 306 374 -168 339 263 -78 264 201 -236
2105 -236 562 265 2 404 -21 166 455 115 267 233 -24 462 212 -86 481 167 76 219 -217 70 354
2126 354 -180 -39 212 -316 92 128 -61 301 -229 -178 186 -577 -178 181 -296 -129 -6 -229 -271 -342 -370 201
2148 201 -678 -324 53 -225 -125 -383 -218 -220 516 -218 -443 -341 -572 -109 -55 -383 21 -259 -371 386 466
2169 466 60 -6 -352 399 365 -454 580 126 -131 74 -252 59 204 -326 -337 -133 238 910 620 -269 -370
2190 -370 -84 -244 462 -396 -679 19 -66 160 689 510 -304 510 -600 30 291 46 608 -441 161 116
2210 116 -513 -207 241 -41 -110 117 -1371 75 200 -125 141 -447 -539 -13 -372 -515 -107 -500 -722 326
2230 326 -730 171 -333 -268 -66 -277 -737 464 -29 -549 -76 -190 352 212 -225 485 561 -268 -288 238
$$ packed form
2083B52k33k55M77n53l1O37r76N16L46m00K9j76K7O46O8n42N07p6l41L42o3m37
2105b36P98k97k63M02m25J87K89l40J52l4k57M86k50k98N67l14r1J43m36K87K84
2126C54n34J41K51n28M08L6j89L62n30N1L64p63L99L59m77J67J23k23m2p1k8N71
2148B01q79L54L77k78J00k58J65kP36p34k25J02k31M63N4l28M04k80j12P57Q0
2169D66m06o6l46P51l4q19J034m54k57K05l26L11J45n30j1K04L71O72k90q89j01
2190c70K86j60P06q58k83O98q5K26N29j79q14Q14j110O30K61k45N62j049O02m5
2210A16o29L06M48k82o9K27j488J446J25l25K66n88r2N26l59j43M08l93k22J048
2230C26j056R01n04O5K02k11m60J201m93n20M73j14N42j40m37P10P6q29k0N26
$$ plain form
2250 238 -564 188 490 -295 658 -65 87 759 314 511 661 -148 2 436 -307 -390 313 -400 171 -500
2270 -500 162 151 223 -387 387 123 -667 725 93 228 260 277 252 103 -334 90 -92 57 188 -356 -37
2291 -37 -384 -842 -459 273 -32 -119 -779 12 155 -322 -532 251 -424 -2 -948 -272 -144 -231 409 -135 109
2312 109 -226 387 -534 -125 -982 -479 6 -45 -198 -28 197 -687 751 16 -24 93 278 389 -95 233
2332 233 218 52 228 -696 543 20 491 143 61 918 -9 -62 123 -102 -99 35 -383 170 506 186 66
2353 66 74 -504 574 383 -36 -86 438 -267 -88 -297 348 326 -207 91 -429 -489 246 -391 -416 349 -229 -337
2375 -337 23 -564 -159 394 -584 -451 44 -282 -46 -228 -446 -217 -85 -74 263 -135 76 170 -322 48 425
2396 425 -197 -84 -44 145 385 -10 -360 217 124 -94 205 54 43 332 114 265 347 5 344 112 -117
$$ packed form
2250B38q02P52L02p85R53p23J52O72m45J97J50q09J50M34p43q3P03p13N71o71
2270e00O62j1P2o10P74k64p90J392o32J35L2J7k5j49m37M24j82J49J31n44L19
2291c7l47m58L83P32l05q7o60P91J43m77k10P83o75M22r46O76J28q7O40n44K44
2312A09l35O13r21M09q57N03M85n1j53J70K25q84J438p35m0J17J85J11m84L28
2332B33j5j66J76r24J239n23M71l48q2Q57r27n3J85k25LJ34m18N53L36l20j20
2353F6Qn78J078j91m19n0N24p05J79k09O45k2n33K98n20o0P35o37k5P65n78j08
2375c37L60n87M05N53r78J33M95l26K36j82k18K29J32J1L37l98K11R4m92L70L77
2396D25o22J13M0J89K40l95l50N77r3k18K99j51j1K89k18J51Q2l42L39k32k29
$$ plain form
2417 -117 350 142 -112 286 -70 229 366 228 201 288 80 -55 180 -155 62 105 -30 58 -275 1 -223
2438 -223 -108 82 85 -250 -68 -186 -374 189 -297 -327 338 40 -204 -29 -425 -70 -255 -213 57 -248 -94
2459 -94 9 -421 -144 131 -163 -70 -224 -130 119 345 -128 238 161 -368 135 96 -73 271 184 -36 310 -5
2481 -5 243 544 -51 283 209 -66 97 143 73 -2 216 -200 481 -112 251 289 -111 307 -73 66 208 281 -55
2504 -55 233 43 -15 133 -30 -239 -18 -366 -433 144 -58 -5 52 -149 -567 -89 -155 -220 -166 -623 -150 -388 261
2527 261 -246 -472 -625 -507 -244 6 15 -141 -267 -645 121 535 125 224 127 -387 322 405 -404 -22 -106 91
2549 91 324 77 -301 275 -156 -12 98 -154 158 61 38 177 -58 177 165 104 37 18 37 279 275 35 170
2572 170 95 131 251 222 35 104 148 -150 220 29 -33 192 -249 -38 111 4 6 -17 -179 48 97 -391 361
$$ packed form
2417a17M67k08k54L98l56K99J37j38k7Q7k08j35K35l35K17M3j35Q8l33K76k24
2438b23J15J90Ll35J82j18j88N63m86l0O65k98k44J75l96L55j85M2K70l05J54
2459i4J03m30K77K75k94R3j54R4K49K26m73L66p7n29N03l9j69L44q7k20L46l15
2481eK48L01n95L34p4k75J63M6p0p5K18m16O81n93L63L8m00M18l80J39J42P3l36
2504e5K88j90n8J48j63k09K21l48o7N77k02N3N7k01m18M78o6o5N4m57M73k38O49
2527B61n07k26j53J18K63K50Rj56j26l78P66M14m10R9r7n14P09Q3q09L82q4J97
2549I1K33k47l78N76m31J44J10k52L12r7k3J39k35K35j2o1o7j9J9K42mk40J35
2572A70p5L6J20k9j87O9M4k98L70j91o2K25m41K11J49j07Kk3j62K27M9m88P52
$$ plain form
2595 361 141 -96 108 -59 -250 178 -60 -316 12 -254 57 51 -89 40 -94 -313 77 -165 104 34 -19
2616 -19 157 -189 -286 -71 -118 -37 62 -110 -96 125 144 51 248 8 1 -87 -207 4 41 -116 109 162 -28 227
2640 227 -42 14 493 37 16 56 -5 234 123 -26 -54 367 111 240 -59 157 25 -195 47 163 -365 -170
2662 -170 -154 97 177 246 -124 -60 -139 -334 -11 -465 -99 142 -110 270 -181 -265 -220 -186 61 -145 51 -19 150
2685 150 -319 -105 27 -249 47 43 -95 88 109 -36 62 84 -67 40 -158 16 134 145 -190 130 37 -63
2707 -63 -60 185 5 109 -185 404 -58 28 12 39 -120 306 21 41 -20 140 25 96 50 -53 230 143 493 3
2731 3 -180 -140 136 -25 128 209 342 144 32 -8 184 -180 -224 -95 -224 -1 -68 -154 65 -59 -99 -163 -408
2754 -408 -253 -79 -42 -293 -169 -347 41 -293 -306 4 -186 82 -15 232 277 128 -334 149 88 -201 -154 -82
$$ packed form
2595C61k20k37K04j67j91M28k38k56L28k66L11oj40J29j34k19L90k42K69p0n3
2616a9J76l46r7K15m7Q1R9j72J4K21J9r3J97k40pq8j20K11L7j57K25N3j90K55
2640B27k69N6M79m56k1M0o1K39j11j49k8M21k56J29k99K16j32k20K42J16n28J95
2662a70J6K51Q0O9l70O4p9j95L23m54L66K41k52L80m51q4M5L4K47k06J96p0J69
2685A50m69K14J32k76K96mj38J83K1j45R8K2j51J07j98J74J18J1l35L20r3j00
2707f3LK45j80J04k94N89m62Q6j6K7j59M26k85K0o1J60j15P1m6j03K83q7L50m90
2731Cj83M0K76j61J53Q1J33j98j12m0J92l64m4J29j29K23o7q6K19j24m0o4k45
2754d08J55J74L7k51J24j78L88l34j3L10j90K68r7K47M5j49m62M83o1k89M7P2
$$ plain form
2776 -82 131 78 90 410 -80 -91 204 97 121 442 2 -121 185 357 -187 267 220 235 228 -25 -71 37 45 -373
2800 -373 169 36 -156 70 69 377 56 -102 -258 -219 -54 152 -166 43 129 -234 155 -26 -111 107 179 -98
2822 -98 1 52 -292 -157 -101 -126 -63 49 -5 -170 -288 92 3 -53 122 152 -44 -201 -32 -9 10 105 -62 -2 -131
2847 -131 171 -10 -11 226 239 206 367 125 -110 87 -193 59 42 94 378 250 272 -72 142 107 349 248 147
2870 147 48 79 -52 -107 -92 1 72 -112 96 -80 63 188 -446 -180 167 -114 -67 -45 30 218 -218 -173 -446
2893 -446 63 -484 -153 70 88 -393 -137 -279 181 -353 -111 -155 -21 -402 706 -168 150 498 313 -93
2913 -93 11 -124 -1 -71 129 51 -109 53 77 -227 257 -250 -75 230 -157 -122 272 -227 109 339 107 254
2935 254 270 17 183 51 -144 141 103 -44 31 61 236 185 -54 135 206 -367 180 37 -185 -185 32 -240 13
$$ packed form
2776h2K13n3J2L20m90j1K95j07K4L21m40j23L06J72n44M54m7J5pk53m6J08Qm18
2800c73N42j33j92K26jL08l21j58j56L9J65K06l18K09Q6l63L89j81q5K18P2k77
2822i8R9N1l44J35N6k5O3J12n4j65j18L80q9n6J75L0j96j57J69K3J9R5j67O0j29
2847a31L02j81jK37J3l3J61k42k35J97k80K52j7N2K84j28K2l44K14l5K42j01j01
2870A47r9L1j31n5J5R3P1j84K08j76J43J25o34K66L47k81M7K2P5J88m36M5k73
2893d46N09n47L31K23J8m81K56j42M60n34K42m4J34l81J108q74L18L48j85m06
2913i3J04j35J23p0K00p8j60J62K4l04M84n07J75L05l87L5L94m99L36K30k32J47
2935B54J6k53J66j32j95K85l8j47P5L0J75n1k39J89P1n73N47j43k22%K17k72K53
$$ plain form
2958 13 -148 -79 301 -207 -45 98 -150 -78 47 -126 119 -86 -24 82 -20 17 -31 151 -90 -191 -305 0
2980 0 -95 -64 -1 -6 -62 -5 -283 -85 -22 -52 -35 200 -193 141 -104 -156 -51 -290 -85 199 -27 155 179 -133 -137
3005 -137 268 -29 42 98 -112 -2 77 186 97 40 -214 -65 74 6 155 -33 160 131 -164 190 24 -73 34
3028 34 -133 47 17 -203 -377 -27 136 146 34 72 -63 -152 240 -99 -94 -268 138 -23 -195 126 -173 -30
3050 -30 -67 144 27 -5 -146 -23 -102 -159 -84 -309 -59 28 -154 -188 -3 -49 -228 50 -163 143 55 15 192 11
3074 11 -32 159 -32 6 149 -15 33 357 41 121 58 -79 310 -147 91 -221 169 108 -22 -20 43 -53 -52 107
3098 107 -53 221 -84 268 70 229 155 -222 -41 -396 -95 135 58 277 32 285 -14 -84 -19 91 -158
3119 -158 -46 169 -91 92 -143 -264 82 -119 -191 -36 136 -209 56 -105 -202 87 -245 27 157 -35 -60
$$ packed form
2958A3j61O9L80n08J62J43k48P2J25j73K45k05O2J06j02L7m8J82k41j01j14L05
2980@r5L1O3nn6N7k78J98O3l0J7K35l93L34k45n2J05k39K05K84k26J82K4l12m
3005a37M05k97P1N6k10J10P9J09q9n7k54J49J39o8J49j88J93k9k95L54j66r7J07
3028C4j67J80l0k20j74L50J63J0j12L8j35q9L92l39Nj74M06j61j72L21k99J43
3050c0l7K11j17l2j41J23p9n7P5k25K50Q7j82l4J85m6j79K78k13L06q8m0J77j81
3074A1m3J91j91L8J43j64M8L24l16Q0o3j37L89m57K38l12L90o1j30KO3r6JJ59
3098A07j60K74l05L52j98J59p4l77J81l55L01K30p7K19k45K53k99p0O5J10k49
3119a58J12K15k60J83k35j21L46k01p2J55J72l45K65j61r7K89l32K72J30j92k5
$$ plain form
3140 -60 22 -33 -4 336 -121 -60 173 126 94 -31 -1 76 -25 -3 -171 -57 -90 306 52 166 1 225 76 -193
3164 -193 65 41 150 281 30 -79 -70 -4 -189 299 51 34 -60 75 82 20 -78 116 142 163 39 -83 -19 279
3188 279 -149 -337 -245 -8 -42 -81 -44 -313 -80 -69 -209 0 -264 -11 -363 55 -112 -59 117 -217 103 -153
3210 -153 -196 -164 50 63 -96 108 152 45 -151 -195 -55 8 -47 13 125 177 -44 41 -17 55 32 -129 112 108 -33
3235 -33 231 -1 -126 106 -58 71 160 9 11 282 9 -37 177 -39 70 -28 -68 19 171 56 78 -27 261
3258 261 -52 42 23 197 117 13 38 -180 -64 -53 -186 -134 132 -155 -118 35 -299 -159 -293 -114 -19 -142 80
3281 80 128 -173 -65 -9 -372 29 -76 -66 121 54 54 32 -147 -190 -243 142 -32 237 -109 124 54 -78 -63 -106
3305 -106 163 -63 -42 -117 -56 -255 -45 9 70 -57 254 185 304 138 -653 293 -230 -266 302 -360 0 -86 185
$$ packed form
3140f0Q2n5K9L40m57O1K33m7l2j25L0P7j01K2j68J14l3L96k54J14j65K24j49k69
3164a93K58k4J09J31k51j09RO6j85M88k48j7r4J35Po2r8J94K6K1j24j22O4K98
3188B79m28j88R2K37l4l9L7k69K33J1j40K09k64K53l52M18j67N3J76l34L20k56
3210a53m3L2K14J3j59K04M4j07j96m4J40O3n5O0J12N2k21Q5n8P2k3j61K41mj41
3235c3K64k32j25K32j64J29Q9j51KK71k73m6K14k16J09r8m0Q7J52j15K2j05K88
3258B61l13R4j9J74q0j04K5k18J16J1j33N2K66k87L7J53l34J40j34J79R5j23K22
3281H0M8l01J08N6l63M01j05J0J87o7%k2j79m3n3L85j74K69l46K33p0j32J5m3
3305a06K69k26K1p5O1j99K10N4O1j27L11o9J19j66p91R46n23l6N68o62L60q6K71
$$ plain form
3328 185 -64 -106 -382 116 560 440 10 -274 471 15 -92 454 -170 83 -137 -28 340 111 -197 -71
3348 -71 -205 -178 211 21 166 103 -6 -200 109 -184 179 30 34 -17 45 15 179 -161 -81 -97 -88 -83 47 176 118
3373 118 -3 -19 341 141 10 270 91 52 -244 241 11 -116 20 -63 31 118 -48 126 -131 82 -119 52
3395 52 13 -15 124 23 94 -130 216 26 -161 -56 41 -14 72 -27 -60 -116 15 -40 -64 -62 -2 -276 4 85 -85
3420 -85 -4 -27 16 -64 -42 -274 -52 -48 9 -152 25 17 -69 -201 -216 152 69 -178 -183 8 -55 -10 -162 11 39 -22 178
3447 178 -147 117 -184 14 53 191 -39 -8 -66 3 31 264 47 392 251 80 289 -98 172 37 402 -18
3469 -18 -118 -102 -30 53 83 63 159 105 75 -300 61 -80 194 -105 -57 -31 -43 36 100 -28 -37 -20 -189 -124 -148 117
3495 117 35 -200 -151 -72 274 160 247 -84 190 192 190 -47 -154 36 -98 -46 64 2 -61 -4 26 -115 -155 -38 -3
$$ packed form
3328A85k49m2k76M98M44j20m30k84P45m56j07N46o24K53k20J09L68k29l08J26
3348g1j34K7L89j90J45o3j09j94L09k93L63j49Mn1O2l0J64l40Q0j6RNJ30J29n8
3373A18j21j6L60k00j31K60j79l9k96M85k30j27J36q3R4Q7j66J74k57K13k01J71
3395E2l9k8J39j01P1k24L46j90j87J05R7n5Q6r9l3n6J31n5k4KO0k74K80Q1j70
3420h5Q1k3M3q0K2k32K22MN7j61J77qq6j32j5L68q3k47nJ91o3M5j52J73K8o1K00
3447A78l25K64l01J98L9J38k30L1n8O9K8K33k17L45j41j71K09l87K70j35L65m20
3469a8j00J6P2Q3L0k0R6n4l0l75L61j41K74k99M8K6j2P9O4j28rJ7j69O5k4K65
3495A17q2k35M9P9L46j14Q7l31K74Kkk37j07J90j34N2J10o2o3N7L0j41m0J17L5
$$ plain form
3520 -3 -178 83 203 20 -67 178 -25 -7 13 33 227 234 -18 -62 187 109 15 43 212 183 -9 217 396 -97
3544 -97 -16 100 -63 1 2 -36 36 46 -68 7 -9 74 214 -206 -73 266 222 -132 16 -154 136 39 59 -132 -125
3569 -125 109 213 -91 -20 53 51 -7 -10 -103 34 -160 -191 125 -65 -259 -92 -54 135 -85 -186 1 -69 -78 -281
3593 -281 -53 70 294 -186 -311 76 -10 -142 -4 87 32 21 -85 122 -61 52 215 178 235 283 -42 -97 -25
3616 -25 124 -22 300 199 97 -107 -73 131 177 146 70 -84 -244 230 -3 -13 132 -7 103 18 -101 -201
3638 -201 -313 -71 -53 56 -65 -61 248 54 -64 -20 -60 158 -8 -257 83 -20 -285 11 -208 62 55 34 -4
3661 -4 14 64 -238 2 -15 35 24 -76 98 11 120 24 -141 144 56 45 111 -103 -8 59 -80 49 42 -87 69
3686 69 -2 21 194 135 247 18 177 197 145 -27 141 -268 15 90 89 81 144 383 -8 95 -113 -18 -1 49 64
$$ packed form
3520cj75K61J20j83q7K45k03J8K0K0J94Pk52m4K49p8r4K8J69k9j92K26J79m93
3544i7Q1J16j63O4Jl8P2J0j14P5j6Q3J40m20J33L39m4l54J48j70K90r7K0j91P
3569a25K34J04l04P1P3kn8lr3J37j94l1L16j90j94J67L8J89k20j01J87p0rk03
3593b81K28J23K24m80j25L87q6j32J38R1n5j1j06K07j83J13J63l7N7M8l25n5P2
3616b5J49j46L22j01j02k04L4K04M6l1p6j54j60M74k33j0J45j39J10q5j19j00
3638b01j12K42J8J09j21ML09j94j18M4m0K18j66k49L40j03k65K96k19K70pk1l8
3661dJ8N0l02K40j7N0j1j00J74q7J09r6j65K85q8j1O6k14R5O7j39J29pj29J56
3686F9p1K3J73n9J12k29J59K0n2j72J68m09K83P5jqO3K39l91J03k08R5J7N0J5
$$ plain form
3711 64 14 -83 13 -94 39 6 -187 226 -114 -137 181 321 -42 -124 -107 130 -52 25 65 55 -2 69 -65 218
3735 218 -104 -30 -38 -44 -39 186 -50 26 64 -190 238 42 143 30 -63 266 -214 118 -58 -157 -32 204 -43 -31
3759 -31 65 160 -229 -70 -53 3 -23 194 90 31 60 25 65 161 158 11 33 -92 198 -133 -107 62 87 -120 -113 50
3785 50 308 -98 161 41 -132 -38 -217 -168 -53 -128 102 -174 -84 -83 6 -306 -67 -72 77 -156 64 -161 -200 -33
3809 -33 -21 252 -102 -126 66 159 131 -275 152 -49 203 38 -159 -152 222 -10 -202 56 116 -15 151 -261 193
3832 193 -122 -11 342 -131 23 143 65 -59 6 73 159 121 76 26 199 7 -125 -70 -104 116 126 103 41 78
3856 78 125 82 204 112 51 188 -146 11 -35 87 323 38 75 74 -136 20 117 -243 -164 -129 -310 -148 -73 -199
3880 -199 216 -96 34 -8 27 178 -192 -334 -77 185 152 93 17 211 -233 -230 25 -140 98 151 -324 -111 38
$$ packed form
3711F4n0r7R6j07J33l3j93M13l40k3L18J40l63q2J7K37j82P7M0j0n7P1j34K83
3735B18l22P4qoNK25k36P6L8k54M28j96J01j13r3L29m80L32j76r9J25K36k47J2
3759c1R6R5l89J59J7N6k6K17j04n9K9l5M0R6lj47K2j25K90l31K6J69K5k07PJ63
3785E0K58m06K59j20j73R4j79M9J15p5K30k76R0JQ9l12K39nJ49k33K20k25l9J67
3809c3J2K73l54k4J92R3k8m06M27k01K52j65j97PL74k32j92K58O0j31J66m12M54
3832A93l15J11L53m73J54J20p8j24O5O7Q6l8m5n0J73j92j32N5l4K20J0k3o2L7
3856G8M7m3J22r2o1J37l34J57m6J22K36k85L7jk10J56R7l60P9L5j81J62P5j26
3880a99M15l12J30m2L5J51l70j42K57K62l3n9p6J94m44LK55j65K38N3m75K13J49
$$ plain form
3903 38 69 155 184 -196 -22 247 -505 101 -32 191 110 46 287 484 -324 -120 266 564 297 -87 487 454
3925 454 970 -418 633 285 -191 225 -926 74 472 -162 115 208 -181 -137 260 -40 -171 -13 301
3944 301 -60 -14 20 -22 -275 -46 157 -257 11 171 -62 -134 -104 68 -16 9 -114 -21 -317 82 44 -4 26 -227
3968 -227 -49 184 -68 118 -35 -105 194 -227 70 141 37 -62 1 278 28 21 227 136 189 111 171 -22 -8 46
3992 46 130 7 29 -182 -148 123 -211 52 154 47 65 -261 -27 -80 175 -77 -120 -62 -197 -48 71 -161 -11
4015 -11 318 -86 23 -134 -81 109 -190 -148 -90 56 63 -47 63 113 113 82 44 -77 -31 -213 -265 -8 110 -235
4039 -235 -132 -317 -157 -268 -361 7 444 -650 79 412 -339 298 163 -348 -115 -155 -107 -94 281 75 -257
4060 -257 -386 305 193 44 54 116 73 27 79 -20 -17 104 40 -32 130 62 3 -120 116 85 26 -43 260 -74 -60
$$ packed form
3903C8L1Q6K9l80J74K69p52O06j33K23q1o4K41J97q08K04L86K98k67l84N74l3
3925D54N16j388J051l48m76M16j151J000L98o34K77R3l89M4L97l00j31J58L14
3944C01l61M6L4m2k53K29K03m14K68J60k33p2L0J72q4K5j23R3k96L99l8m8L0k53
3968b27J78K33k52J86j53p0K99m21K97P1j04r9O3K77k50pK06r1N3p8O0j93J4N4
3992D6Q4j23K2k11L4K71l34K63J02j07J8l26K34n3K55k52m3N8j35J49J19k32J50
4015a1L29m04J09j57N3J90k99M2N8J46Pj10J10N0%l1l8j21M6j82n2K57J18l45
4039b35J03j85J60j11r3L68M37j094P29L33p51O37j35n11K33m0M8J3L75k06l32
4060b57j29O91j12j49J0O2m3m6N2r9LJ21o4p2J62o8n9j23K36l1n9o9L03l34J4
$$ plain form
4085 -60 -179 102 149 -137 133 -64 -132 183 -37 -53 -74 70 57 -122 103 -166 -33 30 42 -36 -6 23 -32 -49
4109 -49 -207 61 11 -95 223 -129 -64 -148 -163 -136 173 204 188 -96 66 186 11 232 -13 -238 173 127 239
4132 239 113 105 277 158 25 -38 112 32 -29 -3 186 74 176 41 57 94 105 190 142 47 18 -13 -174 55 -36
4157 -36 -109 91 7 116 -144 54 268 141 -227 -91 156 48 -195 -382 -213 30 -122 153 -140 -215 -26
4178 -26 -178 -225 111 113 189 -194 -25 149 -124 -25 263 -41 0 -18 125 46 -47 -128 120 66 -81 -279 6 -16
4202 -16 -158 165 -55 52 15 16 64 -33 -25 -210 143 144 171 -69 -147 66 234 234 60 149 -41 185 116 151 45 142
4228 142 60 161 -78 151 100 -51 71 121 -94 71 179 -74 205 -123 -123 45 -184 236 -136 149 103 -143
4250 -143 -84 42 -41 -75 65 48 95 -36 12 49 63 27 -62 94 -154 -99 -19 80 -61 -103 -21 24 -149 -155 186 100
$$ packed form
4085f0j19K81M7k86K70j97o8L15k20j6k1J44j3j79K25k69J33O3J2p8L0K9n5j7
4109d9j58K68n0j06L18l52O5q4j5K7L09L1j6k84J62J20j75K21k45k25M11m6J12
4132B39j26qJ72j19j33o3J50q0o1K6J89j12J02j35J6L7J1Q5m8r5k9l1j61K29r1
4157c6p3K00q4J09k60J98K14j27l68J36K47j08k43j87J69K43j52K75k93p5J89
4178b6j52m7L36KP6l83J69J74k73R9K88l04M1j8J43p9r3q1K48n4j47j98K85k2
4202a6j42L23k20J07l7JM8r7Qj85L53JK7k40p8K13J68%j74Q9j90K26o9L5j06R7
4228A42q2J01k39K29n1j51J22N0k15J65J08k53K79l28%J68k29M20l72K85m6k46
4250a43N9J26q3l4J40j7M7j31M8L7J4l6q9J56k48N5Q0R9j41m2Q2M5j73oL41q6
$$ plain form
4276 100 64 43 -10 -166 208 -187 -172 -31 52 30 -182 99 -1 337 -63 -116 58 54 61 30 29 14 23 200 -150 -107
4302 -107 30 612 -30 -437 -77 118 7 -51 221 759 327 -198 547 -94 167 -160 -130 207 -369 -293 178
4323 178 253 63 -267 -648 76 -9 -767 45 69 171 69 -7 -147 -94 -341 -203 33 -119 -99 -33 63 134 -83
4346 -83 -59 -174 42 62 -20 -116 148 93 87 69 -8 212 10 131 14 270 -120 155 53 76 158 11 150 79
4370 79 -11 -19 68 -87 137 237 41 19 212 365 4 -140 -192 67 75 130 63 -70 169 -181 139 -189 -15 174
4394 174 -245 81 -120 -10 49 181 -49 88 -354 -113 -165 -64 -6 -110 102 65 73 -79 169 -15 37 143
4416 143 -90 47 134 -2 -67 -66 -217 -97 28 66 63 -29 -52 166 -59 -106 -115 60 200 -48 227 56 -29 73
4440 73 169 -25 255 128 225 -108 196 -113 -55 -41 145 -7 -225 -110 245 -109 43 179 -132 -42 96 -141
$$ packed form
4276A00l6k1n3j56L74l95J5J41Q3k2k12K81j00L38m00n3J74mPl1jj5RJ77l50M3
4302a07J37N82o42m07L60J95j11n8K72N38m32n25P45o41K61l27L0L37n76P6M71
4323A78P5j90l30l81P24q5p58Q12K4J02j02p6j40N3k47J38K36j52K0O6R6P1k17
4346h3K4j15K16K0q2r6K64n5oj8p7K20k02J21j17K56l90K75j02K3Q2j47J39p1
4370G9r0qQ7j55K24J00j96k2J93J53l61j44n2K59QN5o7j33K39l50L20l28J74J89
4394A74m19L26k01J10N9J32k30J37m42K41n2J01N8j04K12l7Qj52K48j84N2J06
4416A43k33J37Q7j36o5Jj51J20J25L8lr2k3K18k25m7rJ75J40k48K75j71q5J02
4440G3R6j94K80j27R7l33L04l09N8J4J86j52k18J15L55l54J52J36l11R0J38k37
$$ plain form
4462 -141 -138 -6 -68 20 -12 17 485 -40 180 -199 63 353 78 138 146 162 58 66 -19 74 267 281 413 -22 -123
4487 -123 69 25 22 -19 -45 -208 147 29 -462 -266 -217 -132 206 102 -80 249 -281 11 -170 -252 24 320 573
4510 573 67 328 -323 127 943 468 -5 -338 -233 183 101 -439 -399 -403 -381 351 499 412 244 -538 -3 170
4532 170 -773 -906 82 520 -100 -338 -441 -18 -142 -243 -297 478 -912 -323 234 125 251 -1 -142 421
4552 421 554 295 272 -318 446 432 373 220 -52 438 -103 -345 278 131 -477 -1 -503 -834 -286 127 311
4573 311 -495 36 98 -43 -328 149 -264 -49 -170 -62 -215 456 345 191 314 218 -253 847 362 -134
4593 -134 -128 -24 380 269 9 260 -194 357 -91 190 -113 -154 568 -214 41 -10 325 -85 -435 -718 -424
4614 -424 -230 72 -201 90 135 181 613 -49 177 214 455 204 265 123 346 10 -108 -307 294 51 115 108
$$ packed form
4462a41LJ32o2Q8l2K9M68n25K20l79K62K90k75O0QJ6j04Qq5R3J93J4J32m35j01
4487a23J92m4lm1k6j63L55j18m91J96M9Q5L38j04j82L29n30K92j81q2K76K96K53
4510E73n06K61o51M50Q16m75m73l33J05M16q2n40M0mK2P32J48q7j68p82N35J73
4532A70r43j33R88M38o20k38j03M23j24j01n4P75j390N89N57j09J26k52j41N63
4552D21J33k59k3n90P64j4n9j53k72M90n41k42O23j47o08M76n02l31N48M13J84
4573C11q06N31O2j41k85M77m13K15j21J08j53O71j11j54J23r6m71J100m85m96
4593a34OJ04M04j11k60K51m54N51m48K81l03m1P22p82K55n1L35m10l50k83K94
4614d24J94L02k73K91M5M6M32o62K26L7K41k51O1j42K23l36j18j99O01k43O4p
$$ plain form
4636 108 370 -118 -558 -84 393 135 -92 1 222 -146 400 165 -436 -99 -35 -129 -144 129 28 -107 -71 163
4658 163 479 47 -56 -12 48 65 547 -12 77 61 266 90 -137 77 449 -108 -284 -18 370 -44 -207 69
4680 69 -68 -307 29 343 -182 -302 -25 -39 162 -659 -259 82 295 -80 147 152 617 79 113 -394 96 515
4702 515 135 567 286 -88 246 244 -194 -23 171 -436 -497 282 -275 283 108 115 408 210 -223 103 -83 37
4724 37 16 -434 193 349 404 149 156 405 232 191 -209 -235 248 305 -29 385 -31 299 -90 -40 287 -242 167
4747 167 224 296 274 -336 576 556 228 -64 -370 231 -225 -170 383 795 536 -623 -283 -302 97 -100 139 319
4769 319 418 -162 228 -30 -240 72 -285 -359 -30 67 -165 -550 -43 98 223 23 -363 132 -831 -408 351
4790 351 -58 -124 278 -257 -130 14 -57 -456 -502 -227 343 131 380 204 -373 -108 295 381 -345 965 -135
$$ packed form
4636A08K62m88m40M74M77k58k27R3K21l68N46k35o01L37O4r4j5K73j01j35L6K34
4658A63L16m32j03M4O0J7M82n59Q9j6K05j76k27K14L72n57j76K66L88m14j63K76
4680F9j37k39L36L14n25j20K77j4K01q21M00L41K13l75K27NM65n38L4n07M90M19
4702E15l80M32k81l74L34km38J71J94o07o1P79n57N58j75PK93j98m33L26j86J20
4724C7k1m50O27J56N5k55PK49j73m1m00k6M83N7l34M14m16L30l89N0L27n29M09
4747A67N7P2k2o10R12k0l28k92l06O01m56N5N53M12k59j159L40j9L99j97K39J80
4769C19R9n80L90k58k10L12l57p4L29R7k32l85N07J41J25k00l86M95r63M23P59
4790C51m09o6M02n35J27J44p1l99m6K75N70k12K49j76n77K65M03Q6p26J310j100
$$ plain form
4811 -135 -70 -81 212 -194 136 413 265 303 1 228 344 -294 289 289 -493 92 209 -145 -694 116 -34 -77
4833 -77 -134 274 498 -282 -781 -34 -334 413 -40 1302 605 -83 230 -571 -43 -205 20 -38 -45 160 43
4854 43 -44 700 -240 169 923 353 -622 -214 -29 44 674 283 -432 67 3 848 363 -766 205 674 898
4875 898 383 345 251 1096 -297 -583 172 238 105 67 3 184 189 -480 -879 882 -124 -217 231 -501 199 911
4897 911 11 299 367 244 807 -65 800 97 -172 -420 168 359 157 476 -360 403 155 85 -552 191 265
4918 265 -298 203 -587 -73 159 357 525 133 -128 -309 -41 206 -298 -544 -310 149 470 85 -652 127
4938 127 -3 -911 472 -529 561 258 422 -19 -756 -709 -681 -249 415 58 505 -10 69 93 55 958 -614
4959 -614 -102 241 840 -298 -53 383 696 576 -362 215 69 171 311 -127 -144 -298 -124 102 -89 143
$$ packed form
4811a35O5j1K93m06L30K77j48L8l02K27J16o38N83%p82N85J17l54n49Q10j50m3
4833g7n7M08K24p80m99P47l00P47m53J342o97o88L13q01N28j62K25n8pK05j17
4854D3q7P44r40M09P54n70r75M08J85P3O30l91p15M99o4Q45m85j129R71M69K24
4875H98n15l8r4Q45j393k86P55O6j33l8o4J81No69l99J761j006r3M48p32P00P12
4897I11r00K88O8j23N63q72Q65p03k69k48N88J91k02L19q36P63k48p0o37P43P4
4918B65n63N01p90N14K32J98J68l92k61j81K68K47n04k46K34M59L21l85p37P79
4938A27j30r08J383j001J090l03J64m41p37M7K8M32O64l57M47n15P9K4l8R03j572
4959f14N12L43N99j138K45M36L13j20r38N77j46J02J40m38j7j54J74K26j91K32
$$ plain form
4979 143 269 287 385 47 288 60 204 269 -304 155 -116 676 294 -128 -203 -415 92 -283 567 -704 309
5000 309 427 -782 21 -482 -231 -54 -1014 -1167 287 159 858 1006 -399 -817 -293 -105 -747 -491 772
5019 772 205 256 -676 -1089 279 264 -257 -240 492 213 -417 227 306 -297 185 -238 -298 157 472 11 181
5040 181 191 -77 588 -11 556 -105 294 32 259 540 116 16 -41 578 394 -260 236 -308 139 -202 -240
5061 -240 19 -265 270 253 -116 -522 3 573 334 137 271 492 -102 -142 -668 48 -510 476 -1051 191
5081 191 3 -781 268 -651 8 -420 -180 -842 -461 -386 288 -434 -447 18 347 -475 53 362 -375 134
5101 134 127 357 -228 320 -269 184 -104 -69 425 -276 312 201 198 157 -154 -134 137 148 -113 -296 155 220 338
5124 338 -156 -445 -717 96 -37 236 23 199 -132 -318 136 16 -37 -74 -70 -41 77 96 82 110 185 302 108
$$ packed form
4979A43J26J8R8l38K41k28J44O5n73M59k71P92l82m22p5k12N07l75Q50j271J013
5000C09J18j209Q03n03K51J77r60j53J454j28O99J48j405m18N24J88o42K56J263
5019G72n67N1r32m13J368j5n21J7P32k79o30O44P9o03M82m23o0M55L15m61J70
5040A81J0k68O65n99N67o61L99k62K27K81m24j00n7O19j84o54M96n44M47l41l8
5061b40K59k84N35j7l69m06N25N70k39j97J34K21n94m0n26P16n58R86j527J242
5081A91j88p84J049r19O59m28K40o62L81P5O74p22j3M65L29q22N28L09p37N09
5101A34pK30n85N48n89M53k88L5M94p01N88j11lm1l11K0K71J1k61j83M51O5J18
5124C38m94k89k72Q13j33K73k13J76l31j86M54j20n3l7MK9J18J9j4K8P5J17j94
$$ plain form
5147 108 55 21 -14 126 -269 -69 -78 10 -75 76 -178 69 19 -122 -212 -31 -207 -305 57 -96 176 -227 -33
5170 -33 117 53 126 -23 -216 -33 -32 -264 230 101 -13 32 -97 -215 76 -59 152 -16 15 54 208 236 204
5193 204 134 -62 -52 243 36 56 -18 -60 -39 8 131 24 -127 -8 -38 103 -139 -25 -6 -272 -17 -317 54
5216 54 240 -1096 483 -108 -167 83 -93 -298 58 42 -28 176 -181 -205 87 -133 -2 23 100 -79 9 -24
5238 -24 -73 -52 -214 -75 -20 99 -187 4 72 -151 116 87 -222 136 -20 -6 186 47 135 -93 -15 -64 218
5261 218 -139 73 65 -341 102 62 33 276 -40 212 -302 152 -139 -151 13 -112 225 56 89 47 -19 438 275
5284 275 -183 146 218 198 79 -62 -7 -142 125 128 -1 -144 137 -87 -101 -37 -115 -101 42 59 116 164 -6 13
5308 13 8 -105 -48 -169 -54 194 -85 -151 68 31 7 70 -24 -291 414 363 355 -32 -214 36 -32 162 57 -138
$$ packed form
5147A08n3l4l5J40l95K00rQ8q5J51k54K47n0j41r0J81j76r8L62j53K72m03J94
5170c3J50o4P3j49j93J83Jk32M94j29j14M5j29j18K91j35K11j68L1L9J54K8l2
5193B04p0j96J0K95k07K0p4m2K1M7J23j07j51J19l0J41k42J14J9k66K55l00L71
5216E4J86j336J579n91n9K50j76k05L56j6p0K04l57k4K92k20J31K5P7j79Q8l3
5238b4m9K1j62J39N5J19k86J91O8k23K67k9l09L58j56J4J92j39Q8k28P8m9K82
5261B18l57K12qm06M43m0k9K43l16K52n14M54k91j2J64j25L37j69L3m2o6M57j63
5284B75m58L29P2k0j19j41N5j35K67Lj29j43K81k24j4O4p8J4J43J7N7M8j70J9
5308A3nj13N7j21J15K48k79o6K19l7k4O3r4k67P05n1ql87j82K50o8J94j05j95
$$ plain form
5332 -138 -153 70 -189 11 47 -14 -24 -160 -163 -51 60 -140 -93 79 114 3 286 -166 -84 121 -64 -17 37 -342
5356 -342 -143 -193 108 354 -49 62 -35 -77 40 -92 -207 -39 137 -21 -137 10 142 -15 64 28 -23 -120
5378 -120 88 9 -26 0 -17 -160 80 -65 -115 -69 -109 -243 41 93 48 60 113 290 -110 226 -84 -120 -146 -219 32
5403 32 31 209 -27 -128 45 187 -228 139 84 -174 99 -112 20 -23 -70 -48 -84 192 169 -135 -100 118 169 14
5427 14 31 223 -177 -98 -27 155 264 137 50 75 37 155 48 -172 201 -4 46 -112 79 45 -118 48 48 115
5451 115 4 49 -342 -88 -78 -8 264 -123 -228 -277 19 -94 0 153 -222 -92 145 106 -165 -91 48 58 -373
5474 -373 -131 -54 -35 97 -90 -8 34 -114 60 -32 127 35 -65 -51 456 214 41 26 -339 -9 -60 -87 565
5497 565 -225 286 271 -284 158 -148 66 170 641 218 11 -596 139 122 599 -440 1266 114 616 -7
$$ packed form
5332a38j5K23k59K00L6o1j0j36lJ12J11k00M7J72L5j11K83m52Q2K05j85M7N4l79
5356c42J99n0L01K46m03J11r7m2J17j32j15J68J76j58j16J47J32j57P9l6n1r7
5378a20K08p9l5K6j7j43K40j45n0M6m0j34K84N2m5J2N3J77m00L36l10l6k6p3K51
5403C2jJ78k36j01J73J42m15L67n5k58K73k11J32m3m7K2l6K76k3l04L5K18N1j55
5427A4J7J92m00P9P1J82J09j27q7K5l8J18j07k20L73k05N0j58J91l4j63J66%O7
5451A15j11M5l91K54J0P0K72l87j05m9K96j13R4J53l75J30K37l9k71P4J39J0m31
5474c73K42P7J9J32j87Q2M2j48J74r2J59r2j00J4N07k42j73j5l65L30n1k7O52
5497E65p90N11j5n55M42l06K14J04M71m23k07o07P35j7M77j039J706j152N02o23
$$ plain form
5517 -7 -149 -229 42 -234 376 327 -12 353 235 643 -130 -99 81 149 417 -407 -131 -57 -113 -214 49 -162 -37
5540 -37 -222 70 -11 -150 -147 -211 -220 8 -307 -163 -76 91 86 -92 214 122 86 -78 -362 195 192 149 209 250 -83 103
5566 103 -318 64 104 224 92 -349 -119 25 112 -123 95 102 81 26 276 288 29 -214 -312 249 127 -99 -126
5589 -126 -96 50 162 274 152 -161 322 71 -177 -95 219 203 403 65 -505 116 60 -141 292 -204 -13
5610 -13 470 -315 -100 217 -728 -1021 413 -259 -101 152 -666 436 392 -115 203 228 -38 -263 -403 11
5630 11 349 -660 -258 -216 329 406 66 -183 -219 126 127 -191 131 83 -445 272 225 -1 -11 57 -66 -77 -247
5653 -247 123 -13 -66 3 -76 294 181 136 8 101 -105 -164 2 112 -9 -289 90 102 35 37 -55 97 33 -57
5677 -57 -16 -255 60 -134 16 2 -37 -157 -258 305 -2 103 -162 80 -69 -121 -165 73 52 -58 114 -97
$$ packed form
5517gj42q0K71k76O10m9l39L65j18M08p73L1J80O8K68q24K76P4n6j01K63k11J25
5540c7j85K92q1j39Lo4rK28l15J44Q7J67nj78L06r2l6j64k84N57lm3O0M1l33J86
5566A03m21L82M0J20j32m41K30J44Q7k35K18Pk1n5K50J2k59k43r8N61j22k26k7
5589a26L0J46J12J12j22l13M83k51k48Q2L14j6K00l38n70O21n6k01M33m96J91
5610a3M83p85K15L17r45k93J434o72J58K53q18J102m4n07L18K5k66k25j40M14
5630A1L38j009M02M2N45P7l40k49l6L45Jl18L22m8n28P17m7k26j0O8j23j1j70
5653b47L70j36n3O9p9L70j13m5j28R3k06n9J66J10j21k80L79J2o7Kr2J52o4r0
5677e7M1k39L15j94J50j4l9j20j01N63l07J05k65K42j49n2m4K38k1j10J72k11
$$ plain form
5699 -97 20 122 387 -137 -61 -208 -37 113 38 -31 -134 51 94 -174 60 52 295 -155 205 209 -23 22 -39 -26
5723 -26 166 96 -40 120 208 113 59 90 -188 -193 63 -46 -131 -152 -65 -24 -153 200 29 54 -48 -107 72 -4 52
5748 52 56 6 -103 3 -23 -45 -12 19 18 136 -99 -84 49 112 119 -46 -154 106 91 -133 89 172 -30 -66 58 -35
5774 -35 90 77 -50 -101 -63 -107 142 135 69 27 -82 107 131 -12 -160 -66 -159 133 -30 25 110 12 48 4 183 -79
5800 -79 105 162 216 -5 17 140 -50 -5 33 -158 238 176 -90 -163 -16 6 -104 73 -9 -25 -89 142 -163 -260
5824 -260 -4 -10 9 93 -41 -48 158 -74 -77 121 149 53 -101 -75 15 99 -71 221 -77 -115 -112 30 -148 -123 167 222
5850 222 -43 214 -137 72 124 -34 -272 -7 64 -37 -211 -75 110 -63 -115 97 14 -5 161 292 -29 -205
5872 -205 129 54 145 21 81 141 66 142 -108 329 -248 -97 130 156 251 -26 80 75 213 151 -197 -61 -52 -34 42
$$ packed form
5699i7J17J02K65n24P6j47J71J50p5o9j03J85M3k68K34qK43m50L60Mk32M5o1J3
5723b6J92p0j36J60Q8r5n4L1k78nK56j09q5k1Q7M1j29L53j71K5j02n9J79p6N6
5748E2Mn0j09J06k6k2L3L1jJ18k35J5J33O3Pj65j08K60j5k24K22Q3k02l6J24r3
5774c5J25j3j27n1L8m4K49po6m2j09J89K4j43j48R4r3K92j63N5Q5r8L6m4J79k62
5800g9J84N7N4k21K2J23j90M5L8j91L96o2k66p3J47K2j10J77q2j6o4K31l05r7
5824b60K56oJ9Q4j34pK06k32lJ98K8r6j54K6R0Q4j70K92k98l8LJ42j78K5K90N5
5850B22k65K57l51K09N2j58k38K65P1j01j74J36J85j73n2K12q3j9J66J31l21j76
5872b05L34p5R1j24O0O0p5P6k50M37n77J51K27K6R5k77J06nJ38o2l48J36RJ8P6
$$ plain form
5897 42 -27 -179 -66 72 -110 241 38 64 18 -20 128 -247 -142 -97 -52 -72 22 -59 15 -85 -130 -194 110 54 93
5922 93 122 -189 212 -261 227 139 79 -36 -180 -64 -34 -164 -95 27 7 66 -29 57 52 110 7 -10 57 1 -115
5947 -115 -19 6 -35 18 14 -14 39 -67 -34 -45 -99 113 -256 -223 -45 3 203 172 -257 19 -340 -17 -214 125 293
5972 293 -21 -91 85 -65 -123 -32 129 4 48 187 233 -88 -244 226 18 92 177 283 -39 39 48 -48 132 102
5996 102 -150 133 314 10 197 109 -205 -142 88 12 91 -88 128 -75 -52 19 -87 -94 100 68 98 220 -340
6019 -340 -180 56 121 44 -58 205 -8 -150 112 -268 211 -99 189 363 62 66 430 162 -117 378 202
6040 202 260 403 182 -491 -77 -166 213 467 -51 -152 133 52 -132 8 -133 -319 240 -47 354 -403 -7
6061 -7 367 167 -5 82 -18 280 -154 242 539 -71 104 -36 -30 246 -46 -411 -192 -475 132 -163 104 -116
$$ packed form
5897D2o9j52J13J38j82L51k03K6m6l8J48l75J05M5M5k0R4q1P4j00m5o4L04n6L9
5922I3K9l11M01m73M88q8o0j15j44J16L0j30O9J22k0N9r5Q6nN8j03j7O7n6j16
5947a15R6K5m1N3mk8N3j06L3j1n4K12l69L3J78M8K00l1m29K76l59L23j97L39J68
5972B93l14p0J76j50n8R1J61j25M4J39M6l21j56M70k08P4Q5J06l22P8Rr6J80l0
5996A02k52K83J81l04J87q8l14O3K30p6P9j79K16k03K3P1j06pJ94l2L0J22n60
6019c40J60K36O5p7j02K63k13j42K62l80M79l10K88J74l01ML64k68k79M95j76
6040B02N8J43k21o73M14q9L79K54n18j01K85q1j84J40j41j86N59k87M01p57L96
6061gL74k00j72Q7j00K98m34L96K97o10J75j40OK76k92l65K19k83O07k95K67k20
$$ plain form
6083 -116 270 275 -264 67 222 528 186 62 236 129 -342 144 -7 -45 -197 267 -413 196 -155 403 25
6104 25 589 457 56 16 -56 268 -685 -329 -371 -149 -159 -194 77 -444 -223 133 -151 538 -318 211 192 133 128
6127 128 -411 76 277 -284 -123 -174 122 216 411 -101 -265 -101 5 -15 -18 50 511 109 -11 -264 286 227
6149 227 -199 -63 -22 473 -499 83 -92 -32 -114 21 -100 -251 596 73 -302 -13 58 -83 -388 328 -233
6170 -233 76 -72 114 158 379 80 337 292 42 269 21 219 -377 -191 -237 -140 90 -53 -74 2 -303 491
6192 491 -105 206 -158 -210 70 -138 -147 287 -142 235 198 398 -328 35 282 -264 146 118 114 163 249 185 -252
6215 -252 -494 -169 398 -282 -133 -487 59 491 -529 -353 -466 -387 540 -8 361 -384 543 -522 -63 -144
6235 -144 180 220 -86 255 -614 -15 542 185 156 -118 32 -244 307 -88 495 121 -181 99 -429 -287 -161
$$ packed form
6083a16L86Nn39L31J55L06l42j24J74j07m71M86j51l8j52M64o80O09l51N58l78
6104B5N64j32m01m0p2L24r53L56m2K22j0l5K71n21K21L56k84O89q56N29j9n9n
6127A28n39M87K01n61J61n1K96R4J95n12j64J64J06k0lO8M61m02j20k53N50n9
6149B27m26J36M1M95r72N82j75O0q2J35j21j51Q47n23l75K89P1j41l05P16n61
6170b33L09j48J86M4K21k99K57m5k50K27k48J98n96J86m6R7K30j43k1P6l05P94
6192D91n96L11l64n2K80k08rM34m29L77l7K00p26L63K47n46M10k8mM9Q6o4m37
6215b52k42L25N67o80J49l54N46M32j020J76j13P9R27n48L69p45R27j065M59q1
6235a44L24M0l06L41q69N99N57l57k9k74J50k76N51l95N83l74l02K80n28J42J26
$$ plain form
6256 -161 -37 -164 -234 65 420 -111 -97 -154 -412 -21 -256 -323 -461 494 109 -74 676 -26 7 -23 270 485
6278 485 -25 -110 152 132 46 521 -499 315 181 322 -527 260 -142 151 154 323 326 -61 201 -98 181 -21
6300 -21 -68 259 62 34 -231 190 239 -39 328 -90 153 191 169 -159 59 -125 128 68 -205 151 -467 128
6322 128 -364 -142 225 3 -91 322 50 100 -114 407 -164 -8 605 -144 -221 297 -107 -63 -30 234 -120 -33
6344 -33 -41 85 87 97 -50 -35 262 -77 -67 -242 -56 129 -68 87 -154 91 -180 -41 132 -104 233 -23 13
6367 13 52 17 57 169 43 119 479 -189 215 30 -240 -116 110 -158 60 -70 -89 79 177 -156 -38 -84 -177
6390 -177 -135 80 -74 161 278 347 -223 -34 7 181 154 -448 -64 87 -30 74 -217 124 -187 -376 -3
6411 -3 -4 -14 -138 240 -268 87 -317 -39 -13 -280 7 300 31 106 184 -228 4 265 137 -13 -73 189 -145
$$ packed form
6256a61J24j27p0K99L55n31J4n7k58L91k35o7j38R55l85j83P50p02L3l0K93K15
6278D85n10q5K62k0q6M75j020Q14j34J41q49P87m02K93LJ69Ll87K62k99K79k02
6300b1m7L27j97k8k65M21M9k78L67m18K43L8k2l28K18j84K53o0k73L56o18N95
6322A28m92K22L67k22r4M13k72N0k14N21n71J56O13p49p7N18m04M4L3K64l54Q7
6344c3qJ26KJ0j47J5K97l39J0j75J86J85j97J55k41K45k71J39J73k36L37k56L6
6367A3L9l5M0J12j26P6L60o68M04j85k70J24K26k68K18j30j9J68R8l33J18m6r3
6390a77M2K15j54K35J17O9n70J89M1J74k7o02L84J51j17J04k91L41l11j89L73
6411cjj0j24L78n08L55m04K78K6k67K87K93k69P5P8m12K32K61j28j50o0K62l34
$$ plain form
6434 -145 432 91 276 395 204 56 -69 190 144 0 -35 333 141 10 56 134 63 -151 -13 284 79 69
6456 69 179 63 -98 -156 -45 -126 -108 164 -59 137 -110 109 -33 82 165 67 160 166 56 -45 10 -98 113
6479 113 269 205 26 17 22 92 283 153 26 88 176 51 -102 3 16 -177 74 144 -283 56 -100 -20 -43 138
6503 138 -136 -114 69 69 -192 84 -25 -74 40 137 -100 -119 -14 177 -57 22 -26 -175 -6 -103 176 -97 182
6526 182 -181 104 144 -53 -62 187 -70 115 -95 171 61 -167 28 -135 -26 -11 -134 147 -86 238 223 -10
6548 -10 74 49 -132 136 -129 -149 -285 -62 -85 -47 -258 99 63 -52 94 -60 174 39 91 -190 -72 -23 -131
6571 -131 110 73 -46 -202 -39 -155 38 -182 -102 169 52 105 200 -22 -126 -149 -272 -62 -92 255 -27 -207
6593 -207 -61 -155 160 128 -117 -175 -248 -275 48 -28 86 13 103 -5 -108 -122 142 -43 107 62 82 -4 -124 41
$$ packed form
6434a45N77l41J85J19j91j48j25K59m6j44l5L68j92j31M6P8p1k14J38K97k05j0
6456F9J10j16j61n8J11q1J8K72k23J96k47K19j42J15Q3r8R3Oj10j01N5j08K11
6479A13J56o4j79rNP0J91j30j27O2Q8j25j53J05J3j93K51P0m27L39j56Q0k3J81
6503A38k74K2J83%k61K76j09m9J14R7k37j9J05J91k34P9m8j49J69r7K79k73K79
6526A82l63K85M0j97rK49k57J85k10K66j10k28J95j63J09J5j23K81k33L24j5k33
6548a0Q4k5j81K68k65k0j36K23k3L8k11L57l6j15J46j54K34j35N2k81J18M9j08
6571a31K41l7j19j56J63j16J93k20Q0K71j17N3R5k22j04k3j23K10l0L47k82j80
6593b07J46r4L15l2k45n8p3k7L23p6J14p3R0j08j03j4K64j85J50m5K0q6j20J65
$$ plain form
6617 41 9 36 110 129 13 -21 28 246 -83 -139 -90 58 -208 57 -13 105 -206 118 -248 -2 -209 -30 -129 11
6641 11 19 -36 61 -92 57 144 73 -87 -80 228 202 117 17 -224 296 -26 34 -105 186 -56 109 -84 -68 131
6665 131 -2 -22 -11 -101 246 48 -96 230 -102 146 -182 28 213 -63 12 2 -59 39 127 -32 26 84 49 -89
6689 -89 -21 -140 -76 199 -154 50 125 -17 -8 68 -241 -130 -134 156 -168 -48 -39 -129 -72 183 104 -203 -154 -233 6
6714 6 -35 -56 -38 60 -21 151 213 156 52 340 -76 58 -16 195 -117 140 -44 127 -82 119 3 -132 29
6737 29 -17 124 -175 157 176 -141 -63 353 88 -5 -6 -44 66 -18 -212 182 -340 -123 -18 -324 83 17 -59 -177
6761 -177 -87 -324 -204 132 157 -214 -23 7 -19 -38 37 -139 57 90 -51 80 17 249 16 284 44 210 178
6784 178 -141 -57 57 107 155 -96 -164 82 -184 112 -94 -269 109 -30 -62 60 -70 -103 -155 -90 98 207 -107
$$ packed form
6617D1l2K7P4J9j16l4M9K18l29n6M9J48k66K65p0J18l11L24l66K46k07J79r9J40
6641A1Qn5R7j53J49Q7p1j60PL08k6q5j00k41N20l22O0j39K91k42J65j93J6J99
6665A31j33k0J1r0L47j98j44L26l32K48l28K10J85k76P5j0o1R8Q8j59N8N8l5j38
6689h9O8j19O4K75l53K04P5j42RP6l09J11mK90l24J20Rr0N7K55p9l07M9p9K39
6714Fm1k1J8R8q1J72O2n7j04K88m16J34p4K11l12K57j84J71k09K01j16j35J61
6737B9m6J41k99L32J9l17P8M16k65r3jl8J10q4j94L94n22K17J05l06M07o6p6j18
6761a77R0k37J20L36K5l71J91L0k6j9P5j76J96L3j41J31o3K32k33K68k40J66l2
6784A78l19Q4J14N0M8k51o8K46k66K96k06j75L78j39l2J22j30l3n2O5J88J09l14
$$ plain form
6807 -107 -148 188 -78 112 -200 -132 -37 -72 -115 -126 -73 -66 29 -39 10 -21 266 -93 71 -70 70 117 13 -88 -14
6832 -14 -177 74 40 -194 -53 80 -49 146 2 360 20 -149 -44 199 -150 -85 -141 -160 -10 -19 -150 8
6854 8 69 33 -64 -22 -103 -92 123 -165 15 243 17 -63 216 -156 191 -29 93 -47 216 -197 -135 58 84 -29
6878 -29 16 -19 -135 141 -93 44 -3 -19 -176 58 36 -78 57 -25 30 -20 239 -18 -165 217 -27 4 -160
6901 -160 -1 222 49 -69 -147 -46 82 -56 37 12 128 21 -60 -82 -294 3 -12 -145 126 -47 -24 59 -235
6924 -235 97 -33 271 11 10 19 -70 -94 -7 120 130 -64 -76 106 80 297 -3 -53 127 263 127 50 -60 168
6948 168 -102 -221 118 -74 74 47 95 92 -155 -29 -79 -21 38 106 210 -95 -146 2 91 116 18 -175 26 42
6972 42 28 -65 44 202 -88 -31 11 16 -91 151 272 11 -167 -109 121 6 -80 -124 54 32 28 -98 107 3
$$ packed form
6807a07m1L36k66J90l12O8R5l5m3j1N3PR5o8M9l1K87l59J64j41J40M7j04j01P4
6832a4j63K51l4k34J41J33j29J95j44L58l40j69J05K43l49O5n6j9J50rj31J58
6854HO1l6r7M2q1J1K15k88J80K28k26q0K79l72L47k20J22j40K63m13O2J93K6j13
6878b9M5l5j16K76k34J37m7j6j57K34k2j14J35q2N5n0K59k57j47L82k44L1j64
6901a60J59K23j73j18p8J01J28j38R3k5J16j07q1k2k12K97j5j33K71j73K3Q3k94
6924b35L32j30L04k60jRq9k4Q7J27J0j94j2J82k6K17l00n0J80J36j36p7j10K28
6948A68k70j19L39j92J48k7M8lk47J26n0N8N9O8J04l05n1J48Q9K5r8j93K01J6
6972D2j4r3J09J58k90N7M2Nj07K42J21k61j78N8K30j15q6m4J78k2mj26K05j04
$$ plain form
6996 3 -99 146 57 50 104 30 11 180 177 34 -129 136 54 -34 -40 -227 -79 -129 13 -56 78 -4 -117 -183 163 26
7022 26 -74 -93 66 -20 -225 106 -95 -83 145 171 85 195 52 -120 138 123 259 176 104 -4 37 -70 66
7045 66 49 7 181 98 37 -28 9 -41 52 -91 -85 24 6 -4 57 254 138 150 143 59 161 53 215 -60 -311 -93
7071 -93 -81 191 151 -109 -199 142 -105 -112 -39 53 48 1 -39 139 124 -57 -211 -32 75 62 -2 307 238 161 -123 -76
7097 -76 -205 3 127 -31 142 -210 -207 -259 -220 -4 19 189 -19 69 292 143 -98 -22 -114 -89 99 47 78 -158
7121 -158 42 -47 -151 123 160 -153 -1 -14 157 -16 77 -121 23 -35 223 55 -103 84 -263 229 193 50
7143 50 -117 92 -224 13 -232 -288 -114 113 -204 124 -57 114 -132 35 -6 -227 -231 12 83 96 115 -31 116
7166 116 76 27 -174 -126 -96 115 -171 89 -156 276 19 169 58 49 -225 48 126 -47 -98 -60 -94 -181 -138 -81
$$ packed form
6996Cj02K45q9pN4p4j9J69lj43j63K65q2q8oj87J48n0J42o9J34q2j13o6L46j37
7022B6j00j9J59q6k05L31k01J2K28K6q6J10j43j72K58j5J36q3p2j08M1j07J36
7045F6j7m2J74q3o1o5L7n0R3j43OJ09j8j0O1J97j16J2pq4J02j08J62k75k51K18
7071i3J2K72m0k60r0L41k47pP3R2nm7m0J78j5j81j54J79J07j3o4L09o9p7k84M7
7097g6j29K08J24j58J73l52Ln2L9K16K3J70k08Q8K23j49k41P6r2K5J88n2L1k36
7121a58K00q9j04K74L7l13J52j3J71j73R3j98J44n8K58j68j58J87l47M92l6j43
7143E0j67K09l16K37k45n6J74K27l17L28j81J71k46J67m1k21mK43P1J3J9j46J47
7166A16m0m9k01M8L0K11k86K60k45M32k57J50j11rk74K73P8j73n1L8l4q7M3N7
$$ plain form
7190 -81 -14 -285 86 52 103 -49 -97 77 39 38 -4 148 4 19 -70 42 12 177 58 204 -83 150 -99 -15
7214 -15 74 -110 13 8 23 -37 -34 216 55 -60 337 -87 -177 -222 29 -235 181 -115 -110 -207 26 412 262 375
7238 375 9 10 125 -32 119 -12 -167 151 -111 -107 97 -58 90 -62 -82 -6 68 -200 -8 68 45 -74 92
7261 92 82 211 -167 289 61 -141 20 18 -180 7 216 -31 -194 -38 281 -89 -30 95 86 -83 6 -13 -156
7284 -156 -76 2 142 73 -8 -134 -124 194 51 -160 65 -87 110 83 92 -139 -332 -196 223 -168 204 -18 -84
7307 -84 -120 -27 -7 -180 -215 -206 -196 222 193 154 103 130 -101 -113 139 28 -6 -148 333 24 -85 78 -38 6 -23
7332 -23 -66 -101 -57 237 44 61 -7 -77 176 -57 -138 59 -164 107 81 113 258 8 -22 70 30 -209 111 -383
7356 -383 22 61 -58 -97 72 60 -56 100 -108 -41 -80 31 -20 19 141 237 86 117 130 179 100 96 -33 -50 107
$$ packed form
7190h1O7k71L71l4N1j52m8J74l8jm2J52j44J5q9J12l0J65j19J46k87K33k49Q4
7214a5Q9j84J23nJ5o0LK50j61j15L97m24r0m5K51k64M16k96Nr7K33L86j50J13
7238C75l66JJ15j57J51j31j55L18k62MK04j55J48j52k0P6P4k68J92P6k3j19J66
7261I2j0J29l78M56k28k02J61kj98J87K09k47j63J56L19l70N9J25rj69Q9j9j43
7284a56Q0P8J40o9q1j26J0L18j43k11K25j52J97k7Rk31j93J36M19l91L72k22o6
7307h4l6R3K0j73l5RJ0M18k9l9n1K7k31j2K52j11l4j42M81l09j09J63j16M4k9
7332b3m3l5M4K94j93J7o8p0K53k33q1J97k23K71k6L2J45k50l0R2m0k39L20m94
7356c83M05L9j19l9J69j2j16J56k08O7l9J11n1L9J22R6j51L1J3M9p9mj29j7J57
$$ plain form
7381 107 124 -109 -340 42 -206 -135 -198 17 -60 -316 14 71 -176 99 -153 47 142 36 156 120 -55 -226
7403 -226 16 37 -3 -122 12 -155 -191 117 109 26 -87 -36 167 -35 39 88 78 124 107 -126 336 65 204 60
7427 60 -122 -304 110 174 126 -47 -212 178 39 3 -107 133 -213 76 103 45 7 -230 49 -85 71 -140
7449 -140 -2 134 282 -80 43 -1 145 67 -264 316 83 101 18 -47 18 -29 147 200 35 -245 -69 23 -43
7472 -43 -24 -100 -199 -225 76 -34 -78 -108 -67 -111 -16 77 -67 -80 -69 -97 9 -117 -128 -11 -37 68 305 195 -84
7497 -84 116 0 -76 -98 37 -339 118 126 240 -24 -17 237 -235 27 7 -81 19 -205 -115 13 299 291 143 -278
7521 -278 726 -42 -169 28 137 291 -145 -325 220 414 -37 -338 94 -164 -361 -83 -579 60 -188 -259
7541 -259 -206 27 -264 85 -135 -50 127 -500 -118 -253 46 -92 -85 -191 141 91 -318 -84 0 -189 -3 403
$$ packed form
7381A07J7k33k31L82k48P1o3K15p7k56L30N7k47K75k52K00R5j06J20l6j75j71
7403b26K42K1m0j19J34j67l6L08qq3j13N1K03k02P4M9j0M6j7k33M62k71J39j44
7427F0j82j82M14O4m8j73j65L90j39l6j10K40l46K89K7n8l8k37K79j34J56k11
7449a40J38J36J48l62J23m4J46p8l31N80k33J8q3o5O5m7J76N3j65k80J76R2o6
7472d3J9p6r9k6L01j10m4l0M1m4R5R3j44j3J1k8J06j26j1J17k6J05K37j10k79
7497h4K00j16p6k2J35l76M57QJ14k64PK54m72K62k0q8J00k24R0J28K86qj48m21
7521b78J004p68j27J97J09J54m36j80N45J94m51l01M32k58j97K78m96O39k48p1
7541b59N3K33k91L49k20Q5J77o27L82j35K99j38Pj06L32n0m09K34Q4j89J86M06
$$ plain form
7563 403 -5 20 170 85 -244 227 -150 -515 59 -358 -158 104 -110 -167 10 -122 416 -306 121 101 350
7584 350 -348 -592 431 -173 -272 -195 -525 -16 481 75 78 -376 199 97 -695 -94 -340 799 -431 416
7604 416 -350 25 -336 505 77 -38 436 580 -32 110 375 536 -278 909 219 -147 -350 -172 -289 580
7624 580 -67 -264 390 417 -136 20 -284 511 -43 748 -31 98 335 626 539 -100 -794 123 -11 -258 -411
7645 -411 -152 357 -112 145 -49 -6 -58 211 390 -214 352 251 -419 -22 -26 179 80 -222 -150 -144 104 -30 -93
7668 -93 -100 111 56 81 88 68 37 111 128 74 -103 -57 186 77 34 -233 4 70 -8 81 60 159 167 47 181 -412 -1
7695 -1 -15 -233 -147 104 31 93 -77 5 152 -73 -16 -125 -97 -99 -23 78 -236 -186 -145 -103 202 -69 191 48 87
7720 87 217 359 30 1 46 -47 -200 0 161 34 91 130 133 -184 -63 -130 -44 110 -104 283 -287 296 -55
$$ packed form
7563D03m08K5J50q5l29M71l77l65N74m17K00K62k14n7J77j32N38p22M27k0K49
7584C50o98k44J023o04r9P7l30N09M97m06Lm54N75j02p92O01k46J139j230Q47
7604D16p66L75l61Q41m28j15M74J44o12J42K65J61q14J187o90l66k03J78j17Q69
7624E80o47j97O54K7n53J56l04P95n54P91p79J29K37K91q7o39o94R17j34k47j53
7645d11K59N09m69K57j94M3n2K69J79o04N66j01o70L97mK05r9l02P2OK48j34o3
7668i3pK11n5K5Pk0l1P4J7n4j77M6K43j09m3k67K37O6p8Q9k1R9Qj20J34n93M11
7695aj4k18Q6K51p3O2j70Q2J47k25N7j09K8kP6J01l14N0M1M2L05k71K60j43L9
7720H7J30J42l29k9M5r3j53K00J61j27N7L9Ll17J21o7Q6J54k14L87n70N83l51
$$ plain form
7743 -55 32 140 77 -77 55 -59 -296 -84 54 -132 -260 -112 83 217 -189 -139 0 85 -132 -99 158 -83
7765 -83 -54 -306 -244 165 -270 233 -258 -269 82 -34 94 -98 130 301 86 137 -150 105 -72 -55 -108 -99 93
7788 93 18 122 -49 103 -7 186 26 51 109 198 107 132 -140 113 -234 54 70 -59 165 -100 -126 -30 19 -85
7812 -85 -11 188 -156 54 108 -81 -157 -98 166 -70 19 -164 78 -89 88 -2 8 -120 -103 -289 323 -122 20
7835 20 189 -31 423 247 189 227 334 -156 -144 -159 -215 205 -277 39 348 218 -103 -325 -165 -121 182 35
7857 35 28 46 -216 157 -145 296 289 56 -77 -150 226 -185 86 29 323 12 180 11 -193 -101 113 -47 -6
7880 -6 35 -81 108 141 101 -667 223 84 -228 -66 -86 72 -250 -37 450 567 591 75 -303 -283 14 214 89
7903 89 -140 -173 -346 31 -306 99 -217 -65 321 -128 29 150 -128 -26 4 -120 -104 -113 77 -80 -89 71 139
$$ packed form
7743e5Q7J08o3j54J32j14k37K12J38j86j28J48J95J34m06N0J39Q5k17L3K57k41
7765h3K9k52O2M09m35N03m91j1L51j16J28j92K28J71k15N1k87K55j77J7n3RJ92
7788I3p5J04j71J52j10J93j60K5N8Q9r1K5k72K53l47K88J6j29K24k65k6R6M9j04
7812h5P4J99l44K10N4j89p6N9K64k36Q9j83K42j67J77r0J0j28J7j86O12m45J42
7835B0J69k20M54j76n8L8J07m90J2j5n6M20m82L16L09j30l21k22J60M4L03j47
7857C5pJ8k62L73l02M41pk33j33p3L76m11K71n7K94l11J68j69k04R2K14j60M1
7880fM1j16J89L3m0p68Q90j39l12J62k0J58l22K13M87J17K4n16l78K0K97K00j25
7903H9k29l3j73L77l37M05l16J52L86m49J57J21k78J02L0j24J6rJ90j57rJ60O8
$$ plain form
7926 139 -248 -95 168 -166 -126 96 26 -141 -131 -31 143 -100 71 59 183 -217 223 149 -118 46 -11 35
7948 35 159 147 169 158 178 269 28 141 -358 -141 -115 2 -102 -10 55 134 -17 0 -319 96 -139 -14 -27 -4
7972 -4 12 -59 49 24 -112 -59 77 -49 -66 213 29 -214 -115 -21 123 -340 -246 205 57 136 163 -164 -189 -264 116
7997 116 393 58 -323 159 -110 215 14 -89 -293 -365 212 -151 -86 290 292 -361 -70 -103 -196 -155 319 96
8019 96 299 -201 221 104 -444 324 -99 -445 -36 -255 243 -159 -155 221 -53 302 156 -405 -221 -323 -22
8040 -22 46 -487 237 159 598 261 312 291 48 -50 277 -349 -506 -275 -214 248 121 -202 -136 507 24 219 590
8063 590 -317 -421 -30 499 -617 199 271 -189 -468 -129 601 -231 -506 -221 -27 -1081 265 -583 301
8082 301 -169 -103 -264 41 -580 -317 420 -284 260 -84 296 122 693 -505 -270 540 -27 -437 279 -329
$$ packed form
7926A39l87J53K63l34M0K22p0j67J0J00J74k43J71j2J24m00M40p4k67J64n7M6
7948C5J24j2K2j1K0R1k41J13m99K17K6J17j04R2O5P9j51J7l19M15k35J25j3K3
7972dJ6p1J08k5j36N3J36j26j7K79j84k43R9R4J44m63R4M51j48P9K7l27k5p5L80
7997A16K77l35l81M82k69L25k01j03k04p2N77l63O5L76Ko53K91l3r3M1M74k23
8019I6K03n00M22j17n48P68m23l46M09k19M98m02ML76k74L55j46n61J84j02L01
8040b2O8n33P24p8M39l37N1k1k43r8L27o26j57K31O1M62j27l23O6O43m83J95L71
8063E90r07j04L91N29j116Q16P2m60k79L39P30q32k75K85J94j054J346q48Q84
8082C01m70O6j61L05o21K63P37p04N44l44L80j74N71j198K35Q10n67m10P16o08
$$ plain form
8102 -329 -376 554 126 148 -190 111 -294 -198 -321 -95 162 -258 -95 -587 -144 -252 -671 371 16 316 -264
8123 -264 399 650 -119 467 -114 -850 741 -407 173 -390 -314 -151 -349 187 -227 109 -73 -153 -187 -81
8143 -81 -63 -451 271 116 -124 196 -338 423 -39 -128 20 -31 10 64 127 -94 -77 -377 -139 -359 10 466 -518
8166 -518 77 282 156 60 776 -309 157 316 278 277 114 52 -103 296 -254 361 -219 209 318 156 428
8187 428 -356 -470 65 166
$$ packed form
8102c29m7R30m28K2l38L01m05R6j23K26K57m20J63m92M43j08m19J042l55L00n80
8123b64O63K51p69N86n81p36J591j148N80n63P6J63j98N36m14L36j82q0l4J06
8143h1J8l88P22j55k40L20n34P61m62q9J48n1M1N4O3k21J7l00K38k20L69M56r84
8166e18N95K05j26r6P16j085M66J59l8jj63o2j55L99n50O15n80M28J09j62K72
8187D28p84j14N35J01
8191A66
$$ Imaginary data points
##PAGE= N=2
##DATA TABLE= (X++(I..I)), XYDATA
$$ plain form
0 0 0 0 0 0 0 0 0 0 0 0 0 0 -8 8 -8 8 -16 16 -16 24 -32 32 -40 48 -56 67 -80 91 -104 120 -140 160 -181 205
34 205 -235 262 -298 333 -373 416 -464 516 -575 634 -704 777 -860 948 -1044 1150 -1267 1396
52 1396 -1537 1694 -1871 2068 -2288 2543 -2832 3171 -3571 4053 -4643 5390 -6370 7711 -9678
67 -9678 12882 -19330 64652 -145454 24875 110529 -186649 73395 19630 -77334 81868
78 81868 -12584 -22772 46334 -46956 13171 5967 -28090 19067 10747 -8627 12553 16274 -13988
91 -13988 -10181 6814 -39990 546 -3588 -34230 32589 -25747 -24324 45328 -51060 8938 41855
104 41855 -47262 37798 6385 -40052 31003 -38711 -12976 17793 -43865 27819 4722 -29212
116 -29212 38090 -20168 -20233 23789 -24702 -511 26543 -2038 11192 26972 -3229 -9758 17201
$$ packed form
0@%%%%%%%%%%%%qJ6j6J6k4L2l2M0n6O4p2Q8j04J23j47J71j95K24k60L00l41L86
34B05m40M97n60O31p06P89q80R80j091J209j338J481j637J808j992K194k417K663
52A396k933L231l565L939m356M831n375O003o742P624q696J0033j1760J4081j7389
67i678K2560l2212Q3982k10106J70329Q5654k97178K60044n3765r6964J59202
78H1868r4452j0188O9106r3290O0127p204l4057M7157q320j9374K1180L721l0262
91a3988L807J6995m6804M0536m134l0642O6819n8336J423O9652r6388N9998L2917
104D1855q9117Q5060l1413m6437P1055o9714K5735L0769o1658P1684k3097l3934
116b9212O7302n8258o5M4022m8491K4191K7054k8581J3230J5780l0201o529K6959
$$ plain form
129 17201 -22524 -18733 25860 -27286 4111 34027 -27585 28104 15977 -26811 38697 -14474
141 -14474 -10031 42015 -29507 17709 29511 -35523 24977 -1074 -27656 23575 -14965 -3408
153 -3408 12620 -20624 10487 -509 -10047 24269 1532 1349 17285 -7303 -9628 220 -12785
166 -12785 -16511 2641 -8718 -11329 18311 -8528 -5068 19058 -29157 -3773 10829 -30612 22257
179 22257 13469 -15925 30992 -12830 -18156 14925 -33531 -2939 10274 -28279 17134 5434
191 5434 -17157 24693 -1428 -9438 20380 -6038 -4488 17414 -3586 -2428 12594 -8849 -7457
204 -7457 11189 -9482 1647 16636 -11098 7165 6729 -17757 16595 2087 -5634 32472 -2878
217 -2878 2804 24751 -23258 -241 5036 -28954 10325 1706 -10685 23891 -1551 -1659 13787
$$ packed form
129A7201l9725L791M4593n3146L1397K9916o1612N5689j2127m2788O5508n3171
141a4474M443N2046p1522M7216J1802o5034O0500k6051k6582N1231l8540J1557
153c408J6028l3244L1111j0996r538L4316k2737j83J5936k4588k325R848j3005
166a2785l726J9152j1359k611K9640k6839L460K4126m8215K5384J4602m1441N2869
179B2257q788k9394M6917m3822n326L3081m8456L0592J3213l8553M5413j1700
191E434k2591M1850k6121q010K9818k6418J550K1902k1000J158J5022k1443J392
204g457J8646k0671J1129J4989k7734J8263m36k4486L4352j4508p721L8106l5350
217b878N682K1947m8009K3017N277l3990L9279q619j2391L4576k5442j08J5446
$$ plain form
230 13787 -15467 -1932 3494 -10927 9363 5302 -1113 9300 -4583 -7664 -2183 -14733 -9905
243 -9905 684 -10585 -2351 10717 -7991 1347 11594 -12957 2316 6473 -14012 9012 -429
256 -429 -12553 8959 -14913 -8920 9757 -17068 6296 11235 -15184 10871 -169 -13361 12327
269 12327 -4049 491 16021 -4237 7551 9512 -10309 2070 -1211 -14955 -94 2538 -3332
282 -3332 10789 13135 1504 8386 3249 -6791 4586 -1524 -65 12097 -2232 5507 8909 -10958
296 -10958 5311 -908 -13851 8455 -5651 -5308 14749 -4984 4525 12454 -9360 6049 4329
309 4329 -10925 6595 -1598 -10697 3138 -7344 -9249 3525 -4219 -2883 7520 -3374 -3765 4482
323 4482 -8783 -4479 5815 -6786 3347 8246 -6546 4170 -3048 -13514 967 -11887 -8531
$$ packed form
230A3787k9254J3535N426j4421K0290m061o415J0413j3883l081N481j2550M828
243i905J0589j1269Q234J3068j8708R338J0247k4551J5273M157k0485K3024r441
256d29j2124K1512k3872N993J8677k6825K3364M939k6419K6055j1040j3192K5688
269A2327j6376M540J5530k0258J1788J961j9821J2379l281j3744J4861K632n870
282c332J4121K346j1631O882n137j0040J1377o110J459J2162j4329P739L402j9867
296a0958J6269o219j2943K2306j4106L43K0057j9733R509P929k1814J5409j720
309D329j5254J7520q193r099J3835j0482j905J2774p744J336J0403j0894l91Q247
323D482j3265M304J0294j2601J0133M899j4792J0716p218j0466J4481j2854L356
$$ plain form
336 -8531 8695 -7522 3942 14307 -6674 5269 7149 -10468 2234 2426 -5094 4922 2391
349 2391 -363 2777 -2235 -1155 734 -3807 1445 4232 -920 5181 6514 -861 5849 4559 -608
364 -608 7622 1808 -579 4785 -6514 -3202 1230 -8680 3679 6055 -2275 9736 2905 -3463 5687
379 5687 -4686 -2438 4418 -5394 3192 4885 -4746 4722 -281 -9977 -527 -7229 -10655 2475 -1409
394 -1409 -362 9263 139 -562 3317 -6725 -2897 -374 -7016 983 -861 -5704 2643 -4150 -4378
409 -4378 3558 -6518 -801 3997 -6449 3652 4155 -4337 6182 1970 -2850 6489 -1349 -2189 3813
424 3813 -5554 -2186 951 -6146 2568 4621 0 9333 5352 -363 6344 -2180 -4540 4896 -2371
439 -2371 898 8805 -1039 1971 3991 -6379 -823 -403 -6145 3577 2397 627 8106 2368 1648
$$ packed form
336h531J7226j6217J1464J0365k0981J1943J880j7617J2702J92p520J0016k531
349B391k754L140n012J080J889m541N252K787n152O101J333p375O710j290n167
364f08Q230n814k387N364j1299L312M432r910J2359K376q330J2011o831o368R150
379E687j0373K248O856r812Q586J693r631R468n003r696R450o702l426J3130l884
394a409J047R625r124p01L879j0042L828K523o642P999j844m843Q347o793k28
409d378P936j0076N717M798j0446J0101N03q492J0519m212m820R339p838q40O002
424C813r367L368L137p097Q714K053m621R333l981n715O707q524k360R436p267
439b371L269P907r844L010K020j0370N556M20n742R722j180j770P479n738p20
$$ plain form
454 1648 3991 -3601 -1688 603 -5094 238 408 -5706 2622 -1093 -5403 3106 -2233 -3559 4474
469 4474 -2885 -1490 4020 -4835 -967 1530 -5177 3070 92 -5222 2423 -5708 -7461 335 -6661
484 -6661 -2078 5365 -1327 4088 5733 -2198 2296 676 -5725 597 141 -4035 3725 2283 -1289
499 -1289 4570 -713 -3690 1691 -3926 22 5239 -563 7451 5944 -1600 6589 -541 -4006 5204
514 5204 -3437 -1670 4277 -4125 1287 2519 -2612 3903 2519 -326 4217 882 -993 2340 -314
529 -314 -1376 1871 -950 -1142 2435 -2301 -887 1169 -7086 -1307 -735 -7460 4684 2363 -2534 8604
545 8604 -1012 -3502 2797 -8152 -2276 -960 -7127 3848 -1743 -3780 5397 -5210 -2468 2769
559 2769 -6797 -548 2456 -2561 3279 3241 -867 1745 551 -3095 -79 -698 -4363 1626 -674 -3100
$$ packed form
454A648K343p592J913K291n697N332J70o114Q328l715m310Q509n339j326Q033
469D474p359J395N510q855L868K497o707Q247k978n314P645q131j753P796o996
484f661M583P443o692N415J645p931M494j620o401O322m56m176P760j442l572
499a289N859n283k977N381n617L948N217n802Q014j507p544Q189p130l465R210
514E204q641J767N947q402N412J232n131O515j384k845M543l335j875L333k654
529c14j062L247k821j92L577m736J414K056q255N779N72o725J2144k321m897J1138
545H604r616k490O299j0949N876J316o167J0975n591k037R177j0607K742N237
559B769r566O249L004n017N840l8m108K612j194l646L016o19l665N989k300k426
$$ plain form
575 -3100 4411 -665 -121 6253 -1877 3661 4605 -3661 6082 -574 -4590 7053 -4051 -738 8329
590 8329 -4199 2285 3341 -6080 2301 -519 -2502 5267 687 3224 5537 -427 1766 1605 -4081
605 -4081 -1828 -281 -4199 -750 2734 -2659 1927 2502 -5360 2197 -911 -5619 5443 -1937 -2672
620 -2672 6948 -5452 -768 3439 -7515 2191 -788 -6377 2682 -4845 -3667 3149 -4484 1462 4054
635 4054 -2326 2871 1738 -2773 88 -1285 -3186 -790 -12 -1257 2178 1386 -1778 2924 -1493 -3731
651 -3731 3345 -2360 197 7106 -679 4513 5227 -3262 3782 -1600 -4199 3320 -3829 -305 5004
666 5004 -2524 3733 2929 -1754 2811 83 10 2336 151 1866 1369 -511 1255 -294 -1497 -203
682 -203 -174 -2141 -787 587 -2826 190 1414 -2732 2656 1294 -1600 3930 -1752 -2383 1286 -6086
$$ packed form
575c100P511n076N44O374q130N538R44q266R743o656m016J1643j1104L313R067
590H329j2528O484J056r421Q381k820j983P769m580K537K313n964K193j61n686
605d081K253J547l918L449L484n393M586N75p862P557l108m708J1062p380p35
620b672R620j2400M684M207j0954R706k979n589R059p527J178O816p633N946K592
635D054o380N197j133m511K861j373j901K396P78j245L435p92l164M702m417k238
651c731P076n705K557O909p785N192P14q489P044n382k599P519p149L524N309
666E004p528O257q04m683M565k728p3K326k185J715m97j880J766j549j203J294
682b03K9j967J354J374l413L016J224m146N388j362k894N530n682o31L669p372
$$ plain form
698 -6086 -1423 -526 -5001 3204 -209 -2345 3807 -3722 -2359 1827 -5177 760 2365 -2096 3268
713 3268 2005 -2100 1223 -1400 -4200 -595 -2089 -2611 1957 567 211 3858 -325 9 3017 -2290
729 -2290 1741 2296 -2828 3698 153 -2721 5064 -1994 -1659 5781 -3759 1234 3685 -4218 3275 2317
745 2317 -2292 5515 1587 -108 5267 -970 -750 2201 -3717 -836 376 -2471 1130 2747 -443
760 -443 1994 92 -2743 1006 -409 -2733 2859 30 -1647 4269 -2077 -1542 1195 -4472 -1171 -620
776 -620 -4213 1771 -749 -1391 4214 -2385 296 2136 -3084 866 273 -3447 943 -1240 -2046 1523
792 1523 -1471 -164 1619 -1333 -426 691 -1390 43 1531 -435 1679 2897 166 2280 1145
807 1145 -2042 1593 -1641 -2817 2856 -1143 201 4557 95 2369 2498 -910 2067 -341 -285 2847
$$ packed form
698f086M663Q97m475Q205l413k136O152p529J363M186p004N937J605m461N364
713C268j263m105L323k623k800L605j494n22M568j390l56L647m183L34L008n307
729b290M031N55n124O526l545k874P785p058L35P440r540M993K451p903P493r58
745B317m609P807l928j695N375o237K20K951n918K881J212k847L601J617l190
760d43K437j902k835L749j415k324N592k829j677N916o346N35K737n667L301N51
776f20l593N984k520o42N605o599K681J840n220L950n93l720M390k183q06L569
792A523k994J307J783k952R07J117k081J433J488j966K114J218k731K114j135
807A145l187L635l234j176N673l999J344M356m462K274J29l408K977k408N6L132
$$ plain form
823 2847 -1306 1439 3322 -1874 1272 1271 -3116 -84 -53 -2047 844 848 -166 1243 531 -392 1536 -467
841 -467 -759 1237 -2350 -2009 205 -3616 -961 746 -2673 1483 -24 -2400 2257 -2445 -2356 1797
857 1797 -3431 -541 3482 -2207 1674 2097 -3360 -748 -1655 -4009 -674 -774 -310 2684 630 1159
873 1159 2423 -1137 -381 1412 -2092 366 2028 -1172 1999 2046 -1542 2210 -54 -2052 2679 -1175
889 -1175 -341 3954 -918 1382 3655 -1002 1901 1627 -1065 2284 -287 -1191 1498 -1929 -426 1673
905 1673 -1457 1201 2391 -1515 1233 874 -2168 567 -316 -1343 1454 -509 -499 1433 -2203 -914
921 -914 -220 -3989 -1035 -411 -2629 1420 494 -876 2368 -893 -1395 660 -3066 -1654 360 -2432
937 -2432 493 866 -1921 757 -356 -1689 105 -854 -243 1029 -863 912 1262 -1031 2250 1297
$$ packed form
823B847m153K745J883n196L146jm387L032L1j994K891Mj014J409p12r23J928k003
841d67k92J996l587L41K214l821K655J707l419M156j507k376M657m702Q9M153
857A797n228K890M023n689L881M23n457K612r07k354L335j00M64K994k054N29
873A159J264l560P56J793l504K458J662l200L171M7l588L752k264j998M731l854
889a175Q34M295m872K300K273m657K903k74k692L349k571r04K689l427J503K099
905A673l130K658J190l906K748l59l042K735q83j027K797j963J0J932l636J289
921i14O94l769K954O24k218M049r26j370L244l261n02K055l726J412K014k792
937b432K925L73k787K678j113j333J794r59O11J272j892J775L50k293L281r53
$$ plain form
953 1297 -1643 2100 -291 -2155 1927 -821 -1110 2839 30 604 3391 161 1284 2095 -1101 691
969 691 474 -1138 1792 408 280 2833 -595 14 1449 -2889 -271 1403 -1888 1949 2224 -1165
985 -1165 2415 1180 -1897 1454 -1187 -1747 1481 -869 -1047 -361 -1426 192 207 -1443 799 -591
1001 -591 -2005 887 -1264 -854 1527 -1541 -707 1650 -1937 -86 755 -3126 -679 -177 -3057 741
1017 741 1074 -497 2792 900 -1029 1936 -1368 -1367 1218 -1679 363 1814 -911 1981 1252 -1608
1033 -1608 1506 -493 -1435 2059 -379 273 3216 54 1302 2605 -813 1194 1033 -1563 508 270
1049 270 -833 2083 -309 -304 2153 -1610 383 2638 -2047 945 1515 -2741 771 557 -1565 1751
1065 1751 -491 -1422 2069 -2908 -1294 132 -2744 -586 -13 -2327 2048 286 -556 1835 -2041 -2293
$$ packed form
953A297k940L743k391j864M082k748k89L949k809N74K787l230J123Q11l196J792
969F91k17j612K930j384j28K553l428O09J435m338K618J674l291L837K75l389
985a165L580j235l077L351k641n60L228k350j78O86j065J618J5j650K242j390
1001e91j414K892k151M10K381l068Q34K357l587J851Q41l881K447N02k880L798
1017G41L33j571L289j892j929K965l304JK585k897K042J451k725K892p29k860
1033a608L114j999r42L494k438O52K943l162J248J303l418K007j61k596K071k38
1049B70j103K916k392NK457l763J993K255m685K992N70m256L512k14k122L316
1065A751k242r31L491m977J614J426k876K158N73k314M375j762q42K391l876k52
$$ plain form
1081 -2293 123 -2705 -1009 1340 -1821 751 1484 -1980 -299 -634 -2799 477 -646 -1268 1936 -99
1097 -99 -448 1996 -1831 60 1109 -2930 1307 828 -2733 2369 -373 -1015 3539 -415 -280 2635
1113 2635 -1488 374 1532 -2302 1380 940 -1092 1901 977 -1466 2120 -349 -1359 1349 -1190
1128 -1190 -368 2214 -539 339 2646 -1598 1393 607 -3015 1441 -653 -2197 2308 -1322 -955 1982
1144 1982 -2237 -59 1083 -2462 752 -163 -2414 1543 -748 -1231 1381 -1279 -858 644 -1911 -1131
1160 -1131 35 -1809 -872 616 -1368 511 1131 -1093 1262 367 -1277 1285 -1160 -1486 1578 -1671
1176 -1671 595 2293 -1495 1636 871 -2106 1675 -383 -850 2395 -604 922 2571 -244 1480
1191 1480 1214 -1010 671 -103 -857 1098 324 241 1710 448 -157 1431 -504 -568 1794 -1525 105
$$ packed form
1081b293K416k828J696K349l161K572P33l464J681l35k165L276j123o22L204k035
1097i9l49K444l827J891J049m039M237m79l561N102k742o42M554l954J35K915
1113B635m123J862J158l834L682m40k032K993r24k443L586k469j010K708k539
1128a190Q22K582k753Q78K307m244K991p86l622M456k094j544M505l630L67K937
1144A982m219K178J142l545L214r15k251L957k291m83K612k660M21J502k555P80
1160a131J166j844R37J488j984J879O20k224K355q95j644K562k445l26L064l249
1176a671K266J698l788L131p65k977L781k058m67L245k999J526J649k815J724
1191A480k66k224J681p74p54J955p74q3J469j262o05J588j935o4K362l319J630
$$ plain form
1208 105 1864 -1844 1046 1043 -2141 1527 -629 -2237 1643 -1968 -714 1182 -2102 670 754 -1379
1224 -1379 1409 -450 -1557 836 -1912 -1587 467 -1699 -80 850 -962 201 554 -1399 -285 -306
1240 -306 -1491 610 127 -805 1975 -180 -784 1429 -2094 -619 686 -2274 825 1223 -1437 2686
1256 2686 295 -634 2644 -900 184 2022 -1490 897 1185 -1271 1922 239 -602 2001 118 -155
1272 -155 1140 -234 -544 1258 -457 611 1591 -361 697 1379 -1623 613 48 -2120 846 -375
1288 -375 -1316 2198 -468 -532 1666 -1991 -6 177 -2395 644 -558 -1358 1675 -982 -781 1274 -1687
1305 -1687 -925 70 -1947 -338 -66 -1200 470 422 -750 910 54 -974 580 -809 -925 1507 -1289
1322 -1289 -1255 1509 -1046 954 1213 -1389 1125 419 -1517 1279 -329 -760 2038 181 347 1942
$$ packed form
1208A05J759l708K890ll184L668k156j608L880l611J254J896l284K772Q4k133
1224a379K788j859j107K393k748L25K054k166J619R30j812J163L53j953J114k1
1240c06j185K101m83r32K780k155o04K213l523J475J305k960L099L98k660M123
1256B686k391r29L278l544J084J838l512K387K88k456L193j683q41K603j883k73
1272a55J295j374l10J802j715J068R80j952J058O82l002K236n65k168K966j221
1288c75r41L514k666o4K198l657J985J83k572L039j202q00L033k657K01K055k961
1305a687P62R95k017J609K72j134J670m8j172J660q56j028J554j389j16K432k796
1322a289L4K764k555K000K59k602K514p06j936K796j608m31K798j857J66J595
$$ plain form
1338 1942 -524 331 -240 -551 609 416 -12 1154 759 643 1104 -4 106 553 -495 166 542 -283
1356 -283 498 883 -384 697 215 -1215 577 -645 -1086 940 -1023 -68 1003 -1248 329 73 -1583
1373 -1583 488 -898 -1461 628 -1387 -864 845 -1133 15 626 -1404 -240 -112 -1402 -201 -48
1389 -48 -797 660 123 -648 681 -211 -584 581 -538 -365 502 -787 546 594 -249 867 67 -141
1407 -141 1281 -481 -74 853 -741 734 1024 -363 1215 275 -287 1268 -296 -76 968 -449 189
1424 189 1304 -483 609 1012 -775 558 279 -1043 575 4 -592 1137 -371 -378 1236 -684 -401
1441 -401 436 -1566 -392 314 -1590 474 299 -924 783 -551 -1188 211 -1070 -1089 120 -1111 -327
1458 -327 326 -675 228 -47 -598 327 -562 -759 265 -345 -195 346 -270 414 623 -518 181 160 -779
$$ packed form
1338A942k466Q55n71l11J160j93m28J166l95j16M61j108J10M47j048O61L76q25
1356b83P81L85j267J081m82j430J792j222m41K026j963R55J071k251J577k56j656
1373a583K071j386n63K089k015N23J709j978J148O11k030J164J28j290J201J53
1389d8p49J457n37p71J329q92l73J165j119J73Q67j289J333M8q43J116q00k08
1407a41J422j762M07R27j594J475K90j387J578r40n62J555j564K20J044j417O38
1424A89J115j787J092M03j787J333k79j322J618n71n96J729j508pJ614j920K83
1441d01Q37k002J174P06j904K064j75j223J707j334o37J399j281j9J209j231P84
1458c27O53j001R03k75n51R25q89j97J024o10J50N41o16O84K09j141O99k1r39
$$ plain form
1477 -779 329 -30 -224 791 162 65 1099 128 274 710 -416 252 470 -150 910 368 10 1393
1495 1393 -47 225 798 -490 55 411 -367 470 673 -217 795 321 -215 626 -240 -550 114 -378 -489
1514 -489 350 -251 100 486 -388 -336 -6 -848 -177 -510 -857 368 -324 -505 480 -495 -367 193 -1194 -443
1534 -443 -341 -1084 187 -69 -374 620 -214 -464 362 -679 -424 527 -598 54 455 -308 502 450 -445
1553 -445 662 321 -958 532 -253 -475 1210 -70 183 1348 -399 956 865 -939 582 259 -763
1570 -763 976 263 -157 1416 -189 -52 1049 -621 -130 536 -420 356 521 -200 587 423 -396 208
1588 208 -436 -619 227 -555 -195 470 -423 192 9 -513 202 -372 -816 -108 -499 -780 368 -478 -227 455
1608 455 -740 -138 77 -775 -264 -311 -832 586 -442 -432 497 -147 574 273 -412 166 191 -464 89 40
$$ packed form
1477g79J108l59j94J015o29r7J034r71J46M36j126O68K18o20J060n42l58J383
1495A393j440K72N73j288N45L56p78Q37K03q90J012m74n36Q41q66l10O64m92j11
1514d89Q39o01L51L86q74N2L30q42O71l33l47J225o92j81R85r75J28N60j387P51
1534d43J02p43J271k56l05R94q34k50Q26j041K55R51j125O52M01p63Q10n2q95
1553d45J107l41j279J490p85k22J685j280K53J165j747J355r1j804J521l23j022
1570g63J739p13m20J573j605J37J101j670M91O66r56P76J65p21P87j64q19O04
1588B08o44j83Q46p82L60O65q93O15j83n22P15n74m44P08l91k81J148q46K51O82
1608D55j195O02K15q52N11m7n21J418j028J0R29o44P21l01o85N78K5o55N53m9
$$ plain form
1628 40 -294 849 256 104 814 -144 316 654 -292 437 558 -373 601 193 189 567 128 217 258 -281 50
1649 50 372 -67 508 503 -137 717 300 -675 486 -191 -470 566 -81 -27 778 -323 -40 155 -745 114
1669 114 -68 -590 97 -221 -399 503 -262 -330 383 -825 -452 20 -829 -324 154 -940 145 456 -722
1688 -722 120 -83 -760 376 -677 -783 745 -623 -146 819 -779 571 402 -1059 614 198 -657
1705 -657 921 -95 56 980 -177 38 737 -70 166 678 -323 333 555 -92 587 648 41 651 317
1724 317 -134 771 -295 -54 865 -627 373 674 -463 723 -139 -824 291 -480 -138 656 -500 317
1742 317 458 -400 439 16 -742 121 -369 -552 -114 -555 -315 189 -231 -323 -27 -702 -229 -12 -832 -146
1762 -146 -61 -369 527 -58 -554 599 -477 -520 281 -935 29 385 -702 807 -145 -356 877 42 -2
$$ packed form
1628D0l34J143n93j52P10r58M60L38r46P29J21r31R74m08mL78m39Q9M1n39L31
1649E0L22m39N75no40Q54m17r75J161o77k79J036o47N4Q05j101K83J95r00Q59
1669A14j82n22O87l18j78R02p65o8P13j208L73M72q49N05M78j094J085L11j178
1688g22Q42k03o77J136j053j06J528j368M77R65j598J350j69j461J673m16q55
1705f57J578j016J51R24j157K15O99q07K36N12j001O56K22o47O79O1o07O10l34
1724C17m51R05j066K41R19j492J000L01j137J186q62o85J115p71L42P94j156Q17
1742C17J41q58Q39m23p58Q63m90j83M38m41K40N04m20r2K96o75M73K17q20O86
1762a46Q5l08Q96n85m96J153j076m3Q01j216R64L56j087J509r52k11J233q35m4
$$ plain form
1781 -2 690 -443 124 588 -315 575 155 -70 881 216 -66 492 -126 -247 544 11 -74 1207 -37 117
1801 117 784 -572 218 561 -721 419 268 -708 811 -489 11 633 -513 291 21 -767 96 105 -399
1820 -399 474 -353 -698 315 -362 -363 98 -576 -634 84 -832 -44 -291 -446 243 148 -563 340 24 -562 545
1841 545 -475 -487 -149 -144 114 220 -570 523 209 -968 150 41 73 72 250 -49 912 250 251 812 261
1862 261 -59 293 -242 696 87 -262 348 -85 -390 165 16 307 457 -221 265 603 -482 315 566 -498
1882 -498 94 -806 -242 535 -314 82 372 -694 -24 -57 -313 91 -295 -624 431 -615 -252 344 -438
1901 -438 -509 -95 -703 -16 -231 -766 -260 18 -943 169 -329 -411 -390 -213 -383 -75 -839 -563 584 -586
1921 -586 3 326 -558 315 325 -457 128 -107 47 359 -415 -163 257 57 327 243 424 204 589 -308 373
$$ packed form
1781bO92j133N67M64r03Q90m20k25R51o65k82N58o18j21P91n33q5J281j244J54
1801A17O67j356P90L43j282J140j51r76J519j300N00O22j146Q04k70p88Q63Rn04
1820c99Q73q27l45J013o77jM61o74n8P18r16P88k47j55O89r5p11R03l16n86J107
1841E45j020j2L38NK58J06p90J093l14j177J118j09L2jJ78k99R61o62JN61n51
1862B61l20L52n35R38o09l49O10m33l05N55j49K91J50o78M86L38j085P97K51j064
1882d98N92r00N64P77q49L96K90j066O70l3k56M04l86l29J055j046L63N96p82
1901d38p1M14o08O87k15n35N06K78r61J112m98q2K1J77j70L08p64K76J147j170
1921e86N89L23q84Q73J0p82N85k35J54L12p74K52M20k00K70q4J81k20L85q97O81
$$ plain form
1942 373 104 17 518 15 48 485 41 -93 -146 -365 153 41 -379 225 7 -144 459 -343 -40 147 -380
1963 -380 -355 610 -100 441 -126 -664 516 -295 277 89 1 -286 -536 -511 -44 333 -774 109 -300 -589
1983 -589 -51 -395 223 -289 -297 -529 -243 -247 -2 954 23 240 161 -316 233 537 -466 860 47 20 562
2004 562 675 -698 372 -595 217 569 -266 261 511 260 363 763 278 684 -390 277 265 -193 165
2023 165 189 -109 303 707 102 414 654 -211 702 167 -441 505 40 -19 -16 -229 -292 258 122 -156 -287 -577
2045 -577 -417 -176 -578 965 365 -160 220 -1003 -144 44 -817 409 -189 -392 1271 100 483 667
2063 667 67 156 238 176 -156 244 -781 981 374 135 774 206 -18 126 -224 70 544 304 821 441
2083 441 180 291 547 -496 34 159 -539 801 302 -264 375 140 23 435 127 -180 302 -325 239
$$ packed form
1942C73k69q7N01n03L3M37m44j34n3k19N18j12m20O04k18j51O03q02L03J87n27
1963c80K5R65p10N41n67n38J180q11N72j88q8k87k50K5M67L77j107Q83m09k89
1983e89N38l44O18n12qk32K86mK45R56r31K17p9m77N49L04j003J326q13k7N42
2004E62J13j373J070r67Q12L52q35N27K50k51J03M00m85M06j074O67j2m58L58
2023A65K4k98M12M04o05L12K40q65R13n35o08R46m65n9Lk13o3N50j36k78j31k90
2045e77J60K41m02J543o00n25L80j223Q59J88q61J226n98k03J663j171L83J84
2063F67o00Q9Q2o2l32M00j025J762o07k39O39n68k24J44l50K94M74k40N17l80
2083D41k61J11K56j043N30J25o98J340m99n66O39k35j17M12l08l07M82o27N64
$$ plain form
2102 239 127 -108 192 151 -242 326 56 -305 -2 -409 -60 230 -390 61 446 -292 200 -113 -463 220
2122 220 -179 -304 149 -658 -357 364 -306 -111 -76 -454 80 -221 -489 -183 -327 -347 -48 -105 -175 130 -487
2143 -487 -236 172 -459 -207 -188 -120 346 109 -65 124 -603 -144 513 117 -96 304 -284 322 -148 371 816
2164 816 424 -80 420 92 122 393 16 -3 453 409 508 686 70 356 167 -39 301 299 136 966 -667 316
2186 316 -99 -342 -597 380 290 -136 -187 232 664 -204 33 326 -433 -192 -61 -328 -764 517 133 302
2206 302 -206 -538 86 -135 -818 -110 -245 -479 48 -299 -16 156 -592 -320 -180 231 -58 -216 -685 766
2226 766 319 328 455 -423 489 273 205 -245 517 44 -6 309 423 12 907 -341 604 125 -165 686 295
2247 295 -352 870 263 2 635 255 707 141 -191 147 380 -411 147 -318 -257 317 -319 -395 277 -617
$$ packed form
2102B39j12k35L00m1l93N68k70l61L03m07L49K90o20M51L85p38M92l13l50O83
2122B20l99j25M53q07L01P21o70J95L5l78N34l01k68L06j44k0K99n7p0L05o17
2143d87K51M08o31K52J9O8M66k37j74J89p27M59O57l96k13M00n88O06m70N19M45
2164H16l92n04N00l28L0K71l77j9M56m4R9J78o16K86j89k06L40kj63Q30j633R83
2186C16m15k43k55R77r0m26n1M19M32q68K37K93p59K41J31k67m36J281l84J69
2206C02n08l32O24k21o83P08j35k34N27l47K83J72p48K72J40M11k89j58m69J451
2226G66m47RJ27q78R12k16o8m50P62m73n0L15J14m11Q95j248R45m79k90Q51l91
2247B95o47J222o07k61O33l80M52n66l32L38K33p91N58m65O1N74o36p6O72q94
$$ plain form
2267 -617 -313 -3 -737 -417 -331 -155 -180 119 -266 657 -36 50 248 -428 102 254 6 -258 470 -496 336
2288 336 -121 -102 236 -351 273 486 158 433 1169 -528 175 711 254 142 174 -421 203 -303 30 -88
2308 -88 -241 -5 -297 198 179 152 -411 -48 -315 253 400 -239 885 99 -427 -207 519 31 931 -282
2328 -282 654 397 325 -84 438 194 409 388 -643 -477 -232 -209 108 79 -506 636 -281 -1020 -17 81 -535
2349 -535 149 -49 417 -17 -381 -370 445 -491 -325 -103 -708 -170 408 -331 303 257 140 235 -647 -40 209
2370 209 101 -89 630 -745 216 -374 -154 602 -150 64 133 -10 -258 311 555 -119 24 -48 286 -82
2390 -82 -91 479 153 -124 348 -98 153 239 -60 240 415 -168 65 281 -65 6 133 -62 212 214 13 187
2412 187 -592 129 -65 -270 56 -86 -152 147 240 -333 90 -140 -85 176 -345 -62 -113 -177 -206 -289 -341 -98 -109
$$ packed form
2267f17L04L10p34L20Q6J76k5K99l85R23o93Q6J98o76N30J52k48k64P28r66Q32
2288C36m57J9L38n87O24K13l28K75P36j697P03N36m57j12L2n95O24n06L33j18
2308h8j53K36k92M95j9k7n63L63k67N68J47o39J124p86n26K20P26m88R00j213
2328b82R36k57p2m09N22k44K15k1j031J66K45K3L17k9n85J142r17p39J003R8o16
2349e35O84j98M66m34l64J1Q15r36J66K22o05N38N78p39O34m6j17R5q82O07K49
2370B09j08j90P19j375R61n90K20P56p52K14O9j43k48N69K44o74J43p2L34l68
2390h2rN70l26k77M72m46K51Q6k99L00J75n83K33K16l46P1J27j95K74Kk01J74
2412A87p79P21j94k05L26j42o6K99R3n73M23k30N5K61n21K83n1o4k9q3n2K43j1
$$ plain form
2435 -109 -481 -59 -198 -202 69 -316 267 -38 -140 138 74 -197 390 -141 -343 316 -246 -55 -36 -117 345 248
2457 248 -31 242 -93 -168 39 -186 -35 184 221 171 472 -49 -166 245 -118 -12 84 -64 343 7 -28 570
2479 570 204 39 113 193 41 238 -188 98 213 -249 256 -64 -257 -11 -106 -157 -54 -231 -208 -73 -99 -269
2501 -269 -166 -307 -61 -226 -214 -363 -302 -246 -123 27 -265 154 -192 33 -79 -453 141 75 225 223 246 -432
2523 -432 -132 217 -430 -317 21 -407 218 308 -160 485 668 799 -217 -125 54 389 703 214 410 132
2543 132 174 83 268 214 128 123 258 36 142 163 146 224 201 168 73 0 150 20 -144 -175 -122 -250 173 151 -84
2568 -84 184 25 26 135 -53 -21 -192 -78 -170 120 -83 -299 0 -292 111 -228 -317 49 -78 12 -34 -524 17
2591 17 -44 -465 -151 2 -265 298 5 -224 189 57 146 102 -171 64 302 43 161 224 -145 188 267 174
$$ packed form
2435a09l72M22j39mK71l85N83l05j02K78o4k71N87n31k02O59n62J91J9q1M62r7
2457B48k79K73l35p5K07k25J51K19L7n0L01n21j17M11l63J06R6j48M07l36l5N98
2479E70l66j65P4Q0j52J97m26K86J15m62N05l20j93K46r5n1J03j77K3J35k6j70
2501b69J03j41K46j65J2j49O1N6J23J50k92M19l46K25j12l74N94o6J50kK3o78
2523d32L00L49o47J13L38m28O25R0m68O45J83J31j016R2J79L35L14m89J96k78
2543A32M2r1J85n4q6nJ35k22J06K1j7P8k3l3r5p3J50j30j64l1N3j28M23k2k35
2568h4K68j59JJ09j88L2j71J14r2K90k03k16K99k92M03l39q9L66j27R0m6m90N41
2591A7o1m21L14J53k67N63k93k29M13j32Q9m4k73K35K38k59J18O3l69L33P9r3
$$ plain form
2613 174 98 131 145 148 255 14 119 274 45 225 35 205 195 -87 45 74 105 -33 -67 -137 163 -112 20
2636 20 -82 -175 -112 -245 -150 68 79 85 230 -128 -188 155 -54 -214 -118 -177 -65 94 -237 -93 -123 -166 43 -139
2660 -139 -246 125 -93 -130 -142 -393 -73 47 -340 -10 -2 -94 13 -147 13 203 64 -25 216 -62 -114 98
2682 98 -92 89 -24 43 301 112 -128 295 231 -90 328 -49 -85 155 -266 41 296 230 42 221 -259 -75
2704 -75 63 -251 18 136 37 -112 123 -27 40 -122 -3 25 12 225 -23 -50 -59 -188 -363 -72 -108 -126 151
2727 151 -53 243 -189 -166 -243 -81 -249 23 -234 -97 135 -267 2 116 -184 -158 273 -145 120 132 -116
2748 -116 -57 119 -34 22 -85 95 181 -142 188 -44 -190 193 -58 -42 93 69 241 258 383 67 284 -24
2770 -24 104 88 51 -29 225 -51 487 -296 42 -26 92 98 149 75 72 90 -167 -62 -8 17 -175 193 -82 -49 7
$$ packed form
2613A74p6L3J4LJ07k41J05J55k29J80j90J70j0k82J32K9L1j38l4p0L00k75J32
2636B0j02r3O3j33R5K18J1OJ45l58o0L43k09j60R6n9J12J59l31J44l0m3K09j82
2660a39j07L71k18l7j2k51L20J20l87L30Qr2J07j60J60J90j39q9K41k78n2K12
2682I8j90J81j13O7K58j89k40M23o4l21M18l77l6K40m21L07K55o6j88J79m80J84
2704g5J38l14K69J18r9j49K35j50O7j62J19K8j3K13k48k7rj29j75K91l6j8K77
2727A51k04K96m32K3p7J62j68K72k57J37K32m02K69J14l00K6M31m18K65J2k48
2748a16N9J76j53N6j07J80Q6l23L30k32j46L83k51J6J35k4J72J7J25l16K17l08
2770b4J28j6l7q0K54k76N38p83L38o8J18ON1p4lJ8k57J05N4K5j92L68k75L3N6
$$ plain form
2795 7 114 148 59 -120 -13 -16 108 193 -194 -101 -167 -106 -75 -14 -164 311 -297 43 -141 -320 74 -6 -169 148
2819 148 86 -173 220 -294 -33 -21 40 -38 76 129 -123 302 -174 108 31 55 286 89 9 361 137 174 306
2842 306 -80 -64 120 -177 262 307 7 -71 117 63 74 -131 142 -122 -170 13 182 123 -123 346 -179 -143 -68
2865 -68 98 102 -81 -16 168 137 -193 59 14 -174 -237 -49 -357 57 -319 -217 185 -233 -43 -69 -118 207 -473
2888 -473 141 -300 156 -48 231 -221 -210 193 -220 -49 16 501 -87 8 68 328 174 360 86 -283 -66
2909 -66 -125 127 24 150 -110 189 215 -104 163 -194 50 387 -92 195 241 -58 324 21 -70 -33 88 -163
2931 -163 261 -216 -65 120 25 31 77 -188 173 -18 8 262 203 -82 31 14 -78 118 -123 -1 -64 -219 6
2954 6 -217 -88 -291 -183 -103 108 -23 -36 -90 -202 194 -167 -165 -137 -77 -160 68 -98 -288 220 -78 -77 244 57
$$ packed form
2795GJ07L4q9j79J07lJ24Q5l87R3o6O1L1O1j50M75o08L40j84j79L94q0j63L17
2819A48o2k59L93n14K61J2O1p8J14N3k52M25m76K82p7K4K31j97q0L52k24L7J32
2842C06l86J6J84k97M39M5l00p8J88n4J1k05K73k64m8J83J69n9k46M69n25L6P5
2865f8J66Mj83O5J84l1l30K52m5j88o3J88l08M14l76J02M02m18J90k6m9L25o80
2888d73O14m41M56k04K79m52J1M03m13J71O5M85n88R5O0K60j54J86k74l69K17
2909f6n9K52j03J26k60K99K6l19K67l57K44L37m79K87M6k99L82l03r1L7J21k51
2931a63M24m77J51J85r5OM6k65L61j91K6K54n9k85J13j7r2J96k41J22o3j55K25
2954Fk23J29k03J08Q0K11j31j3n4j12L96l61KK8O0q3K28j66j90N08k98JL21j87
$$ plain form
2978 57 54 142 -9 46 -185 78 -85 -182 64 76 282 168 208 71 51 152 -74 71 163 54 106 123 -109 126
3002 126 29 -192 224 -168 190 27 85 86 -138 -235 -193 78 -268 142 157 -47 226 -299 -153 -170 -18 -70 -99
3025 -99 -192 -10 -105 -261 -206 44 -64 -138 -116 -28 82 14 -84 -34 -215 -127 -196 125 159 203 -28 49 -196 -220 98
3050 98 45 -75 26 -4 -56 -117 -97 -35 -55 153 151 69 42 -59 102 221 97 -10 38 142 -206 -45 186 34
3074 34 335 377 -13 217 68 -49 379 0 -39 358 75 -20 6 -72 -80 233 90 147 -6 -231 -10 -176 -18
3097 -18 -154 -184 -134 -34 -148 93 -163 -77 71 -120 -238 238 73 -96 -209 -252 -181 48 -147 9 29 -109
3119 -109 180 87 -13 82 -276 -5 -82 -158 -105 -164 -36 -68 38 -15 23 87 244 5 177 -117 -169 18 79 213
3143 213 139 48 -163 -12 285 205 -5 76 95 64 -6 102 181 40 -122 -328 109 -158 133 -11 107 258 175
$$ packed form
2978E7lQ8j51N5k31K63j63r7K46J2K06j14M0j37k0J01k26J45R2j09N2J7k32K35
3002A26r7k21M16l92L58j63N8Jk24r7M2K71l46M10J5k04K73n25J46j7J52n2k9
3025i9r3J82r5j56N5K50j08p4K2Q8J10o8r8N0j81Q8o9L21L4M4k31P7k45k4L18
3050I8n3j20J01l0n2o1K0O2k0K08kq2k7j01J61J19j24j07M8J04l48J61K31j52
3074C4L01M2l90K30j49j17M28l79l9L97k83r5K6p8qL13j43N7j53k25K21j66J58
3097a8j36l0N0J00j14K41k56Q6J48j91j18M76j65j69j13m3P1K29j95J56K0j38
3119a09K89r3j00R5l58K71p7p6N3n9J28l2J06n3L8O4J57k39J72k94n2J87O1J34
3143B13p4r1k11J51K97q0k10Q1J9l1p0J08P9j41j62k06M37k67K91j44J18J51q3
$$ plain form
3166 175 -75 -171 113 -221 -184 -116 -332 -57 -73 167 -31 24 110 36 -18 5 62 -102 53 -50 18 -117 -208 43
3190 43 -45 -151 -46 -50 -301 -130 -28 -113 -56 -257 36 -97 40 -109 0 87 -169 259 129 -24 -17 210 134
3213 134 20 -140 205 115 170 -95 83 105 341 6 153 -81 -58 121 -21 161 -10 214 83 73 4 -150
3235 -150 -73 -201 -35 15 134 40 37 -138 -16 -114 1 -134 -102 -66 -106 -118 -134 139 -66 -206 27 -137 -10 90
3259 90 -118 87 -34 -201 -100 -309 -161 97 -53 48 -50 -204 -87 -82 -140 -37 92 229 191 -121 -119 -118 185
3282 185 74 -83 -182 117 298 226 73 8 171 116 -52 -15 90 -31 397 3 -72 -4 70 -52 111 115 24 148
3306 148 49 -215 264 -34 182 48 131 128 248 -295 25 -128 -484 -327 423 32 -114 254 134 86 193 350
3328 350 231 -81 -282 136 222 -274 -47 261 378 -399 -112 8 -155 -202 -11 -626 -158 -573 -256 -468 -592
$$ packed form
3166A75k50r6K84l34L7O8k16K75j6K40j98N5Q6p4n4K3N7j64J55j03O8j35r1K51
3190D3q8j06J05mk51J71J02q5N7k01K93j33J37j49J09Q7k56M28j30j53PK27p6
3213A34j14j60L45r0N5k65J78K2K36l35J47k34K3J79j42J82j71K24j31j0o9j54
3235a50P7j28J66N0J19r4lj75J22r8J15j35L2L6m0j2j6K73k05j40K33j64J27J00
3259I0k08K05j21j67J01k09J48K58j50J01r8j54J17Nn8J03J29J37l8l12KJL03
3282A85j11j57r9K99J81p2j53o5J63n5j68L7J05j21M28l94p5O8P4j22J63Mr1J24
3306A48r9k64M79k98K16j34Q3lJ20n43L20j53l56J57P50l91j46L68j20m8J07J57
3328C50j19l12k01M18Q6m96K27L08J17p77K87J20j63m7J91o15M68m15L17k12j24
$$ plain form
3349 -592 548 -472 150 -218 98 -196 -8 -173 220 95 143 101 213 -80 188 -61 -57 73 269 120 246
3370 246 -118 108 192 84 -186 66 -33 -75 -2 -9 153 26 88 -60 129 -246 -438 -82 216 38 48 -11 -135
3393 -135 -235 243 -13 -181 6 -196 36 -65 68 -257 -71 102 139 127 -199 -11 -108 -234 -40 -119 -139 187
3415 187 -179 91 -189 -78 -29 37 -56 47 67 -152 13 8 -270 34 54 27 -12 -187 -251 61 -15 -20 -160 222
3439 222 70 131 170 110 120 -52 118 -78 43 -25 -108 82 -25 52 122 20 251 132 233 189 90 -137 58
3462 58 53 32 -137 48 49 48 -64 -110 -106 -70 -158 -94 -261 -167 -150 -84 -22 -86 200 134 2 -176 -93 -168 3 -143 -109 -254
3490 -254 31 -28 -128 -73 -180 -74 -68 -47 265 62 -87 214 160 48 -78 58 -7 95 40 171 190 115 -4
3513 -4 132 -172 -165 -63 230 -120 169 -18 -30 -72 101 137 -15 184 79 52 31 157 109 174 89 -101 298 230
$$ packed form
3349e92J140j020O22l68L16k94J88j65L93j25M8m2J12k93K68k49MJ30J96j49J26
3370B46l64K26Q4j08k70K52r9m2P3pJ62j27O2j48J89l75j92L56K98j78J0n9j24
3393a35j00M78k56j68J87k02K32j01J33l25J86J73L7j2l26J88r7j26J94p9k0L26
3415A87l66K70k80J11M9O6r3J03K0k19J65nk78L04K0k7l9j75o4L12p6nj40L82
3439B22j52O1L9o0J0j72J70j96J21o8q3J90j07P7P0j02K31j19J01m4r9k27J95
3462E8nk1j69J85Jjj12m6ML6q8O4j67R4J7O6O2o4K86o6j32j78Q3p5J71j46L4j45
3490b54K85n9j00N5j07J06OK1L12k03j49L01n4j12j26J36o5J02n5J31J9p5j19
3513dJ36l04PJ02K93l50K89j87j2m2J73L6j52J99j05k7k1J26m8O5q5j90L99o8
$$ plain form
3537 230 -133 167 240 52 167 -84 -27 -54 42 56 97 110 -22 54 -277 203 150 -133 21 23 -165 -244 -246 8 -98
3562 -98 -240 -267 -32 100 -32 -8 167 -115 97 -30 19 2 -96 -9 -245 -20 -234 -7 -19 -30 56 48 149 -127
3586 -127 28 -243 -111 202 -52 44 -36 -52 -13 -71 -59 -75 114 235 118 7 212 120 69 48 90 117 33 38 86
3611 86 40 129 -67 76 89 -138 -237 2 -168 34 -204 96 134 -63 -109 -16 -87 -158 -76 -6 -80 -202 -80 -27 24
3636 24 74 -248 -212 -201 104 -2 -190 89 -227 -194 -25 -157 -6 67 -192 126 50 -5 -38 -147 -76 8 248 191
3660 191 23 3 120 -70 172 -60 -22 146 87 185 -166 2 62 -161 10 47 -68 -35 -77 130 -24 -97 83
3683 83 -26 -38 89 66 206 22 50 92 -28 -177 -83 -96 -11 -46 -129 -27 64 8 -67 11 -155 -65 15 -60 37 161
3709 161 15 -26 -1 -252 27 29 -104 144 119 58 15 -136 16 75 -64 262 32 22 91 21 -248 82 -150 -28
$$ packed form
3537B30l63L00P3j88J15k51N7k7R6J4M1J3j32P6l31M80n3k83J54Kj88p9kK54j06
3562i8j42k7K35J32j32K4J75k82K12j27M9j7r8Q7k36K25k14K27j2j1Q6qJ01k76
3586a27J55k71J32L13k54R6q0j6L9n8J2j6J89J21j17j11K05r2n1k1M2K7q4NM8
3611H6m6Q9j96J43J3k27r9K39j70K02k38L00L8j97m6R3p1p1Q2P0p4j22J22N3N1
3636B4N0l22L6J1L05j06j88K79l16L3J69j32J51P3k59L18p6n5l3j09P1Q4K40n7
3660A91j68k0J17j90K42k32L8J68n9R8l51J68O0k23J71L7j15L3m2K07j54p3J80
3683H3j09j2J27k3J40j84K8M2j20j49R4j3Q5l5q3J02R1n6p5P8j66R0Q0p5R7J24
3709A61j46m1K5k51K79Kj33K48k5o1m3j51J52N9j39L26k30j0O9p0k69L30k32J22
$$ plain form
3733 -28 82 4 -49 143 35 -134 -6 -119 94 81 3 76 335 137 26 178 39 18 120 -58 -64 123 93
3756 93 -47 18 -123 -141 272 354 -180 85 245 209 -256 72 -173 -27 4 299 6 24 -136 -49 62 41 -437
3779 -437 -102 97 -21 -57 -149 152 -79 -307 -50 72 105 160 -83 -241 -81 173 -63 -310 5 -422 112
3800 112 -112 71 -80 -23 -180 199 166 -254 184 82 0 28 108 -77 57 58 261 192 159 249 -18 81 387 -88
3824 -88 138 -11 37 145 128 -162 234 256 -126 -111 63 80 -12 -19 -88 219 -118 70 74 -59 99 73 164 47 -50
3849 -50 -73 76 -154 165 -99 -160 30 -92 120 -147 -30 59 50 64 -131 140 219 -83 -60 -222 17 56 -9 177
3873 177 175 -51 -83 -204 -125 -69 -104 171 -132 76 -74 -48 34 -56 -49 370 6 141 264 129 2 23 -228 89
3897 89 326 358 -68 -194 -202 -35 42 34 244 -296 497 540 -145 -181 -348 252 -589 -115 -241 -243 50 83 -308 -345
$$ packed form
3733b8J10p8n3J92j08j69J28j13K13j3p8P3K59j98j11J52j39k1J02j78oJ87l0
3756I3j40O5j41j8M13Q2n34K65J60l6m65L28k45J46L1K95k93J8j60Q7J11k1m78
3779d37L35J99j18l6r2L01k31k28K57J22L3N5k43j58J60K54k36k47L15m27N34
3800A12k24J83j51N7j57L79l3m20M38j02q2K8Q0j85J34JK03o9l3R0k67R9L06m75
3824h8K26j49M8J08j7k90L96K2l82J5J74J7r2po9L07l37J88Mj33J58k6R1j17r7
3849e0k3J49k30L19k64o1J90j22K12k67J17Q9rJ4j95K71P9l02K3j62K39L9o5J86
3873A77kk26l2j21P9N6l5K75l03K08j50K6Q2r0PM19l64J35J23j35j27K1k51L17
3897H9K37L2m26j26qJ67P7qK10n40P93M3o85l6j67O00q41M74j26kK93L3l91l7
$$ plain form
3921 -345 365 357 -670 -784 233 -545 -538 -267 -429 -246 -209 -101 -187 -192 -212 330 181 278 -40 6 -319 -281 9
3944 9 74 -195 146 61 139 100 42 35 211 -6 263 -110 -104 -25 -36 82 -250 33 -51 -42 129 -166 6 246 82
3969 82 124 -115 87 185 19 96 32 175 149 -17 -148 -239 91 89 -54 28 63 -116 -54 -87 -31 -157 -84 -19 -169
3994 -169 36 -31 38 118 -41 216 -72 -223 167 9 -262 -187 123 -92 87 -76 48 152 11 254 119
4015 119 -87 -8 -87 16 155 -177 -121 151 -7 107 -286 -254 -169 37 163 205 -41 180 -5 100 -306 -178
4037 -178 -37 224 3 63 -174 -305 -12 -516 221 115 286 -61 -128 53 326 -9 -293 -62 47 252 -154
4058 -154 20 -120 -397 -214 240 -148 92 17 209 -74 -4 -54 -74 -150 -81 -196 -146 28 0 84 87 -42 -57 83
4082 83 -31 227 28 -134 -63 -103 -197 -130 29 124 19 165 124 -195 -3 -31 88 13 -95 -145 230 146 -213 64
$$ packed form
3921c45P10qj027j14J017p78PK71j62J83L7J08q6nk0N42j49R7l18M6l25L8K90
3944IO5k69L41q5P8l9n8pJ76k17K69l73OP9j1J18l32K83q4RJ71k95J72K40j64
3969H2M2k39K02R8j66P7o4J43k6j66j31r1L30kj43Q2L5j79O2l3N6j26P3O5j50
3994a69K05o7O9Q0j59K57k88j51L90j58k71P5L10k15J79j63J24J04j41K43j35
4015A19k06P9p9J03J39l32N6K72j58J14l93L2Q5K06J26M2k46K21j85J05m06J28
4037a78J41K61k21O0k37j31K93n04P37j06J71l47o7J81K73l35k84K31J09K05m06
4058a54J74j40k77J83M54l88K40p5J92k83P0n0k0p6O9j15N0J74k8Q4Lj29j5J40
4082H3j14K58j99j62P1m0r4O7J59R5j05J46m1l19J92k8J19p5j08n0L75q4l59K77
$$ plain form
4106 64 158 -90 16 -48 49 -129 -35 230 -280 2 189 42 -439 100 -172 -20 151 -82 -60 132 87 129 7
4129 7 78 59 164 -137 -255 226 -97 127 35 131 90 -53 -222 -85 -79 78 32 12 63 4 -203 -165 245 13 -63
4154 -63 110 -71 -159 31 -79 80 18 -148 147 -29 -175 -253 -167 103 -61 -19 46 86 14 -27 128 19 98 351
4178 351 9 109 -35 -136 96 133 124 -320 45 -9 -151 -164 6 -111 24 -118 119 -114 150 -26 -27 280
4200 280 10 146 119 -114 -169 55 22 91 -105 -7 12 97 167 -38 274 -228 64 62 122 11 271 31 -40 -34 -140
4225 -140 57 402 -229 39 1 -62 17 -198 75 -41 219 63 -43 78 -25 -109 278 -96 22 217 -190
4246 -190 14 1 -120 140 -113 46 67 -3 72 -43 -352 20 136 222 227 42 203 162 105 48 -190 60 66 -14
4270 -14 -5 30 123 -88 213 92 98 97 246 -52 45 -174 87 188 162 58 73 115 51 141 71 19 119 233 136 58
$$ packed form
4106F4R4k48J06o4R7j78R4K65n10K82J87j47m81N39k72J52J71k33K2J92m5M2j22
4129GP1j9J05l01j18M81l23K24r2R6m1j43j69J37OJ57m6k0N1n9k07L8M10k32p6
4154f3J73j81q8J90j10J59o2j66K95j76j46p8Q6K70j64M2O5M0p2m1J55j09P9K53
4178C51l42J00j44j01K32L7rm44L65n4j42j3J70j17J35j42K37k33K64j76jL07
4200B80k70J36k7k33n5K24l3O9j96R8J9Q5P0k05L12n02K92kO0j11K60k40p1Oj06
4225a40J97L45o31K68l8o3P9k15K73j16K60j56j06J21j03q4L87l74J18J95m07
4246a90K04j3j21K60k53J59K1p0P5j15l09L72J16Q6Nj85J61m1n7n7k38K50Oq0
4270a4RL5R3k11L01j21OjJ49k98R7k19K61J01k6j04J5M2o4R0p0n2J00J14r7p8
$$ plain form
4296 58 -8 -6 -3 75 -94 226 56 -92 257 177 141 -129 -270 -306 178 -445 546 28 178 263 -78 -85 -556 618
4320 618 -668 226 1267 285 -517 -355 222 -409 -269 -121 23 -40 148 -101 41 331 36 91 226 184
4340 184 26 -83 -95 306 26 -12 123 57 133 -128 -65 40 120 7 262 262 -11 -5 36 43 162 132 107 202 4
4365 4 -84 101 -145 -11 -66 -146 -84 -50 33 407 207 23 -1 86 -57 203 -162 58 -94 35 50 14 137 -3
4389 -3 -114 -21 -7 -9 231 85 -166 156 -199 47 -21 327 -72 42 49 70 -296 -125 157 -135 127 40 85 -153
4413 -153 133 151 -30 -9 121 242 242 184 95 149 -191 -49 -69 -101 76 -61 -39 -253 -21 -156 -12 -6 38 166
4437 166 154 1 33 -115 -140 -27 88 -310 53 301 -117 -259 -35 410 265 -349 134 -58 -115 116 139 -152
4459 -152 -276 -104 127 -232 -103 130 -175 -184 -191 -74 -193 146 181 5 -97 -345 3 -119 -18 49 -111 -468
$$ packed form
4296E8o6KLP8j69L20j70j48L49q0l6k70j41l6M84o23R91n18J50Q5l41pm71J174
4320F18j286Q94J041r82q02J62N77o31J40J48J44o3J88k49J42K90k95N5J35m2
4340A84j58j09j2M01k80l8J35o6P6k61O3J05Q0j13K55%k73OM1PJ19l0k5R5j98
4365Dq8J85k46J34n5q0O2L4Q3L74k00j84k4Q7j43K60l65K20j52J29J5l6J23j40
4389cj11R3J4kK40j46k51L22l55K46o8L48l99J14PK1l66J71K82k92K62q7M5k38
4413a53K86J8j81K1J30J21%n8q9N4l40J42k0l2J77j37K2k14K32j35J44OM4J28
4437A66j2j53L2j48k5J13J15l98L63K48m18j42K24M45j45o14M83j92n7K31K3k91
4459a52j24J72K31l59J29K33l05rpJ17j19L39L5j76j02k48L48j22J01O7j60l57
$$ plain form
4481 -468 -289 384 328 -177 -92 108 9 106 -113 -341 428 389 56 129 41 -408 455 634 320 38 -63 160
4503 160 -146 407 -274 135 224 59 358 61 -12 371 -797 -54 -2 801 410 385 -262 119 68 -1190 -472
4524 -472 -391 -679 -108 -31 -402 -522 -109 -605 -976 -222 -200 398 -630 171 278 502 34 -11 -236 21 299
4545 299 -768 221 -221 -233 66 -71 115 -100 -152 238 -22 145 480 -204 357 138 -264 -245 1348 -37
4565 -37 -230 -497 -208 -11 391 288 -88 22 -174 332 18 49 -23 129 466 57 24 165 65 423 457 228
4587 228 10 -55 26 -108 -663 158 251 -98 -192 10 -19 76 -86 -320 386 13 -44 110 -113 232 0 -342
4609 -342 143 -3 -280 -299 -12 -734 -45 -281 -67 733 -194 -405 -240 -47 -167 106 -543 206 163 -37 295
4630 295 11 -402 266 193 -441 -100 179 -34 76 -356 123 -74 -222 -177 143 -310 -466 -16 77 473 -8
$$ packed form
4481d68J79O73n6n05Q5K00r9R7k19k28P69l9l33P3q8m49Q63J79l14k82j01K23
4503A60l06N53o81M09Q9j65K99k97p3L83j168P43N2Q03l91k5o47L81n1j258P18
4524d72Q1k88N71P7l71j20M13m96l71P54K2N98j028Q01J07K24m68m5k25K57K78
4545B99j067R89m42j2K99j37J86k15n2L90k60J67L35o84N61k19m02J9J593j385
4565c7j93k67K89J97M02j03l76J10j96N06l14L1p2J52L37m09l3J41j00L58L4k29
4587B28k18o5Q1j34n55Q21R3l49r4K02k9R5j62k34P06l73n7J54k23L45k32l42
4609c42M85j46k77j9K87p22O89k36K14Q00r27k11J65J93j20K73o49P49m3k00L32
4630B95k84m13O68p3o34L41K79k13J10m32M79j97j48M5L20m53j56M50R3L96m81
$$ plain form
4651 -8 372 -193 88 31 -171 -149 -13 -507 123 -235 -561 363 -159 378 -100 -99 140 -150 244 91 214 -290
4673 -290 38 643 -95 174 5 -41 -370 -13 395 95 252 184 -247 107 81 162 -63 -57 437 327 201 -20
4695 -20 -35 367 72 30 -177 8 158 -227 154 -352 -52 -368 -265 -420 -34 566 112 -68 323 345 75
4716 75 -108 289 212 156 98 -261 515 219 55 74 263 -449 180 320 295 65 347 188 133 -175 277 664
4738 664 -116 334 -27 -167 400 -346 -331 71 397 -1 31 359 466 -247 -738 -45 -171 -271 104 202 -136
4759 -136 78 -196 567 361 425 -360 224 -377 271 63 196 -742 -117 -339 208 420 245 -34 385 133
4779 133 -65 -600 197 405 -79 111 -503 -108 570 102 474 -181 257 -4 228 249 -414 433 -67 212
4799 212 -101 589 -233 181 641 -232 104 -282 -230 374 -93 196 376 -134 -166 77 -1017 -217 -298 24 -324
$$ packed form
4651hL80n65K81n7k02K2J36m94O30l58l26R24n22N37m78JK39k90L94j53J23n04
4673b90L28O05p38K69j69m6l29L57M08l00J57o8m31L54k6Q1k25OM94j10j26k21
4695b0j5M02k95m2k07J85J50l85L81n06L00l16J03j55L86O00m54j80L91K2k70
4716G5j83L97p7n6n8l59P76k96j64J9J89p12O29J40k5k30K82j59n5l08M52L87
4738F64p80M50l61j40N67p46J5M02L26l98L2L28J07p13m91O93j26j00L75R8l38
4759a36K14k74P63k06O4p85N84o01O48k08J33r38O25k22N47K12j75k79M19k52
4779A33j98n35P97K08m84J90o14L95O78m68L72o55M38k61K32K1o63Q47n00K79
4799B12l13O90q22M14M60q73L36l86N2O04m67K89J80n10l2K43j094Q00q1L22l48
$$ plain form
4820 -324 133 191 93 -111 -203 587 -37 -383 -218 480 -3 448 347 297 -676 -249 -121 -189 411 -247 248 -621
4842 -621 -286 285 309 237 348 -57 224 18 91 187 -153 -71 -68 639 -56 -398 412 647 480 155 -275 182
4864 182 -147 -331 -240 -341 266 230 -227 394 331 -46 -350 7 -180 -736 -227 -329 -123 -166 365 318 443 -532
4886 -532 403 115 671 622 -64 -498 -31 371 -100 -943 -213 145 55 364 -419 -141 -161 835 222 2 203
4907 203 203 -501 271 368 260 -399 49 -270 145 -126 272 -210 99 424 -214 245 -822 -65 -755 404
4927 404 49 -298 -208 -365 1117 -29 253 572 -195 -103 103 -61 193 239 -336 -433 11 -309 186 389 2
4948 2 618 333 493 332 -250 -102 -596 14 -135 -425 515 -169 -663 414 121 -410 -44 153 -296 -376 92
4969 92 209 -300 520 -60 270 326 70 202 917 331 -337 563 316 585 798 704 185 -270 -315 -715 717
$$ packed form
4820c24M57N8r8k04r2P90o24l46J65O98m83M51j01n0r73M27J28o8O00o58M95q69
4842f21L35N71K4p2J11m05K81k06P3R6l40Q2LP07o95l42Q10K35j67l25m30M57
4864A82l29j84R1j01O07l6m57O21o3l77l04L57j87n56N09j02K06m3N31m7J25r75
4886e32R35k88N56m9o86m34M67M02m71q43P30L58r0L09p83K78k0R96o13k20K01
4907B03%p04P72R7j08o59M48l19M15k71L98m82L09L25o38M59j067P57o90J159
4927D04l55l47R0j57J482j146K82L19p67R2K06j64K54M6n75r7M44l20M95K03l87
4948BO16k85J60j61n82J48m94O10j49k90R40o84m94J077k93n31L66J97m49q0M68
4969I2J17n09Q20n80L30N6k56J32P15n86o68R00k47K69K13r4n19m55m5m00J432
$$ plain form
4990 717 735 -518 293 621 416 368 -28 -8 -319 269 -275 1598 616 782 -334 26 -147 719 205 -137
5010 -137 271 990 847 -55 -43 385 -282 -231 57 -344 -370 -238 -210 145 563 374 -18 -273 76 388 414 -795
5032 -795 216 164 -316 -10 -295 341 39 -443 -147 -52 923 -383 33 311 138 239 583 -72 -276 91
5052 91 -56 483 -172 -24 -314 184 -431 -553 -331 209 213 471 -221 331 285 787 220 17 411 192 -36
5073 -36 420 -333 575 -364 114 -825 854 25 86 -670 -440 -129 101 -428 -263 418 -631 -102 -55 208
5093 208 446 -14 866 465 329 186 -46 -277 -932 250 -225 291 156 149 133 -137 -593 429 -8 -633
5113 -633 552 333 -309 94 -180 2 -470 -65 -317 -24 361 -280 -379 439 -344 -142 -290 348 -223 194
5133 194 479 28 129 -202 -67 -143 -45 156 181 115 112 67 307 481 -106 39 130 -4 -17 -73 -44 34 -62 203
$$ packed form
4990G17J8j253Q11L28k05m8l96K0l11N88n44J873r82J66j116L60j73Q66n14l42
5010a37M08P19j43r02J2M28o67N1K88m01k6J32K8L55M18j89l92k55L49L12K6j209
5032g95J011n2m80L06k85O36l02m82K96R5R75j306M16K78j73J01L44o55k04L67
5052I1j47N39o55J48k90M98o15j22K22N40MK58o92N52m6N02n67k03L94k19k28
5073c6M56p53R08r39M78r39J679q29O1p56K30L11K30n29J65O81j049N29M7K63
5093B08K38m60Q80m01j36j43k32k31o55J182m75N16j35pj6k70m56J022m37o25
5113f33J185k19o42M03k74J82m72M05k52K93L85o41r9Q18p83K02j48O38n71M17
5133A94K85m51J01l31J35p6R8K01K5o6lm5K40J74n87J45R1j34j3n6K9P8r6K65
$$ plain form
5157 203 86 -98 -205 -32 -456 -118 157 149 -40 188 294 -129 208 -227 34 68 -169 -137 -24 -52 -63 129
5179 129 234 -267 -33 213 -62 -160 -63 106 102 -164 -194 -37 -16 -4 -58 161 -61 21 52 100 103 -141 208 -12
5203 -12 51 88 -7 283 47 -26 -63 78 -95 -129 364 -388 67 -199 -307 315 35 -97 -790 -435 -55 -246
5225 -246 -79 -95 233 -98 99 -168 -17 82 -136 6 47 140 -72 29 -67 17 -233 -7 -131 150 -141 199
5247 199 -263 124 -65 -28 142 -74 -113 -52 -28 74 216 -91 43 195 113 35 -93 193 42 7 218 -57
5269 -57 -6 199 -75 5 22 -201 -75 -33 38 -86 141 -220 81 177 140 20 -26 -99 24 39 29 -120 -133 95
5293 95 -78 72 -148 -183 -140 157 -199 168 -172 85 58 -50 183 -119 317 72 284 -5 27 -170 59 43
5315 43 62 97 95 110 275 695 -448 539 213 -64 133 -201 73 22 174 -204 -36 -104 -40 345 122 -10 29
$$ packed form
5157B03j17j84j07J73m24L38K75qj89K28J06m23L37m35K61L4k37L2J13k8j1J92
5179A29J05n01K34K46k75r8R7J69mk66l0J57K1J2n4K19k22Q2L1M8Lk44L49k20
5203a2O3L7r5K90k36p3l7J41j73l4M93p52M55k66j08O22k80j32o93L55L80j91
5225b46J67j6L28l31J97k67J51R9k18J42M1R3k12J01r6Q4k50K26j24K81k91L40
5247A99m62L87j89L7J70k16l9O1K4J02J42l07J34J52q2p8j28K86j51l5K11k75
5269e7N1K05k74Q0J7k23J26M2P1j24K27l61L01R6l7j20m6p3J23J5j0j49j3K28
5293I5j73J50k20l5M3K97l56L67l40K57k7j08K33l02M36k45K12k89L2j97K29j6
5315D3J9L5kJ5J65M20j143R87l26k77J97l34K74n1J52l78J68o8O4L85k23j32L9
$$ plain form
5338 29 91 130 33 153 -15 -118 79 58 227 -29 119 -55 -188 -258 226 16 96 -142 127 -191 122 176 179
5361 179 -65 -188 -5 -97 47 -365 75 45 56 -116 -79 231 -68 120 -56 70 19 77 -81 165 181 114 370
5384 370 107 14 -93 118 -156 181 96 116 218 77 266 -125 78 26 -71 -45 197 83 -68 -17 29 -36 -18
5407 -18 144 59 -92 108 184 296 163 79 194 97 50 -214 -149 116 -111 111 -116 12 -48 166 -84 170 -4
5430 -4 -110 -8 -212 49 99 43 -112 11 -55 -191 -57 -109 154 83 162 110 -133 225 -210 -120 130 116 -26 -231
5454 -231 -86 124 184 52 0 184 -310 90 296 29 264 -108 123 69 117 127 -264 -527 123 -107 -51 -45 109
5477 109 53 7 -208 -132 -201 -249 -182 167 163 -303 257 91 40 33 215 -212 -332 -9 -114 189 9 155 241 89
5501 89 -95 -293 -415 6 -23 81 -17 -468 -559 -510 -320 -109 -9 -518 -598 -349 528 -331 271 345 18 -173
$$ packed form
5338B9O2L9r7J20j68j03J97k1J69k56J48j74j33p0M84k10Q0k38K69l18L13N4L
5361A79k44j23J83r2J44m12M40l0J1j72L7L10k99J88j76J26n1N8j58K46J6o7K56
5384C70k63r3j07K11k74L37q5K0J02j41J89l91K03n2r7K6K42j14j51N1M6o5J8
5407a8J62q5j51K00P6J12j33q4J15r7m7k64O5K65k27K22k27J28o0K14k50K54j74
5430dj06J02k04K61N0n6j55J23o6j36J34n2K63p1P9n2k43L58m35R0K50j4j42k05
5454b31J45K10O0j32n2J84m94M00K06k67K35l72K31n4M8J0l91k63O50k30N6OJ54
5477A09n6m6k15P6o9m8O7L49mm66N60j66n1pJ82m27j20L23j05L03j80J46Q6j52
5501H9j84j98j22M21k9J04r8m51r1M9J90K11J00n09q0K49Q77q59O02P4l27j91
$$ plain form
5523 -173 -144 179 437 -469 -538 456 21 -286 -533 -359 29 -122 -100 141 82 6 84 -160 133 -21 -76 30
5545 30 -163 -449 87 129 176 255 39 -364 96 -194 57 -158 -308 251 70 170 271 203 50 -249 -112 10
5567 10 19 65 -19 -127 9 -15 -85 217 -10 45 34 -75 -125 -128 25 246 -145 -73 -83 -118 -141 201 346 155 -42
5592 -42 14 -229 -437 -191 223 -303 -19 316 -138 -409 -675 415 -76 -66 398 -70 -280 -140 -828 53 -691
5613 -691 514 110 24 -356 220 -322 -18 -1129 -139 -192 26 232 -280 16 -134 232 -267 111 278 -230
5633 -230 -568 -140 62 -89 238 -79 -177 -50 -568 235 -59 -131 -207 56 -114 -59 -120 137 -190 -153 29 149
5655 149 57 -20 -5 -66 -85 -327 169 -89 39 -130 40 43 249 -94 -214 81 -151 41 -191 147 27 -192
5677 -192 -244 -58 -109 7 -36 71 -129 -140 -214 97 36 -169 105 34 -195 90 32 -192 64 -117 48 3 -349
$$ packed form
5523a73K9L23K58r06o9R94m35l07k47J74L88j51K2K41n9p6P8k44K93j54n5J06
5545C0j93k86N36M2M7P9k16m03M60k90K51k15j50N59j81J00J01o8j53k99J37J22
5567A0RM6q4j08J36k4p0L02k27N5j1j09n0lJ53K21l91P2j0l5k3L42J45j91j97
5592d2N6k43k08K46M14n26K84L35m54k71k66J090m91J0M64m68k10J40o88Q81p44
5613f91J205m04q6l80N76n42L04j111R90n3K18K06n12K96j50L66m99L78J67n08
5633b30l38M28K02j51L27l17r8J27n18Q03k94p2p6K63j70N5o1K57l27L7J82J20
5655A49r2p7J5o1j9k42M96k58J28j69J70LK06l43j20K95k32J92k32L38j20k19
5677a92n2J86n1J16m3J07k00j1p4L11o1k05K74p1k29K85n8k24K56j81J65m5l52
$$ plain form
5700 -349 -49 -5 62 231 -68 -92 41 -33 32 -56 1 58 27 -16 -141 -301 144 201 157 -58 269 282 -20 -23 -70
5725 -70 134 200 255 -35 41 -58 -35 -278 39 11 -54 -380 -77 -135 -54 -116 35 -43 -211 -73 -7 98 -172 -170 -67
$$ packed form
5700c49L00M4O7J69k99k4J33p4O5q8N7N7l1m3j25j60M45N7m4k15L27J3l02lm7
5725g0K04O6N5k90P6r9K3k43L17k8o5l26L03n8Q1o2J51p8j68J38O6J05k70KJ03
$$ [...]
8191d41
##END NTUPLES=NMR FID
##END=
