##TITLE=1H_SL59(Ac20-Py-2H)
 CDCl3, 8 sc, 
 16.12.2020
##JCAMPDX= 6.0         $$ Bruker NMR JCAMP-DX V2.0
##DATA TYPE= NMR FID
##DATA CLASS= NTUPLES
##ORIGIN= UXNMR, Bruker Analytische Messtechnik GmbH
##OWNER= root
$$ XWIN-NMR		Version 3.5
$$ Wed Dec 16 10:34:41 2020 Russian Standard Time (UT+4h)  she@DPX200
##.OBSERVE FREQUENCY= 200.1315066352
##.OBSERVE NUCLEUS= ^1H
##.DELAY= (6, 6)
##.ACQUISITION MODE= SIMULTANEOUS
##.ACQUISITION SCHEME= undefined
##.AVERAGES= 8
##.DIGITISER RES= 18
##SPECTROMETER/DATA SYSTEM= spect
##.PULSE SEQUENCE= zg30
##.SOLVENT NAME= CDCl3
##.SHIFT REFERENCE= (INTERNAL, CDCl3, 0, 15.7039)
##AUDIT TRAIL= $$ (NUMBER, WHEN, WHO, WHERE, WHAT)
$$ ##TITLE= Audit trail, XWIN-NMR		Version 3.5
$$ ##JCAMPDX= 5.01
$$ ##ORIGIN= Bruker BioSpin GmbH
$$ ##OWNER= she
$$ F:/spectra/data/she/nmr/H-F/1/audita.txt
$$ ##AUDIT TRAIL=  $$ (NUMBER, WHEN, WHO, WHERE, WHAT)
(   1,<2020-12-16 10:33:31.43 +0400>,<she>,<DPX200>,
      <created by zg, POWCHK disabled, PULCHK disabled
       configuration hash MD5:
       00 E9 B6 7A A2 85 ED C7 34 08 36 98 17 FE 4E 26
       data hash MD5: 16K
       11 AA A3 85 F4 69 6C 3A 4A 0E AB 36 39 94 F8 C4>)
$$ ##END=
$$ 
$$ hash MD5
$$ 31 34 E3 E5 64 3B C2 D2 05 C1 D9 E9 15 00 80 CF
##$RELAX= 
##$RELAX= 
##$RELAX= 
##$RELAX= 
##$RELAX= 
##$RELAX= 
$$ Bruker specific parameters
$$ --------------------------
##$DU= <F:/spectra>
##$EXPNO= 1
##$NAME= <H-F>
##$PROCNO= 1
##$TYPE= <nmr>
##$USER= <she>
##$AMP= (0..31)
100 100 100 100 100 100 100 100 100 100 100 100 100 100 100 100 100 100 
100 100 100 100 100 100 100 100 100 100 100 100 100 100 
##$AQSEQ= 0
##$AQ_mod= 1
##$AUNM= <au_zg>
##$AUTOPOS= <>
##$BF1= 200.13
##$BF2= 200.13
##$BF3= 200.13
##$BF4= 200.13
##$BF5= 200.13
##$BF6= 200.13
##$BF7= 200.13
##$BF8= 200.13
##$BYTORDA= 1
##$CFDGTYP= 0
##$CFRGTYP= 5
##$CHEMSTR= <none>
##$CNST= (0..31)
1 1 145 1 1 1 1 1 1 1 1 1 1 1 1 1 1 1 1 1 1 1 1 1 1 1 1 1 1 1 1 1 
##$CPDPRG= <>
##$CPDPRG1= <>
##$CPDPRG2= <>
##$CPDPRG3= <>
##$CPDPRG4= <mlev>
##$CPDPRG5= <mlev>
##$CPDPRG6= <mlev>
##$CPDPRG7= <mlev>
##$CPDPRG8= <mlev>
##$CPDPRGB= <>
##$CPDPRGT= <>
##$D= (0..31)
0 1.2 0 0 0 0 0 0 0 0.06 0 0.03 0 0 0 0 0.0002 0 0 0 0 0 0 0 0 0 0 0 0 
0 0 0 
##$DATE= 1608100410
##$DBL= (0..7)
120 120 120 120 120 120 120 120 
##$DBP= (0..7)
150 150 150 150 150 150 150 150 
##$DBP07= 0
##$DBPNAM0= <>
##$DBPNAM1= <>
##$DBPNAM2= <>
##$DBPNAM3= <>
##$DBPNAM4= <>
##$DBPNAM5= <>
##$DBPNAM6= <>
##$DBPNAM7= <>
##$DBPOAL= (0..7)
0.5 0.5 0.5 0.5 0.5 0.5 0.5 0.5 
##$DBPOFFS= (0..7)
0 0 0 0 0 0 0 0 
##$DE= 6
##$DECBNUC= <off>
##$DECIM= 32
##$DECNUC= <off>
##$DECSTAT= 4
##$DIGMOD= 1
##$DIGTYP= 9
##$DL= (0..7)
0 120 120 120 120 120 120 120 
##$DP= (0..7)
150 150 150 150 150 150 150 150 
##$DP07= 0
##$DPNAME0= <>
##$DPNAME1= <>
##$DPNAME2= <>
##$DPNAME3= <>
##$DPNAME4= <>
##$DPNAME5= <>
##$DPNAME6= <>
##$DPNAME7= <>
##$DPOAL= (0..7)
0.5 0.5 0.5 0.5 0.5 0.5 0.5 0.5 
##$DPOFFS= (0..7)
0 0 0 0 0 0 0 0 
##$DQDMODE= 0
##$DR= 18
##$DS= 0
$$ [...]
##$SUBNAM2= <"">
##$SUBNAM3= <"">
##$SUBNAM4= <"">
##$SUBNAM5= <"">
##$SUBNAM6= <"">
##$SUBNAM7= <"">
##$SUBNAM8= <"">
##$SUBNAM9= <"">
##$SW= 16.9725356469052
##$SWIBOX= (0..15)
0 0 2 0 0 0 0 0 0 0 0 0 0 0 0 0 
##$SW_h= 3396.73913043478
##$TD= 16384
##$TD0= 1
##$TE= 0
##$TE2= 300
##$TE3= 300
##$TEG= 300
##$TL= (0..7)
0 120 120 120 120 120 120 120 
##$TP= (0..7)
150 150 150 150 150 150 150 150 
##$TP07= 0
##$TPNAME0= <>
##$TPNAME1= <>
##$TPNAME2= <>
##$TPNAME3= <>
##$TPNAME4= <>
##$TPNAME5= <>
##$TPNAME6= <>
##$TPNAME7= <>
##$TPOAL= (0..7)
0.5 0.5 0.5 0.5 0.5 0.5 0.5 0.5 
##$TPOFFS= (0..7)
0 0 0 0 0 0 0 0 
##$TUNHIN= 0
##$TUNHOUT= 0
##$TUNXOUT= 0
##$USERA1= <user>
##$USERA2= <user>
##$USERA3= <user>
##$USERA4= <user>
##$USERA5= <user>
##$V9= 5
##$VALIST= <valist>
##$VCLIST= <CCCCCCCCCCCCCCC>
##$VD= 0
##$VDLIST= <DDDDDDDDDDDDDDD>
##$VPLIST= <PPPPPPPPPPPPPPP>
##$VTLIST= <TTTTTTTTTTTTTTT>
##$WBST= 1024
##$WBSW= 4
##$XGAIN= (0..3)
0 0 0 0 
##$XL= 0
##$YL= 0
##$YMAX_a= 138532
##$YMIN_a= -155605
##$ZGOPTNS= <>
##$ZL1= 120
##$ZL2= 120
##$ZL3= 120
##$ZL4= 120
##$ABSF1= 10
##$ABSF2= 0
##$ABSG= 5
##$ABSL= 3
##$ALPHA= 0
##$AQORDER= 0
##$ASSFAC= 0
##$ASSFACI= 0
##$ASSFACX= 0
##$ASSWID= 0
##$AUNMP= <proc_1d>
##$AZFE= 0.1
##$AZFW= 0.1
##$BCFW= 1
##$BC_mod= 2
##$BYTORDP= 1
##$COROFFS= 0
##$CY= 11.3945322036743
##$DATMOD= 1
##$DC= 2
##$DFILT= <>
##$DTYPP= 0
##$F1P= 15.9154993809931
##$F2P= -4.1035820241983
##$FCOR= 0.5
##$FTSIZE= 0
##$FT_mod= 4
##$GAMMA= 1
##$GB= 0.15
##$INTBC= 1
##$INTSCL= 1
##$ISEN= 128
##$LB= 0.24
##$LEV0= 0
##$LPBIN= 0
##$MAXI= 10000
##$MC2= 0
##$MEAN= 0
##$ME_mod= 0
##$MI= 1.114404
##$NCOEF= 0
##$NC_proc= 0
##$NLEV= 6
##$NOISF1= 3.799351
##$NOISF2= 2.8
##$NSP= 1
##$NTH_PI= 0
##$NZP= 0
##$OFFSET= 15.70392
##$PC= 1
##$PHC0= -10762.31
##$PHC1= 13.60089
##$PH_mod= 1
##$PKNL= yes
##$PPARMOD= 0
##$PSCAL= 0
##$PSIGN= 0
##$REVERSE= no
##$SF= 200.130013532006
##$SI= 16384
##$SIGF1= 3
##$SIGF2= 2
##$SINO= 400
##$SIOLD= 16384
##$SREGLST= <1H.CDCl3>
##$SSB= 0
##$STSI= 0
##$STSR= 0
##$SW_p= 3612.71676300578
##$SYMM= 0
##$S_DEV= 0
##$TDeff= 0
##$TDoff= 0
##$TI= <>
##$TILT= no
##$TM1= 0
##$TM2= 0
##$TOPLEV= 0
##$USERP1= <user>
##$USERP2= <user>
##$USERP3= <user>
##$USERP4= <user>
##$USERP5= <user>
##$WDW= 1
##$XDIM= 8192
##$YMAX_p= 0
##$YMIN_p= 0
$$ End of Bruker specific parameters
$$ ---------------------------------
##NTUPLES= NMR FID
##VAR_NAME=  TIME,          FID/REAL,        FID/IMAG
##SYMBOL=    X,             R,               I
##VAR_TYPE=  INDEPENDENT,   DEPENDENT,       DEPENDENT
##VAR_FORM=  AFFN,          ASDF,            ASDF
##VAR_DIM=   8192,          8192,            8192
##UNITS=     SECONDS,       ARBITRARY UNITS, ARBITRARY UNITS
##FACTOR=    0.0002944,     1,               1
##FIRST=     0,             0,               0
##LAST=      2.4114304,     0,               0
##MIN=       0,             -155605,         0
##MAX=       2.4114304,     138532,          0
$$ Real data points
##PAGE= N=1
##DATA TABLE= (X++(R..R)), XYDATA
0@%%%%%%%%%%%%qJ6j6J6j6K4l2L2m0M8n6P2q0Q8j04J21j43J66j88K12k40K73l09
$$ 0 0 0 0 0 0 0 0 0 0 0 0 0 -8 8 -8 8 -8 16 -16 16 -24 24 -32 40 -40 48 -56 65 -78 88 -100 112 -128 145 -164
35a64L48l90M36m87N43o04O70p42Q21r08J003j105J218j342J477j626J791j974
$$ -164 184 -206 230 -257 286 -318 352 -390 431 -477 526 -579 639 -703 774 -852 939 -1035
53a035K177k406K665k960L300l695M162m725N419o293P431q982J1219j4721K0952
$$ -1035 1142 -1264 1401 -1559 1741 -1954 2208 -2517 2902 -3391 4040 -4942 6277 -8444 12508
68A2508l5060J15944l475k24233K72848j32517r7024J78534j29688J0938Q5347
$$ 12508 -22552 93392 89917 -134316 138532 6015 -91009 87525 -42163 -31225 54122
79E4122r4675P0995j6721l9342N7175m3195p119M0558k5457Q98K1416m776j8186
$$ 54122 -40553 30442 13721 -25621 31554 -11641 -18760 21798 -3659 -2761 18655 13879 -4307
92d307K2642j4160j5300L1087l6817J2289K6612o3411N0575o73n8519P6306k6601
$$ -4307 18335 4175 -11125 19962 -16855 -4566 22046 -41365 9210 8537 -49982 26324 -277
105b77k3815O5432n0756J1979J7746n1161M2414k1929j9367N5561m2611O636L6027
$$ -277 -24092 41340 -9416 2563 20309 -30852 11562 -10367 -29734 25827 -16784 -10148 25879
118B5879m9687J3863J4893l3941J9084J5035j6410J8306J6979k8994J4590J1399
$$ 25879 -23808 -9945 4948 -28993 -9909 5126 -11284 7022 24001 -4993 9597 20996
130B0996n0789L0760P257n2543O1945j0487l9315P0256m6387j1600N4714o5265
$$ 20996 -29793 967 8224 -44319 17626 7139 -32176 38080 -8307 -19907 34807 -30458
142c0458L1763K7792n8877N9095j4023l6090N4869m2683O14L1822m3614L0097
$$ -30458 1305 29097 -29780 29315 15292 -20798 34071 -8612 -7998 23824 -19790 10307
154A0307j860k9571L6643k5264m569L3952k5679J0573K0553k1953M971M454k0016
$$ 10307 8447 -21124 15519 -9745 -14314 19638 -6041 4532 25085 3132 8103 12557 -7459
167g459J200O618j3950J1252J2484j9636K2509m467k9605L2752k1856j6716M7093
$$ -7459 -6259 359 -13591 -2339 10145 -9491 13018 8551 -21054 11698 -10158 -26874 20219
180B0219l2190P672L6349m4863K1468N677m0236L3314j5600j6118L6587k6660
$$ 20219 -11971 -4299 32050 -12813 8655 14332 -25904 7410 -8190 -24308 12279 -14381
192a4381M491K3042k8941J4837R163k1504J6692L959j5442J2297L828j6896R113
$$ -14381 -9890 13152 -15789 -952 8211 -13293 3399 7358 -8084 4213 8041 -8855 258
205B58N787k0379J6261L116k0337K4448j0747j4251K8556k5027N643K7793l2301
$$ 258 6045 -14334 1927 5043 -15294 9154 -1593 -15844 12712 -12315 -6672 21121 -11180
218a1180K5754Q362l5864L3168j8051k3242L6114k9033M279L0708l2593K0337
$$ -11180 14574 22936 -12928 20240 2189 -21053 15061 -13972 -9693 21015 -11578 8759
230H759Q584l1464K3172p796j5276K3912j0124K394J4943j4177N798O07j7987
$$ 8759 17343 -14121 9051 1255 -14021 9891 -233 2161 17104 2927 8725 9332 -8655
243h655P986q10j4047J5794K902j4355J8537k219j6495K1237r212q832K3019j9929
$$ -8655 -669 -1479 -15526 268 3170 -11185 7352 5133 -11362 9875 663 -8169 14850 -5079
257e079K730J4238k9000J7726K694k3447K9074q673j3189K4806k1176j89J3161
$$ -5079 -2349 11889 -17111 615 3309 -20138 8936 263 -12926 11880 -9296 -9485 3676
270C676j9897J6238M202j1457K1654p524j0602J3582j2655j0232J0406l154o643
$$ 3676 -16221 17 4219 -7238 14416 6892 -3710 9872 -2783 -13015 -2609 -5763 -12406
283a2406J3981L927r946J2178k729j2082J1946p774m63J1734j1178J2041n48j3229
$$ -12406 1575 5502 -4444 7734 5005 -7077 4869 -2905 -3368 8366 -2812 9229 8681 -4548
297d548J7409j6455m589J9276k4545J1652J3673k6121K2563J867k1821K5676q156
$$ -4548 12861 -3594 -8183 11093 -13452 -1800 11873 -14248 8315 10182 -11639 14037 5881
310E881j2103K1226j3839l217J1186j4346K850N642j1767R313M115j1347J1178
$$ 5881 -6222 15004 1165 -2052 9134 -5212 -2362 3280 -8487 826 4941 -6406 4772
323D772K49j5571J3217j874j3997K1125m222q055K0553j5535m976J2244k3094
$$ 4772 5021 -10550 2667 793 -13204 7921 3699 -4356 16197 662 -4314 7930 -15164
336a5164O802Q192j7121J8862J797j0771J6715r023n763R693j0778L161N805o989
$$ -15164 -8362 -170 -17291 1571 3368 -7403 9312 289 -5474 4219 -6559 -3398 2407 -4582
350d582P855L98p187N561k503o573M995N62m908N955J614m882N540q46j176O771
$$ -4582 3273 3671 -3516 2045 -458 -7031 -2036 -1474 -6382 -427 1187 -3695 1845 999 -177 6594
366F594n441M543K820j2621Q992l554j3243J6005n025o977J8631r403k417J1625
$$ 6594 1153 5696 8516 -4105 4887 1333 -11910 4095 -930 -7907 10724 1321 -1096 10529
380A0529j3753K924M276r808J1159q51n190J2865q867m688R310j4259o66R591
$$ 10529 -3224 -300 3976 -5832 5327 4476 -714 12151 3284 -1404 7906 -6353 -7019 2572
394B572j1673N957R989j0288P541L484j1589P144k351o589R495n588J91P215j0264
$$ 2572 -9101 -3144 6845 -3443 4098 7582 -4007 3137 786 -5803 3692 -1896 -1705 5510 -4754
409d754M561K380j2507J0916j476r849J4666n855n741J3525q940l04J0480r878
$$ -4754 -193 2187 -10320 596 -880 -10729 3937 -1918 -7659 5866 -3074 -3378 7102 -2776
423b776M176L743r751N573l323o857Q342n284M65J1037o347K147P087j1203K040
$$ -2776 1400 5143 -4608 965 -2358 -9215 -873 -6157 -5692 5345 -1002 1145 8232 -2971 -931
438i31M019r973O741N274o613P471J153q265M161l504o044N709k461N87P107m101
$$ -931 3088 -6885 -144 5130 -1483 5988 7141 -1124 3037 -467 -6511 -802 -3263 -2676 4431 330
454C30L207L958p825M687N99q816Q786j928p769J0576n815n198J0718q203m93
$$ 330 3537 7495 -330 4357 4956 -3860 4926 2998 -4771 5805 -10 -5208 5510 -2693 -3186
469c186Q923r582M349L959r597Q005j585n828J0811n807k225R670j1025j21O040
$$ -3186 5737 -3845 504 4463 -5134 2871 1286 -4542 6269 462 -1763 7907 -3118 -3239 2801
484B801j2082M271N307q321Q397L372p239P671j800p790P126m466l377R381n691
$$ 2801 -9281 -5010 297 -8024 373 3745 -3494 4177 2377 -5413 1713 -2753 -6130 3251 -2440
499b440J386P112q772K053K255j0529O976n9m627J0189k518k237Q554o971l50
$$ -2440 -1054 6058 -2714 -661 1594 -8935 -1959 -2018 -6645 3544 1026 -1211 7343 372 22
514B2M456p412L667J404n074M433j070l415M646j951j051M664j917j490M273l635
$$ 22 4478 -2934 733 2137 -2937 1496 426 -2989 1657 -294 -1345 3319 1402 -88 4185 550
530E50k085N533m577J165N963o637M199J683j0031O889m169p240J1572n851P1
$$ 550 -1535 3998 -579 586 6549 -88 4111 5794 -4237 2652 -1517 -8757 2815 -3036 -2965
545b965J1402r141L944L674j0579O325k787o152J0154o042q69R204r731J554N442
$$ -2965 8437 -704 3240 6914 -3665 2660 -127 -6279 3875 -2167 -3036 6168 -3563 -2009 3433
560C433r908L731L496o621N824J546m580O343j991l851O496n298k677P340p723
$$ 3433 -6475 -2744 752 -5869 -45 1501 -3079 3264 1273 -2578 3918 -1380 -4057 3283 -4440
575d440N89O737r439M744L597p846R483k161n472J1032q830j315R514j1144L908
$$ -4440 -3851 2886 -6553 -1809 1788 -6058 3425 1264 -4208 6824 -2006 -3321 6193 -4951 -1043
590a043P228r917O424K283q622N283l091l299N398l255K483N457m092K718K873
$$ -1043 6185 -3732 2692 4975 -3647 1636 -1455 -4754 644 -2611 -128 5329 1237 3955 6828
605F828o945O38K828p196K741M617o071M677K196p025O279l616m851Q802o632
$$ 6828 -117 521 3349 -3847 -1106 3511 -2560 2117 4313 -2712 3567 -49 -4900 3902 -2730
620b730O38Q735j0172N545L612j0207R059k583o513R615p388k528P732q249J541
$$ -2730 -2092 6643 -3529 2016 5628 -4579 4480 1897 -4616 4999 -2389 -4917 2815 -5434 -3893
635c893O224o378M492L075m409K039j37l731K211j368j715N165k808o70O171o750
$$ -3893 2331 -4047 445 3520 -889 1150 1013 -2718 -507 -1875 -3590 1575 -1233 -1903 4268 -2482
651b482p96O057r313K500O559q304P274K949o634P374l915l299M986o655K672
$$ -2482 -3278 2779 -6534 -4034 2525 -5779 1495 4444 -2190 5184 1269 -2030 2956 -3699 -1027
666a027K990o595P145j304m167O709m248j646N269m473J231L461l208J359J998
$$ -1027 1963 -4632 2513 1209 -2958 3751 -497 -2143 3126 -1347 -116 3345 137 1496 3494
681C494k943O59J273k814P88J285l646J794O65l895M992j318j605P313n876O97
$$ 3494 551 1210 2483 -331 457 1742 -1904 -110 555 -3340 1652 334 -1271 6042 166 863
697H63N391j0488M140K852r299Q514l39n492R131n677k318N177q257L341K825
$$ 863 6254 -4234 -94 2758 -6541 1973 1634 -3858 5273 -404 -2722 2455 -5802 -2461 364
712C64n511P272j7m127O421l351m201N095m051l143O133l112j902O383m182n90
$$ 364 -5147 2125 2108 -2019 4402 1051 -3150 1945 -2106 -5249 884 -2228 -4130 2253 -1929 -2519
728b519N351o047K904K907o498O696k343m784R820q078L20Q577j0802N047L970
$$ -2519 2832 -3215 -311 2596 -3902 2794 451 -4333 5487 -2591 -2271 6306 -4496 551 4521
743D521j0751P905j018o362R277l885r47O947n110J278K444m847J174J19k707
$$ 4521 -6230 1675 657 -5705 3572 -313 -1260 5687 577 1855 4299 -548 626 745 -1962
758a962K616M20j227K340r3l344L303j814m075O534k901j950P805n072k06N120
$$ -1962 654 1074 -153 2187 2094 -1250 2053 239 -3836 2698 -203 -2153 5652 580 374 5494
774E494p535K630Q20n849N682k584j988O253n716J516M337o139L558J113m270
$$ 5494 -2041 589 1409 -4440 1242 -1342 -3330 2923 -2793 -1277 3060 -3079 479 1592 -2678
789b678L983r86k784L341k088p95L065k045o08K835l267l89K741m207J674L358
$$ -2678 1305 319 -2465 876 -1212 -2007 1058 -987 -1595 1240 -2027 -2416 325 -3882 -2208 1150
805A150l646M390J630n511N910l389m919O680n839J33O516o022L557K575n125
$$ 1150 -2496 1894 3524 -1987 3923 534 -4385 2295 -3544 -3411 3105 -2917 640 3215 -1910
820a910M371k506k320N297m641J163N067n607K792K448n066K316J013m253K105
$$ -1910 2461 -45 -2365 2932 -1709 -546 4521 -1086 1706 4154 -912 1404 2417 -1836 269
835B69N06k539K405J23j488L213j655q97L812l476m31L459m929J409K080m646
$$ 269 775 -1764 641 764 -724 2489 834 -63 3749 273 -158 3301 -1628 -219 1861 -2785
851b785L853m34k964M911l683j154M660o058J428M931n522L236L290n073K667
$$ -2785 1068 634 -2330 2581 -1102 -2256 2404 -3654 -2226 2705 -2817 419 3709 -1364 1303
866A303J41m240K226j188j877L268r37j68L377k702j44K812m671J208K577l870
$$ 1303 1444 -2796 -570 -1758 -3635 -367 -1304 -1472 1905 -797 -941 1871 -2800 -1592 985 -2885
882b885L655R41l687M678k225k973M717m458LM458n229K425K603m500M241n7k549
$$ -2885 770 1711 -1976 2702 477 -2496 2221 -2237 -2234 2224 -3005 -580 2023 -2477 1764 1707 -842
899h42M678l413j52K961n322J834K076m443L428J579l856L773k08l322K570j564
$$ -842 3836 423 271 3232 -2090 -256 1820 -2623 805 2384 -1472 2301 2093 -1229 1341 -223
915b23j469L349j785N05K829k820J232Q93m520J976K27l556L888o50j734M541
$$ -223 -1692 1657 -128 377 3206 386 1618 2511 -2009 -33 194 -3362 526 -124 -1858 2683
931B683k645r98L525l806J79K585l507J390J676k524J731Nj897J677j526j8J280
$$ 2683 38 -960 2565 -1241 -1062 1523 -1984 -594 1082 -1442 289 294 -1603 74 -1452 -1470 -190
948a90k159J387J383k902K922Q35l611L796J94l949M018j673l326L983j816j174
$$ -190 -2349 -962 421 -2481 441 1276 -2335 1461 1655 -2294 1724 51 -3275 708 -1108 -2282
964b282L934k100O26J798l051J791k81k852L661r89j549M846k971m34L478m647
$$ -2282 1652 -448 178 1976 -1075 716 435 -2417 1244 255 -1294 3552 581 147 3625 -1022
980a022K43K220m072K118J848k526L085P4k263K963k164j001K309k716Q66J941
$$ -1022 -779 1441 -2631 -513 1335 -1191 1894 1968 -295 2668 504 -497 1812 -904 -38 1903
996A903l301J977R19k704K114j99k082K212j161j253K328j639k58K247j529R88
$$ 1903 -1398 579 1498 -1206 908 709 -1373 839 -322 -1575 753 -886 -1144 1103 -426 562
1012E62J048k568J309k38k822K746j396j671M285j910j185M418l465n66K842l293
$$ 562 1610 -958 351 113 -2709 37 -1359 -3030 1255 -655 -1840 2578 -887 -1453 1389 -1904
1028a904M40K072k085J551Q11j759K195j597j319K211k692M79K961l103J900K107
$$ -1904 -1464 608 -1477 74 885 -874 1321 -276 -1595 616 -2076 -1597 1364 -1739 161 2268
1044B268l267K069J036l127K147j08k665L010r79j535L246k422j50K616l185J905
$$ 2268 -999 1070 2106 -1021 1126 1018 -1647 1363 384 -1151 2095 -327 -477 2139 -1046 859
1060H59M87k985L349j205j935L983k246n11L679l896L97J642l682J314Q01k026
$$ 859 1346 -1639 1710 505 -1430 2553 307 -204 3475 -421 -24 1618 -2064 -750 51 -1975
1076a975K525K33j139K166j281r18J027j827NJ435j647J057J700k472J279P15
$$ -1975 550 783 -356 1810 529 -389 638 -1189 -1184 251 -1396 -339 1361 -1111 168 883
1092H83l027J790J5k165K592p40q64K547j863O35J563k774J949k30k693L005j565
$$ 883 -2144 -354 -339 -2504 88 -652 -1516 1031 -832 -197 1366 -1408 541 311 -2382 623 -942
1109i42j062L015j901n5K595k441M60J946k618M19J526k518J905J247k180K218
$$ -942 -2004 1011 -890 -945 1650 -791 -331 1615 -1003 -584 942 -1576 329 1576 -604 1614
1125A614l96j823K246j846j363K849k361O96K264k830K303J228l530K787q60k787
$$ 1614 1218 -605 1641 -205 -1568 1281 -1080 -384 1880 -950 1353 2581 -949 1838 978 -1809
1141a809L434j930o14L122k392N67J513l138J653K19k418K322l95j182K118r74
$$ -1809 1625 -305 -919 2203 -189 378 1891 -1247 406 625 -1793 529 134 -1048 1070 96
1157I6m87J689j420l77J398k031L15R19j865Q24J196j905J958N10k417K799j491
$$ 96 -391 1298 -122 -499 899 -1132 -817 102 -1763 -939 257 -1648 310 820 -1597 1202 -289
1174b89j567K387k079J82K320k338J582R64k505K287q55k388K626j375n33K964
$$ -289 -1856 531 -1548 -1366 954 -1384 198 1162 -1343 944 89 -2299 327 -1048 -1581 1383
1190A383j817O71J537j966M45P78j743N51P24j382J476J71j357K075j019j078
$$ 1383 -434 237 1774 -192 253 1031 -712 -161 563 -819 657 828 -529 1546 527 -551
1206e51K487k234k47K180k644J422J580l054K396M01k848L063j637j420K420k318
$$ -551 1936 -298 -545 1635 -1009 413 1993 -1061 1335 1736 -1112 1951 314 -1106 1314 -1004
1222a004M53J677k259J972M0j699K238j407r50K015k068j28J798j329M14J039
$$ -1004 -551 1126 -1133 839 879 -820 1418 11 -939 1076 -992 -1120 678 -651 -237 802
1238H02j201K67M09j564O9J036j528J305M56q43J955j427m77J642k635J010J291
$$ 802 -399 -132 277 -1287 -1218 -182 -1710 -405 51 -792 1163 -264 -741 901 -1734 -724 567
1255E67k989K724J30k329L132j124j617L168k514n8K134k419Q89J141j771J829
$$ 567 -2422 302 432 -1897 1235 111 -1506 1662 -852 -910 1224 -1195 -306 835 -936 893
1271H93l03q50J545o88j289J455j113q29K125j022n6K450k038j63K908l739R01
$$ 893 590 -260 1285 597 -692 763 -350 -1179 946 -76 -132 2318 280 117 3025 -714 187
1288A87J187k933K237j60j322K864k292J76K028l343J932L50l012L014j97j875
$$ 187 1374 -1559 678 518 -804 2060 -232 -56 1972 -1371 561 911 -2101 913 716 -1159
1304a159K633j320o27J738j578k87Q36j245N41L96o12O88L06j288J582n88j282
$$ -1159 1474 154 -473 1265 -313 -600 236 -1009 -468 -72 -684 4 310 -978 604 16 -1266
1321a266J477p20j179K690j992m64L125k853O66J716l076J812L44k217K326k79
$$ -1266 211 -509 -1688 1002 -990 -1454 1671 -1182 -516 1200 -1876 -64 280 -1937 389 110
1337A10j005K086j283L7R55j640P91J31j485J537J00q16J519k54q38J006n26j032
$$ 110 -895 1191 -92 -55 900 -740 51 182 -1303 234 334 -482 1037 783 -55 951 425 -607
1355f07J309m60p80J568r23M47R03j922J652j70j675J889j341j201K549k244M25
$$ -607 702 242 -538 1030 107 554 1457 -465 1187 1017 -658 1231 -110 -1311 1238 -1006 -581
1372e81K526k699J427P85k234J738m71j730J756p79n04J744j418M03R28j830O96
$$ -581 1945 -754 673 1458 -776 962 491 -1239 517 -262 -766 978 -440 -37 891 -939 -243
1389b43N43k074J684M09j808J746K11j673J931m62j550J469j105J2J139j590J057
$$ -243 300 -1774 -90 319 -1489 257 468 -1205 726 264 -1286 183 -922 -910 229 -1361 -304
1406c04O67j414J638o11j014J746j366j48J600j842J059J019j630J244m5j283
$$ -304 363 -1051 587 -24 -1038 708 -658 -806 794 -1048 11 1030 -600 644 599 -684
1422f84J205m28j106J598o22m69J645r53O4J159j424K43O79j692J017L01j237
$$ -684 521 93 -1013 585 -37 -506 1139 186 250 1409 -15 228 907 -785 232 533 -704
1439g04J853k68j434K035j109r29J977k087MJ678j744J073Q69j603J265n79j040
$$ -704 1149 881 -553 1482 373 -556 1421 -666 -662 1016 -728 345 1214 -389 876 297 -743
1456g43J565j196m44J303j396L28Q66j093J046K4j236J041l01r44J202m32n41
$$ -743 822 -374 -818 485 -911 -583 283 -810 236 260 -976 65 -236 -1180 22 -410 -951
1473i51J316q53K82J081j806P27M77j657J164J21j042J814p98j98J077j105M00
$$ -951 365 -488 -206 875 -931 -204 273 -1384 -220 -99 -1141 673 -125 -323 754 -351 49
1490D9N50j549R59M87j508J730k59j129J817q02o51J316j208j99J069j129M42
$$ 49 599 -950 9 496 -1012 718 459 -670 1147 345 -306 1010 -198 -397 672 -457 -15
1507a5R57j178Q44N67j674J083l5j335J455m61p00J539r16k95J151j212K89M63
$$ -15 942 -236 608 1175 -499 584 549 -786 669 208 -492 1047 131 -164 987 -225 64 527
1525E27j071P36L8r69R98p4o19J258j322K22Q19j692Q37P92j603Q61N31j151J015
$$ 527 -544 192 230 -739 259 185 -434 824 -498 -276 543 -1149 -312 480 -1123 -262 269 -882 133
1544A33j45o39J317j407l82J165r66O20P41j296J300J2j490J672o42j360J830
$$ 133 -12 -651 666 -741 -1123 42 -924 -304 437 -859 441 453 -1037 635 -7 -1367 463
1561D63r67p96K102j086j70J446j161J79Q40j550P29L46j136J259k26o32J223
$$ 463 -504 -1300 802 -284 -454 992 -169 10 850 -700 29 375 -761 498 272 -360 863
1578H63p85k9P64j324K06R41j153Q79M89j017O80J39o86N60l70l72Q96j008K67
$$ 863 78 49 813 -511 -305 636 -517 362 851 -166 514 653 -33 527 157 -215 681 -327 -60
1597f0O15r23P63J18r49R87l84r02J041k00j206J464n42n85J254n58m01N60q44
$$ -60 555 -368 395 513 -436 551 167 -735 306 106 -1100 364 -178 -763 491 -67 -468 92 -752
1616g52N96o1o12J031l09m55J115r45R1O97j374O37P94j298N86L86q45J008k40
$$ -752 -156 -217 -829 202 -107 -562 553 -392 -301 396 -978 -341 453 -845 -259 127 -718 290 50
1635E0l70L94l50K4N42o13J30L30k64M39J22n62O47k81p68R52m24l70J247q14
$$ 50 -320 74 -276 -252 290 -323 -193 137 -127 312 434 -128 519 238 -530 422 -2 -372 875 61
1655F1l42J372j141M12K62j043R18k01o73R71p42K07O39p07K23M14q82L97N7o24
$$ 61 -281 1091 -50 362 624 -419 499 298 -375 596 -146 61 700 -7 216 630 -252 145 202 -422
1675d22O00J35m43O72J08p92N36k84o94Q88m44l01O82r77P09K28q69R28k08j029
$$ -422 178 313 -130 542 650 -142 394 110 -584 304 -140 -441 241 -736 -27 201 -668 260 52 -977
1695i77J137m29q10J604j169M83Q88j169J99O19j013N16j65m09O06k0l10Q93p35
$$ -977 160 -269 -1079 525 -644 -161 727 -442 -243 376 -637 -121 -286 -695 -89 -109 -419 474 -261
1714b61R8P21q65k70Q49k23l34N47l77M00M25j357J550lj811J358j67p42J266
$$ -261 -163 558 -307 -577 272 49 -285 262 -115 285 710 -647 903 900 -911 447 280 -462 804
1733H04j063N05P98j217Q53m41n35J090p67m75R28o05M2N07m34R9M69n38j59K58
$$ 804 -259 246 1044 -173 680 239 -296 794 27 -448 480 -125 -83 424 -10 89 558 20 -139 119
1753A19m12J35L56j84L00j36m58M20r4l37N22o16J59K69o33O38J27p45Q11j14
$$ 119 -293 -158 198 14 314 178 -280 140 46 -291 231 -385 -226 43 -590 48 175 -570 241 127
1773A27p09Q07p79J21L76l70K07M67o95L81Q9l71N13n20l3M23k17R2N49m68J64
$$ 127 -582 225 -554 -433 -57 -427 -220 247 -448 -67 22 -349 164 -356 -389 34 -183 -91 458 -10 154
1794A54M05q86K76K36n04K57J06l15O49j86l15Q97o72QM20n98K83J60n87Q04N
$$ 154 559 -327 -51 185 -319 -62 44 -271 378 192 -123 774 102 110 530 -68 215 375 -212 592 597
1815E97p07P84n84n08R08m39k54P52p68M41N3m99P33j82m79L71j45n32M13J23
$$ 597 -110 674 90 -418 490 51 -203 549 -219 222 275 -224 509 327 -152 219 74 -458 -45 78
1835G8m28N85n82J21O14o79o8O73j199N93M67p49O85j19l20O52m73k27N92n44
$$ 78 -350 235 -347 -226 388 -291 -359 314 -885 -292 175 -574 111 -8 -328 324 -149 -376 216 -328
1855c28j47M00n98M32J86l72P07m13k14M23k16j96N20m99K90M58m79O8K73l59
$$ -328 -475 -75 -673 -241 -55 -427 280 -133 -347 76 -140 -336 184 -315 -25 433 -46 22 295 -64
1875f4K08J96m06M91k97m36M94p2N7N78p93R4N44r18N53K6n24P64m69N1K32n13
$$ -64 144 340 -66 425 128 -308 186 114 171 749 -44 50 594 -324 229 255 -269 495 26 77 309 -204
1897b04K99K16n02N70k23j57N52m47j90L88k27n01N29j63l73M09j92k7M15j65
$$ -204 95 311 -191 379 156 -1 551 104 -86 302 75 -426 103 -60 -433 -24 -216 -243 172 7
1917Gk08L99k80p9K1m21M03k30KN30n21M10J25q34M91K66p48N13K12m24L94q1
$$ 7 -201 198 -82 -161 -140 -561 -158 -388 -386 144 -377 33 158 -676 -185 81 -667 -154 58 -366 28 -53
1939e3l86P62n41K14l5l86K16K2j37L17J39o81J018k75r23J195q7o45Q46o36m0
$$ -53 -439 323 -218 -4 -39 -425 -209 -187 -324 -7 132 -549 469 194 -729 466 379 -266 580 -56 -96
1960i6P85p45M34J49m95L04J4q14Q13k27q5K54m41J50O48p50L29K78q92N33P6
$$ -96 689 -56 378 527 32 336 350 -464 349 122 37 291 -150 0 648 -102 227 505 -387 146 222
1981B22n58N63J10l03r8O0r4L4k30J1M04n65L2P86o55M23K12j013P61op54Q56
$$ 222 -336 227 337 34 -64 -4 -98 -64 -294 -283 121 -444 -412 374 -281 142 354 -659 102 96 -658 198
2003A98p11N6N72m40K36K76o04N50m59J89K87m26M8M90m15L22L93n87J55J43k90
$$ 198 -513 -457 115 -325 -89 187 -417 133 -326 -137 150 -276 -228 262 -153 169 562 -25 130 273 -17
2024a7k13K91l99M74l6m73O38J97m33K11J19j40Q6m22M35j63l87N00j53j75P08
$$ -17 -230 61 -338 136 100 -373 265 462 29 240 359 219 305 -117 318 155 -232 268 115 -60 648
2045F48n78j43M10l47L5M47m84K95o5k57J0J23m25L55k33J42M66p33N82j78l32
$$ 648 70 -73 337 -10 25 472 -12 283 218 -39 -29 94 -331 24 -209 -67 399 -334 248 70 -262
2066b62L46Q5m59k86N26l46L84k87k97O96j36k90M73j61j73K36o44N25L54j151
$$ -262 84 169 -290 -576 -50 -396 -12 -299 -596 100 -36 -326 147 -14 -187 49 -595 -70 284 -867
2086h67R64m6n92M59J7n02M45o0j69L30l01J79Q24j240N3P00k94j4j4p24P12M12
$$ -867 97 51 -541 -82 -65 -567 -122 -182 -351 -21 -322 -143 681 -559 -506 194 -100 -114 -128 -852 -140 272
2108B72n19Q10j42o0Q8m98j93L15o87O42m0l4Q55o45K57L43r57J44O66o29K39
$$ 272 -247 563 421 361 449 -49 -242 73 -614 28 -12 -46 809 164 421 764 -193 -49 617 -12 227
2129B27k83l06L28J40j73L42O2n29L8k4r1N05n71L32l3k57L93j16n11M58K24o89
$$ 227 -56 -362 -34 106 -67 275 337 -192 -154 -178 -269 236 -335 -3 -36 -293 100 -16 -527 -69 155 -534
2151e34M52k78J71M1P9l7O8n36L08N5k00L14j15K69M1n02J6K94K86l91L28k27
$$ -534 -82 -360 -189 -148 -69 -106 -38 -574 -266 -211 -411 -97 -212 57 98 -404 -388 -94 192 -199 129 -98
2173i8j41L77n98M99K29j67K18P9l30N0m52L76L71m32K69K3l55K60K55o84K98
$$ -98 -239 138 -460 39 268 101 319 398 68 118 -334 42 413 -19 250 273 -82 178 433 -251 47
2194D7N1k88M24J51n94N80l3P1l05n6K49m22j36L98Q2m62O29q08L88N73r43M10
$$ 47 98 -190 234 385 -209 371 338 409 104 48 297 -125 -261 137 219 -243 386 -422 -34 539 -404 6
2216FM56o32J68l2m55N75n36L50J60j26l9j2o6n0K94l17L63L33p82M86j15n54
$$ 6 462 -170 -2 -34 -489 86 -450 -100 60 -66 -105 -117 -183 -233 61 -256 107 440 -342 144 29 -525
2238e25M53k64Q1o4j53M46L42k50K69K1l28R4j1o44R57l37m04Q89p70M34M12o78
$$ -525 -72 -336 -255 -319 -472 -26 316 66 335 356 28 122 111 -533 424 87 -317 572 -198 236 648 -30
2260c0K6J67k49K17L0l64K34J5j0J16m5r8K82l69nK53k87Q7K87k81j6K14m34N84
$$ -30 -4 163 -86 131 161 -203 31 46 36 152 107 9 291 -78 -83 170 -117 -30 257 -24 -40 174 -260 324
2284C24k22n7J98l61p7L54l54J42L35n46K34L29q23L06k0j25L33k25J91M16p16
$$ 324 102 45 243 -118 -195 159 -195 -53 282 -264 -30 299 -524 -218 -238 -363 -30 -255 -64 352 -364
2305c64J1K26J73k2j61J69k41N8K3Kk69pL14k51O02M56n58k48j65n89R67p7l86
$$ -364 -353 -127 46 24 -137 32 -209 -151 -128 -126 -395 -402 -88 -339 263 719 161 -87 -252 -841 126 49 -337
2328c37O61k80k09L51k27k4J39j9Q5K73n66L88j89l00L73j82j54M07M2m59O48
$$ -337 324 44 -165 186 -41 -65 74 55 140 413 -153 235 46 -254 119 -63 -217 190 232 -227 421
2349D21k85l23K84l87K78j11j22K58K12j30J86j28m64P33l34j99L37m15K57o2
$$ 421 136 -187 97 -290 -12 -123 -245 13 225 95 281 153 -311 422 88 -111 226 -189 68 6
2369Fn6q4N8j21J27j67M8M37m09K12j6k6q4q2L8q0K74k42m4J42pP8P6l00K71L0
$$ 6 -50 -134 -76 -197 -70 -237 -189 248 -161 51 35 9 -75 -157 -119 -199 75 -167 -211 -69 -76 2 78 -222 49 79
2395G9j66K19n27K05M02k65qP8l1J10Nk02K56k22K1Q0M3O5J09l66M89k01k16J98
$$ 79 -87 132 -395 -190 212 -53 -61 17 -14 96 101 -101 155 -67 -46 34 77 142 251 -115 374 173 -43 155
2419A55j43j37L80l27J77j5K07k64Nq2J21J32j44m8j32K07Q5j35k63R7M5J47k6
$$ 155 12 -125 255 -72 105 90 297 33 38 -44 77 209 65 17 -115 92 177 42 -221 -124 -79 68 42
2442D2m01L06J46n33Q43o55J94K48j77k09K11J0J88m50j50M60k36Q0l0J75kk41
$$ 42 -359 -53 93 -440 403 -252 -58 190 13 -196 15 25 213 -237 -387 73 -163 -83 -113 62 60 -181
2464a81l2L35l61K08k49K02J51j6Q8m69K95J72j57L6M0k58L43j76J2M09n15J08
$$ -181 -213 122 -239 -31 -280 -78 73 57 145 -324 -29 143 -14 22 62 -196 147 -29 -17 392 -123 -15
2486a5M35n47M15r7j28J47%j92K47m16K5M15j12k3k78R0k24L65l63J17J63J70
$$ -15 420 -127 288 191 63 210 210 18 265 -151 -126 289 177 154 -124 -34 -258 107 -256 -139 24 194
2508A94j82j66J33m1Nq2K32k27l8K13j55p8L29m92K13J80k30M3J19j7N2j14j05
$$ 194 12 -154 -21 -62 -57 -139 93 -134 -172 41 -114 -192 137 -355 -142 38 -192 -149 -30 -47 5 -109 -214
2531b14K37k75J44j0k35M19o4k87J88K21j29O2j6j44L13m68L10Q9k52L01r3k07
$$ -214 23 -252 -108 -118 -353 66 2 -285 -97 124 -5 57 41 -103 210 -258 52 141 -111 190 97 -110
2553a10L98K4l99K19j72O2J71l04K24p0M4K85k07j38o0k3J66K8j51J32Q1r7o4
$$ -110 288 312 -87 132 -40 22 193 -111 113 43 87 372 165 27 -33 -56 110 138 -13 119 200 103 39
2576C9j13r1J13L1k03L34l1k87L69p0l97L37O8l90M04j56n4o0R4j0j11J63o3J99
$$ 39 -74 -165 -52 -21 -224 110 79 -208 161 91 -306 31 99 -291 113 -43 -97 -157 -63 -73 -184 -21 -84 115
2600A15l38K89k57k9J66j62O9l5K4K6l0K69k04k82K22O4K85p8l9j71J9J06L5k79
$$ 115 -223 66 -191 -220 -54 -216 -147 -182 -158 -132 -162 107 -97 -379 -157 -93 192 114 75 -96 -77 29 64 -215
2624b15K12Q1j60J71j58J87l7j63O2R6j87J87p7N2Q3j40K79m05j28K95M3k4K32
$$ -215 -3 78 -82 89 -69 118 81 -82 -20 76 -111 76 -1 51 134 -6 273 -132 -260 35 78 54 286
2647B86j02k18J56j96j60k5K35J75J52k84K05k60jj49J27J4P1q0K31k43l2J13
$$ 286 184 -34 122 -74 -234 -259 -24 151 303 19 224 -36 -37 -186 -59 -45 26 -54 177 -66 -98 15
2669A5p0j93K72m3p0L56Pm76O9J09l63M20l55K03J03j31K81k29j58L40l16R0L65
$$ 15 -55 -248 24 -19 -89 267 274 -202 -133 -24 -387 33 -322 -119 -16 -147 134 -95 -253 87 -229 -139 226
2692B26l71k6K74j26J1J13m47L03L60m05J49N6p9L3n8J5k1j57N62p6l12P1N0j04
$$ 226 -145 -171 103 -23 -12 101 -346 -43 317 -88 61 117 38 71 13 28 7 -150 412 336 24 95 145 41
2716D1P0r3m03M64O0k30L52k97lK5k0K26J9l20kJ33J55k37n5J75k30o2L63o5k64
$$ 41 111 18 -385 79 139 -91 261 -36 -39 -14 -34 192 211 -109 -111 22 177 -60 -115 60 -170 -232 131 66 -198
2741a98K7J55L0j75MP8m9K94k23j20K11k82K91k06K22k69J2R5l1K21p6r7mJ81
$$ -198 -171 -16 14 -161 -157 -79 -128 166 -57 -177 34 -248 43 -163 59 -210 -198 -103 -134 87 11 -86 -90 91
2765I1j23K2n4l1J47K66o15K74K78m40J00K8J66P0k55j8K7r4J39J33j94J90KM2
$$ 91 -32 -10 -64 -95 52 318 -297 -23 255 -185 -85 -57 109 179 -76 -94 -67 -161 -22 111 -83 107 109 151
2789A51k8M5l06O86l22k62j02K77j9L5q1j68J25n1P6l85L54K24r00Q31J1j85r9
$$ 151 123 168 -138 548 226 -36 -138 139 120 155 74 -94 31 -20 56 -329 25 249 -651 180 191 6 -93
2812i3L12J27p54J01N22l62Q6j16J71R7mn09M95Q8r65J078j40l20j12K66k10K82
$$ -93 219 346 -408 -307 215 -147 -61 -177 -6 91 87 -422 73 161 -804 274 134 -186 -298 -32 -242 40
2834D0j47J23j9k30L52k91J82j61q8M33j80j35K75k89nJ66k17J23J05J60PP9l91
$$ 40 -107 16 -3 -233 119 -172 10 -151 -239 194 14 -121 154 -135 -140 26 -191 -68 37 197 204 283 -108
2857a08J44J50k81K19j61J08l5J67k81J79j59J57j70kJ09k1J39j07j52Q8o9k0
$$ -108 36 186 -95 124 -37 71 36 203 -78 101 -58 99 -71 -73 36 15 154 47 -105 -17 -86 -106
2879a06M88m59j1nQ4r2O0j2k08J49Q7k11K72k5k6r8l9P7K60j83j43Q3K2K04r6
$$ -106 382 -77 -88 -93 -9 -101 -41 -53 -261 -112 -25 -236 36 11 -15 -113 -152 -75 185 2 -141 -58 -36 168 72
2904G2k01L26k73K26k73j02J26K30j95j29K36l47L54n7j21L17l10l8P3q6R5J85
$$ 72 -129 197 -76 150 -123 -225 -99 131 -64 -193 43 -304 50 -7 -128 189 -121 -159 -86 -172 -77 108
2926A08l33O94l27l27K49LJ4j63J01k62M93l51o8J22q6L17l89K63J2J20o8M6J48
$$ 108 -225 469 142 -185 64 67 81 -82 19 -243 250 -101 -169 -47 -133 184 -205 58 70 190 122 168 316
2949C16j01Pm9r0l11N51l02J18R2l67j10L67k19K71k85J54j6J03m0j58J56J16
$$ 316 215 222 173 83 -228 323 21 139 231 -136 -246 121 -98 173 -112 42 26 129 89 -69 87 203
2971B03k19j28J85j48J28M9j84QJ13N5k21L13l19J23j31R8k13J33L20l26L69j89
$$ 203 -16 -144 41 -107 21 70 -114 -106 7 62 -159 154 -165 -42 -173 -75 -288 -155 165 -161 208 19
2993A9r2K15q7j25P6p9p6J78P1k57n4l5L37l4j78R0L4K98l05P1J23k07j5j12K80
$$ 19 -73 142 55 -70 6 -73 -149 29 100 -157 -211 -246 91 57 -121 -31 3 301 -4 67 190 -17 -32 -144 136
3018A36j05L6l8O0m0k00j80K38J27j28J0J05Q2J27l41k9J44j26j8k3L75j56k16
$$ 136 31 67 29 89 49 -151 -331 -93 34 -94 -84 21 103 230 -111 -140 4 -122 -140 -163 212 56 -160
3041a60J30j75J43r2J16j6K12j07P5r6J65l25R8j68J2J48J96o6o2j36j07K02j34
$$ -160 -30 -205 -62 -154 -38 -54 158 51 126 30 195 -130 -32 -200 -188 -40 156 90 28 -108 -215 -13 -147
3064a47J62l3j21n7K98l5o7m8L2j5J0J49P7k90J00J67k73J58l1q0L59k83N1j20
$$ -147 15 -18 -139 -196 102 67 0 -48 -16 -31 -21 128 205 -85 15 182 -91 67 36 -44 315 32 83 -37
3088c7K01K4m7k17J13r5K82m35L78q3L4J61k26l13K22J60j19K63j18k91L25n6
$$ -37 164 188 141 -76 37 -58 224 -211 167 84 118 279 53 -260 -38 122 3 266 148 -143 182 126
3110A26m7K29k83R2Jk19J57N6k23n0J29J43j67K6%J62p7n5k09K55K1j32o6J34
$$ 126 79 308 25 117 118 -101 56 112 -111 -161 -32 111 -56 -30 -30 132 55 0 -209 46 67 -65 -131 3
3134Cj92K23j25j64M0L05j69M9J35l47K70j10j10P0K00K14k79J34j89J67l69J57
$$ 3 -189 34 -91 -255 -215 90 -79 -30 105 -242 28 -82 -192 -122 78 292 13 147 -42 125 -244 -87
3156h7K13j11O1P7j53j11K06r4p8O9n1L31l18j98N8L2L37O8k71k6J12N0k25Q2
$$ -87 126 15 76 153 0 -111 95 1 -77 -8 -59 272 -46 -244 -186 -154 183 251 -20 -46 66 116 -109 -27
3180b7K47j21k68K13j3k31L08j54Q3m6P2l7j64NK03o2K55l47M6L6j14K28j51k
$$ -27 220 99 -169 44 31 -200 108 -46 37 -9 63 26 -138 -133 70 8 263 -84 -38 -2 -116 112 -39 -41
3204d1Mj54L20j17j64L08k50j03K26q7r7J55k26J93L9j57K87k35K09j62o2J69
$$ -41 -37 -191 129 12 -152 156 -94 -197 29 -58 -155 0 -226 -33 6 -151 136 -99 110 -52 -114 55
3226E5k6p1R1J12k37L3k2J55J7L1j2J15r6j50K41k68k21M45j08m7L16m76K26L9
$$ 55 29 -42 49 161 -76 -43 -65 90 107 138 126 241 145 -5 236 -32 -253 192 84 37 353 -123 103 142
3250A42j33n7R4K8L03k21k17N52n83J71j56j27N03r6l50K93r2R3m99k4L66j9K03
$$ 142 9 -48 46 74 377 156 -61 491 -92 79 -77 -204 299 203 -147 146 54 147 -352 -376 -10 -29 174
3273A74k52M5R7Q4l37K15n2n4k1J98j85L04j35NL21l50M5R0j96n9J52j48J45k57
$$ 174 -78 -33 64 148 -189 26 -26 -80 -101 97 -88 216 81 86 407 57 102 192 -4 -63 89 -59 86 -171
3297a71J89j07J11o2O6O7j70K4J05M0r8MJ58P5j59J46k58L7j91K00j65J77j35
$$ -171 18 -89 22 -40 26 93 -77 -53 52 92 -6 -2 156 231 72 218 -40 -3 -194 6 -159 18 -117
3320a17J97j18J12l63K30J30j24o0P1P2K36k36O3j51M7L91l25k38p9M52l69M58
$$ -117 80 -38 74 -289 -59 71 -53 -113 -42 30 266 30 93 -58 -11 380 55 -183 -262 190 -179 279
3342B79l26%J86l37NK15k8K16k36p5K30j97J33j06k14J87j63J19n2K57l8p8k76
$$ 279 -47 -47 139 -198 -193 22 -6 210 -26 -101 129 -68 65 -41 -255 -68 -231 -112 -164 93 55 -23 -299
3365b99L96k8n1l5m0M8O5N7J2j10l2L5k51K45o9j07J98m5J29j55J66R6o2j36J1
$$ -299 97 69 18 -17 -57 -9 56 113 125 15 -17 18 -233 12 -57 -164 34 -11 118 -37 129 225 163 27 38
3390C8L25k85Jj71M14j62k09K4PNJ21j7j25R6j40j23K52j08p3O4J84k93J57j38
$$ 38 363 78 79 -92 322 160 -49 -25 -18 -13 108 91 -34 62 -78 -201 51 -57 -130 -66 118 -175 -18 -156
3414a56K13r9J56mj67q4M88n43j33M02p3K47k80j22N1r5M24k24J13j9m4l09J08
$$ -156 57 -42 114 110 -57 -141 347 -196 -329 73 0 247 -33 -155 -104 -199 225 1 114 95 51 -258 -150
3437a50L41l1r7r2l3r3J70jp1n5j53J56j08J50L10l69J01J57k12J51J69k17m9
$$ -150 191 160 63 -29 -62 -155 15 14 -57 -112 -265 -109 -217 -67 243 -126 -25 132 -80 71 240 23 -26
3460b6O7J4j0o7k03L79q4j09J24p7j82L05j1l12N3K67j86J95j07J8j12J02O2j10
$$ -26 41 55 45 -22 -225 154 70 -39 85 8 -174 131 120 -192 -139 128 -58 137 30 48 -64 38 100 -10
3484a0J06j76R7K66k82m2J59j14K03j86J21k06K06R2m43M16k80K20j69J51l60
$$ -10 96 -80 17 283 1 -41 118 4 207 21 142 -64 142 234 -209 207 -73 147 -22 129 -231
3505b31l78O51J58n26K90k5Q5j46K82n6k53Q3p5K03m5k11P5J25k94K56n8j6j6
$$ -231 -609 42 200 -326 -36 -61 24 -122 160 104 -149 -66 -141 62 17 -194 -119 6 -288 -32 -90 -106 -122
3528a22l4L16k63J28j92J96M1j93L1Q8n2rk1K73j81PK72k24k12J78k66J97n4Q3
$$ -122 -156 160 -103 25 -167 29 70 -123 -92 -4 -56 -65 -86 187 6 13 285 61 -151 27 -239 -42 -96 -13
3552a3J81j53J8j86J84Q3k16K93j78M3n3o9j29P5Q8K5k48L64k84K21J33p7q2j79
$$ -13 168 15 33 -153 31 114 -102 191 13 56 3 -66 -195 -120 -32 -7 -255 109 -175 46 179 102 20 -159
3576a59J72k2k10R7j56J71lN7J74l74L46J39j25J02l1p3j21l07L94k65M84l13
$$ -159 13 -9 -219 -122 -278 -107 -110 -53 121 -253 93 232 107 209 178 105 -16 -323 71 -194 290 -23
3598b3J76k62JM6j61K44m1R1K26k34R5k43J64R3j42k8R6m6Q4l11J33N9j65r2J49
$$ -23 153 -109 -108 -62 -223 21 -20 71 297 63 158 -85 79 172 30 2 98 52 136 -175 -42 17 -148 -240 -91
3623i1O3j07j01J54J11J45q4l9k12J91J00M6k26J56j33NN8l1j92K64J08j81p5
$$ -91 -28 -135 -236 -82 29 174 90 51 -161 30 130 176 -50 106 -27 -22 36 5 -187 77 185 4 -71
3646g1J73j01O7k82M2j54L77j94K71l25K94o8n8k14J22L05l85Q3J25jk22J04R
$$ -71 102 1 68 -214 -172 -326 51 -143 128 -197 97 29 -29 -243 -121 184 -201 -118 7 6 -216 -112 -103
3669a03N0n1k67N40R1n16M15l94J59n56J22L18N39l91L06o16k00Q06m07j8N51
$$ -103 -53 -104 -371 169 260 -256 159 -235 -76 -632 -510 -192 347 -44 262 -354 -554 252 -155 -173 378
3690C78k6j180J050k15m13M61LK03m44kQ91J15q12K60o34P19q2k11L3p50P50l89
$$ 378 352 -828 222 7 -406 55 58 261 -183 -185 706 821 9 269 -365 354 272 61 94 -656 94 -295
3712b95q9O65R17j816J308j045P18k62k06O37m0o82k6K76k67L72l10M43l9p08
$$ -295 -384 281 1198 -618 690 -355 363 101 -105 532 492 -190 -216 60 -207 165 -145 298 259 -449
3732d49N79M52j236Q71n5k12m40N72m82Q20q99N19j70P55j212N45l73Q45n99k09
$$ -449 130 582 -654 217 162 -50 -490 82 -400 420 -479 40 -130 625 -587 -42 -415 430 -169 -378
3752c78r9N81O73o15l03mL04M3L53o50j46O18n18O85j2q08M27l77k6L44n44M63
$$ -378 -477 104 777 162 -141 -145 159 202 555 -95 -241 377 -141 544 532 -276 151 -226 -252 92 -452 11
3774A1p00Q38J58r08O24J62J10R1n86j99p9J241j170J011o02O98q67M00Q7o42
$$ 11 -689 149 307 -601 23 185 295 386 -200 -399 -478 763 -407 604 2 700 -167 233 320 -322
3794c22O38M66j054L70mo9o5K54j37k1K64k40k37O9J71K03j14P0J5k67J57k34
$$ -322 316 782 -272 98 94 25 -40 214 77 56 320 80 -157 -88 83 286 172 242 257 -10 147 -87
3816h7J33P5l3l38Q2L52j76l9J95k42L85j47k56o0J66j64L9Q1O2j87J74qJ8n6
$$ -87 46 121 88 -250 -168 184 8 -31 164 -78 307 160 -96 -156 10 -154 -115 -34 28 -159 15 7 25 -31
3840c1j59J87n6K23q0J0J13k56k08K40j77L06j95oj36J70M91m02J88k11R2L2m8
$$ -31 -190 -3 -59 164 84 94 207 -49 -257 -17 -194 112 -83 -89 -225 -55 436 34 222 11 103 135 87
3863H7k62K57j34J50M3r3L7j84k7j1M84L84j088L46K6j67n9L98P5l36O47n70o40
$$ 87 -175 82 -52 98 141 48 85 -99 -126 -137 347 731 -357 -11 15 -152 -211 187 262 -74 573 3 -637
3886f37N65J97k54J8L38q9k27J88O1n18K95Q4J09j25p2mQL76m4m32L32M5l99J24
$$ -637 -72 125 -129 -111 227 138 -89 99 160 -358 -63 21 130 5 -67 -71 -63 313 269 -163 169 214 -185 -61
3910f1P7o65J008j53L80n92k17k3K99J30k05J66m51O32k86P6q6j93K31l40L96
$$ -61 16 -649 359 206 586 -6 -223 -246 53 183 -22 144 -307 325 39 115 29 -164 67 -273 123
3931A23j12r1L52m44n9L04J78M2k79m7J92j66P4j30O2J93l64M1L4L17k64J78Q9
$$ 123 11 -80 272 -172 -231 73 251 293 14 -33 159 -7 67 -63 -1 192 -172 -131 -97 220 -44 134 223
3954B23l06m0J27k35L55M3k21K9j87K18j51O2K02k62K44k12J59Q6j11n9J1o4K
$$ 223 -83 -123 4 -231 124 167 -54 -25 -212 6 -145 -83 119 -143 101 -111 48 134 23 -36 -25 -89 -87
3977h7K17l16Q9L5j90J57K4j03J66m6P1J74j40J3p1m3r4L14j89k0k19K20O2o0
$$ -87 130 -186 -97 -62 -252 -95 -71 -174 -8 -54 17 191 51 64 -7 -50 -144 170 -19 -39 -258 -38 24 -36
4001c6J08q1r1J48J28p8j61o4L30l43Or7J58J5O2J81j92K99l46J93j24kJ64j54
$$ -36 72 -9 -100 48 176 98 -63 -127 203 -140 -134 -231 -73 -58 4 185 -7 292 -54 139 15 13 177 23
4025B3O5j03N5J28k48J58k00J11J9j48R5n1J00O1J27m25K06J00l4J07Rr3l5N3
$$ 23 88 -15 40 168 -80 78 -122 -11 8 -140 -45 -96 4 65 192 -233 -27 73 39 146 155 62 27 80
4049H0j20J78j28J43r6J41l32M0r2K12o6j14J26J90j83j60M31m16K29k9J5M8k55
$$ 80 -40 138 10 153 57 198 -134 -94 -186 26 -40 -154 -28 162 -21 -181 250 -166 63 34 49 97 -158
4072a58k5L24k1j87K27j99n4Q3R6j28q9J04J62N3j14j3N5q9K02l6k38M8k14K68
$$ -158 -183 141 120 -67 160 -39 -93 -10 86 -42 -131 -27 135 188 74 61 116 27 229 193 -45 3 -211 57
4096E7k55K16q1r4j61K37j30K56j38J78J3K0j95J20Mk28K93j06n1r5MK03j76R2
$$ 57 -198 18 -63 -157 -318 -81 -211 45 -93 85 98 118 -77 43 47 -181 112 6 -45 -140 -136 67 -109 -17
4120a7J94l9j62m8K23l76J32R6J76m35J15J18K8p8O0j71M36m99J27l3k1J35p8
$$ -17 177 138 -24 -72 151 -225 -93 3 179 -256 -141 -23 5 -73 -13 -184 252 -247 -120 -153 -174 -39 -117
4143a17K65r2M6j5q9K43k49K9r4J72J54m97K34J81Q8k33J96j14j35J01j72R4K49
$$ -117 148 56 102 87 -2 241 -8 21 -73 99 253 -244 -10 171 259 26 222 108 -27 74 -98 -4 245
4166B45m06J6R2J04k06J31K77j63j64J90J47k29r3L11l95P1p9j38J70j15K88j66
$$ 245 -161 -145 -53 51 -155 -24 253 90 -74 116 263 34 -59 252 -143 -72 -151 -289 -119 -234 54 -112
4188a12R4J14J46k73J96k40n2J71N5M3k13K46k56P7L0p6N5Q8j50J45J15j78L68
$$ -112 -18 96 242 -31 165 -75 -127 44 99 142 -71 175 -81 -4 26 -50 5 93 -57 88 203 25 393
4211C93k70k11J09L6O5j06l7J31l65J30q3L21M9k56R5J04l49O8J28o4J22K1n0
$$ 393 123 -88 21 57 122 16 -21 110 -255 -125 -208 113 162 -94 1 105 -244 -176 -48 -112 10 31 -19
4234a9n9j7J65o3Oj43K52j75L06j48k44K21j37m5j04L70L8k55o5K08p3nn9L5k20
$$ -19 -78 -95 70 7 13 -130 122 -53 253 105 -139 82 -55 -100 -204 166 204 -51 -116 92 19 14 -45 -10 -230
4259b30J67j87K85NN8j36K00k75O7r2K38O2j90n8R9k14M61k03R6r8k03Q6j59K27
$$ -230 -63 -250 35 40 98 -38 162 -113 -46 -138 100 162 -28 -86 13 -201 260 57 153 55 -148 -62 -221 6
4283Fl9k1L15l36J6M9p6L72k82J41K6j97k34J13P0J2J30j87J8j12L42Q6p5k04
$$ 6 -33 -54 261 -75 -59 -10 -86 286 4 145 171 -26 -260 -147 -77 -65 65 -122 -104 -216 126 212 137 -67
4307f7K98l33J35J14k32J23kqk17L86j46O5k9oj73K34k30P6N8q8j69K44M4j2k79
$$ -67 231 -102 33 147 -85 38 36 28 -189 197 51 116 87 81 -92 142 -88 -12 46 -42 -211 33 77 65 -214
4332b14k4M14k63Q3l8j97J79Np5M4R9M2j38K24j55k76J02J85l31L92k69P7K74
$$ -214 -238 176 -87 -4 -42 -239 -60 -55 -130 -86 13 55 -83 141 -14 -290 -188 -3 -334 58 -211 -134 140
4355A40n3J35l17J85k64J29P8j07L6m2K07r3k27K00q3K48j17J02m93L39L0J10
$$ 140 87 222 -95 90 -174 -45 33 -74 -38 -80 127 34 -193 7 -76 172 55 157 -336 3 33 143
4377A43q9j7L3r0R6J03l83J18O7Q8j94O7q1J97l0O5l2k19N2K29k30K69P2j33P6
$$ 143 54 37 70 -20 76 179 -204 -86 -19 69 -125 -58 -139 58 28 93 61 -158 -106 123 -107 162 234 101 177
4402A77l8l24m9J96n9J21J14j37M7Q8k86J45K3J06j47R9N5Oj12k73L82k20p2K32
$$ 177 139 -185 -234 -38 -97 24 138 1 48 136 -150 -5 18 124 -23 76 131 137 25 -248 134 -86 -158 74
4426G4k31K41l00K53Q3j50o5OM3j48k46J23K18R9k8r5K85k28M5J02M2J82j40j71
$$ 74 -157 84 -216 37 120 -30 -95 -89 -46 -194 -440 -317 -99 0 -28 -123 162 -66 -21 81 123 305 165 -6
4450fJ27m6l5j86J96j1k21N2K76k88L05r5J51o9j36J21k3K9j15J62j57j52K34
$$ -6 121 75 40 -146 50 39 -182 -130 146 -142 163 68 219 150 14 135 112 141 26 188 31 -121 113
4473A13p0J30k34P2q3k3J30J17j46j41K47j33K14Ql41L33j31j78P8P1j70K04j82
$$ 113 43 173 -61 11 -72 -95 35 152 6 -135 112 -21 193 201 -140 193 62 -116 -38 33 -137 67 -115
4496a15J88n7j05j65L98jk01OJ42j83Q0k49KO05n40J82Pj51P0J90j3qk00M3K87
$$ -115 73 16 -89 -254 144 143 -58 -52 90 -93 -13 -262 -260 345 -195 -13 -6 -157 -87 103 90 82 -118 -75 212
4521B12m05K43L9mj38k2J29j90K43q4M6k54J68o4M6l9K8O8j71M08j66k08J51p0
$$ 212 -193 50 89 85 -53 -75 54 -136 107 23 69 -185 -17 -81 -35 -74 -46 22 -149 259 93 -115 36 -34
4545c4K6K57j48J02j65k5K10j46L1m4l63M23k04J33P6k75Q3j74M61l55K54L6j36
$$ -34 -8 249 101 203 38 13 223 77 108 64 -299 124 -80 53 129 -146 -63 -237 224 -131 123 159 23
4568B3O8M4k48j47M54m03J91R9j28j24n1K49J2k8N6J4Ok6p2j4K3K29l00K00m4
$$ 23 91 135 -113 -260 194 -209 -18 81 -47 -171 -222 27 39 11 67 81 87 61 -11 -25 -2 227 -73 127 83
4593H3m1r6J32k4K3k40K22k14K62r7K1p7j2M4M2M9P4k75m6K41K00k74L7J4m5m5
$$ 83 42 -54 78 54 77 -163 59 -155 107 10 31 -46 -58 -14 28 77 151 -124 -170 71 271 -3 34 48 3 -42
4619d2m9K05l03R4J04J35l67K44k48L13j30P1J2l05K97q5J39O4k56r5j12K64p
$$ -42 -91 114 -189 -95 9 144 -223 21 -227 86 -44 27 39 -266 31 -54 85 149 -107 -202 -314 -50 -57
4642e7J97j41L0K7M8L7k19MK12j46%J7j55M0J56R4k98N8j43L74k09J29p1Kk86
$$ -57 140 -1 29 56 104 141 -78 -74 138 -8 -8 9 -146 -106 50 144 -154 -96 -239 135 -74 55 -16 -14 -300
4667c00L36p7O0Q3j56K9J96k54l4J51j57J93k12J16N7j13qj27J6J60M9M7j19L5
$$ -300 36 -41 19 102 -54 -25 171 -83 -117 34 -123 70 -142 -26 31 -82 -90 -217 -201 -41 8 55 -64 -29
4691b9Qr7K26j26L7k8k7n2K32j51j31O2o2K90j2J1j67K2J69r9j89L56j01j18j28
$$ -29 -21 -118 108 -18 19 -9 -36 -88 144 -7 -138 -76 -138 152 140 151 -16 6 175 76 -113 243 142 24 -104
4716a04J60L0o2M5J0k77L50k33K06k40O2k1j7j17J35k3j08J84p4j18J05K55k08
$$ -104 56 86 24 69 79 -198 152 -81 125 -115 -53 -74 -91 -208 -73 -96 -204 -20 -94 -212 -107 148 -60
4739f0K74r6p5j85J14k9PK8J66j96K77l11KK48n8m5o8J88j68o8Q7J31k68J84K05
$$ -60 214 118 43 -142 -28 -57 -50 -22 144 -52 225 -86 -84 164 106 61 -7 181 13 -55 32 163 -105 79 284
4764B84k52N6K8j39J61l20K67p6J24kM2j67N0j91L10j10M1l9n4p8K45k44N9o0
$$ 284 32 88 116 -23 138 -182 85 9 133 131 173 6 56 -135 175 65 106 67 13 -65 180 -64 -5 -65
4788f5J18p2l1Q0j30O1p0J18j84L6j80K55j22K12q8K41j41l63L45j3j57j03O56
$$ -65 53 -19 -50 30 -100 -39 -109 9 -175 -139 -319 -64 -186 26 -62 179 38 -325 20 7 -150 -253 403
4811D03n18K08r1J07l81N17m4K5l77K88Q3l71R5K35j15k46J49j41K07l4M5J50
$$ 403 -115 93 2 109 -272 245 201 226 -151 137 220 -151 -56 179 64 -182 -33 -174 33 -1 44 194
4833A94k08j76j31L37R3r1j24m2J54P5j44Q5J45k93J82q8O5m4q9rQ1j50K03J17
$$ 194 -14 -190 -321 16 109 18 -106 -148 6 81 -63 22 167 -126 56 -32 33 -11 -100 -109 -28 -178 25 142
4857A42k23p0K36j75J86j16k2J76O6l07o3J10j0K49j08k34Q1j6j04K26M8j6l90
$$ 142 -81 -151 85 -90 96 -20 -42 134 200 -107 -170 -60 -70 179 71 -163 -82 -98 -202 24 72 56 -334
4880c34L24%q5J03j84J97l6l47K67p2j63K50K71m4j43r4O4J59m3j17J88l12K59
$$ -334 -10 -10 -95 8 -176 21 -15 -362 -95 -167 -330 -80 191 147 4 -90 -26 133 90 -27 161 -151 108
4903A08J34l47N2L1M1M6Q8p7j62K78k00n8K27q5j60QM2m6M9j1J87j75k42K41r9
$$ 108 242 -105 -53 -22 19 65 153 76 -86 192 -8 -66 161 76 -84 -76 -34 -80 -31 -42 145 -30 -272 -31 -130
4928a30M7J71k25M18l25K22j98J75k24J05l1M3r3J11j84J41K24k38j41L95l18
$$ -130 -83 88 -137 281 -44 178 -20 155 -69 36 5 48 -45 66 -118 23 247 9 -132 263 -55
4949e5Q7l0p2j00k44K48pR4J19J11o6j42j69J76O9o3q0K24j00j78K29p2J20n4
$$ -55 32 2 -70 -170 -414 -166 -173 -79 40 151 85 -57 -226 -50 19 -44 -124 100 0 -178 51 -21 99 45
4973D5k38M1J17j3k4K85j28m8k52K51l2n0J60j46J49k10J74P9k34Q4j22J61n9
$$ 45 -193 -152 -35 -48 -72 213 85 37 -215 36 4 -46 114 -32 117 -93 81 160 -74 10 -112 49 -10
4996a0J03k07P6j02L8J96JK0m5k06J20K23k74R5l1N9j33J9K30l2P3j83m1J9k51
$$ -10 93 -114 -38 -140 -102 94 95 115 70 -136 -16 207 -67 28 -3 56 -77 -58 172 140 213 30 -11 8 -243
5021b43K93j73L04k37K12j57J29k61J21K01j75j75J12r5N2L0o8k23M35L5l5o9
$$ -243 50 -123 181 -56 156 -1 128 -133 -12 189 14 -161 -49 -144 -92 -62 -130 -353 82 117 82 13
5043A3j35J23j51L63j02j07J89j30k02K01j12K11j55K02l36n9J92L2N8k67K44
$$ 13 -122 1 -150 213 111 4 193 63 -139 62 -50 161 6 208 -128 -187 5 37 95 -172 72
5064G2j43r0J77k5J61k02J50M7l92K32o6J36O7k18O2J06n07N86l26j1K68r0j39
$$ 72 -71 -161 16 -9 152 -50 100 147 -245 -13 -79 57 124 -94 -32 74 -433 153 -173 -184 84 -6 -145
5087a45K47j94L8K77j64o5j16J92j62L7j30L45K35n05j95J94J52N1M9k03J47J6
$$ -145 102 -92 -54 223 59 -6 -122 70 -92 -55 -185 160 395 -110 -305 -111 41 92 141 -62 85 101
5109A01l8n1k29N43l11Q5M0k46qJ21K4K21m43L7OJ84J07m65J16M66l91J09K47
$$ 101 63 12 -217 326 15 100 140 -106 -114 7 31 252 -191 -154 -148 36 143 -322 -206 260 -131 -22 225
5132B25j67Q2k01R7k8R2j66J19j31J09j43J92r4m4J72J23k70L09m09M32l15N4
$$ 225 58 140 -61 36 8 100 -66 53 -78 31 -112 80 -14 -58 114 237 -33 276 -133 299 -16 38
5154C8k19J76l4nj37M71k62j03P8O5l7p6J46P7k21m0J34j41K40n2m1l2k24O7K40
$$ 38 -181 -5 -39 -44 -181 290 28 -75 3 68 31 -45 101 178 -43 -83 51 -90 150 98 57 25 -199 -132 108
5179A08P9j10K3K07l62M45l79J7M7q0j56L54j3p4k95J18RmQ1k4k8l5Rk7J00R7
$$ 108 187 77 100 307 -55 390 11 28 75 -5 -161 193 180 106 -189 -71 -62 -66 15 -9 -37 -72 -63 -90 10 107
5205A07r4J06q1j95K4K35j59J77p7n4q0NJ64J3q8K0j3j32J78l15L40k2K0r3M1
$$ 107 13 119 38 -157 -133 102 -57 120 43 -11 -91 -86 78 91 3 23 10 -122 56 -259 81 59 79 -14 27
5230B7J13k89N8O9K02k98J52j37l3J23j76J34K37k17j27J42L8j37K8K50k17J40
$$ 27 140 -149 -91 -22 180 -118 34 -103 -136 -13 -189 -55 182 -35 -162 -20 18 -119 -91 159 -58 82
5252H2j45J69j00j43K32P2J16m60K01L1k8k37K34k39L04j17j17J65j68O7r8J26
$$ 82 -63 106 6 -137 95 167 283 -177 24 55 27 -210 24 -215 89 -28 -145 20 -148 -81 -179 -53
5274e3K0qj59R4L36k63Q1N0l7pn6J19r4K2K0r1n0J18q6n8J80r8J0N8j1q9J53J34
$$ -53 -33 -41 -200 -106 230 -33 48 98 61 54 -2 117 23 45 65 -26 -76 42 -44 -102 78 -20 -10 48 37 -52 101 235
5302B35j76m2j6j57K87k02J7m3N9L6J57N0k56J09n8J6j15O1M1L3J27j63j03l24
$$ 235 59 17 1 -156 131 -71 -54 -97 -38 -2 155 205 -51 58 0 16 -99 -38 3 36 163 0 -103 -427
5326d27K65M60q48O68J30l42N7M78m37K39m97J18rK42j61O3o12N46N38J29o74
$$ -427 -162 298 -550 118 248 -94 -37 441 4 243 -254 -136 -145 97 -64 -1 -613 -67 471 600 -74
5347g4J65M66m86p7J52k08r0N70n80M08j90JJ27j63j75N05j72J38l15o12Q66l44
$$ -74 91 557 71 -6 146 -62 -152 418 -162 246 56 57 184 21 -154 351 179 317 2 -610 256 -88
5369h8m94L75j19n29J233n5o77P37o54r9P92r44J281o26J34R2l29l74M0K16N96
$$ -88 -582 -207 -326 -855 378 323 -354 383 -271 -370 422 -522 759 133 267 359 30 -344 -304 -88 508
5390E08p52P3L60n10J25M4K59O45m26o21o3M10J44J78m23j22J13j6p6J56r1K0
$$ 508 -244 -171 189 -321 -196 -152 107 752 326 -295 -358 52 196 374 -49 -171 -58 -74 -150 6 -85 -65
5412f5J9k5J5Q3o9P2j31j92L76m8%j03J87j63K28K0l68Q1J1j18J92k42K87J12
$$ -65 -46 -71 -56 27 -42 30 -101 -293 83 35 35 -68 119 -44 184 204 -164 -83 -72 -190 2 -240 47 159
5436A59j68l5J31k97M63k30k4l3p2K30l9k04P6J62k15J06Q1k01M3K57n3J89m07
$$ 159 -9 -44 87 -210 253 23 -1 -34 -106 124 85 -119 -43 119 -96 10 91 -110 -67 190 137 326 -81
5459h1J42k76L99l81J16M9Q9k29L05j8L5j59J28J15l44j14L08M8k82P2P7j76N5
$$ -81 61 -215 184 -197 -81 -32 57 -172 133 115 150 -9 119 234 -110 -224 84 132 -150 -78 -1 -177 -122
5482a22J76R6j5k54J97l05J96P6nn5q8J86j40O6M5j73M32j79j70K01N9k47j97
$$ -122 54 150 135 -119 78 -227 -31 45 40 -15 -103 83 -57 9 54 -119 313 134 -36 165 224 -23 -220
5505b20K94J00p7p3J16q0r9J19M5q4J1kq2K3Q8j30P0K4j31m2K00Q2k83J24j71
$$ -220 74 174 97 24 140 60 -39 80 125 41 52 50 -32 -9 79 -51 19 43 -88 -130 70 152 -131 -7 -178
5530a78L35n8l33j2O5K06j16m9L47q5k0j69J70k30KL15j90J0l4P2J85o5l02N9
$$ -178 157 99 -234 -246 -181 25 -91 -140 207 122 102 -67 103 -127 -125 190 0 10 -24 48 233 168 -134 -75
5554g5Q6K1k9M0Kk0j20q2p5M54k72N9J88k74J85p2j4N3k14L09j19k1j27L56J8
$$ -75 11 32 3 43 45 25 -95 -177 -252 202 -70 -11 177 -97 88 16 2 55 -159 150 31 10 -117 239 257
5579B57k18j6j48R7J08j33J04Q4j11J13k90K22k26J33n9K70j15mr4m0J65j53m3
$$ 257 39 23 -125 -28 80 -53 51 135 24 137 -153 69 -157 -24 -83 187 72 68 -26 -66 99 -54 -97
5602i7L33j62Q0k34K92j90j63l9J38Q7J19P7l14K7K86l52J6j07K55J2l4N3K0l34
$$ -97 236 74 154 -80 212 22 -141 -180 -42 45 164 241 -73 -46 240 -112 -96 -203 52 64 30 83 103 -231
5626b31L08j7q3Jk17L06k3k31J84j29K76j00j43k7J36N5J01m20K82J34j18j33
$$ -231 77 60 -23 -22 -239 67 44 -187 -3 -132 144 44 -99 -126 10 65 166 -254 28 162 44 -89
5648h9O2K8K5J03m3k1j9k39L37p1q4m1j52L76q3l62K87m1n8K34j59M9J71n7k60
$$ -89 -27 1 26 129 86 65 46 -193 144 73 -11 -52 -204 172 89 -273 14 -27 -85 149 -10 39 210 153 -107
5673a07K73l04l2L36rMj55K5j52N8K52j68%J01K1j37j11Q1j35L43J0k14M3J50
$$ -107 166 -138 -170 166 157 161 6 31 -121 -63 189 21 21 122 143 6 -105 -24 -159 184 194 -20 23 173
5697A73j19l4p2Lp8N0K53l1k59j11L12Q8k88N8J31r4j49L08j1k64J55nk74M60
$$ 173 54 20 -52 -49 -127 -77 176 145 -114 -225 87 175 -113 -55 76 -18 -167 141 130 -134 21 16 -258 202
5721B02l93Q4J64j48J24n7Qj93L50m53K59j6K75l34R5%L8J3l3r5K35j19M6J8o4
$$ 202 -191 -107 57 -91 33 -24 -16 -209 141 -312 -53 -69 206 -128 -33 -33 5 18 -15 -110 125 6 52 70 6
5746Fj13J64j74J03j16J98M2J31k14l7K7K8RM5l26J3J82O8m3P1j28J88n1k12K93
$$ 6 -107 57 -117 -14 -130 68 110 241 27 -10 17 45 54 99 -227 -214 -32 36 -7 64 -64 124 73 -139 154
5771A54l65K89K5j34l7j02Q3O1Q0k53K63j29J18p5j66J33j00L4K49m85K51N41
$$ 154 -211 78 103 -31 -68 -170 -87 -26 54 -199 64 -65 53 -22 -188 -55 -155 -121 128 -357 -106 435
5793D35j84l08k7q6J00K7J53j98l3M4k13K88O7K1J5j95M5m4J2K54j74N3l07J83
$$ 435 251 -57 -84 -170 -70 -43 110 -88 -121 -77 -290 -2 65 86 101 -94 -49 -93 -81 173 -1 52 -255 -72
5817g2q4N2K25l65K04J37j52J08j34R7k5K2L3N5k42O2K48M7j70J20k06rK69m67
$$ -72 -156 -104 121 -244 -40 97 -55 53 -81 16 -9 13 46 101 -141 -79 169 216 46 166 -40 -49 220 -247
5841b47J36n8L11k47J93j80J65l43K57l0j57L12k95J65J42k83K47n8Q0p6k1J02
$$ -247 -111 -169 142 -105 88 -92 73 -270 -13 -43 -200 112 -183 -18 124 -159 88 30 110 34 13 115
5863A15J0k05K19k48K78j11j46K89k48j64p3J37K10p4K14j22m6j28j7q0J90j50
$$ 115 125 -80 139 -109 169 58 -88 201 -47 -211 -284 -147 63 -11 203 81 35 -93 -110 -190 0 -150
5885a50L3k07M10j57o6R4K8O7m4k8j28K74k47Q7k86K57O1J00q9J62r3J82m30L61
$$ -150 -117 -324 86 -71 -137 -43 -15 52 8 -20 -148 126 -121 -34 -320 -63 -2 98 9 171 78 260 -170 191
5909A91r8j1j60P8k38K98K61m04J65j05K08j4k39Q9k18O1Q2J2L3K8k4Pj0j2k5
$$ 191 93 82 -78 0 -238 60 321 -83 82 -23 185 171 -68 21 -197 -136 -54 -42 -9 19 -5 2 -8 -20 -45
5934d5j03K45M4k27N0j8L23k64J2q4j0M3m7q2n0K24j2J37l29L48j11O8j02M3J5
$$ -45 -148 97 141 -86 -36 -54 269 5 17 -67 -77 -34 -81 -163 -213 11 -1 136 -193 155 44 112 10 53 68
5959F8NQ5r4N2j62M7k18J78P1M4r4j45K51j09O3O1J1p1j21K87l95K85pJ05r8J05
$$ 68 73 158 64 116 -46 1 -217 -39 32 76 -18 -163 88 -21 42 103 114 43 -78 209 -186 99 92 197 99 204
5985B04q4j44%Q5J35p8j05J3j6l7R9k41L24M2j86J11m5pq3J65j72j82K06j21L20
$$ 204 120 -24 -24 61 196 118 13 26 10 -27 72 -169 155 197 11 122 77 70 -13 152 -20 -202 4 -117 203
6010B03j46l07K97m6j7j10J41Nj6M6P7j1j40k71M77k2j12j62K05j39j5J87j3j44
$$ 203 57 -250 47 1 -16 -126 15 20 4 50 127 116 -24 -295 182 160 48 -114 91 -48 -63 124 111 -33
6034c3r8M3K53l64Q2l3K28k83L38j35o0O7M4m0J39j10k31k2j03K45j7J30r5L48
$$ -33 -131 -88 165 -199 -117 -150 78 -205 133 -2 -62 5 49 9 148 38 -193 -215 -318 -73 -90 40 -55 293
6058B93j07j29j00J59k09J47r8K86l32n1L00n0l3J6l14K68j03q2J44P0j6j85J49
$$ 293 186 57 -43 116 -93 54 -44 242 -90 -141 159 109 76 92 -222 46 -57 -139 5 75 59 -126 23
6081B3j6L3o2m5j21J87j76R2R1J88n3j19l5q2J92m0j94Q6J82k50O2R6O0M7m59
$$ 23 7 40 -22 -67 -188 -1 -177 -85 6 194 141 22 -13 -95 97 57 -137 -51 131 -119 -57 39 99 146 -313
6106c13N39k10J5J77l34K31j33J99j22k55J13K32j00N4l9j3j40L0M7k8L00l97
$$ -313 226 16 31 208 -126 105 -28 171 49 -206 -93 139 39 93 54 41 -99 -69 -22 -50 250 -147
6128a47J21K07k57p1j04J89J58l36M06k90j22K34L4L8k30J90J18M5j23m2r7l5
$$ -147 -26 181 -76 -147 -251 -62 96 -240 166 -124 -246 -12 22 60 -170 20 138 183 60 18 -79 -114
6150a14K30p9O5j89m2j01K86j7m7R1j60J26j71L44l50J07q6o3L00J22M1m62J50
$$ -114 116 37 102 -87 -129 -230 56 39 -8 83 -77 49 -122 222 -128 -21 -107 -170 130 252 293 -169 -19
6173a9k11K85q8j07J17r2L60m41L13j23Kj10K93k40l9r5K85k41k2J35o2K92l45
$$ -19 -230 55 -33 -140 -23 -115 245 -196 117 -6 -4 -114 179 -61 -100 -195 90 -151 -173 -38 -100 192 -153
6196a53L24L7k01n5J60l43j7L13m23K62j7J37p5K2p0n9PL57j68O6j13j4J45O1
$$ -153 171 208 7 -48 112 -231 -248 65 -358 -96 -113 24 -51 -29 -99 -158 -151 206 38 104 -9 -23 122 183
6220A83k34Ml9J16M3J79k89N1K1J09k18J6j30K65Q0k22J06n0r3J14k4P4Q4j89
$$ 183 -51 -47 -86 30 73 252 -37 14 35 144 -74 -58 -188 77 157 -65 41 -9 -102 12 -12 62 146 -43
6244d3K86k78Jj17R0Ok04J75J58k45J03K26O1k71K42l71K03o2J91j42M9l2K8j07
$$ -43 243 -35 -34 -151 -61 -55 -259 -84 74 -171 -68 158 219 -52 190 -181 22 -40 151 9 58 26 54 -53
6268e3j9K60l08K56l89K09J47k06J79k89K7J74J78k47K35l42K53M3l38L1L39p
$$ -53 -72 188 -120 136 -253 -44 103 -103 76 -213 -186 -12 166 -81 154 -188 65 108 -230 -199 140 133
6290A33l89J51K82Kj80M9q1l1RR9kl5L1k19J24O4J88k16L8J01J56m25K28J21m13
$$ 133 -256 -105 177 179 -1 48 -33 -64 -55 44 42 7 38 -181 -57 7 195 -21 17 118 274 -151 77 198 -215
6315b15M09n15M38P2l56J1K00K2q8O0J55n22J62K47j50o8Q0%K82l12r9L66r3k57
$$ -215 194 -321 117 189 -167 -156 44 66 -22 38 193 -329 -167 80 -70 -138 -58 -58 224 -88 -187 179 86 -171
6339a71M24m7l12R8j50K19mj02j58K09R5j49J23k10K66j0j09%n8m2J07O7r4J09
$$ -171 253 206 -106 -8 -158 61 57 -45 -203 6 101 -48 75 -135 131 121 12 12 -46 -88 19 86 -8 101
6363A01P7J44J08n35Q8K56j83l1J38m06o50O9R12o63K82O86o68K48J11j74K51
$$ 101 178 322 430 -105 -17 239 56 25 163 -243 -893 -824 88 -575 -293 393 -275 -27 84 -90 161
6384A61k55j4P5M1j03J91M1j61l9K7R0m9j5J0J14j84N7O6L5k6n6L01m28Qj16K16
$$ 161 -94 -108 -33 8 -95 96 137 -24 -63 -36 54 5 -10 0 114 -70 -13 53 88 62 6 307 -121 -113 -229 -13
6410a3J36r3L8P1p6N8j84Q8m7M2N3L0k51J82l1J36j51j41L22p7p9L2O1j91M1L3
$$ -13 123 30 68 139 63 121 -63 25 -22 20 73 103 -148 34 3 139 -12 -153 169 92 13 45 106 -85 -44 -11
6436a1N2l06M04l36L61j29q9J66k00K19j63J32m9o0K49l51n0J24J53J05o16L74
$$ -11 41 -265 139 -197 164 35 -54 112 -88 131 -32 100 51 -9 240 -111 -161 -37 116 221 -395 -21
6458b1l6j7m5K02j72J91k96L51j73K3j4j43J80N1k43k6K20l9j44J50oo1l0J28
$$ -21 -57 -74 -119 83 -89 102 -194 157 -16 7 -7 -150 30 81 -162 -188 32 -7 -151 -1 -7 -68 -98 30
6482C0L0j94K54k70K37j60N1j94K62j24J50j95J17p5L5j3L1J95J68m36P3R8j89
$$ 30 60 -134 120 -150 87 -73 -22 -216 46 -78 72 -123 -6 -81 -46 -59 -28 167 335 -101 -28 70 -119
6505a19K80n9K5p7j19J27j69K21o7k74K83p2J07j90K4M8m5J09K8m58M02k1R9j23
$$ -119 161 102 127 50 -69 58 -111 110 43 -231 52 -20 87 -103 -79 -31 -76 33 61 -397 5 -16 83 -40
6529d0j99J97k1P1j40J56k32O6J05j17J53n1j30K39j41L51kl86J52l0kM4R5j54
$$ -40 -239 -42 -63 8 -132 24 -208 -142 -37 -154 -1 -52 -182 57 -84 267 265 -121 31 1 -1 43 138 -16
6553a6J58j01k26K33j5K8qJ4l15K23l8M7j2o6j2j71K92L5l7k63K00k4K14n4k21
$$ -16 142 41 -185 48 33 61 53 67 -248 -25 -63 -16 -28 -94 -106 -277 15 50 13 -250 -50 -74 140 86 -135
6578a35N63p40M22l21K26r5O1o4M91o35J72rK92l07J93J70l47k7R7q0K65j02p73
$$ -135 428 -312 110 -211 15 -80 -19 -83 408 -227 -55 -64 228 -79 114 284 -63 -90 7 -73 192 90 -683
6601f83P71k51M0P1K52n99R67n73J3o1J90l64N67k48j03k18J0L65k29R2q2J23
$$ -683 88 -163 -123 -52 200 -399 568 -5 8 -53 137 -227 340 92 -11 -229 -219 146 -83 9 -73 50
6623E0K01k87J22J6j95Q4P3p9J28o0j92k5K55j04N0J40k07J35O6l03J99k29N2
$$ 50 251 -36 86 102 -93 -9 64 -15 113 53 -139 -164 91 -13 37 177 -30 105 171 -132 67 -162 -110
6646a10R5J47R2Mm09J58J75o6O0l1l34K62p9J59p2r5m6kN4O7J42k82P1M7l4j69
$$ -110 -15 132 224 228 -181 -23 152 86 146 115 -219 43 -36 123 51 -44 -90 -92 -38 29 171 -111 -40 7 -27 -196
6672a96K30p3Q4q5J57k36k1J58q9l35L56l87K34K7K02K1Q9ok40j84M0J93M2J2
$$ -196 34 -39 45 -40 117 -119 -140 18 -71 -406 -50 -437 -203 -176 26 47 136 130 -110 -294 -254 -61 -19 -7
6696go7L7K06k10j1k9K89m70K04j93J45k61J66K29J37k42P4L8k04o3L50j06k61
$$ -7 -74 -37 169 -41 -52 -81 208 -262 -58 -251 -106 -367 -201 28 165 -77 -3 35 -169 -232 118 12 -249
6719b49J92M13m44k0J22p3O3j22O1M3j02J15k24J07K41Mj31J25k8j98L9J92j07
$$ -249 -57 356 -88 -108 14 -59 4 -118 -57 -14 -116 -1 -225 -118 123 127 -4 121 93 -105 -66 126 19
6742A9J98k38J1K16o5j38J20j68J65km2m37M21q2L9J34l34K56k41K06J39k11j19
$$ 19 217 -21 -10 206 141 3 123 -45 120 118 76 -361 60 -22 17 151 -183 73 -168 38 177 -34 -153
6765a53M17n20K73r5K22K5k89J29j10jJ42j03K2J1J52l8J9N5k6l98L32N9k43j83
$$ -153 264 -256 17 -78 144 169 -120 9 -101 -102 40 -63 -41 -30 122 84 103 158 132 -266 66 125 -118 -301
6789c01J41N8K14k3r1J68j97oJ37Q6Q2l82R7M2K51j33k90K07J06J33k71r5J53
$$ -301 -160 -102 112 89 -2 166 -31 -37 100 186 268 -114 -17 25 276 143 -147 60 166 299 28 -67 86
6812H6p4n2K53k60J5J20o8N5j35o4K02Nl03J45l2q4K99k04J98O2l77N9L33j56
$$ 86 12 -40 213 -47 -32 88 20 75 -60 -124 78 83 -220 -75 -107 -191 108 -96 102 164 -213 -154 179 23
6836B3J24j06K38l96K43k54L97l77J63k22L37r1J42l31M25l73J84m87N37k74J11
$$ 23 147 41 279 -117 126 -128 269 -108 55 -167 170 79 221 -110 315 -58 126 -361 176 -98 13
6857A3J2kr6J5J67j13o3K17o0k28J24p9k3J41r5j32J63J1j20M1J95k91L11j85
$$ 13 25 23 -73 -58 109 -4 -67 150 90 -138 -14 -93 -116 25 -70 -202 -39 -28 -148 -107 88 -203 108 -77
6881g7j06K48j12l0L07k80j2o7M7k2qK7p8K38j1q5pO8j5j16O9M13k28j05j3j0
$$ -77 -183 65 -47 -77 230 -50 -62 -129 -82 -104 -112 -85 -163 75 64 -21 -28 40 25 -91 -22 391 163 58 45 35
6907C5l43L12K84l76Q0Rk5L68l2m13k1L0K04m1m6nM7kK02l83p3L71j36Q0j40n1
$$ 35 -308 4 288 -88 -8 1 -24 344 312 -101 -122 -92 112 71 25 20 67 65 267 -116 -189 182 46 126 -14 -65
6933f5J86j77K0Q1j69R9O6J44j04j11P6o2J77k46m6L2MJ28l25JO33l2l72j56N96
$$ -65 121 -56 -36 45 -124 -25 41 185 81 -30 46 -16 161 -85 -131 -99 -95 33 -292 -291 342 310 -62 -218 378
6958C78k02n29K08o6m3J59k37q8M83l27P48q76k66O99n0L72k06o89K82M48l19
$$ 378 176 -353 -145 -211 -254 -95 -332 -420 63 -264 484 -392 -658 41 -9 363 157 -532 -250 198 -121
6979a21k08M85K66o56J35l7N2k50M17j42M92m26j89M7q2j5K54j43R5M4j1j30p4
$$ -121 -329 156 422 -234 -99 -136 -84 -334 83 -59 433 7 -182 -135 -217 -232 22 -121 -26 18 7 -123 -197
7002a97J0j04K40l6k23L82N9k8j96O2K45l25J38J1j51j02L47k85J15m1J9L8Kj25
$$ -197 -187 -291 -51 -87 -310 72 131 103 -93 -31 214 -111 27 38 -113 -215 132 -153 -38 -79 -60 -22 -20 -145
7026a45K44r4l75L31Q9J66j59qj15l8M6j28L27R5n8k78o2K4J50p1p6J09Mj84J71
$$ -145 99 5 -370 -39 50 216 57 49 -66 -104 -58 -186 141 236 178 -100 -162 -138 12 -59 -135 -26 -22 -206 -35
7051c5J00p4J66k59l4P4J95k91J73M1j96P1j69J02L76q3k82J06J29j56J35K12
$$ -35 65 -9 157 -102 -136 -62 133 -158 15 56 -140 -69 -238 -136 240 157 -125 -19 110 -46 89 301
7073C01j0k30J87k72L0K02k56k3K29j05q6m2q2Q0l5L57j51j22l1j4j3k15J10J83
$$ 301 291 61 248 -24 6 208 -48 -71 158 53 -33 -75 -157 -77 -112 245 94 -28 -59 -73 -86 -301 -191 -8
7097hj21K03J06j00j64j44K73k27L51k1j70P9j22Q1k3j09n3k4m8L44J2K5j47n
$$ -8 -129 74 180 80 -84 -228 45 -182 169 148 -22 57 -65 16 -7 -116 -169 -193 -241 103 115 140 -7 -12
7121a2L08j29r8j71j4J68n9j42K26k06K78l9j47J05j23M5o3o8J63M8n1K4jM0k20
$$ -12 296 167 69 -102 -116 52 -7 -149 77 -129 149 110 -37 68 -55 -10 -73 -141 22 70 19 43 42 82 -138
7146a38J09OK22j95j82J93K42m95L32k22J44k33K26K78l09K33l37j44K49K27l31
$$ -138 -29 -23 199 4 -178 15 257 -238 94 -128 16 -217 9 287 -22 211 -126 -270 -21 206 -125
7167a25J60j54K86j53K23k18j99nM86k00Qj40Q0j31Q1M9p2j1J47L3j69J21k03
$$ -125 35 -119 167 14 237 19 -180 -185 301 101 109 -31 49 -82 -1 48 -24 -35 112 145 -24 97 -106
7190a06J63m2j48Q3J41r0O2r1K10j88K5j38J07K59k9k89qK67p7j17K61m39M49
$$ -106 57 15 -133 -50 91 1 63 -28 182 -6 19 -119 -12 247 218 -71 -79 188 111 -6 255 -184 265
7213B65l58K08q2j34P83p89j67J17o2k3O41o89L72n70J265j034N39m73J69J3K0
$$ 265 -93 115 33 -101 682 -107 -274 -157 -219 -242 399 -290 82 -488 777 -257 282 -191 -22 -9 11
7234A1r4k9K00j09L1J45k61p5N4K40k12K33j22OJ64k76Q2J4K33j87j49J90Q9k75
$$ 11 -83 -112 88 -21 10 155 -106 -181 -127 113 -99 134 12 18 182 -94 -12 2 235 48 -101 89 178 -97
7258i7oJ85j92J29k07J05J33j24K01m4k98J65O2n3n6K97l9j25q8J58j15K15l46
$$ -97 -103 82 -110 19 -188 -83 50 -74 127 83 -215 -50 12 -41 -97 200 161 36 -52 106 -9 206 -140
7281a40K67J38j06l12N9J86p4l8p2Q1K19l28j8J83j50R4j5k01lL51j19J02k26
$$ -140 127 265 159 -153 -94 92 18 -20 -92 -11 208 -120 -138 45 -105 -11 -26 -227 -230 121 2 104 -122
7304a22j3J68j0K7j22Q8j21%L78l28J6l9o0Q2m6J23j63J99q9j63K42j82j3K35
$$ -122 -135 33 23 50 -72 16 -105 -105 273 -55 -39 -78 -138 -56 -102 21 -142 57 -32 -195 47 -135 -148 87
7328H7j72j18K23P7p0j18J13J96k59N0k4M6j74J80l9j49O9J64L27l25j56J12j73
$$ 87 -85 -203 20 97 27 -91 22 218 -41 9 -15 31 -143 37 -2 -151 -82 82 409 84 -72 40 -133
7351a33K49l9j09l8K2J44k67l8J64p5J21Rj50NO0PJ55Pr7j87J67M9orJ79j77j43
$$ -133 116 77 -32 -70 -48 96 -171 -209 -45 -120 1 10 -140 -135 -75 -68 87 94 -3 -190 -23 26 20 11 190 13 -130
7378a30K13q1K37l33K80l09L1k6J24r4J54j12nm2O8N1J18j25K3k73J07K63j38
$$ -130 83 2 239 -94 186 -123 -92 -118 6 -88 66 -46 -51 -93 -25 26 144 19 42 -231 -124 139 1
7401AQ9k27jj9J6K04k23L02k92J18j9J75R5k17k20K41J41j35kK7%j96J77l04K67
$$ 1 90 -137 -138 -157 -141 63 -160 142 -150 -32 -51 124 219 2 -218 23 164 29 27 54 54 -142 35 -269 -2
7426bJ53k83l7L97j29p7l6L71l33j69M10l50p7J57j60K92j82O9jJOJ07p3l9j70
$$ -2 151 -132 -169 228 99 22 -14 357 24 -145 265 -85 -162 -5 -165 127 -55 14 13 14 20 127 54 15 -155
7451a55K78j27L6j75J04o6Q3K6K31l00j8J85k55M13k17j56K40o9J1l8J8O0j36
$$ -155 123 -4 32 -143 -39 -105 -22 4 235 -65 -83 102 -153 260 43 -113 127 58 69 31 49 109 -27
7474b7j21L1m5NQ3J94j41P7j82l2L21k76L47lj90k63L44K0k83P6j13M27k13J05
$$ -27 -148 -117 -162 -157 -74 120 -21 56 -126 -158 163 -113 234 231 41 -222 122 142 -141 -65 -178 249 36 141
7498A41k42J51p3k8J47j63j78K27K84P8k75k07L04l10KJ80o5L31nl70K95k07Q0
$$ 141 -101 50 -23 -51 96 -67 -245 -18 266 344 69 -138 166 -144 -142 38 -27 304 299 -71 224 17 97
7521I7j91J78L3j68R2L6Q6l80p7K80J65l44M5qJ37Q0k48L18k25p5J88j31J9M6
$$ 97 -94 84 117 -51 41 77 163 -217 -294 -14 151 -193 -148 -156 -19 61 -187 131 -94 -169 19 -112 -93 -47
7545d7J67l41J80J65j54J88j82Q9Jj31N6L5nN3l33M22k95m3N8L2K07k63L28j76
$$ -47 120 -221 -41 124 -30 158 -24 65 66 -65 -9 26 21 74 -259 163 -132 -175 -117 -85 122 -141 187 11
7569A1J84k32K02k34m0P7N6Q5r1l1j07o9J86K83l13K25j59J34j89m1J45j35Q4
$$ 11 195 -37 165 -69 -109 -32 24 109 18 -13 -120 -189 -3 280 -33 192 33 167 -22 -63 82 -53 31
7592C1RJ10J31m16K26J16l74L2o4M03j90L2p0P7j8k7k56L51r4K41Rk94r1J23j15
$$ 31 40 150 281 -135 91 207 -167 -135 -199 204 14 46 -24 53 35 8 -248 103 9 250 259 -35 -126 -3 -118
7617a18J80j06J38j30n8J31o6j08J58J38j93j49J53oQ4L8q9J21k37m9L51r5r4
$$ -118 62 -44 94 -36 -94 37 -29 -137 21 159 -34 -183 -30 -36 48 86 -3 118 -119 -168 183 88 -6
7640fK59k42j56K12j40m5K41k1j1k39J87K77l16J33K9j83J3J31j92J55j32L0J98
$$ -6 253 11 -145 67 -73 -118 123 102 91 -148 39 316 0 133 162 -21 -8 123 -69 86 -46 -16 182
7663A82k79j26L56k0j03MJ0l0rp9J23o1J46l6n1p7Q8j44P4J23n1j62m9K57j20
$$ 182 -97 -223 133 113 10 14 24 -6 -15 -94 29 -32 114 78 27 -50 38 -106 -32 91 40 -122 -171 86 -34
7688c4J6r5P9K22j23p5J40j2k85K27j18R3m6J72jj14m0J44j75j35L50k90K05j24
$$ -34 -18 -113 -34 188 65 -10 130 118 -167 60 -58 35 -11 161 160 46 6 150 -25 -160 190 -100 105 -19
7712a9J18M0L9j42O7j0J34j63k91K30k71J81K3K58k79K35o0J10j71j35J17P6l12
$$ -19 99 139 178 36 103 93 227 64 -227 3 -268 -87 -64 194 -85 150 90 200 29 -106 11 87 -225
7735b25J20J20J63l42P5J39O0p1J5o0j33K92k14j40j69L78k23L22n9j0k7j18K55
$$ -225 -105 15 178 -164 -89 50 110 39 54 -6 -139 153 -61 -201 -370 8 -215 107 48 38 11 -107 148
7758A48l35L59k21J95j24mP2J81j18p4L8j06M7K64k01k96L7n8J36N4l5l9n0J34
$$ 148 -187 172 -49 146 22 18 90 271 153 79 117 11 58 322 121 -175 -138 -196 -60 -6 -41 -80 -130 4
7782DJ60l54R0R1l9L74m54J67J69k64M9J58j91n8k4q4J32P8QK0k4O1l6o7o3J45
$$ 4 164 -190 -100 -9 -48 326 -128 39 208 -56 -7 151 -40 -98 -122 -206 -74 4 12 32 8 69 33 -34 -97 48
7808D8R2j87l1J55j03P7J15l19J9J23p6L5m9P6q6J42j07J90j07J31j88o5J2J72
$$ 48 140 -47 -78 77 -26 51 166 -153 -134 -11 -87 -52 -101 -25 -111 31 -76 114 7 138 -50 -115 -103 69
7832F9j66J8J93j28r7J75K0j16R9J07J34k68J2M2k9j98K53k05n2j00L43j21L3
$$ 69 -97 -79 114 -14 -111 64 84 -32 67 174 308 40 52 94 65 -133 120 -85 -137 -237 106 -15 18
7855A8j15J03l7l1r3J35J06j15K15j57q7J72j22O2pj44R7j53K05k9J2J28n0M0
$$ 18 -97 6 -31 -62 -155 -20 86 -29 186 29 -58 114 -8 54 47 -97 0 -153 52 23 35 163 113 153
7879A53j06j06J49Nq1j40N4J42N1M6j74j90K14p0j65M7L40j33j82J50j72r9K10
$$ 153 47 -59 90 95 14 -126 -72 70 121 167 -7 -197 17 -53 -218 -171 169 36 -146 4 -168 -267 -57
7902e7k82L86n6r9K22jN8k22l0J9J75J29k92K92m3k97K39o5L1J49k24J20j18j59
$$ -57 -339 47 -9 -108 114 113 171 -51 -81 -62 113 242 -50 242 199 -98 141 76 107 256 32 152 34 -125
7926a25P3L48l78R6J53j91M5J08o6J14o1N3j32k11J65j41J91k26J40K27l10k14
$$ -125 -52 296 -82 14 167 -24 21 129 63 177 116 169 37 -174 -9 -150 41 -185 -45 182 -128 -342
7948c42L23m0P0P5np1q2kQ6L33k81J4PP6j05j14J68O1M7k57kL8j66J34P2Nn6l3
$$ -342 -19 -59 11 86 81 10 -72 -74 12 345 64 78 85 161 56 -58 110 171 218 -39 -41 -3 -169 -35 37 42 -14 -47
7976d7O6m6J93j71L4q3J24k77P0J9j1r1J42L3J17k54M08l58J85K01n9l27On7J75
$$ -47 19 -27 166 -5 29 -54 70 -207 -137 -118 -129 -220 -78 -45 72 -182 226 -132 53 254 195 -132 -126 -183 -8
8001hR2j24j75J67J29L53n46l55P68n57P3P2K95J51n15K41l72j93N09J7K47p33
$$ -8 84 -40 -215 -48 81 434 -112 -467 301 -256 -183 -111 184 335 -180 61 -311 -504 5 22 269 -464
8023d64L55J72k8K81l81L96j89k51j81M78j48p4J58mk26M0M7j45Q0J35J26k12
$$ -464 -109 63 35 316 -65 331 142 -109 -290 188 40 -34 124 120 -106 -66 -19 -164 -84 51 177 -35
8045c5P1m3J09l84L43j42Mk68L45J74m08J59j46J74K17j80J68q2k58J26j14L06
$$ -35 36 -7 102 -282 61 -81 -77 -345 0 174 -234 -75 -221 -47 170 -10 158 76 -182 -56 -170 136
8067A36j35N1j18j3K77j39p7J4KM40k87N4k85q8J78O2p8j14l26K46M64m45J1J4
$$ 136 1 52 -66 -79 198 59 -18 -4 -2 438 151 205 -80 -168 10 72 -6 -120 -446 -200 264 -181 -170 -156
8091a56L57j38N61m92L77q86J23O34o89P6M5J95J41nl59K09l8J40j03L05l47L69
$$ -156 201 63 624 132 509 -377 -254 380 -309 -233 -188 7 148 143 -216 -7 -45 95 -8 297 -50 319
8113C19L4k03o0l4k45j26L88qL3K25j25J3m35Q4L21q49O68j72K07j89J09j2K53
$$ 319 353 150 90 56 -189 -315 73 65 98 323 198 211 -224 -140 181 -668 0 -172 35 -154 -45 -57 196
8136A96k36j51J83k10K42k56o8M40j53N6j77K33o6Q1j26o8N9J9j3oj18J21k80
$$ 196 -40 -191 -8 -218 24 -232 -300 140 -13 43 -134 99 33 114 -12 -80 -21 -2 -15 -21 -139 -18 -298
8159b98M15j28l1K34k37j9K25j23L0j93J63R2L9P9l80P6O5J2N8K75n39L41k62
$$ -298 117 -11 -42 192 -45 -64 161 38 68 -125 38 130 169 248 -132 -56 9 21 79 354 -185 156 -106
8182a06K41M7m21P32k78l08K55l6J00
$$ -106 135 182 -239 493 215 -93 162 126 226
8191B26
$$ Imaginary data points
##PAGE= N=2
##DATA TABLE= (X++(I..I)), XYDATA
0@%%%%%%%%%%%%%Qj6J6j6K4l2L2m0N0n8P2q8J04j20J36j58J82k08K40k74L10l51
$$ 0 0 0 0 0 0 0 0 0 0 0 0 0 0 8 -8 8 -8 16 -16 16 -24 26 -32 40 -48 56 -64 72 -86 96 -112 128 -146 164 -187
35a87L98m47N03n66O33p07P87q75R70j074J187j309J446j598J760j936K132k348
$$ -187 211 -236 267 -299 334 -373 414 -461 509 -565 622 -687 759 -839 921 -1015 1117 -1231
53a231K589k857L156l493L873m306M808n400O107o964Q034r413J1261j3895J8003
$$ -1231 1358 -1499 1657 -1836 2037 -2269 2539 -2861 3246 -3718 4316 -5097 6164 -7731 10272
68A0272k5627O7016j70896J45828O3238k45436K18998n1883q2174J35740p7392
$$ 10272 -15355 51661 -119235 26593 89831 -155605 63393 11510 -70664 65076 -12316
79a2316j09N1620q1919N9126j2281l2901N0379j3637j9001K5746p161k0752R595
$$ -12316 -12425 39195 -42724 16402 4121 -28780 21599 7962 -11039 14707 7546 -13206 -3611
92c611N450k8178K9294j1649j6436M4385m5823J1418M6597p0195N0976K0524o4416
$$ -3611 1839 -26339 2955 -8694 -25130 19255 -26568 -15150 31447 -38748 12228 32752 -31664
105c1664O1404k3040l5403M7126m7863J8733K1520m1919N3027j4761l0825N0449
$$ -31664 29740 6700 -28703 18423 -29440 -10707 10813 -31106 21921 7160 -23665 26784
117B6784l7915j0647L8784k9156Q126K8429j8823K620J7366k7568o878K3196l8148
$$ 26784 -11131 -21778 17006 -12150 -4024 24405 5582 8202 25568 -2000 -8878 14318 -23830
130b3830P347L9547m9542L2970L0868o5017N1687m762n4410O7636l6365j4454
$$ -23830 -16483 23064 -26478 6492 37360 -27657 24030 19268 -35142 32494 -3871 -18325
142a8325O2950o2124K1783K8360o5044M6885p902l5886N1407l3755J326K8245
$$ -18325 44625 -17499 4284 32644 -32400 14485 6583 -29303 22104 -11651 -10325 17920
154A7920m0448K8316K299k6625M0446j4600j2668K6079k3496q560J2144j6532
$$ 17920 -22528 5788 8087 -18538 21908 7308 -5360 20719 -2777 -11337 807 -15725
166a5725o46J5098p069L739J7421j7985L893J1613l4473K1872Q795l2698M4533
$$ -15725 -16371 -1273 -8342 -4603 12818 -5167 -1274 10339 -24134 -2262 6533 -26165 18368
179A8368o588k6858M3871l5691j0233L1798m2901J9374J6421l1493L6253o587
$$ 18368 11780 -15078 28793 -6898 -17131 14667 -28234 -8860 7561 -23932 12321 5734
191E734j8549L2193k1793l729K3788k4092O840J3769j9110M974R665j6223J949
$$ 5734 -12815 19378 -2415 -6144 17644 -6448 392 14161 -4949 25 9690 -6533 -4584
204d584J3687j6759N219J5661k2823J2583Q261k5480K6310n010j6040L5320k4618
$$ -4584 9103 -7656 -2437 13224 -9599 2984 11245 -14235 12075 7065 -8975 26345 1727
217A727k937K6045m2156J4738J0960l7230L6038l179j9734L9924k4699o167K5963
$$ 1727 -1210 24835 -17321 -2583 8377 -28853 7185 4006 -15728 24196 -503 -6670 19293
230A9293l4972J0969J3789k4132K2294J684j3274J6668j3440o898Q230j6087M674
$$ 19293 -15679 -4710 9079 -15053 7241 8925 -4349 12319 -1121 -8019 211 -15876 -11202
243a1202J0538j1767J1014J1300j6622R117Q089k1544J3821M740j9984K0281p648
$$ -11202 -664 -12431 -1417 9883 -6739 2378 10467 -11077 2744 7484 -12500 7781 133
256A33j4032K2230k0340J286K2271k6254J7279R803k7283K2448n999j5149K3493
$$ 133 -13899 8331 -12009 -10723 11548 -14706 2573 12376 -14907 7541 1542 -13607 9886
269I886j3476L882J6196j8500J1453P08k0933J2057l184j3185J4101M713p261
$$ 9886 -3590 292 16488 -2012 9441 10149 -10784 1273 -1911 -15096 -995 3718 -3543
282c543J0527O598j3701M388M375j5545Q860K624q361J3969p729m21P395j8425
$$ -3543 6984 13582 -119 4269 8644 -6901 1959 4583 -3778 10191 2462 2041 9436 -8989
296h989J0713j173j5965K3941j1735n449K5883k3546N575J7943k8550J5188P242
$$ -8989 1724 551 -15414 8527 -3208 -8657 17226 -6320 -745 17198 -11352 3836 11078
309A1078k3880J8452l014j5410J5543q243m565J3266r231L165R837j2264L871
$$ 11078 -12802 5650 2636 -12774 2769 -5474 -10039 3227 -6004 -2839 6998 -5266 -1395
322a395O883j6130P581R360j5977J4147O491j8921J4829n606j7724J7593j1952
$$ -1395 5488 -10642 -3061 6299 -9678 4469 10960 -7961 6868 1262 -16462 1131 -10821
335a0821k930K1769j4158Q082J2777j8946R862L73j5045J2358m339l434J1523
$$ -10821 -13751 8018 -6140 1942 14719 -4227 5635 6008 -9037 3321 -1018 -4452 7071
348G071p343J905M245r739L192J912o679M703M845n116L434M467o240K861K542
$$ 7071 -272 1633 5878 -3861 -669 1243 -5436 -733 4112 -1004 2430 6897 657 3518 6060
363F060n098N097k805l566N919j1674K129P011j3724J1918O367j3625J4929j978
$$ 6060 962 6059 3254 -312 5607 -6067 -3938 3073 -10651 1267 7634 -5991 8938 6960
377F960j3391J3369q304n285J1692q732M497O263j0905P724k669j2131J0789o079
$$ 6960 -6431 6938 -1366 -6651 5041 -3691 806 7069 -3836 3888 1219 -10912 -123 -6202
391f202n816J5226n759j144J3850j0050j281P844j2598K174N201q820P465J079
$$ -6202 -12018 3208 -2551 -3695 10155 105 -1176 6668 -5930 -3756 1445 -7375 90 1169
405A169o338Q450o668k276Q744j0682M904P856j2208J0269K983j2466J2437k096
$$ 1169 -5169 3281 -3387 -5663 3081 -7601 -2697 5159 -7049 3220 6203 -6263 6174 4078
419D078q555J2154p042l634P965r708J263M168p698Q255K093m580J0782m066n497
$$ 4078 -4477 7677 635 -2999 4966 -4742 -3479 689 -7009 1246 3339 -1241 9541 5475 -22
434b2P861r388l179R414p247J877R759q021J350L326j0273J587K321o120O816
$$ -22 7839 -1549 -4728 4686 -2561 -684 9075 1054 2404 5730 -4543 -2956 -635 -6755 61
449F1K825l070P027k765l164M735p316l65N129q882L997M640j0234P747J417j0041
$$ 61 2886 -184 6843 4078 914 5649 -1667 -2032 3097 -5785 -1788 2852 -7382 365 1782 -8259
465h259J0339j780o733J1124n841k726Q607q834K453N467r257P844O9q713R263
$$ -8259 2080 300 -6433 4691 -1150 -3876 4731 -4103 -1650 3817 -5440 2404 2473 -6240 3023
480C023n826o506J0550p076m17J1685p265K463P616r837K256L030r592N238J953
$$ 3023 -2803 -9309 1241 -5835 -6252 5433 -1832 631 8247 -1590 666 3696 -5896 -658 1295
495A295o262Q791q10n330P744o752k891P118q346L811O894o496P698R12q103P181
$$ 1295 -4967 3824 3014 -2316 5428 -1324 -4215 2903 -5443 -1632 5262 -1234 6464 7376 -727 6454
511F454m457n699P282n382m22N624n615K313K122m343L685P40l177M080k47m215
$$ 6454 1997 -3702 3580 -1802 -2224 3400 -2215 98 2220 -2123 1562 2302 -875 3205 2958 -1257
527a257L409j224m000N364j346l028O665n129j891N177r630K701M561q834J0194
$$ -1257 2152 928 -3072 2292 946 -2082 4583 -546 -2437 2740 -6890 -4189 372 -8462 1732
542A732J905p056J1175n912n109P836j0729J945N229q645Q933K32p273R920n625
$$ 1732 3637 -3419 7756 1844 -3265 4571 -6158 -4213 1016 -7629 1304 1536 -5737 4183 -1442
557a442m968R571p188l12Q353o119K157N106o041K710J339o704M692o69n901P679
$$ -1442 -6410 3161 -4027 -4339 4014 -2105 52 5158 -883 1827 3166 -3538 1154 485 -5416 2263
573B263k892l950R104n898o72Q743q522M026L995r474P926k002q472J1839o126
$$ 2263 -629 -4579 4525 -1373 -2045 6698 -1824 2202 6197 -3277 4649 2647 -5825 6014 -112
588a12l632J1913r245l87O904j0110K878K885n054O282K55j587N810m092k223
$$ -112 -3744 8169 -1076 -1463 5441 -4669 -1791 1094 -3960 2322 2577 990 6800 2708 485
603D85L236o237j530M927m100p0P396n426K47N234q115K313K993p323P615l61
$$ 485 3721 -2516 -4046 881 -3219 -3289 4107 -1319 -1072 4162 -3953 -1640 1353 -5970 1645 1284
619A284n458R904o610k237Q476j0422K980M977j0537Q031l98q021R920l648k839
$$ 1284 -4174 5730 -880 -3117 5359 -5063 -2083 2894 -7643 388 -10 -8031 1889 -1759 -4598
634d598R449n148k59N351n913p3K014l843J565J565k052M012m48l568M663k960
$$ -4598 4851 -297 -556 4795 -1118 -1191 823 -3020 -1455 110 -1942 2070 1622 -1946 2717 -243
650b43m625P984m934j809J0558o934R56P291r285K738J209p432O291l033j333
$$ -243 -4868 3116 -1818 -3627 6931 -3 953 8244 -1041 1697 2906 -4526 1765 -1268 -2601
665b601O993o120L039L002p014N138k47n026O214k155k188N031l496o40K271k824
$$ -2601 4392 -1728 1311 4313 -2701 2437 2190 -2836 3378 1223 -965 4066 570 -70 2201 -623
681f23q40K016k042o72K233k018O1L021l267L184J790m845N796k680n216P218
$$ -623 -1463 553 -1489 -2161 72 -1946 -1885 1136 -2131 1053 2843 -2002 3794 1114 -4102 3116
697C116p229j270Q512q507M258N702r136O193m08p502P445m166p92P445n376L202
$$ 3116 -4113 -5383 3129 -5378 -1120 4582 -4554 1639 1231 -6271 1174 -2992 -3784 3661 -1715 1487
713A487L495p236L961n30o338M588J87m500N917O10m459N902j044m513O482l472
$$ 1487 4982 -2254 1707 1177 -5161 -573 -386 -4886 1031 1641 -2818 3084 2040 -2473 4009 537
729E37j685N712o298K393L236p921P546j315o492J0559o953k458R202j0338K992
$$ 537 -1148 4564 -1734 659 3895 -4026 3520 2205 -4287 6272 -681 -3139 6063 -4275 -1283
744a283O371r378P458J318o232O873l093l904L966m001l90K699k289J696J553
$$ -1283 5088 -4290 3168 4486 -1746 5127 2034 -1870 2096 -1905 -2295 404 -1885 -189 1364
759A364j725J129P13l806J563J695m599M720J233n505O817j866n461O677n994
$$ 1364 -361 768 1481 -2325 -762 933 -3666 1054 2287 -3218 3599 1733 -3728 2949 -3045
774c045j608N667o274M272K527n469O455k259l187O370n248j99M646n225J872
$$ -3045 -4653 1014 -5260 -988 1539 -3930 2525 266 -2921 3449 -1799 -1998 2648 -2577 -705
789g05K034l887K954j21k421L041n94k262L080j388k307M025j935o27N374l456
$$ -705 1329 -2558 396 275 -2146 895 301 -1961 1119 -269 -2576 1449 -486 -1113 4261 805
805H05O87L474o640K311Q47o995O801n97m235Q431l541j703N312o166K043J182
$$ 805 1492 4966 -1674 637 1484 -5511 1290 693 -3542 4889 1348 -355 4957 -1209 834 2016
821B016m737N317j306k646N995m544j276M839n464k34L494l703R90K358k456J502
$$ 2016 -2721 2596 1290 -1356 4639 95 -1181 3658 -1806 -2040 1454 -2249 -1259 1099 -1357 145
837A45J382k122J771rk745L049j581k938M354l129j235M595m054J447K762m536
$$ 145 1527 -595 1176 1167 -1578 1471 -110 -3048 1306 -1823 -3058 1537 -2517 -1070 1692 -2844
853b844L530l30m443N919k867k474P312m560o01N351n203l90K609m795J894J927
$$ -2844 686 356 -4087 1832 -1035 -3509 3803 -757 -1358 3993 -1210 -1600 1009 -3786 -1892 35
869C5k639L454Q59k150K838j482k674L470k390j269M587l076O91L319m789K325
$$ 35 -2604 850 1709 -441 2397 915 -1759 1711 -679 -1948 2639 -437 254 3573 -1216 1109
885A109Q11n126N002j215l383O168l283j200N257m455J358K910m850K729m39l592
$$ 1109 1920 -3206 1796 581 -2802 3366 83 -1117 4140 -315 1043 3953 -897 1832 1393 -2199
901b199L755l024p00M511m056J254M062m946J699J608m389J897R46k506L328k73
$$ -2199 1556 -1468 -2168 2343 -1713 -459 3603 -1343 356 1964 -2425 -528 418 -2088 1240 967
917I67j588K896k748j196K261l646M30K851l233K591J736l041K998l22l148L348
$$ 967 -621 2275 -473 -1669 592 -3054 -2624 227 -3006 -415 1321 -1720 1278 956 -2192 1156
933A156j908j971L861k063q27L129k677N71J494k206J302j01j119K108j212j27
$$ 1156 -752 -2723 1138 -925 -1752 1377 -1300 -729 765 -1441 -139 -240 -1359 749 -463 -590
949e90K925k851Q61K605m092J613K149m864K278J610m297L505Q71l158L763o05
$$ -590 2335 -516 345 2950 -1142 471 2620 -2244 34 1644 -2653 852 1723 -1435 2328 1723
965A723j808K532k800l5K132l342K939P43k904L837j330l505L767k946j855L991
$$ 1723 -85 2447 -353 -388 1744 -1598 1341 2084 -820 3017 1687 -1818 1949 -997 -2852 1139
981A139k567M05L761k918Q45J637l373J496k95k451K871j309j040K763k156o5
$$ 1139 -1428 -1023 2738 -180 665 2302 -1071 425 130 -2321 550 -759 -1799 964 -1192 -1257
997a257K469k843J009J155k805J724O24k081K309j7j254K369j535m78J647k461
$$ -1257 1212 -1631 -622 533 -2272 -548 76 -2005 304 287 -967 1402 -133 -611 1036 -1425
1013a425k29J586k720K539J064k670L298O13l311L347j149l223M006k147j271
$$ -1425 -1654 -68 -2788 -249 815 -1855 1443 2056 -1255 2092 943 -2280 1726 -421 -1692
1028a692L661j578m45K140k476Q97rj951K190q24q79L367j877KK671k984l56K371
$$ -1692 1969 391 -54 2086 -390 507 498 -1453 737 -87 -966 2401 524 526 3197 213 -143 2228
1046B228l359P41K033l129K082R52l024L096q42j978L106k322o82K864l465J566
$$ 2228 -1131 -390 1643 -1486 596 1548 -1476 1620 778 -1200 1906 -416 -1098 1766 -1699 -133
1062a33J656l499L325m01k857L666k275k238L513k837j26L026k085J378J734k219
$$ -133 1523 -1976 1349 948 -1909 1757 -518 -2756 757 -2080 -2206 820 -1265 113 1847 -372
1078c72R76m38j928J129n13p10K207o74n96K280k189o20K244k758Q17J829k553
$$ -372 604 166 -1762 -633 -1146 -1856 351 -323 -919 1361 -828 -1448 796 -1962 -1145 684 -1869
1095a869K216Q52k082K325q81j411K622k297J19J719k842J699N70k057K872l89
$$ -1869 347 1199 -883 1442 561 -850 1772 -525 -406 1313 -1529 170 740 -1317 1555 1166
1111A166k009L171j592j562K948k098o09K562k026J40K100k373P36Q13k351J105
$$ 1166 -843 2328 736 -826 2122 24 -585 1977 -49 91 2191 -182 554 1367 -984 121
1127A21L09k177K753n25j481L613k321l58K345l953R47J743l563K746P20k673
$$ 121 430 -1747 1006 481 -1000 2613 292 -66 2279 -1674 -727 1016 -2547 199 919 -1754
1143a754K973j308j379K583k597K43J770k393J660J021k040J916k69j943J822
$$ -1754 1219 -89 -1468 1115 -1482 -1239 531 -1862 -202 819 -1221 695 426 -1517 305
1158C05o48j168J170m41j069J889q86j11J929j366M54J390k639J210N66k533K502
$$ 305 -343 -1511 -341 -782 -1851 38 -848 -959 970 -396 58 1448 -1191 19 585 -1948 554
1175E54o5j628L220j892l23K399l328J026R62k899K471N77j885K933q89j268K095
$$ 554 489 -1139 2081 189 -134 2265 -1063 -37 925 -1974 497 1074 -811 2122 1233 -35 2060
1192B060j996n55J498j942K16J679j502R04J151k004J247J75j758J685n55j845
$$ 2060 64 -491 1007 -935 -719 960 -542 362 1513 -491 756 931 -827 858 303 -1542
1208a542L139k007l77K846l039Q13J964l674J821L73k614K913j124j066K669j797
$$ -1542 1597 -410 -787 2059 -980 -167 1797 -1877 -56 317 -2297 616 -508 -1574 1095 -702
1224g02O21J051k367J466l22j590K023p23r68K158q98l02J181j214m68J091j086
$$ -702 -81 970 -1397 69 -253 -1843 180 -543 -1511 647 -251 -553 628 -586 -1054 37 -1049
1241a049k30J712p98N65J295j741J165m24j605J803j444k80K406k259R71K326
$$ -1049 -1279 433 -365 200 1495 -246 919 495 -1110 693 -751 -1031 1375 -884 87 2413
1257B413l557K003R53l591L339q79j847K684j537l53K184j901M45J213k164J260
$$ 2413 -1144 859 1812 -1779 1560 681 -1166 1518 -19 -372 1812 -89 356 1569 -595 665
1273F65p2j527J315l4j279J833K48k111K526j314j724K708j390r83K310k250N32
$$ 665 593 -934 381 347 -932 901 1149 -962 1564 250 -1474 1234 -156 -1139 1171 -1079 -547
1290e47K450l266K186l62k161K795k296l23K658k942J550J576k940K180M7k671
$$ -547 1903 -1363 823 461 -1700 1095 -1201 -1524 1134 -1808 -258 1318 -1622 558 605 -2066
1306b066K108n77j142J544o60K88O98m97m4Q76j010J52Q25j761J094Q56k138K102
$$ -2066 42 -535 -1677 -133 -793 -505 193 -304 -348 528 -482 -330 495 -1266 -172 684 -1454 648
1324F48J79k235L016j524j283K962k454l70K565k645J727Q65j875K008p74r94
$$ 648 827 -1408 1608 84 -1199 1763 -691 -1061 1504 -1141 586 1451 -424 1584 810 -184
1340a84J421j530k41J194j386J191R20j590J190J12j572O41L52j340Q96M91r42
$$ -184 1237 -293 -534 660 -726 465 1385 -205 985 1097 -475 166 518 -822 74 565 -377
1357c77J088l04q35J334j136m26J169k001J581J67k189K775r97j334L283k479
$$ -377 711 407 -428 906 -230 -656 513 -1488 93 260 -1929 846 -151 -1485 1798 -681
1373f81l57K307k884R63J088k326K054M1j366J770q04p34J691j812Q9J204j146
$$ -681 -1038 1269 -1615 -652 436 -1890 164 205 -1161 609 -195 -929 762 -1050 -961 243 -903
1390i03M76J416j887J087J103j928R24K80j907J484K05j686K421p84m56J532j571
$$ -903 -427 989 -898 189 1292 -636 288 568 -1339 145 350 -1336 1085 301 -155 1377 -194
1407a94M64O18j615J443k62j074K146j091o71J852j778K38Q53j604J017L93j379
$$ -194 270 888 -727 716 454 -620 1526 435 -236 1616 -162 76 929 -675 342 735 -644
1424f44J180Q7p70J140o10p50P75o22n08J211j196J35J149j092Q39N78k031J663
$$ -644 536 623 -147 993 383 -367 408 -214 -722 489 -707 -572 577 -515 324 902 -1129 534
1442E34J1k300K173p61j187K688j659J26J381j611L41O09j978J295nj059J846
$$ 534 545 -1755 418 -343 -1530 1158 -501 -375 1006 -605 -264 345 -1633 -338 -343 -1402 444
1459D44o37l86J103p53k47J078j366M44P06j512J277L5j022J691n39r68J470j154
$$ 444 -193 -579 524 -229 -476 602 -764 -320 386 -1126 151 186 -836 855 316 -652 818 -336
1477c36k12J318j296L36J166j360J056L44j319J311p66q53J401q42PJ357j633
$$ -336 -548 770 -526 -190 976 -384 672 1016 -303 1008 242 -611 790 -52 -45 1312 -321
1494c21N77P75j405R67J80j253J220o08o31J164m18n94J443j162j94J192j412
$$ -321 256 1031 -374 593 773 -480 740 132 -499 665 247 -347 1096 -66 -260 932 -480
1511d80J03O43j235Q74M50r60J091k75j028J448r41o24J289j203M58R21j270R32
$$ -480 -377 266 -969 -95 355 -605 486 211 -817 631 -310 -934 355 -848 -390 531 -739 193
1529A93L58j530J319m63q12J239r55k15J249j131K49J494j549N58N30j642R06
$$ 193 551 -979 340 -123 -935 304 -651 -866 383 -748 -499 995 -554 4 534 -1108 -202
1546b02J25q88J303n89j43J355j155J80R84j719Q66N31j552J235J39j264J726
$$ -202 -77 -965 338 -251 -394 961 -194 -14 970 -749 117 648 -904 331 470 -794 932
1563I32k55j343J754r41n24J433j242N4P90r58P82N11j328R70l10q52J009m96
$$ 932 677 -666 1088 147 -377 1056 -186 -132 658 -300 482 993 -335 635 325 -527 482 -14
1581a4n06J277r90L3J331j440L33M57j271O74J69n87M31M4j62P06q45L24J93r68
$$ -14 -520 757 -233 -200 1131 -309 24 481 -790 -116 53 -534 -103 -59 -221 485 -360 -36 157 -811
1601h11N29N12j324J098j91q51J372L7j275J224m69n28O95m08r8O02n16M07K21
$$ -811 -282 230 -1094 4 -187 -1038 334 371 -904 320 -149 -677 18 -390 -488 114 -402 5 226
1620B26q85R42j49q82J395p87n07J371j161K65J011q73K63M34q61L35M50q59N79
$$ 226 -659 283 134 -748 647 -140 -647 724 -437 -172 839 -34 229 663 -198 137 587 -272 307
1639C07kj93M99l99J39K99n55k16M54p38N22R9o35J076j62p87J396q97o22Q92
$$ 307 305 112 611 212 351 650 95 -121 333 -405 117 216 -419 657 495 -292 1104 207 -415 477
1659D77o37j03N09q42P14M09p22O23o51Q0O44j063K13P33j027M06N98q71M45K54
$$ 477 -160 -263 246 -596 118 527 -195 428 -223 -143 501 -562 -349 384 -643 -237 361 -510 -65 189
1679A89o56J57L60q78N59J77m97N53l5l97J055j152K87O90j275R51M18j507J543
$$ 189 -467 -310 50 -828 -269 -92 -589 -36 -71 -468 587 -565 -278 412 -863 88 506 -1001 542
1698E42M8j199J313n62n97J023r79J00P68p77O21K68q50R65m94n3N56n41q17J540
$$ 542 590 -609 704 142 -455 568 -411 -311 457 -320 301 569 -281 684 190 137 693 152 -665 875
1718H75o19m21J322p70K51J35k3j177Q66l42K49L19p91M94k56k22P34p85J03M89
$$ 875 256 -165 1157 387 638 773 750 -427 439 97 346 665 -126 368 112 -110 624 -161 -58 431
1738D31j153O78K46q41R34k40l93Q51n34j87L99m36q1J39l23J82L60l65J96L12
$$ 431 -722 -44 202 -639 295 55 -338 513 -21 -208 191 -245 -326 -187 -510 -328 32 -333 -137 175
1758A75o38M21n3m20P17o08j65R86o55Q1O17r22L30O91j222P95q4l79Q95n48k37
$$ 175 -463 -42 -95 -515 202 -406 -571 415 -240 -159 458 -464 -134 557 -665 130 46 -333 562 14 -223
1779b23Q57p14K42M44p91L90o9k56N11J7k21M61n23j76L61j47l22M81n58M8P44
$$ -223 634 -80 162 606 -185 205 136 -120 391 408 187 648 125 -51 310 163 -159 322 -236 -188 556
1800E56q15N29M06j061Q16l11m58P16l65k30O76o39L93L59j085P68k67p25J010
$$ 556 -259 270 676 -385 431 120 -338 378 13 -217 459 -180 213 572 -513 255 -12 -737 273
1819B73j56o79R13n12j14O98o19Q0N7m61L78N9o58O42J29o32P87M3q52J202o99
$$ 273 117 -562 351 -161 -275 423 -196 -116 -59 -520 -142 -83 -741 -99 30 -602 185 228 -624 578 -121
1840a21m91P52m90R3Q78r56L25L27p20K85N9l25N38k69k74O33m11J85J60m01O22
$$ -121 -612 140 -350 -257 621 -335 -10 317 -403 -118 -59 -384 154 -115 -389 244 -167 18 178 -223 399
1861C99K01o80Q8Q0j96M59K0l75M45l24k75N44m53J73K77p06O46J79n31N69l28
$$ 399 600 -80 8 88 -108 351 371 -4 441 117 -158 386 -67 106 383 -323 323 502 -29 540 212
1882B12k75M61n89j60O21m97n0Q48o08K78j04l88M79l48j11J06l13L05K00k88
$$ 212 -63 398 -191 -351 270 -227 -277 571 -37 241 137 -251 228 -120 -231 -125 -438 -133 67 -221
1902b21L07j8n25L18N4m47N62j07m71N41K01o25M95r4k42M23n23L68N1m76N13
$$ -221 86 68 -457 -139 -85 -532 30 -77 -548 -7 194 -431 64 -30 -272 151 -372 -4 47 -429 84
1923H4R1n17Q70o64j59Q73o64k05R39r57N8Q18o71M45j67l51M51K1k75K10K8l94
$$ 84 175 -342 528 -136 -295 578 -86 -291 648 -309 -251 567 -104 341 174 -177 274 295 20 230 258 -136
1945a36M36l82Q6P89n46q7L51o55J89P3n21O87M13r72O99k79m96O94n86R5K03
$$ -136 300 -82 4 793 247 160 511 -144 45 118 -403 284 697 -275 424 145 -351 343 -243 -148 55
1966E5l64N37J67n89O59l46k61M26o41L76L60q65K86J71m04K50M16o57K30Q2k33
$$ 55 -309 228 395 -194 465 119 -142 284 -357 19 379 -486 -200 -29 -433 -183 233 -424 -194 -112 -345
1987c45J92O9j58M27j97k6N20r09K60N66p68M32P6p32N67K10n60J111p40j1M87
$$ -345 -153 -84 -242 185 -12 -38 482 -427 -167 399 -369 63 139 -593 -26 184 -376 735 -5 -16 471
2008D71l01n8M18q52M05o5m89Q25l26q0L43k71k53N76m29N4L40n93M75M10o51
$$ 471 170 112 530 -322 83 18 -471 354 28 -52 291 20 -233 343 -86 -32 308 -285 190 600 -51
2029e1N63k00n31N87j68n04L21q8K5L47o43L61K22n24L47P4k05L44m10k32N01
$$ -51 512 312 -219 368 200 -304 17 -71 -46 301 -342 19 241 -283 64 138 -67 277 -133 -365 136
2050A36n06J66N29o67l1N32p38M58j32j6K46j53q1M82k14p3L72o15q2P81o21N9
$$ 136 -370 -204 325 -342 -373 159 -579 -121 -253 -269 -23 -176 -257 225 11 -62 310 -305 -387 394 -227 -168
2072a68l2l20N87j37l92L24K63n87O79j65k42l2J77L69n82m4N55J99j70L5n56
$$ -168 -200 -520 67 -70 -462 -138 125 -462 217 52 -190 -222 -45 324 -258 -302 253 452 282 317 -239
2093b39n89Q79q6J51R08o52l82K55l80J15j29k6L27K98q95L87N6k89P68j079K02
$$ -239 -828 51 -35 116 1024 372 -10 245 -135 -20 -149 -175 152 450 -445 -58 -2 -291 477 -602 -400
2114d00R89p35K48J52o25N03J51o42N74m55j08N01n11p5N24k44K8N6l26M90L7
$$ -400 589 -146 102 254 -371 132 283 -359 215 -240 -348 153 -358 -433 91 -153 -125 -69 -395 95 132
2135A32o43O91m33p7O35n17K52K46n53q4M73l34J89K9q5K24k00j63O42m34j9L42
$$ 132 -511 180 -253 -330 305 -212 40 286 -267 -351 122 -212 -23 6 -79 145 -55 -218 424 -10 -29 313
2157C13m83j10O51m93l9M67n44L62M79j264J006l09m66O68m0j36M13k00l4j6j79
$$ 313 -170 -280 371 -122 -161 306 -238 124 603 -661 345 36 -430 238 198 62 475 275 241 225 46
2178D6K76j88l73L05Jq4N01o86K65L68m38n4K27k87L2Ok03O9L33m32O84q43L32
$$ 46 322 134 -239 66 67 -17 484 -202 63 431 -7 -61 166 -121 -89 -83 -286 -217 116 -316 368 -475 -143
2201a43L01m84L47l75m71Q49j28J91J98m88l78J263p85l76N21l85J88K47o50P39
$$ -143 158 -326 21 -354 -825 24 -104 87 285 -203 -581 682 -103 -479 42 -343 -155 92 -558 181
2221A81Q1r27O80l0r4J59j91j80P59l01o62P74l95j23N96o65L21l1n16O69R3k10
$$ 181 262 -665 15 -15 -109 50 -141 -321 438 137 -525 249 -146 -269 327 -338 -17 -48 -564 105 198 -12
2243a2K16j18N0j25K8j19K94k97L37j09j90N49j67o36K62J33k53M93m58nL44m31
$$ -12 204 86 136 11 39 -80 214 -83 254 145 -45 504 337 -299 -37 96 -157 336 -122 -127 217 -214
2265b14J82K43n04K19K99l68Q8k54L45o2j90N19k37k68Q7L86n07l0O6j29K40N5
$$ -214 -32 211 -293 -74 225 -143 -55 -309 36 -26 -216 303 66 -202 -115 271 -236 -266 -200 -329 -89 -34
2287c4k80L50j07k83M74n25L86K26n37L28O0l16M37J25l16J91j69j38L53k93o9
$$ -34 -314 36 -71 -354 120 -405 -19 207 -330 -2 58 -258 179 304 -12 179 10 -128 225 -68 -137
2308a37M09m04P2R4K75j01K38n73J33L30k36R2K73j61M17r24L25J22l78L14J09
$$ -137 272 -132 -60 34 309 208 446 -127 6 336 100 192 465 304 721 -203 122 244 -134 180 289
2329B89k13Q1j93j11K48M6j86L65j34q9k2k92J70M6k94L47L14o75K83j75k66Q85
$$ 289 76 157 -36 -147 101 147 -39 326 192 103 81 -211 -41 5 -289 58 372 -303 -20 -195 -461 424
2351D24q31J5N80k25j40L79j48j52J52j99Q0K41n49M50o2m42M99k38O7K64m26
$$ 424 -407 -392 188 -37 -177 202 54 -98 54 -145 -65 176 -373 77 15 -427 72 -166 -99 165 -261
2372b61K49Q6k53K02j14J57j14K14j76K21m86L89j9m6J8Qk01K26K15k78K50n3
$$ -261 -12 74 -179 23 -91 66 -48 166 -10 211 -275 114 95 49 67 75 -126 100 315 37 287 234
2394B34n29N20k14j59M39m27K5L56l77J64J58J7j24P5l58O7L43j85L20m40m7K94
$$ 234 -295 225 11 -148 291 -136 -111 245 -132 32 190 207 83 158 -200 -133 210 25 345 -95 -142 152
2416A52l20K6K22k71K84j74O7J61j74r8R1Mk72L81j26Ll1N3q3J09k15J32N5k04
$$ 152 -168 -142 80 -191 93 -81 -14 147 -27 -125 -34 -30 -302 79 -47 -44 -75 -22 -105 4 -211 -79 -24 -228
2440b28J56J9k12L83m4m94O41k75K36l07l2J81O8J3J30k21J3r5O9o8K16m40K63
$$ -228 -72 -53 -265 118 74 -420 221 -54 182 -125 -157 24 92 105 235 14 27 -68 1 -67 149 -291 -28
2463b8J7k31K76N6J39N2R2m48L70l17k30L29j23r9L45m27O14l19l28O89k93n1
$$ -28 -11 -242 34 90 229 281 373 -75 295 -22 -252 77 -46 -145 200 -227 387 68 -260 429 136 85
2485H5on2R5m1o7o8L47j75l5J02l84K85j48m14L46L35l14J54j0k2j62K5o5m8p1
$$ 85 79 27 122 81 14 -54 293 118 83 185 -199 86 -62 -476 -130 205 -109 45 35 13 -149 -124 -189 -237 -308
2510c08L13r6l03N25k45O2P1j81r9L74l00K69k39K23j27M7K18M0k13Q5J90n10
$$ -308 5 -91 -394 131 -114 -52 19 -162 -261 113 -187 82 -157 66 -61 -14 204 244 31 116 306 -204
2532b04L17K50l80M3q2n8K85Q6k28k67L50j1j35K71m88L40j30L84k32j2l6N7l83
$$ -204 113 363 -17 26 -56 -114 171 257 29 -238 112 101 -34 237 -251 89 -41 343 111 99 63 120 -263
2555b63J96R0k74M58l10J37J00l4l12K95k12K24q7k50K66J07m48J44K86l54K90
$$ -263 -67 23 -251 207 -103 34 134 100 -212 83 -129 95 8 -242 24 131 -317 -173 113 -241 49
2576D9q5p3K80l41R9K94j92m8l9k71K49j17J90J10k74J11N5o1n6J37k08K11NL6
$$ 49 -36 -109 171 -170 -71 223 31 -17 -56 -327 -78 -195 -5 105 -169 -58 -3 -64 -120 17 -191 20 25 61
2600F1j3q3q4J13N3k84L45q8K6N4k38j61K36m5L3J61J68j0l31J93j3j82n5L12
$$ 61 48 -35 -119 -6 47 -237 108 20 46 100 -138 -299 -63 -108 -75 86 254 244 -87 106 93 -89 -144 168
2624A68m22L50J12l74M21j64q5K00k04j13M65l03r2K26l40J74K43n08K11m9O4
$$ 168 -254 96 208 -166 255 91 6 206 2 -111 354 51 -41 185 -155 19 262 -246 -35 -84 -20
2645b0L85k01l64J48q0J23jk24K32J83l10k8K27j62j09L59l09j9K67j47L3O4k37
$$ -20 365 164 -200 -52 -132 -9 -10 -234 -2 181 -129 -157 70 -92 -201 158 -151 -170 97 -50 -17 47 -190
2668a90L14k80o5J93k3K80j56k90L93k21j13L31j33j26J20J83k06J64k30J15M8
$$ -190 124 -156 -221 -28 -51 229 73 -217 176 -45 -158 173 40 -86 34 217 11 175 -55 60 108
2689A08k91J36K74l30K80j44R0o8m02J69L21j03O5K62j96j71K33k09J04Oj30J17
$$ 108 -183 -47 227 -103 177 33 123 55 -347 -178 143 40 105 367 171 0 233 24 128 134 4 121
2711A21j94k8l2M3J43Kj02J59j30K39k65ql76M48p2j81J57j36K94j95Q2o4Q6r5
$$ 121 -73 -101 -133 -90 53 55 -47 112 -18 221 -44 -52 -428 20 -52 -233 -76 -212 82 -113 -31 -95 -9 -104
2735a04j4J43m4J03k37qK08l36K82K11o00M72l9KK06Q2l78N8k24L11M0M1j67m0
$$ -104 -118 25 -19 84 -153 -161 47 -289 -7 204 -396 76 37 39 245 327 -51 7 -217 94 134 175 8 -32
2759c2RK31J51j92k22J04oK9j84K18J50j24l27J45J17l30M93p7j6k18r8J30M9
$$ -32 -23 208 359 167 -55 49 43 72 -112 106 256 132 -195 -50 67 -263 230 153 137 -81 -179 -49 0
2782@j3L51l39K19P1l61J71R7Lj49K44k00K0O3j16o4q9Pj28j14J98J9K82k76k87
$$ 0 -13 338 -1 218 289 -72 99 196 199 50 294 94 114 177 61 -3 -92 -85 -213 -327 -129 -110 172 -104 -391
2807c91O56r81J77QR30n59M58j50k07P8m15J2J31J92L5k00M89J10o98Q99n99j44
$$ -391 265 -716 -539 -531 399 -160 298 148 -59 19 -396 -384 -253 -61 -26 -226 263 373 -325 574 -25 -169
2829a69l0j75R8j82N91m2N5k47N5O9K1J68l50R6J97m20J40J98j19j56K71O6j65
$$ -169 -199 -374 -276 -458 133 91 146 -101 -46 23 44 212 -138 -42 155 -265 -125 73 -46 -202 69 135 -30
2852c0n2O2L82k16r8K08j42j76K88k29N4M0j14P4j36K38j49J60p8k6m7j24K18
$$ -30 -82 -20 362 146 48 256 114 -62 226 -3 51 91 -23 51 -85 153 4 164 86 60 13 -111 107
2875A07k12J57k48K90J2k09J06J09j4l77J78k5L09j35k36J09N5R4k43M7J55j8
$$ 107 -105 52 -196 94 106 -103 3 112 98 -279 -101 -126 183 48 -188 -79 -24 70 -173 -126 29 11
2897A1k11L23j26j92K48k51K46q4K04o1R0k47p2o4l0K88j25J06l6P4k23L32l21
$$ 11 -200 123 -3 -195 53 -198 48 -36 168 107 197 -50 -122 -186 -216 72 -53 53 17 91 -132 200 -121
2920a21J09O8nl3K17k35K03r4l40R1L82l27K52L2m2j15j09k32L40k0m1L0k6J14
$$ -121 -12 56 51 18 235 0 203 109 -231 -140 242 -85 167 199 157 42 -67 -299 41 21 -20 10 -16 98
2944I8k28l0r7K50k55mK32J30kM1j20J47k24J1m5J53j62L55l07L0l20J34L51m31
$$ 98 -130 -160 -257 -7 -262 -266 -34 96 94 135 15 162 -62 -51 -96 57 -105 250 -57 -27 -347 -213 138 -293
2968b93K64k92NK64j51J76K2r8L38k11q2K01J75l58j41L59k03n3q9o9J88K9R9
$$ -293 -29 -321 -316 -52 -203 -27 -5 -103 235 24 -58 143 318 -40 -181 178 -25 -78 -167 -236 -48 -19 80
2991H0J13j31K3oj63o8J74J44k53K62n41N85j44L3L0k96J24L60l40j10R0O0j67
$$ 80 193 62 85 79 -84 -152 22 166 -87 175 -366 219 75 108 138 -158 -34 326 -14 -124 -34 26 -141
3014a41k1K03K8pj04J37k22o7K34j29PO1j20J35M6k40J45J26k20J14k33O9K62
$$ -141 -162 41 69 62 -42 95 -127 -194 40 -89 -82 -21 -141 -6 40 -200 -55 71 -149 -35 -268 -199 63
3037F3j7R2j5j93j31J28k33J32J66k56L12j54K41j05o4k04P0M54k90J76n0j30
$$ 63 46 138 123 -70 -201 -73 -306 -174 -8 -264 48 -106 135 30 -34 -238 -168 286 -4 172 122 -8
3059hJ39k28j29P0K32j11K66k34k2K11k87O2J97m7L2j0M1l3k62J70J09q4P9k41
$$ -8 131 -97 -226 -156 76 -35 231 -3 -25 186 -101 -39 158 111 143 133 174 141 -121 49 158 74 153 -88
3083h8Q9oO3R5k14l5l3J0J05j10K44o5j36RJ89k33j66K15o1J44l8j52J9K94l69
$$ -88 1 -5 58 153 -61 -96 -129 -119 -14 -124 120 55 -81 -72 117 -116 -282 -67 -128 16 -22 -174 -155 139 -230
3108b30O2J32J25k14K63k67L3o8l0J87k1J39k26J16m4Q1o5J25l17J27P2j2q9K49
$$ -230 -168 -36 89 -125 138 -129 -96 -164 -194 -7 -28 111 -115 1 -43 38 -27 98 -219 -92 -20 -32 -121 128
3132A28j09O3M3k14k03K38M65o06J18K92k77K04r3j98J76J6Q9K2k4j89K52l39
$$ 128 19 82 125 -89 -292 -54 411 -195 -77 215 -62 142 49 -149 27 43 132 154 130 -59 193 -146
3154a46L81m22J02K56j72kJ86L8n7m9k77L66j44K6q7Q4k09P8N9j48q0K28Q1m7
$$ -146 235 -187 -85 171 -1 -3 183 221 164 115 -162 204 60 86 -1 83 -126 -48 11 -137 -217 11 92 45
3178D5j15K44m50J88q6L08k53K02j06K3k21L13k02N2l6p1P3P5J34q6j50M5j19
$$ 45 -70 174 -276 -88 -174 134 -119 83 -23 0 -221 92 -110 -58 -94 -165 -92 -17 117 31 -119 -74 -193
3201a93j7K13Q6j72r8L21o9k05K21p5m9j9O0j08o4K77O7k01J47q0R6q0j54P8P4
$$ -193 -210 3 89 -83 -181 140 71 -134 87 12 -37 -56 4 -104 -168 109 176 -25 122 42 138 58 -96 -18 56
3226E6k87K07L62l11J83k08k04L01j22l4J32N1k02J50j23J15k29L48j49j18j27
$$ 56 -231 -24 338 27 210 2 -202 99 -23 -57 75 126 -76 74 -49 66 -163 185 36 -82 -209
3247b09J65L8j44J88j84K70j0j84l43O43m19L69o6o3j18Q3Jj58L7J71j34O8j02
$$ -209 -44 -6 -150 38 -146 124 114 -70 -413 230 -189 180 114 51 -67 16 17 -141 -104 67 -67 1 -101
3270a01L37k26nJ42l4k79J64K4Q0j99J07M7K7j69K9K17j92q1J9L12p5j7k80Q9
$$ -101 236 10 5 147 113 -166 -2 22 102 -97 10 57 84 -85 -56 161 -31 -112 -93 219 144 127 -153 -64
3294f4j18J17j61K53j17J5Q3J78k1r5M9j88K04r7j40P4J04j13J60j36K10K3k11
$$ -64 -182 -65 -226 27 -90 -75 8 186 165 70 119 -69 135 38 -102 -28 76 -37 123 -13 197 220 9
3317IK6k08J83K8j01PKj55O4J12j37J98j11j32L7L95l23P7J50k17K50M1l44J52
$$ 9 35 -173 10 38 -63 -56 -54 -209 -145 -33 -170 28 -83 -215 -178 217 -106 -29 121 -96 154 195 -149 3
3341CN4n4j1m2N7K4J19J9k72K55j73J45o3%j9O6R9j20N6N2k02j10o3K74R6l01
$$ 3 57 3 -8 -50 7 31 150 169 -103 152 -21 124 61 61 42 108 207 87 143 195 -7 -117 -180 94 190 -111
$$ [...]
8191h9
##END NTUPLES=NMR FID
##END=
