##TITLE=1H_SL56a-Dau(f4)
 CDCl3,8 sc, 
 1.10.2021
##JCAMPDX= 6.0         $$ Bruker NMR JCAMP-DX V2.0
##DATA TYPE= NMR FID
##DATA CLASS= NTUPLES
##ORIGIN= UXNMR, Bruker Analytische Messtechnik GmbH
##OWNER= root
$$ XWIN-NMR		Version 3.5
$$ Fri Oct  1 09:24:37 2021 Russian Standard Time (UT+4h)  she@DPX200
##.OBSERVE FREQUENCY= 200.1313468511
##.OBSERVE NUCLEUS= ^1H
##.DELAY= (6, 6)
##.ACQUISITION MODE= SIMULTANEOUS
##.ACQUISITION SCHEME= undefined
##.AVERAGES= 8
##.DIGITISER RES= 18
##SPECTROMETER/DATA SYSTEM= spect
##.PULSE SEQUENCE= zg30
##.SOLVENT NAME= CDCl3
##.SHIFT REFERENCE= (INTERNAL, CDCl3, 0, 15.7039)
##AUDIT TRAIL= $$ (NUMBER, WHEN, WHO, WHERE, WHAT)
$$ ##TITLE= Audit trail, XWIN-NMR		Version 3.5
$$ ##JCAMPDX= 5.01
$$ ##ORIGIN= Bruker BioSpin GmbH
$$ ##OWNER= she
$$ F:/spectra/data/she/nmr/H-F/1/audita.txt
$$ ##AUDIT TRAIL=  $$ (NUMBER, WHEN, WHO, WHERE, WHAT)
(   1,<2021-10-01 09:23:26.00 +0400>,<she>,<DPX200>,
      <created by zg, POWCHK disabled, PULCHK disabled
       configuration hash MD5:
       00 E9 B6 7A A2 85 ED C7 34 08 36 98 17 FE 4E 26
       data hash MD5: 16K
       E7 F5 9B 1F ED 55 F2 22 6E 59 4E 16 C1 E7 EC 73>)
$$ ##END=
$$ 
$$ hash MD5
$$ 19 17 5E 77 8E 00 0E F8 5D 30 95 1A FC 53 15 98
##$RELAX= 
##$RELAX= 
##$RELAX= 
##$RELAX= 
##$RELAX= 
##$RELAX= 
$$ Bruker specific parameters
$$ --------------------------
##$DU= <F:/spectra>
##$EXPNO= 1
##$NAME= <H-F>
##$PROCNO= 1
##$TYPE= <nmr>
##$USER= <she>
##$AMP= (0..31)
100 100 100 100 100 100 100 100 100 100 100 100 100 100 100 100 100 100 
100 100 100 100 100 100 100 100 100 100 100 100 100 100 
##$AQSEQ= 0
##$AQ_mod= 1
##$AUNM= <au_zg>
##$AUTOPOS= <>
##$BF1= 200.13
##$BF2= 200.13
##$BF3= 200.13
##$BF4= 200.13
##$BF5= 200.13
##$BF6= 200.13
##$BF7= 200.13
##$BF8= 200.13
##$BYTORDA= 1
##$CFDGTYP= 0
##$CFRGTYP= 5
##$CHEMSTR= <none>
##$CNST= (0..31)
1 1 145 1 1 1 1 1 1 1 1 1 1 1 1 1 1 1 1 1 1 1 1 1 1 1 1 1 1 1 1 1 
##$CPDPRG= <>
##$CPDPRG1= <>
##$CPDPRG2= <>
##$CPDPRG3= <>
##$CPDPRG4= <mlev>
##$CPDPRG5= <mlev>
##$CPDPRG6= <mlev>
##$CPDPRG7= <mlev>
##$CPDPRG8= <mlev>
##$CPDPRGB= <>
##$CPDPRGT= <>
##$D= (0..31)
0 1.2 0 0 0 0 0 0 0 0.06 0 0.03 0 0 0 0 0.0002 0 0 0 0 0 0 0 0 0 0 0 0 
0 0 0 
##$DATE= 1633065805
##$DBL= (0..7)
120 120 120 120 120 120 120 120 
##$DBP= (0..7)
150 150 150 150 150 150 150 150 
##$DBP07= 0
##$DBPNAM0= <>
##$DBPNAM1= <>
##$DBPNAM2= <>
##$DBPNAM3= <>
##$DBPNAM4= <>
##$DBPNAM5= <>
##$DBPNAM6= <>
##$DBPNAM7= <>
##$DBPOAL= (0..7)
0.5 0.5 0.5 0.5 0.5 0.5 0.5 0.5 
##$DBPOFFS= (0..7)
0 0 0 0 0 0 0 0 
##$DE= 6
##$DECBNUC= <off>
##$DECIM= 32
##$DECNUC= <off>
##$DECSTAT= 4
##$DIGMOD= 1
##$DIGTYP= 9
##$DL= (0..7)
0 120 120 120 120 120 120 120 
##$DP= (0..7)
150 150 150 150 150 150 150 150 
##$DP07= 0
##$DPNAME0= <>
##$DPNAME1= <>
##$DPNAME2= <>
##$DPNAME3= <>
##$DPNAME4= <>
##$DPNAME5= <>
##$DPNAME6= <>
##$DPNAME7= <>
##$DPOAL= (0..7)
0.5 0.5 0.5 0.5 0.5 0.5 0.5 0.5 
##$DPOFFS= (0..7)
0 0 0 0 0 0 0 0 
##$DQDMODE= 0
##$DR= 18
##$DS= 0
##$DSLIST= <SSSSSSSSSSSSSSS>
$$ [...]
##$SUBNAM2= <"">
##$SUBNAM3= <"">
##$SUBNAM4= <"">
##$SUBNAM5= <"">
##$SUBNAM6= <"">
##$SUBNAM7= <"">
##$SUBNAM8= <"">
##$SUBNAM9= <"">
##$SW= 18.0517286264689
##$SWIBOX= (0..15)
0 0 2 0 0 0 0 0 0 0 0 0 0 0 0 0 
##$SW_h= 3612.71676300578
##$TD= 16384
##$TD0= 1
##$TE= 0
##$TE2= 300
##$TE3= 300
##$TEG= 300
##$TL= (0..7)
0 120 120 120 120 120 120 120 
##$TP= (0..7)
150 150 150 150 150 150 150 150 
##$TP07= 0
##$TPNAME0= <>
##$TPNAME1= <>
##$TPNAME2= <>
##$TPNAME3= <>
##$TPNAME4= <>
##$TPNAME5= <>
##$TPNAME6= <>
##$TPNAME7= <>
##$TPOAL= (0..7)
0.5 0.5 0.5 0.5 0.5 0.5 0.5 0.5 
##$TPOFFS= (0..7)
0 0 0 0 0 0 0 0 
##$TUNHIN= 0
##$TUNHOUT= 0
##$TUNXOUT= 0
##$USERA1= <user>
##$USERA2= <user>
##$USERA3= <user>
##$USERA4= <user>
##$USERA5= <user>
##$V9= 5
##$VALIST= <valist>
##$VCLIST= <CCCCCCCCCCCCCCC>
##$VD= 0
##$VDLIST= <DDDDDDDDDDDDDDD>
##$VPLIST= <PPPPPPPPPPPPPPP>
##$VTLIST= <TTTTTTTTTTTTTTT>
##$WBST= 1024
##$WBSW= 4
##$XGAIN= (0..3)
0 0 0 0 
##$XL= 0
##$YL= 0
##$YMAX_a= 191643
##$YMIN_a= -374242
##$ZGOPTNS= <>
##$ZL1= 120
##$ZL2= 120
##$ZL3= 120
##$ZL4= 120
##$ABSF1= 10
##$ABSF2= 0
##$ABSG= 5
##$ABSL= 3
##$ALPHA= 0
##$AQORDER= 0
##$ASSFAC= 0
##$ASSFACI= 0
##$ASSFACX= 0
##$ASSWID= 0
##$AUNMP= <proc_1d>
##$AZFE= 0.1
##$AZFW= 0.1
##$BCFW= 1
##$BC_mod= 2
##$BYTORDP= 1
##$COROFFS= 0
##$CY= 11.3945322036743
##$DATMOD= 1
##$DC= 2
##$DFILT= <>
##$DTYPP= 0
##$F1P= 2.36226072786647
##$F2P= -0.459571619588291
##$FCOR= 0.5
##$FTSIZE= 0
##$FT_mod= 4
##$GAMMA= 1
##$GB= 0.15
##$INTBC= 1
##$INTSCL= 1
##$ISEN= 128
##$LB= 0.24
##$LEV0= 0
##$LPBIN= 0
##$MAXI= 10000
##$MC2= 0
##$MEAN= 0
##$ME_mod= 0
##$MI= 1.114404
##$NCOEF= 0
##$NC_proc= 0
##$NLEV= 6
##$NOISF1= 3.799351
##$NOISF2= 2.8
##$NSP= 1
##$NTH_PI= 0
##$NZP= 0
##$OFFSET= 15.70392
##$PC= 1
##$PHC0= -14798.43
##$PHC1= 15.00082
##$PH_mod= 1
##$PKNL= yes
##$PPARMOD= 0
##$PSCAL= 0
##$PSIGN= 0
##$REVERSE= no
##$SF= 200.130013532006
##$SI= 16384
##$SIGF1= 3
##$SIGF2= 2
##$SINO= 400
##$SIOLD= 16384
##$SREGLST= <1H.CDCl3>
##$SSB= 0
##$STSI= 0
##$STSR= 0
##$SW_p= 3612.71676300578
##$SYMM= 0
##$S_DEV= 0
##$TDeff= 0
##$TDoff= 0
##$TI= <>
##$TILT= no
##$TM1= 0
##$TM2= 0
##$TOPLEV= 0
##$USERP1= <user>
##$USERP2= <user>
##$USERP3= <user>
##$USERP4= <user>
##$USERP5= <user>
##$WDW= 1
##$XDIM= 8192
##$YMAX_p= 0
##$YMIN_p= 0
$$ End of Bruker specific parameters
$$ ---------------------------------
##NTUPLES= NMR FID
##VAR_NAME=  TIME,          FID/REAL,        FID/IMAG
##SYMBOL=    X,             R,               I
##VAR_TYPE=  INDEPENDENT,   DEPENDENT,       DEPENDENT
##VAR_FORM=  AFFN,          ASDF,            ASDF
##VAR_DIM=   8192,          8192,            8192
##UNITS=     SECONDS,       ARBITRARY UNITS, ARBITRARY UNITS
##FACTOR=    0.0002768,     1,               1
##FIRST=     0,             0,               0
##LAST=      2.2672688,     0,               0
##MIN=       0,             -374242,         0
##MAX=       2.2672688,     191643,          0
$$ Real data points
##PAGE= N=1
##DATA TABLE= (X++(R..R)), XYDATA
0@%%%%%%%%%%qJ6j6J6k4L2m0N2o0P2q8J04j28J52j76K08k41K81l28L77m32M94
32B63n62O37p21Q14r15J027j150J284j431J590j767J959k167K398k647K919l218
49a687L547l908M303m742N231n775O385p077P868q777R838j1099J2625j4517J6934
64I149k0144K4638l1428M3001o7918K17588k08670k51687M18214m8760j36139
75e2156Q2473k117j36570J39003N0002j96271L0588K21280j03873j21922Q3969
86e594L5852o9719M6515P477q5220N6695O8959q9646p887N6244L0944J8036k8990
99C3666q3120j1722J13108L5033q9237q019J4331k0173O487o29r766L6813K1850
112C8622p7854l4354Q2429J3783l3600M975K587R034L301l2217j9864P1163N7326
$$ y = [0, 0, 0, 0, 0, 0, 0, 0, 0, 0, 0, -8, 8, -8, 8, -16, 16, -24, 28, -32, 40, -48, 56, -72, 80, -96, 112, -129, 152, -176, 201, -231, 263, -299, 338, -383, 431, -484, 543, -607, 677, -754, 836, -931, 1028, -1139, 1259, -1388, 1531, -1687, 1860, -2048, 2255, -2487, 2744, -3031, 3354, -3723, 4145, -4632, 5206, -5893, 6732, -7785, 9149, -10995, 13643, -17785, 25216, -42702, 174886, -33784, -285471, 132743, 83983, -52156, 30317, 28200, -108370, 30633, 80635, -115636, -85048, 136232, 32359, -89563, -5594, 30258, -39461, 7054, 14531, -70689, -13994, 54965, -34681, -42568, 13676, 44620, 62656, 33666, -49454, -61176, 51932, 86965, -2272, -10291, 4040, -16133, -9646, -10275, -20041, 16772, 38622, -39232, -73586, 8843, 22626, -10974, -5999, -3412, 5622, 8923, -23294, -43158, 28005, 85331]
125H5331r0965m2572P0400k072l0983L2607K1236m1364l0674K101J646M4856J8835
138C8382o5894j8882N0992K2943k5409j2672J3123K749R309k0080m1158K4512
150b2085L8275O192n307j7197j2592Q197K8012j599k0077J9335R03m4057l3162
163e5162K5439N8080K680m4272l2159J9209N6289J1403m2589l0629L1080M1505
175D0874m2701m4464M1887M2713j6313l7202o755J5697K2550K990l7112P192M6304
188C5660k6909n5100J9456M9528l340j6895k470k4690R300L5749k1335j7344L4575
201A6185K498m5490J0131M4995j8485p620K9334k9090l4225L3923K1608l5508
213a1744k256L1265k1023k1367J5369K215J1738K6582k1578m7543J9023M8614
$$ y = [85331, -5634, -48206, 22194, 20122, -10861, 21746, 42982, 1618, -29056, -26955, -25309, 19547, 38382, -27512, -46394, 4598, 27541, 2132, -10540, 2583, 5332, 14641, -5439, -46597, -22085, 16190, 22382, 17075, -122, -12714, -4517, 23495, 21896, 1819, 21154, 22057, -22000, -55162, -29723, 28357, 31037, -13235, -45394, -26185, 30104, 41507, -1082, -31711, -631, 40874, -1827, -46291, -4404, 38309, 21996, -15206, -21961, -6264, 16286, 19276, -17836, -10644, 35660, 8751, -46349, -26893, 22635, 19295, 2400, -70, -24760, -15460, 20289, -1046, -18390, 16185, 18683, -26807, -16676, 28319, 9834, 2214, 31548, 2458, -31767, 2156, 23764, -11744, -14000, 17265, -3758, -25125, -9756, -7541, 4197, 30779, 9201, -38342, -19319, 29295]
225B9295k1694l1804J9952K0903o846k3763n952L0947K8019k2095m1804J3848
237a0994L4939j1408k6622j799K6299J6727l0897l9036J6223N3650K963m4372
249a4327j1520J8381J2924o22j2063K64J6515O724k2506j6544K0543K1106K789
262B1664j4545k5130K582L0947J1650k4802j5610J8141R557j3702k0499k591L0700
275H362J6906l2751k9283K6332L2355j8950k0124J6199J5190n424k0259j1937
287b3384K1957K9208j2896l6877R657L1334p853j3638R678R447n556j3598j3398
300a5919K949K6056K811k9635l965J5802j654m433R532M034p183O20l800p853
314a2638J1763J1200n439o562l137K249R756M475j1222l21J7785o689k2196r80
$$ y = [29295, 7601, -24203, -4251, 16652, 9806, -13957, -19909, 11038, 39057, 16962, -24842, -10994, 23945, 12537, -14085, -15884, 10415, 27142, -3755, -42791, -26568, 27082, 30045, -14327, -25847, -7466, 5458, 4836, -7227, -6963, 9552, 16276, -6230, -22774, -2231, 18875, 21664, 7119, -18011, -15429, 15518, 27168, 2366, -13244, 4897, 14454, 752, -19747, -22338, 8362, 25268, -7483, -36766, -10434, 21921, 2971, -17153, -954, 14236, 8812, -11447, -23384, -1427, 27781, 14885, -21992, -12335, 18999, 11146, -2492, 7186, 16633, 11077, -2521, -15919, -12970, 13086, 15897, -13738, -17703, -1901, -3555, -7988, 1544, 5578, -1605, -985, -4785, -12638, -875, 10325, 4886, -1676, -4813, -2564, 7192, 11667, 445, 124, 17909, 11220, -10976, -11956]
328a1956J4866J3063l569k4229j1436K3453J5123k8860r891L1081R753k2733j6403
341b1738O583K4040J8952k0018l4433J6041L3696j3601k2979J0385J6881o42j3961
354g94j4811P540L2576j82l7482m833K2858j503j1481K369O97j02R962o273j7181
369a8640J3427K1372m723j2900m191J360Q085O394j1007o807J6745L785j9704
382f804p647J5895J7028m674k1613r563J6647J1205j6794p227J7390N867j4691
395d981j1140R185J9638N460j9482j5429J6014J4525j3053j0034R714J0262l093
408G586j4569n787J4893J4805j1852j6286Q295P120q370m537L654P353N008p409
422i6j4168N271J9355J578q441l348l423N166Q789q459j1802J1222J1913j4210
$$ y = [-11956, 2910, 15973, 12404, -11825, -23261, 192, 15315, -13545, -23436, 7645, 17398, -5335, -21738, -15155, 8885, 27837, 7819, -26614, -10573, 23123, 9522, -13457, -3072, 13809, 13167, -794, -15605, -8065, 24511, 24329, -13153, -17986, 4872, 3369, -8112, -5743, -5046, -5148, 4814, -1459, -18640, -5213, 16159, 11436, -1464, -5655, -4295, 3790, 10184, -823, -7630, 9115, 12900, -6804, -14451, 1444, 18472, 13798, -7815, -17378, -731, 10474, -6320, -13547, 3843, 9710, -4981, -16121, -6936, 12702, 18162, -1320, -16749, -735, 13790, 737, -9297, 417, 10679, 7586, -6983, -12770, 2123, 16928, 5076, -11210, -2915, 4205, -4165, -8702, -5048, 2305, 7313, -96, -14264, -8993, 10362, 11940, 3499, 151, -3272, 1894, 10683, 2224, -9578, 1644, 13557, -653]
436f53j4417M100J2979J3370q345k5873M247K9141m513k6922P436K2487l177j5165
450e305j2088M743K9968Q743l4263j2607L2655P712k3306R93R034m017M219m381
464B100j9131R947K3781j7065j9100J9501N116j7603O056Q054p968J0219R188
477A3095k4863p518L2689P654j9023j251j794n954J5617P189k2619j745K1801
490A3278j0530j8978J4316J1972q609k541k699o246J2462O157k4988l299L1278
503A1573J259k7913j328J8186P393L306n897j2914R277J3114j5722p165J9738
516A2907nk3815k022J2768L849L105o210j6056R143J9927j1821j7170J0748R328
530D676m772J969n899j2991J4868J9914j3515j2396J1107K251p136O797K516o205
$$ y = [-653, -15070, -10970, 2009, 15379, 7034, -18839, -14592, 14549, 10036, -16886, -9450, 13037, 9860, -5305, -17393, -12650, 17318, 26061, -8202, -20809, 11846, 19558, -3748, -2755, 6279, 2262, 6481, 2100, -17031, -7084, 16697, -368, -19468, 33, 5149, -12454, -6398, 1656, -6312, 3907, 13095, -11768, -19286, 13403, 21057, 2034, 783, -1011, -6965, 8652, 15841, -6778, -8523, 13278, 2748, -16230, -1914, 10058, 1449, -1092, -3791, -10037, 2425, 8582, -16406, -19705, 11573, 12832, -15081, -16409, 1777, 9170, 12476, 6579, -6335, 2942, 16056, 334, -6831, 12907, 12902, -10913, -12935, -167, 3682, 6787, 577, -15479, -6336, 13591, 1770, -15400, -4652, 4676, -96, 1873, -4026, -17017, -2149, 17765, 4250, -8146, 2961, 5212, -1924, 4873, 7389, 1184]
544A184O889m393k0639J0651K7795j1231k6491M672J3800J863J90j2530j0373
557a8613K2559J4250k6600j2271K4804P128j3249L843K859n570M795k222j0625
570h912J4805J5684k6560j9207K3866J5052j0507k863m702p362J4576J0105j8490
583d515n614J5980n109j0109J0374j000j0631J2578P624j5044K868J4663j2715
596f50j0758J7350P600j1322n559n762j876K0168Q711k6108j0103K3341N879j4562
610c651M10P093j816k236l241l684J0544Q048j5994r015J7866Q904j4718r763
624a1253P952J1207M127j0997j6078N427J8924J116j3227k941N210O38k51O14
638D68l92K342L14o661k807P865N853m641o330K64O354N828n239j1792K937J4586
$$ y = [1184, 8073, 3680, -16959, -6308, 21487, 10256, -16235, -11563, 2237, 4100, 4290, -8240, -18613, 3946, 18196, -8404, -20675, 4129, 11257, -1992, 1851, 4710, -860, 3935, 1713, -8912, 5893, 21577, -4983, -24190, -324, 14728, 4221, 1358, -3344, -10706, 3870, 13975, -4515, -10129, 5851, 742, -9367, 1007, 7, -10624, 1954, 9578, -5466, -2598, 12065, -650, -11408, 5942, 13542, 2220, -3339, -9101, -10977, 9191, 17902, -8206, -18309, 5032, 10911, -3651, -3241, 3852, 2036, -200, -3441, -7125, 3419, 11467, -4527, -13542, 4324, 13228, -1490, -11253, -3301, 7906, 12033, 1036, -15042, -9615, 9309, 10425, -2802, -5743, -533, 105, -146, 468, 76, 2418, 2732, -3929, -6736, 1129, 6982, 2341, -3989, -3725, 2629, 8457, 3218, -8574, -5637, 8949]
654H949J320j5320q246Q481J2264N29j2336o334J0812P609j0572m970J3537N287
668A1010j4336q256P668J0387K629q624j0848P626J5508o607j5502O841J1826
681I322m487o241r73l021L828P442o691o662Q869P08j0187M819R251m709k573
696a305J273p488K195J6415l800j5882N516R807n088j301K972m862M401Q014j3370
711b503j0023J5753P439j4330l201P690k44j931j490n384Q280J2512j3652j6588
725a7672J3524J6100q190q792K066L508M644p28r509K907J4300m507j4977L066
739d260J0084k091l143j402l025L185L455o916l830Q711L717n100m345j639K987
754c612R330j87j0591L15Q890k31n396M79L411L937K68j0228l825J2990N307j2034
$$ y = [8949, 10269, -5051, -13297, -4816, 7448, 7977, -4359, -10693, 119, 7728, -2844, -7814, 5723, 11010, -3326, -11582, -3914, 6473, 9102, 478, -10370, -2744, 12764, 6157, -9345, -2504, 9322, 4835, -1406, -2379, -5400, -1572, 5870, -821, -7483, 1386, 2094, -8093, -3274, 5977, 1268, -1305, -32, -7520, -5325, 11090, 7290, -8592, -3076, 6731, 1643, 342, 3314, -1548, 2853, 10867, -2503, -12526, 3227, 10666, -3664, -6865, 825, 581, -1350, -2840, -8224, 56, 12568, -1084, -17672, -4148, 11952, 3762, -5030, -2964, 544, 5188, 4460, -5049, -2142, 12158, 7651, -7326, -4260, 5824, 3733, 590, -812, -3837, -652, 2803, -4113, -7943, 768, 4485, -615, -4960, -6599, -3612, 5718, 5531, -5060, -4745, 4145, 3914, -1482, -1003, 2408, 6345, 6613, -3615, -7440, 5550, 10857, -1177]
770a177n739P374K751l441m316j863P134P074j0554j0903J0377J1705o467p290
784e335L629L604L53k089m253M273R189m540j1130L168R412j792m453K18l23K24
800A55R44l841j752N921K558n362m236J099L954M035j921n621J341N975o51o104
816c506N28O440L956n577q338K232J0791J430r983l852P136L903n717n706L001
831c262R131L65j1952m221J0709O679o423o135K857N696l83n719k748P370N978
846G942o546p469L122O239R05l209k816P7L529n7n913L77O140J153m290l360J85
863c991M548N029l047o084K303N682k383m850J460M221J827m068o898J731R352
878D832L05r056q25P071J210n691l014M204O304j703r661j517J0367L491p650
$$ y = [-1177, -6916, 458, 3209, -232, -4548, -6411, 723, 7797, -2757, -13660, -3283, 8422, 1955, -5335, -1706, 1898, 2251, 162, -4091, 182, 9371, 4831, -6299, -3131, 6281, 4489, 36, 254, -69, 155, 1099, -2742, -4494, 1427, 3985, -1377, -5613, -4514, -560, 3475, 1554, -4067, -2726, 3249, 2598, -3506, -2978, 3462, 7418, 1841, -6497, -4265, 6526, 7956, -2027, -5879, 1257, 5160, -557, -6263, -3262, 5869, 6234, -5718, -9939, 770, 7449, 1026, -5109, -2252, 3444, 3061, -2658, -5406, 1964, 7942, 1396, -6073, -2951, 3288, 4193, 984, -1832, -1755, 1774, 1717, -4196, -3819, 2321, 3474, -816, -4176, -3991, 557, 5586, 2539, -3545, -1242, 4440, 2057, -2793, -1333, 2888, 4715, 647, -6251, -4520, 4832, 5137, -3919, -4744, 2327, 3537, -2154, -5168, -964, 5340, 3637, -6024, -7541, 2826, 6317, -1333]
893a333k480N257K668k524m135M91O330K862p882n229N775L969k812k182m28p8
909a731K465q56n828K107P442j143n693n89K092K962L799l219n415M671N126o380
925a90l729N515K929j460l921m584L137R662k660j0488K275Q616k750o734k90
940d672L147M596q56q989j878J1014L325q752j54P077k35l847m26N76M107L411
956G444q182o311P203N157n207j643J520j806K009K279n729j145P938r11o913
971d297J109K391j494L297J219n878K473O666o428n068R206N052o791m037O23
986a957J644O253J0j0824l6J0601k449r346L533N890k770j988j858j327N517L404
1002D297q310j385J0290O40r794p94O632K799L12m555o439L733Q706k649n935
$$ y = [-1333, -3813, 1444, 4112, 1588, -2547, -2056, 4274, 7136, -746, -5975, -200, 3769, 957, -1225, -1653, -1731, 734, -122, -5950, -3843, 3599, 2456, -3237, -3826, -1734, 1228, 5027, 1808, -3607, 1064, 6190, -190, -3919, 1596, 4525, 3065, -856, -5440, -2303, 7359, 4699, -5789, -3514, 5102, 2352, -4382, -4672, -1525, 3071, 2215, -6774, -8652, 2362, 5687, -3065, -3219, 3858, 3623, -224, -650, -74, 4033, 7444, -738, -7049, 154, 5311, 104, -1539, -19, -1825, 184, 2463, -3266, -4411, 3527, 2616, -4297, -3188, -797, -2291, 1006, 2225, -3653, -1180, 5486, -942, -6010, 3196, 8248, 1457, -2580, -1957, -313, 5940, 5950, -4874, -4910, 5691, 3242, -6104, -2571, 3319, 549, -1439, -3297, -4624, 893, 4297, -4013, -5398, 4892, 5532, -4262, -5056, 1576, 4375, 4687, 132, -6307, -2574, 6132, 3483, -2452]
1017b452K517K224k304r8J179j476J334J123m759k211N721J631m548j180K210
1032a089K461J431l159n858M790J0180l600j0747M41O914K066j626l232j254L804
1047A522R74n714Q97P988j088r185p32O666K038k444l668j621N196M688n835o388
1063f706N827N894l018l222K24j065J870L518k482k429L912j809n391M185O380
1078E688l943l794O35j717J888P034l405r579N126P682m258l656J639m97K930
1093A773L923p069n433Q736K691q751J727P897m910n300L058J120L038L578q288
1108b210q205J0774Q265r194m420N772j13j175K900l140k318P127j79p849K918
1123a047N681n786k510N510m32j970J918l744l839Q244M986q511m019L669J235
$$ y = [-2452, 65, 2289, -15, -113, 1066, -410, 924, 2047, -2712, -4923, 798, 2429, -2119, -3299, -1089, 1372, 2803, -356, -6214, -1424, 8756, 5156, -5591, -5150, 1764, 3830, 2204, -1028, -2282, 1522, 2496, -3218, -2321, 5667, 4579, -4606, -5338, 1328, 3366, 922, -2746, -4367, 829, 5517, -318, -6706, -879, 5015, 1997, -1225, -1001, -2066, -196, 3322, 840, -1589, 2323, 514, -4877, -692, 5688, 1745, -2049, -1414, -3131, -1243, 5791, 2386, -7193, -2067, 5615, 1357, -2299, -660, -1157, 1773, 5696, -1373, -6806, 1930, 4621, -4130, -2403, 5494, 584, -4716, -1658, -538, 2500, 6078, -2210, -10415, 359, 8624, -570, -4990, 782, 669, -506, 2394, -746, -3064, 4063, 3884, -3965, -1047, 4634, -1152, -3662, 1848, 1416, -554, 1364, -2380, -6219, 2025, 7011, -1500, -5519, -1850, -615]
1138f15K129K374n962l002P651J618p255J948N860l405k252J902j440J319K931
1153C801n782l056Q926J935j0578j546P209K242j511k458n322K475Q418l222o724
1168e193M988M062o097o16N379n70o70J280m451k95P039q16p653K127N061k705
1184H70j361N07l516J967O521l842p067L064M655k168l86Q97j695J177K302m281
1200b356l86P821k2q666N88N952P38k467j393k120L454M203n894n605O124N293
1216E264n431l800K136J456PK9k102J148M112k455n409L443N526j391l841O4J038
1233b06J740J315j829k721K617K172l336j371J842O68J42o31k371k82L263M08
1249A420l228l72L092L70k745j485K364L235J71m381j935M451L007k800l430J859
$$ y = [-615, 1514, 3888, -2074, -5076, 2575, 4193, -3062, -1114, 4746, 1341, -911, 991, -449, 870, 3801, -1981, -5037, 3889, 5824, -4754, -6300, 909, 3151, 1640, -818, -6140, -3665, 4753, 1531, -5193, -205, 3857, -2240, -2856, 2523, 1953, 1283, 2563, -1888, -2183, 4856, 4040, -3613, -1486, 3575, 870, -491, 16, -3500, -1533, 4988, 1146, -5921, -2857, 1798, -370, -756, 141, -1554, -377, 1925, -2356, -2742, 5079, 5057, -3609, -3021, 2931, 3669, 1202, -191, -2311, 1143, 5346, -548, -6153, -29, 5264, -167, -3967, -1831, -375, -368, -339, -2441, -1293, 2819, 364, -5045, -1602, 3924, 2533, -1308, -1244, -206, 1534, 2849, 1020, -1701, 916, 3088, -248, -1619, 223, 891, 1033, 402, -1969, -2251, 1012, 1420, -1808, -2180, 912, 1282, -1463, -2948, -584, 2651, 2822, -1559, -3494, 957, 3964, 1164, -2266, -407]
1265d07L299j153l427o36L726K145l161l785J742L780n52l488m9K940J001k987
1281a012j812K015L033M5l419j368K422J950r99j608L32J754l98j039j531J190
1297d45K131l28k713j102K019J641n19j975J49K032R87k823j799K931L332j974
1313A544l814q9L150J779k389k851K090L645j929m384J125M846j98l496j886K083
1329g74K415k82l300K68L301M79l981m36L069J612j109j556r32J702J498j410
1345E64j919J151J402r09j519k42P28J879J27l094q90K647J891j930j427Q83K170
1362A512m4k302j292K776K767k456l345J218L527Nk954r59K262J932k336l237
1378b926J504L697o66l728j070K655J872j631k153J148L288p49k991J80K679J304
$$ y = [-407, 2892, 1739, -1688, -2324, 1402, 3547, 386, -3399, -1657, 2123, 1571, -1917, -1966, 974, 1975, -1012, -2824, -809, 2224, 2269, -1150, -2518, -96, 1854, 855, -753, -421, 1333, 935, -104, -1635, -445, 1686, 1358, -1355, -2457, -438, 1203, 684, -1291, -1142, 890, 1877, -946, -2745, 186, 3518, 1544, -2270, -2359, 791, 2570, 181, -2670, -580, 3065, 1136, -3248, -2123, 2723, 2525, -971, -2857, -774, 1641, 1359, -1941, -1673, 1628, 2107, -1874, -2310, 759, 2371, 1262, -294, -1226, 476, 1974, 564, -1355, -204, 1198, 289, -1230, -1472, -744, 1135, 1262, -1832, -2722, -75, 1816, -114, -1541, -658, 1512, 1468, -834, -2126, 650, 3417, 961, -2384, -1166, 2361, 2366, -588, -1547, 715, 2647, 311, -2926, -1422, 2275, 1609, -2119, -3189, -534, 1338, -293, -2446, -1298, 1990, 1241, -1750, -1570, 1109, 2413]
1394B413j174j799j53J632J074j525j423J328J590j692j104J5P57J471m20k790
1410a800p28K771J053k396j125J792J160n14k027k74K843K368k641k864K177K942
1426B737j128k341J85K024P67k089k420J774L105j260m048L09L213K59j968j156
1442b037J198K187l40k835p01L659J328k585j169R65Q21L43k57q95N54J364o53
1459I47k420J292J934l54j332j128n19J725J321k275k053K769J956k237j952J394
1475i32K070O71j491k261R93L027q03l431J582L268j735k519N30J761J574n77
1491A727l311j022M053J148m015q36L046L99j666l40k84Q32J505n04k421J430
1507b59J982k333p66K190M01p02j40j299n62L179J318l938j449K576N81M2m27
$$ y = [2413, 1239, -560, -713, 919, 1993, 468, -955, 373, 1963, 271, -833, -818, -61, 1410, 990, -1800, -2528, 243, 1296, -1100, -2225, -433, 727, 213, -1814, -2088, 755, 3123, 482, -2382, -205, 2737, 1609, -732, -547, 1477, 2244, 155, -2265, -491, 2614, 1354, -2694, -2385, 828, 1087, -881, -2037, -839, 1348, 1008, -1827, -2528, 1131, 2459, -126, -1295, -330, 491, 834, 577, -318, 236, 1600, 947, -1473, -181, 1753, 1399, 67, -1061, -1580, 145, 1466, -809, -2862, -93, 1863, -374, -2326, -932, 1138, 1809, 318, -1943, -950, 2077, 1274, -2157, -575, 2693, 958, -1561, -1031, 730, 2304, 1727, -1584, -2606, 1447, 2595, -1420, -2256, 790, 1189, -477, -817, -1101, -269, 1236, 732, -1689, -259, 1723, -610, -1376, 814, 1215, 513, 373, -926, -1488, 1691, 3009, -929, -2378, 198, 779, 821, 394]
1524C94j737K31K878m85l746J323L388j549k353J334J394l86p19j354L64L648
1540B625j36n451m15N592N74l264o51%N93K073r99k777J911K093k827p57L232
1557A416J17k326P28p2l99K098K24l878Q32L678r35k540L26l32O39K725j212m087
1575b998J321L463j711j487J982k66j272J310p91k55K772k18m467J243M677j346
1591A957l685Q20Q50R90J223k695k867L615L024l804j785L333n69k265J653O95
1607D90j304J391j138k602L005L819l240k990K734R24r39J621j085l122L088K600
1623C252l636j260K195l35o49J365r10k084K214L48l081J877L149k802k672K186
1639h43K039k14J79k339j653M239J872l864j500L525K83j945M48l50J1J272q34
$$ y = [394, -1343, -1112, 1766, 1281, -2465, -1142, 2246, 697, -1656, -322, 1072, 686, -33, -1387, -1023, 2625, 2489, -2962, -3377, 2215, 2789, -475, -1126, -1126, -533, 1540, 541, -2236, -325, 1768, -1059, -1816, 1416, 1533, -793, -65, -137, -536, 1562, 1786, -2092, -1260, 2418, 1483, -1057, -731, -1063, -424, 2301, 1089, -2998, -1677, 1786, 75, -1412, 570, 304, -968, 342, -449, -704, 2068, 1850, -2617, -1374, 3303, 1957, -1728, -908, -58, 932, 2155, -540, -3407, 208, 3232, -572, -2357, 976, 407, -1858, -205, 490, -814, 577, -561, -3163, -158, 3661, 421, -2569, 165, 1089, 150, 1771, 686, -2436, 652, 3252, -384, -1644, 551, 216, -433, 932, 22, -2062, 152, 500, -2581, -704, 2445, -357, -3029, -843, 1196, 982, 1161, -1178, -2831, 1408, 3280, -584, -2084, 1441, 1724, -221, 227, -123, -112, 1160, 326]
1656C26k033J999J498l031j726L585R68j890o05r72K15L391L43l641j27K404r1
1673F13m48Q48q47j052J954r7j796J076J387j956n93J285K69n04n59q06L98K453
1691A625n36l407J24L230M72j787p10J07R92J239j304j078J955J013k821m64K334
1708I84P45j260j171O0P86J442j213k265R81K726j240k275O61R48L21L05n79q48
1726h92Q28Q62j047l66J479l4j148J6J41N24P74l36j926J77K011k96j543j43J122
1745B03N83l12j427n24J976R57j691j305J638J222j373j023R49Q42J58j344r48
1762a419J478J748j060k087O14J557k48r42n37M72R94M8j471j23J435M19r42n25
1780e89P91K05j20m44l17P84Q60j061j179O57J018P7p51q34L44Q64J86j260m63
$$ y = [326, -1707, 292, 1790, -1241, -2967, 618, 1586, -304, -909, -1881, -1666, 1725, 2068, -1573, -1700, 704, 613, 165, 1013, 166, -886, 1068, 971, -825, 251, 1638, -318, -911, 374, 643, 139, -420, -1226, -828, 1625, 1089, -2318, -2194, 1036, 1508, -279, -989, -882, 110, 1349, 45, -1033, 922, 1935, -886, -1350, 984, 1729, 469, -702, -642, 144, 1586, 373, -1892, -911, 1815, 575, -1700, -1039, -91, 230, 535, -44, -892, -64, 798, -249, -615, 864, 830, -318, -302, -161, 363, 1137, 801, -1125, -948, 1063, 767, -776, -919, 203, 786, 474, -953, -1477, 499, 1456, -235, -1540, 98, 1320, -53, -1076, -127, 715, 873, -471, -1419, 59, 1807, 747, -1340, -726, 831, 583, -359, -896, -424, 570, 618, -853, -976, 459, 878, -64, -589, 202, 407, 287, -157, -474, 310, 1170, 109, -1070, -413, 605, 682, -69, -903, -559, 305, 491, -769, -1232]
1799a232J551N34r77j107O85J025N24j508o85J475J093j264j070J177J165n34
1815H52j478k89R92J122q32j675O12J399m50j320L70Q66J00l30r96L00J461M0
1833G44r59k60N95O15m37k55P3J56Q17o91r52M90J138k19j125m15M45O87k1j270
1853h44j45J375J80j227q18J317R98o22r96j60J283O44r37q67J105J033p20j209
1871f10Q9J343M33j026r08M18J087o85p91j63J135j13n68o65K16J301j80p27n41
1890i55Q51M41l61k7j70P93R5l82q85P78R93o40o41m78Q20J86j68r60L77R93l32
1911C28j180l98R64J085p23j004K85J205r5q48k35R68P16n27j260J18J514j11
1929H02r29m08N87O73n60p02K97J044l22j264P1N16Q05l45q74J76P04k65J20q60
$$ y = [-1232, 319, 853, -124, -1231, -546, 479, 1003, -505, -1190, 285, 1378, 114, -956, 221, 1386, 852, -626, -915, 77, 1199, 367, -1308, -696, 703, 253, -1067, -697, 169, 269, -61, -1057, -757, 704, 744, -215, -475, 120, 735, 298, 43, 116, 272, 1089, 398, -554, -64, 1074, 855, -270, -685, -240, 447, 426, -844, -989, 386, 566, -661, -1479, -162, 836, 214, -782, -942, 341, 985, 48, -819, 286, 1319, 599, -610, -521, 822, 1255, 229, -679, -261, 826, 141, -650, -813, 322, 209, -359, -1024, -808, 493, 313, -414, -955, -104, 337, -24, -51, -221, 572, 667, 285, -600, 178, 1171, 531, -110, -588, 232, 418, 250, -710, -333, 660, 328, -852, -1250, -286, 799, 76, -928, -643, 562, 467, -381, -616, 352, 1068, 541, -719, -601, 913, 802, -127, -535, 52, 725, 165, -537, -240, 804, 482, -782, -711, -195, 610, 265, -609, -433, 271, 6, 126, -734]
1949g34L37Q50M12j031o91J150M43k36n38o74Q35P17q58o24N66Q86p64j023L53
1968f24J084K19n85j192O10J316m53j444M42J299j9p43o36J58J203J49q18o84
1986g18J044K94r88k69R76k65p6l67j78M95R00n13j152P51P24o21J74k52k54O19
2006C24O52r46r38R02P34r58K78J4j82M42m21n42K04J446j047j113P07J403l27
2025F32q86j69k7J041O36j995j69J972j37j058K25N24n26L4R7p55O24M90j224
2044f71n31J494Q71j768p8J18L21P91J00j329r9J286n1q44L96P1j60O37k7q31
2064c04L53J058j414m65J379K58j230l74N93M5O34l27j711O52J869l07j417J15
2082e93P22j20p9J58m60M36R53j268m38J489Lj374J19R34K9n7l99j114O53J400
$$ y = [-734, -397, 453, 865, -166, -857, 293, 736, 500, -38, -712, 123, 840, -18, -642, -76, 810, 46, -977, -624, 460, 679, 94, -1098, -488, 828, 375, -1069, -627, 672, 653, -90, -726, -568, 635, 784, -34, -718, 326, 620, -368, -637, 339, 74, -2, -369, -547, -52, 848, 335, -817, -66, 658, 37, 211, -41, -295, 324, 976, 30, -908, -6, 728, -230, 48, 62, -120, 322, -99, -641, -437, 1009, -38, -1151, -444, 959, 632, -254, -423, -450, 591, 1227, -768, -937, 1035, 898, -160, 65, 589, 63, 97, 194, -561, 63, 553, -671, -1202, 292, 1163, -605, -683, -565, -244, 547, 647, -682, -781, 505, 454, -390, 6, 77, -83, 554, 527, -304, 49, 1107, -307, -772, 607, 865, -365, -739, -146, -101, 533, 206, -1505, -853, 1016, 709, -708, -593, 129, 9, -70, 88, -372, 64, 1017, -251, -689, 800, 803, -571, -452, 482, 511, 454, 55, -1059, -406, 994]
2102I94r03j290N23N79k0K31L23j173K79R41n62k64J060l09j100N99O67l8q5k8
2122D24r77L50J605j167j371O36R12l8l19k00r47J075N74q70m50J228k10j038
2140g83P01O48l80j31m15p19J436R62j275j029R66R48o40m22j62k70O49O32q36
2159a20m20R32j92p45M94L23n77KO2J11L28P61j102p09R05N43m62r6n0j31P43
2180F00J16j118m96J262J61r47M35L34j68l57N7k10N84K11r06n21J499M38r92
2199a8m54L57M27K48k56n22j12R63m57n49M89K06m96q5M37m00P8N26n10k50O58
2220B80K33o38k27L91j6L36m1r65R6J064M4q98o1P71l56o6k19K69J03K44q37k11
2242g04J034K24j111l50J163L4m8k05m27L22Q50o45p72J90J104m60j63M9J30k7
$$ y = [994, 91, -1199, -676, -97, -117, 114, 437, -736, -457, 484, -78, -342, 718, 409, -691, -92, 575, 537, 452, 424, -553, -203, 1402, 235, -1136, -500, 412, 374, 55, -145, -1092, -17, 557, -313, -763, 465, 255, -783, -82, 566, 186, 55, -360, -1079, 357, 1319, 44, -985, -19, 929, 289, -133, -295, -565, 84, 716, -120, -540, 392, 200, -545, -51, 272, -305, -303, -241, -130, 198, 959, -143, -852, 53, 596, 134, 38, -12, -143, 600, 716, -402, -898, 364, 525, -422, 13, 347, 179, -178, -121, -331, 253, 464, -442, -963, 536, 974, -18, -472, -115, 312, 560, 304, -218, -330, 633, 176, -373, 116, 322, -174, -259, 178, -222, -144, 382, -128, -378, 280, 513, -125, -352, 39, 23, 359, 318, -647, -551, 513, 557, -341, -402, 369, 13, -53, -272, -3, 100, 344, -493, -704, 330, 554, -557, -907, 256, 290, 242, 37, -390, -68, 782, 137, -635, -445, 659, 199, 36, 85, 215, 188]
2262A88J22o68lQ38k56r51N16K76j96K83k93O4M2N54n52n00N20N30K6n08O9j06
2284eM39l7l28m02O11n4m95P3J56M33m80k49K09K93K23p42k75M09M08j48k19N
2306a75K94M50m41m95L09M30j68m21k3N58l1r7m47j8N29k6m62j95M91K17o70J45
2328b46J37K67pk25k27j4N00j53R9r3J82j57j39j65K68K52L1j60n14O46K12q36
2350c42P1m4L99M8l24m21N93L61l83k87R9O89k02m11J88j55K74M3o16J34N26K91
2372E31n95q7p3M56j98m5q8M1L22k62j77j14L04J5J0l81M12L38l61k80J00M37
2394C05p8k85j08J30K58j92k6k56M29J56k64n44M62J23p1j19l08M43Q9k30m3K22
2416I3K46J98p58k29N39J66m06O9jM21k23l36j24M93J70l77q9k85L92P3j50K77
$$ y = [188, 310, -358, -361, 477, 221, -730, -214, 62, -134, 149, -144, -80, -38, 516, -36, -536, -16, 514, 540, 32, 101, -5, 434, 397, 69, -333, 278, 224, -271, -198, -42, 391, -89, -338, -129, 164, 387, -355, -630, -221, 187, 39, -180, -175, 119, 569, 128, -367, -58, 372, 204, -217, -240, 318, 287, 190, -257, -275, 254, 228, -234, -429, 62, 279, -391, -246, -109, 158, 151, -74, -301, -315, 185, 32, 131, 38, 220, 63, -76, -241, 27, 279, 310, 150, -364, 282, 494, -342, -271, -315, 84, 132, -192, -613, -20, 341, -42, -329, -230, 459, 257, -154, 34, -121, 153, 196, -420, -286, 240, 531, -64, -151, -224, 232, 34, -11, -99, -58, 264, 2, -175, -289, 15, 30, 40, -341, 71, 409, 48, -232, -132, 305, 227, -58, -166, -36, 222, 30, 4, -252, 177, 333, 69, -475, -13, 110, 39, -80, -388, 55, 144, -86, -129, 93, 339, 537, -221, -450, 89, 255, -151, -82, -83, 338, 115, -221, -345, 148, 318, -59, -148, -433, -41, 32, -118, 159]
2438A59l46M53l9l87k36L18K58P4l52R9R2J63j23k96K85O6j5o68M55P9o7M0k76
2461b64K11J39K60p04J17M59r8l95J62K52M0j20l60J24L81r2l80j6M86nk69R8
2483B6j60K76ro9l36J81K27j53N4j14O2N4Ll02R2M82j00k09j57M94k66M1n8m4
2507A5j0L55j02p39M14J17Q7n68M5M77J37j00l11j17L79q4j43J47J97k76J02l2
2529a0J30j8L34l22m51N58O8l78l47O84k54J83k28m1J35M6l9k09P2P4k9k3j36
2552b01L61K82o0l05n26N30K18L0k22j22J15JK34l69j73N40K3o45J80K79j05j64
2574i9J5j13L95j8j96l30N69J56n26p4K48j2O6K01l74R8J96j05k49L7L26m06q0
2597b75K49J26k64L68l21K01J48o6l71NN2M23J45j41l16j23M00N0l83j14J87l64
$$ y = [159, -187, 266, 227, -160, -396, -78, 180, 254, -98, 1, 93, 256, 133, -163, 122, 188, 173, -495, -40, 39, -28, 12, -264, -53, 86, 346, -358, -241, 218, 120, -275, -113, 139, 179, 59, -301, -177, 204, 112, -268, -284, 202, 197, -72, 26, -134, 142, 133, 64, -272, -91, 136, -17, 37, -77, -15, 39, 42, -260, -168, 314, 214, 5, -152, 342, 76, 117, 59, 15, 5, 360, 258, -481, -67, 50, 137, -431, -386, 91, 228, 128, -183, -300, 79, -5, -148, -1, 196, -80, 22, -10, 120, 102, 436, 114, -337, 221, 289, -89, -436, 248, -6, 177, -51, -92, 43, 89, 50, -159, -87, -13, -42, -65, -201, 160, 442, 382, 77, -449, 81, 299, 329, 107, -15, 100, 101, 335, -34, -207, 333, 356, -289, -109, 170, 65, -99, -84, -197, 198, 180, -16, -346, 223, 379, -147, -221, 27, 15, 81, 282, -92, 6, 202, 97, -152, -115, 211, -195, -275, -26, 100, -164, 204, -117, 84, 232, 166, -205, -200, -148, 275, 420, 279, -37, -160, 240, 290, -93, -207, -20, -384]
2619c84L49K28k70RK21k06l56M73k8l12k8M05O4k74J59k21nN23k70l55l7N23j60
2642D8j14K97l27J9K5k4Q3K78j58n71L47L05Ok90M5j33J31L43m37j33K51L09l23
2665b3J69j3o5q2K62k09%L80L1q56L19M53l91o1k07L69R6L0l52L8K27J66j88r4
2689aN3j52Q1m1K4K11o3j77KJ13L20l90k3J90l1j5L2j46j87J52L40j45m31K75
2713ij38K5K73j63n4R3J69n99M20P9Pj7N2j21J13J70l19k42L98K8j48j73n1K46
2737C9k53J55K0m1L53m38J70j69M61k90j81L72l6r1k43L58k22K27J60l48K56l2
2759B27Qr8j4j73M1Q1J9k11J82k1j04k12M96r6P0l12M9n0K68O3k93q1K3L38l94
2784a94J34j12L40k7m1k75K63Qj64J9P5K52l50j24r3Q4L45j05Kl47M06k13n2N6
$$ y = [-384, -35, 193, -77, -68, 153, -53, -409, 64, 36, -276, -304, 101, 165, -109, 50, -171, -176, 347, 77, -278, -315, 208, 48, -66, 231, -96, -77, -52, -76, 7, 285, 127, -444, -97, 208, 214, -76, -31, -164, -33, 310, -127, -260, -9, 300, -23, 146, 133, 68, -14, 248, 39, 39, 419, 450, -406, -87, 366, -25, -86, -293, 76, 172, 202, -150, -112, 115, 281, 93, -1, 52, -100, -19, -60, -36, 175, 112, -65, -63, 50, 370, -20, -43, 147, 116, 101, 133, -13, -200, -48, 292, 147, -284, -9, -147, -122, 151, -12, -66, 27, 196, -403, 17, 96, 103, 86, 138, 17, 130, 300, -19, -261, 137, 165, 17, -156, -207, 39, -214, -59, -39, -80, 273, -165, 5, -164, 297, 7, -174, 198, 162, 71, -172, 186, -36, 191, 351, 3, 259, 227, 235, 137, 123, -50, -9, 72, 91, -120, 62, 41, -63, -275, 221, 125, 195, -117, -68, -118, 150, 213, -80, -161, -138, 200, -194, -60, -172, 168, 141, 100, -175, 88, 96, -68, -49, 26, 278, -72, -196, -289, -205, 140, 35, 37, -310, 96, -117, -169, -113]
2808a13L20k1o1j66K71p7k49j31j56K36L85l62K69l65K60j65J35k90L24K54k04
2829I4n6j27M8K68k48J61j64M9J23j30pl6K55j65j28J9K89j05o1k15Q4j5L4j27
2853a60J13P4J84k56k43N04p6K2j56J8N3j13j46K74j2o3J88m22l7K19O7J82k10
2876DJ76k35L38k12j61%L3L01n80k5L84J77j16m0j05J68O2j45j47J25k65r1L22
2899c2N5j8p7j24J16L3j18K11j40j12J75R5O1j43K9J77n06J72J31Q2P3j71r0k1
2923a42J15l5pj2R3j56K67k24J1j03L04j78M7n3J74J0l02k45N53R9l73J55L50
2946C48j27j17l45K04L02j77j38rQ3J52j20j97q9L56j01j98K43j88R7L5m4l32
2968c62M20r8p5J66J95j67J07j45r5P1j05M6q0M00k81k0q6J2J47k27L04j01k08
$$ y = [-113, 207, 186, 125, -41, 230, 153, -96, -227, -383, -147, 238, -124, 145, -220, 40, -125, 10, -280, 44, 298, 94, 38, -89, -41, 227, -21, 140, -24, 25, 148, 18, 11, -25, 230, 65, -63, -44, 245, 140, 79, -136, -52, -67, -33, -160, -47, 27, 211, -45, -288, 216, 140, 162, 6, 24, 77, -36, -182, 92, 80, 17, 205, -217, -254, -35, 32, 214, 4, 180, -55, 283, 71, -90, -90, -57, 244, -336, -361, 23, 200, 84, 44, -61, 107, 169, 24, -123, 2, -263, -354, -32, 23, 5, -72, -196, -80, -47, -165, 46, -94, -206, -31, 64, 125, -18, 11, 188, -318, -146, -15, 67, 140, -31, -121, -142, -27, -62, -69, -81, 12, -144, 123, -101, -90, -193, 111, -67, -20, -73, 101, 111, -191, -436, 117, 216, -157, -2, 348, 221, 104, -241, -37, 265, 88, -50, -59, 24, 176, 56, -141, -230, 126, 25, -173, 70, -118, -21, 14, -30, -362, 58, -40, -115, 51, 246, 79, 186, 41, -54, 17, -88, -42, -122, 278, -3, -23, -109, -97, 50, -177, 127, 26, -182]
2991a82K34j71k17L59k58J72j09R4k39M73j83j34OP9K59k59J50n9j6J02J7l32
3013b14L73q2o5q0M5J96j64M6k1n1K86l54O3M3O2J68l65K00l7j58L85j92j79L81
3037B86j15j10k74M66k44o2O3k1J04j54K1J37j14P6k11P7J79j90O4J74l74QK67
3060E3j14L2j69R8K06j14k7R4n1N2K02j67p8K94k61n3Q0l1q3L9L1k44J91J87J36
3085C03m11J01j0O3O7k89J53q7N0P9j72P6L5N1m2J38j97J53m2J48k6j47j65q4
3109b55M38N1r5r2k04R6J43l7j74K33j93j2J28Ko1j72K31qr8J01r9J16r9J43P
3134I0K4k18Q9J46o4j29l8J60L4j1L7j16K23m21K59M7k74J34P1K3M3J10m90J12
3158a59J42k07K49K83k42Q8n5j5j69ol0J41J67j26j76J57q6J94l09L86q2j22p1
$$ y = [-182, 52, -119, -336, 23, -235, -63, -172, -78, -317, 156, -27, -161, -155, -76, 183, -76, 74, 15, -1, 101, 118, -214, 159, 77, 12, -68, -23, 173, 9, 55, 34, -17, 269, -85, -22, 21, 83, 251, -114, 86, 49, -109, 276, 84, -95, 286, 171, 61, -213, 253, 9, -53, 10, -11, 93, -61, -40, 97, -17, 59, -152, -75, 104, -86, -22, 152, -222, -214, 53, -61, -29, -198, -100, 106, -8, -35, 59, 8, 60, 262, 95, 17, 311, 50, -3, 77, 46, -37, 2, 33, -211, -20, 167, 303, -108, -7, -17, 46, 113, -176, -23, -110, -60, 19, -153, -77, -42, 9, -33, 105, -92, 61, 19, 167, 141, -6, -171, -255, 183, 234, 139, 47, -157, -61, 82, 45, -129, 104, -89, -101, 27, 29, -32, -204, 27, 19, -79, 22, -77, 39, -60, 83, 90, 114, -104, -15, 131, 67, -62, -100, 60, 94, 83, 120, 4, 227, -194, 65, 112, -162, -28, 43, 66, 109, 219, -271, -159, -17, -224, 25, 308, 66, 154, 99, 84, -85, -91, -121, 20, 187, 61, -115, 42, -44, 150, -159, 227, 145, 23, -48]
3181d8k88O40k10M8m57q7L17O2j11L57j29q6r1L38j90j30j80K90K61l22J67l59
3203b08K08q1J42j36J44j6n1r5J45j08J76R4k40o2R1J30k30K66l10O5L93k47j1
3226E9J33K0%J2j91J2N4j4j63OK86k46k4J60j65pj3K06j75J1o5m6Ml1L94l06N0
3253c9Q5J28k52j9J20N1j23L38j62j3j06n4l0K35l00N3j8J87l49k0O04n48J76
3276e6O9k5k11L96j48L4%j22J61k24R3kj64O4L54l73K95j54k85K65K5Pl5O0l00
3301b76M85k13J48k34J70l05J34J00j52K85k28K04j49O1K19J0l18L0J42j10j82
3322a79k1J51O1j22K74m5O5K6k11j78J78l4lp6k00L91j46L24k81q4L55l12j08
3345a75j1J75J50Kk13p7J61nj33O9R2j47Q3j06M3J81K1j10j35M1Q4j41J26l1L5
$$ y = [-48, -336, 304, 94, 142, -315, -402, -85, -23, -134, 223, 94, 8, -83, 255, 65, -65, -245, 45, 306, -16, 151, -208, 0, -81, 61, -75, 69, 53, 2, -93, 52, -56, 120, 214, -26, -88, 3, 133, -97, 169, -141, -76, 317, 70, 59, 192, 212, 212, 224, 33, 45, 99, 85, -78, -72, 214, -32, -56, 104, -61, -68, -81, 125, -50, -39, -104, -150, -146, -177, 217, -89, -39, 46, 174, -78, -97, 23, 74, -49, 289, 127, 114, 8, -46, -76, 159, -141, -88, -106, 81, -268, -288, 316, -232, -56, 13, -12, -223, 173, 25, 59, 59, -63, 98, -126, -33, -35, -199, -135, 219, -154, 141, -13, -298, -33, -8, -1, -36, 24, -276, 209, -4, 144, -90, 80, -225, -91, 9, -143, 142, -86, 118, -31, 30, 249, 259, -59, -29, 113, 3, -179, -200, -49, 12, -110, 164, 119, 184, 210, -1, -179, -1, -35, -38, -114, -314, 77, -69, 255, -26, -110, 245, -67, -175, -186, -11, 139, 141, -72, -149, 12, 7, -126, -57, 35, -112, -29, -135, -92, 89, 110, 0, -135, -94, -10, -151, -25, -56, -21]
3370b1J33j79J08o1J33j71K28j9k27L99n9l45j9J43J95j94k14K41lP8j19q3O2
3393Fj18j22L44J88k45j43K84k15K26m32J41L20k46N2o0k24R4K23j92Q6r4j7m1
3416a85K27rk19L11l96K52P4q2Qj34K31k57J77Qk9N2j22K2K84l67M3n0L30R5k8
3441B36j94j12K70q1j14J26q4J04l54k5L03J55j21j06L1J04Nk90M20q2q0Qj18
3464Ak56J36R7Q1m8j67J75j46j6O0J48K0J19m6j33J49k16K3J22j03J72r5j2l27
3488b62J29J04K2j4J06J48k30L7j23J26L92n17o6k04L64P0l86K65M8l4m9l1R5
3511a0Q2j51n3K45K8j27q2j3m0O9J49j19k2p4K07r5P9pP2k19Q5Mj0m4rJ47l42
3538b50M34m8j25k02L29j8j83J4q4J57M7K6q6o8M1K76m62J04j7J57k45M1n4K31
$$ y = [-21, 112, -67, 41, -20, 113, -58, 170, 151, -76, 323, 264, -81, -100, 43, 238, 44, -170, 71, 68, 146, 27, -56, 6, -112, -234, 110, 298, 53, -90, 194, -21, 205, -227, -86, 234, -12, 40, -20, -244, -150, 73, -119, -33, -127, -144, -185, 42, 33, -186, 125, -271, -19, 55, -27, -19, -153, 78, -179, -2, 6, -23, 29, -93, -71, 213, -154, -111, -161, 169, 264, 236, 42, -70, 200, 119, 5, 131, 47, 151, -203, -228, 75, 230, 109, 3, 34, 138, 143, -147, 273, 191, 111, 119, 1, -255, -119, -22, 59, 11, -156, 19, -127, -143, -83, 65, 85, 204, 158, 25, 174, -42, -19, 103, 0, 172, 77, 65, -262, -133, -29, -7, -21, 85, 233, 3, 40, -83, 43, 435, -82, -148, -352, 12, 82, -304, -39, 9, -25, -74, -105, -10, 72, -79, -132, 113, 141, 14, -68, -81, -121, -52, 97, -22, -44, -118, 89, -6, 73, 66, 138, -81, 4, 8, -2, -46, -55, 92, -250, 184, 136, 11, -191, 138, 120, -63, -49, -133, 24, 71, 97, 11, -57, -16, 260, -202, -98, -115, 42, -203, -162, -216, 15]
3562A5K68k72ok01L24k63L9R5J02Q7l17j59K50K07j47j23k2j9j35J35J25l16K46
3585h7J29O7j31K06j52J84j79n4j00P4L2M3j28J49q3k78L13O0r6J0m17K56N19
3608C37k55m7j57J25L6Ln9o9J83P7Lo39O27k29J52l51Q5K5R5j7K9rJ95j28j40
3633a28Q9j80K41r9L58m16K77j06o0j05K24k9j43j61J69j28N9o5J45J61J3q8l01
3656b73P4r3L77j65p6K84Q6j94L7j60K86om00P3K97R4k61r3m8M3K96O3k75Q1p6
3681b9k18L17k41O8K19o4k07L63k57K38l25o2P3J50L6j2j35l4L56L8p3j73L51
3704C79l87O5k2K56l9k57l08N02P2%o08J88K22q2R7j97q2M8K59l55R9K39k7j4
3728D8j39J57j0lJ97j73j09J00R5k49j93M91k56L2j76Q5r7K40q1L1O8m9M4k64
$$ y = [15, 283, 11, 5, -196, 128, -135, -96, -1, 101, 188, -129, -288, -38, 169, 22, -101, -123, -142, -277, -142, -17, -333, -87, 42, 109, -22, 184, 32, 216, 37, -17, -117, -43, -11, 32, -96, 53, -30, -308, 5, 65, -31, -21, -438, -182, 337, 82, 35, -122, 3, 39, 42, -17, -86, 97, 174, 177, -462, 165, -64, 88, -263, -178, -153, -58, -75, -46, -55, 140, 12, -128, -39, -219, 22, -77, 281, -135, 142, 36, -24, -129, 95, 66, -77, -238, -69, -197, -138, -203, -58, 103, 116, 28, -273, -199, -292, 85, -80, -156, 128, 214, 20, 57, -103, 183, 177, -223, -150, 147, 241, -20, -113, -161, -118, 178, 241, -34, 47, -29, -247, 70, -171, -103, 116, 52, -155, 208, -49, 189, -136, -198, -125, 25, 61, 49, -86, -120, 236, 274, 201, 28, 379, -8, 57, 35, 291, 252, -5, -313, 189, 261, 261, -347, -159, 63, -19, 78, -119, -201, -153, 106, -249, -150, 89, 62, 48, -91, 66, 56, 53, 250, 77, -32, 68, 163, -86, -279, 212, -44, -12, -188, -103, -200, 40, -41, -10, 58, 9, 53, -211]
3752b11Q1M29j93o3j7j65J91j33q7L88n9q0k18K0L05k34K53m19J11l2K19k01q5
3775b00K67o2k34K62K4j65K20L8k24o7L19l08M6R2K60p0n09N9j07L86K5k81J22
3798a07Q4M7m8J5L32k85J32l33J44K37l22K34j78O4j70J16O8k35L67l21N6j36
3820b39J67J76M8r4k66K34J25m9j20m4Q2j92K52k01R4k0j04J63Q1k26P0L19q8
3843A68j78K45lk25k81l0M00r2m8k51N6K08m1j84J54J43J88l58L88j90K87m00
3865d4k13L59n2J00k20n5K65j0q2j51K61P1j48r6n8L6K94k27j74p1N24k92r7j13
3889a93J17K33k70J02k07L52R3k35l9j28R6k8nJ86k45K11k74Q7R3J30l75K25k
3912g6J54j67j05J66l13L57r0J94j18J69j97o7K50m39L2N53k50m1j06K10J06l22
$$ y = [-211, -130, 299, 106, 43, 26, -139, 52, -81, -168, 220, 161, 81, -137, -117, 188, -46, 207, -212, -101, -133, 86, -115, -200, 67, 5, -229, 33, 57, -108, 112, 150, -74, -141, 178, -130, -84, 8, 268, 198, -311, -252, -359, 27, 52, -229, -107, -23, 24, -24, -9, 323, 38, 170, -163, -19, 218, -104, 130, -48, 16, -154, -38, 30, -205, 162, -159, -103, -239, -72, 104, 152, 58, -208, 26, 151, 102, -18, -62, 20, -172, 80, -121, -27, -47, -151, 12, 93, -133, -63, 256, 168, -10, 235, 232, 7, -274, -304, 96, 4, -44, -295, -239, -31, -72, -256, -102, 41, 229, -129, 259, 69, 356, -44, -257, 102, 50, 150, -70, -125, 140, 130, 48, -103, 158, 229, 81, -15, -73, -37, 257, 30, -144, -215, 309, 17, -80, -193, -76, 157, -113, -11, -218, 134, 227, -8, -47, -175, -79, -107, -112, 74, -171, 40, -234, -147, -54, 76, -299, -74, -76, 78, -89, -194, -28, -341, 16, -74, 120, 2, 171, -26, -93, 157, -282, -250, 303, 53, 12, -94, 116, 222, -100]
3934a00j50M1L49p2r0o9K12k09N6q9J87oK2k69J80L32k59k38m3L36o2O9l33J98
3958gl4Q6j9j66j12L42p8j32j89M02M6l27J99m86N90j20o7j86M85k17N3J49k27
3981a5k9J36j78J40j35J03L32o84M03j84p5K45R3j86J31J46m73N1O5K42O4k01
4003iJ35p4J08j85J16j30K10N9l20K04j68J62n4j75r6O3L38l45K45p7j95K31j73
4026a30j4J6L90j78j76J01j16J16K4j0j53J94rk92J74L69k96o5J99k15K72k10
4048im6J09Nk03J8K1J89J80j93o7k2j20L06k96M7J14j2k58r2K61K46l50K72m0
4072F0k11L33j34j09m3K75k44k6J57J2j63K8J48l02L21J46k89N5p7l5J89j45J48
4095I4k76M5J61R2l47K85K9k50j03L37K16l21L6j72J86L9j72O3R1p6k35M32R9
$$ y = [-100, -250, -209, 140, 68, -22, -91, 121, -88, -32, -121, 66, 60, 82, -187, -7, 325, 66, -172, -215, 121, 59, 128, -205, -7, -41, 45, 26, -140, -252, 90, 12, -120, -309, 93, 139, -188, 11, -475, 115, -5, -72, -258, 227, 10, 63, 212, -15, -44, 92, -86, 54, -81, 22, 354, -330, 73, -111, -186, 59, 152, -34, 97, 243, -230, -179, -114, 128, 192, -9, 126, 52, 160, -25, 91, -39, 171, 230, -90, 114, -54, 108, 54, -121, -217, -154, 184, -161, 84, 7, -188, 43, -130, -144, -128, 262, 84, -92, 9, -107, 9, 33, 23, -130, 64, 55, -237, -63, 306, 10, -55, 144, -71, 201, -9, -55, 54, 59, -144, -126, -105, 84, 264, 71, 4, -18, -138, 168, -128, -81, 33, 21, -237, -329, -68, 178, -172, 100, 60, -151, 182, 48, -61, -104, 171, -73, -99, 58, 70, -93, -65, 83, -219, 102, 248, -41, 14, -63, -98, 91, -54, 94, -182, -137, 24, 116, -231, 54, 83, -167, -270, 67, 283, -38, -2, -174, 12, 51, -121, -58, 33, -43, -278, 154, 253]
4118B53n45N13Km77J37N42l83j50j3K60j95K4J60m26L21K44J32o59K06L29l78
4139a03K49K2l10K44J34j44J11J05l12l18L53J50k10Q2l67R0L33L63o51K28r8
4160d9n0m6m5L19k94L94j90j04M2Qk53J37J31K73m23J41O3j06K25j68j33P2J36
4183H0J80l38J61j54j81K12L30m00K3K19l41kL04J2j82R6k41J91K42j2n80K72
4205a09L72r9k01j46J70l08M43j00l71K98L11l37j1K89l21r1K52K04l75Q2K66
4226B18n62L14J61p0j75q1J03K02L8j36j68L0L41k47k08K63J15j54Q4j48K66Q9
4248B75k33k04K40K70m1k98k3m8j21O7K88l56L71J35m12k57O08p8j17L6l0k08
4270a36J43k52r3M07ml02j60L40M66l86K45k71j78L39j5p7l53J37M20j13l56o
$$ y = [253, -292, 221, 223, -254, -117, 425, 42, -108, -121, 139, -56, -32, 128, -298, 23, 267, 399, -260, -54, 275, -103, 146, 168, -142, 102, 236, 92, 203, 308, -4, -322, 31, 181, -29, 53, -314, -224, 109, 472, -179, 49, -49, -99, -145, -190, 129, -165, 229, 39, -65, -23, -15, -268, -131, 0, 273, -150, -9, 54, -52, 173, 5, -128, -56, 80, 260, -78, 83, -71, -252, -40, 290, -110, -87, 132, -209, -211, 93, 105, -77, 19, -222, -31, 211, 199, -381, -109, 263, 164, -37, -183, -13, -321, 122, 22, -349, -51, 260, -77, -88, 201, -120, -211, 41, 245, -130, -48, 218, -344, -30, 131, 61, -114, -195, -92, 110, 148, 12, -156, -126, 215, -32, -240, 23, 138, -16, 68, -80, 186, 275, 42, -162, 78, 348, 307, 9, -14, -62, -183, -116, 172, -184, 187, 322, -90, -347, 261, 183, 66, 102, 72, -136, 7, -245, -338, 69, 65, -237, -397, -57, 409, 23, 268, -3, -181, 158, 143, 66, -287, -150, 270, 157, -199, -205]
4292b05rK72o4q1J8M09l18m08L40J59l2j46n2L17j88J40m47K58K08J25k96J86
4314A86j9j81J58j42j10L03j21q3k57K53O2l84L34l3k08N5P0j80J31J27O6m8K38
4337B17j43k6M4PNOR8l23K2oJ42k25m2kK3J50oQ0J23j9j6m65K17m3K77J03l97
4364a99K7K11L47r0l09L49l6l73K68k53J9K28k33n8j46K03J42k91p4K55L64j15
4386B36k50k1J99p5j52mJ87j01j48L1k6K77j03j6l03M23n3j22J77j10k63J26J69
4409G8k93J63J07j05l8j62K78J40j79j13M04j94k2j21J44m6R6k91M3P8J9j65k7
4432b06K94j16J05k14k42K54M8J9M9q9R7L05j94l37K4L78Q3m13o0K92L8K9j11
4455C3j07R4M5j25K8R0Q0j76o2J23J68J80l75k58J49J50J60j88k54M25K2j22m00
$$ y = [-205, -214, 58, -6, -87, -69, 340, 22, -386, -46, 113, 81, -65, -117, 200, 12, 152, -295, -37, 171, 296, 0, 186, 167, -14, 144, 2, -108, 195, 74, -9, -266, -13, 49, -335, -1, -34, -242, -187, -117, -297, -166, -39, 27, -21, 217, 74, 48, 92, 99, 104, 110, 208, -115, -93, -99, 43, -182, -224, -226, -203, -53, -59, 21, 144, 125, 109, -356, -139, -182, 95, 198, -199, -172, 39, 386, 296, -13, 336, 300, -73, 195, -58, -39, 189, -44, -102, -248, -45, 97, -194, -268, -13, 351, 236, -14, -35, 164, 89, -63, -67, 120, 19, -129, -98, -124, 153, 50, 34, -269, 154, 101, -21, 156, 46, -217, -91, 78, -215, -52, 55, -50, -88, -250, 28, 168, -11, -124, 280, 86, 64, -57, 87, 41, 137, -154, -111, -33, -14, -179, -206, 88, -28, 77, -137, -379, -125, -77, -58, -9, -98, -1, 304, 110, -227, -203, 175, 258, -155, -215, 77, 115, 144, 33, -74, 20, 65, -60, -32, 58, 138, -38, -100, 23, 191, 371, -4, -262, -113, 37, 197, 9, -245, 180, 202, 80, -320]
4478c20K77P8J78j84j62L22j77N6j55j47K79L9o5j54P9J03j92N2j06K39k1J65
4500A84k27j58L54J16k51j9R4N4J2l37k4K01P3M4l63L8K30J40j70k58K06L17l46
4523i0j86L89k41J58j21J64j67K83j68l01L54k63K47k00O7o5M00k36q7j43L48
4544A42k51l18M35k90L87N8j10j48R1L36j01l90K19P1Q1j22o0J17K64k36l92J18
4566i9J55M3l58q3K38J84O0l45q9L60j67R5l83N17K34m96J38n7K09o9k0k77Q2
4589a28Q02n40l07K43Q1j03L6n3j0j24J07k46j2L28r8p0j90M23k63K66j39q6J1
4612g2L60j55j84j4J67K3N5r5n20M35L5p3K6K0Q2l96K26K60m05j64K31J0l2K73
4636I3K23n20K55K58n7j81n6j70J38K36p7k2m5k88J96j98J85p6K7J24l11J00K12
$$ y = [-320, -43, 35, 213, 29, -133, 189, 12, 68, -87, -234, 45, 84, 19, -135, -56, 47, -145, -93, -199, 40, 19, 184, -43, -201, 153, 269, 18, -1, 93, 147, 159, -178, -202, -1, 72, 116, -247, -209, 21, 161, -9, -267, -61, 256, -90, -276, 113, -128, 30, -91, 73, -94, 189, 21, -280, 74, -189, 58, -142, -75, -140, 260, 24, -63, -206, 142, -109, -427, 8, -282, 105, 163, 53, -95, -4, 332, 231, -159, 60, 131, 212, 90, 30, 147, 411, 175, -217, -99, 56, 99, -259, -342, -104, 80, 140, -205, -294, 66, -101, -6, -389, 128, 362, -134, 4, -53, 156, 87, 67, -210, -128, 674, 134, -173, 70, 151, 48, 84, 31, 21, -103, 4, -242, -254, 74, -24, -94, -284, 139, -124, 142, 3, -83, -72, 288, 133, -51, -65, 102, 125, 180, 85, -435, 0, 35, -38, -12, 8, 90, -306, -80, 180, -225, -389, -158, -148, -180, 93, 316, -204, 51, 309, 252, 71, 15, -155, -17, 219, 142, 120, 75, -213, -17, -215, -30, -106, -79, 45, -266, -166, 46]
4659D6l35N7J92K10l00J10K13k68J08J73m19j51L23K87m45L0J25j30L42k12j01
4680a45L90J34m02j10J65J36k83j57J92J77J02R8m12NL71m6m30K18N4p1J53k35
4702i6J93j47K50j19l81O91k03l30J38K6l01M26N4m62J24M31q0k88K28l5l62K50
4724GP7k91L83J39k31k01K96K12m28l36J45J98J18l9j12m7J67Kk15R5J67R1M2
4747B39l3k33J57j44j16o1L93j60J10k54K86l74RK88k41R0L40m98J25l1M4j0J44
4770G0J76k83j26M25j45m37N51m6k36K14Rq7J28k05j89o3N97j99l38M74k2k37
4792C1K9r1j64K33J70j92k36L04mm03J12K33J87k54n2JN3L51k78j32K02M12l53
4815A59l13K19O5R5k72m24k6Q29j94o70M06L23m8j46j82L34Q3j38j32k32M41j26
$$ y = [46, -289, -232, -40, 170, -130, -20, 193, -75, 33, 206, -213, -364, -41, 246, -199, -169, -44, -174, 168, -44, -145, 245, 379, -23, -133, 32, 168, -115, -272, -80, 97, 199, 297, -115, -110, 261, 215, -215, 3, 57, -14, 139, -96, 97, -50, 200, 81, -300, 391, 188, -142, -4, 22, -279, 147, 201, -261, -137, 294, 214, -74, 154, 119, -243, 7, 84, -207, 176, 315, 84, -117, 179, 391, -37, -373, -228, -30, 88, 49, -63, -110, 57, 59, -156, -61, 106, 197, 239, 206, -27, 130, -14, -130, -191, 202, 42, 152, -102, 184, -190, -181, 107, -134, -44, 296, -202, -77, -108, -64, -74, 70, 246, -37, -163, 262, 117, -320, 231, 185, -51, 163, 172, 85, 213, 8, -181, -244, 353, 154, -184, 290, 268, 31, 60, -31, -195, 38, 208, 16, -220, 84, 80, -323, -211, 22, 209, -45, -97, -96, -43, 308, 30, -102, 100, 512, 159, -154, 65, 130, 225, -47, -471, -497, 332, 138, -532, -126, 197, 149, 3, -179, 155, 238, 100, -32, -264, 177, 51]
4837E1k79L0J77J62k15J7j50n0M44n0k95nJ35L5o4J98k8l05J09j34J64N9L17m36
4861a13J6j00L02j6pJ45m78O16k44k97R0Q7p6J7n2J68jj2j40j3J12J46k16R0j60
4886a36M07l51P6K77m60K29L9l2m01L63K49k01l9J4J25j80k3m3J45p2k25J89J9
4909c1J92j51j17PL79o2l09k3PK86J18l11JN26l82k72K6O6K61j03l48L36K1r4
4933B3j84J19K11n5K3m80K46j12N22k65j52L6M40k15j71k05L26J84j58k61j63
4954b91M58k37K71k35j96J05K93J1k39K37O4j68m95N08J49j00q4m63N12K8m7j27
4976d6J23O8o9Qk68L44l19K78J62l71Q2r5P9J65l4k52K38k67O2R5J58k15J71N8
5000A55L11j12m48K40j70J9k46M8J47P2J54pm31L90j45j25R4k28J88k4J56l13
$$ y = [51, -228, -198, -21, 141, -74, -57, -207, -257, 187, 137, -158, -163, -28, 7, -57, 141, 113, -192, -83, -217, -53, 6, 323, -113, -97, -197, 105, 89, 82, 227, -251, 365, 121, -176, -86, 1, -75, -58, -110, 58, 57, 45, -95, -108, 4, 150, -66, 24, -136, 271, -80, -4, 273, -187, 42, 81, 49, -352, 11, 260, 59, 20, 34, 159, -21, -44, -87, 58, -14, -239, -50, -31, 161, 10, -107, -100, 279, 217, -92, -115, -108, 178, 296, -15, -14, 512, 130, -142, -116, -50, 211, 108, -240, 96, 117, 23, -161, -42, 169, 114, 137, -343, -97, -209, 313, 48, -104, -68, 372, 157, -14, -219, 107, 291, 133, -128, -291, 167, -70, 201, -34, -230, -125, 168, 179, -60, 177, 241, 73, -422, 86, 235, 135, 51, -412, 100, 128, 81, -46, 77, 145, 76, 84, -184, 160, -159, 119, 281, -90, -8, -103, -24, 141, 107, -145, 93, -174, -112, -17, 141, -74, 97, 155, 466, 354, -94, 146, -24, -5, -251, -203, -56, 16, 170, 163, -268, 122, -23, -148, -54, -282, -94, -118, 38, -275]
5022b75L19P8J49m64K56O7J27l30M0O3K00j11j47o8J86m0k23K32k72K51l7j21
5044a20j66O1J59J18k48J3L31o7L28l66l30N24m5m6r5J54j70J89j76k98J74L72
5066B96k44n33M83N3j70q8l11O54j52J66l14N2J57k14L00l21P2J80m4K48l63J56
5088F3K6j03KQ8K86n19J00K97j19m73L66J36j50J89q5j20j33K13n5k75O10k99
5110D5n5L2k1l06N56J08q95L46K47K73P7o62R3j3L71j35l68K08M34l56k84L55
5132E0j45q8m3L70k95K66K75n75k6M02j38K8j45K12J4J5j11l67L63l5K7O6j25
5155eM0j98J6K29j74J38K42o20N13K57l77l54J50j43J96J92k67K0J9M11k75j77
5177a67N5J41L2q6j34k6K91J15m29J00N46m62Q0j04J51m2L72m36j05L80n0l89
$$ y = [-275, 44, 122, 271, -193, 63, 130, 257, -73, -33, 30, 230, 119, -28, -96, 90, 50, -173, 59, -213, 38, 1, -120, -286, -225, -66, 52, -196, -183, 148, 81, 409, 43, -287, 237, 192, 146, 51, 205, 35, 224, 48, -250, -76, 296, 52, -481, 2, 55, -115, -203, -514, 140, -12, 154, -160, -108, 49, -165, 135, -186, -114, 66, 22, 270, -93, 63, 89, -14, -12, 76, 362, -157, -57, 240, 121, -352, 14, 150, 0, 189, 104, -16, -149, 64, 9, -266, 344, 45, -10, 22, 1, -305, 251, 359, -536, -190, 57, 330, 407, -255, -162, -175, 196, 61, -307, -99, 335, -21, -305, 50, -95, -183, -226, 144, -151, 115, 390, -185, -211, 191, 53, 81, -64, 148, 162, 177, 66, -301, 62, 27, 54, 120, -5, 35, -163, -147, 82, -92, 46, 288, -332, 181, 438, 61, -293, -143, -286, -90, 102, -165, -145, -126, 285, 10, -167, -112, 29, 61, -25, -159, -185, 106, 221, -208, -108, 438, -24, 56, -48, 103, 61, 433, -3, -108, 272, 222, -167]
5199a67k50M84Q6p1N9k59J52M5m39K86k74M21j52n7j41K94J4J13k20k52N85K40
5221D97m53n1j24K58P3j21J2j46J42l3j93o6L03m23J58o1N18k99M3n02L54Q0L60
5244C26o27j03K95L2j62K51J47k18K15k34l2M5J91k18P2J37r3J04k06k10K78J13
5266A03j32k50K9N99k44k73k3J67o2K62q8k09J62L68l93j37J38L4j2P9k75J9K01
5289F3k69j69M4N70m18mOj38K01J22jl1J88N4k42m0L67R1o12O26m90L39J04k16
5313A45j19n8J03j04K2L3QJ15j65J0k61K31K59k61k54M03O2j81j08M4o1L81k26
5336A8q7p1L77M0l70L2Q4j58J41j12k89O48Ql76l25O30j07j32J10j25j52M68l8
5359B14j08M5Kk61k51M01Q3N4q6k59K82kj8l20K00P2J8m2q6r1K17j74O9q6J62
$$ y = [-167, -417, 67, 153, 82, 141, -118, 34, 79, -360, -74, -348, 73, -79, -136, -277, 17, 31, 144, -76, -328, 257, 497, 44, -7, -131, 127, 200, 79, 91, -55, 87, 54, -139, -205, 98, -325, -167, -228, 290, -9, 34, -468, -114, -34, 326, -301, -404, -109, -77, -239, 12, 159, -59, 156, -78, -110, -65, 126, -92, -20, 117, 24, 128, -78, -288, -10, 103, -29, -279, -250, 349, 105, -168, -191, -24, -86, 176, 88, -121, 41, 409, 16, -121, 17, 51, 39, 118, -157, -138, 63, -206, -375, -331, 239, -179, -183, -177, -315, -114, 8, 7, -24, 164, 218, -24, -64, 303, 394, -218, 408, -82, 257, 361, 145, 26, -32, 71, -33, -11, 22, 30, 145, -20, -10, -271, -40, 219, -42, -296, 107, 169, -12, -120, -76, -137, 244, 18, -69, -140, 237, 277, -93, -61, 23, -135, 6, -106, -395, 253, 261, -115, -440, 190, 83, -49, 61, -64, -216, 252, 214, 106, 151, 153, -108, -359, 42, 125, 179, 93, -166, 116, 114, 96, -224, -24, 48, 66, 24, -62, -153, 64, -110, -41, -127, 35]
5384C5K17l64j57K22J26N3j06n9K82j79l1r3Q7n4j36M15m61J24K98j91J79l21
5406a14K12J77l37N9J34j04K21m09M6L57K9k36p2M4kk35J13j6J46J58nl17k0L5
5430a36J22j23p1K60j6Q3j98J93l7N4pr1N6n0J61j94l41L82o2J47k60O0M21k80
5454G3j21j29R0J8J23K2k16j0L16m1k75r4J54K47l48M7K95P8j74m4J97j30L4k55
5478a43Q1q6M54j42k26m7j40M14l83R1K4J38J27m8O5k8J87l25J18j49J30Q2q1
5501A13k12L52j50o4kj18J81J89m1m28J58K08k52k16J39K15n4Q2r0j61K57M7k88
5524a35J91P2Q9j29j12K49J9k17r1r4K04P1k28j16K81j2n8k28k05M19j54l8j41
5547c63L56K48j09j00l33K66J56k33M6k25K97J82k52q9m6M90k04l92N14k32L6
$$ y = [35, 252, -112, -269, -47, 79, 132, 26, -33, 249, 70, 39, -54, 33, -21, -157, 258, -203, -79, 219, 28, 207, -114, 98, 275, -62, -3, 131, 27, 248, -161, -115, 242, 271, 35, -37, 7, 5, -230, -117, -133, 13, 171, 166, -151, -171, -136, -14, -137, -208, 52, 36, 119, -79, 114, 77, 131, 124, 33, 89, 39, 200, 6, -335, 47, -15, 132, -128, -68, 353, 73, -48, -177, -87, -69, 54, 76, -140, -150, 166, 125, -150, -244, -90, 157, -191, -144, 151, 229, 55, 11, 208, 78, 112, -143, -62, -148, 306, 164, -62, -109, -249, 165, -218, -127, -103, 35, 162, 114, 179, 151, 338, 13, 131, -18, 112, 194, 113, -99, 253, 103, 39, 37, -81, 100, 289, 248, -180, -22, 186, -66, -282, -143, 72, 18, 100, 10, -151, 106, 153, -135, 56, 128, 217, 88, -24, 225, 244, 27, -64, -158, 46, 117, -111, -227, 54, 42, -16, -244, -449, -30, -184, -222, -363, -7, 241, 132, 32, -301, -35, 121, -112, -66, -291, 6, 188, -64, -153, -199, 291, 87, -305, 209, -23, 13]
5568A3N7j75RJ39N9K2j17k1P4k47N5j7K05K58p05J48L65j45j2j54Q0L7J96r3l75
5593c44L51j0l19J43l6P5Q9m4P4k39L52m1l14O7k6N59l58j08J14N3N2j93N7J34
5617H8N5n0l68J77J40j03j54R5J32o0M9J23k90M11r6N2k27J00j69n5K09n1k11
5640b03K81j84l12M55p1R6l31K48Po4L40l36M7K17n3p0p9L9l05K71L56m47K45
5663A47p5k02O7o3J78P2j94J29j15%R7l70L02r0J3q8r2K96K76k48j14p8L01j33
5687A6P3m81N06K36l33k5J80j02J43j7j98LL4J9l15K75j15L50l75r5K51j74L72
5710B28m33J90k05k8K40R3Q6l22L69k05K3m9L73q5l75J16L8j22J18r9M7M1J41
5733A80j74l72J92J31K3j68J36J8O8J0k01K55P5k50n5L77k32M3O3P0m07K76M41
$$ y = [13, 70, -105, -96, 43, 102, 124, 7, -14, 60, -187, -132, -149, 56, 314, -391, -243, 122, -23, -35, -189, -109, -72, 124, 31, -344, 7, -3, -322, -179, -215, -140, -51, -95, -21, -260, 92, 51, -263, -196, -222, 337, -21, -129, -15, 38, 90, -103, -46, 88, 143, 93, -275, -98, 42, -61, -215, -120, 12, -48, 1, 124, -166, 245, 149, 201, -26, 74, -95, -150, 59, 8, -203, 78, -106, -418, 37, -34, 62, -269, -21, -14, -78, 262, -74, -27, 190, 137, 67, -12, 27, -278, -7, 349, -98, 147, 72, -130, -63, -126, 52, 124, -70, 59, -56, -56, 41, -329, -27, -117, -104, -192, -284, 12, 288, 40, -74, -152, 149, 16, 89, -392, 114, 350, 17, -8, 172, 70, 213, 196, -2, 1, 35, 54, -261, 14, -101, 249, -126, -221, 30, -144, 228, -205, -15, -220, -248, -8, 85, 171, -151, 218, 13, 36, -13, 360, 275, -100, 16, 54, -68, 50, -49, -2, 39, 180, 6, -366, -174, -43, -20, -188, -52, -34, 34, 44, -157, 98, 173, -77, -132, 245, 13, 56, 119, 189, -218, 58, 499]
5756D99o18r2L43m2p6Q1l16J26M12k62k78J4L45o8j69j90M69j01q7r2J91J63M9
5779C01m52N3M3J75k91K39j11n5K36k35R6j25L94m21J33K11O5o13K59K16m38M35
5801A15J15m40J90J68Q2n31K01J21j17K54j44P6j11p2J56j3j66L42m34K5M09o6
5823A60J76l02O3k11K91J09l46P5K41l08J48j17j32K56p9m5k54L86j43j29O5K05
5845A09l05K99j0k11K10Nk17J17j00K21N6qKk42L62l19r8p3K97k54R7M0mK10n8
5870A26J15l38J60q3Q6j74N3O1K65j77q9M2k30L14M3r4J50j04j31J24R3l19K95
5893A88l9n63L55L2j34j95K95K2j30J59j00J4L56k49l1R5J38j05l7l8k20J62j8
5916d3J35n3nJ89j09l16N3RQJ29j55RK78q0j30k3j4K29k28K87q8O4k09k32K16
$$ y = [499, -119, -211, 132, 90, 14, 95, -221, -95, 317, 55, -223, -209, 136, 68, -101, -291, 178, 77, -10, -102, 89, 252, 301, -151, -98, -55, 120, -171, 68, -43, -98, 138, -97, -1, -126, 268, -153, -20, 191, 256, -357, -98, 118, -320, 115, 230, -210, -20, 148, 230, -301, -100, 21, -96, 158, 14, 90, -21, -93, 63, 50, -116, 226, -208, -183, 226, 160, 336, 34, 97, -114, 177, 286, -60, 15, 256, -52, 96, -21, -153, 103, 24, -21, -275, 111, -32, -161, -96, 109, -196, 103, 93, -118, 92, 97, -120, -3, -103, 118, 174, 166, 168, -74, 288, -31, -129, -202, 95, -159, -62, -22, -26, 184, 126, 241, -97, 63, -20, 66, -108, -55, 6, 271, 94, 5, 47, -183, 131, 174, 80, 230, 126, -5, 119, 212, -107, 188, 149, -414, -59, -27, -161, -356, -61, -39, -169, -10, -110, -96, 260, 11, -20, 75, 213, 108, 71, 33, -187, -25, -43, 92, 39, 34, 223, 114, -202, -149, -140, -132, -3, -158, -149, 129, 49, -81, -104, -118, 111, -117, 170, 82, 146, -63, -295, -79]
5941g9Q3J20j37m7k4k8pJ67o0J79l01K75k79R2mL96o60L42r2k5r2L05o2k69K44
5966C7l40J74M38k5j46P2l97L80k0k90RL0J47k32k3J15J72m80M36m67L6M30N1
5989A07K9m97K99J80l01K40l4K17Pk46K53j52r2K7R1M1j75K43l42j51J44L67k18
6012C7l04P7L37n6k72Q1j6L59k33Q3K1m05K42L23n12M42R0p7j51j27K79p4K35
6035C79j35l14K30k55Q1j40L26j79K92k28j00J77p2l53J01Q2O6J75k21Q0K26k70
6057e2ok3N7J45l08N5P8N9o9N5L2J80l38J45mj10P9K08q7l41M85N5j17M6k96N1
6083b1J32o5n8o3K22l2j37N1n5J25J07l05lK53j90N0J35k04K25k58jk1J43j9J0
6108B1k43J98K02p0j47o8K27n2L3l59K81J06j38J3j41K57p7j6j84j00K10J40j76
$$ y = [-79, 4, 124, -13, -60, -84, -112, -119, 48, -12, 167, -134, 141, -138, -46, -50, 346, -314, 28, -64, -89, -181, 124, 62, -207, 37, -303, -129, 309, 284, 138, 210, -187, 193, 173, -117, -108, -78, 69, -163, -186, -71, 101, -379, 57, -410, -374, 56, 107, 136, -361, -62, 118, -183, 57, 23, 240, 247, 1, 254, 102, 10, 37, 128, 169, -6, 237, -105, -256, -112, 255, 37, -267, -190, 147, 91, -181, -100, -116, 243, 10, 93, 114, -291, -49, 274, -238, 204, 294, 217, 66, -61, 218, 144, 379, 244, -70, 160, -95, -14, -154, 172, -7, 285, 57, -43, 134, 62, -291, -190, -108, -42, 133, -88, -8, 218, -52, -58, -81, -24, 121, -187, -132, -54, 5, -64, -9, 23, 203, -135, 10, 6, -104, -25, 183, 96, -245, 240, 295, 178, 224, -72, -21, 111, 46, -12, -75, 147, 115, -22, 29, -26, 99, 206, -99, -102, 151, -39, 11, 146, -58, 167, -91, -92, -113, 30, 11, 21, -222, -24, 178, 108, -39, -107, 120, 68, 101, -258, 23, 129, -9, 4, -137, 120, 43, 27, -157, -257, -47, 93, -83]
6131h3p0K14J13l9l44L59j39l0J35Q4k16K10j28n5k02N9L97m27P6j64J96J24P0
6154A40m46K13J06K05k71L3K69J58l06k13l9L46j38J37l9j14J33j26J38l71J41
6175d4k4l5P6j09K35l34J54K13p8m22M22l0k11R4J71qj11L89k58j5J32k92K19
6198A34j63k0k32L01O7k49N8K27l37R3J00l0J25K39j60n10K04K96j10j34JJ24
6220B4J45k71P1nQ5P0j15j9L63m51M3K75j57k31K56k37n5L09k8j96j07M71m37
6243a97rJ76J24k33J91k9q5j96R5J85k29L38m41N12j92k12J76K23l9k16r6j01
6265b55J75P0J61l79R4J63J05Q6j49j86J48j48K71k19Q8Q7k29o4J8K61n60K04
6287b58N00l68K83m33J55J48n6j62M2J57j7O5q6J62J77l39M31l21m14L49qp8J2
$$ y = [-83, -153, 61, 174, 135, -209, 150, 11, -19, 116, 200, -16, 194, 66, 11, -191, -132, 265, -162, -86, -250, -54, 70, 140, -306, -93, 13, 218, -53, -20, 249, 407, 101, -112, -151, 195, 57, 194, 155, 41, 174, 48, 186, -185, -44, -68, -103, -27, -136, 99, -235, -81, 132, 54, -368, 54, 24, -187, -93, 78, 70, -41, 348, 90, 75, 207, -85, 134, -29, -49, -281, 20, 87, -162, -104, 123, -214, -121, -21, -51, 74, 313, 153, -357, -153, 143, 33, -101, -100, 24, 169, -102, -31, -36, 49, 119, 4, -15, 348, -103, -60, 215, 58, -173, 83, -154, -209, 100, 72, -124, -231, 240, -197, -206, -30, 94, -139, 52, 23, -62, -258, -163, 22, -207, 131, -310, 202, 10, -202, -26, 197, 158, -58, -154, -255, -80, -10, 151, -228, -134, 29, 134, 220, 71, -115, 33, -115, 156, -63, 25, 112, -117, -181, -163, 98, -462, -258, 242, -126, 157, -276, -121, 27, -29, -191, -149, 8, -9, 56, -30, 132, 309, -30, 401, 80, -334, 15, 7, -71, -59]
6310e9J26r4J27k50pj9M01k23j22p4L08k43J41K0k44L68k87Q9k4N02n01j15L26
6333A46k48L80l0l14k32K43J63j7j95L56j30k03J48Q2l75J34L47l87j37K35J45
6354A11j8k31R1K0r6Q6MJ44j15K91l66J58Q0p9q3L6mJ03J57m92J58K0L80l03O7
6379A19q3p2O6M4J2j04L4K63l33J53O0j75Lk42L55j5q0l2k47M24k10j20k2K56
6403E4j70m3M3O9l8K31j38k01J20L2K81l84K04J89j72R1m50K99P5J58l47j3J81
6426G1K5o7j46m3k0K67j81J52j45J43o6q5K54r7j24L10j45j99K20j04j14MJ81
6449I1J51l06j22K54l39L38j41k0jJ28j43K9K9N7j8K5j86K46J42j76p0J53o3m8
6473A0J76k29k5L85j07j42q6l66L95J12j57J77J8k06J30L1o6j17M0J84k28l7L17
$$ y = [-59, 67, -27, 100, -150, -157, -176, 225, 2, -120, -194, 114, -129, 12, 32, -212, 156, -131, -42, -66, 436, -65, -180, 146, -102, 278, 248, -66, -298, -55, 108, 91, -104, 252, 122, -81, 67, 149, -226, -92, 255, -132, -269, -34, 111, 93, -138, -47, -27, -123, -37, -33, 111, -4, 287, -79, 79, 159, 80, -3, 33, 29, 132, 289, -203, -45, -25, 355, 52, 119, 36, -36, 30, 74, 86, -18, 16, 279, -54, 99, 159, -16, -13, -255, 100, 85, 5, -27, -274, 150, -60, -180, -202, 54, -116, -159, -116, -47, -85, 146, 8, -193, -73, -41, 240, -144, 60, 249, 77, 168, -282, 17, 92, 250, -97, -110, 71, 96, 29, -117, -160, -180, 87, -94, 58, -87, 56, -10, -95, 159, 62, -62, 248, 103, -96, 124, 20, -94, -90, 91, 242, -64, -186, 68, -271, 67, -74, -94, -95, 33, -110, -81, -52, 5, -13, 12, -174, 72, 214, 38, -32, 121, 58, 10, 186, -43, -68, 317, 210, 68, -18, -384, 11, 123, -34, 143, 161, -45, 85, 116, 50, -67, -27, 157, -71, -108, 209]
6496B09j25l15L03K31k40kJ46j49k19J72N1K33M0k53k9R3j56J97j28j42K5J28
6518G0q6j53J77K43j20k17Q%J4R3mo3K09j02j88R3p8J13N7l5j78O4L11k64L9K2
6544B5j22PK42j33K2K28j45Q5k46L83k64L8l04K70o3m32L74k07L73k26J39M7p8
6567A3J64k56R6j52L24j13j03J75k46L37J48k87j28K7L39l05l74M95k16K5Q8j25
6589g4J57k28L18j4j43q8J38j92L53l73J53J41l87L05L1J99k50o6J58k0K2l5j8
6612H7j53m2R4j65N3K02l53K86k29J33m0J84r5J97k60J54J95n08L84O7k33p3N6
6635e9J95j33k8K44K3k73J85k12q6N5P4Q5k69J84n9o0J92l54L40M6k39J70J28
6658A49j72j2n1j20M10k65j27L39j28J84J67j53k14l06M45k35J95J08k10j77O9
$$ y = [209, 84, -231, 72, 303, 63, 61, 207, 58, -161, 11, 62, 295, 335, 82, 53, 146, -10, 187, 59, -83, -58, 70, -16, -169, 8, 251, 131, -86, -78, -78, -64, 29, 25, -38, 171, 69, -119, -26, -104, 9, 66, 31, -147, -83, 228, -36, 3, 25, -97, -90, 152, 19, 41, 269, 124, 209, -37, 346, 82, 120, -184, 86, 23, -409, -35, -242, 131, -95, 44, 91, 13, 177, -79, 17, -135, 189, 76, -27, 148, -98, 239, 387, 100, -28, -1, 338, 33, -341, 154, -62, -37, 51, -74, 83, -145, 173, 159, 16, -72, 66, -126, 227, -146, 7, 148, -239, 66, 97, 296, 46, -20, 138, 118, 140, 105, 87, -66, -108, -14, -179, -126, 76, -277, 9, -220, -87, -127, 57, -38, 159, -101, 53, 248, -260, 124, 191, -42, -115, -59, 136, 3, -25, 219, 242, -31, 154, -58, -144, -89, -15, 70, -199, -15, -74, -134, 58, -296, 44, 90, -149, 21, 149, -23, -35, -86, -206, 204, -61, -188, 151, 23, 207, 374, 221, 7, -299, 146, -89, 106, 214, 4, -173, -104]
6679a04n5K35N8j7l84J86Q8j40j6J21k16L84J32l76R4j20L44k60rl10L30N3K38
6702B56l32K27m8j54oK83k52J70k31J20L1J46j47n8k27N99l50j72K37j06j47J51
6724a0o8o2J91n7R2j54K05n0j02l0k11L82J47o81N52l06L46K7j35j99J5J14p7
6747g1J90j00q2J96j34j39P9J39m9J8J43m7J42k43j69K50p3K09j04j8q3k7j73
6770a46J5Q4J91J7k63J92m46L69l01K55l6l6j9K54l42J15K72ml63o8L31J11j72
6793A0l5M7LK54k1k51J20o2l06K15j35L9L33L8l28j98L44q6p7j22K55J28p2k82
6817a89K26P3k68J74j04P5Q4J42j49j78O0M3K17l39K52N2o0k53J94j62J09Mj98
6840a95J69J81k17J00j98J22J14k48J72lp9J59r9J20j52p8J57j9m9J75O5k87k00
$$ y = [-104, -159, 76, 134, 117, -267, -81, 7, -133, -149, -28, -244, 140, 272, -104, -10, -130, 214, -46, -55, -365, -35, 18, 256, -76, 151, 103, -51, -57, 226, -26, 144, -87, 33, 64, 210, 63, 5, -222, 377, 27, -145, 92, -14, -161, -10, -78, -140, 51, -6, 86, -68, 137, 87, -15, -45, -256, 126, 273, -408, 144, -162, 184, 211, 76, -123, -108, 6, -71, 119, 19, -63, 133, -1, -140, -61, 78, 29, 47, 190, 143, 285, 42, -127, 123, 50, 259, 155, 137, 54, 27, -146, -131, -47, 144, 161, -102, 90, -356, 13, -288, -33, -69, -105, -124, 130, -212, -97, 175, 171, -192, -260, 71, 182, 10, -25, 22, 25, 279, 258, 7, 127, 65, -241, -26, -161, -122, 211, 249, -79, -277, 67, -19, -96, -218, 37, 165, 93, -189, 37, 110, -158, 16, -88, -13, 71, 213, 64, -114, -54, -11, 206, -133, 119, 171, 111, -142, 52, -110, -1, 3, -195, -26, 155, -62, 38, -160, -38, 76, -172, 0, -3, -82, 77, -22, 98, -54, -132, 25, 6, -43, 132, 197, -90, -290]
6863b90R7L7k4K0P3O5J79l46L84k30j93M59o08N32j55J51l47O7K43o1k37N23k92
6886D7k9N5N2j20M0qK80m51L15j71R1l3j81O6j31J83Np4J36j7j82K94k20J41j03
6911a5m0q3Q5J03J30r0P3j23l46K14K88m11K82j03L6k50K65Q3rj09j7O4M0K7j85
6936i1k22M60Qj95K21k58JJ85J8l27L08m3q3o2J48J18k34K42n13L62m6Qk17J51
6960f1K4Q3k17q4Q8P4K26m65K21J64k59j6K23N1K15k56o4j02K30k77R0J23k60
6983b49K00j14J68k4R8J4j66K88k30j37J29j18j47L98P4m12K96p4n2J63Rk66J88
7006C6k7Q4J43k25P4J9k08K83l13R0J81j69M8J5P6n5j29K92Kk16J02K6o2kJ48
7031B13m97L22p5M36o33J65J56j5p2l46J64J31J34j28M9K19k97J12Pj9q2K52L7
$$ y = [-290, -193, -156, -180, -160, -87, -22, 157, -189, 195, -35, -228, 231, -377, 155, 0, 151, -196, -129, 114, 53, -184, 339, 47, 18, 73, 125, 5, 45, 37, 317, -134, 181, 10, 101, 68, -113, -47, -178, 5, 10, -64, 72, 55, -127, 167, -53, 88, -15, -55, -138, -53, 50, 180, 90, 163, 40, -306, -92, 196, -215, 67, -36, 0, -250, 15, 98, 89, -20, -37, 27, 67, 94, -91, -313, 147, 155, -40, 181, -77, -76, 109, 127, -200, 108, 65, -18, -80, 68, 186, -48, 194, -319, 43, -3, 5, -212, -61, -37, 46, -171, -255, -167, -93, 133, -332, -111, 53, -206, -222, 1, 52, 267, 11, -53, -155, 75, -202, -112, 11, -249, -49, -163, 5, -19, 79, 93, -73, 215, -15, -152, -23, -141, -288, 110, 184, -228, 68, -6, -58, 105, 114, -152, 36, 9, 93, 236, 11, 85, 104, -104, 179, -134, -44, 137, -32, 16, 31, 107, 52, -77, 215, 217, 1, 103, 129, 67, 65, 213, -284, 38, -37, 399, -234, -69, 87, 72, 0, -346, -182, -51, 83, -45, 4, 223, -74, 38, 45, 26, -56, 196, 233]
7054B33l36J44m5l1j44J54lq4l9K7R9K55l51J62j25J39o3P8j63K70n1k60L56j81
7078D1l1J53j5j29j90J63j55nK15j12J19r2j63j22N16j10k71N5K19j7P1l08L57
7101A89K6j08k21O0J09J90l61M47o58K11K58j27j30J37N3k23K01j95%J6L02M8
7123B24m19J66J08Mr7j38J87k10M60m22J07J25k01J17j76J14N5M1R7J07l81O22
7145D90m38j09K92q7j4n30L16J80lr8J19j20m2K40j98P1j79K17j14J25n9j22L7
7168b6j71K13k7J21k83J19P5j13O9J51l8J6m4k35R1L18q9j77J18J2j2j93K92j23
7192F4J74j94k07NL3L04j70l8p2J86q6J50j17j69O7L7L1J08J51k50j19K15j34
7215c1J17K18m08Q5L72k48k49M1J89j74K56j11l0J6J00Jj38j15J25p2k4J32j07
$$ y = [233, -103, 41, -4, -35, -179, -25, -28, -112, -151, -124, -25, 230, -121, 41, -84, 55, -8, 70, -93, 177, 126, -134, 222, 41, 10, 163, 148, 19, -171, -8, -163, -168, 47, -65, 54, -38, -201, -323, 193, 83, -188, -133, 86, 69, 140, -168, 189, 215, 107, -114, -54, 55, 245, -116, 331, -327, -116, 142, 15, -115, 22, 75, -148, 53, -142, -142, -126, 176, 224, -195, -29, 79, 83, -14, -152, 35, -175, 285, -137, -30, 95, -106, 11, -165, -51, 4, 45, 142, 249, -132, 490, 52, -57, 235, 148, 134, -396, -80, 100, 97, -1, 118, -2, -44, 196, -2, 69, -110, 107, -7, 118, 59, -63, -26, -197, 16, -11, 110, -173, -54, 21, -92, -23, 128, 90, 106, 62, -173, -82, 236, 147, -30, 88, 100, 88, -105, 187, 64, 238, 44, -163, -158, -125, 179, 9, -29, -101, 85, -1, 149, 32, -137, -70, -33, -2, 106, 257, 7, -112, 103, -31, 86, 304, -104, -19, 353, 105, -144, -103, 86, -88, 168, 57, 27, 43, 143, 144, 6, -109, 16, -56, -80, 52, -55]
7238e5J17M4r4l0j7j2K34j04Rj43p4L89l64J95k14L57n05M36n6k92K82j42K4j50
7262a65J64pj14LM59o11J49J44J34j14k8J06j7q8P9Q3n4r0L7o7O6j07L7Q2P2j31
7288B2q8K84k84J42j55m6J89j17j73K97O6l52J55M4oJ42n6k55L0J21m7K73l41
7311a55j5J59k59M50j36k0O8qk42o4L28l5n7M54l19q3j64j37J73L06k11J09l29
7334a87J88o0J48k2k90K99j5k2j6L1q1R0k30K34K93m32k90K44J45K32p6k17j08
7357a42K16l32M14j33k1m5K37j7k60M9j69K03j31K64k23j3J55K05m20K61l53J14
7379a41L36mo9o0p6K18j82J61k19L0j86J65L8P7o6N2p2n7q3J37J24o0j72l3L1
7404a11M9K10J06k9j52k64K33n7q0j10P9J43q8R1j35J21nL8K7J4K16l94J28k59
$$ y = [-55, 62, 106, 12, -18, -35, -47, 187, 83, 92, -51, -125, 264, -100, 95, -119, 238, -267, 169, 113, -179, 103, -39, -15, -165, -1, -8, -122, -119, 340, -271, -122, 22, 156, 42, 14, 120, 103, 15, 94, 177, 123, 33, 70, 3, 69, -38, -1, 81, 153, 22, -66, 218, -66, 76, -79, -125, 64, -53, -226, 71, 137, -215, -60, -16, -22, 120, 64, -191, -161, -40, -87, 186, -155, -170, -11, -270, 180, 44, 24, 92, 84, -158, -222, 106, 71, 14, 468, 149, 66, -98, -235, -62, 244, 33, 142, -187, 1, -59, 89, 67, -223, 76, 61, 39, 23, 54, -27, 63, -167, 67, 360, -72, -362, -118, 27, 259, 183, -34, -142, 74, -258, 156, 23, 2, -43, 194, 177, -83, -34, -203, 0, -131, 133, -90, -103, 52, 257, -163, 98, -255, -141, 195, 191, 122, 62, -14, 204, 22, 183, -36, -6, -192, -27, 11, 88, 22, 74, 2, -55, -138, -1, 123, 63, -109, -142, -111, -62, 148, 254, 225, 73, -191, 42, -15, -95, -205, -126, 17, -71, 20, -115, 6, 1, 39, 66, 80, 296, -98, 30, -229]
7428b29R1M7K03k88J93l13N9K77j58J67R2Q6l19NK18j70K81j43K64k16j33Q1m3
7451E2j76Rm1L84l71J3j51K75m0O9m3K40m6j04k75J96Rm5q8K04k18J45J54l48
7475a96J34k29L65o1M5j24j20J05P4O4k64L65j45l5K63K3j81J44j41%o0J58j91
7498gJ03mj95j27P0J23j88K04J8n8K5M7k32J92K0P6j21L7J79Lo3r6J32Kj86J02
7524E6j51O3o7K69r5j87Q8N6k5P3k07L32k20J46L6k2k39J58J0p9m7J17k89n2N44
7549B68j84q8K26k95K0J7j0P9N1k51l0K31k22J56%Q8k93M58k17Q5n1q3R6J66k3
7574A94k38O5N9k23J72j24R9J40k13K1O4j93M13j99N3k51K41l32N1M4J55q9L3
7597e8j39K74K38j72k24L2jM7M2k71K28K11k23O9J22j46l2J51k70m6L25K5j67
$$ y = [-229, -138, -91, 112, -176, 17, -296, -237, 40, -118, 49, 141, 227, -92, -87, 131, -39, 242, 99, 363, 147, 14, 95, 52, -124, -115, -156, 228, -143, -130, -281, -6, -46, 23, -20, 220, 174, 70, -205, -9, 0, -45, -133, 71, -147, -2, 152, -196, -62, -291, 74, 13, 58, -66, -186, -81, -7, 57, -207, 158, 13, -22, 241, 264, 83, 227, 86, 86, 26, 184, -7, 96, 92, -103, -230, -160, -37, -225, -21, -3, -61, -36, 11, -221, -29, -9, 67, -54, -17, 162, 165, 102, 6, 138, 140, -46, 56, -95, -32, -99, 170, 75, -112, -24, 32, 7, 80, -127, 205, -15, 131, 167, 145, -94, 64, 74, -5, -52, 65, -224, -276, 268, 84, -4, 222, -73, -53, -36, -46, 33, 84, -167, -197, 34, -188, -32, -32, 56, -237, 221, 4, 89, 38, -45, 51, 217, 194, -44, 21, 80, -143, 29, -95, 4, 144, -69, -48, 16, -177, 236, 37, 90, -161, 80, -252, -201, -157, -2, -91, -58, -197, 77, 315, 143, -81, -49, -50, -3, 39, -232, -4, 207, -16, 53, 175, 29, -3, 148, -122, -168, 157, 182, 15]
7620A5j04K85k42m3K3J04O8L1k01r1j37M76k10J84Q1k76O5R8j83j73J32k1L29
7643B10l80q8K46K4j51R3Q8k6K6j02N1J29q5K7j3J2k2J37k77O0j12J85n1k32J83
7668f8j8J06j93l9J02J64J60k85J05o2j5O1m3mL8l06K95PP3L0J83o68K49l3J55
7693fL2K6kK9j21J33k42O1J56j21J32k13J46Q2m3j53K91p0Q5p4k96J93K9M6j13
7718a3k28J60P6q2k7m5k6O71m61k12K04j75M8J77k3L6j23j58L81p0p0q1K53j0
7742B02k48J0j41K5N04n06J92j0j02J65o1k29O9K17j21mJ80j15j93K08k02L54
7764A94j35J4P0j75N0l7R6n5n4L04m17J00J08q0j57J31k26K72q1K5J83p2o6r9
7788a07o1p0o8M88p0k4O6j19k76K59m1P2J46k64P5k71K21r5K58p8j74K7j1K15
$$ y = [15, -89, 196, -46, -89, -66, 38, 106, 137, -64, -155, -292, 184, -26, 158, 239, -37, 28, 126, -57, -230, -98, -119, 210, -170, -258, -12, 12, -139, -46, 42, 16, 42, -60, -9, 120, 35, 62, 49, 61, 39, 176, -101, -41, -153, 32, -19, -251, -68, -86, 20, -173, -212, -110, 54, 214, -71, 34, -28, -43, 18, -25, -29, 9, -297, -2, 5, 78, 108, 291, -377, -128, -161, -6, 26, 52, 50, 79, -42, 91, -151, -90, 66, -55, 77, -136, 10, 92, 49, -104, 187, 117, 202, 128, -168, 25, 54, 100, -13, -241, -81, -5, -87, -114, -159, -185, 486, 25, -187, 17, -158, -110, 67, 44, 80, -43, -201, 180, 110, 40, -41, 212, 202, -46, -36, -177, -152, 352, -154, 38, 28, -74, 91, 30, -199, -130, 87, -34, -38, 142, 27, -166, 42, -160, 194, 59, 73, 143, -32, 18, -19, 77, 22, -32, 272, -145, -45, 63, -17, -174, -43, -269, 3, -78, -53, 130, 58, -8, -107, -168, -238, -306, 182, 112, 88, 154, 35, -241, 18, -23, 49, 195, -69, 6, -265, -44, -139, 119, 41, -133, -106, -117, 98]
7812I8M4j97j22Q9j12K46o7J31J39k37j11K58j94j7l9J32J08k06J84k45K2L85
7834B89l92K45k35J46j92K80l49O7Q7r2K59k54L75k45J12j16L7m2M5j41M7J76
7856A07o0k31K65k18J41K8j89J05M2L3j01j4J88L0l06J54R5j18J29k48K32r6J69
7879A37j03k10K61r1J5N8o5L3q5j7J80j0J85m59R0J36j62K46k51m5K64Mp0j03
7903f2k72L09j16J74j67mj67K94J27R3j75r1j0J18O3J32l74J26R4j19K32n9Jj99
7927e2K53m49K60jL3j00J11N4k5l00o1L91l3k46L29k13Q8J06m05K75J31k04K13
7950A55j36j87M95k60p6J48j41j17L3R0K46l80M1J6o8o8J52j05K31J9j16O0k93
7973b61L13j18P9l3P2j69K74Ql79q1J31J45p2J1K26k53J57r0n7R1O4Q5j67j26
$$ y = [98, 142, -55, -177, -88, -200, 46, -21, 110, 249, 12, -99, 159, -35, -52, -91, 41, 149, -57, 127, -118, -96, 289, -103, 142, -93, 53, -139, 141, -208, -141, -54, -146, 113, -141, 234, -11, 101, -15, 22, -20, 25, -116, -69, 107, 47, -184, 81, -137, 4, 32, -157, -52, -10, 23, -78, -92, 96, 126, -180, -26, 69, -49, 80, -168, 64, -32, 137, 34, -176, 85, -6, 9, 67, 2, 35, -50, -67, 113, 103, 288, -171, -81, 55, -107, 139, -112, -157, 107, 111, 41, -62, -334, -25, -141, 33, -134, -138, -305, -11, 116, 209, 34, -57, -67, 51, 114, 246, -128, -2, 92, -27, 205, 146, 147, -52, 201, -248, 12, 11, 44, -56, 55, 109, 84, -216, -277, 114, 81, -165, 164, -49, 39, 145, -260, 15, 146, -58, 155, 19, -168, 327, 67, -9, 139, -2, -119, -86, 4, 250, -130, -89, -73, -141, -209, -57, -162, 69, 88, -28, 32, -261, 52, -66, 13, -20, 52, -117, 157, 165, -214, -295, -164, -19, -91, -80, 146, -107, 50, -40, -97, -6, 58, 143, -24, -150]
7997a50K12p3n2j70L60K1K58m95J20P1k92J43q3L59k83j13J94R8k23K50j5q0j11
8020e4M4j12P7j06N1L17q9k84J01j32k7K31J12k03r5K68j34j30K64q1l6Jn4K65
8044A94k84r9J50m7K42k75K26o1j70J57j45J13n4J29q4j48K40r3P6j38K02j21
8066A0j75L81j65m4N7j82K51j9k88J17J9J6K9j58L37m47P1K86j01j96J97l1j18
8089a53J62J39K65m58L67l98J39K4K41j55j73j20L5J15L0j70J28oL3j14j2J34
8111E3k86K22mM9nO3m8j12J84q3r4J68J6k4p1j93K47m3K00l11J09p9K21j00j90
8136a11Q6Q5j73J36k08K13N3k08K05k46J13Mkq8j3J35L38l58J98k49n1l5J84L
8160A1k7RJ35P3l88K52R0l86M61k71L0J11j31m2L1J17j47N2r3K72k14j20J28J87
$$ y = [-150, 62, -11, -63, -233, 127, 148, 406, -89, 31, 102, -190, -47, -130, 229, -54, -167, 27, 125, -98, 152, 137, 57, -54, -10, -122, -45, -151, -100, 217, 128, -156, -55, -187, -214, 17, 129, -74, -169, 99, -35, -165, 99, 18, -18, -17, -71, 194, -90, -189, -39, -86, 156, -119, 107, 46, -124, 33, -112, 1, -53, 76, -8, -156, 84, -9, 67, -71, 131, 10, -165, 216, 51, 7, 64, -118, 133, 114, -174, -57, -38, -22, 7, -151, 186, -261, -190, 96, -5, -201, -4, -35, -153, 9, 148, 413, -45, 322, -76, 63, 87, 328, 173, 0, -120, -85, 30, 60, -110, 18, 12, 45, -69, -81, 53, -233, -11, -15, 34, 29, 92, 44, -68, 116, 33, -61, 107, 123, 99, 28, -165, 82, 39, 239, -72, 37, -42, 179, 79, -111, -25, 60, -113, 23, -185, 28, 81, -127, 78, -168, -55, -51, -53, -141, -154, -19, 319, -39, 159, -90, -141, -176, 8, 11, -16, -7, 128, 201, -187, 65, 155, -231, 230, -41, -11, 100, -31, -73, -42, 75, -72, -20, -113, 159, -55, -175, -47, 140]
8184A40j33J94Jl04K16k64M05
$$ y = [140, 7, 201, 202, -102, 114, -150, 255]
8191B55
$$ Imaginary data points
##PAGE= N=2
##DATA TABLE= (X++(I..I)), XYDATA
0@%%%%%%%%%%%nJ3j6J6j6K3l1L2m0M8n6O9p7Q8j04J22j45J67j91K20k50K82l18
34a69L59m03M54n10N69o33P05p85Q70r62J066j180J301j433J579j740J917k113
52a108K328k567K839l146L492l891M358m909N570o383P414q764J0615j3317J7647
67A0178k5669M5271j77420k26602M58680J07205k43178M2683J07470j54645Q3774
78B7747R8482j91125j1115K13606q1653j80873R9891Q1969q9793L1000K2288o3559
90d3135L1441N8548n8528n2830P1765L5907n0664j1212n3206M955J32752J7611
102H3404r6188j8582M2192K315p912J8063j2598J4376J6372p0238k1583P4618
114B4239K6850n6779k1801K6706j4828l165o297k5698O8974M0874q7245l5442
$$ y = [0, 0, 0, 0, 0, 0, 0, 0, 0, 0, 0, 0, -5, 8, -8, 8, -8, 15, -16, 16, -24, 24, -32, 37, -40, 48, -56, 66, -79, 88, -103, 117, -133, 149, -169, 190, -213, 241, -269, 300, -333, 372, -413, 457, -505, 561, -619, 682, -751, 828, -912, 1005, -1108, 1220, -1347, 1492, -1654, 1838, -2053, 2305, -2604, 2966, -3417, 3997, -4767, 5848, -7469, 10178, -15491, 29780, -147640, -374242, 84438, 191643, -51535, -8852, 98618, -56027, 27747, 126229, -64896, -76011, 137595, 55942, -124931, -25040, 56929, -32864, -1864, 20424, -43135, -11694, 46854, -11674, -64504, 7261, 43168, -7496, -18708, -71914, -66959, 65793, 83404, -12784, -31366, 10826, 13141, 5229, 23292, 10694, 25070, 41442, -28796, -50379, 24239, 51089, -5690, -27491, -785, -15613, -18778, -25075, -50773, 18201, 59075, -28170, -63612]
126f3612P6459L5318m6846J4058L0564n4538k6272J9750J3020K7203K218n1060
138b3738k2291O4908L0547m5793p387J1347L44O08k7700k1290J8854L8383r70
151A5822l1642l816r23J5986L5987o338j8322O567L373l1953k3807M1459M1655
164D4048j6135n2219k6437M0541M4485k948m3294k9929M2673L4797l8765l7282
176d0465L5907M8978l3212m4519J0475K2142K2247l033l0432N266L6299j4226
188A5427n4386K2830N8120j9415l2912m571q151J0385K8755q645k9225K6896J4725
201A9833m6860R390M6963j6826k4476J8925q135l3712L4679L5904l7967p770L3145
214B3093j2889k4802J5628J4587o887Q129j8314m5472K4003M9745k0004l5583
$$ y = [-63612, 12847, 48165, 1319, 15377, 45941, -8597, -34869, -15119, -2099, 25104, 27322, -23738, -46029, 18879, 49426, 3633, -3754, 7593, 7937, 8545, -19155, -40445, -21591, 16792, 15822, -15820, -19636, -20559, -4573, 31414, 25076, 6754, 13321, 16694, -15259, -39066, 2393, 44048, 27913, -24306, -50743, -10202, 34283, 31335, -11959, -41888, 785, 35582, -3183, -40465, -4558, 44420, 11208, -33311, -22836, -694, 21553, 18520, -11912, -6646, 29653, 15427, -38959, -16129, 41991, 22576, -10336, -14907, -23058, -12673, 16082, 7437, -21788, 5108, 19833, -27027, -17637, 29326, 12500, -11976, 6949, -1186, -34898, -219, 35685, -2282, -10052, 23093, 10204, -14598, 1030, 15617, 8730, 16859, -1455, -46927, -22924, 26821, 6817, -28766]
226b8766J8710L0230j4464k2292N226K3599J9336k9786l8217K0852L6852q169
238A3111k9160O390K9914N520k5647k9386K3068M9871j2266n1359j1902K8867
250b979J4494j1650r225o18J2278N933k2450q588K3204J9362p629k1646j2409
263b1923R180L0208R306l0785j1725K1110J1443j3779j6674Q312K4848Q385l1830
276c924k8000L0738L0606k4363k4931J4008J7226j3127j8371m58K0033K3666j7577
289E526l4952J3841L4356m987k2182Q714J2955j1586q821l381R038K3493j806
302B0208k8314n710K2149K684j2654O534J845j2388j695j010k866Q562R394p447
316g08j1530L529M803P373M071j1354q89J4254l828j8196L300K1851P738j0402
$$ y = [-28766, -10056, 20174, 5710, -16582, -11356, 12243, 31579, 1793, -36424, -15572, 21280, 13111, -16049, -9659, 20255, 25775, 128, -29258, -6190, 43681, 31415, -19944, -31846, -2979, 11515, -135, -9360, -9978, 2300, 8233, -14217, -22805, 399, 19761, 12132, -9514, -21923, -12743, 17465, 26771, -4014, -15739, 5371, 16814, 3035, -13639, -5327, 19521, 27906, -3924, -31924, -1186, 29420, 5057, -19874, -5866, 11360, -1767, -20138, -20596, -563, 23103, 5526, -29426, -15585, 18771, 13784, -8398, 316, 13271, 1685, -7136, -10517, -1479, 22014, 20208, -8106, -13816, 8333, 11017, -1637, 4897, 6742, -5646, -7341, -8351, -11217, -2655, 6739, -708, -12238, -8709, -3906, 3467, 7538, -3816, -4705, 9549, 5721, -12475, -9175, 12676, 20414, 10012]
330A0012j7995o922K5027J3465k7865j2555K7326Q617k9792j3847J6732J9210
342A1413P490k3278k8970J9474L5147j2609k8237J2519K1148p438j3441n849J1447
355a184K7001m675l5714l805L0410L073j8737K222M733l333M256m901j3674R934
369d394J9052q826j9514J105P167O680N079j0002n522J4273N304j7006n566K0109
383G939J2786j1346j9635m639K0371J0620j7446r196J4682N969j7502q310J3610
396b097J4891p21k0544j1135J9052J5144j3330j2289J0702J0231q176j1340r26
409a0538J5649J2955j3970j5395J0421J1186p653p031O290L704j869q705j2229
422a7185P125J8045j503j3073k146N110N590P899m512j1397J0278J0551j5260
$$ y = [10012, -7983, -14905, 10122, 23587, -4278, -16833, 10493, 19110, -10682, -24529, -7797, 11413, 18903, -4375, -33345, -13871, 21276, 8667, -19570, -7051, 14097, 6659, -6782, -12631, -1184, 25817, 21142, -14572, -18377, 12033, 15106, -3631, -1409, 3324, -9, 4247, -654, -14328, -4394, 14658, 5832, -13682, -12577, -5410, 1270, 6349, -3653, -9175, 5098, 10402, -6604, -12170, 7939, 20725, 9379, -10256, -14895, 5476, 16096, -1350, -10546, 4136, 10105, -7397, -15707, -2097, 12794, 12073, -8471, -19606, -554, 14590, 1260, -11029, -327, 9904, 1728, -9612, -10538, 5111, 18066, 4096, -11299, -878, 10308, 2655, -4376, 1914, 5618, 3749, -4956, -17185, -10060, 7985, 6482, -6591, -8737, -3627, 1963, 9862, 5350, -6047, 4231, 14782, -478]
435d78j3074R137J3952L906j1102j9738N673K9741l857k9044O275K3801p574k1134
449a3516m812J0567K0654L407l2957j1031L6409J1863k6253k143J6813k246k913
462C842O71j2345O611K2882j5321k2734J8113J1385j9488k61J3283r559j169Q574
476D484j9528p889L1462Q659k5691m277J0437j136J0951R108k0568n258K2649
489A3403n601k0710J2784J6216j2732p395M045k376Q236O838k0146n707K7148
502A4003K80l2903k735K2842L949o509o693p681R854J6180r275q769J9080L949
516A5572k3080n30J8582K067o186o534j0764O816J8817r986j9506J2303J3400
529A0971r271m054j691q561R895J7324j4998j7857J3198Q437q597M910O351o461
$$ y = [-478, -13552, -4415, 9537, 13443, 2341, -17397, -11724, 18017, 14160, -14884, -8609, 15192, 7618, -13516, -18328, -7761, 12893, 16300, -16657, -27688, 8721, 20584, -5669, -7812, 9001, 6755, 3842, 4513, -7832, -1221, 21661, 6340, -16394, 1719, 13104, -6384, -6645, 6638, -2921, -4090, 4484, -15044, -22933, 8529, 17188, -8503, -12780, -2343, -3479, 7472, 16580, -3988, -9246, 13403, 7802, -12908, -124, 16092, 3360, -4035, 10, -2366, 5870, 12708, -7438, -13145, 14003, 14283, -18620, -21355, 1487, 5436, -1073, -7766, -15447, -5593, 10587, 1312, -7457, 11623, 15572, -7508, -8038, 10544, 12611, 6425, -109, -10873, -4057, 14760, 4774, -14732, -2429, 10971, 1700, -2354, -4045, -12606, -2711, 14613, -385, -18242, -5044, 3393, -5204, -294, 6057, -404]
543d04J890J617j2926P900K5945j2058k9004Q618K0366j665p028q048o848J6777
557E132J2680k6609j4948K6584R756j9012j429Q407m130J921M260p182Q902J3423
571A7755k2670j8592K6362J7746j7816j0078L093k387J0863J1293j7256q177J8031
584H167o06j4186P086L941j2444O294R155j4797k688J6443p116j1519J7090J0340
598A5160j5622o907L766J126J3213N120k5241j0510K4951R008j9034j815J1372
611D587j778m276j68r12O385N547j3824r467J7471R177j7000q821J2831J0547
625A0299k012j1402j0627Q338J8672j699j7687l084R331J858k093R97k85N07Q9
640A202m319j888P742L721o710o557K613O758L076n082q003M607J3754q55j5540
$$ y = [-404, 1486, 3103, -9823, -1923, 24022, 11964, -17040, -8422, 11944, 10279, 3251, -4797, -11645, 5132, 17812, -8797, -23745, 2839, 12595, -6417, -7846, 561, -3569, -1648, 2612, -4570, 4332, 17755, -4915, -23507, 2855, 20601, 2785, -7293, -4200, -6587, 4276, 15569, -1687, -9864, 8167, 7561, -6625, 461, 4402, -8042, -1748, 7407, -7390, -10078, 6365, -751, -12270, 4820, 15160, -462, -7369, -3603, -2477, 10736, 15856, -9385, -19895, 5056, 14064, -4970, -6785, 4587, 2809, -1467, -1635, -2547, 3838, 9385, -4439, -13906, 3565, 12742, -4258, -13079, -248, 10299, 8287, -3115, -13742, -5404, 13268, 11569, -6118, -9202, 129, 1987, -106, 891, 606, 1113, 1202, -3117, -5005, 2737, 6458, -252, -6809, -4196, 2562, 5638, 556, -7447, -2840, 10914, 10059, -5481]
655e481m966J1843J0495m651j3700l995J0984P666j0251n888J2254M574j4296
668e412o685J1764R416l029j0129o928P620J4118p043j5182P459J4890n446r051
682c638K149J368K521N708o242q319P799L296r638J810J0329n610p118L610k865
697d840R60J2600l791j6978M397J3935n327m968N235j778Q77P264q224r553J5570
712E379R664j6142n841J0917K85n095j75j881M312Q736j1717j5483J3864J7020
726A3843j1775j2602M942N661J530j477o505K237J2499k853j5014M781J3351k352
740F266o041K67l16J731L451n664l771P353L718q346m746K122L182N782j773j0983
756g768l51J0429l79p064J370M487K300j479o449j055J2298N179j2786n399R982
$$ y = [-5481, -10447, 1396, 11891, 7240, -6460, -10455, 529, 8195, -2056, -7944, 4310, 8884, -5412, -12097, -333, 9083, 6054, -4075, -11003, -3383, 10735, 3692, -11490, -4031, 10859, 5413, -3638, -1489, -121, 2400, 8108, 1866, -6453, 1346, 4642, -4996, -3186, 7143, 1533, -5585, -1975, -4840, -3880, 8720, 4929, -12049, -7652, 6283, 956, -4012, 1223, -555, 322, 7586, -638, -10191, 5379, 15043, -1099, -6940, 3977, 4262, -833, -1008, -2889, 1423, 10159, -1558, -17041, -3177, 13843, 2068, -10534, -5592, 69, 1599, 122, -6383, -4146, 8353, 5500, -9514, -4733, 8618, 6266, 225, 492, 176, 1907, 5358, -306, -4077, 3276, 6994, -1352, -6098, -3976, -794, 4988, 3215, -7768, -8119, 2310, 1931, -5133, -3763, 724, 3024, 1545, -4904, -5959, 6339, 11518, -1268, -6667, 3315]
771C315L994n515l455N17N257L853r751r511J0150J1436q794j0344N219N010j709
786c28k489j959L614P137m382j0722M769J1077j777o481J149J667M98P23k023
801D73j508M699J709o662m051L596M354J015l401n397J241O161r73n698Q49O297
817B704J952o214o209M418J0360Oj0434k740Q914L963o037n335M239P107j983
832D711j0670k780J1540N582q667o705M635N951j236n735j181O593M560p275p387
847h064N482P645j339m167j939J440L763K88n033J04N767K30o472k674K028L852
863I11K619l601n958L145O394k040m639K678M617j97m204m715K751Q725r38r677
879d129j153Q291J183o116j691M801M276l116q652k27J0203K292r230l270O590
$$ y = [3315, 7309, 1794, -1661, -1144, 4113, 7966, -1785, -11296, -1146, 10290, 1496, -8848, -3629, 1381, -328, -2817, -4776, -1162, 5975, 1593, -9129, -4360, 6717, 4940, -1541, -392, 1275, 1773, 2496, 473, -1035, 3664, 5373, -1289, -5340, -1744, 2610, 3625, 224, -5173, -3932, 2229, 1256, -4442, -3593, 2704, 4656, -1558, -7767, -3349, 7011, 7017, -3417, -6157, 2757, 6720, 683, -4652, -413, 6694, 4711, -5959, -8739, 2801, 8383, -284, -6989, -2354, 3597, 2361, -3374, -4555, 2038, 6598, -677, -8064, -2582, 5063, 3724, -443, -2382, -942, 2821, 3109, -1924, -1820, 3947, 4177, -2295, -4969, -2941, 911, 3530, -71, -6029, -2884, 3510, 1470, -3169, -491, 4126, 3929, -275, -4990, -2239, 6486, 5548, -4129, -5282, 3009, 4192, -1924, -3615, 1186, 5462, 2346, -6306, -6533, 3670, 5962, -3268, -6538, 52]
894E2K561l596k444J524N676J769p062m143P092N255m382l195J186N62J227n36
910A546m218J159O288k489p418M13L801J774J243l240m677M145N520m532m045
925d730O372L370l235m161j339L755P065k529j0643K915R919k407p825J567N032
940C126J882k734p612j493J0006K330j0667k026P990N0m938J032K859K897J953
955D655n829n108Q190O354o545m154L073j03k09K623l767j572O681J22p839L93
971c035M886j589j15J020n006K34O205m252n441Q210N411q341m351M601L081L412
987D930n18q469j35J0922j127j0187K968P847l507m520K70j74L253K292p264k867
1003f286R342J347j0324j41Q400K234l230l893l560M183Q300l187p694K379M485
$$ y = [52, 2613, -983, -3427, -1903, 3773, 5542, -1520, -5663, 1429, 6684, 2302, -893, 293, 855, 2082, 1546, -2672, -1513, 4775, 2286, -5132, -4719, -918, 856, 2099, -1141, -5818, -1673, 3847, -685, -4730, 1642, 5012, 1777, -2384, -3723, 32, 7097, 4568, -6075, -3160, 6759, 4352, -3473, -1906, 3126, 5008, 2274, -5338, -6831, 3175, 5505, -5162, -7188, 802, 852, -4086, -3054, -195, 2702, 4655, -1174, -6282, 1908, 8262, 1717, -2437, 636, 533, 324, 2947, -820, -2392, 4289, 4411, -3428, -3035, 1851, 262, 147, 1167, -3839, -3605, 2600, -1652, -7093, 1117, 6528, -1813, -6164, -1563, 1518, 4930, 4412, -4057, -4192, 6730, 5603, -4584, -1616, 6231, 2724, -1796, -1526, -1700, 1553, 3845, -3419, -6286, 3056, 4403, -5921, -6062, 2338, 4572, 1342, -2551, -6111, -1928, 6372, 3185, -4509, -2130, 2355]
1018B355k302n45K674r59k3J657l509j650N192J254n951j547L269J116m81k557
1034b007l688M791Q127l890j0995K201R251J144m153l282j10L669J422m145n31
1049b196P121j021q537N51P983J219n160k756J58M171L308n964n783O092O602
1064E788m459m658J578R09R66K911k129l558L065O61m824L152O405l989n518K531
1080a169R97O23M598l220q793M324Q455m764n526L356J642P50K350m659n093Q238
1096B109M404r099m18Q135l885o897M502L746l50J144n749o504J0456Q430j0806
1111g82o704P334K327l338J776j144k857N563J484p338J646P256m647l801N592
1126B367J040m306J151q11l256O697M507r618m423O362K443q35Q53m482l796P418
$$ y = [2355, 53, -492, 2182, 1223, 1200, 2857, -652, -2302, 2890, 4144, -1807, -3354, -85, 1031, 550, -2007, -5695, -904, 7223, 3333, -7662, -5461, 3790, 4934, 781, -2501, -2611, 1058, 2480, -1665, -2196, 4925, 3904, -4633, -4082, 3901, 5120, -40, -2796, -2638, 1533, 4841, -1123, -6906, -814, 5788, 1329, -3329, -1751, -842, 124, 3035, 906, -2652, 413, 1074, -3750, -598, 5807, 1818, -3700, -1169, -172, 451, 5049, 1829, -6964, -2640, 5815, 1051, -4475, -1119, 523, 1273, 3623, -1036, -6129, 2109, 6513, -2586, -3004, 5131, 1246, -5651, -1149, 2597, 2247, 3391, -2358, -8862, 1594, 10024, -782, -7486, -152, 2175, -1163, 613, -531, -3388, 2175, 3659, -3679, -2033, 5223, 576, -3225, 2367, 3407, -899, 252, -559, -3815, 2882, 7389, -2229, -6652, -290, 2153, 1318, 2171, -2311, -6107, 1311]
1142A311K525p763O07O619k136m199L114N28j28K972l698l362P648K435j0184
1157c711j877R496J556m598k511k342K251P008k838q135L991N041n849j948N957
1172A491k28k821R76j500l36O241j63p393K054O303k378l261J745j275O20N170
1188E245k950p474L071O186l016k550J292j161m65K612k906j500O349J71q257
1203e353O51P835J01l766r69K89K614L216m421m797N922N744o119m880L885K209
1219B161j162n58j507k09L130j646n128L028N672k919m812J126K797R75P96k168
1235d24j629K814J807k851j365K389J464p52r44j617PL223P5l320o86L268k39
1252A220k990r10K418K356p11m497q45M673K794l404l309K613L266j232l431J51
$$ y = [1311, 3836, -3927, -3320, 3299, 1163, -3036, 78, 606, 478, 3450, -248, -3610, 4038, 6473, -3711, -5588, 3908, 5464, 866, -1645, -3987, -1736, 5272, 2434, -5701, -1710, 3331, -2518, -4466, 1491, 1263, -1558, -582, -2082, -2418, 3823, 3660, -3733, -1679, 4624, 2246, -1015, 730, -545, 75, 5245, 2295, -5179, -2108, 4078, 1062, -1488, -196, -1357, -1822, 790, -2116, -3616, 2733, 2904, -5353, -4702, 3133, 3234, -532, -1501, -1212, 1402, 4618, 197, -4600, 1322, 7066, 947, -3933, -48, 2161, 999, 441, -1066, -1275, 1855, 209, -4919, -1891, 3781, 862, -3950, -2824, -27, 948, 1744, -424, -2053, 761, 2568, -283, -1648, 741, 2205, 1453, 509, -1108, -1101, 2122, 2197, -1123, -1809, 1459, 1220, -1770, -2680, -262, 2094, 1383, -3114, -3959, 714, 3508, 104, -3205, -592, 2674, 1442, -1989, -1838]
1268a838M171J207l756k873K524L834j177l920M67L136J64l165j751K478K818
1283B319q96l343q85K835J724j595j660P59J558k86r67o06J358J878o76k678o13
1300a774K087J540j179j886k24K069Q28k686j587L598K535k705l379J089L515
1315A841N61k684k265K094L170j957m047J811N091j146m286q87K358K898j622
1330I30k920K03L378P9l949l95L711R38j716j960J91J979J607j396k338J632K192
1347B166j339j925R05J134P36p13k310r59L044J343k937j306J667J394o86j916
1363a702o47L010K147k616l453J925L550l11l214n42K589K318k806k492K166L596
1379C518j121m100l17L000J505k158k601Q24K664o85l207K18L200P71k074j428
$$ y = [-1838, 2333, 3540, -216, -3089, -565, 3269, 2092, -1828, -1361, 1775, 1939, -1226, -2977, -499, 2319, 1423, -1920, -2805, 30, 1754, 159, -1501, -742, 816, 530, -437, -1043, 315, 2193, 1517, -1161, -1774, 313, 1853, 674, -1212, -1436, 633, 1461, -1225, -2812, 786, 3321, 616, -2763, -1674, 1841, 2402, -282, -2547, -453, 2717, 760, -3287, -1476, 3615, 2469, -1817, -2704, -346, 2552, 930, -1990, -1787, 1591, 1670, -2279, -2674, 1037, 1975, 259, -1701, -1510, 469, 2076, 680, -1658, -26, 2166, 827, -1098, -193, 941, 1677, 964, -1346, -2305, 739, 2082, -855, -2161, -494, 900, 214, -1702, -2349, 661, 2808, 192, -3261, -1336, 2214, 1903, -1311, -1853, 736, 3054, 248, -2244, -78, 3518, 2397, -1703, -2020, 980, 2485, 327, -2274, -1450, 1214, 529, -2678, -2460, 740, 1511, -563, -1991]
1395a991P67J983P32j468j228J643J247j374j084N86J237Q32p91k176J2K516O23
1412B066k724j012J772Q26j213j614j07K424J558l102k566K663L049j417k633
1427b030R35K466K12j715j305J938L143k048l448P27L506k82k518q64J319J205
1443A241n45k365m12L165Q16k920j299J825Q85m31k27o63M27J213n21j905J412
1460c04K440o71j768o4L07J444R47k070k211K549J774k717k247J641K225k69j579
1477e73j704J172K681n27l374J204L285j636k970J507K732J89j321k221k12L944
1493B176N57l661j034L402N14k607j44M05L96J281j160k082J369K170j650j868
1509a936K287O99j666N4k29l63K894P63l541j725L457J186j421o42l73j81K011
$$ y = [-1991, -1224, 759, 1491, 23, -1205, 438, 1685, 311, -773, -187, 1050, 1882, 1091, -1085, -1073, 1443, 2066, -658, -1670, 102, 928, -285, -1899, -2006, 418, 1976, -1126, -3692, -1029, 2020, 603, -2030, -1095, 1371, 1583, -132, -1437, 501, 3644, 1596, -1852, -1125, 2381, 2099, -419, -1283, 36, 1241, 696, -1669, -2081, 1084, 1900, -1020, -2319, -494, 391, -40, -267, -930, -503, 710, 189, -1716, -304, 2136, 1465, -303, -367, -60, 1384, 2331, 261, -1950, 599, 2373, -344, -2591, -950, 1275, 1006, -573, -2277, -1105, 1576, 1049, -2325, -1121, 2164, 528, -2442, -935, 1797, 1986, 665, -1556, -1768, 2176, 2733, -928, -1962, 1440, 1954, -653, -797, -392, 4, 1285, 125, -1957, -588, 1582, -68, -1936, 351, 1050, -616, -562, -791, -1154, 1740, 2503, -1038, -2763, 694, 1880, 459, -183, -556, -737, 1274]
1526A274M1l510O15M002j608k999J800J617r38p81m16N17K484o9m814j92N535
1543B558O88m229p21J135R81J179p14k518R63K643k480j744L223M56k745L07J292
1560B74n00J058K6k911Q48L838o02l821Q71J377O0J338p81l785J292L875j461
1577I96k803J937L39k127J116M59o42J676J12m040R86M991j246m439J287K724
1593A326j73J76j594k458L395L294l840k696L531K66k570J041J858j805j04j68
1609e21j924K245L267l153l692L001K157j712P35m63j831K185L086l482k063L034
1625H69P29j510P78j44j940J862R10k425N85K836k649l328L478J582j332o53j437
1642a789r53L689K132m560j584M150N33k227J47O21K0Q25p7j966J521K080l012
$$ y = [1274, 1315, -2195, -1580, 2422, 814, -2185, -385, 1232, 294, -487, -903, -386, 2098, 2029, -2785, -2977, 2558, 3246, -983, -1704, -569, 412, 1591, 877, -1641, -678, 1965, -515, -2259, 964, 1420, -1325, -1018, 274, -226, 832, 858, -2053, -1205, 2633, 2031, -1790, -919, 458, 518, 1856, 1075, -2710, -1418, 2457, 996, -1807, 130, 469, -1658, -542, -83, -725, 951, 1063, -2977, -1991, 3000, 1754, -2685, -1398, 1326, 1153, 1329, -265, -2723, 672, 3966, 126, -2570, 961, 1227, -1343, -302, 1556, -249, -353, -521, -2445, -200, 3067, -86, -3778, -777, 1380, -332, 403, -60, -1891, 294, 3380, -102, -2165, 869, 1598, 88, 866, 722, -1218, 644, 1554, -871, -286, 2550, -99, -3427, 51, 1633, 301, -352, -1789, -2742, 947, 3079, -1481, -3065, 1085, 1618, -609, -462, 159, 179, 1004, 927, -1039, 482, 2562, -450]
1659d50j278L456P02k834q49K06O32J904l12l263n24L116L81j664N55j39o81J237
1677A95K93j442Q78J441j408j092K037L89q92m8m26Q7J635n35l067L26L194J57
1695A722k627n80P66Q37O53j317q42J320J475k264r94K810N08j702q33Q55R10
1712F97N04q69j808J117K510j489k265Q56J574l32j09r07n10O83J025r81p46J416
1730C66M29j510l14R12N19N79n58j879P46K201j32k104j45J488L44p46p30l87
1748i21J613J010k245p96J331J185j510o69Q82J020l34j304o05J247J899j361
1764D42k025J139J519j62j476N0N15L91Q2j347NJ403O36j643m99Q89O80o27j41
1783a69m95J082N95j026r47P29J335j89r97m84J50J130O2j600J83J194M95j669
$$ y = [-450, -1728, 1728, 2430, -404, -1253, -1047, -415, 1489, 1177, -2086, -2610, 506, 887, -777, -222, -361, -1042, 195, 488, -954, -76, 1365, -43, -1135, 902, 1291, 399, 351, -75, 12, 1647, 1112, -1955, -1629, 1565, 1722, -905, -1485, -719, 118, 771, -546, -1388, -68, 1407, -857, -1851, 959, 1467, -235, -1068, -213, 697, 1201, 332, -1476, -359, 2151, 662, -1603, -747, 827, 495, 386, -521, -1031, -348, 677, -304, -1050, 366, 795, -715, -1029, -117, 402, 981, 423, -1456, -710, 1491, 1359, -745, -890, 598, 942, 196, -534, -921, 692, 1702, -543, -1339, -8, 1177, -333, -1002, -120, 900, 566, -738, -1343, -96, 1803, 442, -1583, -444, 1075, 913, -563, -513, 2, 393, 475, -872, -867, 536, 1172, -471, -970, -81, 599, -28, -169, -664, 418, 1013, -13, -960, -231, 1104, 915, -82, -566, -416, 714, 776, -824, -641, 553, 1048, -621]
1801f21l64P03J105j74j565n32J578R94j580q68J321J347j036j235K18J317R17
1818A525j066j413Q40J581q30j078K12J005j46j075l50Q7J171J12j170m90R65
1835a20L75k99l89J70N77L89p14p51N52J291rj256l72R77N78l94q52r0J110J14
1855H87j369q36J488Q02q66j139j29J239N36j146o98J100J166j116q95N44J250
1872H18K22j202n94P42J183m44j366L20J420l07j073l37P47O60n25q60k79Q32
1890d3M64p22m43M49K39K90o97j12M12R86j62r53J03P76K08l21q19K91J031j36
1910H41j148n86J436K28p78q92L70J080k66j120k5J196J25p70p10O81J032L2j121
1929c95k21P98P74p91n50L00Q50Q9j008m44J131K26p59m50L41M78p1m83l16Q0
$$ y = [-621, -985, -282, 823, 649, -916, -1448, 130, 1124, -456, -1324, -3, 1344, 308, -927, -709, 608, 1525, 459, -954, -114, 1467, 637, -441, -229, 776, 630, -445, -795, -708, 463, 575, -595, -1085, -120, 255, -44, -433, -263, 314, 703, -11, -762, -210, 1081, 1072, -184, -556, 421, 999, 605, -247, -337, 773, 887, -482, -1318, 170, 972, 106, -1033, -1162, 77, 613, -533, -1231, -131, 1035, -81, -976, -432, 818, 1040, -162, -756, -14, 1169, 725, -641, -321, 1099, 792, -281, -618, 129, 789, 264, -596, -875, -43, 421, -301, -744, -295, -56, 234, -463, -575, -163, 823, 661, -292, -189, 587, 795, 474, -345, -54, 977, 841, -307, -893, 543, 771, -7, -899, -529, 551, 285, -835, -860, 336, 461, -309, -1019, -338, 694, 726, -395, -616, 182, 956, 165, -385, -85, 765, 854, -154, -598, 533, 759, 0, -450, -109, 369, 298, -185, -501, -421]
1949d21Q12j48r96j3P79N99l23q12J24Q03L19m41r68P57Q24p16r53O28Q47q4m65
1970A52o81J05J320n80j118Q3J558l25r60pK09O18J67p40n13J059M24j348K33
1989c44P16M4k94m82j50N54R42q51j078M88J164o39m29J4J22L45P16j142p80J572
2009D88K94r91j22M93j36n0K09m12K83R06q00j423O93J469q33p57n4M56Q32M0
2029E85j482k22J971N3j760L70J045l90j23R2j46K37L21r08n45J473P66j710n56
2048i29Q42K11k7L98j380j55J304K89q45J26M31m05p3M55o40K43Q77o48o99J043
2068D18P8p44q0N45K42R0k42j275P0J696k1j599K7J017k51n7j05k66L56O28j033
2089e06k59J399j29j197N64P31j89j0l90m26N57J097o80j273N20P46l35k28J38
$$ y = [-421, 391, 243, -753, -766, 13, 612, 289, -523, -399, 404, 723, 282, -686, 71, 895, 179, -774, -146, 701, 617, 152, -529, -424, 896, 316, -802, -719, 839, 514, -446, -453, -244, 374, 541, -199, -712, 347, 771, -577, -344, 372, 416, 122, -360, -510, 44, 986, 135, -943, -455, 709, 70, -359, -345, -223, 122, 838, -304, -1084, 488, 782, -209, -331, 162, 26, -24, 185, -227, 56, 962, 162, -1261, -568, 901, 68, -689, -743, -287, 545, 585, -897, -1119, 852, 905, -855, -485, 560, 170, 47, 139, -7, 230, 551, -357, -902, 571, 1337, -373, -929, -87, 124, 97, 495, -885, -1040, 264, 553, -292, -166, 265, -140, -213, 242, -398, -155, 722, 74, -625, 418, 496, -248, -328, 217, 459, 549, 307, -968, -898, 798, 777, -822, -795, 222, -29, -86, -191, -457, -101, 527, -506, -765, 634, 505, -692, -128, 603, 414, 404, 14, -412, 145, 1242, 562, -711, -191, 555, 220, -8, 130]
2108A30p80N9R70n93m41P07l9r42O83P45l17k24n1o02M07J445q56j258Q38R36
2128H17k17o03l15k33Q38P08j158p67J091K42j267M71Q44l37o97K31j14O57L61
2147E52p17j149J270J217j005m76K58O0L01L88o27p32J103Q6r20M54L40o67j04
2166c68N61l15J71N54p44j042J575M08n78p92K49K2O27N99j271n43J329J95q76
2185b39j26P31l03k03K39l31M20L37j204r5J238M28j212n05P94R3K53l43m69L34
2205a63P33r7q83L95O99r25k03P10k71j25K81l86n67R66L22j048O9L49L93m8M6
2226B47n69n9J041M9r91n7N15N0l55L49j04j27L36n17k16O62J55r71K8O24K25
2247C15m85n3j58M98M40o47p71M28R04j08n62L4J67M24k80j09l37N27L38j005
$$ y = [130, -650, -591, 379, -214, -655, 52, 13, -929, -246, 499, 182, -42, -93, -695, -288, 1157, 301, -957, -119, 817, 600, -3, -318, -551, 287, 995, -163, -930, 161, 403, -864, -393, 451, 114, -583, -352, -466, 191, 552, -165, -1314, -44, 1173, 168, -308, -50, 10, 311, 699, 72, -660, 443, 529, -391, 63, 403, -264, -368, 193, -122, 49, 603, -141, -1183, 392, 800, 222, -570, -321, -299, 328, 927, -344, -887, 442, 637, -239, -365, 366, 63, -140, 99, -232, 188, 525, -679, -774, 464, 892, -320, -825, -31, 62, 315, -28, -497, -163, 570, 473, -410, -15, 684, -241, -444, 266, -5, -130, 151, -235, -802, 164, 486, -562, -493, -144, 249, 201, 247, -322, -381, 660, 709, -282, -339, 176, 226, -129, 220, 116, -11, 325, -192, -408, 254, 409, -562, -534, 90, 315, -170, -223, -381, 117, 557, -90, -861, -433, 471, 363, -199, -165, 2, 426, 146, 37, -300, 227, 565, -440]
2267d40M29K36j5n48J64j24L37L12j71o69L42M88k43k13j23K29R0K50l11l05N80
2288B95o5o03K96L84J0k66l05J02N29J11n50o79O83O16p91l92K31L26K57l77p2
2309b60J17N96k73n62K66M57k73k82oK49K93Pm44Q8J54N52o46l50L54r4K78j17
2331A04n93K93L20Q7n60J63K72J48n26p0L80M14j07k10k28N28m6l69k87o6O09
2352B56J26o84o0K92K93k88k91L03L69j92m36k27P70k9j54k74K0L84J07k11m15
2373c41N72J55m29J56r2Q5K62l00j42J14R8J2l71l08N54J60k63k19J35J38L41
2394C17l76q3PM40j47j81J47J15l8n20j0L56L70j21k40j97K26K84m28r4j30M79
2416A76K0l95J62n6M13k87k60M18J66l28j30l1K38J77j87k58J2O6J89j33j40K38
$$ y = [-440, -11, 225, 210, -338, -174, -298, 39, 351, 180, -489, -147, 341, 98, -115, -238, -9, 81, 331, 20, -285, 295, 230, -373, -77, 307, 317, 51, -254, -152, 377, 488, -62, -741, -58, 558, -233, -625, -394, -68, 189, -188, -260, -143, 453, 180, -382, -116, 341, 68, -214, -220, 29, 322, 329, -115, -27, 127, 679, 33, -317, 37, -57, 221, 104, -489, -196, 124, 211, -349, -186, 86, 234, -292, -362, 18, 432, 325, 115, -113, 415, 369, 0, -287, -353, 256, 382, -302, -362, -70, 223, -65, -356, -53, 316, 124, -312, -539, 231, 202, 48, -226, -206, 178, 285, 74, -341, 231, 386, -43, 113, 21, 106, 368, 68, -74, 40, 138, 150, -221, -529, 25, 185, -78, -297, -162, -24, 317, -59, -142, -135, 305, 158, -23, 124, 239, 201, -319, -329, 27, 397, 276, 36, -161, 65, 349, -79, -173, -303, 176, 196, -199, -37, -93, 320, 33, -227, 191, 357, 29, -101, -132, 106, 283, 96, -162, -150, -84, 105, -28, -168, 70]
2438G0J52j51m41K68K87p3k66j47J46M44J38l71o8J69Q0k10l84K82L39km56l25
2460e19M24K99p7j72J68j68J72k80J15J88O4K2n68K45O6J73k59k95N50J07n06
2481b51J17k61M42K20j89k42L87j27K1m3p2J18L3r6k08q0J16J93n44K12L46K28
2503C20m53J74l54M12J41j39o71N54M00k43l93N6J31Q1l74L26j92M80r4l98K44
2524HJ04j19l01P4R3J50O9k44k29M02M85p01p1L45J06j1j07J01l53K64K07m28
2546a56j41M10j63k10J61K38k48J77K2m80M82L15l36m90L64K02R3j58k45K4J80
2567D1P9k84J91J45K21k46M0kq7m49K43n6K76K60q68J24L94O7r4J42l55J99M40
2590D21l71l53N16k01p8M4J81m70K36J91POj28K41k41j9l0K49l97J23j93K29M17
$$ y = [70, 222, 71, -370, -102, 185, 112, -154, -301, -155, 289, 427, 56, -12, 157, 237, 27, -357, -75, 264, 262, -194, -519, -95, 204, 127, -45, 123, -45, 127, -153, -38, 150, 214, 236, -332, -87, -21, 152, -107, -402, 148, 255, -251, -134, -395, 47, 267, 78, -164, 223, 96, 117, 74, 2, 120, 153, 57, -151, -231, -115, 78, -466, -254, 92, 320, -133, 41, -313, 99, 240, 101, -570, -16, 384, 141, -252, -196, -65, 16, -358, -32, -224, 256, 162, -236, 8, 112, -7, -308, -234, -141, 9, 78, -166, -395, 7, 492, -209, -280, 65, 171, 160, 53, 154, -199, 65, 272, -156, -297, 113, -50, -260, -99, 139, -109, 68, 90, -390, 92, 407, 71, -419, -55, 147, 240, 82, -163, -139, 41, 120, -164, 27, 172, 393, 147, 187, 185, 98, -351, -108, -164, 112, 372, -496, -372, 22, 89, -5, 137, -218, -19, 421, 50, -303, 213, 12, -66, -22, 159, -311, -75, 116, 123, 129, 1, 242, 1, -18, -48, 201, -196, -73, -266, -37, 380]
2613C80k44n13K73N63o35J06L4L68m32L77k63k6L79k45l04J44K63j5l57o8k38
2634d53M71L05n91J32k10Q43n79j80J75J29k60K85m5l94M07m9k81J70L87k26k66
2655b30P6K14L12l98M2l27K44M86m03j06J41Jj45L92k20k96L11P5m30K44N28o37
2677a26r0K33K1P2L5R8p52L68O51n69j26k2M81J17l77J94k51Q9J56k56K03l3j75
2700e9o5L1L53k53K34Kl6k56K39k15m90O22K68l11j39L21l76J38k2l41K40J53
2722C8q7P9j70L52l26R7j88K55N25l68j50m9K03j86l50N32l47ll9L00l20L86J40
2745C24m31L0l40N32L8k98K67k46J03K82n09J07J22j9k06J62m0N9J59M3m32J57
2767a36M03j63P0j48k35K42k45J76j17n6M48l41K7J01j9l4l12P13n06J09P8k84
$$ y = [380, 136, -377, -104, 459, -176, -70, -36, 332, -100, 277, 14, -12, 367, 122, -182, -38, 225, 210, -147, -215, -453, 18, 323, -268, -136, -346, 497, -82, -262, -87, 42, -218, 67, 22, -372, 35, -14, -295, -125, 262, 36, -230, -154, 60, 372, -26, 16, -311, -67, 419, 16, -90, 51, 52, -93, 299, 79, -217, 94, 169, -261, -17, 511, -126, -216, 17, 38, 110, 145, 243, -509, -141, 510, -59, -185, -207, 274, 391, 14, 208, -43, 46, 202, -54, 149, 116, -59, -124, -93, 260, 7, 241, 243, 207, -49, 190, -25, -515, 107, 375, 64, -75, 246, -130, 8, -14, -355, -115, 38, -49, 30, -140, 212, -114, -17, -205, 50, 575, 207, 57, 8, 211, 25, -325, 207, -140, -143, -182, 118, -202, 184, 324, -107, -77, -417, 115, 153, -145, 122, -124, -21, 261, -248, -141, -19, -38, -244, -82, -122, -63, 96, 139, -293, -136, 267, 104, 174, 26, -209, 33, -212, -36, -153, -209, 239, -102, -75, 26, 7, -27, -339, 374, -132, -23, 55, -229]
2789b29L41J69j23k76K89k77K22l90M07M2l13j28R1K24p4J9l93J83J8J16P6N5
2811D9M6J19k40j4J6J7K78j70l00K60K21j68k88N5J74M5j58j4K4P8L8rm7q1L4
2836c5q5j5K6J49Q9k58J41j78J22J16N5k22J3K35k35l1L3L2J58l5l9L0j28q1j9
2861a62J43rP7J18m09R6J36L5n1l4K07J2J4k67J17K14k84j32Q3J86M0J43j75j24
$$ y = [-229, 112, 281, 158, -118, 171, -106, 116, -274, 133, 175, -138, -266, -175, 49, -25, -6, -399, -216, -198, -82, -6, 49, 95, 214, -26, -40, -24, -7, 271, 101, -199, 61, 282, 114, -174, -119, 55, 100, -58, -72, -48, 30, 68, 59, 12, -69, -35, -120, -135, -109, 40, 129, -129, 12, -166, -44, 72, 127, -95, -82, 153, -82, -113, -80, -48, 110, 75, 36, 66, -62, -143, -162, -19, -28, 49, 167, -242, -146, -10, 25, -26, -60, 147, 159, 173, -94, 23, 237, -47, -179, -96, 90, 130, 273, 98, -26]
$$ [...]
8191b12
##END NTUPLES=NMR FID
##END=
