##TITLE=1H_SL54a-Dau(rechrom)
 CDCl3
 8 sc, 
 6.07.2022
##JCAMPDX= 6.0         $$ Bruker NMR JCAMP-DX V2.0
##DATA TYPE= NMR FID
##DATA CLASS= NTUPLES
##ORIGIN= UXNMR, Bruker Analytische Messtechnik GmbH
##OWNER= root
$$ XWIN-NMR		Version 3.5
$$ Wed Jul  6 13:51:59 2022 Russian Standard Time (UT+4h)  she@DPX200
##.OBSERVE FREQUENCY= 200.1313499994
##.OBSERVE NUCLEUS= ^1H
##.DELAY= (6, 6)
##.ACQUISITION MODE= SIMULTANEOUS
##.ACQUISITION SCHEME= undefined
##.AVERAGES= 8
##.DIGITISER RES= 18
##SPECTROMETER/DATA SYSTEM= spect
##.PULSE SEQUENCE= zg30
##.SOLVENT NAME= CDCl3
##.SHIFT REFERENCE= (INTERNAL, CDCl3, 0, 15.7039)
##AUDIT TRAIL= $$ (NUMBER, WHEN, WHO, WHERE, WHAT)
$$ ##TITLE= Audit trail, XWIN-NMR		Version 3.5
$$ ##JCAMPDX= 5.01
$$ ##ORIGIN= Bruker BioSpin GmbH
$$ ##OWNER= she
$$ F:/spectra/data/she/nmr/H-F/1/audita.txt
$$ ##AUDIT TRAIL=  $$ (NUMBER, WHEN, WHO, WHERE, WHAT)
(   1,<2022-07-06 13:50:41.62 +0400>,<she>,<DPX200>,
      <created by zg, POWCHK disabled, PULCHK disabled
       configuration hash MD5:
       00 E9 B6 7A A2 85 ED C7 34 08 36 98 17 FE 4E 26
       data hash MD5: 16K
       28 46 2D 33 AC 4F C9 1D 89 81 ED 11 45 BA 58 37>)
$$ ##END=
$$ 
$$ hash MD5
$$ F7 CC 0F DC 72 3A 75 4C B6 63 A7 B3 F4 05 D5 94
##$RELAX= 
##$RELAX= 
##$RELAX= 
##$RELAX= 
##$RELAX= 
##$RELAX= 
$$ Bruker specific parameters
$$ --------------------------
##$DU= <F:/spectra>
##$EXPNO= 1
##$NAME= <H-F>
##$PROCNO= 1
##$TYPE= <nmr>
##$USER= <she>
##$AMP= (0..31)
100 100 100 100 100 100 100 100 100 100 100 100 100 100 100 100 100 100 
100 100 100 100 100 100 100 100 100 100 100 100 100 100 
##$AQSEQ= 0
##$AQ_mod= 1
##$AUNM= <au_zg>
##$AUTOPOS= <>
##$BF1= 200.13
##$BF2= 200.13
##$BF3= 200.13
##$BF4= 200.13
##$BF5= 200.13
##$BF6= 200.13
##$BF7= 200.13
##$BF8= 200.13
##$BYTORDA= 1
##$CFDGTYP= 0
##$CFRGTYP= 5
##$CHEMSTR= <none>
##$CNST= (0..31)
1 1 145 1 1 1 1 1 1 1 1 1 1 1 1 1 1 1 1 1 1 1 1 1 1 1 1 1 1 1 1 1 
##$CPDPRG= <>
##$CPDPRG1= <>
##$CPDPRG2= <>
##$CPDPRG3= <>
##$CPDPRG4= <mlev>
##$CPDPRG5= <mlev>
##$CPDPRG6= <mlev>
##$CPDPRG7= <mlev>
##$CPDPRG8= <mlev>
##$CPDPRGB= <>
##$CPDPRGT= <>
##$D= (0..31)
0 1.2 0 0 0 0 0 0 0 0.06 0 0.03 0 0 0 0 0.0002 0 0 0 0 0 0 0 0 0 0 0 0 
0 0 0 
##$DATE= 1657101041
##$DBL= (0..7)
120 120 120 120 120 120 120 120 
##$DBP= (0..7)
150 150 150 150 150 150 150 150 
##$DBP07= 0
##$DBPNAM0= <>
##$DBPNAM1= <>
##$DBPNAM2= <>
##$DBPNAM3= <>
##$DBPNAM4= <>
##$DBPNAM5= <>
##$DBPNAM6= <>
##$DBPNAM7= <>
##$DBPOAL= (0..7)
0.5 0.5 0.5 0.5 0.5 0.5 0.5 0.5 
##$DBPOFFS= (0..7)
0 0 0 0 0 0 0 0 
##$DE= 6
##$DECBNUC= <off>
##$DECIM= 32
##$DECNUC= <off>
##$DECSTAT= 4
##$DIGMOD= 1
##$DIGTYP= 9
##$DL= (0..7)
0 120 120 120 120 120 120 120 
##$DP= (0..7)
150 150 150 150 150 150 150 150 
##$DP07= 0
##$DPNAME0= <>
##$DPNAME1= <>
##$DPNAME2= <>
##$DPNAME3= <>
##$DPNAME4= <>
##$DPNAME5= <>
##$DPNAME6= <>
##$DPNAME7= <>
##$DPOAL= (0..7)
0.5 0.5 0.5 0.5 0.5 0.5 0.5 0.5 
##$DPOFFS= (0..7)
0 0 0 0 0 0 0 0 
##$DQDMODE= 0
##$DR= 18
##$DS= 0
$$ [...]
##$SUBNAM2= <"">
##$SUBNAM3= <"">
##$SUBNAM4= <"">
##$SUBNAM5= <"">
##$SUBNAM6= <"">
##$SUBNAM7= <"">
##$SUBNAM8= <"">
##$SUBNAM9= <"">
##$SW= 18.0517283424941
##$SWIBOX= (0..15)
0 0 2 0 0 0 0 0 0 0 0 0 0 0 0 0 
##$SW_h= 3612.71676300578
##$TD= 16384
##$TD0= 1
##$TE= 0
##$TE2= 300
##$TE3= 300
##$TEG= 300
##$TL= (0..7)
0 120 120 120 120 120 120 120 
##$TP= (0..7)
150 150 150 150 150 150 150 150 
##$TP07= 0
##$TPNAME0= <>
##$TPNAME1= <>
##$TPNAME2= <>
##$TPNAME3= <>
##$TPNAME4= <>
##$TPNAME5= <>
##$TPNAME6= <>
##$TPNAME7= <>
##$TPOAL= (0..7)
0.5 0.5 0.5 0.5 0.5 0.5 0.5 0.5 
##$TPOFFS= (0..7)
0 0 0 0 0 0 0 0 
##$TUNHIN= 0
##$TUNHOUT= 0
##$TUNXOUT= 0
##$USERA1= <user>
##$USERA2= <user>
##$USERA3= <user>
##$USERA4= <user>
##$USERA5= <user>
##$V9= 5
##$VALIST= <valist>
##$VCLIST= <CCCCCCCCCCCCCCC>
##$VD= 0
##$VDLIST= <DDDDDDDDDDDDDDD>
##$VPLIST= <PPPPPPPPPPPPPPP>
##$VTLIST= <TTTTTTTTTTTTTTT>
##$WBST= 1024
##$WBSW= 4
##$XGAIN= (0..3)
0 0 0 0 
##$XL= 0
##$YL= 0
##$YMAX_a= 217151
##$YMIN_a= -346976
##$ZGOPTNS= <>
##$ZL1= 120
##$ZL2= 120
##$ZL3= 120
##$ZL4= 120
##$ABSF1= 10
##$ABSF2= 0
##$ABSG= 5
##$ABSL= 3
##$ALPHA= 0
##$AQORDER= 0
##$ASSFAC= 0
##$ASSFACI= 0
##$ASSFACX= 0
##$ASSWID= 0
##$AUNMP= <proc_1d>
##$AZFE= 0.1
##$AZFW= 0.1
##$BCFW= 1
##$BC_mod= 2
##$BYTORDP= 1
##$COROFFS= 0
##$CY= 11.3945322036743
##$DATMOD= 1
##$DC= 2
##$DFILT= <>
##$DTYPP= 0
##$F1P= 2.36226072786647
##$F2P= -0.459571619588291
##$FCOR= 0.5
##$FTSIZE= 0
##$FT_mod= 4
##$GAMMA= 1
##$GB= 0.15
##$INTBC= 1
##$INTSCL= 1
##$ISEN= 128
##$LB= 0.24
##$LEV0= 0
##$LPBIN= 0
##$MAXI= 10000
##$MC2= 0
##$MEAN= 0
##$ME_mod= 0
##$MI= 1.114404
##$NCOEF= 0
##$NC_proc= 0
##$NLEV= 6
##$NOISF1= 3.799351
##$NOISF2= 2.8
##$NSP= 1
##$NTH_PI= 0
##$NZP= 0
##$OFFSET= 15.70392
##$PC= 1
##$PHC0= -18056.46
##$PHC1= 9.40069
##$PH_mod= 1
##$PKNL= yes
##$PPARMOD= 0
##$PSCAL= 0
##$PSIGN= 0
##$REVERSE= no
##$SF= 200.130013532006
##$SI= 16384
##$SIGF1= 3
##$SIGF2= 2
##$SINO= 400
##$SIOLD= 16384
##$SREGLST= <1H.CDCl3>
##$SSB= 0
##$STSI= 0
##$STSR= 0
##$SW_p= 3612.71676300578
##$SYMM= 0
##$S_DEV= 0
##$TDeff= 0
##$TDoff= 0
##$TI= <>
##$TILT= no
##$TM1= 0
##$TM2= 0
##$TOPLEV= 0
##$USERP1= <user>
##$USERP2= <user>
##$USERP3= <user>
##$USERP4= <user>
##$USERP5= <user>
##$WDW= 1
##$XDIM= 8192
##$YMAX_p= 0
##$YMIN_p= 0
$$ End of Bruker specific parameters
$$ ---------------------------------
##NTUPLES= NMR FID
##VAR_NAME=  TIME,          FID/REAL,        FID/IMAG
##SYMBOL=    X,             R,               I
##VAR_TYPE=  INDEPENDENT,   DEPENDENT,       DEPENDENT
##VAR_FORM=  AFFN,          ASDF,            ASDF
##VAR_DIM=   8192,          8192,            8192
##UNITS=     SECONDS,       ARBITRARY UNITS, ARBITRARY UNITS
##FACTOR=    0.0002768,     1,               1
##FIRST=     0,             0,               0
##LAST=      2.2672688,     0,               0
##MIN=       0,             -346976,         0
##MAX=       2.2672688,     217151,          0
$$ Real data points
##PAGE= N=1
##DATA TABLE= (X++(R..R)), XYDATA
$$ [...]
1827C89j666O51J001J11j073l94N38J66p14K9O70N27j83o62q5J132M54p48m35
$$ 389 -1277 -626 375 486 -587 -981 -443 -277 -991 -962 -292 235 52 -610 -695 437 891 143 -292
1846b92Q05J79q89m22J288R81j243j031M79J186n11j277J060J257j638k109J130
$$ -292 513 692 -197 -619 669 1650 407 -624 -145 1041 530 -747 313 1570 -68 -2177 -1047
1863a047J990p17j838K68J781j112j196J051K027p02j407L95J051J10o62N50J014
$$ -1047 943 226 -1612 -1344 437 -675 -1871 -820 1207 505 -902 -507 544 654 -8 542 1556
1880A556n52j284LO21L70k56P6m59j87M45j69m02N07N94q67j611Q04J201k63j312
$$ 1556 1004 -280 -277 344 714 458 534 75 -112 333 164 -238 269 863 -4 -1615 -811 390 127 -1185
1900a185N32J128o66j692Q55K521m44j936K04K053j58k069M70K450m74k954Q13
$$ -1185 -653 475 -191 -1883 -1028 1493 1049 -887 -683 1370 1212 -857 -387 2063 1589 -1365 -552
1917e52K223m93k028M68J606p96j782M47J770M9j604l04J009j00q16M13O48j08
$$ -552 1671 1178 -850 -382 1224 428 -1354 -907 863 912 -692 -996 13 -87 -903 -490 158 50
1935E0r26P3K97O49R1M18k30m42M81K18n74N11N75Nj395o12J503K17j156k17J201
$$ 50 -876 -803 -506 143 234 652 422 -20 461 679 105 616 1191 1196 -199 -811 692 909 -247 -464 737
1956G37k70j509j91J837M05j710r35J534J32j426j08J777N57j600l53J018P43
$$ 737 467 -1042 -1233 604 1009 -701 -1636 -102 30 -1396 -1504 273 830 -770 -1123 -105 638
1973F38o44k03Q21M18j096l49J298K96k00n70k00l08K44K02j04j87L20p40n57
$$ 638 -6 -209 612 1030 -66 -415 883 1179 979 409 209 -99 145 347 243 56 376 -364 -921
1992i21J08P81J43p39j15M03K02n83l34J460O39j329m99Q01N97n53p6Q50K49j279
$$ -921 -813 -32 111 -628 -743 -340 -138 -721 -1055 405 1044 -285 -784 17 614 61 -15 835 1084 -195
2012a95k37Q55P87n57o44J11N05o62m62P52K41n97l16m00J77M47K11m17j26M82
$$ -195 -432 423 1210 653 9 120 625 -37 -499 253 494 -103 -419 -819 -642 -195 16 -401 -527 -45
2032d5l53n13N19J103o0j020l61J147K91p04j10J308Pj511k56J252M19r80m95
$$ -45 -398 -911 -392 711 651 -369 -730 417 708 4 -106 1202 1209 -302 -558 694 1113 133 -362
2051c62J056l1j181l76J154N46j368o53R37J23q13L23Q13m37j34m07K05N09O97
$$ -362 694 663 -518 -894 260 806 -562 -1215 -278 -155 -968 -645 168 -269 -403 -810 -605 -96 601
2070F01m29P0r3k22L05K80l02L70M85p74j206J163J150j204q39J009J92j275p49
$$ 601 172 242 149 -73 232 512 210 580 1065 291 -915 248 1398 194 -645 364 556 -719 -1468
2089a468J601P25j272j261Q29J538j196q98J406Q86j636p97J569J015q03p26J119
$$ -1468 133 858 -414 -1675 -846 692 -504 -1402 4 890 -746 -1543 26 1041 238 -488 631
2106F31M79j124m81J280O94r77o83M67o6k95K51NJ20m15q8k57k45M44M67l39p36
$$ 631 1110 -14 -495 785 1479 502 -181 286 220 -75 176 181 301 -114 -202 -459 -704 -260 207 -132 -868
2127h68J78N54L5p44N25J179q62j374J003J836j002p74R08O83j016q05M62J635
$$ -868 -690 -136 -101 -845 -320 859 -3 -1377 -374 1462 460 -314 594 1277 261 -544 -82 1553
2145A553n60j649J91J007M0j192M06Q94l38j425M40N37K04q57J40O94j30p90J95
$$ 1553 993 -656 -465 542 582 -610 -204 690 352 -1073 -633 -96 108 -749 -609 85 -45 -835 -640
2164f40P08J00J37n04j32K61P45m18k15M68L00p14m54M55Q40n06q05J38O57k61
$$ -640 68 168 305 -199 -331 -70 675 257 42 510 810 96 -358 97 937 431 -374 -236 421 160
2184A60q05L00R57n03j374M19J367n77j044P39P66o57r07N53J238k2p35o6L61
$$ 160 -645 -345 612 109 -1265 -846 521 -56 -1100 -361 405 -252 -1159 -606 632 610 -125 -191 170
2203A70J51k31nN16L43q21k15P2L49K70l08l81O4N48p44p24J029P23r83j086P97
$$ 170 321 90 85 601 944 123 -92 -20 329 599 291 -90 -26 522 -222 -946 83 806 -177 -1263 -466
2224d66P33o26p29J112N76q99n69P62O90j49q18N47P86m78q96O42J083n42j314
$$ -466 267 -359 -1088 24 600 -299 -868 -106 584 435 -383 164 950 472 -424 218 1301 759 -555
2243e55O02N11n04l22N06J94n60n52M81J28j50L78k73o25L01K60m18M74J61L60
$$ -555 47 558 54 -268 238 432 -128 -680 -199 -71 -221 157 -116 -741 -440 -180 -598 -124 37 397
2263C97k83n97J72J038K17j052k08J455n94r61O02J129m89j349p7J031k14p51
$$ 397 114 -483 -311 727 944 -108 -316 1139 545 -416 186 1315 826 -523 -600 431 217 -534
2281e34QQ72q4j420j1J577j69j011K30J098m88q38J54J339l70n95j20L64J7j84
$$ -534 -526 346 262 -1158 -1169 408 239 -772 -542 556 68 -770 -616 723 353 -242 -362 2 19 -165
2301a65O43K69p2n49K13k60k11Q22o2j015L8J41K7jj94L73K19q99r8R91K81p92
$$ -165 478 747 675 126 339 79 -132 690 628 -387 -349 -208 -181 -182 -376 -3 216 -683 -781 210 491 -301
2323c01n14J095J07r17JR72N67j246l26R73N87r86k04Q16K92j225k01N87N92o15
$$ -301 -815 280 387 -530 -529 443 1010 -236 -562 411 998 12 -192 624 916 -309 -510 77 669 54
2343E4j47j4L4l27l89N97J74O8o49k57L38J20M70M9l46O54pp55P0P63K00l61m93
$$ 54 -93 -107 -73 -400 -789 -192 -18 50 -599 -856 -518 -398 72 121 -225 429 422 -333 -263 500 700 339 -154
2366a54N82L4o74M8N66L00o19n40O30M60o46p93O26M35p14m57M80M28k46m09K78
$$ -154 428 462 -212 -164 402 702 83 -457 173 633 -13 -806 -180 255 -459 -916 -436 -8 -254 -663 -385
2387c85J46M4j96L29M41q7n06m8N33J62l4o3k24K54l6k55O1O83m6r56l19N68L48
$$ -385 -239 -195 -391 -62 379 292 -214 -262 271 433 399 336 112 366 330 75 136 819 773 -183 -502 66 414
2410D14r60QP49J18j153j30J163P1o68j09L30J60l73j50Q30M36o23l97O11J09
$$ 414 -546 -538 211 329 -824 -954 209 280 -388 -497 -167 -7 -380 -530 300 736 113 -284 327 436
2430D36k78K23J84M0n27or0J23j7J02l30k37J89J06q0j05J32K27m10m65N20M77
$$ 436 158 381 565 605 78 72 -18 105 88 190 -140 -377 -188 -82 -162 -267 -135 92 -318 -783 -263 214
2452B14m94l96N75O49q23j73O79R27j080n50J009L31o17n83R33K93o75p57P58
$$ 214 -280 -676 -101 548 -275 -448 231 1158 78 -472 537 868 251 -332 601 894 219 -538 220
2471B20M41l52q56N66M51r53m65R74K4m95l00M16k3l9K25K34l7K5j10J73m4L4
$$ 220 661 309 -547 19 470 -483 -948 26 50 -445 -745 -329 -352 -391 -166 68 31 56 -54 119 75 109
2493A09L81l81R8k86O07j11o24K89Q08n29q50M40Q32m25j202M57P06o23m63L80
$$ 109 490 109 207 -79 528 417 -207 82 890 361 -489 -49 783 358 -844 -387 319 -304 -767 -387
2513c87P88l52q64J03J019k46o06J55J003m54n33K28O12J61m51j58M07k03j70
$$ -387 401 49 -815 -712 307 61 -545 -390 613 159 -374 -146 466 627 176 18 425 222 52
2532E2j3L79L5r9l13k21J20M8r5m83K88J78l52k05L94M85J0q48L68O25m53j99
$$ 52 39 418 453 354 41 -180 -60 -12 -107 -590 -302 -124 -476 -681 -287 198 208 -640 -272 353 -100 -299
2554b99L56P08o00o33M50O92j74m91J99J44k60k05j19N57L3o88m7M16j75m79O06
$$ -299 57 765 165 -468 -18 674 500 9 208 352 92 -113 -232 325 358 -330 -377 39 -136 -615 -9
2575iP9j75L4n06L5M76K72j60k1K0J31l63J51K10M30k59m94J89M50l23k07L55
$$ -9 70 -105 -71 -577 -542 -66 206 46 25 45 176 -187 -36 174 604 345 -149 40 490 167 -40 315
2597C15Q9l01q12N76P23l72o03K03M01m89k73L83L61l79m43L74K36l19k7K45L07
$$ 315 404 103 -709 -133 590 218 -385 -182 219 -270 -543 -160 201 -178 -621 -247 -11 -330 -357 -112 195
2618A95lk94J86j67K47L07j98l19l4J80K61k74l3K7K93r39K98P43k39o49j8P01
$$ 195 192 -102 84 -83 164 471 273 -46 -80 100 361 87 54 81 374 -565 -267 476 237 -412 -430 271
2640B71l52o24L55P21n3r00K55N51K73j075M14O00l33n65L12O39J98n67j27M71
$$ 271 -81 -705 -350 371 318 -582 -327 224 497 -578 -164 436 103 -462 -150 489 687 120 -7 464
2660D64j26l39m2P12l22o77M8K65k80j57M38n8j15m0j00K0j14M03K73k98m60N70
$$ 464 338 -1 -43 669 347 -330 -282 -17 -297 -454 -16 -74 -189 -229 -329 -309 -423 -20 253 -45 -505 65
2682F5j7j90R4N00K15n54m06Q46J92o98k69N71J87o87l99P65K54r63q4K70L69
$$ 65 48 -142 -48 452 667 113 -293 553 745 47 -222 349 536 -151 -550 215 469 -494 -578 -308 61
2703F1l31k23M92J41m93l09P13Q3k13k94M09K3j54j21J61L36K80n82J75J86P8
$$ 61 -270 -493 -1 140 -353 -662 51 134 -79 -373 36 59 -95 -216 -55 281 561 -21 154 340 418
2724D18q0k63J40l28J31k98L6O30j13o30mL64J6j81l62M98O9o27K15L7N51k51
$$ 418 338 75 215 -113 18 -280 -244 386 273 -357 -361 3 19 -162 -524 -26 43 -584 -369 -332 219 -32
2746c2J16K2K53l52k12O17k7r5r2k76M32j47m36L92K90j32n35J77j17K2J81l54
$$ -32 84 106 359 7 -205 412 385 290 198 -78 354 207 -229 163 453 321 -214 -37 -154 -132 49 -305
2768c05K3L51k13l97J73M91l44k06J29M73P1m17K1L02M61q23j89O45L54o66J07
$$ -305 -282 69 -144 -541 -368 123 -221 -427 -298 175 246 -171 -150 152 613 -210 -399 246 600 -66 41
2789D1M97j08k03k23M54m9m52l55J03L32m30K08k0K04j69R3r6j36P6R2p1N2N1
$$ 41 538 430 227 4 458 409 -43 -398 -295 37 -393 -185 -205 -1 -170 -77 -173 -309 -233 -141 -212 -160 -109
2812a09L82N3k74K78J26m20q2M19N33n53m15K40K88n96l45O39L89q56k19K60R34
$$ -109 273 326 52 330 456 36 -46 373 906 353 -62 178 466 -130 -475 164 553 -303 -522 -262 672
2833F72p14n19O04K60o35l45O40J92l25n52P07J18k55R4M95m2j58j76K7K07j05
$$ 672 -42 -561 43 303 -332 -677 -37 155 -170 -722 -15 103 -152 -58 437 395 237 61 88 295 190
2854A90n8L90k64k71M6K34m39L79O8n06j25J50J9J17j25k77M80j2m03N2P18j48
$$ 190 132 522 258 -13 33 267 -172 207 275 -231 -356 -206 -187 -70 -195 -472 8 -4 -407 -355 363 215
2876B15n88K02P01m58m69N65L76j92m43j18O47j08o16J36O65l28n93K53L24k62
$$ 215 -373 -171 530 72 -397 168 544 352 -91 -209 438 330 -286 -150 515 187 -406 -153 171 -91
2896i1j23k40L24J66l04q8M07j59j02M2j01K59p5J36l13K65K51k23j34M55J08
$$ -91 -214 -454 -130 36 -268 -356 51 -108 -210 -168 -269 -10 -85 51 -262 3 254 31 -103 352 460
2917D60k51j24J14oJ5l17J54L46l67n80L57L79j97l02P3L09j44j14j21N71k03
$$ 460 209 85 199 193 208 -109 45 391 24 -556 -199 180 -17 -319 -246 63 -81 -195 -316 255 52
2938E2l32Q1J19Q8k15N2K33J89N1n13M06J78M7m17mj06J52O1r7k55O69n25m04
$$ 52 -280 -199 -80 8 -207 -155 78 267 318 -195 211 389 436 19 15 -91 61 122 25 -230 439 -86 -490
2961d90K89L64l91j52J18L59j56l64J87M69J7o98L85K51k11j11L02O6L29m68j40
$$ -490 -201 163 -228 -380 -262 97 -59 -423 -236 233 250 -448 -63 188 -23 -134 168 234 563 95 -45
2982d5L27j18j91%L80l41r7L12l31M5l8J04j70q6J22n1k48K64K13K58p61O6O37
$$ -45 282 164 -27 -27 353 12 -85 227 -104 -59 -97 7 -163 -249 -127 -178 -426 -162 51 309 -452 -386 251
3005B51j27m33K58L02j0m25K43L74J28n89l73Q00j72l60K38L58j32p73K27L60
$$ 251 124 -309 -51 251 241 -184 59 433 561 -28 -401 399 227 -133 105 463 331 -442 -215 145
3025A45j40l92l1N19j85k3k43M92j75k35o5N09j42j65L22j15J85m55L89k19K16
$$ 145 5 -387 -418 101 -84 -107 -350 142 -33 -268 -333 176 34 -131 191 76 261 -194 195 -24 192
3046A92j37M02j64m80L25Rj47l69N94l2l13%K05J00n65J47Q8K8n7k85P21J00n88
$$ 192 55 457 293 -187 138 147 0 -369 225 193 -120 -120 85 185 -380 -233 -145 -117 -174 -459 262 362 -226
3069b26k59N05L55n49R0L60j01j48k69K53L16L3m12K33j97M0lJ73k47l3j82J8
$$ -226 -485 20 375 -174 -84 276 175 27 -242 11 327 360 -52 181 -16 24 21 194 -53 -86 -268 -250
3091b50M9J21q6j88L47j30o5k0m8L68j26j74L8L38j47L8k80M59J07k26o9l4M62
$$ -250 -201 -80 -166 -354 -7 -137 -202 -222 -270 98 -28 -202 -164 174 27 65 -215 244 351 125 56 22 484
3114D84m27J2J13K61m69j1J85j32P6k82k30L51q1k28K12JJ13j18J46j77K05M8
$$ 484 57 69 182 443 -26 -37 148 16 92 -190 -420 -69 -150 -378 -166 -165 -52 -170 -24 -201 4 52
3136E2r7L01j27P4j75J55J60J66m02j76K16J71k79j4J97N6l64q9K49j80p2K14
$$ 52 -45 256 129 203 28 183 343 509 107 -69 147 318 39 25 222 278 -86 -175 74 -106 -178 36
3158C6j44j2k21j13O53j16l98k42N76J4j63M9L72m28J84m7K80k81M08m8m31J23
$$ 36 -108 -120 -341 -454 199 83 -315 -557 19 33 -130 -81 291 -137 47 0 280 -1 407 359 -72 51
3180E1n1K20kk87J77Jl33j43K26K56m46J2M1M10k62j60J45N97l08n51L93K74l08
$$ 51 0 220 218 -69 108 109 -224 -367 -141 115 -331 -319 -278 132 -130 -290 -145 452 144 -407 -14 260 -48
3203d8k27M38m7J26l20J44L47m9o51J44N52k94jJ2k57J65j01J21k72K49j89k17
$$ -48 -275 163 116 242 -78 66 413 364 -287 -143 409 115 114 126 -131 34 -67 54 -218 31 -158 -375
3225c75J22J98LQj68J7L55P9j63L0P4nj84K42L46l21k29j87L80N4p65N19J94M3
$$ -375 -253 -55 -52 -44 -212 -195 160 239 76 106 180 175 -9 233 579 258 29 -158 222 276 -489 30 224 267
3249B67o21L43K57j37l53J61J11Q3l12q2K61J1l33L15P5J76j64J01J36j00k4K6
$$ 267 -354 -11 246 109 -244 -83 28 111 -201 -283 -22 -11 -344 -29 46 222 58 159 295 195 171 197
3271A97l36R1L05j82K8J69k54N6k01j4K63k25l65M79k2j58k56K60Q3O0k31J58
$$ 197 -139 -48 257 75 103 272 18 74 -127 -141 122 -103 -468 11 -11 -169 -425 -165 -82 -22 -253 -95
3293i5K57J31n53m5O50O9j98l19K82K0j8j00J96j61J55k03L2Q4k06m7J41r2j32
$$ -95 162 293 -260 -305 345 414 216 -103 179 199 181 81 277 116 271 68 100 184 -22 -69 72 -20 -152
3316a52J69j69K59k37J64j73j13J84K22m60J71K38l40J5K02J86j21k64J42L72
$$ -152 17 -152 107 -130 34 -139 -252 -68 154 -306 -135 103 -237 -222 -20 166 45 -219 -77 295
3336B95j34l87M22J00l39m6k81N39l99j23J67L38j76k45J34k2n2j67K82Q0l3K4
$$ 295 161 -226 196 296 -43 -89 -370 169 -230 -353 -186 152 -24 -269 -135 -157 -209 -376 -94 -14 -47 -23
3358b3j2nK2M26l04k20K78M0m0k6R8J46k59o1j06K72J57n49o8M56r6k42O3M0j2
$$ -23 -35 -40 -18 408 104 -116 162 202 162 136 234 380 121 60 -46 226 383 -166 -234 222 126 -116 -53 -13 -25
3383b5l38K6L38j90k68J45N26j81j78o0J53J80l12L78k7jJ5j14mM3K0P7j36Jj2
$$ -25 -363 -337 1 -189 -457 -312 214 33 -145 -205 -52 128 -184 194 167 166 181 67 63 106 126 203 67 68 56
3408E6P4P2j09j66M3m0k12L00j19P4k02J00L77o16K98P4K92j88k91J02J10Oq9
$$ 56 130 202 93 -73 -30 -70 -282 18 -101 -27 -229 -129 248 -368 -70 4 296 108 -183 -81 29 35 -54
3431e4J96l5p5K7K6J34k0l44K53J3R0k76OL33k42k00K80J8l23J57p6N8O1j67L1
$$ -54 142 107 32 59 85 219 199 -145 108 121 211 -65 -59 274 32 -168 112 130 -193 -36 -112 -54 7 -160 -129
3456a29p4J56K43k25J41J1r2j2r3L57j09r9mM0l9r5l9J51j0l28K54P9r9j05j35
$$ -129 -203 -47 196 -29 112 123 31 19 -74 283 174 75 71 111 72 -23 -62 89 79 -249 5 84 -15 -120 -255
3481b55J74P6j84j93K64J76n7j12j9J66n1n6O5L72k97J7Q2L58l47j95Q8j07J68
$$ -255 -81 -5 -189 -382 -118 58 1 -111 -130 36 -15 -71 -6 366 69 86 168 526 179 -16 72 -35 133
3504A33K05l82J7J60j39k28L9J63J1j17J46j83Q2j38k62M35O5j92Q4K84J5j92
$$ 133 338 -44 -27 133 -6 -234 -195 -32 -21 -138 8 -175 -93 -231 -493 -58 7 -185 -101 183 198 6
3526FO9K4K64l06p0mK25q0j8J47o9j12q2K26l13J7j21p9J29J89q1k75J81J7j71
$$ 6 75 99 363 57 -13 -17 208 128 110 257 188 76 -6 220 -93 -76 -197 -276 -147 42 -39 -314 -133 -116 -287
3551b87M4J68j57M01l25m0K62K15l73O6K26o6J8l08J66J28q0j39J37K70n75N5
$$ -287 -243 -75 -232 169 -156 -196 66 281 -92 -26 200 134 152 -156 10 138 58 -81 56 326 -249 -194
3573a94K00o2jJ14k24J48m4m2q0L73k95M1J52j13N3J42k20K76o9k27K09j12j0
$$ -194 6 -56 -57 57 -167 -19 -63 -105 -185 188 -107 -66 86 -27 26 168 -52 224 155 -72 137 25 15
3596A5j40K80j28r7O3J11k35N2M2j3p5J60j19j35R9K6J00j43Q4N6J70j93j04L50
$$ 15 -125 155 27 -70 -7 104 -131 -79 -37 -50 -125 35 -84 -219 -120 -94 6 -137 -53 3 173 -20 -124 226
3620B26P0o9k70J02J57j05o9NL39k55k17P7n8L60m30J62r5O0l2j38J03O9m6r6
$$ 226 296 227 -43 59 216 111 42 47 386 131 -86 -9 -67 293 -137 25 -70 -10 -42 -180 -77 -8 -54 -150
3644a50K77m1j28L0K1r9J54q3q2N8L74l63J19N4J51K9k23Q1o5n0j07K7J37j55
$$ -150 127 86 -42 -12 9 -90 64 -19 -101 -43 331 -32 87 141 292 321 98 179 114 64 -43 -16 121 -34
3668c4K07m18Q1J30Q3k48M8M6L5k00M01j54k8m7l4K29L7k92N7K70m8k23l5j6J47
$$ -34 173 -245 -164 -34 49 -199 -151 -105 -70 -270 131 -23 -51 -98 -132 97 134 -158 -101 169 121 -102 -137 -153 -6
3693fR4j21j28K90j58k31K73j07q0L2O6o6O1R2j10J1J96k65K02K7l0r9J28P9k
$$ -6 88 -33 -161 129 -29 -260 13 -94 -174 -142 -76 -142 -81 11 -99 -88 108 -157 45 72 42 -57 71 150 148
3718A48j48L45j08k42J40r6R8r1R7j26K05k46R6j15j12J43r8K52m25j14M17j20
$$ 148 0 345 237 -5 135 39 137 46 143 17 222 -24 72 -43 -155 -12 -110 142 -283 -397 20 -100
3740a00O6j69j05K91n3k09K34J78j93J84J56l36Q4J47l9L3k77P8J86J68m36r3
$$ -100 -34 -203 -308 -17 -70 -279 -45 133 -60 124 280 -56 28 175 136 169 -108 -30 156 324 -112 -205
3762b05J96J90l42lJ19K43k27j68J43L4l53L05J11k06O4K3k9K01k17J68j51J64
$$ -205 -9 181 -161 -164 -45 198 -29 -197 -54 -20 -373 -68 43 -163 -99 -76 -105 96 -121 47 -104 60
3784F0r7j03M30m73J64K33p1k61K40o3k9n5J76n5r2j81K86j55m7j33K83r9k10
$$ 60 -37 -140 290 -183 -19 214 143 -118 122 59 30 -25 151 96 4 -177 109 -46 -93 -226 57 -42 -252
3807b52K84k05L52j55j82l2K38P1Rm4K7j1Qj82J74k48JJ49m5j00K22k40P4K58
$$ -252 32 -173 179 24 -158 -190 48 119 128 84 111 100 108 -74 100 -148 -147 2 -43 -143 79 -161 -87 171
3831A71r7j60m5J4J56k13k3K74j41J7Kr7M62m14j09J56Q0l4MJ77l5J66j19j43
$$ 171 74 -86 -131 -117 39 -174 -197 77 -64 -47 -45 -142 320 -94 -203 -47 33 -1 3 180 145 311 192 49
3855D9J07k5k36J24J5j31j03J33J49j13l7P8n1pM8K0J3J2n3r9j08K12J35N2k72
$$ 49 156 131 -105 19 34 -97 -200 -67 82 -31 -68 10 -41 -48 0 20 33 45 -8 -107 -215 -3 132 184 -88
3880h8n5K27J69k71N8M4R5k82J10J21o7l30J38L51n00J30kJ39j86l3J65K75l10
$$ -88 -143 84 253 -18 40 84 179 -103 7 128 61 -269 -131 220 -280 -150 -152 -13 -199 -232 -67 208 -102
3903a02j79K60L2j10J81N9j17k4K40j60j92L10k34p4j22K04J68Jj55J10P6j76
$$ -102 -281 -21 11 -99 82 141 24 0 240 80 -112 198 -36 -110 -232 -28 140 141 -14 96 172 -4
3925dj17O8J26j85j0j13K99k47L3J04M1n1n9J2P7L6k6O1R6l48L51q2J40o6r6J45
$$ -4 -121 -53 73 -112 -122 -235 64 -183 -150 -46 -5 -56 -115 -103 -26 10 -16 45 141 -207 144 62 202 136 40 185
3951A85j51m7J35J6k03J01J04l06J2K7K40j61K43j41j50L13m71J40J38j86j09
$$ 185 34 -13 122 138 -65 36 140 -166 -154 -127 113 -48 195 54 -96 217 -254 -114 24 -162 -271
3972b71J94J36k9p9R9J12m0n7J23o7Lk23K40J9q6j49R3J02M3l22o5K20R1l96N5
$$ -271 -77 59 30 -49 50 162 122 65 188 121 124 -99 141 160 74 -75 18 120 163 -159 -224 -4 87 -309 -254
3997b54K90k5Rj14R1k2m9J40rj12L0N2q0l2R2p8R5O0j64K59m1k14Q9N6l9j29m9
$$ -254 36 11 20 -94 -3 -25 -74 66 57 -55 -25 27 -53 -85 7 -71 24 84 -80 179 138 -76 13 69 30 -99 -148
4024a48J71j72J96Jj37p0o1J60j5j57J97N7j58K87j81K11j77O3j71J78J93k62
$$ -148 23 -149 47 48 -89 -159 -220 -60 -75 -232 -35 22 -136 151 -30 181 4 67 -104 74 267 5
4046EJ07l63L63r6J7J8J3J8mJ9j99K06j70P1J10p8k23K98l45K65J70k67j9M41
$$ 5 112 -251 112 16 33 51 64 82 78 97 -102 104 -66 5 115 37 -186 112 -233 32 202 -65 -84 357
4070C57k46j77R8j6J72j05k4p1J97l12J34O6K34k91j35J22L5j1j60J54p2O4k5
$$ 357 111 -66 32 16 188 83 59 -12 185 -127 7 73 307 16 -119 3 38 27 -133 21 -51 13 -12
4093a2O0j10Jr6K19lOj18r7Q5K6l2PJ06J35j86k1o7J97N2k7k48J11J80j56j06
$$ -12 48 -62 -61 -157 62 59 65 -53 -150 -65 -39 -71 -64 42 177 -9 -30 -97 100 152 125 -123 -12 168 12 -94
4119i4K07l6j08j05J09j7j41j05L34j71q8N3m2J73j57L97m3l4pk32J14Oj8j9o0
$$ -94 113 77 -31 -136 -27 -44 -185 -290 44 -127 -215 -162 -204 -31 -188 209 166 132 125 -107 7 13 -5 -24 -84
4144h4L43m30L67j89j14J12K34l31R5p1J1M7k66K97j17MO1K1J42k35J03M6j61
$$ -84 259 -171 196 7 -107 5 239 -92 3 -68 -57 -10 -276 21 -96 -92 -31 -10 132 -103 0 46 -115
4167a15R1j38J84K60l89J31J78k52No7j13L32l27K08L0o0J24j14K7r3K16k45J66
$$ -115 -24 -162 22 282 -107 24 202 -50 -45 -112 -225 107 -220 -12 18 -42 82 -32 -5 -98 118 -127 39
4190C9j07n3J19l59J87K29j69j79K22J78p1k57P7J69o3p3L13j11j35K56k32j27
$$ 39 -68 -121 -2 -361 -174 55 -114 -293 -71 107 36 -221 -144 25 -38 -111 202 91 -44 212 -20 -147
4212a47L22j0k83K37l33J72rNJ46N7j50K0m6K5j36M0K09j07j15L4J08j23K02q
$$ -147 175 165 -118 119 -214 -42 -51 -46 100 157 7 27 -19 6 -130 -90 119 12 -103 -69 39 -84 118 110
4236A10n1j17J62j5m5j83K10j42J66r7J11m3k83K71K8l16K10k04K39o5n3J41p4
$$ 110 59 -58 104 89 44 -139 71 -71 95 -2 109 66 -217 54 82 -234 -24 -228 11 -54 -107 34 -40
4259d0J04j89K22m9j57j04M4R9J2J6j50L45k04N4K48j40N1l61L41MJm3j35n6J17
$$ -40 64 -125 97 48 -109 -213 -169 -70 -58 -42 -192 153 -51 3 251 111 162 -199 142 146 147 104 -31 -87 30
4284C0j1J11j13j20j20J7O2K4L95k93N8p7J37J9or6j34O9N3n2K58l77K14NJ67
$$ 30 19 130 17 -103 -223 -206 -144 -120 275 -18 40 -37 100 119 113 17 -117 -48 5 -47 211 -166 48 53 220
4309B20j29l92K02J37j14J81K4k31J90k83N2J64R3j92j6J85o6j18r1lK56M7O4
$$ 220 91 -301 -99 38 -76 105 129 -102 88 -195 -143 21 114 -78 -94 91 25 -93 -184 -187 69 116 180
4332A80j77J47l36L12L5J6r3J5q8j64L35k66l0K53o2j93L04l52J80Q5o2l6q6Q1
$$ 180 3 150 -186 126 161 177 84 99 11 -153 182 -84 -114 139 77 -116 188 -164 16 101 39 3 -83 -2
4356bO3k31J98O2j80o9J28K9p4J1P9J7J04l00J78K58q3l09J11K04j03n7k6j30
$$ -2 61 -170 28 90 -90 -159 -31 -2 -76 -65 14 31 135 -165 13 271 188 -121 -10 194 91 34 8 -122
4380a22j4K71k14K6J93k15m0N5j86K05LP9k5j3J7%j79J60j71K00j07P2j90K59
$$ -122 -136 135 -79 -53 140 -75 -115 -60 -246 -41 -38 41 16 3 20 20 -159 1 -170 30 -77 -5 -195 64
4404F4k09J95n9L4m7n8Q4J27j47j86J95J6j03j25J45J17Q6l54K72j71J68QK1j81
$$ 64 -145 50 -9 25 -22 -80 4 131 -16 -202 -7 9 -94 -219 -74 43 129 -225 47 -124 44 52 73 -108
4428a08J82J12j05l3K9q1J27j09j29J58N4l2j05M8O3Q1m71L3L18J85m80q4K65
$$ -108 74 186 81 48 77 -4 123 14 -115 43 97 65 -40 8 71 152 -319 -286 32 217 -263 -347 -82
4451h2j55J86J79J94n69L24j3j40K1J10P8j74R5m3J8P9j39r2J51j04j87K07R6
$$ -82 -237 -51 128 322 -247 77 64 -76 -55 55 133 -41 54 11 29 108 -31 -123 28 -76 -263 -56 40
4474D0l3J30k01LK45k51L42n1n15J87nJ13kk50L90p1j02L5J74j67mj93L64j04
$$ 40 7 137 -64 -61 184 -67 275 224 -291 -104 -109 4 2 -248 142 71 -31 4 178 11 7 -186 178 74
4498G4m4j12M8J25l3j4J33l30J71L5j20R7M6l4j68J39O1L4k91Q3j06K95j00k18
$$ 74 30 -82 -34 91 58 44 177 -153 18 53 -67 30 76 42 -126 13 74 108 -183 -100 -206 89 -11 -229
4522b29J98r1L3J4l4J12p0j3M6l0p5K20o3j6J12m3k07nM5Q8J91j40n6M6j02J18
$$ -229 -31 -122 -89 -75 -109 3 -67 -80 -34 -64 -139 81 18 2 114 71 -136 -141 -96 -8 183 43 -13 33 -69 49
4548D9k2j3L7O0J3j94J54j07N0m9j46K24N6mj32K1Q8rk81K1J61J80j00j8K07k53
$$ 49 27 14 51 111 124 -70 84 -23 27 -22 -168 56 112 108 -24 -3 85 76 -205 -184 -23 157 57 39 246 -7
4574gl15J30J10L14k03j30m9r0J80P5j08L32j13j71R8j82K88k09kM3J43j26P2
$$ -7 -322 -192 -82 232 29 -101 -150 -240 -60 15 -93 239 126 -45 53 -129 159 -50 -52 -9 134 8 80
4597H0k77M94l50K16KM6l91Q2L9l2J56j05J28K7j08q6O6J59j71j23O1J95j32M8
$$ 80 -197 297 -53 163 165 211 -180 -98 -59 -91 65 -40 88 115 7 -79 -13 146 -25 -148 -87 108 -24 24
4621B4P2N7j11P4m0q2K69k90M4J38j36m4l4J46k0m04L07J08l8j23J02O4Q4j77
$$ 24 96 153 42 116 76 -6 263 -27 17 155 19 -25 -59 87 67 -337 -30 78 40 -83 19 83 167 -10
4645a0j37J99j64j81K82K56j34Q0j29M1k06J67J6l4j64K90l7k23j30K67j49N4
$$ -10 -147 52 -112 -293 -11 245 111 191 62 103 -103 64 80 46 -118 172 135 -88 -218 49 -100 -46
4667d6O8j23J86j89R8r6n9J48k40R1K17l01N9K44j22J0J16j74L00j04p7N5K1j64
$$ -46 22 -101 85 -104 -6 -102 -161 -13 -253 -162 55 -246 -187 57 -65 -55 61 -113 187 83 6 61 82 -82
4691h2K87k34K71l03K33M9k86j29M71k55j00K15l53L42j97J55k17j7n8n8L01p4
$$ -82 205 -29 242 -61 172 221 -65 -194 277 22 -78 137 -216 126 -71 84 -133 -150 -208 -266 35 -39
4713c9O5P2R0o4j9j05K18j35K9j44r1O7J78m01L51J53j07k4n3n5n5j05R4JQ6Q2
$$ -39 26 98 188 124 105 0 218 83 112 -32 -123 -56 122 -279 72 225 118 94 41 -14 -69 -174 -80 -79 7 89
4739H9M7l62K95j30J82o6l37J72J3L58k56K8j1J16k52J81k13K79j12K1n1p7J20
$$ 89 136 -226 69 -61 121 55 -282 -110 -97 261 5 33 22 138 -114 67 -146 133 21 42 -9 -86 34
4762C4J2o3P5j59l0J20L7qn9J06j5j52L6R0j32J55mo8L8J7k9j62L12j70p5n7j
$$ 34 46 -17 58 -101 -131 -11 26 18 -41 65 50 -102 -66 24 -108 47 43 -25 13 30 1 -161 151 -19 -94 -151 -152
4789a52K09k71K0J42OL26k02j69N7j14K40q0mJ05l5o7j2j16J22n1J81L1k26P3
$$ -152 57 -214 -194 -52 -46 280 78 -91 -34 -148 92 12 8 113 78 11 -1 -117 5 -46 135 166 -60 13
4813A3j38K83l60O0J20O9R9j88J25Q8k46K74j40o1K8J04o2k6J4m1K5j95N1J75
$$ 13 -125 158 -202 -142 -22 47 146 -42 83 171 -75 199 59 -2 26 130 68 42 56 15 40 -155 -104 71
4837G1L5J16J4m82K48k9k13J89O1j02J38p3j17J36Q6Mk4K8j53j12J24RJ47j02
$$ 71 106 222 236 -246 2 -27 -240 -51 10 -92 46 -27 -144 -8 78 82 58 86 -67 -179 -55 -46 101 -1
4861ak29K25j98K05M9M1%J24m57K11o2k76K67J50J9L6j05j7k88Q0J33l0L03k40
$$ -1 -230 -5 -203 2 51 92 92 216 -241 -30 -92 -368 -101 49 68 104 -1 -18 -306 -226 -93 -123 180 -60
4885f0Rj19M91k65p7j75K47M1o6M0l90L09m1q5K57k81J65j63L34j50j42P9J80
$$ -60 -51 -170 321 56 -21 -196 51 92 26 66 -324 -15 -56 -141 116 -165 0 -163 171 21 -121 -42 138
4908A38n5k87K32K2K2p9J78j32j03k6L5J84k1j16R3r4m9L70r0l67J79j44K76j70
$$ 138 83 -204 28 50 72 -7 171 39 -64 -90 -55 129 108 -8 85 -9 -58 312 222 -145 34 -110 166 -4
4932dJ49l46j44K14J45j0J10q3J72l24J60l5m0OM6r8K75q9J5J3l42K45L9j52K0
$$ -4 145 -201 -345 -131 14 4 114 31 203 -121 39 4 -36 -30 16 -82 193 104 119 132 -210 35 74 -78 -58
4957e8Q1j27K22j00LN4q6j99m8M54l7k17K8J87j94n8J40r0LP7l15K59O1l3K37
$$ -58 23 -104 118 18 21 75 -11 -210 -258 196 159 -58 -30 157 -37 -95 45 -45 -42 35 -280 -21 40 7 244
4982B44k24r4J18j50K72k00N0J9LR8j72J09M2k09k8Q3J76P7k55o6J22j4k4K0r3
$$ 244 20 -74 44 -106 166 -34 16 35 38 136 -36 73 115 -94 -122 -39 137 214 -41 -107 15 1 -23 -3 -96
5007i6J14o2J56M5p3k02kJ77j55K62k00J85k04oK31r3lk15mK45j57J12n0L49m31
$$ -96 18 -44 112 157 84 -118 -120 57 -98 164 -36 149 -55 -61 170 77 74 -141 -145 100 -57 55 5 354 -77
5032g7N9J57J41l09q6M2NJ37Qk75J70Lj0K06l0j19k16K85k61JJ18J34k8l0j62
$$ -77 -18 139 280 -29 -115 -73 -68 69 77 -198 -28 -25 -35 171 141 22 -194 91 -170 -169 -51 83 55 25 -137
5057a37J19j70J07K7J21j82J65L6j9o8N5Q9l50K59k61P3K21r7K2Q5J8j61M1L11
$$ -137 -18 -188 -81 -54 67 -115 50 86 67 -1 54 143 -207 52 -209 -136 85 -12 10 95 113 -48 -7 304
5081C04k69j01R2j4J5R2m6k25L25k10J72j76k8J19j46K85l90J28J38k3oo2K7J10
$$ 304 35 -66 26 12 27 119 73 -152 173 -37 135 -41 -69 50 -96 189 -201 -73 65 42 36 -26 1 111
5105A11Jj56K2j28J47n0O1k65K16p8Q2OJ59j38l9M8j16J13k42K67j76J82q5mn8
$$ 111 112 -44 -22 -150 -3 -53 8 -257 -41 -119 -37 -31 128 -10 -49 -1 -117 -4 -246 21 -155 27 -58 -62 -120
5130a20Q9R0L8j04l8j21L34j51K6j07J08j21K48k04j56L66m01M76q2k22J43l4
$$ -120 -31 59 97 -7 -45 -166 168 17 43 -64 44 -77 171 -33 -189 177 -224 252 170 -52 91 57
5152E7J22l23N3J16n1K1j91K02m9q9N3J49M1k23J40q6rJ48j56R3R5O7l14J04m1
$$ 57 179 -144 -91 25 -26 -5 -196 6 -43 -132 -79 70 111 -112 28 -58 -67 81 -75 18 113 180 -134 -30 -71
5177g1L09k63J57m4k7M0O6j38J52k16K13j89K0L2J6j2p6L9jj35M6j6O9l3QQ2k72
$$ -71 238 -25 132 88 61 101 167 29 181 -35 178 -11 9 41 57 45 -31 8 7 -128 -82 -98 -29 -62 -54 28 -244
5204b44L36k01J58J45k86O1J17j43rj22K28M4J5j81J93lo4o2n9rJ85j85o4j48
$$ -244 92 -109 49 194 -92 -31 86 -57 -66 -188 40 84 99 -82 111 108 44 -18 -77 -86 99 -86 -150 -298
5228b98M60n7j33L1o9j3n1N2j64J52P6m3K5m4r2Q0K5p9J71j09J25N8k5j09J34
$$ -298 162 105 -28 3 -66 -79 -130 -78 -242 -90 -14 -57 -32 -76 -168 -88 -63 -142 29 -80 45 103 78 -31 103
5253A03J0M1j89o5K32k18J04j6k25N43j82k53J06K0Mj22J92M1k19rJ05R9j17J14
$$ 103 113 154 -35 -100 132 -86 18 2 -223 320 138 -115 -9 11 15 -107 85 126 -93 -102 3 102 -15 99
5277I9K7j42k1r6K23M0j64P7P7k08J48r5N5R8j49JJ44k34l1J27M7K2p8o6NK25
$$ 99 126 -16 -37 -133 90 130 -34 43 120 -88 60 -35 20 118 -31 -30 114 -120 -151 -24 23 45 -33 -99 -94 131
5303A31k08J38P1j3o1o2j84J41j23K54j85K6k14J77p4K09l1j78J42n0J5m2J16
$$ 131 -77 61 132 119 58 -4 -188 -47 -170 84 -101 -75 -289 -112 -186 23 -8 -186 -44 -94 -79 -121 -5
5326ek37L45l69K53J11j5o2j36M1J42o7L0P7j88k3J12K49n10K60j8j07L6Q2R1
$$ -5 -242 103 -266 -13 98 83 21 -115 -74 68 1 31 108 -80 -103 9 258 -252 8 -10 -117 -81 1 92
5350I2Jj00r9K9J31j08R0o9j86K93j53P1O6m1R9m6J06o5k93Q0J34M7pk28K23J6
$$ 92 93 -7 -106 -77 54 -54 36 -33 -219 74 -79 -8 58 17 116 70 176 111 -182 -102 32 79 72 -156 67 83
5376H3j28J5QK0R6l05J51j46K02j82J5K53Q9k6o1k27L05j89J51n4k34J54Mk1l8
$$ 83 -45 -30 -22 -2 94 -211 -60 -206 -4 -186 -171 82 171 145 84 -143 162 -27 124 70 -164 -10 -6 -27 -65
5401f5J4j4K62M7k21j57q3L62k00L4J71k61J27p5l2K50q3l49K18J67j88J34j75
$$ -65 -51 -65 197 244 23 -134 -217 145 -55 -21 150 -111 16 -59 -91 159 76 -273 -55 112 -76 58 -117
5424a17kJ28o3J16K5L0j71J47j9m1j31J27Q8k3q0J5m7k52M09k65J09R2j01J13
$$ -117 -119 9 -54 62 87 117 -54 93 74 33 -98 29 117 94 14 29 -18 -270 139 -126 -17 75 -26 87
5448H7J3J07j84n9J44j99p4o0J31L82l71O9J63p6k04J73Kk65O6J35q9Pn7K57j07
$$ 87 100 207 23 -36 108 -91 -165 -225 -94 288 -83 -14 149 73 -131 42 44 -221 -155 -20 -109 -102 -159 98 -9
5473ik73M02q7K9j53K22k05J63k2p8J69n2l41K23p6M9K45l39J73N1q2P0m8l8l8
$$ -9 -282 120 33 62 -91 131 -74 89 67 -11 158 106 -235 -12 -88 -39 206 -133 40 91 9 79 31 -7 -45
5498d5k2R7m1R9j15o3J69k52K7K55Kj17L2O3r2K08m00J16Q5LJ8k57J19K97k19
$$ -45 -67 30 -11 88 -27 -90 79 -173 -146 109 111 -6 26 89 -3 205 -195 -79 6 9 27 -230 -111 186 -33
5523c3M2n7J92j49O6k35j30N60k93j4j16P5J42O3j00m8L5j02k9l7N5L7J20M3Q6
$$ -33 9 -48 144 -5 61 -174 -304 256 -37 -51 -167 -92 50 113 13 -35 0 -102 -131 -168 -113 -76 44 87 173
5548A73l6R1j31l9j23j19J54R9r1J62j40M0nj43J31qJ9pJ0J38k76L24J10l41Q2
$$ 173 137 228 97 58 -65 -184 -30 69 -22 140 0 40 35 -108 23 15 34 27 37 175 -101 223 333 -8 74
5573G4K3p6J6j4K5j5L32o11J36L72k82J1j23j08J17J91N7j38j51QK26p8j5K00
$$ 74 97 21 37 23 48 33 365 -246 -110 262 -20 -9 -132 -240 -123 68 125 -13 -164 -156 70 -8 -23 177
5597A77l33K67j19K04o9j06j8J28j00j66J69j83K1J22m8J06o0o5o5NJ2k7J91q3
$$ 177 -156 111 -8 196 127 21 3 131 31 -135 34 -149 -128 -6 -54 52 -8 -73 -138 -133 -121 -148 43 -40
5621d0J35j53PJ0j18J89O5l04K46K9j43J86m5j42Q0p4K70j94j2J34rk62M32j81
$$ -40 95 -58 -51 -41 -159 30 95 -209 37 66 -77 109 64 -78 2 -72 198 4 -8 126 117 -145 287 106
5645A06r0K75n14K16n9N9k9L8j07J91o8j00R1K15j85j48R9O1N6m6k02k9K49j40
$$ 106 16 291 -223 -7 -66 -7 -36 2 -105 86 18 -82 9 224 39 -109 -10 51 107 61 -141 -170 79 -61
5669f1J26k1j08Q8L9o9j38k2K01k50J3J21j78K33J0l58L27J45o9q2j0J72j79J
$$ -61 65 44 -64 24 63 -6 -144 -166 35 -215 -202 -81 -259 -26 -16 -374 -47 98 29 -53 -63 109 -70 -69
5693f9n4j0Q3J05J33k12k01L33k06J33K2k5L8n9KK82l68j98L28j5P5j26j42K69
$$ -69 -123 -133 -50 55 188 -24 -225 108 -98 35 57 32 70 11 13 295 -73 -271 57 42 117 -9 -151 118
5717A18l3j88N1j32LJ00l5L2L3nR4J38k55K17q2k68j3R4%J38p8kO5k57N7J68P7
$$ 118 85 -103 -52 -184 -181 -81 -116 -84 -51 -56 38 176 -79 138 56 -212 -225 -131 -131 7 -71 -73 -8 -265 -208 -40 37
5744C7K0LJ18r7j22N8j60J52J56J6j80jo9j1K28q5pj4J0k4J31PKj32j70O5J20
$$ 37 57 60 178 81 -41 17 -143 9 165 181 1 0 -69 -80 148 63 56 42 52 28 159 166 168 36 -134 -69 51
5771E1j47q8M00l82J05N7pP7o2q8K7J02lj20J47k0j69J73j46K47j63j11J34K17
$$ 51 -96 -184 216 -166 -61 -4 -11 66 4 -84 -57 45 42 -78 69 49 -120 53 -93 154 -9 -120 14 231
5795B31k73N8j21K77j25k5Q7j35OJ10j40J09l65L53K76k83n2K8PP1l42J58P7j04
$$ 231 -42 16 -105 172 47 22 109 -26 -20 90 -50 59 -306 47 323 40 -12 16 23 94 -248 -90 -13 -117
5819a17K96j25m43L03M5K1K8j37J42n4r8k6k9J73k5j4J86k55K1J57j47j8o0M68
$$ -117 179 54 -389 -86 -41 -20 8 -129 13 -41 -139 -165 -194 -21 -46 -60 126 -129 -108 49 -98 -116 -176 292
5843B92k52k65J03j78L16P5p5K85m13L45j37k29O1J08M6ro0r0M5J56J3j85Q6J17
$$ 292 40 -225 -122 -300 16 91 16 301 -112 233 96 -133 -72 36 82 73 13 -77 -32 124 137 -48 38 155
5867A55k52Q9O1p7k06J30K41J21l37p4K85l4o9J23J59k57k30L57k13O4k01L72
$$ 155 -97 -8 53 -24 -230 -100 141 262 -75 -149 136 102 33 156 315 58 -172 185 -28 36 -165 207
5889B07r3j64m7J38P5mq0j27J15J26j80O3K6o2J53l82K50j13j5j60K73J24j23
$$ 207 114 -50 -97 41 116 112 32 -95 20 146 -34 29 55 -7 146 -236 14 -99 -114 -274 -1 123 0
5912@k04J13Q3M1j52K6J40QJ09j46J30j05j37J89r5KJ37j46K7j93K14M8Nj38k0
$$ 0 -204 -91 -8 33 -119 -93 47 55 164 18 148 43 -94 95 0 2 139 -7 20 -173 41 89 94 -44 -64
5937f4K7k66M45k50L0R9j62K49j42j20N9K71j09J27l19L9N2L09k71K50j85lk03
$$ -64 -37 -303 142 -108 -78 21 -141 108 -34 -154 -95 176 67 194 -125 -86 -34 275 4 254 69 66 -137
5960a37K35q6j61K34p7L0r5j8J47J24r9O0j50p9J11n3J80k24P2J31j53K52k72
$$ -137 98 12 -149 85 8 38 -57 -75 72 196 97 157 7 -72 39 -14 166 -58 14 145 -8 244 -28
5983b8o5K06j06N0m07L91m4Q8l9j77J79L3l4L7p9j11J97rJ15k37Q8j8N3r7K6k5
$$ -28 -93 113 7 57 -350 41 -3 85 46 -131 48 81 47 84 5 -106 91 82 197 -40 48 30 83 -14 12 -13
6009a3J30k10K75L2j04m7q1o3Q0L4n7K1Q2q6j22J67N6J1k01P3l6n5K13j84N3Q6
$$ -13 117 -93 182 214 110 63 -18 -81 -1 33 -24 -3 79 -7 -129 38 94 105 -96 -23 -59 -114 99 -85 -32 54
6035E4o3k39N1o0P7o3K14K33l43K33j16q1l2J94j60K20Kk45K31k0R9j70q4p4k
$$ 54 -9 -248 -197 -257 -180 -243 -29 204 -139 94 -22 -103 -135 59 -101 119 121 -124 107 87 186 16 -68 -142 -144
6060a44P4L42k51N0j49J22P4j83P9j22l1J26k17L06M2Q9r5l37L01m2p2l4J63j27
$$ -144 -70 272 21 71 -78 44 118 -65 14 -108 -139 -13 -230 76 118 207 112 -225 76 34 -38 -72 91 -36
6084c6R2J11o2l8j27J04K8j46K11j93O7K33k16k32J21k31P9J86r5K15j26j5K3
$$ -36 56 167 105 67 -60 44 72 -74 137 -56 11 244 28 -204 -83 -314 -235 -49 -144 71 -55 -70 -47
6107d7J76j63K56k66o8K21j60q6K70J9Kk00K30k29j77K90n8m2l39L83N2n1oj46
$$ -47 129 -34 222 -44 -112 109 -51 -137 133 152 154 -46 184 -45 -222 68 10 -32 -371 12 64 13 7 -139
6131a39K23r3j53K38j56K29l77J78J15J8l91K10lp8J71J26k67O8J75op9J07j81
$$ -139 84 -9 -162 76 -80 149 -228 -50 65 83 -308 -98 -101 -179 -8 118 -149 -81 94 88 9 116 -65
6154f5M4p9J90j48N3Q8k02O9L5J31r1k63L64l2m19J19J22N9j22K39p3k0RqJ29
$$ -65 -21 -100 90 -58 -5 83 -119 -50 -15 116 25 -238 126 94 -325 -206 -84 -25 -147 92 19 -1 8 0 129
6179A29O2k25l6K41n6r2o0q6L43o0Q9m18J73J1M2q4n2J45j60J1K33j33R6l9k67
$$ 129 191 -34 -70 171 115 23 -37 -123 220 160 249 -169 4 15 57 -27 -79 66 -94 -83 150 17 113 74 -193
6204a93K95j04j04kl9L0J16j25J34J2R0j95l9M19j14j50%J28j20K7p0J13r7O4
$$ -193 102 -2 -106 -108 -147 -117 -1 -126 8 20 110 -85 -124 295 181 31 31 159 39 66 -4 109 12 76
6228G6k17N03l47PL0j29r1K23K4k07K02K8j90R6K07j99k1R7M7k38K62p2nj75J13
$$ 76 -141 362 15 22 52 -77 -168 55 79 -128 74 102 -88 8 215 16 -5 92 139 -99 163 91 86 -89 24
6253B4Q9r9j0J6J50j23j65k6k7K74p4rO0J54q3j59q2M4j53L42L4l45K07k04J08
$$ 24 113 14 4 20 170 47 -118 -144 -171 103 29 20 80 234 151 -8 -90 -46 -199 143 177 -168 39 -165 -57
6278e7n0K40j81L8Q1k8p5R8j7j26L29j26o3n7K0K6j04R7n4k04K43m2K2o6m3L04
$$ -57 -107 133 -48 -10 71 43 -32 66 49 -77 252 126 63 6 26 52 -52 45 -9 -213 30 -12 10 -56 -99 205
6304B05n7pk51J05J48j52J17j06Q0k02J81l3l0J62oj44J89k46j51J36j42ML44
$$ 205 148 141 -110 -5 143 -9 108 2 82 -120 61 28 -2 160 154 10 199 -47 -198 -62 -204 -200 144
6327A44l2r6q1j12J4J02q1L59j60K5k90Q6O8j48K40j10J36k8k42k5K49R0j42m
$$ 144 112 16 -65 -177 -163 -61 -142 217 57 82 -208 -122 -54 -202 38 -72 64 36 -206 -231 18 108 -34 -38
6351c8K14L9k35K60q8k86N8J86m9R8j74J69k28J82j69J51r8j78M67m53J12m1K05
$$ -38 176 215 -20 240 152 -134 -76 110 61 159 -15 154 -74 108 -61 90 -8 -186 281 -172 -60 -101 104
6374A04R2k35n0K49o2k70O3lP0K08k56j46R1L23j65j52J74j16J00K4n5j10J48
$$ 104 196 -39 -89 160 98 -172 -109 -112 -42 166 -90 -236 -145 178 13 -139 35 -81 19 43 -12 -122 26
6397B6P9r2R8m8k76J14N8n2R3J79j41k27K04J32l03J55k34L84m1r4K7j85O9Q1
$$ 26 105 13 111 63 -213 -99 -41 -93 0 179 38 -189 15 147 -156 -1 -235 149 108 14 41 -144 -75 6
6421Fj25J46K79l21J9r1JJ07j08jJ00k8J31l58L8Q7K52M5k82j25J31N6J4O7j56
$$ 6 -119 27 306 -15 4 -87 -86 21 -87 -88 12 -16 115 -243 -205 -118 134 179 -103 -228 -97 -41 -27 40 -116
6446a16%K51j87j21J10K7K73j94Q3n5qn3k15kj4J13K95k73J21k71J73J43j28j16
$$ -116 -116 135 -52 -173 -63 -36 237 43 126 71 63 10 -205 -207 -221 -108 187 -86 35 -236 -63 80 -48 -164
6470a64l8L41l9r5J1K6j45K89q0k47L35k21kJ66l00J36j81KN05l29j76J29j87
$$ -164 -202 139 100 5 16 42 -103 186 106 -141 194 -27 -29 137 -163 -27 -208 -206 299 -30 -206 -77 -264
6493b64L47k05K13k39M8r2K52K09m06K61j54no3J88j98J5r0oJ90%o1p3J76K4l1
$$ -264 83 -122 91 -148 -100 -192 60 269 -137 124 -30 -35 -98 90 -108 -93 -183 -189 1 1 -60 -133 43 67 36
6518C6j65P2J54k78N7N5L14l20L8k5j8QN4J0J22j66J90K3j49q1J89Q5j88j13R
$$ 36 -129 -57 97 -181 -124 -69 245 -75 -37 -62 -80 -72 -18 -8 114 -52 138 161 12 -69 120 205 17 -96 -87
6543h7K73p8j54k3J3J36k05k3N2J77J3p7j00J58j20r0k95L83J64j15or6J81j11
$$ -87 186 108 -46 -69 -56 80 -125 -148 -96 81 94 17 -83 75 -45 -135 -430 -47 117 2 -4 -100 81 -30
6567c0r9K10j71J33O1j67J4J68r1K6j20J1M6j8O7j94K98m6k51L60N4k82N1k31
$$ -30 -129 81 -90 43 104 -63 -49 119 28 54 -66 -55 -9 -27 40 -154 144 98 -153 207 261 -21 30 -201
6591b01L42k15J51o2Q5k92K38L2j32j29L48N2pr8l76L15q1J85l17J91j06p5M4
$$ -201 141 -74 77 15 100 -192 46 78 -54 -183 165 217 210 112 -264 51 -30 155 -162 29 -77 -152 -108
6614a08L8J88r9Q2j81L09k46J86l25L51k38Q4j5Oj40K19q5l2L8n5K4j06K03j33
$$ -108 -70 118 19 101 -80 229 -17 169 -156 195 -43 41 26 32 -108 111 26 -6 32 -23 1 -105 98 -35
6638c5p4L3L7m0Q1o0J78M0P4j54q8p4k6J53l01L13l0R9o8j54J88q1Kj61K46j50
$$ -35 -109 -76 -39 -79 2 -58 120 160 234 80 -8 -82 -108 45 -256 57 27 126 58 -96 92 11 13 -148 98 -52
6664e2J47J25l11k4J48m8j92K92qk92K05Q8k93J99k5K22k37R8j19R7k8pK45l11
$$ -52 95 220 -91 -115 33 -15 -207 85 77 -215 -10 78 -215 -16 -41 181 -56 42 -77 20 -8 -15 230 -81
6688h1J5J6O6j26J48k3k31R9J80k08K34K06m87L27k11J90o7l5J29o6J4n0j2l13
$$ -81 -66 -50 16 -110 38 15 -216 -117 63 -145 89 295 -192 135 -76 114 47 12 141 75 89 39 27 -286
6712b86K03j05K41k29K11k17J85m5N2R8j83K03o2J08j02k4K3J13j41l2J06j77
$$ -286 -83 -188 53 -176 35 -182 3 -42 10 108 -75 128 66 174 72 48 71 184 43 11 117 -60
6734f0k7nK12j86k5J50J47j47J20m36K03K8P9j52L0o9p0L22k42P5K0j18l9J95
$$ -60 -87 -92 120 -66 -91 59 206 59 179 -257 -54 -26 53 -99 -69 -138 -208 114 -128 -53 -33 -151 -190 5
6758Eq1o1J39jq1J28M3J16j77JrL9N9j81o3Q5Q5P4j03p5R7Q2N8j92k5M9R1j73
$$ 5 -76 -137 2 1 -80 48 91 207 30 31 22 61 120 -61 -124 -39 46 120 17 -58 39 121 179 -13 -38 11 102 -71
6786g1K25k59J49J62k26J60k84N3J79P4j35Kq9R2k5o5l1R8q3q0n8J87J76m3k26
$$ -71 154 -105 44 206 -20 140 -144 -91 88 162 27 29 -60 32 7 -58 -89 9 -74 -154 -212 -25 151 108 -118
6811a18M0l5K5J14j3j1j05J98K9o4j2n9P6J66j46O0k3l3j46R6P4P5k40J73k1l3
$$ -118 -78 -113 -88 26 13 2 -103 95 124 60 48 -11 65 231 85 145 122 89 -57 39 113 188 -52 121 100 67
6837F7j5j53O7L1M1r0J04J3j50N5n1J34j29N3r6j69L90k91K36k26P2M1J3PJ74
$$ 67 52 -101 -34 -3 38 -52 52 65 -85 -30 -81 53 -76 -23 -119 -288 102 -189 47 -179 -107 -66 -53 -46 128
6862A28j14J01P3j19j66n3J98n5J26j95k7J49J28m67L15J03j53N2n6J26J1j60
$$ 128 14 115 188 69 -97 -150 48 -7 119 -76 -103 46 174 -293 22 125 -28 24 -32 94 105 -55
6884e5J88k03Q5K58k74P4q5J37O9k67P1Rj97L25k66J60j06K08j41KJ02q8L6p7
$$ -55 133 -70 15 273 -1 73 -12 125 194 -73 -2 7 -190 135 -131 29 -77 131 -10 -8 94 6 42 -35
6908c5j01M9J21r9J1J22j23J0j93J93K03j14j52N1J75l63M24l75O4L45j03j12
$$ -35 -136 -87 34 -65 -54 68 -55 -45 -238 -45 158 44 -108 -57 118 -245 179 -196 -132 213 110 -2
6930bJ43j90K96l06k5JM15k59k43J69k02M18k37j14J25o6J36pj66M3k4R9J02j4
$$ -2 141 -49 247 -59 -84 -83 332 73 -170 -1 -203 215 -22 -136 -11 -77 59 52 -114 -71 -95 4 106 92
6954I2l04K80n1K73k43J12pj34K6j15k5J40j35J90K41l27o4L08m55K51MJ0j56
$$ 92 -212 68 17 290 47 159 152 18 44 -71 -96 44 -91 99 340 13 -51 257 -198 53 57 67 -89
6977h9j57J44k15K81K65k70p9K19o2L26n63nJ86k58J91K65j65M9j13j09K49J14
$$ -89 -246 -102 -317 -36 229 -41 -120 99 37 363 -200 -205 -19 -277 -86 179 14 63 -50 -159 90 204
6999B04j23Jj06K05m91L60J04l38K04j22l3P1R1k0k38K26R4K8j63Qn4J94J23j50
$$ 204 81 82 -24 181 -310 50 154 -184 20 -102 -135 -64 27 7 -231 -5 89 117 -46 -38 -92 102 225 75
7023G5q8Pr5j39J33j94L33k3m6j08K94j76P3k3J91k54J08k55K22Np6k9J46k3k02
$$ 75 -13 -6 -101 -240 -107 -301 32 9 -37 -145 149 -27 46 23 214 -40 68 -187 35 40 -36 -65 81 58 -144
7048a44J65j45J43Q1j78J94j60L5l6J19k2j65J17M9Rj7q4P9K4q5p3K85j4l46L71
$$ -144 21 -124 19 100 -78 116 -44 -9 -45 74 52 -113 4 53 62 45 -39 40 64 -21 -94 191 177 -169 202
7073B02k60K28Q6m25L21q6q9L35l86J05k09J85K4O4k61J37q9M54m72J37j2J3j48
$$ 202 -58 170 256 -169 152 66 -23 312 -74 31 -178 7 31 95 -166 -29 -118 336 -136 1 -11 2 -146
7096a46L8K04j03q0P9m6J76jk33J68n7O1n3l13K10J36K57k53k24L6L08k27R4l12
$$ -146 -108 96 -7 -87 -8 -54 122 121 -112 56 -1 60 7 -306 -96 40 297 44 -180 -144 164 -63 31 -281
7120b81L85o3j76K26j81O3J09r9P2j40o1J50k4R2j86K07p5m9J12J04j11k83j01
$$ -281 104 41 -135 91 -90 -27 82 -17 55 -85 -146 4 -20 72 -114 93 18 -31 81 185 74 -209 -310
7143c10K85J07j56K2L1j4p1L87j25p1j0k46L60j43o5J02J11j57o9L5j81J69M0
$$ -310 -25 82 -74 -52 -21 -35 -106 281 156 85 75 -171 189 46 -19 83 194 37 -32 3 -178 -9 31
7166C1m0j33L9L6j57R6L5j09N3K27j79m6P9P5l2L8N3J0j6J02k02Nj28K08k25J35
$$ 31 -9 -142 -103 -67 -224 -128 -93 -202 -149 78 -101 -147 -68 7 -25 13 66 76 60 162 -40 -35 -163 45 -180 -45
7192d5L2J88k55Q2L7j68K30j11K6J48k48j87J87J66j88J28j19N3K46k29l9K07
$$ -45 -13 175 -80 2 39 -129 101 -10 16 164 -84 -271 -84 82 -106 22 -97 -44 202 -27 -66 141
7214A41j74M6M8m7K2N5qo4m4J9L35k33j33m3J05j19J90L7j58J59k7j81P4q2R0
$$ 141 -33 13 61 14 36 91 83 19 -25 -6 329 96 -37 -80 25 -94 96 133 -25 134 107 -74 0 -82 8
7239Hj9k08LJ81n0m7J91j8j9r5j24J36KQ3R9N0o7j0j88RR4K08j05M8po9j69L92
$$ 8 -11 -219 -216 -35 -85 -132 59 41 22 -73 -197 -61 -59 24 123 173 106 96 -92 -83 11 219 114 162 155 86 -83 309
7267C09l6k64r6L63l77p1J04j53K97n1j83K16r1Qj55J94j7J31L6k39O5K17j41
$$ 309 273 9 -87 276 -101 -172 -68 -221 76 25 -158 58 -33 -25 -180 14 -3 128 164 -75 -10 207 66
7290F6Q3j1j15R8j51J72j09j67Q6r3J53j8o2j66J62J32k86L55j09o6j42L33j03
$$ 66 149 138 23 121 -30 142 33 -134 -48 -141 12 -6 -68 -234 -72 60 -226 129 20 -46 -188 145 42
7313D2J88j72M5jm08K68j10R9j2n6P8J73j68J97k31Q6J6p7J15m18N06k29M4p7
$$ 42 230 58 103 102 -306 -38 -148 -49 -61 -117 -39 134 -34 163 -68 18 34 -43 72 -346 160 -69 -25 -102
7337a02J89j11J06j9O1n55M69k67nO9J18j13J75P1M3j89Q7Q5Ml1j01J58k33R0
$$ -102 87 -24 82 63 124 -431 38 -229 -234 -165 -47 -160 15 86 129 -60 27 112 116 85 -16 142 -91 -1
7361aK29j78m5j52K88k00j05J79N5q3P8k39J40q8P7L52k96k64K25k2J48Qk03L31
$$ -1 228 50 5 -147 141 -59 -164 15 70 -13 65 -174 -34 -122 -45 307 11 -253 -28 -50 98 106 -97 234
7385B34j53m9k34M24Pj79j07J91j07j33J86m30L31L7j72L46j65l2J59k13l5Q0
$$ 234 81 32 -202 222 229 50 -57 134 27 -106 80 -350 -19 18 -154 192 27 -5 154 -59 -94 -14
7407a4j02R1K4j51L71o2k07N6M3j42p8L24k83p9J97m0O0J07k89J07J88m6j80r1
$$ -14 -116 -25 -1 -152 219 157 -50 6 49 -93 -171 153 -130 -209 -12 -52 8 115 -174 -67 121 75 -105 -196
7431a96J40P2j65J85K52l9m59K67Q8m3l9j38J26j85J81o9l3J65k20l0Q6J5l4M9
$$ -196 -56 16 -149 36 288 249 -210 57 145 102 63 -75 51 -134 47 -22 -55 110 -110 -140 -54 -39 -73 -24
7455b4kK8l6R3k24P8Q0l20M05Q3m68L06k60K97J47l72L32L9q7j71J34M9J3o2r9
$$ -24 -26 2 -34 59 -165 -87 -7 -327 78 161 -307 -1 -261 36 183 -189 143 182 95 -76 58 107 120 58 -41
7480d1j49K95l3l51L69j37j85J19K04k66K47P5k76L85k82k7j94J40R7K28j57l18
$$ -41 -190 105 72 -279 90 -47 -232 -113 91 -175 72 147 -129 256 -26 -53 -247 -107 -10 218 61 -257
7502b57N9P3r0K60J47j08%k06J03K8O5J93l70lK15Q4J36k71j34M3j15K2J9k27
$$ -257 -198 -125 -215 45 192 84 84 -122 -19 9 74 267 -103 -106 109 193 329 58 -76 -33 -148 -126 -107 -334
7526c34M02O9k57K1M6m6j00K76J9k13R5O2l9j29J90o1q0J12m0N0k60K60j31J26
$$ -334 68 137 -120 -99 -53 -99 -199 77 96 -117 -22 40 1 -128 62 1 -79 33 -7 43 -217 43 -88 38
7550C8j21M5N8P8m8J5J96l15Q3p9K28j77k30J46J37p7j02L8Q5P0k22M02k34m6
$$ 38 -83 -38 20 98 50 65 261 -54 29 -50 178 1 -229 -83 54 -23 -125 -87 -2 68 -154 248 14 -32
7574c2J08j38N8O1j62L5K35k97J31J9j5m0k3O8J11m1P3j9j13j07J47j1k86K58
$$ -32 76 -62 -4 57 -105 -70 165 -132 -1 18 3 -37 -60 8 119 78 151 132 19 -88 59 48 -238 20
7598B0OJ52l1o5j83J82R6l9r0o2J84m5j61LK12k50j56N1J52PJ09j86lJ88Kj09
$$ 20 26 178 147 82 -101 81 177 138 48 -14 170 125 -36 -33 179 -71 -227 -176 -24 -17 92 -94 -97 91 93 -16
7624a6l9l00J69K18m1J26k61J48j38L61k82N3J10j60j13K60j51J75P0j67P0J35
$$ -16 -55 -355 -186 32 -9 117 -144 4 -134 227 -55 -2 108 -52 -165 95 -56 119 189 22 92 227
7646B27l86L24k43j0l5Q9l1r7j5J70qP0Q5k55J57j15j17K08J8O5j32P5l1J03J33
$$ 227 -159 165 -78 -88 -123 -34 -65 -162 -177 -7 -15 55 140 -115 42 -73 -190 18 36 101 -31 44 13 116 249
7671B49k77Qn9J08n2J47j67J24J86l14L9k03K82k00RJ62m1J66k28J0j18k3K4J73
$$ 249 -28 -20 -79 29 -23 124 -43 81 267 -47 -8 -211 71 -129 -120 42 1 167 -61 -51 -169 -192 -168 5
7695EJ29r8O4M7l22K50N8kk85J58k35J43j17J17P6j32L54m07K73q6r3K58J09k76
$$ 5 134 36 100 147 -175 75 133 131 -154 4 -231 -88 -205 -88 -12 -144 210 -197 76 -10 -103 155 264 -12
7719a2n9R8j38K7J26j68K43r5N9l7j57R4J20j08l1K06j55M0R2j42r3J39J22j00
$$ -12 -71 27 -111 -84 42 -126 117 22 81 44 -113 -19 101 -7 -38 168 13 53 145 3 -90 49 171 71
7743G1KO5l9j98J00j94K27m1j9J29j59k16J25K47j00P1R9j78j83Q1R4R8j43J71
$$ 71 73 138 99 -99 1 -193 34 -7 -26 103 -56 -272 -147 100 0 71 170 -8 -191 -110 -16 82 -61 110
7767A10k60K26j36MJ36j11j17J42K52l48J92j83K48Pk29N2J05M7j85l0J53j67
$$ 110 -150 76 -60 -56 80 -31 -148 -6 246 -102 90 -93 155 162 -67 -15 90 137 -48 -78 75 -92
7789i2K17j31q9n0Q7oQ8P9j83J67j58P9J53Mj64P9j27J56j11J52l25O9O1k0j05
$$ -92 125 -6 -95 -145 -58 -64 24 103 -80 87 -71 8 161 165 1 80 -47 109 -2 150 -175 -106 -45 -65 -170
7814a70J25km2K72j01j8j55J26l9j7L01k67J86j44j41K64k16J87J26k68j33o4
$$ -170 -45 -47 -89 183 82 64 -91 35 -4 -21 280 13 199 55 -86 178 -38 149 275 7 -126 -190
7836a90L50o9l0j57K14Mj34n1P7l01J98O7o5j13N0lK22j1j61J85k0o1j12J88K6
$$ -190 160 91 61 -96 118 122 -12 -63 14 -287 -89 -22 -87 -200 -150 -153 69 58 -103 82 62 1 -111 77 103
7861A03j51K41o6p2O0l0R1j25k16L15l12N1K80j09o0P0K5j48J82k28O6r4j38L45
$$ 103 -48 193 127 55 115 85 176 51 -165 150 -162 -111 169 60 0 70 95 -53 129 -99 -33 -127 -265 80
7885H0j69L13j37k58J56J11j91J77M1q8M2j17R4l3n4P7k32J86J99k02j42K62p1
$$ 80 -89 224 87 -171 -15 96 -95 82 123 35 77 -40 54 21 -33 44 -188 -2 197 -5 -147 115 44
7908D4m0M9j78P2J18L9j14M2M8j77j36J85oL8J35k64Q0L8J34r2L3R1L7qj42J48
$$ 44 4 53 -125 -53 65 104 -10 32 80 -97 -233 -48 -54 -16 119 -145 -65 -27 107 15 48 139 176 168 26 174
7934A74M3n3r4J19m82N5j55K39M4PL21k61OL5j19R6P0k23K47j23J69k52R3K35
$$ 174 217 164 70 189 -293 -238 -393 -154 -110 -103 218 -43 -37 -2 -121 -25 45 -178 69 -54 115 -137 -44 191
7958A91j38j7J41k15J75M6L0k30K5j91J29q7J03mP0J62k09R0n0N8l10J18j9N6
$$ 191 53 36 177 -38 137 183 213 -17 8 -183 -54 -141 -38 -42 28 190 -19 71 21 79 -231 -113 -132 -76
7982g6J28m9k16K58ml16K39J4j0r5K48j50J39q2Q9j61K9J56j49n9J03pj42K01
$$ -76 52 3 -213 45 41 -275 -36 -22 -32 -127 121 -29 110 28 117 -44 -15 141 -8 -67 36 29 -113 88
8006H8j87Q9M7j74N0K7M8P5J2J07k77K79k67j6j7R0J62j57Q6m5MK9P3j83K28J45
$$ 88 -99 -10 37 -137 -87 -60 -12 63 75 182 -95 184 -83 -99 -116 -26 136 -21 65 20 24 53 126 -57 171 316
8032C16l23Q4M2n2j65J98j29K38k41m7J16j60O9k38K96k00J95k15K2J51O7l3q0
$$ 316 -7 77 119 67 -98 100 -29 209 -32 -79 37 -123 -54 -292 4 -196 -1 -216 -194 -43 24 -9 -89
8055h9Pn9J19O4q3J14j22M9J76l11J58j1K2J28l79O1R4M8R5k23L75n20K94N7j99
$$ -89 -82 -141 -22 42 -41 73 -49 0 176 -135 23 12 34 162 -217 -156 -62 -14 81 -142 233 -287 7 64 -135
8080a35K43o4nk33K87J76k48J19j54L0K7J4m4r8L7J9q6q1L40j07K31l25K4n6Q0
$$ -135 108 44 39 -194 93 269 21 140 -14 16 43 57 13 -85 -48 -29 -115 -196 144 37 268 -57 -33 -89 -9
8105ij03Q3J40r4j18j39J43M9O5q7K26l18K63m8J62m49K58j8L3q6J39l6N5J49
$$ -9 -112 -29 111 17 -101 -240 -97 -48 17 -70 156 -162 101 53 215 -234 24 6 39 -47 92 56 111 260
8129B60k67K3N9j14j9R2o3P7j51L4n9l5J55P8L6j09j51J03M9k62K79Nj66J50J12
$$ 260 -7 16 75 -39 -58 34 -29 48 -103 -69 -128 -163 -8 70 106 -3 -154 -51 -2 -264 15 20 -146 4 116
8154A16j51j91K08L7J19j86q1J45N8J6k50J43l4j79O9J72J40j3j71j5j07j65L07
$$ 116 -35 -226 -18 19 138 -48 -129 16 74 90 -160 -17 -51 -230 -161 11 151 138 -33 -48 -155 -320 -13
8177a3K5P9j70J31N5j67%J80j65j0K92j44p4J45
$$ -13 12 91 -79 52 107 -60 -60 120 -45 -55 237 93 19 164
8191A64
$$ Imaginary data points
##PAGE= N=2
##DATA TABLE= (X++(I..I)), XYDATA
0@%%%%%%%%%%Qj6J6j6K4l2L2m0N6o7P5q8J11j35J55j79K08k41K81l26L72m22M79
$$ 0 0 0 0 0 0 0 0 0 0 0 8 -8 8 -8 16 -16 16 -24 32 -35 40 -48 63 -72 83 -96 112 -129 152 -174 198 -224 255
33B55n43O14o92P78q74R76j088J212j347J494j655J831k022K232k463K715k990
$$ 255 -288 326 -366 412 -462 514 -574 638 -709 785 -870 961 -1061 1171 -1292 1423 -1567
50a567L294l629M002m414M872n392N983o661P445q368R474j0824J2515j4706J7674
$$ -1567 1727 -1902 2100 -2314 2558 -2834 3149 -3512 3933 -4435 5039 -5785 6730 -7976 9698
65I698k1937K8610m0598O8649k53330j38068N15724o9045k19834J13382J43521
$$ 9698 -12239 16371 -24227 44422 -208908 -346976 168748 99703 -120131 -6749 136772
76A36772j24498K230R28k821Q2259l2348j13984O2255K9747p9558J8137J11327
$$ 136772 12274 14504 15432 12611 94870 62522 -51462 10793 40540 -39018 -20881 90446
88I0446m8621p6949J7080K5762K1293k0626l7727M9409o509p0043M047L1820o956
$$ 90446 41825 -35124 -18044 7718 29011 8385 -29342 20067 13558 -56485 -52438 -20618 -27574
101b7574M2624K0291j07850j301J27684m4689o3188R1373J4995q4555j616L8673
$$ -27574 15050 35341 -72509 -73810 53874 9185 -54003 37370 52365 -32190 -33806 4867
113D867K6516M4816n3666j01330Q9205P2468j29387j7883J31242k1787j12114
$$ 4867 31383 76199 22533 -78797 10408 82876 -46511 -64394 66848 45061 -67053
124f7053K9684O9884k1305o882L2334J34l7730m4436J4708M9986R70k0459J358
$$ -67053 -37369 32515 11210 4328 36662 36796 -934 -45370 -30662 19324 20294 -165 1193
137A193J350k0141j8453J0927L7376K1975l9486l5680K5431J6997Q302K2173k0698
$$ 1193 2543 -17598 -36051 -25124 12252 34227 -5259 -40939 -15508 1489 9791 31964 11266
150A1266l0581K1069M190l9566K0282N6424k4917m5531J2364J6783r17M529J7945
$$ 11266 -19315 1754 5944 -33622 -13340 43084 18167 -27364 -15000 1783 866 5395 23340
163B3340J5938j5170l6062q727K3539O822j3109m909k357k934p290K974L5971
$$ 23340 39278 24108 -11954 -20681 2858 9680 -3429 -8338 -10695 -13629 -20919 -17945 18026
176A8026J1387l6926l738K2277j8919m566M5713q295n0528J3141K2636j8978M300
$$ 18026 29413 -7513 -11251 11026 -7893 -12459 33254 24959 -25569 -12428 10208 -8770 -4470
189d470K0860r504j7592o322M95J3455N446p373J9850R211l9957j2057L7399J2855
$$ -4470 16390 6886 -10706 -17028 -16533 -3078 2368 -5005 14845 24056 -15901 -27958 9441 22296
203B2296j8017j2028o49N188o871q329L3366K9152l8320k5085K8511J599j0396
$$ 22296 4279 -7749 -8398 -3210 -10081 -18410 14956 44108 5788 -19297 9214 10813 417
216D17K1841m138k6953K720p678j7194K8090J7193k1562Q630K384l2912J5545
$$ 417 22258 18120 -8833 -6113 -13791 -30985 -2895 14298 -7264 1366 3750 -29162 -13617
229a3617L3355k4512p386L0363j9325k6967K8348J5863j2931M483K277p967o853
$$ -13617 19738 -4774 -12160 18203 -1122 -28089 259 16122 3191 7674 9951 1984 -4869
242d869j0671J9956L7930k7118m8715K4521L1801j8115o962J0548j10j566k0192
$$ -4869 -15540 4416 42346 15228 -33487 -8966 22835 4720 -2242 8306 8196 6630 -13562
255a3562j5276L4827J2092l7781Q233K8147l2170j1862L9843p22j8322R760j0638
$$ -13562 -28838 5989 18081 -19700 -11467 16680 -15490 -27352 12491 11769 -6553 3207 -7431
268g431p867K6494n046j5392K8984q97m0065R793K1433j1765J2464J0740l2805
$$ -7431 -15298 11196 6150 -9242 19742 18845 -21220 -11427 10006 -1759 10705 21445 -11360
281a1360n212K6452p442p242K1432L25k0410j0602n90J9093R315k9334n455L1200
$$ -11360 -16572 9880 2438 -4804 16628 16953 -3457 -14059 -14649 4444 13759 -15575 -21030 10170
295A0170r593k7321K1951K5390q285j1119p393J472J2529q826p835K6450K56l9801
$$ 10170 577 -26744 -4793 20597 12312 1193 -6200 -4728 7801 -1025 -8860 17590 17846 -21955
309b1955K494L1660p04n040L545q038j014n54j4793J1713K4149j8484k2957J1866
$$ -21955 -19461 12199 11495 6455 10000 1962 948 394 -14399 -2686 21463 2979 -19978 -8112
323h112O784l794O565j621k906Q175j1953j3183K2053J6780j4673r029M946M143
$$ -8112 -1328 -5122 1443 -178 -3084 5091 -6862 -20045 2008 18788 4115 -4914 32 4175
337D175r02j1599K915K9833m654m0726J913L0954l249j3353Q563N899o687j4287
$$ 4175 3273 -8326 -5411 24422 19768 -20958 -19045 11909 8660 -4693 3870 9769 3082 -11205
351a1205m788K3976J1903k9566q989K2886m837j3079J5348P135n812L10j1927
$$ -11205 -15993 7983 19886 -9680 -18669 4217 -620 -13699 1649 8784 2972 3282 -8645
364h645l636K4885J153k2300R688J2094j6604n384R187M541J1386o177k9073O893
$$ -8645 -12281 12604 13757 -8543 1145 13239 -3365 -8749 438 4979 16365 10188 -18885 -11992
378a1992K6489j5585j5006K3336O005k3258r609J1919K1101M651k5234p313K3574
$$ -11992 14497 -1088 -16094 7242 13247 -10011 -19620 -7701 13400 18051 -7183 -14496 9078
391I078n375k4003J7855K4065j4248j9131J505J0989O890r018j045K2006m886
$$ 9078 3703 -20300 -2445 21620 7372 -11759 -10254 735 7625 -1393 -2438 19568 14682
404A4682l3566O511K7736j0544j2055J1460j301r476p70m189P535J9733p889k0030
$$ 14682 -18884 -12373 15363 4819 -7236 4224 2923 -6553 -7323 -11512 -3977 15756 7867 -12163
418a2163M917R057K822O348p562j1155J0954J103j8206N873J8411o938j2554M692
$$ -12163 -7246 1811 4633 10981 3419 -7736 3218 4321 -13885 -8012 10399 3461 -9093 -4401
432d401Q502R60n613K049J5079o722k6835P096K6725r695j9532R823R204q282
$$ -4401 4101 5061 -552 1497 16576 9854 -16981 -9885 16840 7145 -12387 -2564 6640 -1642
446a642p780K106J6382R426k1600j3548J7637J149j5336J2310J5005j6545j3958
$$ -1642 -9422 -7316 9066 18492 -3108 -16656 981 2130 -13206 -896 14109 -2436 -16394
459a6394P122O810M950L430k544l49k074o134K677O474N70N288J554j2644l423
$$ -16394 -9272 -2462 2488 5918 3374 3025 951 -5183 -2506 3968 4538 9826 11380 -1264 -4687
474d687J0970K149l409J550l464n737m946m527R460J1958j3758j1836J4346K470
$$ -4687 6283 8432 5023 6573 3109 -2628 -7574 -12101 -2641 9317 -4441 -16277 -1931 539
488E39j4943Q670J8201p830j2895K348N083J531j329p45L233q29n838L521J0220
$$ 539 -14404 -5734 12467 4637 -8258 -5910 -827 704 -625 -1370 1863 1034 -4804 -1283 8937
503H937J878l792q74l63n11m295j608P554k660j1984J343K661q547R260J5284
$$ 8937 10815 7023 6149 5786 5275 980 -628 6926 4266 -7718 -6375 -3714 -12261 -3001 12283
518A2283j2935j0963J4006l17r302J1009N428r650k086n186n259J5196N959j3563
$$ 12283 -652 -11615 2391 2074 -7228 3781 9209 -441 -2527 -7713 -12972 2224 8183 -5380
532e380N148Q945j5557k135J7683j584p801L520l662o248L721J762M784O188q260
$$ -5380 -232 8713 -6844 -8979 8704 7120 -681 2839 -823 -7071 -3350 -1588 3196 9384 1124
547A124n906N499m412O08J5549m924j4005R133J32j3206J1648J1239j0182m09
$$ 1124 -4782 717 -3695 -3087 12462 7538 -6467 2666 2798 -10408 1240 12479 2297 1888
561A888j158j1450J1921R129k0668L753K0015k1519j5717K7333M891j7088Q885
$$ 1888 730 -10720 1201 10330 -10338 -6585 13430 -8089 -23806 3527 8418 -8670 215
574B15M573r925O478J253p083J2980J407k1778N239J5966j2077k460J5136n348
$$ 215 4788 -5137 1341 2594 -4489 8491 9898 -11880 -6641 9325 -2752 -5212 9924 4576
588D576q987O907j94J30R418m643j1199M16n22K885O132p865k522J1922q910j4898
$$ 4576 -4411 2496 2302 2432 11850 7207 -3992 -3576 -4098 -1213 4919 -2946 -5468 6454 -2456 -17354
604a7354J6819J3075j3576l067N923o211k830J715J903J2211j795k2757M775K3327
$$ -17354 -535 12540 -1036 -4103 1820 -4391 -7221 -5506 -3603 8608 6813 -15944 -11169 12158
618A2158j0223j4658K0404J0481j9133r644Q872R230K384p014m302Q212j163j2143
$$ 12158 1935 -12723 7681 18162 -971 -10615 -1743 7487 9871 2857 -1445 6767 5604 -6539
632f539N457J3712n444j1871L4M755n41l748K47N611j375q168k52L845K309N385
$$ -6539 -1082 12630 7186 -4685 -4651 104 -437 -4185 -3938 1673 298 -7870 -8122 -4277 -1968 3417
648C417k558j0235L722R502p435m345J3257L915j2558l946R422Q430j493q341
$$ 3417 859 -9376 -5654 3848 -3587 -7932 5325 9240 -3318 -7264 2158 10588 9095 754
662G54J630Q439p465j2711R858J4711q323j5284J812J0273k133j0299M976J3862
$$ 754 2384 10823 3358 -9353 505 15216 6893 -8391 -6579 3694 1561 -8738 -3762 10100
676A0100p651j7228N593J3959l955p340L125L675j792n465j726J2736R252j1936
$$ 10100 2449 -14779 -9186 4773 818 -6522 -3397 278 -1514 -6979 -8705 4031 13283 1347
690A347p770Q524K031m851L040K952j156m19n457l616R701N951q243n253L658
$$ 1347 -6423 2101 4132 -719 2321 5273 4117 3698 -1759 -5375 4326 10277 2034 -3219 439
705D39Q72m721j825P114O267j0011j0624P833P730o887j486P495J421n479n510
$$ 439 1311 -3410 -5235 1879 8146 -1865 -12489 -4656 3074 -3813 -5299 2196 3617 -1862 -7372
720g372K297J2356J228j4895P37J3252o627r175J2167P244p884l217j410j279
$$ -7372 -5075 7281 8509 -6386 -5649 7603 976 -8199 3968 11212 3328 111 -1299 -2578
734b578O897Q41o742K741K347p320j672N729N21N83k140o463K844O235l728n32
$$ -2578 4319 5160 -1582 1159 3506 -3814 -5486 243 764 1347 -793 -7256 -4412 1823 -1905 -2437
750b437O909j763o633j196K446P848J618j1095K336J1759r715r960J5809O905
$$ -2437 4472 2709 -3924 -5120 -2674 5174 6792 -4303 -1967 9792 77 -9883 5926 12831
764A2831j4461l215N525j194J248J11l084O301j012j4579M882J4796p908p274
$$ 12831 -1630 -4845 680 -514 734 845 -2239 4062 3050 -11529 -6647 8149 241 -7033
778g033J0599j458r614M855N255j652K076j031n545K129K232Q46M890k301p143
$$ -7033 3566 2108 -7506 -2651 2604 952 3028 1997 -3548 -1419 813 1659 6549 4248 -2895
793b895M162J800q293L165R273l239p256m39J652K960j006l056N602J995j2573
$$ -2895 1267 3067 -5226 -2061 7212 3973 -3283 -3722 -2070 890 -116 -3172 2430 4425 -8148
808h148k53J4305k652r836O620M828q038k247M964M293J357n085m087O474J171
$$ -8148 -8401 5904 3252 -6584 36 4864 -3174 -5421 -457 3836 5193 108 -3979 2495 3666
823C666o522M129O045p203m198N124K09k176K925J130l040l165k04N094J232n964
$$ 3666 -2856 1273 7318 115 -4083 1041 1250 -926 1999 3129 89 -3076 -3280 1814 3046 -2918
839b918J489N525p451o056Q593N615n913k261K524J343p63k395M663O680o395
$$ -2918 -1429 4096 -3355 -9411 -818 4797 -1116 -3377 -853 490 -273 -2668 1995 8675 2280
854B280q856O656N281p451j33P860j086o694j743L060N409J60n975Q18K842n293
$$ 2280 -6576 80 5361 -2090 -2223 5637 4551 -2143 -3886 -826 4583 4743 -1232 -414 2428 -2865
870b865j637N043m80j768J838l802l603O786L167l364O86K010k320q19o04K556
$$ -2865 -4502 541 61 -1707 131 -3671 -7274 -488 2679 -685 1 2011 -309 -1128 -1732 824
886H24N493l219p703M548N803o467k114Q300J023p584l162L724N316k245p219
$$ 824 6317 3098 -4605 -57 5746 -721 -2835 5465 6488 -1096 -4258 -534 4782 2537 -4682
901d682K695O649o241o527P427M919m774l319K34J882K522j999j671N047L04n938
$$ -4682 -1987 4662 -1579 -8106 -679 4240 -534 -3853 -3619 -1737 785 -1214 -2885 2162 2466 -3472
917c472J051N250R48O11j763l897K765K334n688j16P742k241q888p20N970L633
$$ -3472 -2421 2829 3777 4388 2625 -1272 1493 3827 -1861 -1977 5765 3524 -5364 -6084 -114 3519
933C519l326m070N274M269r884n411J2024N513j0245l929O296J625m834k193P031
$$ 3519 193 -3877 1397 5666 -4218 -9629 2395 7908 -2337 -6266 30 1655 -3179 -5372 1659
948A659P723o014q950O436O839o611l389O245J82n605k505O95L578J789m079j342
$$ 1659 9382 3368 -5582 854 7693 1082 -2307 3938 4120 -1485 -3990 -3295 283 2072 -2007 -3349
964c349L194lj767J351K79O07J387m336k308O661K635o257j184M862J277l471
$$ -3349 -155 -158 -1925 -574 -295 312 1699 -2637 -4945 1716 4351 -1906 -3090 1772 3049 -422
980d22j646M774N022o523q171P091P992q097n258Q928K681r514m395P358O705
$$ -422 -2068 2706 7728 1205 -6966 125 8117 20 -5238 3690 6371 -3143 -7538 -180 6525
995F525n214q203L619O798n782o577Q255P066n912n792L102M419j336k621K576
$$ 6525 1311 -6892 -3273 3525 -2257 -8834 -579 6487 575 -5217 -2115 2304 968 -1653 923
1010I23K923l633l957K392K081L23J985j089k260K066O03k293K552K524l399k883
$$ 923 3846 213 -3744 -1352 729 1052 3037 1948 -312 1754 2357 64 2616 5140 1741 -1142
1026a142l81m69K689K04n835J505O450n497o023Q626N518p091l505L882K705j675
$$ -1142 -1523 -1992 697 901 -4934 -3429 3021 -2476 -8499 127 5645 -1446 -4951 -1069 1636 -39
1042c9l885K111O385k444p008M023O497k921k168K490J37q86k102n53M870N50
$$ -39 -3924 -1813 4572 2128 -4880 -857 5640 2719 551 3041 3178 2292 190 -363 4507 5057
1058E057p428m08M876l743k100N750j877m088L326j635l758O386K481p274J493
$$ 5057 -2371 -2779 2097 -1646 -3746 2004 127 -3961 -635 -2270 -6028 358 2839 -4435 -2942
1073b942L937l220K92M185j385J245J442o146l28P743j945n209N117J538n734
$$ -2942 995 -2225 -1933 2252 867 2112 3554 -2592 -2920 4823 2878 -2331 2786 4324 -1410
1088a410j13K965J158O48k633k330K143m15l349L157K588m117j089J281j616J765
$$ -1410 -1523 1442 2600 3248 615 -1715 428 13 -3336 -179 2409 -1708 -2797 -1516 -3132 -1367
1104a367K915j964m43J856k186l37L059j076j32K180l621j843N372R08m961K681
$$ -1367 1548 -416 -859 997 -1189 -1526 1533 457 325 2505 -1116 -2959 2413 3321 -1640 1041
1120A041L493m458k932L539K041j270k213q93K176j79l420J298M389k076m304
$$ 1041 4534 76 -2856 683 2724 1454 -759 -1652 524 345 -3075 -1777 2612 536 -3768
1135c768Q74L194J64j021J80J538j304k440J989K588j021L0J637k540k045L104
$$ -3768 -2894 300 464 -557 -377 1161 -143 -2583 -594 1994 973 1003 2640 100 -1945 1159
1151A159J406k036j68J185j548j763o0K756J642k656l211L092J311l974L6N457
$$ 1159 2565 529 361 1546 -2 -1765 -1825 931 2573 -83 -3294 -202 1109 -2865 -2829 2628
1167B628J40n234j863M773K678m391j626N714J058o506m15O744O4m116J06J094
$$ 2628 2768 -2466 -4329 444 3122 -1269 -2895 2819 3877 -2629 -3044 3700 3764 -352 -246 848
1183H48k34j414q77K080K785k907l773L222J039k300R25J883k032j183J329n77
$$ 848 614 -800 -1677 403 3188 281 -3492 -270 769 -1531 -606 1277 -755 -1938 -609 -1186
1199a186J33K789K44l033j157K699J281j765r16L555P54n235j370N258J827l680
$$ -1186 -1053 1736 1980 -1053 -2210 489 1770 5 -911 2644 3398 -1837 -3207 2051 3878 198
1215A98k199K495K508l356l936M495N184o120n231N664K879n195k30M394l3l087
$$ 198 -2001 494 3002 -354 -4290 205 5389 -731 -5962 -298 2581 -2614 -2844 1550 1517 -1570
1231a570j182J185L618jl861P81L795k436k747L095K481q45k334j215J418K261
$$ -1570 -2752 -1567 2051 2050 -1811 -1030 2765 329 -2418 677 3158 2313 -21 -1236 182 2443
1247B443j081j899J082R16j505j705n82L313K175m955l013M955J052n101J910
$$ 2443 1362 -537 545 1461 -44 -1749 -2331 982 3157 -1798 -4811 144 1196 -3905 -1995
1262a995M904j778l736O9J603K886l69l917K560M154n339l439P214K526n450p62
$$ -1995 2909 1131 -2605 -2536 -933 1953 1584 -2333 227 4381 -958 -4397 2817 5343 -107 -869
1278h69K730q18p72n61J54K533k95m908j7L588n93j415J95k01P30K81k694J035
$$ -869 1861 1043 271 -290 -136 2397 2102 -2806 -2823 765 172 -1243 -1048 -1249 -519 -238 -2932 -1897
1296a897M591j717l715P62L082O2j665p01K639J641m374j329O377J262o008l85
$$ -1897 2694 977 -2738 -1976 1106 1168 -497 -1198 1441 3082 -1292 -2621 3756 5018 -990 -1375
1312a375M546p73l256L12L026M64l910l060L206K666l289j742M064J27m565L41
$$ -1375 3171 2398 -858 -546 2480 2944 -966 -4026 -820 1846 -1443 -3185 879 1006 -3559 -3218
1328c218L155P29n93m88l83M00p09N58J349O43k23j82r39j115K401J646j843j405
$$ -3218 -63 666 73 -415 -798 -398 -1107 -549 800 1443 1220 1038 99 -1016 1385 3031 1188 -217
1346b17J906j56k393q23K616K098l472l410K735K294l480j611M447J320m261j139
$$ -217 1689 1533 -860 -1683 933 3031 -441 -3851 -1116 1178 -2302 -3913 534 1854 -2407 -3546
1362c546L937J973k514j403K780J609l543j621M700J506m207j156K565N59j417
$$ -3546 391 2364 -150 -1553 1227 2836 -707 -2328 2372 3878 -329 -1485 1080 1639 222
1377B22l8J145O31j846j540J517J201j964L48N89k180p65K093p5j019J167J079
$$ 222 184 1329 1960 114 -1426 91 1292 -672 -324 265 -1915 -2680 -587 -662 -1681 -514 565
1394E65j480j016J200K226M74k084j26J745j111k247K405K937k164k565J126J628
$$ 565 -915 -1931 -731 1495 1969 -115 -241 1504 393 -1854 551 3488 1324 -1241 -115 1513
1410A513j002q28J119J805j868l262J622K357j494j050J207m43j589J39J041L07
$$ 1513 511 -317 802 2607 739 -2523 -901 1456 -38 -1088 119 -324 -1913 -1774 -733 -426
1426d26O47q21o85N96L2M52J600j83j400J120J47j662P45K511j053j826J42Q11
$$ -426 221 -600 -1285 -689 -657 -205 1395 1212 -188 932 1079 -583 162 2673 1620 -206 -64 747
1444G47j98q56L22J448k53k715K72K315l76j776jR19j045p68L60J171P83j423
$$ 747 549 -307 15 1463 1210 -1505 -1233 1082 706 -1070 -1071 -152 -1197 -1965 -1605 -434 349 -1074
1462a074p04J373R47n82R25P42r06j51J20q63R68J786j486j823N22M92n52P4P60
$$ -1074 -1778 -405 542 -40 885 1627 721 570 690 -173 795 2581 1095 -728 -206 286 -266 -192 568
1481E68J185q52k973n3L143l01k694J413J633k005k205J429K931J92k665j28K614
$$ 568 1753 901 -2072 -2125 1018 717 -1977 -564 1069 -936 -3141 -1712 1219 1411 -1254 -1382 1232
1498A232l94k193J062K874n05k685k9J895r1j020J9J159p11j329m5O87K01L03
$$ 1232 838 -1355 -293 2581 2076 -609 -638 1257 1166 146 165 1324 613 -716 -761 -74 127 430
1516D30o53j150K75J197j12q86P66N42o92j468N32K190R68k901o51L393o29k926
$$ 430 -223 -1373 -1098 99 -13 -899 -133 409 -283 -1751 -1219 971 1939 -962 -1613 1780 1151 -1775
1534a775J506L912j597l824M97L029L18l020m95L447k93m826Q1M956k87l452J11
$$ -1775 -269 3643 2046 -1778 -1281 1748 2066 -954 -1449 1998 1705 -3121 -3040 1916 1629 -1823 -1712
1551a712K352l19k049j39K578J396l146j068K854K85j859J217J313j458j63L64
$$ -1712 640 321 -1728 -1867 711 2107 -1039 -2107 747 1032 -827 390 1703 245 82 446
1567D46p96J066J334j572r19O94l26l39R33r94N42J059k322j698L615R58l878
$$ 446 -350 716 2050 478 -441 253 -73 -412 521 -473 69 1128 -1194 -2892 723 1681 -2197
1584b197J09K991p82k471O04K868R51k301k062K674K254k855j142L742L9l398
$$ -2197 -2088 903 121 -2350 -1746 1122 2073 -228 -2290 384 2638 -217 -1359 2383 2422 -976
1600i76o12K649O97j348j208J256P47k088j012K553J060k320q96Q84j01K1M55
$$ -976 -1588 1061 1758 410 -798 458 1205 -883 -1895 658 1718 -602 -1498 -614 -715 -694 -239
1617b39n98L82R12j434p48J419J351k17r49j14P13L62o69j03K070j06k437p10
$$ -239 -837 -455 457 -977 -1725 -306 1045 828 -121 -235 478 840 171 68 2138 2032 -405 -1115
1635a115K285N83j850n21J684j94k312l48K498O68j981j281J508O7q16J97J170
$$ -1115 1170 1753 -97 -618 1066 872 -1440 -1788 710 1378 -603 -1884 -376 -309 -1125 -928 242
1652B42L03j137j056R79J011P8n4N4k14k3R2l5Q58N16l06j456l49Q09P95r93q13
$$ 242 545 -592 -1648 -669 342 420 366 420 206 183 275 240 1098 1614 1308 -148 -497 312 1107 114 -699
1673f99J489k84k260m24K876M75k051l41J171J23j704J58J932R11k200r94J978
$$ -699 790 506 -1754 -2178 698 1173 -878 -1219 -48 75 -1629 -1471 461 1372 -828 -1822 156
1690A56J420j974j46K455n37k080M20J500j72p81O41m24r62N1M44P51p76n15L69
$$ 156 1576 -398 -544 1911 1374 -706 -286 1214 1042 261 902 478 -484 -433 11 762 -14 -529 -160
1709a60o33p82O05J428m85j472L68J255o03j094J818J959k188j894J866K184j967
$$ -160 -793 -1575 -970 458 -27 -1499 -1131 124 -479 -1573 245 2204 16 -1878 -12 2172 205
1726B05q90K263L66k116r48J703J340j034j769Q92J236k223p50K168J075j912
$$ 205 -685 1578 1944 -172 -1120 583 1923 889 -880 12 1248 -975 -1725 443 1518 -394
1742c94j045J236L26j276K90J395l99j086k0P73nk06J475l32j393J77J618l52
$$ -394 -1439 -203 123 -1153 -863 532 133 -953 -973 -200 -205 -411 1064 732 -661 -484 1134 782
1760G82m65Q50K93p73j172j05J907J33k474j88K589j315k675J942K520k083j611
$$ 782 317 1167 1460 687 -485 -590 1317 1450 -1024 -1212 1377 62 -2613 -671 1849 -234 -1845
1777a845J000P78l16m11M21J159m88j869M43K346j78j804R57J155j055k72P19
$$ -1845 -845 -67 -383 -794 -373 786 298 -1571 -1128 1218 1040 -764 193 1348 293 21 740
1794G40M98J4n43r65K89J46L39J72q48l54P53o67j352J412J480j364j186M06J039
$$ 740 1238 1252 709 -256 33 179 518 690 -158 -512 241 -426 -1778 -366 1114 -250 -1436 -1030 9
1813In37j24M31J018m03j665j17K384K31j721M34J703r03j527J014J413j20j170
$$ 9 -528 -652 -221 797 394 -1271 -1388 996 1227 -494 -60 1643 740 -787 227 1640 1520 350
1831C50p87N64L79q19j77Q37R2q99o56P5J012M27r10m70Q30N50j046j81J191J125
$$ 350 -437 127 506 -313 -490 347 439 -460 -1116 -1041 -29 398 -512 -982 -152 398 -648 -829 362 1487
1851A487j487j307J173J321m22j591J108R53r14j754J667K263j469k088Q23J402
$$ 1487 0 -1307 -134 1187 765 -826 282 1235 321 -1433 234 2497 1028 -1060 -237 1165
1867A165j399j227J151J409j320j747M40J496Q7p50k2J389o43j272M67J403L57
$$ 1165 -234 -1461 -310 1099 -221 -1968 -1528 -32 55 -695 -717 672 29 -1243 -776 627 984
1884I84p86o2%k35M80J9j82N63M35q20j031O78J054qj718L71R36o22j712P70J978
$$ 984 198 136 136 -99 381 400 218 781 1216 396 -635 43 1097 1089 -629 -258 678 56 -1656 -886 1092
1905A092o54k238J70K126k26j879R42J975o56k033K84K733k05k030L10J440o52
$$ 1092 438 -1800 -1630 496 270 -1609 -667 1308 652 -1381 -1097 1636 1431 -599 -289 1151 499
1922D99j136O40J585O1j856m40J082L73j007K87N87m35j150K26M25J1j76%l84
$$ 499 -637 3 1588 1649 -207 -647 435 808 -199 88 675 240 -910 -684 -259 -248 -424 -424 -808
1941h08k06M76M45j55J4P74N1j139j62J697M63j122l05P85pj141j24J633N31k195
$$ -808 -1014 -538 -93 -248 -234 540 591 -548 -710 987 1450 328 23 808 801 -340 -464 1169 1700 -495
1961d95n90J399O30j634N7J532k69j516p44J438K40n07o51Q37L71p39l37J133
$$ -495 -1085 314 944 -690 -633 899 630 -886 -1630 -192 48 -459 -1110 -273 98 -641 -978 155
1979A55O01p62l99M51L8K02L42j9j25J66k76o47M10R27j78p14o00L13M31p56j33
$$ 155 756 -6 -405 46 84 286 628 609 484 650 374 -273 137 1064 886 172 -428 -115 316 -440 -573
2000e73R33L1j396m84J185P48p59m97O99K15q86p1J210N06m35q57M79P51m20m00
$$ -573 360 391 -1005 -1489 -304 444 -315 -812 -113 102 -784 -855 355 861 426 -431 48 799 379 -21
2020b1O67N32q16o53L77J98K28O3o77l09K75l8p15L07R30j84j308l65R96Q22p32
$$ -21 646 1178 362 -291 86 284 512 575 -102 -411 -136 -174 -889 -582 348 164 -1144 -1509 -513 309 -423
2041d23l70J380J52j493j07J592M09j151m29Q90K42p62j53J311K89j241o60R65
$$ -423 -793 587 739 -754 -861 731 1140 -11 -440 450 692 -70 -223 1088 1377 136 -524 441
2059D41N08j113R0N72o23p10J86J93K38R8l97k20m2J77K70M28n35K69O69l83j095
$$ 441 949 -164 -74 498 -125 -835 -649 -456 -218 -120 -517 -737 -779 -602 -332 96 -439 -170 499 116 -979
2080i79J159J260j161q72J349L08r97n95J519O20j233j454J144J041j078j259
$$ -979 180 1440 279 -593 756 1064 67 -528 991 1611 378 -1076 68 1109 31 -1228
2096a228J419P50j889q80J433J144j045q18N30J166j087o33J282J032j121r31
$$ -1228 191 941 -948 -1828 -395 749 -296 -1114 -584 582 -505 -1138 144 1176 55 -876
2112h76Q87N13k81L00M09n21k42R8k04K99O5J53n04l81L8L12P3o70K07O91p04
$$ -876 11 524 243 543 952 431 189 287 83 382 447 600 96 -285 -247 65 138 -532 -325 366 -338
2133c38j319R79J510o74j491N34J312p21p47O99J472l37j542L28J475l44j114
$$ -338 -1657 -678 832 158 -1333 -799 513 -208 -955 -256 1216 879 -663 -335 1140 796 -318
2150c18N50J070o53j517O23R72m9p85j38L28p7n84K1P57n3p03j19L2M20L23m1
$$ -318 232 1302 649 -868 -245 727 678 -107 -245 83 6 -578 -557 200 147 -556 -675 -643 -223 100 59
2171E9o32M31N43p35r0Q97M79l49r18M20L41J62q82M61Q25m51j451O25J259n38
$$ 59 -573 -142 401 -334 -424 473 952 603 -315 105 446 608 -274 187 1012 561 -890 -265 994 456
2191D56q54K71O77p91n64N34N79j21p86j79N76J09m49J13O13J13m09m79L95R59
$$ 456 -398 -127 550 -241 -805 -271 308 187 -599 -778 -202 -93 -542 -429 184 297 -112 -591 -196 763
2211G63k3m81p3j42K47k68k37P70O33j024j030Q50R92r38r62J057K58q09q89Q37
$$ 763 740 259 186 44 291 23 -214 556 1189 165 -865 -15 977 39 -923 134 392 -417 -1306 -469
2231d69R74p32q57J79J254m10p68O18J044m31j206O37R75k09q38M35P40q10l68
$$ -469 505 -227 -1084 -905 349 -61 -829 -211 833 402 -804 -167 808 599 -239 196 936 126 -242
2250b42N67L67m62m1Pn39m0O0J60J41j66N2k73l28K71O52J54r81k40J147k44p41
$$ -242 325 692 230 189 196 -343 -383 -323 -163 -22 -188 -136 -409 -737 -466 186 340 -641 -881 266 22 -719
2272g19N46J659p13j289K38J398k16r74K41O89l91j301J80J253o0r80J0N88j17
$$ -719 -173 1486 773 -516 -278 1120 904 -70 171 860 469 -832 -652 601 541 -439 -429 159 42
2291D2q52L95P63l32m91j27N19k09j40J20N10l43k04M45N5M0N24j01q12J25N31
$$ 42 -810 -415 348 16 -475 -602 -83 -292 -432 -312 198 -145 -349 96 151 191 715 614 -198 -73 458
2312D58j5k47n05P48Qj038r5J017L03j071l05R32K4j158L03J019R4j113m24R48
$$ 458 443 196 -309 439 447 -591 -686 331 634 -437 -742 190 214 -944 -641 378 472 -641 -1065 -117
2332a17M79m78m69J069K93r49j30P08M37n95j71M9J54J59k64K52J84j19q35o3
$$ -117 362 -116 -585 484 777 -172 -302 406 843 248 77 126 280 439 175 427 611 492 -343 -406
2352d06K25J36p5j00mn7J0j25k53P93Q4m92j67N20l3j04O0N33k7l15o55R72N21
$$ -406 -181 -45 -120 -220 -224 -281 -271 -396 -649 144 228 -264 -431 89 56 -48 12 545 518 203 -452 520 1041
2375A041n46m42M46L99r15l71O71L44n94l86o9K59l4k2m3K33k80k31JL52L10k31
$$ 1041 495 53 499 898 -17 -388 283 627 33 -353 -422 -163 -197 -219 -262 -29 -309 -540 -539 -187 123 -108
2397a08l78K21J65J08jK5N98J2p10J35M94K54j009J55N87j71p59j11R99j24p05
$$ -108 -486 -265 -100 8 7 32 630 642 -68 67 561 815 -194 -39 548 377 -382 -493 506 382 -323
2418c23j93M38K65o63l65Q46K22q87k14N37N32n44j7O03Ml11j03N58J5K00m00
$$ -323 -516 -78 187 -476 -841 5 227 -660 -874 -337 195 -349 -366 237 241 -70 -173 385 400 600 200
2439B00k2l84L51K81j81k54K00P1l10m13N95M87n87p29K22L86l07n22O52P51r50
$$ 200 178 -206 145 426 245 -9 191 262 -48 -461 134 621 34 -695 -473 -87 -394 -916 -264 487 -463
2460d63o27P92R28n48o08P25L85p20m20J063L90m16n27K00N09m98l77O86J04l50
$$ -463 -1090 -298 630 82 -526 199 584 -136 -556 507 897 481 -46 154 663 165 -212 474 578 228
2480B28p36M66K02m54J12O2j25l9k17K55m9J07J55p8l21L03K52j7k68K32M76j67
$$ 228 -508 -42 160 -294 -182 -120 -245 -284 -501 -246 -295 -188 -33 -111 -432 -129 123 106 -162 70 546 379
2502C79p19L86R32k86q43J37P48n37n77J81R88o77q66NQ45J10p94K85M88n10m10
$$ 379 -340 46 978 692 -151 -14 734 197 -380 -199 789 112 -754 -749 96 206 -588 -303 185 -325 -735
2523g35K88P69j59n39J69K97j00m37M68M24r7o4j00l5J97P8J88l05j13o5l03m6
$$ -735 -447 322 163 -376 -207 90 -10 -447 21 445 348 284 184 149 346 424 612 307 194 129 -174 -220
2545b20L35J14j75p45J29N36k57k89J36P21m21o68O33M93l20k98K17L96k97ln1
$$ -220 115 229 54 -691 -562 -26 -283 -572 -436 285 -136 -804 -171 322 2 -296 -79 317 20 17 -34
2566c4M30J96o46j7N18p6k85j4J77P3l89J30O2J46j52m13j35N8L41k66M9L58P2
$$ -34 396 592 -54 -71 447 371 86 72 249 322 -67 63 125 271 119 -294 -429 -371 -30 -296 -247 111 183
2589A83l28k52L46M29N3n72J72N17m81m37M32P96m96o47K21K81k72j77J47M22
$$ 183 -145 -397 -51 378 431 -141 31 548 67 -370 62 858 362 -285 -64 217 -55 -232 -85 337
2609C37l52m81J67N82l09l68L66L21r73K69K57J09j4j99R6J33RJ52M3j8J12N0
$$ 337 -15 -496 -329 253 -56 -424 -58 263 -710 -441 -184 -75 -89 -288 -192 -59 -50 102 145 127 239 289
2631B89J69p06M57M24kq54J29O61j76o98J95N70k76n79j80M86M60r11J42N86n
$$ 289 458 -248 209 633 631 -223 -94 567 391 -307 -112 458 182 -397 -577 -91 369 -542 -400 186 181
2652A81j047J08J153l21m91J43O44l64j45O9N35Q2o57J01J84L10l21J48k68j46
$$ 181 -866 -758 395 74 -417 -274 370 6 -139 -70 465 547 -110 -9 175 485 164 312 44 -102
2672a02Q4Q3ll56J32pk88L7K34K42j82k17K23K01o14J7P33N23q23r6L36J95l62
$$ -102 -18 65 62 -294 -162 -169 -457 -420 -186 56 -126 -343 -120 81 -533 -516 217 740 -83 -179 157 352 -10
2695a0j30Q75Lo93k04N29K13n17l15N09J62p14j76L14L31l70k87M53k6m58O6L15
$$ -10 -140 735 738 45 -159 370 583 66 -249 260 422 -292 -468 -154 177 -193 -480 -27 -53 -511 -445 -130
2717a30n8J16q9k66M36J47p7P2l2K84L4j07j19K83k6o18n5L59K47m40R3K15j99
$$ -130 -188 -72 -161 -427 9 156 79 151 119 403 437 330 211 494 468 -150 -205 154 401 -39 54 269 70
2740G0m55l06M24M50n11l45M70K39l62q8J80L87l12j01L56o1J81J3j68L28Qm88
$$ 70 -385 -691 -267 183 -328 -673 -203 36 -326 -414 -234 153 -159 -260 96 35 216 229 61 389 397 -91
2762i1L12m7K54R3m67r4J38Rk30J64L80n73l69p6M33P1l57R6K95P5n31l5P66K22
$$ -91 221 174 428 521 54 -40 98 107 -123 41 421 -152 -521 -597 -164 -93 -450 -354 -59 16 -515 -550 216 438
2786D38o31k21O66j12r3M5K92M65j000P3L82k5k06P6N4qk22p8N6K22k85J21m33
$$ 438 -193 -414 252 140 47 92 384 849 -151 -78 304 279 73 149 203 195 -27 -105 -49 173 -112 9 -424
2809d24J38K97j40k62J35j07L92l99q0N33L64m80k27M16M05l71l53O85P3n68k37
$$ -424 -286 11 -129 -391 -256 -363 29 -370 -450 83 447 -33 -260 156 561 190 -163 522 595 27 -210
2830b10K44O62n91l28M45K92n19p00Q52J62l70m90K84M54l10l92L25L93l28j38
$$ -210 34 696 105 -223 222 514 -5 -705 147 309 -61 -551 -267 187 -123 -515 -190 203 -125 -263
2850b63J54N05j28j90m9K84j35o1J88l70J89L29l11k52K31M6Q2l82K18N2K07o93
$$ -263 -109 396 268 78 29 313 178 117 305 -65 124 453 142 -110 121 167 249 -133 85 137 344 -349
2872c49O4N84k58p97L75O85l67m89M32L42j32m61K15M88m9l58j16Q17m05m86K32
$$ -349 -285 299 41 -756 -381 304 -63 -552 -120 222 90 -371 -156 332 283 -75 -191 626 221 -265 -33
2893c3O14l08o5m32M73K0n30J38L31k83j12o9O2P0J08Qn62O46j89j98N2L93J15
$$ -33 581 273 208 -224 249 269 -261 -123 208 -75 -187 -256 -194 -124 -16 -8 -570 76 -113 -311 -259 134 249
2916B49l85q1oJ90Q9j80M19J58j20l54J02M35j45l51J11J79q2j98j61L23r8j12
$$ 249 -136 -217 -223 -33 56 -124 295 453 333 -21 81 516 371 20 131 310 228 30 -131 192 94 -18
2938a8k86J62L27l75j34K22J19l68J29j93M94Qj44j40L40K57m15J43L5K83k59
$$ -18 -304 -142 185 -190 -324 -102 17 -351 -222 -415 79 87 -57 -197 143 400 -15 128 163 446 187
2959A87m18K73L76k86lj46L54k03n19J44O30m72k64o1N15k65l73K45K15K21o85
$$ 187 -231 42 418 132 129 -17 337 134 -385 -241 389 -83 -347 -408 107 -158 -531 -286 -71 150 -535
2980e35M89M36k19j91L5R1o6k5NJ92j83K17l01j37K34r0L67l18k6l3q4k20ML02
$$ -535 -46 390 171 -20 15 106 40 15 20 212 29 246 -55 -192 42 -48 319 1 -25 -58 -142 -362 -358 -56
3004e6J44l46k2M21k64l07O1O77k28l96P2P46q4m41P4N07j28n68M34L65m92m53
$$ -56 88 -258 -280 141 -123 -430 -369 308 80 -316 -244 502 418 -23 51 558 430 -138 296 661 169 -284
3026b84J26L51Ko09J90K17k9k99N2J60J45k44r4J14J05nr2l1N8K72j02n3k32L87
$$ -284 -158 193 195 -414 -224 -7 -36 -335 -283 -123 22 -222 -316 -202 -97 -102 -194 -225 -167 105 3 -50 -282 105
3050A05J36p1o9J10K75q15M48K14J58n45l47N12j40k2k42N60K64q62R2K28M00
$$ 105 241 170 101 211 486 -329 119 333 491 -54 -401 111 -29 -51 -293 267 531 -331 -239 -11 389
3071C89n77n0L30J03l79k89M28N07l78k49L05K47j23l44L20k04oK52r7j16K52
$$ 389 -188 -238 92 195 -184 -473 -45 462 84 -165 140 387 264 -80 240 36 30 282 185 69 321
3092C21k61l05K85p4j44L9j81M32k05r3L1O8J14k02KQ3J63j34l01L47J65j56K6
$$ 321 60 -245 40 -34 -178 -139 -320 112 -93 -186 -155 -87 27 -175 -173 -90 73 -61 -362 -15 150 -6 20
3115B0qL00j67P6Q7r5M6l28k0K87K0j92n9K39l03o0k6O3J97%n38K30K29J21n47
$$ 20 12 312 145 221 308 213 259 -69 -89 198 218 26 -33 206 -97 -157 -183 -120 77 77 -461 -231 -2 119 -428
3140d28L98K52l27o4M4K38K28j66l93N42J0m21j44N11J06n90J65K32p5j85l43
$$ -428 -30 222 -105 -169 -125 113 341 175 -218 324 334 -87 -231 280 386 -204 -39 193 118 -67 -410
3161d10L10L74k28m63L26L7k2K56j47m7j35K9K9K68n9j96J28j68L50J52k09p9
$$ -410 -100 274 46 -417 -91 -54 -76 180 33 -14 -149 -120 -91 177 118 -78 50 -118 232 384 175 96
3183I6L3K95l95k52M22K74m33n09N01K26k08m00K77K30n90kL23O44o09l49L38
$$ 96 129 424 29 -223 199 473 40 -469 32 258 50 -350 -73 157 -433 -435 -112 532 -77 -426 -88
3204h8L42k85k78M87K50l86l07L80K66k86j40K94K9j23l10L41j33M9j48K5J02
$$ -88 254 -31 -309 178 428 42 -265 115 381 95 -45 249 278 155 -155 186 53 102 -46 -21 81
3225H1j69P5P0j49l33N61k40m20K40K91N1j79j77O12j91o86O54Q7j8k95K11K08
$$ 81 -88 -13 57 -92 -425 136 -104 -524 -284 7 58 -121 -298 314 123 -563 91 178 160 -135 76 284
3247B84M8m92K20K57j58l60J38K20l0m8l01L92j07k88QK46j74o4Q6J4l5J94P9
$$ 284 332 -160 60 317 159 -201 -63 157 127 79 -222 170 63 -225 -217 29 -145 -209 -123 -109 -144 50 129
3270A29j10R8j41o3K02p1j39K35j52k0J18k1n2J55Q0j95j95J60J65J21l99P0K35
$$ 129 19 117 -24 -87 115 44 -95 140 -12 -32 86 65 13 168 248 53 -142 18 183 304 -95 -25 210
3293B10j21m66K01J42L6k80q1L40K76k78k5O3K89k46j21P1L4K08k34kJ62p9j60
$$ 210 89 -377 -176 -34 2 -278 -359 -19 257 -21 -46 17 306 60 -61 10 44 252 18 16 178 99 -61
3316f1K3J32K8L6l12j2J56J84n08K45L9N9k15L6P3j84o5J84K36j18l0L6L40J14
$$ -61 -38 94 122 158 -154 -166 -10 174 -334 -89 -50 9 -206 -170 -97 -281 -346 -162 74 -44 -74 -38 302 416
3340D16m92L80k27Q0k71J12K70r4k30N5K63k07r1l4P1M0l11K75M0l04J42Kj92
$$ 416 -76 304 77 157 -114 -2 268 174 -56 -1 262 55 -36 -70 1 41 -270 5 45 -259 -117 -115 -307
3363c07M3L46l27K28p7K1J75k11J39K9K12l96O3O04m38j36R5K19l52k65L03M00
$$ -307 -264 82 -245 -17 -94 -73 102 -109 30 59 271 -125 -62 542 104 -32 63 282 -70 -335 -32 368
3385C68k41k19l66N77k83j42k4K78J89l67j89M60k43L54j09J77o2j75L6K37l97
$$ 368 127 -92 -458 119 -164 -306 -330 -52 137 -230 -419 41 -202 152 43 220 158 -17 19 256 -141
3406a41%L68q6n5k6R0q8J2j29K06l19m7KN89l54j49K53j26j77l26L49L75m28j08
$$ -141 -141 227 141 86 60 150 62 74 -55 151 -168 -215 -213 376 22 -127 126 0 -177 -503 -154 221 -207 -315
3430c15K62J1K04l22M01j09j11j05L45J39k72r0m4K34q4k7k24O02m37k99J14J79
$$ -315 -53 -42 162 -160 241 132 21 -84 261 400 128 38 -6 228 144 117 -107 495 58 -241 -127 52
3452E2n9k04J03j25K08K3k76J34K56p7q7R1M0r3k6K08p9J70j53J06jn1j85k36
$$ 52 -7 -211 -108 -233 -25 -2 -278 -144 112 35 -52 39 79 -14 -40 168 89 259 106 212 211 160 -25 -261
3476b61N04r1l84K73q2J45q7j20n1j16j5j56L05mM06n27n5J91p2J68m3L52l52
$$ -261 243 152 -232 41 -41 104 17 -103 -154 -270 -285 -441 -136 -140 266 -261 -316 -125 -197 -29 -72 280 -72
3499g2k4L30j69Q5p6P6j48O2K20m57L63k3k01P7j35O9JM9j70K4K05l00N3L61p6
$$ -72 -96 234 65 150 74 150 2 64 284 -173 190 167 -34 43 -92 -23 -22 27 -143 -119 86 -214 -161 200 124
3524A24j48j24K3N9j15p4K42P9K4j36J20J94j10r5j70L76k49p3L0R7K65l31j61
$$ 124 -24 -148 -125 -66 -181 -255 -13 66 90 -46 74 268 158 63 -107 269 20 -53 -23 74 339 8 -153
3547a53j02L63l12K63k44Q0Q8k24M3J71L17l31k45J55L62l46Q1K3J95l37J9J55
$$ -153 -255 108 -204 59 -185 -105 -17 -241 -198 -27 290 -41 -286 -131 231 -115 -34 -11 184 -153 -134 21
3569B1K62p5j48m7J68k6m8j20N4J59m37Q8K75l53mK36o2p3L6k03J8L51M3r5p2
$$ 21 283 208 60 13 181 155 107 -13 41 200 -237 -149 126 -227 -231 5 -57 -130 -94 -297 -279 72 115 20 -52
3594e2P8J26k46L45j75K4l7q8Q3R9j70n6NK48j61k96K51K33j75k75j5K67ll67
$$ -52 26 152 -94 251 76 100 63 -25 58 157 -13 -69 -64 184 23 -273 -22 211 36 -239 -254 13 10 -357
3618c57K19J06ok26K39J99k26J32j46L84k59o2J15j1r7J61k10J01R0n2pN1j38
$$ -357 -138 -32 -38 -264 -25 174 -52 80 -66 318 59 -3 112 101 4 165 -45 56 146 94 87 138 0
3641@j5k9N4k02K71k28j40K71j00j75J16M4J43j66R7j22K68K93m47J47j44j59
$$ 0 -15 -44 10 -192 79 -149 -289 -18 -118 -293 -177 -133 10 -156 -59 -181 87 380 -67 80 -64 -223
3663b23N0l0N25j24l31q7O13j82k49o9K93K5k80j72Q7J36k94K50oJ44l07P5L28
$$ -223 -173 -203 322 198 -133 -220 393 211 -38 -107 186 211 -69 -241 -154 -18 -312 -62 -68 76 -231 -156 172
3686A72j26P4k40J1J62J00j01k32K32J49j16l12L11M6M4j17J25k4k62J2J60l13
$$ 172 46 120 -120 -109 53 153 52 -180 52 201 85 -227 84 130 174 57 182 158 -104 -92 68 -245
3708b45K99n49K60L09n8R5k04rm8J62j56J66k80L40k38J70L3J5k83K72J30P4l45
$$ -245 54 -495 -235 74 16 111 -93 -102 -150 12 -144 22 -258 82 -156 14 47 62 -221 51 181 255 -90
3731i0J47J95o5q6j11j10J85j12p1l0L97k89k17j45O74l04j15j51J22M9j52N6
$$ -90 57 252 187 101 -10 -120 65 -47 -118 -148 249 -40 -257 -402 272 -32 -147 -298 -176 -127 -279 -223
3753b23K61j06K15J17j41j5p7l6K39n2j74m1L39l39m6P1J95J5j0l00J05K97m39
$$ -223 38 -68 147 264 123 108 31 -5 234 182 8 -33 306 -33 -79 -8 187 202 192 -108 -3 294 -145
3776a45QJ05P2Oj87jj8K01l5Q3j25p7K4jj64L73K07l02q7J31Q1p2j76K89J8j39
$$ -145 -137 -32 40 46 -141 -142 -160 41 6 89 -36 -113 -89 -90 -254 119 326 24 -63 68 149 77 -99 190 208 69
3802F9j59J06J51l51KK50n6n6n1K07k48R8J38n0K29l00MP4J3Pr9K20J01l11R4
$$ 69 -90 16 167 -184 -182 68 12 -44 -95 112 -136 -38 100 50 279 -21 -17 57 70 77 -22 198 299 -12 82
3827H2j03l1L21j38l44J63L9%J70l25K04k1j33j17O8J43J28p5j30r9J63r1j31
$$ 82 -21 -52 269 131 -213 -50 -11 -11 159 -166 38 17 -116 -233 -165 -22 106 31 -99 -198 -35 -126 -257
3850b57K70j55j43L00R8j14j49K22j1L5p4M3J47j47R9j24J54j27J73k64j34M51
$$ -257 13 -142 -285 15 113 -1 -150 72 61 96 22 65 212 65 164 40 194 67 240 -24 -158 293
3872B93l83N5j17K2N7l01K89j50O2J27Oq8L33M5k73J44j5j58l3P9k7J79K2L0k21
$$ 293 -90 -35 -152 -130 -73 -374 -85 -235 -173 -46 -40 -128 205 250 -23 121 106 -52 -85 -6 -33 146 168 198 -23
3897b3P5nN6p5K8n1L1mm28K86R7o9j09m3K47Pj5l50J61J03J76k3l8j53J82L6J02
$$ -23 52 47 103 28 56 5 36 32 -396 -110 -13 -82 -191 -234 13 20 5 -345 -184 -81 95 72 34 -119 63 99 201
3924B01l09L96n0j54k69J07K79j17k98L15J90k50k54J30K35k32k3j4K27l65r5
$$ 201 -108 288 238 84 -185 -78 201 84 -214 101 291 41 -213 -83 152 -80 -103 -117 110 -255 -350
3945c50J37J72N7o2j49J68k0J15J16Q3k33q8j6J57q2J2N1j9M9k3q8j04J6j8J83
$$ -350 -213 -41 16 -46 -195 -27 -47 68 184 267 34 -54 -70 87 5 17 68 49 98 75 -13 -117 -101 -119 64
3970F4k43o5K51l4j16Q1K38j93n9o1N8J85k60J33J35j45J49j27K93l87KK3J18
$$ 64 -179 -244 7 -27 -143 -62 176 -17 -76 -137 -79 106 -154 -21 114 -31 118 -9 284 -103 -101 -78 40
3993D0J39j24l7j12J70n2l2L0o5j74K73k45J43k06NJ91L8n4p9M4lJ38M0j20j3
$$ 40 179 55 18 -94 76 24 -8 22 -43 -217 56 -189 -46 -252 -247 -56 -18 -72 -151 -107 -110 28 68 -52 -65
4018f5O4J70J8j84O9K9l17K16K22j1q7J6j99J47j60n7J47Q0l01m4L24k36L46k97
$$ -65 -1 169 187 3 72 101 -216 0 222 211 124 140 -59 88 -72 -129 18 98 -203 -247 77 -159 187 -110
4042a10J25p9n1N0M7j0J17k02l8K44J4k56J42Q8P5k36O2P0L1m0l14N1K70J9l66
$$ -110 15 -64 -115 -65 -18 -28 89 -113 -151 93 107 -149 -7 81 156 -80 -18 52 83 43 -271 -220 50 69 -297
4067b97M20n08M98l06J01M5j30Q3k12L42j34K3P4J45j95k7M1J85l02L1K23J65
$$ -297 123 -385 113 -193 -92 -47 -177 -94 -306 36 -98 -75 -1 144 -51 -78 -37 148 -154 -123 100 265
4089B65k12o5l7J7J70j02j09m0l0O6q4J86l1j27J98j52j3l5J47Jk08K21J65j58
$$ 265 53 -12 -49 -32 138 36 -73 -113 -143 -77 -161 25 -6 -133 65 -87 -100 -135 12 13 -195 26 191 33
4113C3J11q7Oj21L3L33ll33nR1L7rq8J80j95J79m07J74oJ36q8K12m03K60l67K73
$$ 33 144 57 63 -58 -25 308 305 -28 -33 58 95 86 -2 178 -17 162 -245 -71 -77 59 -29 183 -220 40 -327 -54
4139e4J51j66P1j29M5J36J32l26K54P0P7j03j31kJ24m5r0J04j38K03m06K32J70
$$ -54 97 -69 2 -127 -82 54 186 -140 114 184 261 158 27 25 149 104 14 118 -20 183 -223 9 179
4162A79j91J18j16r0N6q3R9N8j45l4J59R3j15j32J81J46k48j6K53q2j2j18J98
$$ 179 -12 106 -10 -100 -44 -127 -28 30 -115 -149 10 103 -12 -144 37 183 -65 -81 172 90 78 -40 158
4185A58j04J2j98K7J92q1K1k47L34j39M6j13k2j44L06K4l3q2J10m80K20K70q6
$$ 158 54 66 -132 -105 87 6 27 -220 114 -25 21 -92 -114 -258 48 72 39 -43 67 -413 -193 77 -9
4208iJ4J46N2j92K08j94k63L94k7k59J28J03j5j72R8M2J13k69Oj8J86k30L6n9
$$ -9 5 151 203 11 219 25 -238 156 129 -130 -2 101 86 -86 12 54 167 -102 -96 -114 72 -158 -122 -181
4232a81K20k14k9J19j8P4m1j0j63K46J15p5q6o2K53l58Q8M61k97J64n6j78J94
$$ -181 39 -175 -204 -85 -103 -29 -70 -80 -243 3 118 43 -43 -105 148 -210 -122 339 42 206 150 -28 166
4255A66l12J28J0n2j0k3J97j90K9k21J79M1p2K48j08JP5k47K27j26l4K47k40K18
$$ 166 -146 -18 -8 -60 -70 -93 104 -86 -57 -278 -99 -58 -130 118 10 11 86 -161 66 -60 -94 153 -87 131
4279A31l8j84J33j7Lj26K9k1L10l11K03l22K13p3O7n7J16q4m21M16J47j85n9J62
$$ 131 93 -91 42 25 28 -98 -69 -90 220 -91 112 -210 3 -70 -3 -60 56 -28 -449 -33 114 -71 -130 32
4303C2K1j80M5J2k0J58k93K04J9O4j05J88J0j72j17K94j66L7l44L20n9M0j22O7
$$ 32 53 -127 -82 -70 -90 68 -225 -21 -2 62 -43 145 155 -17 -134 160 -6 31 -313 7 -52 -12 -134 -67
4327f7J36j34n7J70j99K01J73j72R5j83P9q4K41j12j52Q4K5q3P8J90k2k60K41
$$ -67 69 -65 -122 48 -151 50 223 51 146 -37 42 -42 199 87 -65 19 44 -39 39 229 207 -53 188
4350A88j79n9j7j96M6J04J69q4j0M4j42J96k69l1J02J52O2j14j13L31k88K57j19
$$ 188 9 -50 -67 -263 -217 -113 56 -28 -38 6 -136 60 -209 -240 -138 14 76 -38 -151 180 -108 149 30
4373C0M9j6L55l45K38r5k06J62P5p7j79R7p8j58N1J67m31K78M2j4L6O4j49j47
$$ 30 79 63 418 73 311 216 10 172 247 170 -9 88 10 -148 -97 70 -361 -83 -41 -55 -19 45 -104 -251
4397b51J31K63q6m0j35J38j06k9L00j67lK31l37J52q6o5J43J3p7J47q9l6J49j44
$$ -251 -120 143 57 17 -118 20 -86 -115 185 18 15 246 -91 61 -25 -90 53 66 -11 136 47 11 160 16
4421A6O8l00L42j11j36%k55M98P8j89j6q3K48K9k84O8L02q4m78L59J04l90J15
$$ 16 84 -216 126 15 -121 -121 -376 122 200 11 -5 -88 160 189 -95 -27 275 191 -287 72 176 -214 -99
4444i9J44j25L17l86K86k59J89j32J26m7j33R4K5j28P6O8r3NK1N0j3R3oJ17l26
$$ -99 45 -80 237 -149 137 -122 67 -65 61 14 -119 -25 0 -128 -52 16 -77 -72 -51 -1 -14 79 73 190 -136
4469a36J20N6Q1k7N5j62N1j17j03J11J83j62M5Kj27m3K38j31J67J11o5l1L6m4
$$ -136 -16 40 121 94 149 -13 38 -79 -182 -71 112 -50 -5 -3 -130 -173 65 -66 101 212 147 116 152 108
4493A08k57J00J6oN5j26J70j03K5J41L1J34k99J95j72j39J70o3Q3k8j8j1r1%K82
$$ 108 -149 -49 -33 -39 16 -110 60 -43 -18 123 154 288 -11 184 12 -127 43 -20 63 35 17 6 -85 -85 197
4518A97J82l64n7Q5J22l61o7L15j98R1o7m7J53N2j39J13K1j09K90Ol74K84k90
$$ 197 379 15 -42 43 165 -196 -263 52 -146 -55 -122 -169 -16 36 -103 10 31 -78 212 218 -156 128 -162
4541a62J73K79j83l82K10K10k12J86K1J8q3k15K04k6L2p5J08Rk16j42N49j72k67
$$ -162 11 290 107 -275 -65 145 -67 119 140 158 75 -140 64 38 70 -5 103 112 -104 -246 303 131 -136
4564a36J24L2m7j71J84O9N4j71j32j09L98k08K20k8n4K31k92Q0Q5k50R9j9N6j62
$$ -136 -12 20 -27 -198 -14 55 109 -62 -194 -303 95 -113 107 79 25 256 -36 44 129 -121 -22 -41 15 -147
4588a47K03j06m8K25k01j9J19o8oKj75J93L3O3m9K9r6P2K48l57J97p1K49q5k25
$$ -147 56 -50 -98 127 -74 -93 26 -42 -48 -46 -221 -28 5 68 19 48 -48 24 272 -85 112 41 290 205 -20
4613b0j3M0Rj38J53p9N2k17J65J26n5N3j53J62k86L51M1k56J98k97K86J6j42k13
$$ -20 -33 7 16 -122 31 -48 4 -213 -48 78 23 76 -77 85 -201 150 191 -65 133 -164 122 138 -4 -217
4637b17l2L91J14j70L3k12J97n0k6o3L8L2k34L68j49j07K2J5p6R5o9M0P0l2j7
$$ -217 -249 142 256 86 119 -93 104 54 28 -35 3 35 -199 169 20 -87 -65 -50 -126 -31 -100 -60 10 -22 -39
4662c9J13j4Rr0L57k74M2j69j68J81q9L5J79l75K80p2J39j32j41L28K3r5j15j66
$$ -39 74 60 69 -21 336 62 104 -65 -233 -52 -141 -106 73 -302 -22 -94 45 -87 -228 100 123 28 -87 -253
4686b53J07J33J8P9k15J99j67Q8k48J99J37J82m6p1j99J54j29q2J79J71l74Q5
$$ -253 -146 -13 5 84 -131 68 -99 -11 -259 -60 77 259 213 142 -57 97 -32 -114 65 236 -138 -53
4708e3o2qK89m3j45K00m5k74J05J2Q1j33N3o1L08j5l12J76l4j58J92JJ99k99P6
$$ -53 -115 -123 166 123 -22 178 133 -141 -36 -24 57 -76 -23 -84 224 209 -103 73 39 -119 73 74 273 -26 50
4733E0q2j09K7L34m31L84j44kNn5Q3j22k6L80l50p5J03k4Q5j63J0j3rJ60J17j25
$$ 50 -32 -141 -114 220 -211 173 29 27 32 -23 60 -62 -88 292 -58 -133 -30 -54 31 -132 -122 -135 -144 16 133 8
4759HN1j52J92N8Q0l57j3K90k55K98p4J08m68K06m1J01P8k61j01L54k78L3Q4m2
$$ 8 59 -93 99 157 237 -120 -133 157 -98 200 126 234 -234 -28 -69 32 110 -151 -252 102 -176 -143 -59 -101
4783a01N2l2J80k89K33j9M2j09J0P5j56oJ27q7r8L00l15K55j15j2l7K00j04J26
$$ -101 -49 -81 99 -190 43 24 66 -43 -33 42 -114 -120 7 -80 -178 122 -193 62 -53 -65 -102 98 -6 120
4807A20j43k2NLP0R4p6r8j57M5L5K75k3r5p9J34o9l4K4N8j49P2m9O4k01K29pj98
$$ 120 -23 -45 -40 -37 33 127 51 -47 -204 -159 -124 151 128 33 -46 88 19 -15 9 67 -82 -10 -59 5 -196 33 26 -172
4835a72J32L6J84j14n5O3k55j06M6L61j24J39k87l1J45k1M0rj12K61m5J21j89
$$ -172 -40 -4 180 66 11 74 -181 -287 -241 120 -4 135 -152 -183 -38 -59 -19 -28 -140 121 76 197 8
4858HJ50q8o9j30J21l0J12J10k47J15Kj80J40j31K43k57p2o0J72J89n1k60L20
$$ 8 158 70 1 -129 -8 -38 74 184 -63 52 54 -126 14 -117 126 -131 -203 -263 -91 98 47 -213 107
4881A07j52j63L69j22K5j68K08m42L02o7J05J35k81M6L25k28N8j16j00K86l01
$$ 107 -45 -208 161 39 64 -104 104 -338 -36 -103 2 137 -144 -98 227 -1 57 -59 -159 127 -174
4902a74K52K6k16J00k9J15k42nL67R4l92L0JLK57j06Lk16J81Pj42lL5j47K46J45
$$ -174 78 104 -112 -12 -41 74 -168 -173 194 288 -104 -74 -73 -70 187 81 84 -132 49 56 -86 -89 -54 -201 45 190
4928A90k67j40L72j68p5N2J20Q0j34L0L0j41P5J47l20K58k14K45j50n4j34M07
$$ 190 -77 -217 155 -13 -88 -36 84 164 30 60 90 -51 24 171 -149 109 -105 140 -10 -64 -198 209
4950B09p1q1o5n9J24J2J02k06Q4j59P8J07o1j88K14k20J61O3M7l63L13J8K2R3
$$ 209 138 57 -8 -67 57 69 171 -35 49 -110 -32 75 14 -174 40 -180 -19 44 91 -272 41 59 81 174
4974A74j34M6q8n2p7K66j98K13l12N3J25r7O1J09j40q7J77Mk47K53o9j2K18j5
$$ 174 40 86 -2 -54 -131 135 -63 150 -162 -109 16 -81 -20 89 -51 -138 39 43 -204 49 -20 -32 186 171
4998A71j28j36L7p6K06k71R6k3m5J15Q9j38l2J88k64PL02l64J90J14j50J37j5
$$ 171 43 -93 -56 -132 74 -197 -101 -124 -169 -54 35 -103 -135 53 -211 -204 98 -266 -76 38 -112 25 10
5021A0l3JK71k01n9r5J23j32J50r1J56j13J06J20j56n5O2j1k57J04J40J40k35
$$ 10 -23 -22 249 48 -11 -106 17 -115 35 -56 100 -13 93 213 57 2 64 53 -204 -100 40 180 -55
5044e5J92Kj71J76j69J70m4q1L4Rk09J30p2J54r2j80J45J21r9Q4O3m1k05K43K6
$$ -55 137 139 -32 144 -25 145 101 20 54 63 -146 -16 -88 66 -26 -206 -61 60 -39 45 108 67 -138 105 131
5069A31j62j29K61o8PPk9l72L15j75K74j36J90j12j8O4j36k1J85K1j12n0J2J58
$$ 131 -31 -160 101 33 40 47 18 -354 -39 -214 60 -76 114 2 -16 48 -88 -109 76 97 -15 -65 -53 105
5093A05j90J32k52L90J19j25k11j25J01lJ04J11LP6k31k7J03M7P3k13q5P0J19
$$ 105 -85 47 -205 185 304 179 -32 -157 -56 -59 45 156 159 235 4 -23 80 127 200 -13 -98 -28 91
5116I1j91J56K71m56K14P2j27P5o3j60K87k46M6K10l46r1K69J50r1l5j65J48j26
$$ 91 -100 56 327 -129 85 157 30 105 42 -118 169 -77 -31 179 -167 -258 11 161 70 35 -130 18 -108
5139a08Q6j62K67j02J14K38m21K04q1Qq7l4Q3J7j25J61q2K5q6K26k78J0M0M6j3
$$ -108 -22 -184 83 -19 95 333 -88 116 35 43 -44 -78 5 22 -103 58 -24 1 -85 141 -137 -127 -87 -41 -54
5164e4R2l2j23L9K63j78j55J0K59j76K31k27JJ05o0k5k27K16j28O7J38jj59J56
$$ -54 38 6 -117 -78 185 7 -148 -138 121 -55 176 -51 -50 55 -5 -30 -257 -41 -169 -102 36 35 -124 32
5188C2M8j9L0J17m10M6p6K21k40L53j91j0J47k08L24k07J16J82l48J41n2N2M4
$$ 32 80 61 91 208 -202 -156 -232 -11 -251 102 -89 -99 48 -160 164 -43 73 255 -93 48 -4 48 92
5211I2j66J67n1j50K76j19M9o1MN2q7M4P1m46J07L63j02k04K14m4j94J1K14K14
$$ 92 -74 93 42 -108 168 49 98 37 41 93 6 50 121 -325 -218 145 43 -161 53 9 -185 -174 40 254
5235B54k59p7k1J40k49k6M25k71M7rL22j80j46k02N05r9R6k56J12L8k8j05J03
$$ 254 -5 -82 -103 37 -212 -238 187 -84 -37 -46 276 96 -50 -252 253 154 250 -6 106 144 116 11 114
5258A14Kl77L66m0j30J02n3O5n5J1l0M8R6j87J2K49%k57J54J08k04J03j36K14
$$ 114 116 -261 105 65 -65 37 -16 49 -6 5 -25 23 119 -68 -56 193 193 -64 90 198 -6 97 -39 175
5282A75k50J20n4j53M13k11q4J12k8m4m9j10L01k91J11r2q1K78l4k05R6J76j65
$$ 175 -75 45 -9 -162 251 40 -44 68 40 -4 -53 -163 138 -153 -42 -134 -215 63 29 -176 -80 96 -69
5305f9J20k36L85k54j30K50q1j13J59J83k09j04K53j98M3j04K97j70k39K13Q9
$$ -69 51 -185 200 -54 -184 66 -15 -128 31 214 5 -99 154 -44 -1 -105 192 22 -217 -4 85
5326H5P1l67O9O7l7J26j4l97N23k60J44P2O0l29L60k6k08J13j54L4j22M26k27
$$ 85 156 -211 -142 -75 -112 14 0 -397 126 -134 10 82 142 -187 173 147 -61 52 -102 -68 -190 236 9
5349In1K12mj36L8oj91J45nj94J08K21j43l8rK13l06M0R7R9j05j09j2k4K79j83
$$ 9 -42 170 166 30 68 62 -129 16 11 -183 -75 146 3 -35 -44 169 -137 -97 0 99 -6 -115 -127 -151 128 -55
5375e5O2J52j06k32q2L09J0k5J39j98L24k89j24J17M6p3PO2p2J85j09L2j86kR5
$$ -55 7 159 53 -179 -261 48 58 33 172 -26 298 9 -115 2 48 -25 -18 44 -28 157 48 80 -106 -108 -13
5400a3j9Q2n4P8J02j81j31J61j32L6j09K46O2L6l71J72K08j29oN9j18m1l9om2
$$ -13 -32 50 -4 74 176 -5 -136 25 -107 -71 -180 66 128 164 -207 -35 173 44 38 97 -21 -62 -101 -107 -149
5425a49P8o5L02j87J29k17j27M09lk74LP4m0J68M3K5n78N55m28J10M0J66o3M7
$$ -149 -71 -136 166 -21 108 -109 -236 173 170 -104 -101 -27 -67 101 144 169 -409 146 -282 -172 -132 34 -29 18
5449A8j25Nn5j45M77m00jK23J85k02J53j74M4p8q3K91k58J60O6K0j70J72j78k33
$$ 18 -107 -102 -157 -302 175 -225 -226 -3 182 -20 133 -41 3 -75 -158 133 -125 35 101 121 -49 123 -55 -288
5473b88J77K9P1J43j82Q2M1k66J84k9m4J09o5m0j8K81j94R6J04m36N5L54l2k40
$$ -288 -111 -82 -11 132 -50 32 73 -193 -9 -38 -82 27 -38 -78 -96 185 -9 87 191 -245 -190 164 132 -108
5497a08j78J92J63p6m3m8J96Q1j98R8N1j67m9J60k40Q0nO4P2J36q4q9J8J48kj96
$$ -108 -286 -94 69 -7 -50 -98 98 179 -19 79 130 -37 -86 74 -166 -86 -91 -27 45 181 97 8 26 174 172 -24
5523b4J42o8m4n4J57q7k22J88j37K56j08J1L9k12K57j94J51j51J6j30Q3L2Q9j70
$$ -24 118 50 6 -48 109 22 -200 -12 -149 107 -1 10 49 -163 94 -100 51 -100 -84 -214 -131 -99 -10 -180
5547a80J68J64j40j56J17j9Q9J01J26k52j60J44p6j23J86J57r5l4J87j42j39K44
$$ -180 -12 152 12 -144 -27 -46 43 144 270 18 -142 2 -74 -197 -11 146 51 17 204 62 -77 167
5569A67j11j27j00K58j49K7J98j14J38p7k37K51k33k7K50l63J94J68j62J37o6
$$ 167 56 -71 -171 87 -62 -35 163 49 187 110 -127 124 -109 -136 114 -249 -55 113 -49 88 22
5590B2N0j14Mr6K71k47r6K64p6N1j89L77J42j41n58K86m5q2J37o6J49K8n0q1l3
$$ 22 72 -42 -38 -134 137 -110 -206 58 -18 33 -156 221 363 222 -336 -50 -95 -177 -40 -106 43 71 21 -60 -93
5615i3L29j30l74K17J00j28J13K4r1M8M4m7j14K75m61L40j62K00j98J47j29Pm1
$$ -93 236 106 -268 -51 49 -79 34 58 -33 15 59 12 -102 173 -288 52 -110 90 -108 39 -90 -83 -124
5638a24J64J53k22j20Q7K18j79k6L45k80J28k01k00K39J67m3j56P9K26j99j49
$$ -124 40 193 -29 -149 -62 156 -23 -49 296 16 144 -57 -257 -18 149 106 -50 29 255 56 -93
$$ [...]
8191A29
##END NTUPLES=NMR FID
##END=
