##TITLE=1H_SL54a-Dau(f5-f5)
 CDCl3
 8 sc, 
 17.03.2022
##JCAMPDX= 6.0         $$ Bruker NMR JCAMP-DX V2.0
##DATA TYPE= NMR FID
##DATA CLASS= NTUPLES
##ORIGIN= UXNMR, Bruker Analytische Messtechnik GmbH
##OWNER= root
$$ XWIN-NMR		Version 3.5
$$ Thu Mar 17 13:58:04 2022 Russian Standard Time (UT+4h)  she@DPX200
##.OBSERVE FREQUENCY= 200.131346
##.OBSERVE NUCLEUS= ^1H
##.DELAY= (6, 6)
##.ACQUISITION MODE= SIMULTANEOUS
##.ACQUISITION SCHEME= undefined
##.AVERAGES= 8
##.DIGITISER RES= 18
##SPECTROMETER/DATA SYSTEM= spect
##.PULSE SEQUENCE= zg30
##.SOLVENT NAME= D2O
##.SHIFT REFERENCE= (INTERNAL, D2O, 0, 15.7039)
##AUDIT TRAIL= $$ (NUMBER, WHEN, WHO, WHERE, WHAT)
$$ ##TITLE= Audit trail, XWIN-NMR		Version 3.5
$$ ##JCAMPDX= 5.01
$$ ##ORIGIN= Bruker BioSpin GmbH
$$ ##OWNER= she
$$ F:/spectra/data/she/nmr/H-F/1/audita.txt
$$ ##AUDIT TRAIL=  $$ (NUMBER, WHEN, WHO, WHERE, WHAT)
(   1,<2022-03-17 13:56:49.20 +0400>,<she>,<DPX200>,
      <created by zg, POWCHK disabled, PULCHK disabled
       configuration hash MD5:
       00 E9 B6 7A A2 85 ED C7 34 08 36 98 17 FE 4E 26
       data hash MD5: 16K
       1F D2 3A 6B 9F 33 CC 40 EF A6 FA 42 4C F9 22 6F>)
$$ ##END=
$$ 
$$ hash MD5
$$ 35 16 70 35 B9 3B 3F A6 0D 46 D5 1C CD 54 74 DF
##$RELAX= 
##$RELAX= 
##$RELAX= 
##$RELAX= 
##$RELAX= 
##$RELAX= 
$$ Bruker specific parameters
$$ --------------------------
##$DU= <F:/spectra>
##$EXPNO= 1
##$NAME= <H-F>
##$PROCNO= 1
##$TYPE= <nmr>
##$USER= <she>
##$AMP= (0..31)
100 100 100 100 100 100 100 100 100 100 100 100 100 100 100 100 100 100 
100 100 100 100 100 100 100 100 100 100 100 100 100 100 
##$AQSEQ= 0
##$AQ_mod= 1
##$AUNM= <au_zg>
##$AUTOPOS= <>
##$BF1= 200.13
##$BF2= 200.13
##$BF3= 200.13
##$BF4= 200.13
##$BF5= 200.13
##$BF6= 200.13
##$BF7= 200.13
##$BF8= 200.13
##$BYTORDA= 1
##$CFDGTYP= 0
##$CFRGTYP= 5
##$CHEMSTR= <none>
##$CNST= (0..31)
1 1 145 1 1 1 1 1 1 1 1 1 1 1 1 1 1 1 1 1 1 1 1 1 1 1 1 1 1 1 1 1 
##$CPDPRG= <>
##$CPDPRG1= <>
##$CPDPRG2= <>
##$CPDPRG3= <>
##$CPDPRG4= <mlev>
##$CPDPRG5= <mlev>
##$CPDPRG6= <mlev>
##$CPDPRG7= <mlev>
##$CPDPRG8= <mlev>
##$CPDPRGB= <>
##$CPDPRGT= <>
##$D= (0..31)
0 1.2 0 0 0 0 0 0 0 0.06 0 0.03 0 0 0 0 0.0002 0 0 0 0 0 0 0 0 0 0 0 0 
0 0 0 
##$DATE= 1647511008
##$DBL= (0..7)
120 120 120 120 120 120 120 120 
##$DBP= (0..7)
150 150 150 150 150 150 150 150 
##$DBP07= 0
##$DBPNAM0= <>
##$DBPNAM1= <>
##$DBPNAM2= <>
##$DBPNAM3= <>
##$DBPNAM4= <>
##$DBPNAM5= <>
##$DBPNAM6= <>
##$DBPNAM7= <>
##$DBPOAL= (0..7)
0.5 0.5 0.5 0.5 0.5 0.5 0.5 0.5 
##$DBPOFFS= (0..7)
0 0 0 0 0 0 0 0 
##$DE= 6
##$DECBNUC= <off>
##$DECIM= 32
##$DECNUC= <off>
##$DECSTAT= 4
##$DIGMOD= 1
##$DIGTYP= 9
##$DL= (0..7)
0 120 120 120 120 120 120 120 
##$DP= (0..7)
150 150 150 150 150 150 150 150 
##$DP07= 0
##$DPNAME0= <>
##$DPNAME1= <>
##$DPNAME2= <>
##$DPNAME3= <>
##$DPNAME4= <>
##$DPNAME5= <>
##$DPNAME6= <>
##$DPNAME7= <>
##$DPOAL= (0..7)
0.5 0.5 0.5 0.5 0.5 0.5 0.5 0.5 
##$DPOFFS= (0..7)
0 0 0 0 0 0 0 0 
##$DQDMODE= 0
##$DR= 18
##$DS= 0
##$DSLIST= <SSSSSSSSSSSSSSS>
$$ [...]
##$SUBNAM2= <"">
##$SUBNAM3= <"">
##$SUBNAM4= <"">
##$SUBNAM5= <"">
##$SUBNAM6= <"">
##$SUBNAM7= <"">
##$SUBNAM8= <"">
##$SUBNAM9= <"">
##$SW= 18.0517287032376
##$SWIBOX= (0..15)
0 0 2 0 0 0 0 0 0 0 0 0 0 0 0 0 
##$SW_h= 3612.71676300578
##$TD= 16384
##$TD0= 1
##$TE= 0
##$TE2= 300
##$TE3= 300
##$TEG= 300
##$TL= (0..7)
0 120 120 120 120 120 120 120 
##$TP= (0..7)
150 150 150 150 150 150 150 150 
##$TP07= 0
##$TPNAME0= <>
##$TPNAME1= <>
##$TPNAME2= <>
##$TPNAME3= <>
##$TPNAME4= <>
##$TPNAME5= <>
##$TPNAME6= <>
##$TPNAME7= <>
##$TPOAL= (0..7)
0.5 0.5 0.5 0.5 0.5 0.5 0.5 0.5 
##$TPOFFS= (0..7)
0 0 0 0 0 0 0 0 
##$TUNHIN= 0
##$TUNHOUT= 0
##$TUNXOUT= 0
##$USERA1= <user>
##$USERA2= <user>
##$USERA3= <user>
##$USERA4= <user>
##$USERA5= <user>
##$V9= 5
##$VALIST= <valist>
##$VCLIST= <CCCCCCCCCCCCCCC>
##$VD= 0
##$VDLIST= <DDDDDDDDDDDDDDD>
##$VPLIST= <PPPPPPPPPPPPPPP>
##$VTLIST= <TTTTTTTTTTTTTTT>
##$WBST= 1024
##$WBSW= 4
##$XGAIN= (0..3)
0 0 0 0 
##$XL= 0
##$YL= 0
##$YMAX_a= 96778
##$YMIN_a= -184019
##$ZGOPTNS= <>
##$ZL1= 120
##$ZL2= 120
##$ZL3= 120
##$ZL4= 120
##$ABSF1= 10
##$ABSF2= 0
##$ABSG= 5
##$ABSL= 3
##$ALPHA= 0
##$AQORDER= 0
##$ASSFAC= 0
##$ASSFACI= 0
##$ASSFACX= 0
##$ASSWID= 0
##$AUNMP= <proc_1d>
##$AZFE= 0.1
##$AZFW= 0.1
##$BCFW= 1
##$BC_mod= 2
##$BYTORDP= 1
##$COROFFS= 0
##$CY= 11.3945322036743
##$DATMOD= 1
##$DC= 2
##$DFILT= <>
##$DTYPP= 0
##$F1P= 2.36226072786647
##$F2P= -0.459571619588291
##$FCOR= 0.5
##$FTSIZE= 0
##$FT_mod= 4
##$GAMMA= 1
##$GB= 0.15
##$INTBC= 1
##$INTSCL= 1
##$ISEN= 128
##$LB= 0.24
##$LEV0= 0
##$LPBIN= 0
##$MAXI= 10000
##$MC2= 0
##$MEAN= 0
##$ME_mod= 0
##$MI= 1.114404
##$NCOEF= 0
##$NC_proc= 0
##$NLEV= 6
##$NOISF1= 3.799351
##$NOISF2= 2.8
##$NSP= 1
##$NTH_PI= 0
##$NZP= 0
##$OFFSET= 15.70392
##$PC= 1
##$PHC0= -17314.15
##$PHC1= 17.80078
##$PH_mod= 1
##$PKNL= yes
##$PPARMOD= 0
##$PSCAL= 0
##$PSIGN= 0
##$REVERSE= no
##$SF= 200.130013532006
##$SI= 16384
##$SIGF1= 3
##$SIGF2= 2
##$SINO= 400
##$SIOLD= 16384
##$SREGLST= <1H.CDCl3>
##$SSB= 0
##$STSI= 0
##$STSR= 0
##$SW_p= 3612.71676300578
##$SYMM= 0
##$S_DEV= 0
##$TDeff= 0
##$TDoff= 0
##$TI= <>
##$TILT= no
##$TM1= 0
##$TM2= 0
##$TOPLEV= 0
##$USERP1= <user>
##$USERP2= <user>
##$USERP3= <user>
##$USERP4= <user>
##$USERP5= <user>
##$WDW= 1
##$XDIM= 8192
##$YMAX_p= 0
##$YMIN_p= 0
$$ End of Bruker specific parameters
$$ ---------------------------------
##NTUPLES= NMR FID
##VAR_NAME=  TIME,          FID/REAL,        FID/IMAG
##SYMBOL=    X,             R,               I
##VAR_TYPE=  INDEPENDENT,   DEPENDENT,       DEPENDENT
##VAR_FORM=  AFFN,          ASDF,            ASDF
##VAR_DIM=   8192,          8192,            8192
##UNITS=     SECONDS,       ARBITRARY UNITS, ARBITRARY UNITS
##FACTOR=    0.0002768,     1,               1
##FIRST=     0,             0,               0
##LAST=      2.2672688,     0,               0
##MIN=       0,             -184019,         0
##MAX=       2.2672688,     96778,           0
$$ Real data points
##PAGE= N=1
##DATA TABLE= (X++(R..R)), XYDATA
$$ [...]
$$ plain form
1947 589 76 68 599 -5 -308 225 -59 -1007 -321 686 -571 -1004 12 3 -1221 -430 262 -106 -453 -159
1967 -159 -200 272 451 -440 -180 1349 415 -787 416 1711 353 -401 484 550 -362 -376 -4 34 54 -633
1987 -633 -971 15 470 -868 -876 545 111 -1044 -319 299 -80 -457 501 275 98 340 257 -77 684 730
2007 730 -248 398 662 5 -139 657 331 -511 -56 224 -708 -509 198 -328 -792 -147 -268 -716 -72 -43
2027 -43 -250 -104 251 -850 -293 730 132 -455 636 810 -163 -443 834 557 -143 10 60 144 60 -434
2047 -434 -146 286 22 -940 -836 851 -211 -1140 -215 715 -664 -983 96 338 157 -5 -135 368 654
2066 654 -85 -425 912 1346 -443 -315 1285 402 -363 315 472 -420 -225 -145 36 -499 -62 -367 -607
2085 -607 -3 -500 -654 149 444 -469 -253 715 -267 -449 750 549 -431 40 912 517 -124 601 392 250
$$ packed form
1947E89n13qN31o04l03N33k84r48O86J007j257m33J016rj224P91O92l68l47K94
1967a59m1M72J79q91K60J529r34j202J203J295j358p54Q85O6r12j4L72L8K0o87
1987f33l38R86M55j338qJ421m34j155P25O18l79l77R58k26j77K42q3l34P61M6
2007G30r78O46K64o57j44P96l26q42M55K80r32J99P07n26m64O45j21m48O44K9
2027d3k07J46L55j101N57J023n98n87J091J74r73k80J277k77p00J53N0Q4q4m94
2047d34K88M32k64r62J04J687j062r29R25R30j379l19J079K42j81j62j30N03K86
2066F54p39l40J337M34j789J28J600q83p65O78J57q92J95Q0J81n35M37l05k40
2085f07O04m97j54Q03K95r13K16R68r82j82J199k01r80M71Q72l95o41P25k09j42
$$ plain form
2105 250 317 -184 -503 343 171 -741 56 149 -926 -1123 219 175 -848 -508 123 -210 -616 -374 100 467
2125 467 337 -457 -318 956 544 -572 305 1291 204 -674 373 615 150 -383 -7 198 -343 -269 -659
2144 -659 23 408 -797 -879 -18 279 -890 -516 394 -64 -491 33 513 96 307 396 156 163 424 -8 315
2165 315 826 79 -146 533 514 -701 -46 516 -572 -614 -25 -261 -684 -239 -158 -221 -245 -479 -335 244 393
2186 393 -409 -235 930 154 -505 510 1138 167 -346 640 551 -204 -319 552 426 104 -354 -486 335 98
2206 98 -848 -674 275 -205 -1326 -340 765 -103 -814 21 439 -108 -335 92 568 722 -34 -174 555 695
2226 695 -165 -7 781 729 -486 -54 556 62 -376 49 -268 -570 -496 -481 -381 -164 -370 -335 -205 178 -251
2247 -251 -160 329 193 -268 280 724 34 -124 882 589 -123 42 360 328 15 23 -119 207 109 -573 -184
$$ packed form
2105B50O7n01l19Q46j72r12P97R3j075j97J342m4j023L40O31l33m06K42M74L67
2125D67j30p94J39J274m12j116Q77R86j087q78J047K42m65n33L76K05n41P4l90
2144f59O82L85j205q2Q61K97j169L74R10m58m27N24M80m17K11Q9k40PK61m32L23
2165C15N11p47k25O79j9j215O55N62j088m2N89k36m23M45Q1o3k4k34J44N79J49
2186C93q02J74J165p76o59J015O28r71n13R86q9p55j15Q71j26l22m58j32Q21k37
2206I8r46J74R49m80j121R86J105q68p11Q35M18n47k27M27M76J54p56j40P29J40
2226F95q60J58P88n2j215M32O10m94m38M25l17l02P4J5J00K17k06L5J30L83m29
2247b51R1M89j36m61N48M44o90j58J006k93p12J65L18l2l13Qj42L26r8o82L89
$$ plain form
2268 -184 332 -330 -1239 -238 193 -776 -969 194 113 -225 -458 87 230 214 -106 -14 910 554 -551 59
2288 59 934 419 -509 49 981 -4 -546 187 376 8 -386 -407 -104 259 -551 -845 -15 14 -1044 -834 342
2309 342 -42 -554 205 627 -288 94 608 301 578 795 74 102 591 274 267 641 361 -504 -207 450 -252
2330 -252 -634 116 232 -824 -875 76 -400 -407 -260 -251 -58 49 -321 45 788 406 -336 269 874 -76 -614
2351 -614 623 892 -30 -483 243 223 56 -325 -258 87 -45 -921 -736 394 30 -1166 -376 597 -310 -784
2371 -784 52 496 -15 -350 354 43 411 66 251 587 666 203 -143 795 540 -412 -15 475 -286 -682
2391 -682 -119 -97 -456 -431 13 -441 -361 -289 -334 -40 101 -107 -458 145 -201 -245 471 721 -179 -173 604 490 -194
2414 -194 325 487 283 -250 -90 38 335 103 -597 -529 230 -304 -1181 -86 358 -643 -958 104 257
$$ packed form
2268a84N16o62r09J001M31r69j93J163q1l38k33N45J43j6l20R2R24l56j105O10
2288E9Q75n15r28N58R32r85n42P33J89l68l94k1L03L63q10k94Q30K9j058K10J176
2309C42l84n12P59M22r15L82N14l07K77K17p21K8M89l17pL74k80q65K97O57p02
2330b52l82P50J16j056n1R51m76pJ47RJ93J07l70L66P43l82p42O05O05r50n38
2351f14J237K69r22m53P26k0j67l81O7L45j32q76J85J130l64j196P90R73r07m74
2371g84Q36M44n11l35P04l11L68l45J85L36P9m63l46R38k55r52L97M90p61l96
2391f82N63K2l59K5M44m54Q0P2m5K94J41k08l51O03l46m4P16K50r00OP77j14o84
2414a94N19J62k04n33J60J28K97k32p00O8P59n34q77J095M44j001l15J062J53
$$ plain form
2433 257 -449 -410 165 467 210 -123 252 837 303 -190 188 1026 470 -555 120 916 97 -669 52 80
2453 80 -332 -296 -319 -95 -65 -594 -989 129 237 -747 -220 476 -126 -759 77 501 57 -21 605 287 140
2474 140 353 335 348 393 -92 4 479 202 -294 -169 464 -319 -934 -104 194 -541 -667 315 -18 -500 -401 31
2496 31 53 -79 84 -208 435 143 -435 232 1338 166 -481 537 839 75 -397 140 481 -63 -482 -139
2516 -139 73 -49 -476 -387 309 -124 -819 -350 410 -98 -857 -165 436 -312 -369 27 522 393 -27 47 491
2537 491 640 57 107 381 522 -384 26 336 167 -579 71 310 -674 -477 -37 -359 -384 33 -458 -174 15
2558 15 -293 -261 350 73 -482 248 770 -8 -323 445 529 -303 23 548 533 54 -100 77 7 -161 -513 -160
2580 -160 235 -278 -989 -282 516 -576 -652 231 348 -404 -426 92 588 159 -123 -80 559 544 -108 115 1101
$$ packed form
2433B57p06L9N75L02k57l33L75N85n34m93L78Q38n56j025O75P96q19p66P21K8
2453H0m12L6k3K24L0n29l95J118J08r84N27O96o02o33Q36M24m44p8O26l18j47
2474A40K13j8J3M5m85R6M75k77m96J25O33p83o15Q30K98p35j26R82l33m82R9M32
2496C1K2j32J63k92O43k92n78O67J106j172o47J018L02p64m72N37L41n44m19L43
2516a39K12j22m27Q9O96m33o95M69P60n08p59O92O01p48n7L96M95j29m20P4M44
2537D91J49n83N0K74J41r06M10L10j69p46O50K39r84J97M40l22k5M17m91K84J89
2558A5l08L2O11k77n55P30N22p78l15P68Q4q32L26N25j5m79j54J77p0j68l52L53
2580a60L95n13p11P07P98j092p6Q83J17p52k2N18M96m29k82M3O39j5o52K23R86
$$ plain form
2601 1101 446 -598 82 814 310 -533 287 338 -263 -512 -123 -337 -32 -337 -562 -141 33 -401 -319 533
2621 533 -45 -459 -144 415 -41 -375 473 373 104 -20 492 196 223 286 -119 512 307 -247 -286 226 -215
2642 -215 -563 143 536 -386 -674 329 340 -678 -382 40 396 89 -57 27 480 60 -257 -51 1168 416
2662 416 -431 474 774 -32 -680 282 437 -302 -340 -79 202 79 -498 -362 377 212 -698 -482 648 54
2682 54 -648 169 467 -82 -305 209 392 194 102 342 315 606 217 2 391 270 -65 -73 371 152 -465 -20
2704 -20 189 -575 -522 -106 -248 -254 -366 133 -241 -344 -285 -130 38 252 31 160 629 174 -534 491 979
2725 979 -167 -120 581 343 -255 -127 184 241 -194 -268 -363 68 -130 -575 -373 241 -309 -1134 -55 445 -405
2746 -405 -471 174 187 236 -39 166 265 581 -44 -154 800 411 -443 203 412 218 -491 -32 262 -259 -236 -101
$$ packed form
2601A101o55j044O80P32n04q43Q20N1o01k49L89k14L05l05k25M21J74m34Q2Q52
2621E33n78m14L15N59m56l34Q48j00k69j24N12k96K7O3m05O31k05n54l9N12m41
2642b15l48P06L93r22k88J003J1j018K96M22L56l07j46Q4M53m20l17K06J219p52
2662D16q47R05L00q06o48R62J55p39l8K61K81j23n77J36P39j65r10K16J130n94
2682E4p02Q17K98n49k23N14J83j98r2K40k7K91l89k15L89j21l35qM44k19o17M45
2704b0K09p64N3M16j42oj12M99l74j03N9J55J68K14k21J29M69m55p08J025M88
2725I79j146M7P01k38n98J28L11N7m35p4r5M31j98m45K02O14n50q25J079N00q50
2746d05o6O45J3M9k75K05R9L16o25j10R54l89q54O46K09j94p09M59K94n21K3J35
$$ plain form
2768 -101 195 14 -470 -240 -152 -18 -198 -578 324 115 -442 -99 554 76 -401 207 566 -95 341 592
2788 592 97 -2 229 170 146 151 -249 -109 368 -206 -824 -95 345 -529 -825 191 395 -498 -628 143 -35
2809 -35 -174 -34 -127 387 403 50 68 635 564 -260 120 818 70 -319 396 60 -51 -104 -9 153 -210 -313
2831 -313 -324 166 -87 -541 -498 484 79 -731 -3 507 66 -363 431 372 68 -192 329 223 375 19 148
2852 148 401 126 139 -26 537 -46 -287 -27 292 -307 -507 65 94 -98 -441 -240 -143 -281 -363 135 160 -103
2874 -103 -237 174 611 119 -261 191 793 -200 -334 622 562 -182 -228 -43 219 -11 -415 -300 25 -224 -780
2895 -780 -220 543 -75 -863 15 372 -313 -467 138 256 21 -96 203 317 257 -102 182 492 280 -421
2915 -421 -32 589 216 -450 59 560 48 -622 -59 267 -200 -302 -315 -123 -386 -184 -364 63 97 -405 -34
$$ packed form
2768a01K96j81m84K30Q8J34j80l80R02k09n57L43O53m78m77O08L59o61M36K51
2788E92m95r9K31n9k4Nm00J40M77n74o18P29M40q74k96J016K04q93j30P71j78
2809c5j39J40r3N14J6l53J8N67p1q24L80O98p48l89P15l36j11n3R5J62l63j03
2831c13j1M90k53m54M3R82m05q10P28N10m41m29P94n9l04k60N21j06J52l56J29
2852A48K53k75J3j65N63n83k41K60L19n99k00N72K9j92l43K01R7j38q2M98K5k63
2874a03j34M11M37m92l80M52O02r93j34R56o0p44m6J85K62k30m04J15L25k49n56
2895g80N60P63o18p88Q78L57o85j54O05J18k35j17K99J14o0l59K84L10k12p01
2915d21L89O21l73o66N09N01n12o70N63L26m67j02j3J92k63K02j80M27L4n02L71
$$ plain form
2936 -34 453 49 -302 524 516 43 -63 509 449 135 214 321 196 133 -370 -189 410 -207 -602 62 27 -316
2958 -316 -795 274 319 -437 -483 -84 176 -22 120 284 476 274 12 136 440 184 -249 -2 767 20
2978 20 -515 222 474 -133 -348 349 206 -205 -291 -275 68 -46 -541 -423 112 7 -621 -60 448 98 -418
2999 -418 -18 430 159 72 407 486 145 176 -41 290 330 -81 -185 400 29 -229 -17 362 -241 -376 67
3020 67 170 -309 -68 153 -118 -415 -221 83 -109 357 -314 75 730 209 -417 283 798 237 -122 412
3040 412 176 -16 -134 447 347 -115 -246 -209 -188 7 -456 -271 651 -253 -425 56 574 -206 -519 -18 354
3061 354 -187 -127 102 370 182 -55 17 280 517 126 119 779 365 -369 95 322 -130 -402 -112 -67 -562 -462
3083 -462 -325 -85 -20 -316 -457 58 120 -406 60 498 92 -418 505 469 91 -380 480 165 95 249 74
$$ packed form
2936c4M87m04l51Q26qm73j06N72o0l14P9J07j25o3n03J81N99o17l95O64l5l43
2958c16m79J069M5p56m6L99K60j98J42J64J92k02k62J24L04k56m33K47P69p47
2978B0n35P37K52o07k15O97j43m11q6J6L43j14m95J18N35j05o28N61N08l50n16
2999d18M00M48k71q7L35P9l41L1k17L31M0m11j04N85l71k58K12L79o03j35M43
3020F7J03m79K41K21k71k97J94L04j92M66o71L89O55n21o26P00N15n61l59N34
3040D12k36j92j18N81j00m62j31L7K1J95m63J85R22r04j72M81N18p80l13N01L72
3061C54n41O0K29K68j88k37P2K63K37l91pO60m14p34M64K27m52k72K90M5m95J00
3083d62J37K40O5k96j41N15O2n26M66M38m06n10R23l6l78m71Q60l15p0J54j75
$$ plain form
3104 74 130 160 -113 89 147 -245 -479 -130 156 -109 -757 36 -67 -559 -438 123 12 -225 -285 206 391 190
3126 190 -48 -95 659 310 -314 54 925 -16 -434 105 709 -152 -331 35 78 -214 -144 -168 -228 -46 -359 -595
3148 -595 -54 -77 -665 -104 392 249 -403 117 396 -97 56 237 219 73 349 216 351 265 255 -234 363
3169 363 131 -376 -234 375 -113 -432 98 188 -340 -692 64 -194 -237 -302 79 12 -58 -151 48 511 173 -443
3191 -443 253 655 -88 -295 657 567 -315 99 236 231 -147 -157 -137 254 -227 -586 -350 93 3 -947 97 299
3213 299 -80 -578 58 484 -122 -24 291 501 -53 194 234 201 613 150 -106 788 84 -332 249 176 -482
3234 -482 -223 1 241 -204 -265 -117 -185 116 -163 -420 -186 31 -174 -202 368 190 -303 288 644 85 -128
3255 -128 636 231 172 -4 90 40 -170 -65 -170 104 -36 -198 -246 35 -170 -570 74 167 -445 -730 122 425
$$ packed form
3104G4N6L0k73K02N8l92k34L49K86k65o48P93j03m92J21N61j11k37o0M91J85k01
3126A90k38m7P54l49o24L68Q71r41m18N39O04q61j79L66M3k92P0k4o0J82l13k36
3148e95N41k3n88N61M96j43o52N20K79m93J53J81j8j46K76j33J35q6j0m89N97
3169C63k32n07J42O09m88l19N30R0n28l52P56k58m3o5L81o7p0r3J99M63l38o16
3191d43O96M02p43k07R52r0q82M14J37nl78j0K0L91m81l59K36M43r0r50J044K02
3213B99l79m98O36M26o06R8L15K10n54K47M0l3M12m63k56Q94p04m16N81p3o58
3234d82K59K24K40m45o1J48o8L01k79k57K34K17k05k8N70j78m93N91L56n59k13
3255a28P64m05n9j76R4n0k10J05j05K74j40j62m8K81k05m00O44R3o12k85Q52L03
$$ plain form
3277 425 -389 -224 -230 167 10 14 169 521 195 7 98 615 471 -372 100 431 -82 -395 20 378 -378 -384
3299 -384 -148 -33 -2 -401 -292 208 124 -333 -169 290 120 -108 -55 498 38 -216 490 193 147 148 266 63
3321 63 155 9 -93 227 207 -313 -56 -20 -290 -393 48 112 -471 -241 -1 258 -281 -152 250 7 62 -84
3343 -84 80 66 -59 -70 282 709 55 -230 350 728 -127 -174 321 159 82 -147 -18 409 276 -490 -276 14
3365 14 -55 -660 -224 452 69 -486 332 363 -90 -197 503 452 51 268 -155 81 230 -183 -37 493 439 43
3387 43 -189 527 57 -365 -2 86 -504 -262 -182 -207 -485 -84 39 -37 -104 17 -230 267 77 -137 12 347
3409 347 268 54 421 654 73 -69 84 270 31 -230 214 -119 23 -432 -235 408 -142 -775 49 -3 -172
3430 -172 -416 -73 245 -168 -173 73 294 19 -209 345 590 138 -116 108 469 216 -133 224 454 -16 -339
$$ packed form
3277D25q14J65oL97j57MJ55L52l26j88R1N17j44q43M72L31n13l13M15L58p56o
3299c84K36J15L1l99J09N00q4m57J64M59j70k28N3N53m60k54P06k97m6JJ18k03
3321F3R2j46j02L20k0n20K57L6k70j03M41O4n83K30K40K59n39J29M02k43N5j46
3343h4J64j4j25j1L52M27o54k85N80L78q55m7M95j62p7k29J29M27j33p66K14K90
3365A4o9o05M36O76l83n55Q18L1m53j07P00n1m01K17m23K36J49m13J46N30n4l96
3387D3k32P16m70m22L63Q8n90K42Q0k5k78M01J23p6o7J21k47M97j90k14J49L35
3409C47p9k14L67K33n81j42J53J86k39k61M44l33J42m55J97O43n50o33Q24n2j69
3430a72k44L43L18m13nK46K21k75k28N54K45m52k54K24L61k53l49L57K30m70l23
$$ plain form
3451 -339 367 326 -198 -377 -133 -26 -49 -301 -194 5 -173 -382 -167 194 179 -408 89 332 255 82 303
3472 303 261 -27 82 161 -43 190 -71 22 134 0 -312 -223 252 -126 -694 29 252 -431 -417 163 81 -311
3494 -311 -128 92 -114 -178 -76 -82 385 155 -145 -83 561 202 -293 263 660 -238 -473 304 41 -6 -238 93
3516 93 265 -132 -411 -273 203 -169 -540 -376 77 -122 -487 43 111 -123 -72 43 213 0 140 272 613
3537 613 -54 -145 133 232 -2 -340 188 -238 -83 -234 -10 196 -371 -202 -75 -170 -459 -246 89 -167 -207
3558 -207 -166 -369 184 429 -74 86 425 -46 -34 348 468 48 -114 185 258 60 -141 201 342 -269 -16
3579 -16 -172 123 -324 -353 46 264 -198 -260 368 288 -134 -176 248 202 38 40 341 293 332 -70 35 398 328 -455
3603 -455 166 504 -111 -370 69 263 -102 65 156 -366 -202 -81 -226 71 4 -95 -110 186 159 -318 121 414
$$ packed form
3451c39P06m1n24j79K44J07k3k52J07J99j78k09K15L61j5n87M97K43p7j73K21
3472C03m2k88J09P9k04K33k61R3J12j34l12Q9M75l78n68P23K23o83J4N80q2l92
3494c11J83K20k06o4J02oM67k30l00O2O44l59m95N56L97q98k35P77k63m7k32L31
3516I3J72l97k79J38M76l72l71J64M53j99l65N30O8k34N1J15J70k13J40J32L41
3537F13o67r1K78R9k34l38N28m26J55j51K24K06n67J69J27r5k89K13L35k56m0
3558b07M1k03N53K45n03J60L39m71J2L82J20m20j62K99P3j98k01L42J41o11K53
3579a6j56K95m47k9L99K18m62o2O28q0m22m2M24m6j64KL01m8L9m02J05L63p0p83
3603d55O21L38o15k59M39J94l65J67R1n22J64J21j45K97o7r9j5K96k7m77M39K93
$$ plain form
3625 414 -51 -289 379 318 90 -44 130 387 -85 60 172 -26 21 -84 -121 334 -63 -402 183 224 -265
3646 -265 -300 296 -22 -195 -411 208 98 -202 26 235 387 173 -131 201 679 185 17 316 566 -45
3666 -45 -117 221 102 -206 -148 -202 110 -298 -388 -158 5 45 -534 -236 435 -59 -391 -82 304 -15 -212 230
3688 230 196 -150 -93 223 356 296 -45 68 235 192 120 52 377 35 -363 -14 149 -387 -288 40 -146 -339
3710 -339 -145 62 -199 27 -186 84 194 25 -175 -34 406 109 60 473 240 -86 -216 377 328 -322 -2
3731 -2 163 106 -15 -31 -420 -31 -101 -728 -331 139 5 -448 123 153 -369 -486 166 223 -53 144 320 52
3753 52 78 177 17 357 187 -204 -137 259 -72 -147 -207 71 -160 -166 -128 15 8 -426 -95 -124 -15 -12 112 -84 22
3778 22 -180 126 257 30 -209 515 451 -113 94 342 303 106 50 148 7 105 -57 -188 -6 -287 -241 10
$$ packed form
3625D14m65k38O68o1k28j34J74K57m72J45J12j98M7j05l7M55l97l39N85M1m89
3646b65l5N96l18j73k16O19j10l00K28K09J52k14l04L32M78m94j68K99K50o11
3666d5p2L38j19l08N8n4L12m08r0K30J63M0n79K98O71m94l32L09L86l19j97M42
3688B30l4l46N7L16J33o0l41J13J67m3p2o8L25l42l98L49J63n36R9L28j86j93
3710c39J94K07k61K26k13K70J10j69k00J41M40k97m9M13k33l26j30N93m9o50L20
3731bJ65n7j21j6l89L89p0o27L97M70j34m53N71L0n22j17O52N7k76J97J76k68
3753E2K6R9j60L40j70l91O7L96l31p5o0K78k31oL8J43pm34L31k9J09LJ24j96J06
3778B2k02L06J31k27k39P24o4n64K07K48l9j97n6R8j41R8j62j31J82k81M6K51
$$ plain form
3800 10 99 -393 -324 379 228 -380 -151 104 26 -362 -92 -152 205 5 -11 160 509 10 -112 256 464 16
3822 16 -366 146 387 -301 -373 183 312 49 -327 -110 -148 -33 -134 -338 166 -159 -196 -41 359 60 -157
3843 -157 264 238 43 -136 302 340 -1 12 72 102 278 -200 -181 -26 -169 -423 202 -9 -121 -361 -103 11
3865 11 -364 -185 184 -77 -461 76 -283 274 -111 -125 194 194 -79 -177 325 354 -184 -139 136 438 -59 2 11
3888 11 193 -189 1 204 -117 160 -266 -167 334 -190 -468 -45 -79 -105 -111 105 383 -16 25 394 224 55
3910 55 -159 162 237 -59 24 -8 214 -39 -178 -18 35 -332 -194 34 -154 -68 9 -216 -177 45 9 -243 284
3933 284 -164 -293 -13 297 -75 -139 -11 255 -131 -28 322 281 -86 -20 103 11 55 4 81 -2 -105 -220 32
3956 32 -16 -199 -323 -12 -324 -391 -101 -35 200 -144 3 307 313 190 -116 27 316 134 -228 57 329 -99
$$ packed form
3800A0Q9m92O9P03j51o08K29K55p8l88K70o0L57k00j6J71L49m99j22L68K08m48
3822A6l82N12K41o88p2N56J29k63l76K17l8J15j01k04N04l25l7J55M00k99k17
3843a57M21k6j95j79M38L8l41J3O0L0J76m78J9J55j43k54O25k11j12k40K58J14
3865A1l75J79L69k61l84N37l59N57l85j4L19%k73r8N02K9n38M5K75L02m97O1R
3888A1J82l82J90K03l21K77m26R9N01n24k78M23l4k6oK16K78l99M1L69j70j69
3910E5k14L21P5k96Q3l2K22k53j39J60N3l67J38K28j88Q6P7k25L9K22l6k52N27
3933B84m48j29K80L10l72o4J28K66l86J03L50m1l67O6J23r2M4n1P7q3j03j15K52
3956C2m8j83j24L11l12o7K90O6K35l44J47L04Oj23l06J43K89j82l62K85K72m28
$$ plain form
3978 -99 -168 254 162 -212 -271 201 246 -196 -605 -132 -131 -279 -294 -78 258 -260 -211 -19 205 -97 -291 297 257
4001 257 20 56 335 39 177 75 -66 189 -54 72 82 65 -58 -197 94 180 -175 -375 -32 -124 -66 -216
4023 -216 -20 -189 -307 -50 21 9 -268 29 20 509 -2 -196 104 487 5 -124 363 452 -195 -79 148 72
4045 72 -228 -61 86 108 -343 -243 -495 -87 24 -516 30 259 31 -131 154 357 -170 87 139 22 -148
4066 -148 -7 174 290 327 -194 131 484 55 -260 242 403 -370 -266 103 -43 -314 -245 -195 -166 -112 -139 34
4088 34 66 -119 -270 86 362 166 58 215 122 213 127 410 342 -190 -40 287 -190 -65 -183 8 -117 85
4110 85 -164 102 199 -402 -166 -43 112 -86 -313 239 202 68 -141 143 199 -110 166 161 339 119 -367 123
4132 123 277 193 -248 -10 490 -128 -160 -83 43 -205 -42 110 -133 -312 -159 -293 -126 -62 -381 -43 91
$$ packed form
3978i9o9M22r2l74n9M72M5m42m09M73Jj48j5K16L36n18M9J92K24l02j94N88m0
4001B57k37L6K79k96J38j02j41K55k43J26J0j7j23j39K91Q6l55k00L43r2N8j50
4023b16J96j69j18K57P1j2k77K97rM89n11j94L00L83m82j29M87Q9o47J16K27p6
4045G2l00J67J47K2m51J00k52M08J11n40N46K29k28j62K85K03n27K57N2j17j70
4066a48J41J81J16L7n21L25L53m29l15N02J61p73J04L69j46k71O9N0K9N4k7J73
4088C4L2j85j51L56K76j96j08J57r3R1q6K83o8n32J50L27m77J25j18J91j25K02
4110H5k49K66R7o01K36J23J55j98k27N52l7j34k09K84N6l09K76nJ78k20m86M90
4132A23J54q4m41K38N00o18l2P7J26k48J63J52k43j79J53j34J67O4l19L38J34
$$ plain form
4153 91 -145 -60 246 418 -109 198 149 221 -28 219 195 238 149 120 -112 397 29 -127 15 46 -125 -349 -156
4176 -156 -372 -110 -124 52 -111 -138 -251 -136 127 -272 -32 97 294 164 -70 70 300 151 -292 414 146
4197 146 -134 -124 34 227 -269 -239 226 -79 28 -238 -37 352 -135 -150 161 184 -181 -207 265 166 259 -116
4219 -116 264 121 85 115 -19 415 156 7 -99 547 193 -85 265 251 21 -259 -113 136 -328 -204 51
4240 51 -214 -95 -268 -185 -169 -98 -76 176 239 177 -26 330 165 -33 259 335 291 -147 -68 55 26 -45 -262 49
4264 49 -137 83 -412 -239 83 -164 -444 -86 336 -260 -363 -15 23 -194 -250 -51 -24 58 263 264 288 274 -393
4287 -393 271 337 82 -217 123 184 -241 -2 -10 240 -96 -204 -193 -20 -208 -415 -74 -2 45 8 -131 -30 56
4310 56 -335 81 381 57 192 451 154 -102 58 338 81 41 -320 88 -4 -41 -58 43 240 -124 -231 -136
$$ packed form
4153I1k36Q5L06J72n27L07m9P2k49K47k4M3q9k9k32N09l68j56J42L1j71k24J93
4176a56k16K62j4J76j63k7j13J15K63l99K40J29J97j30k34J40K30j49m43P06k68
4197A46k80J0J58J93m96L0M65l05J07k66K01L89m87j5L11K3l65k6M72r9R3l75
4219a16L80j43l6L0j34M34k59j49j06O46l54k78L50j4k30k80J46K49m64J24K55
4240E1k65J19j73Q3J6P1K2K52O3o2k03L56j65j98K92P6m4m38P9J23k9p1k17L11
4264D9j86K20m95J73L22k47k80L58M22n96j03L48L8k17n6J99K7Q2K05JK4j4o67
4287c93O64O6k55k99L40O1m25K39qK50l36j08J1J73j88k07L41P2M7l7j39J01Q6
4310E6l91M16L00l24J35K59k97k56J60K80k57m0l61M08r2l7j7J01J97l64j07R5
$$ plain form
4332 -136 -99 -286 -153 148 -217 -183 -203 26 343 -79 -258 -145 27 18 -45 369 80 48 -86 362 493 70
4354 70 -123 270 275 -402 -249 42 31 -174 -295 26 -12 -95 -260 -125 -21 -141 -236 181 65 334 -107 45
4376 45 204 242 117 123 -89 304 -200 143 69 9 -171 160 131 -122 -222 162 -67 -325 112 -66 -132 -338 40
4399 40 -55 59 66 -186 -15 0 -159 -415 50 439 38 -175 386 185 130 308 404 145 -6 -103 166 63 -95
4422 -95 -54 -34 -8 -114 -392 293 146 -356 -182 292 361 0 -72 115 281 180 -99 275 108 256 73 55
4444 55 280 162 -75 78 -35 -121 -321 -1 -5 -13 -42 30 -5 -219 -142 -6 112 -103 126 -107 148 -26 -27 -201
4468 -201 179 -72 -54 156 137 -106 48 186 365 193 -7 231 -175 -112 124 59 57 -215 -418 -145 -150 -163 -122
4491 -122 -224 123 -269 33 215 -17 -55 84 65 67 -186 221 346 198 -180 -201 331 148 -228 -239 201 163
$$ packed form
4332a36L7j87J33L01l65L4k0K29L17m22j79J13J72ro3M14k89l2j34M48J31m23
4354G0j93L93No77J53K91j1k05j21L21l8q3j65J35J04j20r5M17j16K69m41J52
4376D5J59L8j25Ok12L93n04L43p4o0j80L31k9k53j00L84k29k58M37j78o6k06L78
4399D0r5J14Pk52J71J5j59k56M65L89m01k13N61k01n5J78R6k59j51r7K69j03j58
4422i5M1K0K6j06k78O85j47n02J74M74O9l61p2J87J66j01k79L74j67J48j83j8
4444E5K25j18k37J53j13q6k00L20mqk9P2l5k14P7J36J18k15K29k33K55j74jj74
4468b01L80k51J8K10j9k43J54J38J79j72k00K38m06O3K36o5kk72k03K73nj3M1
4491a22j02L47l92L02J82k32l8J39j9Kk53M07J25j48l78k1N32j83l76j1M40l8
$$ plain form
4513 163 -275 -122 -15 20 -170 -183 86 -76 87 -298 -259 -21 -83 -150 10 137 149 -6 191 251 -193 -58
4535 -58 245 236 -115 -40 194 188 -82 -220 -10 466 -230 -137 -17 -41 -312 -295 234 -26 -266 7 123 -124 -82
4558 -82 -3 -29 -213 -117 -1 -23 -17 -13 146 90 194 -286 -236 357 171 -74 -80 42 126 -273 -52 55 79 -71 -168
4583 -168 -35 76 -459 -36 -51 -80 -169 194 123 135 -37 59 383 372 221 -10 317 229 12 -232 162 57 16
4606 16 -219 115 158 -347 -49 300 29 -189 155 -143 44 -122 -58 -214 141 -27 -89 21 98 -108 -165 182
4628 182 111 -40 -228 179 46 -112 -11 26 47 -132 165 -27 5 -277 -320 -52 278 -104 -104 -54 260 -324 -136
4651 -136 83 104 -10 93 214 48 37 8 -124 204 -29 43 143 314 -43 -152 6 -230 -27 -197 203
4672 203 -163 -299 -53 378 185 -265 -175 -1 215 -265 -199 300 50 -270 26 207 82 238 -29 537 70
$$ packed form
4513A63m38J53J07L5j90j3K69j62J63l85L9K38o2o7J60J27J2j55J97O0m44J35
4535e8L03rl51P5K34ok70j38K10M76o96R3J20k4k71J7N29k60k40K73J16k47M2
4558h2P9k6j84R6J16k2OMJ59n6J04m80N0N93j86k45oJ22Q4l99K21J07K4j50r7
4583a68J33J11n35M23j5k9q9L63p1J2j72R6L24j1j51k31L27q8k17k44L94j05m1
4606A6k35L34M3n05K98L49k71k18L44k98J87j66O4j56L55j68o2J10P7k06n7L47
4628A82p1j51j88M07j33j58J01L7K1j79K97j92L2k82m3K68L30l82%N0L14n84J88
4651a36K19K1j14J03J21j66j1k9j32L28k33P2J00J71l57j09J58k36K03j70M00
4672B03l66j36K46M31j93m50R0J74K16m80O6M99k50l20K96J81j25J56k67N66m67
$$ plain form
4693 70 115 202 -137 -78 -67 146 30 200 159 -147 76 180 -326 -296 61 151 -114 -297 108 -2 158 276 -1
4716 -1 98 122 149 107 -10 27 -90 256 -91 292 -1 115 301 -207 44 -10 50 -65 -169 93 153 -176 -310
4739 -310 -56 193 -75 -252 176 175 117 -233 162 -43 -323 -26 -64 7 -73 -165 238 87 98 37 -167 207 48
4762 48 143 154 183 -168 -158 36 -61 -233 -57 -31 -26 -51 6 -59 4 -35 -190 174 52 108 69 107 206 -127 3 231
4788 231 87 10 112 174 -103 10 25 100 108 -286 -348 241 99 -316 -149 42 -229 -245 -42 -128 37 71 305
4811 305 305 146 171 103 -111 74 -108 136 94 187 -105 -220 -22 327 126 -139 3 -12 -337 -263 33 -168 -143
4834 -143 -216 151 -291 -182 -45 -18 188 70 -261 184 239 3 136 223 197 -140 37 29 15 141 -145 130 49
4857 49 120 -141 -78 -58 -208 -45 -204 65 -380 -367 243 -24 -20 -77 236 -111 176 27 219 142 57 -39 177 136
$$ packed form
4693G0M5Q7l39N9J1K13j16J70m1l06K23J04n06L0L57R0k65j83M05j10J60J18k77
4716aR9K4K7m2j17L7j17L46l47L83k93J16J86n08K51n4O0j15j04K62O0l29j34
4739c10K54K49k68j77M28jn8l50L95k05k80K97l8P1q0r2M03j51J1o1k04L74j59
4762D8R5J1K9l51J0J94r7j72J76K6Nk5N7o5O3l9j55L64j22N6l9L8R9l33J30K28
4788B31j44p7J02O2k77J13J5P5Ql94o2N89j42m15J67J91k71j6K03q6J65L4K34
4811C05%j59K5o8k14J85j82K44m2R3k92j15J98L49k01k65J42j5l25P4K96k01K5
4834a43p3L67m42J09J37K7K06j18l31M45N5k36J33Q7k6l37J77qj4J26k86K75q1
4857D9P1k61O3K0j50J63j59K69m45J3O10k67Mn7L13l47K87j49J92p7q5r6K16m1
$$ plain form
4881 136 140 -19 60 271 -8 -82 -117 7 -105 -109 -195 108 21 -123 -33 3 -105 -281 30 33 -163 -136 138 -142 -154
4906 -154 -14 108 234 153 142 99 49 71 7 -56 250 -148 -132 -15 -70 -111 -5 208 21 -69 -77 80 -108 25
4930 25 -33 -90 -137 -115 -175 53 -27 -256 169 106 76 -48 -287 236 64 66 31 163 -51 -160 -340 74 -133 -178
4954 -178 -3 82 68 -346 41 206 -39 25 -370 -154 40 -194 93 184 37 -107 -156 146 -117 -15 -114 139
4976 139 257 -59 40 413 81 -194 -127 44 -1 -36 -148 48 -140 -297 -115 -89 -214 -317 -45 37 61 -3 115
4999 115 244 211 -59 217 238 176 335 105 149 67 62 85 3 -41 -32 -162 132 6 -229 -165 4 -56 -201 -102 -77
5024 -77 -1 -266 192 192 8 234 -37 288 224 100 -166 178 150 -163 194 -89 12 -18 -37 35 206 -187 8
5047 8 313 -55 -69 -171 -119 -111 -307 -122 213 139 -248 21 221 275 -98 -26 312 171 -214 40 -84 92 181
$$ packed form
4881A36Mj59P9K11k79p4l5J24j12mq6L03q7j44R0L6j08j76L11Lj96K7K74k80j2
4906a54J40J22J26q1j1m3n0K2o4o3L06l98J6J17n5m1J06K13j87r0qJ57j88J33
4930B5n8n7m7K2o0K28q0k29M25o3l0j24k39N23j72Kl5J32k14j09j80M14k07m5
4954a78J75Q5j4m14L87J65k45O4l95K16J94k34K87R1j47j44m9L02k63J02r9K53
4976A39J18l16R9L73l32k75O7J71m5l5j12J96j88j57J82K6j25j03K72Q2K4o4J18
4999A15J29l3k70K76K1o2J59k30M4q2nK3q2m4Rj30K94j26k35O4J69o0j45R9K5
5024g7P6k65M58%j84K26k71L25o4j24k66L44k8l13L57k83J01l0j9P2J71l93J95
5047HL05l68j4j02N2Qj96J85L35p4l87K69K00N4l73P2L38j41l85K54j24J76Q9
$$ plain form
5070 181 -120 52 125 -196 -139 -25 -51 -268 -248 -4 -267 27 -277 -104 151 -203 41 -101 159 20 -164
5091 -164 24 21 76 139 -7 340 113 -29 215 234 59 7 269 93 23 175 129 -96 -80 -181 -114 -98 -89 -254
5115 -254 -259 -150 -108 -244 243 110 -47 80 32 158 253 204 236 117 3 -82 244 181 -131 86 10 215 41
5138 41 -112 -46 -1 -246 -87 -221 -47 -208 -266 -27 70 185 -209 28 -40 56 -117 37 346 16 36 315 -46
5161 -46 -208 8 240 43 -82 -66 -201 122 -243 -192 -134 161 -87 -307 79 -130 -237 -243 124 -40 -193 -30
5183 -30 300 128 70 -37 138 303 174 138 173 112 -180 104 130 19 -281 37 -127 -75 -103 -254 96 -136 -41
5206 -41 62 -74 4 22 78 -105 114 -82 -43 -92 185 94 -135 132 55 -1 -243 -56 195 183 -33 1 -171 103
5230 103 62 117 -278 -100 -147 -60 20 -84 -112 -93 -234 -79 12 51 -306 -150 76 245 235 318 -89 47 45 -95
$$ packed form
5070A81l01J72P3l21N7J14k6k17K0K44k63K94l04J73K55l54K44j42K60j39j84
5091a64J88lN5O3j46L47k27j42K44J9j75n2K62j76p0J52m6k25J6j01O7J6Rj65
5115b54nJ09M2j36M87j33j57J27m8J26R5m9L2j19j14q5L26o3l12K17p6K05j74
5138D1j53O6M5k45J59j34J74j61n8K39R7J15l94K37o8R6j73J54L09l30K0K79l61
5161d6j62K16K32j97j25J6j35L23l65N1N8K95k48k20L86k09j07oL67j64j53J63
5183c0L30j72n8j07J75J65j29l6L5o1k92K84K6j11l00L18j64N2k8j51L50k32R5
5206d1J03j36P8J8N6j83K19j96L9m9K77r1k29K67p7n6k42J87K51j2k16L4j72K74
5230A03m1N5l95J78m7Q7Q0j04k8J9j41J55R1L9l57J56K26J69j0Q3m07J36kj40
$$ plain form
5254 -95 -35 -15 79 -235 171 -48 25 90 -214 -72 -139 76 -19 45 -27 42 -147 87 57 -237 -154 44 5 -200 -60
5279 -60 104 44 -77 63 260 369 96 -82 -76 357 -22 -162 173 61 -110 -108 255 85 -17 -190 189 -211
5301 -211 -10 144 -65 86 59 114 -60 53 -96 -140 452 247 -50 -120 221 128 168 -147 83 -99 -96 55 9
5324 9 -71 -218 77 27 -72 -134 -246 -41 -128 -148 -80 80 0 -11 173 296 405 -79 196 115 79 160 81 163 75 -114
5350 -114 -104 180 65 -49 62 218 129 -202 15 46 170 23 -107 -42 -203 8 -244 -72 -161 2 57 6
5372 6 103 -175 -55 100 -59 82 -112 322 -85 111 94 -53 -98 -263 -189 -41 -115 -93 -182 61 75 48 -152 -161
5396 -161 -63 -260 -42 -62 56 -65 26 1 288 107 232 376 43 -43 -99 266 145 89 155 -257 -65 -14 19
5419 19 138 124 -104 -56 -9 -162 209 34 -12 95 -28 95 15 169 78 167 95 55 76 249 75 -75 -7 124
$$ packed form
5254i5O0K0R4l14M06k19P3O5l04J42o7K15r5O4p2O9j89K34l0k94Q3J98l9k05J40
5279f0J64o0j21J40J97J09k73j78OM33l79j40L35j12j71KL63j70j02j73L79m00
5301b11K01J54k09J51k7N5j74J13j49m4N92k05k97p0L41r3M0l15K30j82LJ51m6
5324Iq0j47K95n0r9o2j12K05q7k0O8J60q0j1J84J23J09m84K75q1l6Q1p9Q2q8j89
5350a14J0K84j15j14J11J56q9l31K17L1J24j47j30O5j61K11k52J72q9J63N5n1
5372FR7k78J20J55j59J41j94M34m07J96j7j47m5j65P4J48p4K2q9K43J4k7k00r
5396a61R8j97K18k0J18j21R1k5K87j81J25J44l33q6n6L65j21n6O6m12J92N1L3
5419A9J19j4k28M8M7j53L71j75m6J07j23J23q0J54r1Q9p2m0K1J73j74j50O8J31
$$ plain form
5443 124 14 -1 -93 -177 62 -9 -81 -135 69 9 -63 -151 -36 -107 -273 26 -219 -31 73 -140 237 230 -158 -44
5467 -44 179 227 65 -100 165 46 -84 -36 101 170 113 92 189 -105 -95 -31 180 -5 -41 18 11 -15 120 -168 168
5492 168 -114 -134 -65 85 32 96 60 100 211 -187 37 -108 10 75 61 311 -23 -115 -192 200 -63 -56 -26 17 -14
5517 -14 57 -366 -120 3 -323 -120 97 -25 -212 123 18 62 27 260 179 138 115 192 55 156 104 -1 23
5540 23 302 -14 61 80 -224 104 -198 -183 -1 -323 -84 132 -130 -201 -65 39 6 17 -5 143 -101 -34 87
5563 87 133 181 245 273 -112 -36 66 182 -58 68 -179 -69 77 1 -82 -58 -243 -86 -114 -1 -267 111 121 -106
5587 -106 140 226 1 -49 43 43 -124 215 280 149 -44 113 93 151 48 -14 69 222 -119 -280 102 -215 54
5610 54 118 -160 26 99 -153 24 -133 -106 -73 -126 98 91 -112 -70 112 -162 -2 73 -91 -65 -10 4 6 -126 -5
$$ packed form
5443A24j10j5r2q4K39p1p2n4K04o0p2q8J15p1j66K99k45J88J04k13L77pl88J14
5467d4K23M8j62j65K65j19j30M8J37O9n7k1R7k94J0O4K11j85l6N9pk6J35k88L36
5492A68k82k0O9J50n3O4l6M0J11l98K24j45J18O5j4K50l34r2p7L92k63PL0M3l1
5517a4P1m23K46J23l26K03K17j22j87L35j05M4l5K33q1m1k3P7j37J01n2j05K4
5540B3K79l16P5J9l04L28l02J5J82l22K39K16k62p1J36J04l3J1k2J48k44O7J21
5563H7M6M8O4K8l85P6J02J16k40J26k47J10J46p6q3K4j85J57k8J13k66L78J0k27
5587a06K46Q6k25n0R2%j67L39O5j31j93J57k0N8j03o2Q3J53l41j61L82l17K69
5610E4O4k78J86P3k52J77j57K7L3n3K24pk03M2J82k74J60P5j64K6N5J4Kj32J21
$$ plain form
5635 -5 214 -180 -161 -8 23 -350 -396 123 -35 151 -278 88 92 -68 45 186 136 123 -123 340 148 -140 -136 -2
5659 -2 230 16 16 67 228 -17 -33 -165 109 -83 -67 -160 81 -211 98 -171 -103 -63 -310 -239 273 43 -223 -31
5683 -31 211 -41 -56 269 -46 78 82 -90 38 57 35 140 -106 -4 35 135 149 226 -71 18 88 -192 72 69
5707 69 19 -133 -25 82 131 -2 -61 115 80 -67 -5 -29 -19 174 -24 -72 365 196 -74 -105 27 -20 184 -51
5731 -51 85 282 -243 -7 -7 89 -177 -115 -90 57 -119 -179 -288 21 -34 8 20 113 133 25 153 238 107 48 16
5756 16 189 5 -106 7 -44 -40 -198 90 33 -262 19 -61 -194 -154 -5 172 -116 -333 -48 -18 -140 10 -120
5779 -120 199 -66 111 -76 300 -24 -48 140 90 -72 217 118 4 -160 -219 -91 -244 -200 -223 52 18 63 -55
5802 -55 -129 -215 -31 -92 120 -14 194 66 131 281 242 -202 -36 -93 64 207 19 -26 146 -99 -191 268 54
$$ packed form
5635eK19l94J9J53L1l73m6N19j58J86m29L66Mj60J13J41n0j3k46M63j92k88MJ34
5659bK32k14%N1J61k45j6j32K74j92J6r3K41k92L09k69O8M0k47P1N12k30k66J92
5683c1K42k52j5L25l15J24Mj72J28J9k2J05k46J02L9J00J4P7k97Q9P0k80K64l
5707F9n0j52J08J07M9j33n9J76l5j47O2k4J0J93j98m8M37j69k70l1J32m7K04k35
5731e1J36J97n25K36%R6k66O2K5J47j76o0j09L09n5M2J2R3K0j08J28Q5j31n9l2
5756A6J73j84j11J13n1Mj58K88n7k95K81q0j33M0J49J77k88k17K85L0j22J50j30
5779a20L19k65J77j87L76l24k4J88n0j62K89r9j14j64n9J28j53M4k3K75l4M5j18
5802e5p4q6J84o1K12j34K08j28O5J50l9m44J66n7J57J43j88m5J72k45r2M59k14
$$ plain form
5825 54 -185 -166 111 -153 -222 96 4 20 110 -13 125 22 100 -271 3 130 -3 67 125 66 10 -47 300 -420
5849 -420 68 32 -292 -68 101 -78 -30 77 -201 -45 18 -193 -146 -47 175 -101 -202 -165 71 84 -68 20 118
5872 118 162 -9 -42 249 131 -20 18 -115 10 -11 33 -77 -49 -127 166 193 32 -173 -243 91 -59 -116 -84 100
5896 100 -132 23 -61 119 -88 -150 -132 275 -12 -65 62 482 80 76 -25 -30 14 -148 54 51 203 -312 -63 -71
5920 -71 -86 63 70 55 -10 -186 -59 -215 -45 -261 76 200 -194 -32 -67 53 -53 -8 -112 60 279 -276 -70
5943 -70 210 -128 119 -187 75 -144 -147 -110 -13 67 -276 -245 82 90 -30 -88 10 -173 158 91 379 -121 -100 -71 19
5968 19 316 -212 31 -30 5 -53 -213 -160 92 -95 -63 285 -3 -37 59 50 64 28 -250 202 47 -116 8 -138
5992 -138 37 -66 132 175 -98 -246 74 66 -15 -38 8 187 233 -23 257 80 35 -94 11 79 -123 -100 52
$$ packed form
5825E4k39J9K77k64o9L18r2J6R0j23J38j03P8l71K74J27j33P0N8n9n6n7L47p20
5849d20M88l6l24K24J69j79M8J07k78J56O3k11M7R9K22k76j01L7K36J3j52Q8R8
5872A18M4j71l3K91j18j51L8j33J25k1M4j10K8p8K93K7j61k05p0L34j50n7L2J84
5896A00k32J55q4J80k07o2J8M07k87n3J27M20m02mj01nM4j62K02lJ52n15K49q
5920g1j5J49Pj5o5j76J27j56J70k16L37J24l94J62l5J20j06M5j04J72K19n55K06
5943g0K80l38K47l06K62k19lL7R7Q0l43L1L27Qj20n8R8j83L31o7K88n00K1K9R0
5968A9K97n28K43o1L5n8j60N3K52j87L2L48k88l4R6rJ4l6k78M52j55j63J24j46
5992a38J75j03J98M3k73j48L20qq1k3M6J79M6k56K80j77m5j29J05O8k02K3J52
$$ plain form
6015 52 -54 87 -242 -246 239 112 -408 167 69 -29 -413 -67 34 -31 -152 35 298 93 114 -18 104 -53
6037 -53 -103 120 136 147 -209 -20 -28 -93 -42 -82 6 184 -25 19 129 213 -46 3 70 -17 111 -181 59 26 -113
6062 -113 -73 25 11 36 -19 2 146 63 178 -50 70 -113 49 -4 -62 -186 148 156 141 93 72 135 -105 -86 -73 55
6088 55 94 2 40 22 132 -75 -165 241 42 26 28 203 -141 -277 63 111 32 -28 32 26 69 -160 -19 120 178 -124
6114 -124 -394 119 -117 -200 -224 139 124 98 115 183 129 95 146 -85 -131 -165 171 157 94 -191 -60 -31 -207 -173 -47
6139 -47 -25 108 -121 -169 9 126 -32 -215 86 196 86 -36 -217 -87 16 23 86 -6 -108 156 331 -19
6161 -19 -23 -142 -119 -154 -77 -3 60 170 67 -96 15 58 -70 -110 63 -82 -322 -8 155 82 54 210 159 -159
6185 -159 67 168 175 -18 -131 -75 -4 -8 -118 -102 -154 215 125 -109 -14 53 -333 -21 126 53 0 -295 -78 77
$$ packed form
6015E2j06J41l29mM85j27n20N75r8r8l84L46J01o5j21J87K63k05K1j32J22j57
6037e3n0K23J6J1l56J89qo5N1m0Q8J78k09M4J10Q4k59M9O7q7J28k92K40l3j39
6062a13M0R8j4K5n5K1J44q3J15k28J20j83J62n3n8j24L34Qj5m8k1O3k40J9J3J28
6088E5L9r2L8j8J10k07r0M06j99j6KJ75l44j36L40M8p9o0O0oM3k29J41J39N8l02
6114a24k70N13k36q3k4L63j5k6J7O8n4l4N1k31m6l4L36j4o3k85J31K9j76L4J26
6139d7K2J33k29m8J78J17j58j83L01J10j10j22j81J30J03PO3r2j02K64J75l50
6161a9mj19K3l5P7P4O3J10j03j63J11M3j28m0J73j45k40L14J63p3k8J56n1l18
6185a59K26J01Pj93j13N6P1mj10J6n2L69r0k34R5O7l86L12J47p3n3k95K17J55
$$ plain form
6209 77 21 -167 303 236 316 -40 210 253 -164 -155 -48 -180 -83 22 277 -21 -155 38 5 -163 215 -389 44
6232 44 -150 62 -90 130 74 142 -76 -115 49 17 -42 -166 38 -94 178 -139 128 25 96 196 107 108 -107
6255 -107 -24 -4 -204 -125 110 5 -199 48 78 92 -177 -70 92 45 -132 -237 -110 115 39 -125 118 -146
6277 -146 -51 -97 75 1 -190 52 -63 36 -210 139 90 135 98 -255 42 -49 -234 -65 263 68 -477 28 -19
6300 -19 113 -78 -153 148 77 -112 87 -168 -79 -38 82 192 321 -54 -246 -11 104 -10 103 -11 -119 91
6322 91 -1 -38 -145 -156 -267 88 -26 -112 -56 -167 -162 -55 92 212 -28 94 -86 110 150 85 41 17 23 -136 120
6347 120 158 83 -178 -299 -15 2 -85 -44 311 -42 -135 -128 -109 -41 253 -354 114 191 47 266 -173 228 -137 -212
6371 -212 -161 -6 -130 67 18 203 83 66 59 -73 -50 31 -191 -10 -58 -209 -168 38 -300 -230 90 -268 -331 161
$$ packed form
6209G7n6j88M70o7Q0l56K50M3m17RJ07j32R7J05K55k98j34J93l3j68L78o04M33
6232D4j94K12j52K20n6O8k18l9J64l2n9j24K04j32K72l17K67j03P1J00q9Jk15
6255a07Q3K0k00P9K35j05k04K47L0J4k69J07J62m7j77j05J27K25p6j64K43k64
6277a46R5m6J72p4j91K42j15R9k46L49m9M5l7l53K97r1j85J69L28j95n45N05m7
6300a9J32j91p5L01p1j89J99k55Q9M1J20J10J29l75j92K35J15j14J13j14j08K10
6322I1r2l7j07j1j11L55j14q6N6j11NJ07J47J20k40J22j80J96M0o5m4k4Oj59K56
6347A20L8p5k61j21K84J7q7M1L55l53r3PJ9O8K94o07M68P7j44K19m39M01l65p5
6371b12N1J55j24J97m9J85j20j7pj32K3Q1k22J81m8j51M1K06l38P0L20l58o3M92
$$ plain form
6395 161 204 74 -27 16 90 38 -193 -184 118 387 0 61 90 -100 -34 -76 31 174 142 115 165 -23 -96 -64 63
6420 63 -246 -186 147 34 -183 -46 -277 130 -196 -69 80 -147 -230 -58 -30 275 -197 79 -52 -73 8 -191
6442 -191 -177 -34 109 -206 -202 -37 276 -11 119 -69 40 -229 -220 -5 -32 89 117 236 46 -201 73 -57
6464 -57 -227 -123 -34 42 -18 -164 54 -3 -36 -301 -9 276 84 -68 219 -25 19 -72 154 190 -61 -182 -128
6487 -128 -23 -151 -152 54 -30 -103 -123 -171 10 40 -91 63 -143 462 70 42 12 119 63 41 237 52 134 204
6511 204 67 -182 -39 13 -124 216 -83 -38 192 -105 4 -132 -69 125 -185 124 330 205 110 27 -22 -69
6533 -69 51 -31 168 -81 -98 210 121 226 25 31 30 75 -85 -209 97 -178 -208 82 5 27 41 -15 153 83 -138
6558 -138 91 56 186 15 84 64 -33 110 98 211 -173 -114 53 74 6 -47 -55 175 10 -252 -137 115 -43 -21
$$ packed form
6395A61M3j30j01M3P4n2k31RL02K69l87O1K9j90O6m2J07J43l2k7N0j88p3L2J27
6420F3l09O0L33j13k17J37k31M07l26J27J49k27q3J72K8L05m72K76j31k1Q1j99
6442a91J4J43J43l15MJ65L13k87J30j88J09k69RK15k7J21K8J19j90k47K74j30
6464e7j70J04Q9P6o0j46K18n7l3k65K92K85j92j52K87k44M4r1K26L6k51j21N4
6487a28J05j28jK06q4p3k0m8J81L0j31J54k06O05l92k8l0J07n6k2J96j85Q2P0
6511B04j37k49J43N2j37L40k99M5K30k97J09j36O3J94l10L09K06j25r5q3m9m7
6533f9J20q2J99k49j7L08q9J05k01OjM5j60j24L06k75l0K90p7K2J4n6J68p0k21
6558a38K29l5J30j71O9k0r7J43j2J13l84N9J67K1o8n3qK30j65k62J15K52j58K2
$$ plain form
6582 -21 169 36 -251 80 -301 100 221 -26 -199 90 -99 19 -131 57 -12 -17 -38 203 -68 59 -206 -155
6604 -155 -32 252 -124 59 126 140 -39 -90 -134 -195 -204 -230 129 -373 49 160 275 10 -108 34 -28 141 -127
6627 -127 134 231 -115 135 -201 221 -209 -48 278 -8 -142 -13 257 305 95 60 40 -170 -82 70 -1 -49
6649 -49 -52 178 69 122 -155 -191 86 106 -112 -38 99 -29 37 -64 -9 14 109 -150 46 -207 -68 111 -159 105
6673 105 76 6 138 -86 -258 25 93 17 -61 -54 7 -26 61 -254 267 -195 -168 39 379 318 -54 -129 -145 243 167
6698 167 79 159 -31 -51 131 -103 -88 75 -176 79 -26 -170 171 36 -73 67 -89 57 55 -55 210 -110
6720 -110 67 22 175 172 22 -146 -1 81 42 -67 248 -59 -141 -155 -41 -46 60 63 -23 212 -168 -78 -74 7 -98
6745 -98 -11 -49 -121 211 -88 -167 10 116 18 264 9 16 -19 10 200 -113 135 -43 -96 6 -4 43 -151 15
$$ packed form
6582b1J90j33k87L31l81M01J21k47j73K89j89J18j50J88o9nk1K41k71J27k65N1
6604a55J23K84l76J83O7J4j79n1m4o1rk6L59n02M22J11J15k65j18J42o2J69k68
6627a27K61R7l46K50l36M22m30J61L26k86j34J29K70M8k10l5k0k10Q8J52p1m8
6649d9lK30j09N3k77l6K77K0k18P4J37j28O6j01N5K3R5k59J96k53J39J79k70K64
6673A05k9p0J32k24j72K83O8p6p8PO1l3Q7l15N21m62K7K07L40o1l72p5j6L88p6
6698A67q8Q0j90k0J82k34J5J63k51K55j05j44L41j35j09J40j56J46kj10K65l20
6720a10J77m5J53lj50j68J45Q2l9j09L15l07q2j4J14nJ06Lq6K35l80R0MQ1j05
6745i8Q7l8p2L32k99p9J77J06r8K46k55Pl5K9J90l13K48j78n3J02j0M7j94J66
$$ plain form
6769 15 12 -91 165 -80 -307 34 9 7 -67 45 339 27 -12 -248 160 63 8 -29 76 105 -111 -100 74 -80
6793 -80 -356 -193 -110 172 -231 10 -53 -155 -23 74 -110 -81 -119 -85 26 56 -40 168 -68 59 -192 -5 -183
6816 -183 232 68 -60 111 175 40 -176 26 132 -357 -238 179 -74 -43 -272 70 -393 -34 -188 250 117
6837 117 -78 151 58 -83 -216 27 166 32 32 -151 88 -107 26 187 108 -263 -255 96 310 210 -200 -214
6859 -214 106 -50 -56 -145 36 154 -284 -21 176 17 82 -62 146 -43 -51 -166 341 -218 16 84 122 56 -193
6882 -193 -90 -182 -25 -315 -23 86 66 85 -85 -38 243 66 231 -142 -24 -151 -2 -205 -41 -116 -19 166
6904 166 -26 -85 121 -29 129 -35 -67 27 -103 136 -113 214 -31 -76 169 -100 -82 110 228 -66 34 -7
6926 -7 -37 213 38 -20 -259 -76 19 1 42 -51 19 -117 -80 -81 -37 95 139 58 -38 148 17 210 158 6 -259 41
$$ packed form
6769A5lj03K56k45k27L41k5kp4J12K94l12l9k36M08r7n5l7J05K9k16J1J74j54
6793h0k76J63Q3K82m03K41o3j02J32R7j84K9l8L4J11L0r6K08k36J27k51J87j78
6816a83M15j64j28J71O4j35k16K02J06m89J19M17k53L1k29L42m63L59j54M38j33
6837A17j95K29r3j41j33K43J39j34%j83K39j95J33J61p9l71QL51K14j00m10j4
6859b14L20j56oq9J81J18m38K63J97j59O5j44K08j89qj15N07n59K34O8L8o6k49
6882a93J03r2J57k90K92J09k0J9j70M7K81j77J65l73J18j27J49k03J64p5R7J85
6904A66j92n9K06j50J58j64l2R4j30K39k49L27k45m5K45k69J8J92J18k94J00m1
6926gl0K50j75n8k39J83R5j8M1r3P0j36L7jM4J32M4q1r6J86j31J93n2j52k65L00
$$ plain form
6952 41 -285 -132 93 118 -31 -141 -204 26 -198 -197 171 -59 68 54 52 -179 -68 89 -18 -71 69 163 107 8
6976 8 162 38 -157 -118 152 96 337 230 -27 -115 120 100 157 -145 -104 116 42 -88 -33 21 10 -101 67 -130
7000 -130 79 108 -19 110 -136 79 -68 138 -117 -246 3 189 60 -48 -67 127 103 -62 -90 31 59 79
7022 79 38 126 114 -319 -102 -44 63 -83 49 25 -108 -26 -186 281 169 -90 278 241 -212 -103 31 -12 30
7045 30 -37 158 -105 118 -44 -151 99 3 -161 45 -62 92 43 -2 4 -58 -129 18 178 112 -129 -75 120 140
7069 140 -8 -183 299 -53 -9 -120 133 61 -187 -36 41 -54 -5 -95 -69 -127 -337 19 87 64 -191 183 209 -151
7093 -151 134 61 152 210 -53 112 155 74 80 58 31 131 -119 42 -65 -156 -98 -167 55 119 73 -126 -48 -23 -62 -16
7119 -16 -89 13 -1 53 31 227 82 -18 218 233 -23 35 121 57 68 46 29 363 -62 193 165 -190 -53 -352
$$ packed form
6952D1l26J53K25K5j49j10o3K30k24JL68k30J27j4kk31J11J57j07n3J40R4n6r9
6976HJ54j24j95L9K70n6K41j07k57q8K35k0N7l02M1K20p4j30N5N4j1j11J68j97
7000a30K09K9j27J29k46K15j47K06k55j29K49J86j29j08j9J94k4j65k8J21K8K0
7022G9m1Q8j2m33K17N8J07j46J32k4j33Q2j60M67j12k59L68l7m53J09J34m3M2
7045C0o7J95k63K23j62j07K50r6j64K06j07J54m9m5Oo2p1J47J60o6k41N4J95K0
7069A40j48j75M82l52M4j11K53p2k48J51P7r5M9r0K6n8k10L56O8k3k55L74K6l60
7093a51K85p3R1N8k63J65M3q1Ok2k7J00k50J61j07r1N8o9K22O4m6j99P8K5l9M6
7119a6p3J02j4N4k2J96j45j00K36J5k56N8Q6o4J1k2j7L34m25K55k8l55J37k99
$$ plain form
7143 -352 34 -62 59 -43 102 -38 -97 34 -16 -60 -285 -26 27 -33 -2 29 -187 330 27 85 280 -133 1
7166 1 76 163 -250 6 50 99 -16 -251 62 -30 -9 24 102 133 -148 304 -197 -48 119 158 79 -20 -79 152 223
7191 223 -62 111 15 48 -33 30 -122 -43 -255 209 -43 -67 -72 107 -88 -161 11 -159 183 77 171 57 108 62
7215 62 -25 168 14 -169 -51 -18 -24 0 12 -169 -25 43 0 -185 -170 48 -123 112 108 -27 270 0 -143 85
7239 85 174 -51 -117 -79 15 71 -169 154 -81 -67 10 111 7 152 -82 -16 175 232 137 -128 110 -127 27 -15
7263 -15 -57 -102 -108 19 -39 112 -134 9 -21 -75 83 12 48 157 -202 -307 121 -32 53 47 45 -25 -68 -36 -232 191
7289 191 15 -94 -56 199 -25 -128 -23 -233 73 -127 319 -96 -98 76 -251 109 -153 -95 45 16 -151 24
7311 24 125 83 -12 -82 342 156 -38 -99 300 -78 34 58 -71 4 -26 -84 103 1 -81 4 -134 106 -99 -57
$$ packed form
7143c52L86r6J21j02J45j40n9J31n0m4k25K59N3o0L1L1k16N17l03N8J95m13J34
7166AP5Q7m13K56M4M9j15k35L13r2K1L3P8L1k81M52n01J49J67L9p9r9n9K31P1
7191B23k85J73r6L3q1O3j52P9k12M64k52k4nJ79j95p3J72j70L42j06R4j14N1m6
7215F2q7J93j54j83J18L3oK4J2j81J44O8m3j85J5K18j71K35mj35K97k70j43K28
7239H5Q9k25o6L8R4N6k40L23k35J4P7J01j04J45k34O6J91N7r5k65K38k37J54m2
7263a5m2m5oJ27n8J51k46J43l0n4J58p1L6J09l59j05M28j53Q5okp0m3L2j96M23
7289A91j76j09L8K55k24j03J05k10L06k00M46m15kJ74l27L60k62N8J40k9j67J75
7311B4J01m2r5p0M24j86j94o1L99l78J12K4j29P5l0n8J87j02q2Q5j38K40k05M2
$$ plain form
7335 -57 11 -116 13 -30 84 109 -24 5 -12 -88 4 241 -120 205 59 -159 -157 51 -1 45 47 228 -67 -74 150
7360 150 -101 76 44 -24 -219 67 40 42 4 151 -4 91 -192 21 -13 242 182 -62 212 183 -114 -93 -88 67
7384 67 -31 -169 -76 -192 -160 3 -81 -245 64 118 85 -91 254 -53 40 -94 -70 -51 11 57 66 -233 167 67 129
7409 129 76 -196 309 -76 67 -127 -52 -21 -123 191 21 32 -80 -187 -97 -41 -24 155 8 167 104 113 155 -57
7433 -57 369 165 -154 -8 90 105 -116 -84 344 -122 9 28 -207 76 -107 133 -217 -48 -162 83 -195 77
7455 77 -65 -80 -89 -51 88 46 52 228 25 75 -137 -102 68 47 -19 14 53 215 -114 -132 88 108 88 195 -141 46
7481 46 8 -21 -10 -59 187 66 -203 -85 124 154 40 168 -31 -80 100 42 -110 33 108 -52 170 -108 149
7504 149 -57 -71 233 111 70 9 -24 0 -65 -241 19 10 -22 62 77 71 102 34 -61 -139 -6 114 -7 -1 66 -116 62
$$ packed form
7335e7O8j27J29m3J14K5j33K9j7p6R2K37l61L25j46k18KK08n2M6KJ81k95pK24
7360A50k51J77l2o8j95K86k7Kl8J47j55R5k83K13l4K55o0k44K74k9k97K1NJ55
7384F7r8j38R3j16L2J63q4j64L09N4l3j76L45l07R3j34K4J9O2M6Rk99M00j00O2
7409A29n3k72N05l85J43j94P5L1j02L14j70J1j12j07R0N6J7J79j47J59o3RM2k12
7433e7M26k04l19J46R8J5k21L2M28m66J31J9k35K83j83K40l50J69j14K45k78K72
7455G7j42j5rL8J39m2OJ76k03N0k12L5J70k1o6L3L9J62l29j8K20K0k0J07l36J87
7481D6l8k9J1m9K46j21k69J18K09L0j14J28j99m9J80n8j52J43P5j60K22k78K57
7504A49k06j4L04j22m1o1l3K4o5j76K60rl2Q4J5oL1o8r5p8J33J20j21OO7j82J78
$$ plain form
7531 62 125 218 -36 -99 -30 195 -87 -114 88 -38 117 -2 -100 -17 -297 -260 35 43 -140 -35 207 -67 66 -130
7555 -130 93 -11 99 -117 37 83 -114 33 112 56 -128 -161 19 34 95 -24 122 -7 -72 56 -164 -57
7577 -57 90 200 69 -55 -11 -61 222 -240 -31 223 41 34 451 331 -146 -102 28 -205 -61 -149 -61 13 -125
7600 -125 -130 -101 -218 75 73 28 91 -178 -10 -111 140 255 153 -13 234 15 -42 247 -159 105 -45 33 -35
7623 -35 19 -281 100 4 39 121 44 -59 92 8 -109 61 10 67 111 81 -90 9 -27 -1 -140 -177 76 -226 91
7648 91 217 25 222 83 116 -232 52 -20 -38 -136 5 -65 -8 -147 -116 166 -152 -284 -67 -70 16 -61 250 -22
7672 -22 -195 12 45 80 138 6 -123 152 -156 56 90 82 -264 100 179 36 215 -80 -4 -97 54 -189 -203 24
7696 24 96 -149 30 -76 111 368 70 -356 63 -24 -179 -40 -45 -156 383 134 108 -132 36 273 -1 114
$$ packed form
7531F2O3R3k54o3O9K25k82k7K02j26J55j19r8Q3k80L7K95Qj83J05K42k74J33j96
7555a30K23j04J10k16J54M6j97J47P9n6j84l3J80J5O1j19J46j29o5J28k20J07
7577e7J47J10j31j24M4n0K83m62K09K54j82pM17j20m77M4J30k33J44q8Q8P4j38
7600a25nK9j17K93km5O3k69J68j01K51J15j02j66K47k19n7K89m06K64j50P8o8
7623c5N4l00L81r6L5Q2p7j03J51q4j17J70n1N7M4l0j71R9l6K6j39l7K53l02L17
7648I1J26j92J97j39L3l48K84p2j8r8J41p0N7j39L1K82l18j32K17lQ6p7L11k72
7672b2j73K07L3L5N8j32j29K75l08K12L4ql46L64P9j43J79k95P6r3J51k43j4K27
7696B4P2k45J79j06J87K57k98m26M19q7j55J39nj11N39k49k6k40J68K37k74J15
$$ plain form
7718 114 -168 -98 -193 181 180 89 284 -63 -113 33 36 22 46 111 137 -86 -42 -25 -46 30 -169 -152 57 -58 -107 208
7744 208 -121 -4 23 62 -133 -55 17 126 -53 84 42 23 19 83 27 21 128 86 -153 -304 -115 -92 8 -178 -33
7769 -33 -299 130 148 -4 268 91 -78 -159 5 187 158 79 -52 -81 163 -75 19 41 91 91 138 43 -24 -86 -124
7794 -124 22 144 109 -183 7 213 25 -109 193 -180 297 62 -128 118 180 -174 44 -239 -68 -88 175
7815 175 -22 156 -28 220 -3 -47 65 -224 -25 -219 145 -55 -36 -16 -84 -48 81 58 120 256 113 55 109
7838 109 -164 330 -50 102 -144 124 -154 -7 62 0 87 102 -97 -71 -10 -73 155 59 201 -182 8 -38 177
7861 177 -37 68 8 -40 -82 74 -196 -60 106 -41 -32 81 109 92 86 133 -87 204 -104 -79 -258 -161 190 -114
7885 -114 -122 -238 92 -211 2 -61 18 -27 182 -314 -28 67 121 323 164 161 -28 126 51 -109 -214 240 -110
$$ packed form
7718A14k82P0r5L74jr1J95l47n0J46Lj4K4O5K6k23M4J7k1P6j99J7K09j15m9L15
7744B08l29J17K7L9j95P8P2J09j79J37m2j9mO4n6oJ07m2k39j51J89K3J00j86J45
7769c3k66M29J8j52K72j77j69q1J64J82k9p9j31k9K44k38R4K2N0%M7r5o7o2l8
7794a24J46J22l5k92J90K06j88j34L02l73M77k35j90K46O2l54K18k83J71k0K63
7815A75j97J78j84K48k23m4J12k89J99j94L64k00J9K0o8L6J29k3O2J36j43n8N4
7838A09k73M94l80J52k46K68k78J47O9o2Q7J5j99K6O1o3K28r6J42l83J90m6K15
7861A77k14J05o0m8m2J56k70J36J66j47RJ13K8j7oM7k20K91l08K5j79R7L51l04
7885a14qj16L30l03K13o3P9m5K09m96K86R5N4K02j59lj89J54p5j60j05M54l50
$$ plain form
7908 -110 -39 102 110 -251 29 -11 89 48 -188 448 108 -75 -184 -197 139 -5 13 -223 -209 6 -3 -188 -6
7931 -6 -22 -81 -141 343 -227 -100 92 63 138 -37 131 -214 89 -139 162 136 -86 -165 63 146 -112 -100 66 -81
7955 -81 136 -114 -202 5 130 -131 71 -70 94 15 -254 17 -91 -26 -152 -10 45 99 -86 125 68 19 -52
7978 -52 34 -175 -144 -230 -40 120 158 105 72 -51 128 41 -75 182 41 -60 86 123 124 102 11 -128 29 257
8002 257 -19 145 -97 -154 -33 16 -156 -84 81 35 71 36 -62 5 10 -145 -24 50 -31 -156 -60 19 -186 -20 22
8027 22 234 -65 201 214 -70 106 59 15 -95 121 -38 -36 64 -52 37 197 62 113 -103 -31 -38 -174 -46 -42
8051 -42 -265 54 -156 52 172 -41 201 -96 153 125 -253 -274 92 137 1 -39 -35 6 4 102 17 7 -133 -67 -152
8076 -152 -113 -268 -16 -37 -47 -65 -328 7 31 156 -4 172 10 39 -108 258 72 126 129 -86 144 14 90
$$ packed form
7908a10P1J41Ql61K80m0J00m1k36O36l40j83j09j3L36j44J8k36J4K15rj85J82
7931fj6n9o0M84n70J27J92k9P5j75J68l45L03k28L01k6k22p9K28Q3k58J2J66j47
7955h1K17k50q8K07J25k61K02j41J64p9k69K71j08O5j26J42N5N4j85K11n7m9p1
7978e2Q6k09L1q6J90J60L8n3l3j23J79q7j16K57j41j01J46L7Jk2r1j39J57K28
8002B57k76J64k42n7J21M9j72P2J65m6L6l5r8O7Nj55J21P4q1j25R6P9k05J66M2
8027B2K12k99K66J3k84J76m7m4j10K16j59KJ00j16Q9J60j35N1k16P2pj36J28M
8051d2k23L19k10K08J20k13K42k97K49k8l78k1L66M5j36m0MM1kR8q5j0j40O6q5
8076a52L9j55K52k1j0j8k63L35K4J25j60J76j62K9j47L66j86N4Lk15K30j30P6
$$ plain form
8099 90 36 150 -83 104 -14 224 -82 25 -15 48 -102 8 -18 65 -100 81 43 -118 147 -98 226 -65
8121 -65 53 98 274 -168 36 231 79 -13 -90 69 -69 360 63 -148 -103 -373 160 -145 -40 -13 -66 22 -24
8144 -24 -54 -156 105 165 -48 229 100 134 -97 109 272 -143 -131 -64 -266 11 123 214 143 141 121 51 47 34 5
8169 5 155 242 214 15 89 13 5 -300 -149 44 76 -134 -94 13 45 -52 -249 -56 27 208 -168 248
$$ packed form
8099I0n4J14k33J87j18K38l06J07m0O3j50J10k6Q3j65J81l8j61K65k45L24k91
8121f5J18M5J76m42K04J95j52r2p7J59j38M29k97k11M5k70N33l05J05K7n3Q8m6
8144b4l0j02K61O0k13K77j29L4k31K06J63m15J2O7k02K77J12R1p1kk0p0mj3k9
8169EJ50Q7k8j99P4p6ql05J51J93L2k10M0J07L2r7j97J93Q3J81l76M16
8191B48
$$ Imaginary data points
##PAGE= N=2
##DATA TABLE= (X++(I..I)), XYDATA
$$ plain form
0 0 0 0 0 0 0 0 0 0 0 0 0 0 0 0 0 -1 8 -8 8 -8 8 -12 16 -16 17 -24 24 -32 33 -40 46 -50 57 -65 73 -82 92 -105
38 -105 116 -129 142 -158 174 -197 213 -237 261 -288 316 -348 385 -424 465 -516 570 -633 706 -788
58 -788 885 -1004 1145 -1325 1556 -1865 2304 -2975 4109 -6380 12617 -63729 -184019 41853
72 41853 84943 -55596 4343 75935 -29887 -13168 42249 -17942 -1286 63564 -10402 -49606
84 -49606 30836 13772 -55399 7371 45581 -22382 -36939 20847 12930 -35181 -9430 24091
96 24091 -5610 -15232 6347 -6559 -19811 21906 26091 -25854 -2928 33528 -20376 -24768 41734
109 41734 18897 -25566 19405 13352 -42571 11295 49613 -21360 -24381 23993 -16767 -36260
121 -36260 20142 5919 -29170 18754 17190 -37568 -209 41696 -4137 -12817 24911 -6480
$$ packed form
0@%%%%%%%%%%%%%%%jRj6J6j6J6k0K8l2L3m1M8n6O5p3Q6r6J07j22J38j55J74j97
38a05K21k45K71l00L32l71M10m50M98n49O04o64P33q09Q89r81J086j203J339j494
58g88J673j889K149k470K881l421M169n279P084j0489J8997p6346j20290K25872
72D1853M3090j40539N9939P1592j05822J6719N5417o0191J6656O4850p3966l9204
84d9606Q0442j7064o9171O2770L8210o7963j4557N7786p917m8111K5751L3521
96B4091k9701r622K1579j2906j3252M1717M185n1945K2926L6456n3904m392O6502
109D1734k2837m4463M4971o053n5923N3866L8318p0973l021M8374m0760j9493
121c6260N6402j4223l5089M7924j564n4758L7359M1905m5833q680L7728l1391
$$ plain form
133 -6480 -38960 3374 18499 -11598 -2016 13208 -6931 -4040 18081 3531 -2331 27745 7988
146 7988 -39426 -11448 28087 -8030 -27257 18194 18974 -21010 -10422 9155 24 11486 12126
159 12126 -18926 -8159 17235 -18660 -29316 23898 19430 -23827 -2974 16449 -12773 -4629
171 -4629 25156 2820 -13778 8149 3232 -9930 8938 12134 -6051 2094 8643 -12320 -9292
184 -9292 17090 5903 -17728 -3638 5781 -14580 -9022 16693 2087 -17360 3470 6758 -16599
197 -16599 -2045 19185 -921 -5235 11347 -6612 -10952 21695 10599 -17008 11645 19214 -21809
210 -21809 -10865 25310 1693 -14958 8480 -71 -15147 3021 31 -13605 9655 9317 -25145
223 -25145 -10524 19189 -5429 -16067 17237 17155 -13390 -9963 8785 7706 5376 4266 -4531 -1476
$$ packed form
133f480l2480M2334J5125l0097R582J5224k0139K891K2121j4550n862L0076j9757
146G988m7414K7978L9535l6117j9227M5451P80l9984J0588J9577r131J1462O40
159A2126l1052J0767K5394l5895j0656N3214m468m3257K0853J9423k9222Q144
171d629K9785k2336j6598K1927m917j3162J8868L196j8185Q145O549k0963L028
184i292K6382j1187k3631J4090R419k0361N558K5715j4606j9447K0830L288k3357
197a6599J4554K1230k0106m314J6582j7959m340L2647j1096k7607K8653P569m1023
210b1809J0944L6175k3617j6651K3438q551j5076J8168k990j3636K3260l38l4462
223b5145J4621K9713k4618j0638L3304q2l0545L427J8748j079k330j110q797L055
$$ plain form
237 -1476 7740 -2700 -9389 9695 16208 -7027 -12656 6331 1707 -11165 4608 9618 -13086
250 -13086 -10196 6899 -5191 -8020 10787 492 -14205 4436 5577 -11146 6513 16327 -9152
263 -9152 -3388 17610 -4510 -12792 18136 10974 -16232 -791 9298 -10278 -3075 12076 -1868
276 -1868 -4475 7317 -4977 -10795 8474 3689 -13475 1863 9251 -15854 -16221 11285 8174 -9283
290 -9283 1669 10650 -4523 -5927 8534 6909 3503 6286 -6631 -11658 10462 10187 -13698 -607
304 -607 20193 -4910 -19318 7715 11041 -7254 -543 1739 -11397 -2637 4144 -10947 -2456 14761
318 14761 -5955 -16580 9728 8553 -12187 2652 16523 -2657 -6102 7794 866 -4146 9875
331 9875 5725 -9122 -1559 5508 -4892 -1945 8988 -485 -7865 3493 674 -11824 762 11164
$$ packed form
237a476R216j0440o689J9084O513k3235n629J8987m624j2872J5773N010k2704
250a3086K890J7095j2090k829J8807j0295j4697J8641J141j6723J7659R814k5479
263i152N764K0998k2120q282L0928p162k7206J5441J0089j9576P203J5151j3944
276a868k607J1792j2294n818J9269m785j7164J5338P388k5105l67K7506l111j7457
290i283J0952Q981j5173j404J4461j625l406K783j2917n027K2120k75k3885J3091
304f07K0800k5103j4408K7033L326j8295O711K282j3136Q760O781j5091Q491J7217
318A4761k0716j0625K6308j175k0740J4839J3871j9180l445J3896o928n012J4021
331I875m150j4847P563P067j0400K947J0933r473p380J1358k819j2498J2586J0402
$$ plain form
345 11164 -7777 -11702 6633 113 -12160 5076 11097 -5574 -1538 6799 -5816 -1323 13711
358 13711 181 -6629 10126 -359 -16762 6703 16784 -8796 -6870 11654 -2278 -12262 4862
371 4862 6222 -4254 254 -2397 -9716 3796 7736 -9222 -3949 13919 -427 -16689 835
384 835 11821 -3517 -6350 6226 3506 -3595 425 2109 2202 9320 3401 -10599 -871 10904 -4327
399 -4327 -8618 10728 5248 -13786 -3034 7064 -5341 -1219 9457 -4826 -10717 3227 -627
412 -627 -7590 4795 2874 -9409 1238 6488 -7767 -1050 15291 2431 -8023 5815 5888 -6593
426 -6593 1672 11084 -13 -4683 1396 -1361 -3074 3689 -57 -6690 660 1150 -11111 -4529 10083
441 10083 -1364 -11266 3743 6402 -9911 -2870 11253 1850 -3891 3921 -552 -2348 7819 1708
$$ packed form
345A1164j8941l925J8335o520j2273J7236O021j6671M036Q337j2615M493J5034
358A3711j3530o810J6755j0485j6403K3465J0081k5580J926J8524j3932r984J7124
371D862J360j0476M508k651p319J3512L940j6958N273J7868j4346j6262J7524
384H35J0986j5338k833J2576k720p101M020J684R3P118n919j4000R728J1775j5231
399d327m291J9346n480j9034J0752J0098j2405M122J0676j4283n891J3944l854
412f27o963J2385j921j2283J0647N250j4255O717J6341j2860j0454J3838P3j2481
426f593Q265R412j1097m670O079k757j713O763l746o633P350M90j2261O582J4612
441A0083j1447r902J5009K659j6313P041J4123r403n741P812m473j796J0167o111
$$ plain form
455 1708 -4509 10445 7706 -13213 -1987 15983 -1466 -11126 5248 2892 -12084 -5997 582
468 582 -2527 3207 1618 -10211 -3532 9528 -63 -5641 7340 6204 -7518 -3689 6313 456
482 456 -1919 6137 2871 -5216 971 5614 -1123 1419 7986 -1851 -6953 2762 -782 -8807 2624
497 2624 3994 -11153 -4182 8461 -5238 -8012 10735 4997 -9656 1950 5730 -6556 1251
510 1251 8229 -4181 -2146 7821 -4380 -6430 11262 4627 -9846 3046 7902 -8717 -4596 10411
524 10411 1988 -6486 1031 1037 -4293 555 1528 -3372 1426 2404 -8606 -6502 8330 3846 -9030
539 -9030 -279 9561 -2966 -7286 6355 6537 -2270 990 1048 -4843 2246 4992 -4605 883 10646
554 10646 -2743 -8959 7441 6200 -7575 1043 5981 -8339 -6605 4342 -3457 -6653 5459
$$ packed form
455A708o217J4954k739k0919J1226J7970j7449r660J6374k356j4976O087O579
468E82l109N734j589j1829O679J3060r591n578J2981j136j3722L829J0002n857
482D56k375Q056l266q087O187M643o737K542O567r837n102R715l544q025J1431
497B624J370j5147O971J2643j3699k774J8747n738j4653J1606L780j2286P807
510A251O978j2410K035R967j2201k050J7692o635j4473J2892M856j6619M121J5007
524A0411q423q474P517On330M848R73m900M798R78j1010K104J4832m484j2876
539i030Q751R840j2527m320J3641J82q807L260N8n891P089K746r597N488R763
554A0646j3389o216J6400j241j3775Q618M938j4320J734J0947p799l196J2112
$$ plain form
567 5459 1148 -8418 307 4711 -3534 1712 7032 -3345 -3506 7295 522 -6606 6355 9368 -5419
582 -5419 -3718 7167 221 -4302 5531 3333 -6160 -1124 728 -5819 334 5335 -6429 -6473 5929
597 5929 -1619 -10140 4707 8376 -6938 -4267 6631 -571 -3181 5868 3875 -307 4256 60
611 60 -4561 5531 6989 -6196 -3458 7842 -1342 -10569 1141 7419 -2227 -5139 684 -958 -3199
626 -3199 239 -726 -1794 2931 -527 -8683 -849 8339 -740 -3932 6787 3364 -6310 2748 7334
641 7334 -2936 598 7563 -3376 -6179 4306 1445 -3799 4010 1496 -7491 481 3566 -6220
655 -6220 -1154 7128 -4319 -8620 3415 1899 -5867 1101 5527 -1792 -2290 1407 -298 2046 4883
670 4883 -723 -2232 3842 1854 -4075 1386 7261 -137 -5256 2164 3208 -5120 -2454 4684 15
$$ packed form
567E459m311r566Q725M404q245N246N320j0377j61J0801o773p128J2961L013j4787
582e419J701J0885o946m523R833k198r493N036J852o547O153N001j1764m4J2402
597E929p548q521J4847L669j5314K671J0898p202k610R049j993m182M563m196
611F0m621J0092J458j3185K738J1300r184r227J1710O278r646k912N823j642k241
626c199L438r65j068M725l458q156P834R188r079l192J0719l423r674R058M586
641G334j0270L534O965j0939k803J0485k861n244P809k514q987P972L085r786
655f220N066Q282j1447m301J2035j516p766O968M426p319m98L697j705K344K837
670D883n606j509O074j988n929N461N875p398n119P420J044q328K666P138m669
$$ plain form
685 15 -5237 -2425 -2160 -1388 2873 -878 -4390 3300 2884 -8399 -1915 10319 1339 -6507 2639 3402
701 3402 -3087 951 3605 -158 3056 2972 -5451 -1780 7073 -159 -5095 3542 2098 -6767 -2410 3333
717 3333 -1884 -2189 2303 -1979 -5136 900 1474 -2608 747 2920 -2483 -1925 2852 280 -393 5599
733 5599 1987 -4929 1367 5523 -2205 -2358 5922 1534 -5304 -614 1618 -2061 786 1081 -3599 -1186
749 -1186 1403 -4568 -2770 5681 458 -6689 539 3915 -3983 -2097 5466 2357 -2130 -90 493
764 493 561 3258 1611 -1605 2514 3040 -4582 -2794 6764 2399 -6332 -684 4182 -3112 -4493 1940
780 1940 1234 -1762 -388 -3016 -4025 2899 1864 -5149 295 5338 -3400 -4402 5115 3103 -2723
795 -2723 3149 2926 -3760 829 5020 -1108 -854 4617 -617 -3612 1767 554 -2575 2341 1466 -6012
$$ packed form
685A5n252K812K65P72M261l751l512P690m16j1283O484J2234q980p846R146P63
701C402o489M038K654l763L214q4q423L671Q853p232m936Q637j444q865M357N743
717C333n217l05M492m282l157O036N74m082L355K173n403N58M777k572o73N992
733E599l612o916O296M156p728j53Q280m388o838M690K232l679K847K95m680K413
749a186K589n971J798Q451n223p147P228L376p898J886P563l109m487K040N83
764D93O8K697j647l216M119N26p622J788R558m365q731N648M866p294j381O433
780A940p06k996J374k628j009O924j035p013N444N043q738j002R517k012n826
795b723N872k23o686M589M191o128K54N471n234k995N379j213l129M916q75p478
$$ plain form
811 -6012 -2540 3495 -2444 -4788 2773 2131 -4929 -2285 2681 418 -734 2031 886 -658 1496
826 1496 84 -701 4387 4398 -3160 -1574 5462 -99 -5070 3304 4613 -4567 -3528 2308 -1871 -3061
842 -3061 1097 -1274 -2532 1086 -2791 -5055 4342 4089 -5724 -1736 6191 -672 -4461 4090 4902 -771
858 -771 571 1088 -960 2525 3016 -2049 -505 3978 -1787 -5576 1566 2939 -2729 -2187 1372 -2262
874 -2262 -3453 1855 1126 -2787 577 1632 -3299 -2165 2885 544 -902 2327 567 -1938 3421
889 3421 3112 -2722 2266 5596 -2994 -4535 3859 1893 -3722 452 2081 -2633 -1536 429 -1885
904 -1885 655 3034 -2898 -3662 2514 129 -5055 1253 4613 -2551 -4030 2025 2071 -1154 1068 2460
920 2460 707 438 316 -1232 2443 4195 -1955 -3170 3610 1509 -5075 -695 4958 -1045 -4651 196
$$ packed form
811f012L472O035n939k344P561o42p060K644M966k263j152K765j145j544K154
826A496j412p85N088J1p558J586P036n561m971Q374J309r180J039N836m179j190
842c061M158k371j258L618l877k264R397k53r813L988P927o863l789Q551Q12n673
858g71J342N17k048L485M91n065J544M483n765l789P142J373n668N42L559l634
874b262j191N308p29l913L364J055m931J134N050k341j446L229j760k505N359
889C421l09n834M988L330q590j541Q394j966n615M174J629m714J097J965k314
904a885K540K379n932p64O176k385n184O308L360p164j479O055M6l225K222J392
920B460j753k69j22j548L675J752o150j215O780k101o584M380N653o003l606M847
$$ plain form
936 196 230 -2264 939 30 -2012 1171 949 -4629 -760 4699 -926 -2987 2600 1244 -3019 1873
952 1873 3809 -610 1507 3585 -1083 -1962 3332 1702 -1293 433 -450 -2924 -475 414 -2495 -602
968 -602 2724 -2037 -5135 1027 2831 -2483 -1621 2780 -57 -3130 265 1581 212 1918 1201 -1478
984 -1478 1833 3447 -1775 -259 5840 485 -4661 1033 2773 -2849 -1864 2089 -905 -2713 -738
999 -738 -1776 -1488 1883 -905 -3638 1089 2137 -3823 -744 5463 1318 -3401 963 2839 -846 118
1015 118 2415 445 446 1365 -1636 -1130 3607 1507 -3179 170 2026 -2848 -2300 2243 -497 -3132 750
1032 750 -449 -4635 9 3009 -1398 -1090 2587 32 -1593 1995 1238 -1000 2812 1226 -3642 365
1048 365 3961 -1111 -2112 3158 1667 -2968 -816 2042 -139 -742 82 -1616 -1445 159 -1717 -2016
$$ packed form
936A96L4k494L203r09k042L183k22n578L869N459n625k061N587j356m263M892
952A873J936m419K117K078m668q79N294j630k995J726q83k474K449Q89k909J893
968f02L326m761l098O162J804n314Q62M401k837l073L395J316j369J706p17k679
984a478L311J614n222J516O099n355n146N694J740n622R85L953k994j808J975
999g38j038K88L371k788k733M727J048n960L079O207m145m719M364J876l685R64
1015A18K297j970JR19l001N06M737k100m686L349J856m874N48M543k740k635L882
1032G50j199m186M644L000m407L08L677k555j625L588p57k238L812j586m868M007
1048C65L596n072j001N270j491m635K152K858k181o03Q24j698J71J604j876k99
$$ plain form
1064 -2016 2037 1010 -4123 -1312 3292 -407 -2644 2485 2784 -2130 -669 2460 160 710 2413
1079 2413 -698 -195 2918 -482 -2668 3314 2763 -4330 -1683 3097 -1659 -3163 1785 472 -2621
1094 -2621 -191 -528 -2770 967 1732 -2562 -927 2598 -603 -2094 2594 2692 -1038 982 1991 -975
1110 -975 -48 3023 550 -1703 1311 1115 -2072 -807 1819 -56 -976 499 -1544 -2220 1272 45
1126 45 -3320 38 2324 -2914 -3191 2553 1800 -1814 712 1576 -691 484 1669 -456 1207 2939
1142 2939 -1264 -1612 3159 1263 -2773 887 2870 -2420 -2625 1307 -115 -1803 15 -690 -1666 -135
1158 -135 -850 -2166 1117 2474 -2103 -2203 2585 1142 -2101 836 3202 -299 -840 1317 481 372
1174 372 1992 479 -1058 1405 732 -2261 -111 2402 -1169 -2011 544 -842 -2282 584 628 -2321
$$ packed form
1064b016M053j027n133K811M604l699k237N129K99m914J461L129k300N50J703
1079B413l111N03L113l400k186N982n51p093K647M780m756j504M948j313l093
1094b621K430l37k242L737P65m294J635L525l201j491M688R8l730K020J009k966
1110i75R27L071k473k253L014j96l187J265K626j875r20J475k043o76L492j227
1126D5l365L358K286n238k77N744p53l614K526Q64k267J175J185k125J663J732
1142B939m203l48M771j896m036L660J983n290k05L932j422j688J818p05r76J531
1158a35p15j316L283J357m577j00M788j443l243K937K366l501n41K157q36j09
1174C72J620j513j537K463o73k993K150K513l571q42K555j386j440K866M4k949
$$ plain form
1190 -2321 -594 1286 -1695 -1750 1863 1358 -704 297 469 -426 1582 1641 -529 734 2687 -609 -2083
1207 -2083 1822 2577 -1699 -1249 1112 -676 -2143 -31 -100 -962 220 -1411 -2486 326 1144 -2370
1223 -2370 -683 2607 -370 -3065 1358 2186 -682 334 2192 -206 -167 1598 -20 167 2398 -135
1239 -135 -2377 1400 1243 -2364 -671 2121 -1032 -2871 -397 64 -1463 122 -112 -1474 -169 596
1255 596 -1465 -441 2116 715 -1444 572 1302 -376 605 2114 186 -664 1681 415 -1592 858
1271 858 2187 -1004 -1119 745 -567 -1014 285 -547 -1236 634 -505 -3082 -101 2271 -1558 -2047
1287 -2047 2057 734 -2021 235 1922 548 495 673 -824 662 1721 -689 -634 2328 623 -2646
1303 -2646 537 2067 -969 -1467 938 -237 -2157 -499 -160 -775 127 -514 -1716 -496 1299 -1011
$$ packed form
1190b321J727J880k981n5L613n05k062J001J72q95K008N9k170J263J953l296j474
1207b083L905P55m276M50K361j788j467K112o9q62J182j631j075K812Q18l514
1223b370J687L290k977k695M423Q28k868J016J858k398L9J765j618J87K231k533
1239a35k242L777j57l607J693K792l153j839K474M61j527J585k34j362J305P65
1255E96k061J024K557j401k159K016P30j678R81J509j928q50K345j266k007K450
1271H58J329l191j15J864j312m47J299q32o89J870j139k577K981K372l829m89
1287b047M104j323k755K256J687j374n3J78j497J486J059k410N5K962j705l269
1303b646L183J530l036m98K405j175j920J658L39o15R02o41j202J220J795k310
$$ plain form
1319 -1011 -1024 2274 1188 -1846 -227 2182 -88 -173 1812 479 -609 999 394 -964 1100 1570
1335 1570 -1569 -1176 1342 -811 -1603 981 -269 -1993 -349 253 -2255 -421 1758 -818 -1902 681
1351 681 745 -1243 594 1256 228 773 875 -675 149 2713 360 -1445 1273 1471 -1757 -1282 1773
1368 1773 330 -1409 -442 -48 -1224 81 -321 -1644 -6 613 -2493 -1364 1892 162 -1481 1152
1384 1152 1766 -1076 -240 1915 1177 270 1119 -144 -180 1165 71 -1108 1313 1129 -1770 -1232 1230
1401 1230 -245 -1706 443 360 -1684 -1030 14 -811 -367 754 -656 -1461 633 506 -650 652 1587
1418 1587 -28 -43 1245 156 -289 2147 958 -1400 46 1773 -1018 -1362 1097 125 -1524 -595
1434 -595 -621 -1283 649 85 -1785 2 1312 -1384 -1920 1770 1332 -1515 -65 1316 -19 14 1098
$$ packed form
1319a011j3L298j086l034J619K409k270q5J985j333j088J608o05j358K064M70
1335A570l139L93K518k153p92K584j250j724J644O02k508J834K179k576j084K583
1351F81O4j988J837O62j028N45J02j550Q24K564k353j805K718J98l228M75L055
1368A773j443j739R67L94j176J305m02j323J638O19l106J129L256j730j643K633
1384A152O14k842Q36K155p38r07Q49j263l6J345j094j179K421j84k899N38K462
1401A230j475j461K149q3k044O54J044q25M44J121j410q05K094j27j156J302R35
1418A587j615j5J288j089m45K436j189k358J446J727k791l44K459r72j649R29
1434e95k6o62J932n64j870J787J310k696n36L690m38k847J450J381j335L3J084
$$ plain form
1451 1098 837 897 1493 -259 -755 1454 1382 -1277 -292 1264 -877 -1907 668 516 -1479 -778 38 -1260
1469 -1260 -901 275 -757 -372 1051 -427 -1547 1138 1274 -1099 200 2131 -217 -593 1381 958
1485 958 -209 1290 1271 -765 -149 920 -676 -439 956 -470 -1391 -242 -369 -1134 296 354 -1603
1502 -1603 -667 854 -432 -1336 740 1352 -574 -593 695 492 244 907 74 219 1210 188 -1151 1074
1520 1074 2213 -1278 -1248 1346 141 -1589 -102 363 -967 -541 -620 -1375 -61 723 -1444 -1005 1331
1537 1331 -213 -1766 565 1660 -386 39 1399 157 -568 1022 1033 108 849 321 -1205 79 1219
1554 1219 -370 -701 667 -299 -1796 -525 144 -801 -615 511 -568 -1496 788 259 -1047 854 937
1571 937 -799 -627 1176 492 -161 1377 302 -526 1295 915 -1003 644 1903 -1024 -1694 368 299
$$ packed form
1451A098k61O0N96j752m96K209p2k659R85J556k141j030K575j52j995P01Q16j298
1469a260L59J176j032L85J423j478j120K685J36k373J299J931k348l76J974m23
1485I58j167J499j9k036O16J069j596K37J395j426r21J149j27p65J430N8j957
1502a603R36J521j286r04K076O12j926j9J288k03k48O63q33J45R91j022j339K225
1520A074J139l491L0K594j205j730J487M65j330M26p9p55J314P84k167M39K336
1537A331j544j553K331J095k046M25J360j242p25J590J1r25P41n28j526J284J140
1554A219j589l31J368r66j497J271O69r45J86J126j079r28K284n29j306J901Q3
1571I37j736J72J803o84o53J538j075q28J821l80j918J647J259k927o70K062o9
$$ plain form
1588 299 -1071 -307 -165 -754 -597 -563 -1562 -174 1292 -648 -1729 682 1121 -1389 -271 1543 644
1605 644 -455 416 472 223 1016 570 -317 1006 808 -1170 -467 1517 -208 -1349 21 499 -1288 -903
1623 -903 294 -662 -823 -145 -551 -664 399 206 -693 613 704 -873 -318 1319 583 58 1090 548
1641 548 -427 370 1163 -478 -52 1111 -234 -1472 -19 163 -736 -341 -344 -1035 -351 103 -988 -605 1121
1660 1121 -240 -1741 -166 1275 -355 -482 1159 637 -218 302 374 418 1265 399 -870 566 1241 -792
1678 -792 -908 922 484 -1532 -730 346 -582 -588 -95 -693 -564 -203 -941 -719 803 469 -847 30 1042
1697 1042 -276 -48 905 887 -58 435 872 -285 175 837 56 -144 531 -279 -921 165 322 -1011 -275
1716 -275 41 -887 -795 24 -238 -853 238 42 -1114 -183 1061 215 -178 701 312 59 949 490 -120
$$ packed form
1588B99j370P64J42n89J57L4r99J388J466j940j081K411M39k510J118J814q99
1605F44j099Q71N6k49P93m46q87J323j98j978P03J984j725j141J370M78j787L85
1623i03J197r56j61O78m06j13J063j93q99J306R1j577N55J637p36n25J032n42
1641E48r75P97P93j641M26J163j345j238J453J82q99L95lo91O84M54j091L83J726
1660A121j361j501J575J441j630j27J641n22q55N20P2M4Q47q66j269J436O75k033
1678g92j16J830m38k016Q02J076r28oM93n98J29L61p38K22J522l34j316Q77J012
1697A042j318K28R53j8r45M93M37j157M60O62p81k00O75q10o42J086J57j333P36
1716b75L16r28R2Q19k62o15J091j96j156R31J244q46l93Q79l89k53Q90m59o10
$$ plain form
1735 -120 1594 681 -1178 -36 1350 -120 -1088 337 546 -974 -848 -355 -220 -139 -547 -1061 -378 447
1753 447 -694 -1118 676 895 -1235 -704 859 659 -163 166 805 229 392 -15 179 921 926 -372 -350
1772 -350 672 -293 -1148 -3 610 -922 -775 135 -458 -1148 175 -148 -749 176 12 -784 79 1037 332
1791 332 146 812 -4 -335 1068 776 -173 625 651 -630 -493 1054 205 -558 -31 -1 -681 -522 -350 -594
1811 -594 44 -254 -1022 -848 791 18 -1186 245 1260 -57 -828 972 1016 154 314 136 322 722
1829 722 175 -594 804 1126 -689 -1100 859 550 -1133 -313 158 -451 -987 -466 -578 -125 59 -649 -1026
1848 -1026 344 381 -747 308 1209 182 -380 742 503 -281 679 959 -177 -72 517 23 -396 549
1866 549 118 -551 -247 -107 -787 -248 320 -809 -632 293 -725 -1156 168 613 -623 -271 678 183 -386
$$ packed form
1735a20J714r13j859J142J386j470r68J425K09j520J26M93J35Q1m08n14O83Q25
1753D47j141m24J794K19k130N31J563k00q22L29O39n76J63m07J94P42Nj298K2
1772c50J022r65q55J145O13j532J47R10n93o90J323l23o01R25j64p96Q63R58p05
1791C32j86O66q16l31J403k92r49P98K6j281J37J547q49p63N27L0o80J59J72k44
1811e94O38k98p68J74J639p73j204J431J015j317p71J800M4q62J60j78J86M00
1829G22n47p69J398L22j815m11J959l09j683Q20M71o09n36N21j12M53J84p08l77
1848a026J370L7j128J055R01j027n62J122k39p84R60K80j136J05N89m94m19R45
1866E49m31o69L04J40o80N39N68j129J77R25j018m31J324M45j236L52R49m95n69
$$ plain form
1885 -386 392 522 505 712 310 -147 950 643 -450 -33 1038 52 -1340 148 821 -558 -776 87
1903 87 32 -522 -573 -678 -179 726 -540 -1155 382 834 -699 -558 1138 689 -628 196 1007 414 273
1922 273 468 157 228 644 -111 -167 592 388 -970 -265 224 -671 -345 458 -652 -877 -246 -126 -856 9
1942 9 333 -312 -293 257 104 241 696 454 -27 736 630 -243 175 955 224 -563 556 596 -880 -391 524
1963 524 -267 -700 -506 -513 -342 155 -696 -721 626 40 -1426 -45 1131 -24 -846 185 953 123 -250
1982 -250 410 785 956 230 -348 317 936 -372 -541 569 417 -1114 -796 460 -325 -963 -356 88 -437
2001 -437 -490 -276 -332 215 308 -358 -235 830 91 -311 786 942 -333 -9 824 44 -138 760 448 -542
2021 -542 -72 -28 -373 -109 37 -445 -280 -120 -719 -460 146 -410 -1100 -166 471 -315 -471 911 631 -284
$$ packed form
1885c86P78J30j7K07m02m57J097l07j093M17J071r86j392J488O73j379k18Q63
1903H7n5n54n1j05M99R05j266o15J537M52j533J41J696m49j317Q24Q11n93j41
1922B73J95l11P1M16p55n6P59k04j358P05M89q95L26Q03j110k25O31J20p30Q65
1942IL24o45J9N50j53J37M55k42m81P63j06q73M18P80p31p87J119M0j476M89R15
1963E24p91m33J94pJ71M97q51k5J347n86j466J381J176j155q22J031P68q30l73
1982b50O60L75J71p26n78O65O19j308j69J110j52j531L18J256p85o38O07M44n25
2001d37n3K14n6N47R3o66J23J065p39m02J097J56j275L24Q33p80j82Q98l12r90
2021e42M70M4l45K64J46m82J65J60n99K59O06n56o90R34O37p86j56J382k80r15
$$ plain form
2041 -284 101 549 563 579 321 148 805 607 -764 -216 861 477 -753 -93 876 -656 -1169 100 198
2060 198 -837 -577 -529 -212 29 -268 -578 435 666 -506 -526 823 554 -442 299 1012 51 -69 379
2079 379 400 166 349 -65 -479 139 -289 -525 -155 146 -825 -880 227 -244 -808 125 201 -694 -417 243 81
2100 81 -341 -11 4 -82 94 176 -39 922 835 -150 -59 869 -17 -647 490 636 -630 -507 434 -215 -295 -360
2122 -360 -257 -340 -306 -603 -482 478 345 -814 -451 860 -23 -651 532 1009 39 -71 387 510 428 310
2142 310 278 432 662 -121 -677 237 605 -780 -481 442 -328 -1066 -461 238 -242 -553 5 -416 -172 227
2162 227 -210 -191 324 326 -213 577 857 -67 300 980 51 -447 618 579 -264 16 393 -228 -156 -437 -532 -167
2184 -167 88 -531 -557 231 -131 -1149 -55 534 -423 -768 581 831 -200 -285 642 683 -193 -151 16 730
$$ packed form
2041b84L85M48J4J6k58j73O57j98j371N48J077l84j230O60R69j532n13J269R8
2060A98j035K60M8L17K41k97l10J013K31j172k0J349k69r96P41P13r61j20M48
2079C79K1k34J83m14m14O18m28k36L70L01r71n5J107m71n64R33P6q95K77O60j62
2100H1m22L30J5q6J76Q2k15R61q7r85R1R28q86o30J137J46j266J23R41o49q0o5
2122c60J03q3L4k97J21R60j33j159L63J311q83o28J183M77r70j10M58J23q2j18
2142C10l2J54K30p83n56R14L68j385K99R23p70p38O05O99m80l11N58m21K44L99
2162B27m37J9N15Kn39P90K80r24L67O80r29m98J065l9q43K80L77o21P2k81r5L65
2184a67K55o19k6P88l62j018J094N89r57l45J349K50j031q5R27M1q76M2J67P14
$$ plain form
2204 730 689 -179 -7 628 402 -803 -128 785 -52 -1290 -60 69 -386 -875 -405 62 -86 -154 -601 248
2224 248 433 -88 -222 782 406 -245 251 662 324 20 66 536 -106 158 189 -192 6 -182 -322 -319 -36
2245 -36 -474 -661 -217 9 -643 -238 221 -288 -600 411 410 -539 117 344 91 291 171 121 588 235 -187
2266 -187 229 783 212 -476 189 588 -403 -463 439 176 -760 -653 -329 -78 14 -553 -452 114 -4 -645 -395
2287 -395 726 549 -658 34 991 -48 -411 449 805 271 -172 -52 250 329 240 -375 129 459 -818
2306 -818 -812 360 -66 -982 -202 99 -815 -503 38 -354 -184 -93 2 -29 597 222 116 354 388 -227 86 492
2328 492 380 89 528 657 -252 -201 250 133 -395 -279 -208 -272 -369 -631 -321 135 -334 -1182 -209 284 -224
2349 -224 -714 358 619 -250 -96 595 631 118 40 391 407 373 -254 75 863 265 -610 -158 710 -137 -899
$$ packed form
2204G30m1q68J72O35k26j205O75R13q37j238J230J29m55m89M70M67j48o8m47Q49
2224B48J85n21j34J004l76o51M96M11l38l04M6M70o42K64L1l81J98j88j40LK83
2245c6m38j87M44K26o52M05M59n09l12J011jr49O56K27k53K00j20n0M67l53m22
2266a87M16N54n71o88O65L99r91o0R02k63r36J07L24K51R2n67J01N66j18o41K50
2287c95J121j77j207O92R57j039l63Q60L56n34m43J20L02P9q9o15N04L30j277
2306h18OJ172m26r16P80L01r14L12N41l92J70R1R5l1O26l75j06K38L4o15L13M06
2328D92j12k91M39J29r09N1M51j17n28J16P1o4r7k62L10M56m69q48R73M93n08
2349b24m90J072K61q69J54O91L6n13p8L51J6l4o27L29P88n98q75M52Q68q47p62
$$ plain form
2370 -899 33 426 -104 -949 -333 93 15 -115 -367 182 76 -271 -414 629 591 -388 -114 804 99 -285
2390 -285 295 621 24 147 244 -321 142 57 -148 -2 16 -211 -351 -126 -171 -889 -80 282 -579 -720 389
2411 389 570 -446 -184 352 146 -151 252 61 533 356 -66 159 768 314 -366 -139 808 -247 -749
2430 -749 260 428 -552 -836 79 248 -394 -572 -269 52 76 -492 -410 800 170 -607 92 948 37 -399
2450 -399 324 762 269 131 252 425 268 171 -271 215 494 -549 -603 295 260 -639 -244 109 -250 -415 -148
2471 -148 -99 -372 -89 262 207 18 -33 -171 230 557 -133 355 616 231 -407 332 679 37 -426 224 145
2492 145 -451 -231 88 -164 -407 -508 -401 -140 -123 -738 -471 550 90 -713 32 609 -359 -236 552 670
2512 670 136 -40 193 452 521 -339 52 787 352 -568 -178 617 -13 -796 -130 371 -43 -676 -261 -80
$$ packed form
2370h99R32L93n30q45O16M26p8j30k52N49j06l47j43J043l8r79K74R18p05l84
2390b85N80L26n97J23R7n65M63q5k05J46J8k27j40K25m5p18Q09L62q61j41J109
2411C89J81j016K62N36k06k97M03j91M72j77m22K25O09m54o80K27R47j055n02
2430g49J009J68r80k84R15J69o42j78L03L21K4n68Q2J210o30p77O99Q56r11m36
2450c99P23M38m93j38J21J73j57r7m42M86K79j043n4Q98l5q99L95L53l59j65K67
2471a48M9k73K83L51n5j89n1j38M01L27o90M88K61l85o38P39L47o42m63O50p9
2492A45n96K20L19k52k43j01J07K61J7o15K67J021m60q03P45N77r68J23P88J18
2512F70n34j76K33K59O9q60L91P35m35r20L90P95o30p83O66N01m14o33M15J81
$$ plain form
2532 -80 -434 -405 -483 127 193 83 -205 410 286 42 -171 667 336 -206 208 625 67 -92 440 310 -56
2553 -56 -37 -82 -311 -293 -412 -304 -63 -447 -779 -336 68 -403 -765 221 183 -20 -305 420 304 -34 91 305
2575 305 498 210 -104 87 808 254 -262 11 952 -36 -500 91 530 -545 -932 101 -22 -648 -509
2594 -509 -342 -193 48 -368 -444 315 283 -742 47 766 197 -127 358 767 222 62 176 450 -54 -112 -262
2615 -262 163 298 -501 -545 332 34 -692 -397 113 -262 -574 -71 376 -171 -500 36 -87 -71 74 102 325
2636 325 293 104 63 780 377 -170 379 643 -258 -396 478 525 -555 -402 128 13 -572 -371 -305 163 -209
2657 -209 -658 -200 563 -257 -882 369 527 -197 -531 436 775 151 -249 128 685 -68 103 20 191 388
2677 388 -346 -334 521 -95 -648 55 698 -443 -677 -35 430 -341 -444 -201 -158 317 115 -156 174 502
$$ packed form
2532h0l54K9p8O10O6j10k88O15j24k44k13Q38l31n42M14M17n58j59N32j30l66
2553e6J9m5k29J8j19J08K41l84l32M43M04m71l62R86l8k03k85P25j16l38J25K14
2575C05J93k88l14J91P21n54n16K73R41r88m64N91M39j075l87J033j23o26J39
2594e09J67J49K41m16p6P59l2j025P89P19n69l24M85M09n45j60J14K74n04n8j50
2615b62M25J35p99m4Q77k98p26K95N10l75l12N03M47n47l29N36j23J6J45K8K23
2636C25l2j89m1P17m03n47N49K64r01j38Q74M7j080J53N30j15n85K01O6M68l72
2657b09m49M58P63q20o25J251J58p24l34R67L39o24m00L77N57p53J71q3J71J97
2677C88p34J2Q55o16n53P03O43j141k34O42M65p71j03K43M3M75k02k71L30L28
$$ plain form
2697 502 -63 -142 599 -1 -214 46 587 48 73 212 187 -127 0 22 -442 152 -400 -401 -141 -160 -455 -286
2719 -286 168 -108 -682 39 439 -302 -294 266 506 7 -6 300 562 147 54 352 725 467 -472 -163 552
2740 552 -211 -1082 -317 533 -242 -865 30 129 -378 -307 -168 106 -54 -661 -540 304 351 -139 -152 627 187
2761 187 -417 322 853 164 -70 500 463 100 -80 -209 159 116 -370 -433 -27 150 -524 -360 187 -411 -460
2782 -460 105 345 -128 -549 248 163 -92 39 499 322 332 53 388 486 412 -88 132 547 -20 -512 53
2803 53 692 -643 -306 -64 23 -310 -334 -7 74 34 -437 -215 484 14 -557 -15 601 -10 -409 293 674
2824 674 40 -57 290 494 215 288 158 165 322 -286 -212 271 247 -699 -402 182 -132 -528 -30 49 -472 -318
2846 -318 85 228 83 194 55 237 347 -44 34 675 455 -280 27 527 158 -32 285 452 -319 -273 293
$$ packed form
2697E02n65p9P41o00k13K60N41n39K5J39k5l14J27K2m64N94n52jK60j9k95J69
2719b86M54k76n74P21M00p41QN60K40m99j3L06K62m15r3K98L73k58r39L09P15
2740E52p63q71P65Q50p75o23Q95R9n07P1J39K74j60o07J21Q44M7m90j3P79m40
2761A87o04P39N31o89k34N70l7l63j80j29L68m3m86o3M06J77o74J64N47n98m9
2782d60N65K40m73m21P97q5k55J31M60j77J0k79L35R8p4n00K20M15n67m92N65
2803E3O39j335L37K42Q7l33k4L27Q1m0m71K22O99m70n71N42O16o11l99P02L81
2824F74o34r7L47K04k79P3j30PJ57o08P4M83k4r46K97N84l14l96M98P9n21J54
2846c18M03J43j45J11j39J82J10l91P8O41k20p35L07N00l69j90L17J67p71M6N66
$$ plain form
2867 293 169 -85 -137 -35 -133 14 -316 -206 111 -61 -626 67 421 143 -516 644 498 -102 -100 88 317
2888 317 218 -51 270 317 100 -171 -142 470 115 -706 -190 343 -308 -668 -120 37 -519 -509 -136 61 -320
2909 -320 -326 -333 192 559 -557 -145 473 318 -259 305 869 199 -62 352 689 18 -108 -10 129 -260 -66
2930 -66 -142 -163 -27 -488 -598 -109 -389 -726 -83 239 -381 -477 308 -9 -230 -11 396 57 -90 -17 143 101
2952 101 297 -127 63 510 116 -540 296 546 -202 -575 194 282 -571 -199 -104 114 -175 -477 -179 194 -60
2973 -60 -421 -348 924 153 -471 254 778 -36 -112 502 471 145 -91 41 128 245 -384 -218 290 361 -394 -399
2995 -399 213 -261 -848 -256 222 -209 -283 -151 -84 28 7 72 221 372 -118 -81 375 661 73 54 629 100
3017 100 -202 55 396 -201 -151 282 -102 -283 -166 -246 -203 -435 -314 -557 198 -257 -562 235 350 -298 -472
$$ packed form
2867B93j24k54n2J02r8J47l30J10L17j72n65O93L54k78o59J160j46o00KJ88K29
2888C17r9k69L21M7k17k71K9O12l55q21N16N33o51l60N48J57n56J0L73J97l81
2909c20opN25L67j116M12O18j55n77N64N64o70k61M14L37o71j26R8J39l89J94
2930f6p6k1J36m61j10M89k80l37O43L22o20r6P85l17k21K19M07l39j47P3J60m2
2952A01J96m24J90M47l94o56Q36K50p48l73P69Q8q53L72R5K18k89l02K98L73k54
2973f0l61P3J272p71o24P25N24q14p6O14l1l26k36J32Q7J17o29J66N08P1p55n
2995c99O12m74n87N92M78m31p4J32O7J12k1O5J49J51m90L7M56K86n88j9N75n29
3017A00l02K57L41n97N0M33l84j81J17q0M3k32J21k43P55m55l05P97J15o48j74
$$ plain form
3038 -472 265 383 179 -142 526 397 -12 160 351 581 320 -314 -128 395 17 -586 11 413 -421 -692
3058 -692 -186 253 -105 -315 92 130 -158 -288 -214 200 281 -175 -33 523 625 -332 27 762 325 -423 323
3079 323 435 9 49 34 225 -32 -160 -270 -48 0 -340 -316 195 -82 -534 30 172 -20 -367 280 144
3100 144 -445 -13 302 233 403 102 130 271 257 -185 99 438 147 -250 -51 426 -257 -138 139 454 -551
3121 -551 -502 26 -138 -421 -165 -142 130 111 -569 -129 514 -35 -212 236 545 -7 -167 604 481 44 70
3142 70 257 83 -14 -237 -138 328 126 -526 -264 140 -57 -805 -219 22 -510 -354 318 308 -118 -124 101 198
3164 198 226 31 195 379 361 116 72 508 126 36 264 494 -318 -217 197 50 -573 -360 -134 -169 -260 -344
3186 -344 -245 28 -231 -252 -195 383 -274 -308 151 331 -113 -434 199 275 -112 -28 239 567 -36 -485 192 463
$$ packed form
3038d72P37J18k04l21O68j29m09J72J91K30k61o34J86N23l78o03N97M02q34k71
3058f92N06M39l58k10M07L8k88j30P4M14Q1m56J42N56J02r57L59P35m37p48P46
3079C23J12m26M0j5J91k57j28j10K22M8l40K4N11k77m52N64J42j92l47O47j36
3100A44n89M32L15o9J70l01K8J41j4m42K84L39k91l97J99M77o83J19K77L15j005
3121e51M9N28j64k83K56K3K72j9o80M40O43n49j77M48L09n52j60P71j23m37K6
3142G0J87j74r7k23R9M66k02o52K62M04j97p48N86K41n32J56O72j0m26oK25R7
3164A98K8j95J64J84j8k45m4M36l82r0K28K30q12J01M14j47o23K13K26l5r1q4
3186c44R9K73k59k1N7N78o57l4M59J80m44l21O33P6l87Q4K67L28o03m49O77K71
$$ plain form
3208 463 76 -725 -55 422 44 -666 64 146 -416 -409 99 -216 -25 -152 -87 -4 -132 -278 -263 341 621 -230
3230 -230 214 551 -70 -263 715 547 -18 47 355 92 -152 -138 -223 -204 -131 -226 -103 166 -146 -364 78 405
3252 405 -335 -489 139 39 24 -175 254 114 -26 148 414 327 505 -165 213 481 180 -263 73 593 -246
3273 -246 -506 141 305 -509 -101 28 47 -262 -428 -132 -27 1 -389 -58 311 10 -456 -68 631 128 -264
3294 -264 391 538 -93 -233 209 144 96 -51 -312 60 -95 -201 -152 309 -126 -281 -123 240 -232 -572 177
3315 177 236 -86 -161 228 191 173 251 0 208 454 -117 69 509 -16 -310 267 290 -158 -53 179 158 -358
3337 -358 -395 -32 -213 -145 -340 -310 -54 -35 -187 -219 468 -136 -386 382 543 5 -391 504 495 -28 30 206 126
3360 126 69 22 -41 331 -64 -62 -37 459 -154 -831 -193 248 -234 -500 -188 95 129 -47 19 87 -22 59 -246
$$ packed form
3208D63l87q01O70M77l78p10P30Q2n62PN08l15J91j27O5Q3j28j46J5O04K80q51
3230b30M44L37o21j93R78j68n65O5L08k63k44J4q5J9P3r5J23K69l12k18M42L27
3252D05p40j54O28j00j5j99M29j40j40J74K66q7J78o70L78K68l01m43L36N20q39
3273b46k60O47J64q14M08J29J9l09j66K96J05K8l90L31L69l01m66L88O99n03l92
3294b64O55J47o31j40M42o5m8j47k61L72j55j06M9M61m35j55J58L63m72l40P49
3315A77N9l22p5L89l7j8P8k51K08K46n71J86M40n25k94N77K3m48J05K32k1n16
3337c58l7L63j81O8j95L0K56J9j52l2O87o04k50P68J61n38l96Q95rn23N8J76q0
3360A26n7m7o3L72l95KK5M96o13o77O38M41m82k66L12K83L4j76O6O8j09Q1l05
$$ plain form
3383 -246 308 393 -339 1 309 132 -199 298 499 -233 -96 202 190 -406 -128 37 -240 -74 -293 -56 -212
3404 -212 -45 -473 -243 222 -284 -264 291 90 -363 -191 338 216 -18 146 316 411 -185 -8 -52 392 -158
3425 -158 -269 329 466 -198 -218 359 90 -349 -337 -150 41 -171 -367 -192 161 154 -169 -389 422 339 -274 86
3447 86 611 234 -206 286 418 -326 -269 240 133 -65 -16 -134 -79 -81 -538 -140 -97 117 -606 -40 -33 -325 -517
3470 -517 -10 35 -321 -90 120 352 91 60 174 345 303 -144 -205 362 -30 -140 125 338 -43 -253 198
3491 198 69 -325 -226 -53 23 -122 -254 10 63 -107 -164 -106 448 -38 -308 126 543 140 -75 295 354 97
3513 97 -2 353 256 115 121 105 314 238 -89 -373 388 -269 -443 -60 314 -367 -429 95 154 -299 -107 -16 97
3536 97 24 259 -130 297 269 -115 204 509 160 87 157 172 -178 -88 196 -3 -362 128 75 -137 165 -200 -93
$$ packed form
3383b46N54Q5p32L40L08j77l31M97K01p32J37K98j2n96K78J65k77J66k19K37j56
3404b12J67m28K30M65n06K0N55k01m53J72N29j22k34J64J70R5n96J77m4M44n50
3425a58j11N98J37o64k0N77k69m39J2J87J91k12j96J75L53pl23k20Q11q3o13L60
3447H6N25l77m40M92J32p44N7N09j07j98M9j18N5km57L98M3K14p23N66Pk92j92
3470e17N07M5l56K31K10K32k61l1J14J71m2m47o1N67l92j10K65K13l81k10M51
3491A98j29l94R9J73P6j45j32K64N3j70n7N8N54m86k70M34M17m03k15L70N9k57
3513I7r9L55r7j41Oj6K09p6l27k84P61o57j74L83L74o81o2N24N9m53J92R1J13
3536I7p3K35l89M27k8l84L19L05l49p3P0J5l50R0K84j99l59M90n3k12L02l65J07
$$ plain form
3559 -93 144 90 -432 -388 106 -297 -227 89 19 -150 -41 336 180 -39 8 388 55 143 -17 170 399 -27
3581 -27 -280 -212 399 -322 -460 189 221 -180 -187 -11 67 -240 -184 -52 52 -56 49 -67 169 143 -571 100 235
3604 235 247 -135 86 444 163 -113 523 139 -29 -58 80 207 -173 24 -41 69 -99 -482 -296 157 -212
3625 -212 -158 -22 -194 -45 -245 32 -29 -342 80 169 185 196 41 276 361 -66 -119 -65 472 -70 -25 208 142
3648 142 -161 -321 -7 -142 -405 -75 -77 154 -245 -456 270 407 23 -61 106 273 75 -248 475 255 -28
3669 -28 123 265 389 284 -36 -28 241 66 -110 217 358 -76 -401 -248 340 -214 -331 -96 -198 -247 -166 316
3691 316 -173 -125 37 183 251 312 -4 280 326 168 -34 121 534 -146 -218 362 -59 -105 -44 -75 55 -325 -343
3714 -343 26 142 -76 -397 -70 72 -113 -256 15 271 10 -30 317 375 -129 -61 73 343 351 22 228 391
$$ packed form
3559i3K37n4n22M4M94m03P0L16p0j69J09L77j56k19M7L80l33Q8j60J87K29m26
3581b7k53O8O11p21j38O49L2m01pJ76P8l07N6J32J04j08J05j16K36k6p14O71J35
3604B35J2l82K21L58k81k76O36l84j68k9J38J27l80J97o5J10j68l83J86M53l69
3625b12N4J36j72J49k00K77o1l13M22Q9J6J1j55K35Q5m27n3N4N37n42M5K33o6
3648A42l03j60L14j35k63L30kK31l99k11P26J37l84q4J67J67j98l23P23k20k83
3669b8J51J42J24j05l20QK69j75j76L27J41m34l25J53N88n54j17K35j02m9Q1M82
3691C16m89M8J62J46O8O1l16K84M6j58k02J55M13o80p2N80m21m6O1l1J30l80j8
3714c43L69J16k18l21L27J42j85j43K71K56k61m0L47N8n04O8J34K70Ql29K06J63
$$ plain form
3736 391 77 -282 256 111 -245 -457 19 184 -422 -225 -103 -45 -161 -106 -47 -28 -112 113 39 147 -43 -179
3758 -179 -114 501 205 -168 133 415 -86 -204 290 45 -112 -378 -5 68 -153 -102 -420 -93 -153 -331 94
3779 94 128 42 -263 137 112 -236 -99 168 170 -396 100 239 72 227 -149 45 377 96 -218 321 494 59
3801 59 -237 25 285 -431 -284 98 95 -195 -196 117 -5 -306 -153 -235 28 65 -358 327 528 -51 -323 55
3823 55 170 -74 -123 194 149 -68 36 14 35 11 -105 -96 86 25 -253 13 255 -198 -288 -67 86 -350 -124
3846 -124 280 -174 149 -202 111 130 75 9 237 288 -53 -38 93 324 91 -346 132 275 -542 43 226 38
3868 38 -341 -44 39 106 109 -268 -140 97 -54 -133 252 -74 -129 15 188 194 -256 -103 444 134 1 -80 375
3891 375 198 53 -365 -9 351 -72 -263 13 342 -284 -464 192 171 -294 -41 -39 -30 14 -103 89 86 -6 -69
$$ packed form
3736C91l14l59N38j45l56k12M76J65o06J97J22N8j16N5N9J9q4K25p4J08j90j36
3758a79O5O15k96l73L01K82n01j18M94k45j57k66L73P3k21N1l18L27o0j78M25
3779I4L4q6l05M00k5l48J37K67Kn66M96J39j67J55l76J94L32k81l14N39J73m35
3801E9k96K62K60p16J47L82lk90jL13j22l01J53q2K63L7m23O85K01n79k72L78
3823E5J15k44m9L17m5k17J04k2K1k4j16RJ82o1k78K66K42m53r0K21J53m36K26
3846a24M04m54L23l51L13J9n5o6K28N1l41J5J31K31k33m37M78J43q17N85J83j88
3868C8l79K97Q3O7Ll77J28K37j51p9L85l26n5J44J73Om50J53N47l10j33q1M55
3891C75j77j45m18L56L60m23j91K76L29o26j80O56k1m65K53KRM4j17J92lr2o3
$$ plain form
3914 -69 137 267 -45 -196 320 370 5 -182 79 402 -199 -210 156 362 125 -119 18 230 22 -210 -10
3935 -10 65 -75 -352 110 -19 68 -26 -100 382 -269 -84 273 -18 212 133 -209 148 -243 4 -81 229 -55
3957 -55 -171 194 3 -202 -289 90 -39 -316 -438 157 22 -159 -327 -68 -130 1 -74 259 259 148 -243 80
3979 80 495 -208 120 523 397 45 -131 127 -8 162 -46 103 74 -144 -201 -120 137 82 -454 -61 90 -112
4001 -112 -455 281 147 -165 -185 86 -17 131 -68 370 308 135 -145 216 129 121 114 -67 -51 -342 -7 114 42
4024 42 -296 148 296 103 -227 -187 34 101 -340 -196 230 139 -186 -145 180 362 15 5 271 303 -9 70 424
4047 424 198 78 -280 2 -7 -132 -248 -39 46 -414 -223 0 192 -255 -366 -43 -3 62 302 149 121 287
4069 287 235 99 415 99 -199 152 402 244 -101 175 185 -144 91 242 135 -314 21 98 211 -195 -251
$$ packed form
3914f9K06J30l12j51N16N0l65j87K61L23o01j1L66K06k37k44J37K12k08k32K00
3935a0P5j40k77M62j29Q7r4p4M82o51J85L57k91K30p9l42L57l91K47q5L10k84
3957e5j16L65j91k05q7L79j29k77j22N95j35j81j68K59o2J31p5L33%j11l91L23
3979H0M15p03L28M03j26l52j76K58j35J70k08J49k9k18n7Q1K57n5n36L93J51k02
4001a12l43P36j34l12k0K71j03J48j99M38o2j73k80L61q7qpj81J6k91L35J21p2
4024D2l38M44J48j93l30M0K21O7m41J44M26r1l25M1L25J82l47j0K66L2l12P9L54
4047D24k26j20l58K82rj25j16K09Q5m60J91K23J92m47j11L23M0O5K40j53k8J66
4069B87n2j36L16l16k98L51K50j58l45K76J0l29K35J51j07m49L35P7J13m06n6
$$ plain form
4090 -251 -137 -41 -174 -493 3 261 -249 -230 71 199 -55 -106 106 325 -97 118 225 139 13 175 139 30
4112 30 -119 -474 3 409 -188 -150 34 33 -135 -305 -22 209 118 69 46 5 400 -209 78 191 7 -292 194
4135 194 370 62 -67 87 365 46 -318 302 20 -51 57 -250 35 -74 -361 49 164 -26 -198 -168 140
4156 140 -415 -369 64 -125 -321 -253 52 48 -5 -48 59 342 193 44 10 208 -196 118 -109 172 -90 3 314
4179 314 -40 -137 -3 151 51 -97 -292 -107 -152 -8 -370 -41 358 -189 -315 222 267 -275 -52 296 301 20
4201 20 -42 244 330 94 164 57 430 -46 -130 -253 -94 -227 -342 75 14 -272 -59 -198 88 -151 -170 44
4223 44 4 66 3 -137 254 18 -196 166 476 -38 -173 -24 156 82 -370 136 21 -141 -179 -173 -24 -38 -250
4246 -250 -281 -154 -220 -127 -285 46 11 -76 290 -150 -50 -245 35 110 236 -9 222 176 -121 11 107 171 -98
$$ packed form
4090b51J14R6j33l19M96K58n10J9L01J28k54n1K12K19m22K15J07q6j26J62l6j09
4112C0j49l55M77M06n97L8J84jj68j70K83K31r1m9k3m1L95o09K87J13j84k99M86
4135A94J76l08j29J54K78l19l64O20k82p1J08l07K85j09k87M10J15j90j72L0L08
4156A40n55M6M33j89j96O8L05mn3m3J07K83j49j49l4J98m04L14k27K81k62R3L11
4179C14l54r7J34J54j00j48j95J85m5J44l62L29L99n47j26N37M5n42K23L48Nk81
4201B0o2K86Q6k36P0j07L73m76q4j23J59j33j15M17o1k86K13j39K86k39j9K14
4223D4m0O2o3j40L91k36k14L62L10n14j35J49J80p4m52N06j15j62l8OJ49j4k12
4246b50l1J27o6R3j58L31l5q7L66m40J00j95K80P5J26k45K31m6k97J32R6O4k69
$$ plain form
4269 -98 -214 190 316 -301 -158 -41 -34 -452 -156 240 -114 -288 -155 113 61 -127 -152 -5 488 199 4 209
4291 209 320 -11 -261 405 123 -122 -173 19 102 -49 -191 74 -93 -229 -196 -58 -51 62 -182 -247 108 -179
4313 -179 -305 232 -52 -206 -8 265 -61 77 105 160 356 59 -71 175 351 -104 -62 68 166 -249 -5
4334 -5 -19 342 -284 -329 -155 -63 -26 -155 -130 188 -274 -33 -45 -12 -56 -57 15 327 -221 -88 230 222 71 8 173
4359 173 71 38 88 -97 -52 -131 -276 -58 -24 82 -270 -125 -200 -440 -121 -7 14 -113 -249 236 89 -137
4381 -137 -9 -65 381 72 -45 -96 284 114 37 104 163 150 -32 -213 -128 42 -25 131 -86 -339 -12 -182 34
4404 34 -152 109 -195 348 -224 -159 185 -80 -168 -242 274 271 -287 76 313 -74 -53 -123 178 179 111 -345 -264 -2
4428 -2 -374 -146 -40 64 -181 -235 32 6 -159 -354 -113 249 -13 -234 -77 -51 45 -33 91 385 119 75 428
$$ packed form
4269i8j16M04J26o17J43J17Pm18K96L96l54j74J33K68n2j88k5J47M93k89j95K05
4291B09J11l31k50O66k82k45n1J92Q3j51j42K65j67j36L3J38PJ13k44o5L55k87
4313a79j26N37k84j54J98K73l26J38K8N5J96k97j30K46J76m55M2J30R8m15K44
4334ej4L61o26m5J74R2L7j29K5L18m62K41j2L3m4jP2L12n48J33L18qj51o3J65
4359A73j02l3N0j85M5p9j45K18L4J06l52J45p5k40L19J14K1j27j36M85j47k26
4381a37J28n6M46l09j17n1L80j70p7O7N9j3j82j81Q5J70o7J56k17k53L27j70K16
4404C4j86K61l04N43n72O5L44k65q8p4N16ln58L63K37l87K1p0L01Jo8m56Q1K62
4428bl72K28J06J04k45n4K67k6j65j95K41L62k62k21J57K6R6p8J24K94k66m4L53
$$ plain form
4451 428 160 195 -39 -236 17 85 19 -147 41 -121 -139 -208 135 -120 -469 137 -17 -53 -346 -28 172 -206
4473 -206 -177 228 60 -200 -8 163 169 29 227 -41 256 -46 -318 148 18 -138 -219 -82 -141 -211 -96 28
4495 28 120 -10 -101 -149 -240 -93 44 103 -137 -262 -97 145 331 -85 -68 185 93 1 -172 67 186 -84 104
4518 104 176 77 52 37 110 -75 -249 -7 97 -35 -426 -95 55 124 22 -265 2 66 116 -9 -187 238 -61
4541 -61 4 243 173 157 -55 121 151 -293 -94 308 -153 -304 20 51 -181 -361 -45 -120 -192 -173 -111 42 27 -234
4565 -234 -349 153 209 -55 271 122 220 211 -12 204 195 29 -54 241 -20 93 -109 81 22 -163 -111 55 -104
4588 -104 -238 -238 -8 46 -174 -147 -36 146 -75 -123 30 131 -25 -73 -34 301 141 -49 176 173 127 -23 219
4611 219 178 -333 28 -171 63 -18 -107 -17 20 -318 -338 -28 -11 -71 -137 -35 151 -191 -11 38 263 199 -103 203
$$ packed form
4451D28k68L5k34j97K53O8o6j66J88j62j8o9L43k55l49O06j54l6k93L18K00l78
4473b06K9M05j68k60J92J71Oj40J98k68K97l02k72M66j30j56q1J37n9p0J15J24
4495B8R2j30r1m8r1J47J37N9k40j25J65K42J86m16J7K53r2r2j73K39J19k70J88
4518A04P2r9k5j5P3j85j74K42J04j32l91L31J50O9j02k87K67O4N0j25j78M25k99
4541f1O5K39p0j6k12J76L0m44J99M02m61j51L24L1k32j80L16p5p2J9O2J53j5k61
4565b34j15N02N6k64L26j49R8rk23K16rj66q3K95k61J13k02J90n9j85N2J66j59
4588a04j34%K30N4k20K7J11J82k21m8J53J01j56m8L9L35j60j90K25lm6j50K42
4611B19m1n11L61j99K34q1q9R0L7l38k0L10J7o0o6J02J86l42J80M9K25o4l02L06
$$ plain form
4635 203 74 216 -264 141 162 -24 65 289 114 -86 -85 150 -13 -88 -189 -44 -170 -85 -70 292 0 -109
4657 -109 112 17 94 -144 54 -19 465 22 69 158 13 -110 266 194 -82 152 65 -18 114 -273 133 37 -82
4680 -82 -33 -174 33 -89 -115 -156 199 29 -201 -220 56 -98 -7 81 13 130 45 65 155 20 30 173 193 153 -10
4705 -10 110 187 28 -139 -228 -35 -286 -143 -340 169 103 -266 22 -177 -28 -196 -143 145 211 -125 -90 323
4727 323 -45 34 7 288 143 -25 44 26 289 76 -41 127 -10 -223 -266 -114 382 -6 -271 169 -31 -137
4749 -137 -125 123 102 -18 -251 208 231 -20 97 141 336 79 -69 -91 188 -146 -108 176 -142 7 -78 243
4771 243 165 -183 -87 -28 -65 69 92 -228 25 135 -93 76 89 84 -163 221 98 -239 29 -182 28 -111 -36
4794 -36 -41 4 107 -108 221 -53 -338 -209 162 2 -283 -373 -176 -145 -146 -275 114 57 -174 67 -90 74 -132
$$ packed form
4635B03j29J42m80M05K1j86Q9K24j75k00JK35j63p5j01J45j26Q5J5L62k92j09
4657a09K21r5P7k38J98p3M84m43M7Q9j45j23L76p2k76K34q7q3J32l87M06r6j19
4680h2M9j41K07j22k6m1L55j70k30j9K76j54R1Q8o8J17q5K0R0j35J0J43K0m0j63
4705a0J20P7j59j67q9J93k51J43j97N09o6l69K88j99J49j68N3K88O6l36L5M13
4727C23l68P9k7K81j45j68O9j8K63k13j17J68j37k13m3J52M96l88k65M40k00j06
4749a37J2K48k1j20k33M59K3k51J17M4J95k57j48k2K79l34L8K84l18J49q5L21
4771B43p8l48R6N9l7J34K3l20K53J10k28J69J3nk47L84j23l37K68k11K10j39P5
4794c6nM5J03k15L29k74k85J29L71j60k85r0J97L1jj29L89n7k31K41j57J64k06
$$ plain form
4817 -132 -249 251 41 -211 -5 81 499 117 -19 254 181 105 -73 -11 0 -302 -116 97 170 -42 -18 19 -214
4840 -214 156 -338 -122 112 -24 -406 329 165 114 154 74 339 160 96 63 478 -81 43 242 16 128 26
4862 26 429 180 -157 199 277 -80 -284 -309 -113 -23 -453 -30 -2 99 -174 23 0 -70 -121 -122 51 137 -179 21
4886 21 177 131 15 16 247 143 30 -133 75 369 -94 -152 82 172 -8 -238 -135 -92 -77 -134 84 165 22
4909 22 -81 277 295 -123 -82 249 403 -102 -256 174 260 146 115 29 190 148 -57 -121 8 -50 -151 -50 99
4932 99 -13 -215 -137 63 -166 -251 207 223 -106 -50 -17 20 117 136 273 159 -90 11 75 66 -16 -57 69 3 -184
4957 -184 -176 -157 -79 -142 -504 157 -286 -144 -190 77 191 184 -82 114 65 31 123 -69 -25 -49 190 180 359 -120 198
4982 198 149 205 -80 74 -13 -107 -260 24 3 -147 -49 -103 142 92 -291 -67 60 -254 99 66 259 -61 -38
$$ packed form
4817a32j17N00k10k52K06Q6M18l82j36K73p3p6j78O2J1l02J86K13P3k12K4L7k33
4840b14L70m94K16K34j36l82P35j64n1M0q0K65j79o4l3M15n59J24J99k26J12j02
4862B6M03k49l37L56P8l57k04k5J96R0m30M23K8J01k73J97k3p0n1jJ73Q6l16K00
4886B1J56m6j16JK31j04j13j63K08K94m63n8K34R0j80k30J03M3J5n7K18Q1j43
4909B2j03L58J8m18M1L31J54n05j54M30Q6j14l1q6J61m2k05o4J29n8j01J01J49
4932I9j12k02P8K00k29q5M58J6l29N6L3L7R7J9J37j14k49J01O4rq2m1J26o6j87
4957a84QJ9P8o3l62O61m43J42m6K67J14pk66J96m9l4R2j92M4k4K39j0J79m79L18
4982A98m9N6k85J54q7r4j53K84k1j50R8n4K45n0l83K24J27l14L53l3J93l20K3
$$ plain form
5005 -38 -269 151 198 1 65 29 -39 76 20 205 38 -24 190 93 116 81 -88 265 -90 -37 -117 -58 -367 -274 -231
5030 -231 -27 193 -83 -111 280 -82 -146 -242 435 -1 18 45 153 225 -73 -51 94 -46 -148 -167 100 34 -160
5053 -160 -31 214 -36 -161 88 -87 107 17 -302 -86 -15 36 90 25 191 -152 74 42 115 -128 2 24 274
5076 274 8 -89 75 32 -187 -8 148 -69 -65 -286 61 -41 152 -319 71 -69 -140 -30 82 -27 -245 40
5098 40 239 270 -209 -83 181 300 -126 147 300 88 51 -271 19 -9 -422 -259 80 71 -242 -232 42 171
5120 171 71 -330 156 -28 -123 -94 65 15 30 151 -8 121 -114 82 142 123 57 -52 -86 102 -35 -83 -18
5143 -18 64 -238 -40 67 38 -154 104 -55 -65 -110 -147 -36 326 -78 -433 61 -131 -84 207 184 106 87 61 186
5167 186 115 217 195 -41 162 -137 -52 43 -20 -23 60 42 -179 -46 -221 110 -198 28 39 -48 206 -29 81 100
$$ packed form
5005c8k31M20M7j97O4l6o8J15n6J85j67o2K14r7K3l5j69L53l55N3q0N9l09R3M3
5030b31K04K20k76k8L91l62o4r6O77m36J9K7J08P2k98K2J45j40j02j9K67o6j94
5053a60J29K45k50j25K49j75J94r0l19K16P1N1N4o5J66l43K26l2P3k43J30K2K50
5076B74k66r7J64m3k19J79J56k17Mk21L47j02J93m71L90j40p1J10J12j09k18K85
5098D0J99L1m79J26K64J19m26K73J53k12l7l22K90k8m13J63L39rl13J0K74J29
5120A71j00m01M86j84r5K9J59n0J5J21j59J29k35J96O0j9o6j09l4J88j37m8O5
5143a8Q2l02J98J07k9j92K58j59j0m5l7J11L62m04l55M94j92M7K91k3p8j9k6J25
5167A86p1J02k2k36K03k99Q5R5o3lQ3j8k21J33j75L31l08K26J1q7K54k35J10J9
$$ plain form
5191 100 -43 -287 -142 -73 128 -8 4 166 186 101 64 290 25 -158 -28 68 23 -14 -48 117 71 5 -62 30
5215 30 -254 -139 1 -85 -76 -387 -35 219 19 -34 -99 -18 306 94 -8 280 74 -21 -10 132 -182 -79 -228
5238 -228 -148 -30 -163 -148 271 -338 16 35 53 -23 -100 -223 -129 158 21 -86 -72 -18 -7 -64 129 260 -86 209
5262 209 170 118 -54 -210 -105 20 -38 3 -18 336 -158 -26 -111 85 -124 -79 130 -7 -3 228 240 -159 -80 21
5286 21 168 -100 200 105 33 300 -19 80 157 -8 118 24 179 -155 -190 181 -204 -71 65 -151 -4 -144
5308 -144 -187 -344 9 18 -366 67 19 57 -63 -244 111 -77 -151 150 -99 253 105 -77 69 165 66 -147 129
5331 129 -148 210 -137 38 -271 6 138 -90 85 -77 -221 45 -110 -227 1 -56 137 -48 7 271 -28
5352 -28 268 49 49 182 -42 387 148 164 137 102 -297 -27 -306 30 66 6 -280 -147 -230 42 -126 -133 -219 1
$$ packed form
5191A00j43k44J45O9K01j36J2J62K0q5l7K26k65j83J30R6m5l7l4J65m6o6o7R2
5215C0k84J15J40q6Rl11L52K54k00n3o5Q1L24k12j02K88k06r5J1J42l14J03j49
5238b28Q0J18j33J5M19o09L54J9J8p6p7j23R4K87j37j07J4N4J1n7J93J31l46K95
5262B09l9n2j72j56J05J25n8M1k1L54m94J32q5J96k09M5K09j37MK31J2l99P9J01
5286B1J47k68L00r5p2K67l19R9P7j65J26r4J55l34l5L71l85J33J36k16J47j40
5308a44m3j57L53Rl84M33m8L8j20j81L55j88p4L01k49L52j48j82J46R6r9k13K76
5331A29k77L58l47J75l09K77J32k28J75j62j44K66j55j17K28n7J93j85N5K64k99
5352b8K96k19%J33k24M29k39J6k7l5l99K70k79L36L6o0k86J33q3K72j68pq6K20
$$ plain form
5376 1 -24 93 100 163 78 -90 238 175 -86 -162 39 -21 -98 205 63 -188 55 202 -13 -175 -65 -39 5 40 -115
5401 -115 -136 129 -78 -10 -97 -78 138 -78 242 172 188 -36 62 113 39 -41 72 -17 283 73 62 142 81 13 -40
5426 -40 -20 206 13 -232 -79 79 -231 123 39 -195 -222 15 25 -38 -136 46 -87 57 20 258 10 219 86
5449 86 10 78 154 120 46 91 100 -61 -262 205 -39 -348 -163 131 -34 -92 -10 44 -160 185 -123 246 -193 -240
5473 -240 268 232 -6 -40 105 129 121 -79 -199 86 50 121 -181 -118 -88 -72 91 159 -20 43 -186 98 -131 -152
5497 -152 40 178 -73 -234 135 158 -137 -111 81 61 -37 -152 -21 125 223 -37 234 159 -35 69 169 59
5519 59 226 -72 -113 -172 43 -141 -119 214 120 -149 -47 44 103 99 -52 -28 166 145 -25 177 -115 119 -135 -20
5543 -20 -106 76 30 73 -16 135 198 54 -100 -224 -116 251 32 -198 -58 -68 -277 -184 258 60 147 -142 38
$$ packed form
5376Ak5J17PO3q5j68L28o3k61p6K01o0p7L03j42k51K43J47k15j62J10K6M4L5j55
5401a15k1K65k07O8q7J9K16k16L20p0J6k24R8N1p4q0J13q9L00k10j1Q0o1o8n3
5426d0K0K26j93k45J53J58l10L54q4k34k7K37J0o3r8J82j33J44l7K38k48K09j33
5449H6p6O8P6l4p4M5Rj61k01M67k44l09J85K94j65n8Q2N4k04L45l08L69m39m7
5473b40N08l6k38l4J45K4qk00j20K85l6P1l02O3L0J6J63O8j79O3k29K84k29k1
5497a52J92J38k51j61L69K3k95K6J92k0r8j15J31J46R8k60K71p5j94J04J00j10
5519E9J67k98m1n9K15j84K2L33r4k69J02R1N9mj51K4J94k1j70K02k92K34k54J15
5543b0q6J82m6M3q9J51O3j44j54j24J08L67k19k30J40j0k09R3M42j98Q7k89J80
$$ plain form
5566 38 -85 -1 86 86 290 -119 151 -63 249 -244 64 234 334 -80 134 118 267 59 -74 -68 60 -147 -129
5589 -129 -71 116 -16 -51 -137 81 -98 -15 84 -29 -23 43 -56 -42 74 66 -139 286 192 -216 81 -61 118 -373
$$ packed form
5566C8j23Q4Q7%K04m09K70k14L12m93L08J70J00m14K14j6J49k08j33OJ28k07J8
5589a29N8J87j32l5q6K18j79Q3R9j13OO6r9J4J16qk05M25r4m08K97j42J79m91
$$ [...]
8191e6
##END NTUPLES=NMR FID
##END=
