##TITLE=1H_SL54a-Dau(f4)
 CDCl3
 8 sc, 
 14.02.2022
##JCAMPDX= 6.0         $$ Bruker NMR JCAMP-DX V2.0
##DATA TYPE= NMR FID
##DATA CLASS= NTUPLES
##ORIGIN= UXNMR, Bruker Analytische Messtechnik GmbH
##OWNER= root
$$ XWIN-NMR		Version 3.5
$$ Mon Feb 14 10:54:54 2022 Russian Standard Time (UT+4h)  she@DPX200
##.OBSERVE FREQUENCY= 200.131346
##.OBSERVE NUCLEUS= ^1H
##.DELAY= (6, 6)
##.ACQUISITION MODE= SIMULTANEOUS
##.ACQUISITION SCHEME= undefined
##.AVERAGES= 8
##.DIGITISER RES= 18
##SPECTROMETER/DATA SYSTEM= spect
##.PULSE SEQUENCE= zg30
##.SOLVENT NAME= CDCl3
##.SHIFT REFERENCE= (INTERNAL, CDCl3, 0, 15.7039)
##AUDIT TRAIL= $$ (NUMBER, WHEN, WHO, WHERE, WHAT)
$$ ##TITLE= Audit trail, XWIN-NMR		Version 3.5
$$ ##JCAMPDX= 5.01
$$ ##ORIGIN= Bruker BioSpin GmbH
$$ ##OWNER= she
$$ F:/spectra/data/she/nmr/H-F/1/audita.txt
$$ ##AUDIT TRAIL=  $$ (NUMBER, WHEN, WHO, WHERE, WHAT)
(   1,<2022-02-14 10:53:29.76 +0400>,<she>,<DPX200>,
      <created by zg, POWCHK disabled, PULCHK disabled
       configuration hash MD5:
       00 E9 B6 7A A2 85 ED C7 34 08 36 98 17 FE 4E 26
       data hash MD5: 16K
       B2 E9 F9 F1 35 7B A0 E6 D0 DE CE D2 1E 25 0B A5>)
$$ ##END=
$$ 
$$ hash MD5
$$ 10 5B D4 95 CE B5 9C 8D 45 62 74 73 22 16 C4 F5
##$RELAX= 
##$RELAX= 
##$RELAX= 
##$RELAX= 
##$RELAX= 
##$RELAX= 
$$ Bruker specific parameters
$$ --------------------------
##$DU= <F:/spectra>
##$EXPNO= 1
##$NAME= <H-F>
##$PROCNO= 1
##$TYPE= <nmr>
##$USER= <she>
##$AMP= (0..31)
100 100 100 100 100 100 100 100 100 100 100 100 100 100 100 100 100 100 
100 100 100 100 100 100 100 100 100 100 100 100 100 100 
##$AQSEQ= 0
##$AQ_mod= 1
##$AUNM= <au_zg>
##$AUTOPOS= <>
##$BF1= 200.13
##$BF2= 200.13
##$BF3= 200.13
##$BF4= 200.13
##$BF5= 200.13
##$BF6= 200.13
##$BF7= 200.13
##$BF8= 200.13
##$BYTORDA= 1
##$CFDGTYP= 0
##$CFRGTYP= 5
##$CHEMSTR= <none>
##$CNST= (0..31)
1 1 145 1 1 1 1 1 1 1 1 1 1 1 1 1 1 1 1 1 1 1 1 1 1 1 1 1 1 1 1 1 
##$CPDPRG= <>
##$CPDPRG1= <>
##$CPDPRG2= <>
##$CPDPRG3= <>
##$CPDPRG4= <mlev>
##$CPDPRG5= <mlev>
##$CPDPRG6= <mlev>
##$CPDPRG7= <mlev>
##$CPDPRG8= <mlev>
##$CPDPRGB= <>
##$CPDPRGT= <>
##$D= (0..31)
0 1.2 0 0 0 0 0 0 0 0.06 0 0.03 0 0 0 0 0.0002 0 0 0 0 0 0 0 0 0 0 0 0 
0 0 0 
##$DATE= 1644821609
##$DBL= (0..7)
120 120 120 120 120 120 120 120 
##$DBP= (0..7)
150 150 150 150 150 150 150 150 
##$DBP07= 0
##$DBPNAM0= <>
##$DBPNAM1= <>
##$DBPNAM2= <>
##$DBPNAM3= <>
##$DBPNAM4= <>
##$DBPNAM5= <>
##$DBPNAM6= <>
##$DBPNAM7= <>
##$DBPOAL= (0..7)
0.5 0.5 0.5 0.5 0.5 0.5 0.5 0.5 
##$DBPOFFS= (0..7)
0 0 0 0 0 0 0 0 
##$DE= 6
##$DECBNUC= <off>
##$DECIM= 32
##$DECNUC= <off>
##$DECSTAT= 4
##$DIGMOD= 1
##$DIGTYP= 9
##$DL= (0..7)
0 120 120 120 120 120 120 120 
##$DP= (0..7)
150 150 150 150 150 150 150 150 
##$DP07= 0
##$DPNAME0= <>
##$DPNAME1= <>
##$DPNAME2= <>
##$DPNAME3= <>
##$DPNAME4= <>
##$DPNAME5= <>
##$DPNAME6= <>
##$DPNAME7= <>
##$DPOAL= (0..7)
0.5 0.5 0.5 0.5 0.5 0.5 0.5 0.5 
##$DPOFFS= (0..7)
0 0 0 0 0 0 0 0 
##$DQDMODE= 0
##$DR= 18
##$DS= 0
##$DSLIST= <SSSSSSSSSSSSSSS>
$$ [...]
##$SUBNAM2= <"">
##$SUBNAM3= <"">
##$SUBNAM4= <"">
##$SUBNAM5= <"">
##$SUBNAM6= <"">
##$SUBNAM7= <"">
##$SUBNAM8= <"">
##$SUBNAM9= <"">
##$SW= 18.0517287032376
##$SWIBOX= (0..15)
0 0 2 0 0 0 0 0 0 0 0 0 0 0 0 0 
##$SW_h= 3612.71676300578
##$TD= 16384
##$TD0= 1
##$TE= 0
##$TE2= 300
##$TE3= 300
##$TEG= 300
##$TL= (0..7)
0 120 120 120 120 120 120 120 
##$TP= (0..7)
150 150 150 150 150 150 150 150 
##$TP07= 0
##$TPNAME0= <>
##$TPNAME1= <>
##$TPNAME2= <>
##$TPNAME3= <>
##$TPNAME4= <>
##$TPNAME5= <>
##$TPNAME6= <>
##$TPNAME7= <>
##$TPOAL= (0..7)
0.5 0.5 0.5 0.5 0.5 0.5 0.5 0.5 
##$TPOFFS= (0..7)
0 0 0 0 0 0 0 0 
##$TUNHIN= 0
##$TUNHOUT= 0
##$TUNXOUT= 0
##$USERA1= <user>
##$USERA2= <user>
##$USERA3= <user>
##$USERA4= <user>
##$USERA5= <user>
##$V9= 5
##$VALIST= <valist>
##$VCLIST= <CCCCCCCCCCCCCCC>
##$VD= 0
##$VDLIST= <DDDDDDDDDDDDDDD>
##$VPLIST= <PPPPPPPPPPPPPPP>
##$VTLIST= <TTTTTTTTTTTTTTT>
##$WBST= 1024
##$WBSW= 4
##$XGAIN= (0..3)
0 0 0 0 
##$XL= 0
##$YL= 0
##$YMAX_a= 126729
##$YMIN_a= -252872
##$ZGOPTNS= <>
##$ZL1= 120
##$ZL2= 120
##$ZL3= 120
##$ZL4= 120
##$ABSF1= 10
##$ABSF2= 0
##$ABSG= 5
##$ABSL= 3
##$ALPHA= 0
##$AQORDER= 0
##$ASSFAC= 0
##$ASSFACI= 0
##$ASSFACX= 0
##$ASSWID= 0
##$AUNMP= <proc_1d>
##$AZFE= 0.1
##$AZFW= 0.1
##$BCFW= 1
##$BC_mod= 2
##$BYTORDP= 1
##$COROFFS= 0
##$CY= 11.3945322036743
##$DATMOD= 1
##$DC= 2
##$DFILT= <>
##$DTYPP= 0
##$F1P= 2.36226072786647
##$F2P= -0.459571619588291
##$FCOR= 0.5
##$FTSIZE= 0
##$FT_mod= 4
##$GAMMA= 1
##$GB= 0.15
##$INTBC= 1
##$INTSCL= 1
##$ISEN= 128
##$LB= 0.24
##$LEV0= 0
##$LPBIN= 0
##$MAXI= 10000
##$MC2= 0
##$MEAN= 0
##$ME_mod= 0
##$MI= 1.114404
##$NCOEF= 0
##$NC_proc= 0
##$NLEV= 6
##$NOISF1= 3.799351
##$NOISF2= 2.8
##$NSP= 1
##$NTH_PI= 0
##$NZP= 0
##$OFFSET= 15.70392
##$PC= 1
##$PHC0= -16228.74
##$PHC1= 9.800791
##$PH_mod= 1
##$PKNL= yes
##$PPARMOD= 0
##$PSCAL= 0
##$PSIGN= 0
##$REVERSE= no
##$SF= 200.130013532006
##$SI= 16384
##$SIGF1= 3
##$SIGF2= 2
##$SINO= 400
##$SIOLD= 16384
##$SREGLST= <1H.CDCl3>
##$SSB= 0
##$STSI= 0
##$STSR= 0
##$SW_p= 3612.71676300578
##$SYMM= 0
##$S_DEV= 0
##$TDeff= 0
##$TDoff= 0
##$TI= <>
##$TILT= no
##$TM1= 0
##$TM2= 0
##$TOPLEV= 0
##$USERP1= <user>
##$USERP2= <user>
##$USERP3= <user>
##$USERP4= <user>
##$USERP5= <user>
##$WDW= 1
##$XDIM= 8192
##$YMAX_p= 0
##$YMIN_p= 0
$$ End of Bruker specific parameters
$$ ---------------------------------
##NTUPLES= NMR FID
##VAR_NAME=  TIME,          FID/REAL,        FID/IMAG
##SYMBOL=    X,             R,               I
##VAR_TYPE=  INDEPENDENT,   DEPENDENT,       DEPENDENT
##VAR_FORM=  AFFN,          ASDF,            ASDF
##VAR_DIM=   8192,          8192,            8192
##UNITS=     SECONDS,       ARBITRARY UNITS, ARBITRARY UNITS
##FACTOR=    0.0002768,     1,               1
##FIRST=     0,             0,               0
##LAST=      2.2672688,     0,               0
##MIN=       0,             -252872,         0
##MAX=       2.2672688,     126729,          0
$$ Real data points
##PAGE= N=1
##DATA TABLE= (X++(R..R)), XYDATA
$$ [...]
1975D89M86j897K56K228n57j754M18R96L07q89m48N98J091j593j011K253Pk275
1993a295Q54J375j139j144J419J50q23M61m11N49J99r77L17J770j376j422J884
2010C91R17j810R8J934j046p88Q8P78K23q60q16J167Q45k263n66K657o9k112L15
2029i17J164j49q89j19J296P60j694r10K200L40j624Q6J930n03j361L56R67j74
2047G59q56k94R81K82j852J49J811q74j263R51N22j023j56O86K85k77m39J67L94
2066d7n2l08Q56N70j225m54J156L44p29l51Q80M79j378l92J502J83j544j54J415
2085G51n06j019J44O65M96p86j128J028J289j436o58J963K7j725L60J189l65j34
2103A55L04k51L90J59j541M97J950j705q09J338n7j096O06N27o63J46k56n37O19
$$ plain form
1975 489 975 -922 -666 1562 1005 -749 -331 665 972 83 -365 233 1324 -269 -1280 973 980 -1295
1993 -1295 -441 934 -205 -1349 70 220 -603 -142 -553 -4 195 -782 -465 1305 -71 -1493 391
2010 391 1308 -502 -404 1530 484 -304 -216 562 785 -75 -891 276 1121 -1142 -1708 949 880 -1232 -917
2029 -917 247 98 -791 -910 386 1146 -548 -1458 742 1082 -542 -456 1474 971 -390 -34 933 759
2047 759 -97 -391 590 872 -980 -831 980 106 -1157 -206 316 -707 -863 -177 108 -169 -608 -441 -47
2066 -47 -99 -407 449 1019 -206 -660 496 840 111 -240 640 1119 -259 -651 851 1034 -510 -664 751
2085 751 245 -774 -630 35 531 -255 -1383 -355 934 -502 -1160 803 830 -895 -535 654 289 155
2103 155 459 208 598 757 -784 -287 1663 -42 -851 487 430 -666 -60 467 -196 -50 -306 -843 -224
2122b24L16r34J011M09j581O34J125o08p71J538n47o22L70J49J9m7k05nO63k56
2142D34j236P76J036j207n11Q79J28n90m04Q80L77n07j408P63J259l65j271J233
2160B66M75j015o84Q72J013l98r78O64J054j009q21Q31Q18p63q50M98N35o08l81
2179d81O17M31r10k44N97K75r81L47O26l76m95M34L37J54o34n41J577k91j133
2198f91O45J415j266q97J350L61j275N9N85L29j85j268K58J568p30j595J247J204
2216A114k048q43J796M33p66j87M13M11L7j075N83J364q24j432J483P61j649j5
2234d44J410p07m56M22j96K50j8p16L02P38j207n30J825l27j616P48J069j467
2252i20j3J121K11k49m69J07P32J87j035L20J320q66j175R61R15j137l91L88N93
$$ plain form
2122 -224 92 -842 169 578 -1003 -369 756 148 -623 915 368 -254 116 265 284 237 32 27 690 434
2142 434 -802 -26 1010 -197 -708 171 299 -291 -695 185 562 55 -1353 -590 669 304 -967 266
2160 266 741 -274 -958 -86 927 529 -449 215 1269 260 -561 270 1088 325 -525 -27 508 -100 -481
2179 -481 136 567 -343 -587 10 285 -696 -349 277 -99 -594 -160 177 331 -303 -844 733 442 -691
2198 -691 -46 1369 103 -794 556 917 -358 -299 286 615 430 -838 -580 988 258 -1337 -90 1114
2216 1114 -934 -1777 19 452 -314 -501 -88 323 360 -715 -132 1232 408 -1024 459 1220 -429 -444
2234 -444 966 259 -197 225 29 279 261 -455 -153 585 -622 -1152 673 346 -1270 -522 547 -920
2252 -920 -933 188 399 150 -319 -212 520 707 -328 -8 1312 446 -729 232 1147 10 -381 7 600
2271F00o44o92N12Q30n53r26N19Q24n18j176O88J009k71j142M95R76k28q49R01
2290C55N85p71l56K32O86j47m78j85L30J55q50M37L33l93l93O88l18l91L67J88
2310G4m0q0l96J62N10o73j16J214k65p88J08J037n40k27N07Q1o0q03j66Q00N20
2331H59j448k29J491n26j272R59R81r02o65K59K68P38r21m68J212O17j975K64
2349g58J733n85j131P34M64k28k32p3N67K48j067K38P88k51j205N19J177r09o81
2368f52N07L63o01j10L05M05m93n18N77Q41r45m69J228p1r28N2J125j34m81k89
2388b88J041L66j541k48J534p8j296J62O81j06q80j5R41J37j111k13J126K61j389
2407i16K47J275j72j414P70P82k87l54j86N64K82r35l4J283l55q10J91O46r36
$$ plain form
2271 600 -44 -736 -224 606 53 -873 -354 470 -48 -1224 -536 473 202 -940 -445 531 303 -546 355
2290 355 940 169 -187 45 731 584 106 -79 251 406 -444 -7 326 -67 -460 228 -90 -481 -114 74
2310 74 34 -46 -442 -280 230 -443 -559 655 390 -398 -290 747 207 -20 487 568 508 -295 -461 339 859
2331 859 -589 -818 673 147 -1125 -166 815 -87 -752 -493 -225 513 -408 -876 336 953 -1022 -758
2349 -758 975 390 -741 -7 457 229 -3 -76 491 739 -328 -90 698 447 -758 -239 938 29 -652
2368 -652 -145 218 -383 -493 -188 217 -276 -794 -217 624 -321 -790 438 367 -561 -509 616 482 1 -288
2388 -288 753 1119 -422 -670 864 786 -510 -348 333 227 -653 -668 273 410 -701 -914 212 473 -916
2407 -916 -669 606 434 -980 -210 572 285 -69 -255 309 591 -344 -378 905 550 -260 -69 577 -359
2426c59J24O00k6m36n3j05N01k55k27P0O29j321j22J370j77q24L92M15n5n36N0
2447c45N52L13n79m49J153J89j585P06R36m90p95J10O50q4m79k61M60N02r85n23
2467a004J325j52r07M88N20j70n83O8P12j02J8m21N23J20l63K13K73j0m82J64
2487B30r5J20l02m08L56J58m52j30R54q18j94N93L08q26L46K71j62j31J6j28N66
2508B72l74k11O84N11j026k21R40m8m54j50L90q6r4n10N54L05m70p93O89N80r12
2529d24k10R80k76l34n16N32M56m0n79M98P02q74k80R95Mp40lL37M4l10p0p8O28
2552D42l41k67N22k16q58N01O61m50l51J47K46j95l59M38L55k47p38O67L75m63
2572a31l31N46O13q34k75P65N11o32n66M34Q89p74r01R08O42r86m32P07K48p03
$$ plain form
2426 -359 -235 365 339 -97 -150 -255 246 -9 -236 -166 463 -858 -980 390 213 -611 -219 196 141 -395 -345
2447 -345 207 520 -59 -508 645 834 -751 -45 891 401 -394 -284 366 282 -197 -458 2 504 -481 -1004
2467 -1004 321 169 -738 -250 270 100 -483 -415 297 195 213 -208 315 435 72 285 558 548 66 230
2487 230 135 255 -47 -455 -99 59 -393 -523 431 -387 -581 12 320 -506 -160 111 -51 -182 -166 -294 272
2508 272 -102 -313 371 882 -144 -365 575 527 73 -77 313 227 133 -377 177 482 12 -781 -92 488 -424
2529 -424 -634 346 70 -264 -780 -248 208 168 -411 87 789 -85 -365 630 634 -106 -109 228 272 -38 -108 -186 442
2552 442 101 -166 356 140 -718 -217 444 -6 -357 -210 36 -159 -518 -80 275 28 -710 -43 332 -131
2572 -131 -462 84 697 -137 -412 353 864 232 -334 100 989 215 -686 222 864 -122 -554 153 401 -302
2592c02l07M36N86q29l79P05N14r11r1R64r6n10J5L53M56n76l29R41L0r93N7R60
2614F94l57q68O87L85o59m38P14%j80o85L44O36Q9j240P94Q62r92l96J054K66
2634G10j081K60N14K2k25m29L51R72q04q48N81Q28j042n98J144K2o26l92P62k87
2654a66n5m06L52P08m47o18P31L88o99j75O16N5o28M33L76l38j22p1O02k05l37
2675fk36K88n4l00L15J07k31k98J76M91m35l86J56O85o08j67N48L71m80k88O00
2696B48L21l52m53P4R52m49r62J045M04q33l91N06J32l01k22j49M16L74r82M1
2716e81J046k50p64L55K67k77k67M80M33r6n04j42N97P8r54M35P32n75o6K52J49
2737C48m24L24k18K78lm62r9Q15n03q41J224J0j206K16Q27l18k64L12k4Q0R2m41
$$ plain form
2592 -302 -609 -173 413 -416 -795 -90 424 -487 -578 386 290 -220 -205 148 604 28 -301 640 670 -323 -266 694
2614 694 337 -531 156 541 -118 -556 158 158 -22 -707 -363 273 362 -878 -84 778 -214 -610 444 710
2634 710 -371 -111 403 425 200 -229 122 1094 290 -558 23 851 -191 -789 355 377 -249 -641 121 -166
2654 -166 -221 -627 -275 433 -14 -632 99 487 -212 -387 229 284 -344 89 465 127 5 -66 536 331 -6
2675 -6 -242 46 -8 -308 7 114 -117 -415 -239 252 -183 -569 -413 272 -336 -503 45 416 -64 -352 248
2696 248 569 217 -236 -162 790 341 -621 424 828 -5 -396 110 242 -59 -281 -430 -14 360 -622 -581
2716 -581 465 215 -549 -194 73 -204 -471 9 442 346 -158 -300 297 375 -579 -144 588 13 -53 199 348
2737 348 -76 248 30 308 305 -157 -256 559 56 -785 439 449 -757 -541 286 -32 -296 16 -8 72 164 -277
2759b77N94O33j375j1J364n83r95N78J004p91p06N44N72k07q06K05M95J20j060
2778g02K36R79l73o69R6O55j9o91R9Q55k89m48L65M99l55n29N11K13l18k97O85
2799E03l35N6l90L69J81p96m5M25O57j077P0Q55o37n05K36Q21J7q22kN36P7o66
2821d72L07P43P4j014L73M78l31l25K13N92Rp46K1Q10k31j196N39O22m30l73K40
2842i7J21j28n3l92Q30k3o01J95M66l07l47N13Q9k89J21L46k92j22k1J36L13n18
2864f0j88K9N67o99J39N15k56o51J24M96n7m8j90M05j23k81l03Q69j91m60L88
2885B5N40m62j55K94p7L03n10j59N69Q0p74J96L18P1m50M1P4M7j31l29M04J35
2907E0o23J77M46J31l46j25M83j12j98j0L80j38k87J28K66J14m63L43Q0k89l01
$$ plain form
2759 -277 317 950 -425 -436 928 345 -650 -72 932 141 -565 -21 551 344 -462 -257 238 358 -702
2778 -702 -466 513 140 -529 -433 222 203 -488 -389 466 177 -271 94 593 238 -291 220 433 115 -182 503
2799 503 168 224 -166 203 384 -412 -457 -32 625 -452 -382 473 -164 -669 -433 388 405 -417 -419 117 194 -472
2821 -472 -165 578 652 -362 11 489 158 -167 46 638 647 -99 -78 732 501 -695 -156 466 36 -337 -97
2842 -97 24 -104 -157 -549 281 258 -343 -148 318 11 -336 177 266 -23 98 444 152 30 9 145 458 -60
2864 -60 -248 -219 348 -351 -212 303 47 -604 -480 16 -41 -89 -279 126 3 -278 -581 288 97 -363 25
2885 25 565 103 -52 242 165 468 -42 -201 368 448 -326 -130 188 259 -191 -150 -76 -29 -160 -489 -85 50
2907 50 -573 -396 50 181 -165 -290 193 81 -117 -127 253 115 -172 -44 222 336 -127 216 296 7 -294
2928b94L81L1k59R0O8J61l12l97L72K65k27k82M94M09p68j76O94L4l31j73M07
2949A87K86k95n62N30O10r54k55Q10M6n75j35N66O9o34k23L13P05o14l15M88L47
2970C95p81k48P55k50J2L4J60O3j0k85O55k28m57J73K91q2l68L74M23o54l02L00
2992c0O82o45q7O7L70m02o50P47L47m30o18P21L78r87K25K62M06m98m04M31N48
3013D33l98m89P29M20p12k27N00J08l08m03N95K70m98o49R07K29p86j01M68k53
3033a65k33P5J64N6p7n1K96o0j56q4P66j76p52O97J92l93n7K41k27k75L15J15
3055B11j24K06o76L60N33j070q7M01L84l49l04O51j9o5m44J76M66m90j66M49M59
3076E02m37k53N21J37n26l54L08N77l24m05J13K69l41m02P44k28k85K07J6O0l0
$$ plain form
2928 -294 87 118 -141 -51 17 178 -134 -531 -159 106 -121 -403 91 500 -268 -444 250 284 -47 -220 187
2949 187 473 178 -384 146 756 -198 -453 357 403 -172 -307 259 328 -306 -529 -216 489 -125 -440 48 395
2970 395 -386 -634 121 -129 -117 -83 77 140 130 -155 500 272 -185 -12 279 197 -171 203 626 -28 -330 -30
2992 -30 652 7 -80 -13 357 -45 -695 52 399 -31 -649 72 450 -537 -312 -50 356 -142 -546 -115 433
3013 433 35 -454 275 695 -17 -244 256 364 56 -347 248 518 20 -629 278 507 -279 -380 88 -165
3033 -165 -398 -323 -159 -103 -180 -231 65 5 -151 -235 531 355 -397 300 492 99 42 283 56 -219 96 211
3055 211 87 293 -383 -23 510 -560 -647 -246 138 -211 -515 136 117 52 -392 -216 250 -240 -406 43 502
3076 502 65 -188 333 470 -56 -410 -102 475 151 -254 -141 128 -213 -615 129 -99 -384 -177 -161 -101 -131
3097a31k38J55L82l02K6K67N2m07M17J57k81o1k9j9J94j09j2k6J98k04l18M03
3119A14j54p18N50L05l22k9L6L73j89l20J82O15l01n87M57L38l62n53M44L02J37
3140C18m32L71K63k51m90K72M28n71l83M67K11m35j7K55J10j05j10k67N34j81
3160a3m32L43N33p21j38P09l03k58K83J80j18k20J23K75M02q62K96J78j49m47
3180c39J24P43n79o09M12M80j68m78J19N03o1q00N98J81k34l79L88O06n24o1J51
3201G3N12n5o01j1Q27p12k82O73m8n41k37L21K53l89lN6M50l48m05K57M41l78
3223a47J22J65O8n68K66L23n0j93J02L48M8o24M0O38j93p12L14L37j21m17L18
3244F4K2om60M9P03n41k80J76L90j23m21K77K80j89P2P1J4M2q6j36M08K31p95
$$ plain form
3097 -131 -369 -214 168 -134 -108 159 211 -196 221 378 97 36 7 -12 182 73 61 35 233 29 -289 114
3119 114 -40 -758 -208 97 -225 -254 -218 155 -34 -354 -172 443 142 -445 12 350 -12 -565 -121 181 318
3140 318 -114 257 520 269 -221 51 479 -92 -475 -8 203 -232 -249 6 116 11 -99 -366 168 -13
3160 -13 -445 -102 431 -290 -428 281 -22 -280 3 183 65 -155 -32 243 645 -217 79 257 108 -339
3180 -339 -215 528 -51 -660 -248 232 64 -414 -295 208 147 -653 -55 126 -108 -487 -99 507 -17 -78 73
3201 73 585 530 -71 -82 745 33 -249 424 376 -165 -402 -81 172 -217 -220 -164 286 -62 -467 -210 231 -147
3223 -147 -25 140 208 -360 -94 229 179 -14 88 436 484 -140 -100 538 345 -367 -53 284 163 -254 64
3244 64 86 80 -380 -331 372 -169 -449 -273 117 -6 -427 -150 130 -59 13 84 98 140 54 -82 326 557 -238
3267b38J46P16m49l02L7L95j20j78P6k16K87m28R1M30k28n88M22J88k15J50k79
3288c03M31j74k74M93Jj94l0N0L72m55m7M37j36j09j10j38M47l92k03Q18k88m67
3310b71j31N48J48o95p7N04K83p28j43O90J2l96k59Q28J01p00K72N66k09k00k45
3331a02K93J24k23k17M69j26m92lN89r7o53K53J62j7k78K07R7ll51MN89j59m40
3354c74M88L83o00P8L28J21n79L27Oj0j16k79J16M42l73m12O69l9o53l1N41q4
3376e1o6q6L23K38m66m57O66J22o13N1P16J6n92O3M50P9n71P9M04J2l78l2N20
3399D27k69m60J51M08j82q2J%J28n48P8P19l82n70J38P13m20K1K13Pj04k85J99
3422i9K50pj97K78K34o08Q6M05K5l63j9R2J17k94j79K93L41n23l61P26p7m12k55
$$ plain form
3267 -238 -92 624 175 -127 -90 305 185 7 83 -133 154 -274 -183 247 19 -569 -147 41 -174 -24 -303
3288 -303 128 -46 -320 173 174 -20 -50 0 372 -83 -130 307 171 62 -48 -186 261 -131 -334 484 196 -271
3310 -271 -402 146 294 -401 -478 26 309 -419 -562 128 140 -256 -515 313 414 -286 -14 552 343 143 -102
3331 -102 191 315 92 -125 344 218 -274 -277 312 215 -438 -185 -23 -40 -318 -111 -14 -17 -368 -364 225 66 -374
3354 -374 114 497 -103 -25 303 424 -155 172 178 168 52 -227 -111 331 -42 -454 215 176 -477 -508 33 -51
3376 -51 -117 -203 120 358 -108 -565 101 223 -390 -339 377 393 -199 -136 314 393 -178 -99 305 317 -61 -93 427
3399 427 158 -302 -151 257 75 -7 -6 -6 122 -426 -348 371 -11 -581 -443 270 -150 -129 84 91 -13 -298 -99
3422 -99 151 144 -53 225 459 -149 -63 342 367 4 -15 77 194 -100 -279 14 355 -168 -529 197 120 -292 -547
3445e47P35o2j39j25M79k26J4l06K07M52m49m82P19K61m35j36J46j17k22J39n4
3466a48K33k94k03M31n1l93O0J79J51l82M85m7R0j53J98J34m4k3j76J42K4l49
3488a36L76K42m23k17L41J3j14l47P6M57l24k11Q1L23l15m38N51L1n2j20K33J84
3510B11l68k5L75M25k78m57J74N02o79Q6L1L10l35k08K12J57k41k94M49J24k22
3531e1l84M49J2j77rK54Q2n60K34M25%l12k41K62K25m90K90O94n65k02k91N77
3553B22q1j68k8M87k30o92N32L44m97o77Q59J00n17K1M22L1O4%r6K55j48l23J31
3576A1O3j12k76M40P4k02m0L43j4l82k9K73l3m1n95N69M9l65j8J70L64l84J81
3599D6j8L08o47PM48n0m10J94N27m65K8J01J99p2k09J5N40l16m13K04M42j36p81
$$ plain form
3445 -547 188 126 -13 -138 341 115 129 -177 30 482 33 -449 270 531 96 -40 106 -11 -233 -94 -148
3466 -148 85 -209 -412 19 -32 -425 -365 -186 -35 -417 68 21 111 -42 156 290 246 223 47 189 213 -136
3488 -136 240 482 59 -158 183 196 82 -265 -189 268 -56 -267 -186 137 -178 -616 -65 -34 -86 -206 27 211
3510 211 -157 -182 193 618 340 -117 57 559 -120 -34 -3 307 -28 -236 -24 133 -108 -402 47 171 -51
3531 -51 -435 14 26 -151 -160 94 176 -384 -150 275 275 -37 -278 -16 209 -281 9 703 138 -64 -355 222
3553 222 141 -27 -55 432 202 -490 42 386 -111 -788 71 171 -346 -325 97 128 192 192 96 351 203 -120 11
3576 11 74 -38 -314 126 200 -2 -42 301 287 -95 -124 149 116 75 -520 49 98 -267 -285 -115 249 -135 46
3599 46 28 336 -311 -304 144 94 -316 -122 405 -60 -32 69 268 196 -13 2 542 226 -187 17 459 323 -458
3622d58K51M13m01l09J04O59k11k66J88K90j7m96J36N14j51o33O33J11k98j93
3642a34K36K48j72j01k43L39J14l49Q2L30m83J39M04o56L72j82l04M57l97o4Q3
3663b81M60n61K73J48M2j49j10L74o1j24J53o3J51l34Q7L36j80k52q0N13k62m46
3685c66L55K53l12k88J89J38J76k65k50J54N17o57L8K87P5k89O0L70J78m40Q1
3706DK32J30k54j05J65k09%L5Q4k35J3l9J64j7m56J79L89m50J99q3M23j48k38
3729b17K34m3R8kP3K4j46k82O53k2o35N8M92j03m42RN77m95ll48O20J11l98M5
3753a42N94j68p16K23M65k41j45Q5m9L01l33J20J75L41p59N1M59k93k2K24N2l51
3775a29K08j49K94l2n26M16M1r8l17L08J65m27L29K8j45p6N5L70j53j5k34J89
$$ plain form
3622 -458 -207 206 -195 -504 -400 259 48 -218 -30 260 243 -253 -117 397 246 -387 246 357 59 -134
3642 -134 102 350 178 77 -166 173 287 -62 20 350 -133 6 410 -246 126 -56 -360 97 -300 -364 -281
3663 -281 179 -382 -109 39 81 -68 -178 196 135 11 164 101 252 -82 5 341 161 -91 -171 342 80 -366
3685 -366 -11 242 -70 -358 -169 -31 145 -120 -370 -216 301 -356 -318 -31 44 -245 -185 185 363 -77 4
3706 4 236 366 112 7 172 -37 -37 -2 82 -153 -140 -179 -15 -32 -488 -309 80 -370 -171 -254 169 21 -217
3729 -217 17 -26 72 70 143 167 21 -261 392 370 -265 -207 285 182 -260 -251 326 -169 -172 -520 100 211 -187 -142
3753 -142 452 284 -432 -209 256 15 -130 -45 -94 207 -126 -6 169 510 -249 -198 261 -32 -54 170 222 -129
3775 -129 79 -70 224 192 -334 82 123 25 -292 16 181 -246 83 111 -34 -110 -55 315 162 147 -87 102
3797A02L55m58k61N13J60m62L3K53K9l57j56N77R5m03r0JL45n15R7M95j65m87
3819b99J31J63J2k76L54r7N2o1m5M51l8m16K9J94j63l3O5Q0N2k26jK03k21j35
3843b25o9K41r5j42J28k8L43n01J95J04%j40K52J16j94j27Q00l04o57J47M74j36
3865A82k46r0J37K5j00k77L66N76o95k90O80m90k5p9K95K13j12l10K93R6j41o0
3887e2N2J00L5k93L85K05m40j93L13J35n16J26K01L3l09J17L29k03r2J21n6j8
3909b0j51J50J9o9m2J47K49k07n58Q49k56j26j48M75j3j48j58J05j10J54l41K15
3931A6M09l21n85M28J64l52M2M8K67j49k30J46L01m90K06n2L19l99L6K06J67p9
3953I8m7M2M59o17n5J37K46m53J68N88n47l57M36K4j22j69K73j67J89k80j42M71
$$ plain form
3797 102 457 -1 -262 251 411 -51 -18 235 264 -93 -249 328 423 20 -70 -69 276 -239 -142 353 188 -299
3819 -299 -168 -5 7 -269 85 -12 40 -21 -66 385 347 -69 -40 154 -9 -42 23 103 155 -71 -72 131 -90 -225
3843 -225 -294 -53 -148 -290 -162 -190 153 -348 -153 -49 -49 -189 63 179 -15 -142 658 354 -303 -156 318 182
3865 182 -64 -154 -17 8 -92 -369 -3 573 -122 -412 268 -222 -247 -326 -31 182 70 -240 53 149 8 -52
3887 -52 0 100 135 -158 227 432 -8 -201 112 247 -269 -143 58 91 -218 -101 228 25 -67 54 -2 -20
3909 -20 -171 -21 -2 -71 -113 34 283 76 -482 367 111 -15 -163 312 299 151 -7 98 -12 142 -199 16
3931 16 425 104 -481 -53 111 -241 -199 -151 116 -33 -263 -117 184 -306 -100 -152 167 -232 -196 10 177 98
3953 98 51 93 552 -65 -120 17 263 -190 -22 566 19 -338 98 122 0 -169 104 -63 126 -154 -296 175
3975A75l68l56O09J74l51k61J50M64l64r9O0L72p4n00L56K85j75l46O81l69j31
3996f8p2K33R4l05j63O1N61l23j23r7R1J15k79M06O1m95J98J1N74l25j45L38k3
4019C25k46k71M44J98n90J38J55J37l77J63j82N1J63k06K63m02r1K11K38Lm31
4040c07K58J09j29k58K10N49j36m03q2L36m4l46J07N70j93l76P3M9O5j31K4J30
4062G5k41j71O9J47p0j82K39J14J47k6j56j38M39l44K4N0J71j69L84k95j00N8
4084B5J59j98K07k9l84M02m42r2J29K61k77j7N53j89l07n7L87q4j08j56L94K26
4106D03l49l42M89r5k66K65K05k01k75J11J73J88j48m02M23J31m98q1L31j42k15
4127b95J70K90l43j9q8K82J02l12J34J01J66n12M63J73l45o8M04k31k31K8K37
$$ plain form
3975 175 -193 -549 60 234 -117 -378 -228 236 -128 -227 -167 205 131 -369 -13 272 97 -249 432 63 -68
3996 -68 -140 93 187 -118 -281 -220 341 18 -105 -202 -111 4 -275 131 192 -303 -105 -94 480 155 10 348 325
4019 325 79 -192 252 450 -140 -2 153 290 -87 76 -106 -55 108 -98 165 -237 -328 -117 121 124 -307
4040 -307 -49 60 -69 -327 -117 432 296 -107 -189 147 103 -243 -136 434 241 -135 -62 -13 52 -79 -55 75
4062 75 -166 -337 -268 -121 -191 -373 -134 -20 127 101 -55 -193 246 -98 -74 -24 147 -22 362 67 -33 25
4084 25 184 -14 193 164 -220 182 -260 -352 -223 38 -239 -256 297 108 -199 -256 131 47 -61 -217 177 403
4106 403 54 -288 201 106 -160 105 310 109 -166 -55 118 306 158 -244 179 310 -188 -269 62 -80 -295
4127 -295 -125 165 -178 -197 -285 -3 99 -213 -79 22 188 -324 139 312 -33 -101 303 72 -159 -131 106
4148A06L43n00o5O8K44k98j29L68k87Q1J61j15Pk17L23J02k39L06n74R6O77n81
4170a23P8K13J82n57M45Pl05K21jj4j09k53l2N64j20l53J27K43k06L6j52K58k19
4193g0J21j75j90M79n58K17L95k17n7K00k0m7q9L46j02l3r2q5L03o32J36L17L62
4216E09p55JM25j76k30j04M31K11l35j65J45J79k42J0K14k9k13L03P9l18L48n11
4238b23J72J98k33q6M23r0l85J13K94L0J9k73k73M36j38j82M02k06m1m2K66m00
4260b19K17n0k3j2M2J01j10K17k10K43j3K0m78J72L82j24m13K30N9j83K33k95
4282b14J20o2J1j59N02k84k01L11J49l27r3K14K57k53O8k25N21o12m4M00J48j63
4304F4k62L73%j2l90K28P2k88K3J94K73m10j50L59J56m96L3P2L10k97q9L52l53
$$ plain form
4148 106 449 -51 -116 -48 196 -102 -231 137 -150 -69 92 -23 -16 -233 90 192 -47 259 -315 -219 458 -123
4170 -123 -45 168 350 -207 238 245 -60 161 160 146 37 -216 -248 316 196 -157 -30 213 7 43 -109 149 -70
4193 -70 51 -124 -314 165 -393 -176 219 2 -55 145 125 78 -11 335 233 200 108 23 326 -306 -170 147 509
4216 509 -246 -245 180 4 -226 -330 101 312 -23 -188 -43 136 -106 -96 118 89 -124 179 258 -60 288 -223
4238 -223 -51 147 -86 -172 251 161 -224 -111 183 213 232 -41 -314 122 -16 -198 204 -2 -43 -85 181 -219
4260 -219 -2 -52 -75 -87 -45 56 -54 163 -47 196 183 203 -275 -103 279 155 -258 -28 31 -152 81 -214
4282 -214 -94 -156 -145 -304 198 -86 -287 24 173 -154 -247 -33 224 -29 39 -186 335 -277 -321 79 227 64
4304 64 -198 175 175 163 -227 1 73 -215 -192 2 275 -135 -285 74 230 -266 -233 -161 149 -148 -237 115 -238
4327b38N8Q5M32j63k95N9K85j35k81K30K85l49j05l9K45k32k64K90K35n18M70
4348E5k96M59n90J4K01K14l89J95L29l24J82k47L40r6j30o3K17J11m71K67k1R9
4370E6J71op7R1m82J14J20J06j45MM25k47l13P3J40P1l63K23K9M4j98J22J03j14
4394e3J18qpM17m95L0L33k67j17J31L64n06j72K35K01k54R7K0K45j01j30J70j75
4417G6Ql64J27J74J09l57K05J14J40k18K30k7K1k74j57O87m87l06K61L5L4k0l75
4440c64M58j29l05L40J43l13lK53%j29J59J72k59j04K26J53k92JN7l9lk31K76
4463F7J7p7R7J86k65k47r5M90k24k07K56j86K27N7l35J66K85k57k90L70J13j82
4485c4m4j68L27K09j54KJ11n6j25k10K80o2l36L94j81J47k55m4R2J04k1k42N03
$$ plain form
4327 -238 -180 -95 337 174 -121 -62 223 88 -193 37 322 -27 -132 -171 74 -158 -422 -132 103 -415 55
4348 55 -241 218 -372 -358 -157 57 -332 -137 192 -132 50 -197 143 47 -83 -146 71 182 -289 -22 -43 56
4370 56 227 221 144 235 -247 -133 -13 93 -52 -48 377 130 -183 -110 30 101 -262 -39 -10 34 -164 -42 61 -53
4394 -53 65 57 50 467 -28 2 335 68 -49 82 446 -60 -232 3 204 -50 47 67 312 211 81 251 76
4417 76 84 -280 -153 21 130 -227 -22 92 232 14 244 217 238 -36 -193 494 7 -299 -38 -3 31 11 -364
4440 -364 94 -35 -340 0 143 -170 -173 80 80 -49 110 282 23 -81 145 298 6 7 64 25 22 -209 67
4463 67 84 7 104 290 25 -222 -317 173 -51 -258 -2 -188 39 96 -239 -73 212 -45 -335 35 148 -34
4485 -34 -78 -246 81 290 136 138 249 193 68 -142 138 76 -260 134 -47 100 -155 -199 -107 -3 -24 -266 237
4508B37J19n82M79Mk66J99j28j79L4j50M85o0k06m9j1L41m59J82J48J82n12L6
4530a56M00j33k43j8K96n2k39j87K91K51l40J03K14j25j28p8K71O5m71K86K91
4551B98p1l61Q7L14j70J43j97n5J91l55M6N76n08P6K2P6j83k84M04J42m48P5J56
4574b6K26k96j14J56pL72k24j04J44l26M4L02M0l91J72J23Q1l23R2J1O5k14K28
4597C1K4k16k21L4M00j09n7l0L37N4m86K5M70M6l83O2L53n18J61r0R9n0M5L3j90
4622a76J34L4k80K79q4L1J3j7j98R4j43K06P4j87R4J93l62K83J39p3m5L4K19j23
4646A39n5J40j24j37O0j07O21n32j48qJ59J76o74J61L05j77L25l46N2J81j82J16
4668e5n8K00k03K9J68K04j54k38K27J04l21j61K48K38o2k37J70J39l42J88N5l41
$$ plain form
4508 237 356 -226 253 257 -9 190 62 -117 -83 -233 252 192 -14 -63 -74 267 -192 -10 138 320 -192 -156
4530 -156 244 111 -132 -150 146 94 -145 -332 -41 210 -130 -27 187 62 -66 -144 127 192 -279 7 298
4551 298 227 -134 -47 267 97 240 43 -12 179 -176 -130 446 -62 14 36 112 -71 -355 49 191 -257 -182 -26
4574 -26 200 -96 -210 -54 -61 311 87 -17 127 -199 -155 147 187 -204 -32 91 172 -151 -59 -48 17 -197 31
4597 31 55 -161 -382 -348 52 -57 -114 -144 193 247 -239 -214 256 302 -81 -19 334 -184 -23 -113 -14 -64 -19 14 -176
4622 -176 -42 -8 -288 -9 -93 -62 -49 -66 -264 -170 -313 -107 -33 -220 -126 67 -295 -12 127 54 9 43 262 139
4646 139 84 224 100 -37 23 -84 537 5 -143 -151 8 184 -490 -329 -24 -201 124 -222 -170 11 -171 -55
4668 -55 -113 87 -116 -87 81 285 131 -107 120 224 -97 -258 -10 228 166 -71 99 238 -104 84 139 -202
4690b02j58L39Q2j90K28J91m34l0L03o0K18l3l98J09K95k54J74l3J84m40j5L70
4712B46n6j30m26O45l55O4j76J15K20l75O0J26J09j5l40L8K01m3O1J56p5Lk01
4735a48K84K36o64L76J21Nl56k9K98K25m45j2R2J40k37P0P4N8j39J44j56l5PN1
4759d0m7K15m09J19K46j30j06j14M50L0m57K76K09r0m70L45K60l42j24K27L2j05
4781b5J81p9k4j58j14O5K79K10n07l8K63j75k03L51J69j54L4L3J32l71J76j41
4803i6M94k35j79J09j24j34J06K69n3O7l76J43m2L2k3R4n0m3p8J45P1k61K29j68
4827a03K55n13N27J6m25L98M1q1N5j89J09O4q6j91J70J94k28k93N8L87k48J59
4849G6j60L80o15J7J30J23J1k05J17m0J72mK11O1l16J7L84k05K3j25j31J80M1
$$ plain form
4690 -202 -360 -21 61 -129 99 290 -144 -174 129 69 287 254 -144 -35 260 6 180 147 331 -109 -124 246
4712 246 190 60 -366 279 -76 -12 -188 -73 147 -228 -168 -42 67 52 -288 -250 -49 -92 -31 125 50 53 -148
4735 -148 136 372 -292 84 205 210 -146 -175 123 348 -97 -109 -17 123 -114 -44 30 88 -51 93 -63 -98 -91 -40
4759 -40 -87 128 -281 -162 84 -46 -152 -266 184 214 -243 33 242 152 -318 27 287 -55 -179 48 80 -25
4781 -25 156 77 53 -105 -219 -154 125 335 -172 -210 53 -122 -325 26 195 41 75 108 240 -131 45 -96
4803 -96 398 163 -16 93 -31 -165 -59 210 157 224 -152 -9 -51 -19 -42 52 2 -41 -119 26 97 -164 65 -103
4827 -103 152 -361 166 182 -243 155 196 115 170 -19 90 154 68 -123 47 241 13 -280 -222 165 -83 76
4849 76 -84 296 -319 -302 -172 -49 -38 -243 -126 -166 6 2 213 274 -42 -25 359 154 177 52 -79 101 142
4872A42j26r0L31l31O5J41j08j15o2O1J13j12m3J63j2M9j75q6L84k73k4N44j89
4895B47kl13K11l9j58K27R2l73j2lk1J70k38J04K80k55j49K40qN4l44K19J53k12
4919a30P0r5M41n70J71m2K31o4N8o3K14k07p8Q7j0L07n27P6K34l2k55L31j09j76
4943a38j03N29m26J65m0l2p0q0J16R6J53m06J65M60l10q0nJ32Q9l76M9N02k94
4966I6N4j32O4k06J28n2K6O4qM1o4K28n17K11J2J58p26M96L4J59k59J41J93lj51
4991a3J04J91O0o48J53L00k68K9J10J88n4k52K97k47j7n8r4K48L5m04M35k64j32
5014c01K49K3J13j93J56J35Pl16Q5O7L26k52k83L36J75m46K06J68o8n68J58K92
5036F9O4l06k55M44j32K27j5O7j34l00k6O28j04m47K26J19o0l0p0J42j69L5K42
$$ plain form
4872 142 16 -74 257 -74 -9 132 24 -91 -153 -92 21 -91 -134 29 17 66 -109 -195 189 -84 -108 436 247
4895 247 245 -68 143 104 -54 173 265 -108 -120 -123 -144 26 -212 -108 172 -83 -232 8 0 54 -290 -71 82 -130
4919 -130 -60 -155 286 -284 -113 -155 76 12 70 7 221 14 -64 23 13 320 -207 -131 103 71 -184 147 38 -138
4943 -138 -241 288 -138 27 -13 -45 -115 -195 -79 17 170 -236 -71 389 79 -1 -6 126 215 -161 -112 390 96
4966 96 150 18 82 -124 4 -48 -22 42 34 75 11 239 -278 -67 -55 103 -623 -127 -93 66 -193 -52 141 138 -13
4991 -13 91 282 342 -306 -153 147 -121 -92 18 206 152 -100 197 -50 -67 -125 -219 29 64 -340 95 -169 -301
5014 -301 -52 -29 84 -109 47 182 189 -127 -42 25 351 99 -184 152 327 -119 87 255 187 -381 -223 69
5036 69 133 -173 -428 16 -116 111 96 163 29 -271 -297 331 227 -220 6 125 65 35 -35 107 -62 -27 215
5059B15k23k6J11k19K92k75J37k38L60N9l35j90K51M6l18O41l80k47M12J11j07
5080G7K4k68L61q8r0k61N19k20j74J79Q7k15j84L23j01o2j10p5K73j44j21R7J9
5103a54J76R1m06M34J66l86Q9K29o5q4m1R0j66K0J85j04j59J09l7K4P3l1l39K81
5127eR9l16K71pJ9k72J67K86j78j69J89k3P3j64J35j76O8q4J75K9j56j07K09J80
5151B43l08k73M24J10k83q9J84Q6k96J33N9j78L59l42L35k04j8j94L30o5j89P8
5173i8l7J80j82Q9o5J67j4o8J74m7q6k86L62N7j85J18K4r8L48m68J87j45M1J46
5197A14j29j59J4K66Rk17Q5J07O4m67M22K20l11%L6P4j38L21l60M9P5j60R8K16
5221B29j28k03k73L55J07r4j01k6K00j74L8J70R8l39K92k09K31m16J10L31o7l
$$ plain form
5059 215 -8 -34 77 -142 150 -125 12 -226 134 193 -142 -332 -81 -35 -353 288 -92 -339 73 184 77
5080 77 101 -167 194 106 16 -245 274 54 -120 59 146 -69 -253 70 -31 -93 -203 -278 -5 -149 -270 -173 -154
5103 -154 22 113 -293 141 307 -79 10 239 174 90 49 139 -27 -7 178 74 -85 24 -13 11 84 53 -286 -5
5127 -5 94 -222 49 42 61 -211 -44 242 64 -105 84 61 134 -30 105 -71 -3 -87 88 117 -39 -146 63 243
5151 243 -65 -338 86 196 -87 -176 8 94 -202 -69 -10 -188 171 -171 164 -40 -58 -252 78 13 -176 -98
5173 -98 -135 45 -137 -48 -113 54 40 -28 146 99 13 -273 89 146 -39 79 103 5 353 -115 72 -73 -32 114
5197 114 -15 -174 -160 106 115 -102 -17 90 154 -313 109 329 18 18 54 128 -10 311 -49 0 75 -85 13 229
5221 229 101 -102 -375 -20 87 -7 -108 -134 66 -108 -70 100 198 -141 151 -58 173 -243 -133 198 131 128
5243A28p3m0K00j06m54M85o8m7OJ2p5r0J1J75j15j15j56O78k20l55J97M73l64
5266H7k31N0lJ90m2p8L39j6m57R1J44L9l26M89q1k23m2m4K11j59j53l7M44L8m97
5291b67K83m1l3j15J44M10m17O2N2K37l86N3NJ47k65K99j32m7qP4M9j33J20o9
5315B2Q3%k21J34J17j32O5j95J41J6m1O9Q1k27P2j05J20J29k02M9r6K7j13K3O46
5340D62m79r3J88J22q1j61J6L66m08p4K38K9j31q9K1J2J06r8p8j35M30k85M9K63
5364A90l2l05J33J65j67M6L4J67l8o0j15K12l5n11L57o0J05M8j58l1J62M2l16
5387a67L95k84O1p7j44J84J84r2M9J22j40O7R3m51K81J3j16j50J04oL59m75L20
5410A30l18J70k87J16L24l72K21L2k87Q6K56k03K65q7j81J6K16l7K53l89K15j87
$$ plain form
5243 128 55 15 215 109 -345 140 72 25 31 43 -32 -122 -111 64 -51 -166 -322 356 136 -219 -22 451 87
5266 87 -144 -94 -97 93 51 -27 312 296 -161 -70 74 113 -213 276 195 -28 -70 -114 97 -62 -215 -252 192 230 -267
5291 -267 16 -25 -58 -173 -29 381 -36 26 78 315 -71 -18 -13 134 -131 168 36 -11 -19 55 104 -29 91 22
5315 22 105 105 -116 18 135 3 68 -127 14 30 -11 58 139 -88 -16 -121 -1 128 -74 -25 -121 -94 -207 -184 462
5340 462 -17 -110 78 200 119 -42 -26 340 -68 -142 96 125 -6 -95 -74 -62 44 -54 -132 -267 163 -122 -73 190
5364 190 158 -147 -14 151 -16 30 64 231 193 133 18 230 195 -316 41 -19 86 134 -24 -55 107 149 -167
5387 -167 228 -56 5 -72 -216 -32 152 60 109 231 91 158 251 -200 81 94 -22 -172 -68 -74 285 -190 130
5410 130 -188 -18 -305 -189 135 -237 -16 16 -271 -185 71 -132 133 46 -135 -119 97 60 313 -76 139 -48
5432d8l5J28j03J14j31O0J30J16k56r9J33K8J16l66J67L3j83M73k23m06L10L9
5454cl4J71j85k64M16k58K10j6j12j60M23rJ5j91l04K09J98k65k6L38m73K99j72
5477a93L35r1n51L41L17j40j86M82l20J65l41L3K55p0m1J44m0o0p6J69q4J23k09
5500c8R6l4m0n4J27J11k47j22J4N0O9M6j13L18j56nK2j61J34j38M09j94JL7j98
5525f6J71k68J61M9j26O3K50n2l65k5J46L50l54R2N6j44L01j17k48K57k20o7O5
5548i1J38k12J1J40K7m9n9n7L86j54j67OJ20K36l23j73K73K7l11K05Q4l77j1K21
5572a10J96M8n6j75o3o2J07oK71o6j56J21n9k0kJ0J54k39nL77p9k50J07J4O7k49
5598a25l8J54lj15LL26l05j33K01K15%k83K72mk6j90O3p4J04j52K74j4Nl79J44
$$ plain form
5432 -48 -83 45 -58 56 -75 -15 115 231 -25 -124 9 37 153 -213 -46 -13 -196 277 54 -352 -42 -3
5454 -3 -37 134 -51 -315 101 -157 53 37 -75 -235 188 179 194 3 -301 -92 106 -159 -185 153 -320 -21 -193
5477 -193 142 51 -500 -159 158 18 -168 314 -6 159 -182 -149 106 36 -5 139 99 39 -37 132 48 171 -38
5500 -38 58 24 -16 -70 57 168 -79 -201 -187 -137 -68 -22 -135 183 27 22 44 -117 17 -121 288 94 95 132 -66
5525 -66 105 -163 -2 47 -79 -16 234 182 -183 -208 -62 288 -66 26 82 -62 239 122 -126 131 -89 -156 -91
5548 -91 47 -165 -154 -14 13 -36 -95 -152 234 80 -87 -81 39 275 -48 -221 52 79 -232 -27 57 -320 -331 -110
5572 -110 86 134 78 -97 -160 -222 -115 -121 150 84 -72 49 -10 -30 -32 -22 132 -107 -112 265 186 -64 43 57 124 -125
5598 -125 -163 -9 -12 -127 -124 202 -103 -236 -35 180 180 -103 169 165 139 -51 12 -62 42 -110 164 150 155 -224 -80
5623h0K18qp6j58J40m5k77J75M1j36L46J22o6k39j17N2kJ51j56J25k8j09j42M50
5647A81pj96k3M4l0J09j61J72M5j03m13M45K9j88k3J62O3j26k03J56Kn3R3j63
5671a88N26k65k73K11M2K0n5K21p0j13J6Q2N7l31L21k21p0M18l61K9k21Q2J69
5694B6k2Pj79K5P5Q3k47K67J59j49j08J51k37K83k14%M9J41R7m85M14j70q7ML
5719a14K67j84j61N3j84J92R2j00qJ07j00P8n7Q6jJ26j0m5J20k47J8qM13k53k04
5744a24M5K00j23R9j15m3J55J9p6Qk64L36%j55j4qK51k90O8N3j29J77l59K16p5
5769a48R8J24o4K20j51l1o1J90j97J48K1n7j93J33j63J30j82J91lj99J93J92l88
5792a97K47j08J49k53J08J49k70M63j72j98R5K67m3k90M7j87K26J33r7NJ60k52
$$ plain form
5623 -80 138 130 54 -104 36 -9 -286 -111 -70 -206 140 262 196 -43 -160 -108 -110 41 -115 10 -18 -127 -269 181
5647 181 174 -22 -45 -1 -31 78 -83 89 134 31 -382 63 92 -96 -119 43 106 -20 -223 -67 -65 -118 -25 -188
5671 -188 338 73 -200 11 53 73 18 239 169 56 72 154 211 -120 201 -20 -90 328 -33 -4 -225 -143 26
5694 26 4 11 -168 -143 -68 15 -232 35 194 45 -63 88 -149 134 -80 -80 -31 110 207 -278 136 -34 -121 -117 -114
5719 -114 153 -31 -192 -139 -323 -131 -39 -139 -147 -40 -140 -62 -119 -33 -34 92 82 37 157 -90 -72 -80 333 80 -124
5744 -124 -79 121 -2 97 -18 -61 94 113 37 45 -219 117 117 -38 -52 -60 191 -99 -31 22 -107 70 -289 -73 -148
5769 -148 -50 74 10 230 79 48 -13 177 -20 128 149 92 -101 32 -131 -1 -183 8 5 -194 -1 191 -197
5792 -197 50 -58 91 -162 -54 95 -175 288 116 -82 13 280 237 -53 -6 -193 33 166 69 74 234 -18
5814a8j39k0J61j53j76M73k9q2P5j23j56M21l92K07Mj05L7n2M29l78j19K82k01
5837e4J04K6j43K89j36j61k65L10j32J9N4m6N1m4K92r2R5J14m74K68j32r5J8M4
5861i0K7j51L87p2j92j42K32j86k8J99J24r3K28n0j76J76k85K87k94L2J7o4K03
5884H9n8J8l02K75k12L03k84L4J42k53L35J11j69j19J75n8j04QN8o0P4Q8k94J06
5908i7R2l2J85o7j50q2K39m9K9j55k6J43nj61J49K44j97l8m5K01P5n53M84L2J5
5933B31l08M7K31K02l57m8J21j22J9o2J37k74M4J06R8L1j63J51l6j61J47M9m4
5956C9j96L01Q5Q6k24k8oR5l09J91O9R1k1rl4rj77JJ88j03K2J77l60J32q6M5j65
5983b05L14j15m1L2J25k35N8r9P6J38j02N5J39j17n5j30K18J83l37q3N7K86j81
$$ plain form
5814 -18 -157 -177 -16 -169 -345 128 99 17 92 -31 -187 234 -158 49 53 -52 -15 -67 362 -16 -135 147 -54
5837 -54 50 76 -67 222 86 -75 -340 -30 -162 -143 -89 -135 -84 -128 164 72 167 281 -193 75 -57 -152 -134 -90
5861 -90 -63 -214 173 101 -91 -233 -1 -187 -215 -16 108 15 243 193 17 193 -92 195 -99 -67 -50 -114 89
5884 89 31 49 -253 22 -190 113 -171 -137 5 -248 87 198 29 -90 85 27 -77 -69 -11 -71 3 91 -203 -97
5908 -97 -5 -37 148 81 -69 -151 88 39 68 -87 -113 30 25 -136 13 257 60 22 -23 178 253 -300 184 216 231
5933 231 -77 -30 201 403 46 -2 119 -3 16 -46 91 -183 -139 -33 65 96 -67 84 48 -113 34 83 39
5956 39 -157 144 229 315 91 63 57 152 -157 34 103 194 173 164 130 121 -56 -55 133 30 52 229 -131 1 -85 -40 -205
5983 -205 109 -6 -47 -15 110 -125 -67 -166 -90 48 -54 1 140 23 -32 -162 56 239 -98 -181 -124 162 -19
6006a9J42l11L33k01JN3O4q3L0q7J44k95K16J86l16K67o6P2l0qK14m82M1K40q4
6031B1P2m9r4l3l5j92N48j58j82jL31j15k41O6K25k32K15l07J31J1N5q2M6o1j09
6056a70N1K84rl76J71J20o7j88J7L33k13R1J94l02J7m9j06L83j06k56K53q6q9
6079a03K72q3O3j89r6L26J05J44n78N7K03J0k81L80l57R4jP8J64l54L29k56J06
6102C3N6M4k25J73n3L1r9Pk61J90K8KR9J68L6j73k41m6M17j96N8Q3j94K46Q8k50
6128B1J43l20K03j73J37j51o4L18M5oq7q2p6JQ0R4q4Q3k21K92j10N8p1J23p5k15
6154a37J12j84L5K7J42J54Jl28J80N4k78j8L85k49k3K99j50j84K67l67M03j06
6176C5K19k87J58l14M84l83O6M4k59L53N8k59N4L27n38K06k12M56l11K10k28p0
$$ plain form
6006 -19 123 -188 145 -56 -55 -2 62 -21 9 -78 66 -229 -13 173 -143 124 58 130 100 92 306 -176 -135 105 21
6031 21 93 44 -50 -83 -118 -310 238 80 -102 -103 228 113 -128 -62 163 -69 146 -161 -30 -19 36 -46 0 -61 -170
6056 -170 -119 165 156 -220 -49 71 4 -184 -167 166 -47 44 238 -64 -47 -96 -202 181 75 -181 72 -14 -103
6079 -103 169 86 149 -40 -136 190 295 439 -139 -82 121 131 -150 230 -127 -33 -34 44 208 -146 183 -73 33
6102 33 89 133 -92 81 28 59 -40 -33 -294 -104 -76 -74 25 193 229 56 -185 -231 186 -10 48 131 -63 183 271 21
6128 21 164 -156 47 -126 11 -140 -204 114 159 153 66 -16 -92 -91 -11 83 -1 82 -139 153 43 101 30 153 78 -137
6154 -137 -25 -209 -174 -147 -5 149 150 -178 2 56 -222 -240 145 -104 -127 172 22 -162 105 -262 141 35
6176 35 254 -33 125 -189 295 -88 -22 22 -237 116 174 -85 -31 296 -242 -36 -248 208 -103 107 -121 -191
6198a91J00L21m13K71M3k94j7k7J54n4N1o0K44j19P3k30J58j60M74k27L6j69J51
6221A15n3k95M08k14r1J53M3j66k9n1L52p5j68P7O8No9R5M7j74J37j55J57l30
6245b13L28o4m2J19k68J76o6O0j68R3J19P6l78J68j09M01k39o3K04J45n42L56
6267I3K30k23l1J88k20M9q3j52J40j08J08J4n2K74j06l2j26R5j58J2o6R7J70m47
6291c34N23j76j77K15k06J33N7r9J5O8J56j86J85j19L2k1L6k44K78J62n10J13
6313i9K2K74l82O5L44j05Q1j94J54k54o4J3J7P9O8k31L37n9k1K7j84N8j7K48J3
6338A90k63J75j17j39L33n5rq8L5j3j58K97j19o4j44J37K85m80K22o8K15k81l2
6361a41L56l25K6j0n7J26n1K93j23k90K9K24lm16K05J57Q0j13o6K04k0m6o0M9
$$ plain form
6198 -191 -91 230 -183 88 131 -163 -180 -207 -53 -107 -56 -116 128 9 82 -148 10 -150 324 97 133 -36 115
6221 115 62 -233 175 -39 -130 23 66 -100 -129 -180 172 97 -71 6 74 79 10 105 152 -22 115 -40 117 -213
6245 -213 115 51 9 128 -140 36 -30 30 -138 -45 74 150 -228 -60 -169 232 -7 -70 134 279 -263 93
6267 93 323 100 69 257 37 86 3 -149 -9 -117 -9 5 -47 227 121 89 -37 58 -100 -88 -154 -57 113 -334
6291 -334 189 13 -164 51 -155 -22 35 -64 -49 19 175 -11 174 55 87 66 102 -142 136 298 -212 -99
6313 -99 -77 197 -185 -120 224 119 200 6 160 -94 -158 -145 -128 -49 19 -212 125 66 45 72 -112 -54 -71 177 190
6338 190 -73 102 -15 -154 179 124 115 27 62 49 -109 188 69 5 -139 -2 283 -197 25 -43 172 -109 -141
6361 -141 215 -110 -84 -94 -151 -25 -76 217 94 -196 -167 57 54 -362 -157 0 80 -33 -99 105 85 39 -21 28
6385B8Jj10j08J95j36n7J24q5k2J86kK7J05k49J81KJ58l29J43Q5j24J30J6j67
6409hJ73j74J36N1k34k01p6L56o1J39k0J9Q5j58j45L31p5K7j09Oj71J88k02J85
6433F2k56J71J48K3k0l60l6M06l39J44J03o1M2p4J00p3j1O5m3l0k8j65L43mj98
6458i1J7j06L79k88j47M15J3j89K84l71p7K85q0q5R2L0k24J11n4q5J01K85j56
6481E9k1M3mn4k50J32J13j97J42%R9k7k45L18j38J14p4j5l6k94L29j7O8j1k84
6506b50L78L0j68M0n8J62l08j9K88l17J50k01J89L01j66j43J93n0K3r4Q7J49m75
6529b59M45m48K11j71K33k81N38j00l7j13o9J51o2k8j5k70K02M9q6J27j85J89
6551B1j7N3M1l8l7J37j04OP2j59P0j1J05j17k4pj36K15q8M4R8j94K0l9K30l26
$$ plain form
6385 28 29 -81 -189 6 -130 -187 -63 -148 -170 16 14 41 146 -103 78 80 238 -91 52 137 13 143 159 -8
6409 -8 165 -9 127 178 -56 -257 -333 23 -38 101 81 100 185 27 -118 213 138 165 56 62 -109 79 -123 62
6433 62 -194 -23 125 148 128 -232 -268 138 -201 -57 46 -15 27 -47 53 -20 -31 34 -9 -39 -67 -232 111 107 -91
6458 -91 -74 -180 199 -89 -236 179 192 3 287 -84 -161 124 44 -41 51 81 -143 -32 -86 -171 -70 215 59
6481 59 38 81 77 23 -227 -95 18 -179 -37 -37 62 35 -210 108 -30 84 10 -5 -41 -335 -6 -23 45 34 -250
6506 -250 128 158 -10 30 -28 134 -174 -193 95 -222 -72 -273 -84 217 51 -92 101 51 74 -20 67 216 -259
6529 -259 186 -262 -51 -222 11 -270 268 168 131 18 -51 100 38 10 -5 -275 -73 -24 -110 17 -168 21
6551 21 4 57 98 60 23 160 56 62 134 -25 45 34 139 22 -2 -9 -145 70 -18 26 124 -70 -50 -89 141 -185
6577a85N5P1K51k88L1L9k4l7j06L14P0l47m2M19j86j28M5J55J15l26K56k47K9
6600f6P5J7j48k4K30o6L4j10k18j02M69j25J64j40Q1j20K24k14l06N91m19L44
6622A71rJ25k62Kn3J90o2Jk92K86k54J84q6j8K5k6J03j21R7m5M6n4J84l96M15
6647A51k44P2M5J60l95K46Q0J77j01j28n5r7l3j45L26k39L3K6J91k27K63J34j63
6670G7J5j48j7N4j97J03J70p6o5N4J16K11o05M74K45l75l15K11L32l34q5K38l4
6693D9j02k81J27K91l37K1K66p1J59j4j0J5L8k63J66J15k11p3J78l4J63j69L8
6716F1J31O2m14L06k14J38m7k1J36j20pj76P0K5N1J80j56k33l7K14J3J1k32L12
6740E3k6j5J19j52O8j79l8P2M6j08K96j70K37j00J1P9k69m4K60j48L2k7J75k89
$$ plain form
6577 -185 -130 -59 192 -96 -65 -26 -50 -87 -193 121 191 -156 -198 221 35 -93 -48 107 222 -104 152 -95 -66
6600 -66 9 26 -122 -146 84 18 52 -58 -276 -378 91 -34 130 -10 71 -49 175 -39 -345 246 -173 171
6622 171 162 287 25 27 -26 164 102 103 -189 97 -157 27 -59 -77 -52 -78 25 -96 1 -44 2 -52 132 -264 151
6647 151 -93 -21 24 184 -211 35 115 292 191 63 8 -89 -122 -267 59 -180 -147 -121 70 -157 106 240 77
6670 77 92 -56 -73 -19 -216 -113 57 -19 -84 -30 86 297 -308 166 411 36 -279 -68 264 -70 -155 83 49
6693 49 -53 -334 -207 84 -253 -232 34 -37 122 108 98 113 151 -112 54 169 -42 -115 63 29 192 23 61
6716 61 192 254 -160 146 -68 70 23 2 138 18 11 -165 -95 -70 -19 161 5 -228 -265 -51 -38 -27 -259 53
6740 53 27 12 131 -21 47 -132 -170 -98 -52 -160 136 -34 203 103 114 193 -76 -120 140 -8 24 -3 172 -117
6764a17j72J82k07M08L9j34j67K63k88J83l4M5k9j78N23j73j27M4o2J57q4K4j41
6787d5k61M3K44K23j94j01K0N2j88MP5L72j46j54j38K07p0J04l4l66M89k57P4
6810d7k1J54K83m48NJ66j67r9J81j56N1J40Q1k45L22m8l43P0pj63J87J62k15K56
6834I9J5l1k01Q9m2K1O8o9R5k11M1K2J83J6l3L2l4pq9P5j56O0M9j81L95k24j45
6861a63J01M06m23P9o5K05k27J26R6j04L1o8O3k6N2k58K41l6j52K39j25L1J26
6884A49k87m5K61j58M7J73l9k75J39J68k87K25P0r9K7k2P4M5j69L29m16K87k75
6907g8J32K01j95J31k99L67l10P3np9R7k68J97L5p5M21j99k52K1K2P1k74L15K1
6931G0k55L85j68m2n1J53l3j01J27j46J12j72m3K48j05j20M2j08P6K30j62K88
$$ plain form
6764 -117 -289 -107 -314 94 133 -1 -168 95 -193 -10 -44 1 -28 -206 317 144 17 61 -1 156 72 96 -45
6787 -45 -306 -263 -19 204 10 -91 -71 -19 -207 -203 -128 244 98 -56 -194 13 -57 47 13 -353 136 -121 -47
6810 -47 -68 86 369 -79 -74 92 -75 -174 7 -149 -98 42 123 -122 200 152 -191 -121 -128 -291 -104 58 -157 99
6834 99 114 83 -118 -29 -71 -50 18 -51 44 -167 -126 -104 79 95 62 94 60 53 -36 39 -117 -57 -8 -189 206 -18 -163
6861 -163 -62 344 -79 0 -65 140 -87 39 135 31 62 -6 57 31 83 -175 66 30 -122 117 -8 23 149
6884 149 -138 -183 78 -80 -33 140 101 -174 -35 133 -154 71 141 42 69 47 121 166 -3 326 -90 197 -78
6907 -78 54 255 60 191 -108 259 -51 22 17 -62 35 -233 -36 -1 -76 345 146 -106 -85 -63 8 -266 49 70
6931 70 -185 200 32 -10 -61 92 59 -42 85 -61 51 -121 -164 84 -21 -141 -99 -207 -131 99 -63 225
6953B25j2l75J58J06j01J38k44K05J2q3o9L3O9l28K52K16m6m5P4j23m3j20K1J
6977g9K4J55r6J45k15n8J33J3N5k90K1K51r0J45l6n5J21l27P2J67k33J65k8K7
7001a3O8j7k15K52r9N8k2j10r8L74l06J33K3q1rJ80j54n4Q9j32J19J24j9J29j00
7026A20k16K09k07J94q8j1j30n3J41J93k61J45m4J13q3k23R2J62k89L75L3j82
7048a0J98l31N0L17l52K11j5j30K58m29N10l98M02k80K19L6j74r5r0J31R7j46
7070b1r1%L9k19J53K5J2J86j57J90l5l06K17r2P6o6J11K42k00j75K31j90J01J65
7094A96k27p3J74k71RK39j77K21l49K44J74j47J7j17K2O6J3j73l9Qk77L12K5O7
7118f3M7j59J85K6O8J32l82J64qL17k11j13J30K4n40O51l11L26m47L73r6j52L3
$$ plain form
6953 225 213 -162 -4 102 1 139 -105 100 112 29 -40 -7 62 -266 -14 202 156 111 185 62 19 -101 -80 -79
6977 -79 -55 100 4 149 -66 -124 9 22 77 -213 -192 59 -31 114 78 23 144 -183 -111 56 -177 -12 -40 -13
7001 -13 55 38 -177 75 -24 34 12 -98 -196 178 -128 5 28 -53 -62 118 -36 -90 -1 -133 -14 110 91 220 120
7026 120 -96 113 -94 100 12 1 -129 -182 -41 152 -109 36 -8 105 22 -201 -109 53 -236 139 172 -10
7048 -10 188 -143 -93 224 -128 83 68 -62 196 -233 277 -121 281 1 220 256 82 -13 -103 28 125 -21
7070 -21 -112 -112 -73 -292 -139 -114 -102 84 -73 117 82 -224 -7 -99 -23 -89 22 264 64 -111 120 -70 31 196
7094 196 -31 -104 70 -201 -192 47 -130 91 -258 -14 160 13 30 -87 -65 1 14 -159 -198 -190 -467 -155 -130 -63
7118 -63 -16 -175 10 36 104 236 -146 18 10 327 116 3 133 157 -383 268 -43 283 -164 209 113 -39 -6
7141fP9j46Pk4K4J0M29m38J72k00p7P8j45J90N8o5K56k69j4J29q4j38J82O3n1
7166B0R0k27K87j32M7k48K04R4j0Ok37J36m1q3L8k4J49P0j28L02k97j13K39k9
7190A13rj35J70j18j16J97k41L28k9j48k75K29P7L6l05K85n2j2J84k71O0r3J57
7213C2j09P7p6J97n9K8q1j79J97J50k92K33j38o2R3j1p0K4P7L3o2j05Q3J7N5j12
7239f0J73p3M0j79LJ86j47J95j47J1l6Q2j27M4K97m08K58p7q7j64J6J09J57K6
7263I2jj66J19K1j80K22k7j35m3M3l8J03j03M6K34m9l4j08l3K4J71j50O3k52K92
7288A11j57K57Nk17n2M5N2J87r5j02l81M80j50j88K68L1l2j76K24l19K69oP8l61
7312b29K81m6J07j76j64K90j98QL23p9k13K29l03mN5K87l86K72o3k66L53j00n1
$$ plain form
7141 -6 73 -73 -66 -90 -66 -56 373 -65 107 -93 -170 -92 -237 -47 11 -54 202 -67 -81 48 -36 -174 8 71 20
7166 20 110 -117 170 38 85 -163 41 135 125 131 -106 30 -11 -94 -56 -80 69 139 11 313 16 -97 142 113
7190 113 104 -31 139 21 -95 102 -139 189 160 12 -263 -34 43 79 -226 59 7 -5 179 -92 -32 -125 32
7213 32 -77 0 -76 121 62 90 9 -170 27 177 -115 118 -20 -82 11 0 -70 -46 31 64 2 -103 -20 -3 52 -60
7239 -60 113 40 80 -99 -96 90 -57 138 -9 2 -34 48 -79 -35 262 -146 112 35 -52 -216 -200 -91 66 92
7263 92 91 -75 44 65 -115 107 80 -55 -98 -55 -93 10 -93 -47 187 138 104 -4 -37 -13 158 8 71 -181 111
7288 111 -46 211 216 -1 -53 -8 44 231 136 34 -347 133 -17 -205 63 94 62 -114 110 -209 60 54 132 -229
7312 -229 52 6 113 -63 -227 63 -135 -127 196 117 -96 133 -170 -174 -119 168 -218 54 -9 -275 78 -22 -73
7335g3K40l65J07p4J88k0q7P2j51J24k50K53M2J04k48j9J26J28J03n7J9l57M04
7358B09k87q7M53m38J9J70j94j03J72J22r0N0O3m4M2k46K60j59j44L44j22j42
7380a52J88J03r0m2j2L22l82J98j97J13q0k4j38R1J31p9j61J89J95M7l54K20N2
7403A38j31j42J22J08k94J39P7p5J51l3l1N1l6R1k53L15k49l3OJ14k66L04m6J49
7427A76r1p4%J8m0L1j31Q7k7o7L09P1j82J48j28nq8Q0j08j81J35j09K51k63J6
7452a72K58n3kj37J64j88J30K30j47j77J35k79K25J18P4k51J33J3j47J64N2L2
7474A75k31L8J08j23qR1k0L3Mo8J22q9p3k49K88P8J24j74o5k1K00j8k45J49N9
7499H5Rk49J97N2J47m3j54n5q5O5J16j94%l9J81p3o2R1J43k24kJ20p2k3M47l46
$$ plain form
7335 -73 167 -198 -91 -165 23 3 -84 -12 -163 -39 -289 -36 6 110 -138 -157 -31 97 200 143 162 -195 209
7358 209 -78 -165 288 -150 -131 39 -155 -258 -86 36 -54 -4 59 15 57 -189 71 -88 -232 112 -10 -152
7380 -152 36 139 49 7 -5 317 -65 133 -64 49 -31 -55 -193 -102 29 -50 -211 -22 173 220 -134 86 138
7403 138 7 -135 -13 95 -199 -60 17 -58 93 60 29 80 44 135 -118 197 -52 -85 -79 35 -231 73 27 176
7427 176 85 11 11 29 -11 20 -111 -24 -51 -118 191 262 80 228 100 95 7 87 -21 -202 -67 -176 75 -188 -172
7452 -172 86 33 31 -106 58 -130 0 230 83 -94 41 -238 -13 105 179 -72 61 74 -73 91 143 175
7474 175 -56 -18 90 -33 -41 50 30 63 67 -1 121 32 -41 -290 -2 76 200 26 -39 -60 140 122 -123 26 85
7499 85 94 -155 42 94 241 198 44 -11 -96 -31 85 -109 -109 -148 33 -40 -102 -11 132 -92 -94 26 -46 -69 378 32
7525C2j8K00j92j26L53k13k13K91M5r5p8O7l0m6J05J12k20p0J99j03k84J66K31
7548A13n8k00J85j66J09J90j89k80L61k57J1q7L17M8j83J12l1J5J81k42K54n08
7570c05J44n2K31j15Q3j69J86j95J19N6j96K51j14j9J84j80J77n5j9j37n1K71
7592I5j35j58K33j10J41k19N3R0Q1J65j60j25p9K81k23J0n5K01j65q7O8N0k6J04
7616C0J44J49k48j07j38O6P0L04k12q4K52l86K10J76j85L3k27K37j76L5j0j63
7638b30K75r8j30J50j25R5O9N4j35M8J80M4j83Q0j87r8M17k26J04k59j90K35K90
7661A80J68m10Q9or8L31k80j09K5j69J07J96J3J2K36n26L31j99K4L05k72K27k46
7684g1J85q7R1m8j04k45P08l86P1l11M7J22%K26j40L6k03N5P0j66L32l10J76j31
$$ plain form
7525 32 14 214 22 -104 249 36 -177 114 159 64 -14 53 23 -23 82 194 -26 -96 103 0 -284 -118 113
7548 113 55 -145 40 -126 -17 173 -16 -296 65 -192 -181 -268 49 97 -86 26 -5 10 191 -51 203 -305
7570 -305 -161 -213 18 -97 -14 -183 3 -192 -73 -17 -213 38 -76 -95 89 -91 86 31 12 -125 -176 95
7592 95 -40 -198 35 -75 66 -153 -100 -10 71 236 76 -49 -128 153 -70 -60 -115 86 -79 -166 -98 -48 -74 30
7616 30 174 323 75 -32 -170 -104 -34 270 58 -26 226 -160 50 226 41 74 -153 84 -92 -57 -67 -230
7638 -230 45 -53 -183 -33 -158 -63 6 60 -75 -27 153 197 14 94 -93 -191 226 0 104 -155 -345 -110 180
7661 180 348 -62 27 21 -77 254 -26 -135 -110 -279 -172 24 37 49 285 -241 90 -109 -85 220 -52 175 -71
7684 -71 114 27 118 70 -34 -279 429 43 114 -197 -150 -28 -28 198 58 94 -109 -54 16 -150 182 -128 48 -83
7708h3J56L42n69K00m8k76L28k5J20Jj5J01k00n3r5J56q4p1K07J47j88l09K80
7731B2J38l7k54K60j88n6K07L4J6k81M7J94k6j65P9K1j35k6J58j69L78k89pJ19
7755D0j5l4J0Qn3k9J12Q7j55j43K02j01K57K9k28k02J96o6K53k87O1j02JL9J46
7780B6m9K5N6j99J89R4J8k14L85m17j27K24K24k68k07J40J06J71k46J28j92L89
7802B56m17P2M3LK47l8r3J03nmq9oK53l67Loj01J44L2K9m9P7r6l55K66n2J00R4
7830D4J46j91N0p7j95K66j54K29j82p2R0J77l41K10l8n8J52L4Lk55Q2j33K92j03
7854b4P3j78L6P3o1N5K12l19j9Q0k42J71J47P9K9l14l2K77n1P5n2j40K29p2r1
7879e9R5l11L36n6J97k18J05j94J40k29L35k86nJ53P3j41m6K31O1k87L07k50n7
$$ plain form
7708 -83 73 415 -154 46 -2 -278 50 25 145 146 131 232 32 -21 -116 40 -44 -115 92 239 51 -258 22
7731 22 160 123 -131 129 -59 -115 92 126 142 -139 -92 102 76 -89 -10 11 -124 -150 8 -161 217 -72 -79 40
7755 40 25 -9 1 9 -44 -73 39 126 -29 -172 30 -71 186 215 -13 -215 -19 -85 168 -119 -58 -160 -159 -120 26
7780 26 -23 2 58 -141 48 142 160 -54 331 -86 -213 11 235 -33 -240 -100 6 177 -69 59 -133 256
7802 256 -161 -89 -46 -43 204 166 73 176 171 167 78 72 325 -42 -39 -45 -146 -2 30 59 10 87 -9 -364 -98 -150 -50 44
7830 44 190 -1 49 -28 -223 43 -111 118 -64 -136 -46 131 -210 0 -38 -96 56 90 93 -162 -80 -213 79 -24
7854 -24 49 -129 -93 -20 -81 -26 186 -133 -152 -72 -314 -143 4 83 112 -202 -234 43 -8 67 15 -125 104 32 -59
7879 -59 36 -275 61 5 202 -16 89 -105 35 -194 141 -145 -150 3 76 -65 -111 120 181 -106 201 -49 -106
7902a06J77J8M3k51j65O82l14r9J55k48l5J44L0K8m7J36n7K38l27J43j07j36J99
7925A01j38k40L28j12K28j83LQ1n1q0R5r2K20k77L43j90q7J81M2q9j25Q8Q7Mj02
7950C5M0j89L17n5m9j32J80l78K06j58J26J08q3O4J64Kl56J41q2J63o2L02j21
7973A83m29L25j86K25j06J46j89p6J94O1k10J86k88J10r5r3J7J57J02J30m41M79
7995B02p1m53O8L01j94K27q6J03j6l95N80M9o30K83QNP4N7l2j67j93R8J25M0J68
8020A51j44r7J24j72nK26p6J7J0R6k02K77L7k93J44k71J60K31j06j17P2j74j76
8043b88K38J5J05k29N2Q2L9j31N4Q4q8q8o7J44K31j40j97K02K1K7j13j08L53j35
8067F3p5Q4l4J12j24K0J3o7Qr1J6k0P4r2J68J1j41R1J01j23K1l3j05M28r6j30
$$ plain form
7902 -106 71 89 132 -119 -284 398 84 -15 140 -108 -143 1 31 59 12 148 91 329 2 145 38 -98 101
7925 101 -37 -277 51 -61 167 -16 -13 68 17 -63 32 -60 160 -117 226 36 -51 130 172 83 -42 46 133 137 35
7950 35 75 -114 203 148 99 -33 147 -231 -25 -183 -57 51 -32 32 196 198 -158 -17 -99 64 2 304 183
7973 183 -246 79 -107 118 12 158 -31 -107 87 148 -62 124 -164 -54 -149 -242 -225 -68 34 164 -277 202
7995 202 131 -322 -254 47 -147 80 -6 97 81 -314 266 315 -315 -32 -24 -19 55 112 80 -87 -280 -182 -57 -17 151
8020 151 7 -90 34 -138 -143 83 7 24 34 130 -72 205 242 -51 93 -178 -18 213 107 -10 62 -112 -288
8043 -288 -50 -35 70 -159 -107 -25 14 -117 -63 21 -67 -155 -222 -78 153 13 -184 18 39 66 -47 -155 198 63
8067 63 -12 72 38 150 26 46 59 -8 0 -91 -75 -95 -21 -113 55 66 -75 16 117 -6 15 -18 -123 305 209 79
8093G9J57j08j63J34j73L7l4J1n9L32k21o1K26m08L97L4n1k01K64l49P2Q6J16
8116A17J91k7l85J64K85m12nJ8K69k77p8L04q1n1q6K60K2l05O9J26k69R1J94m8
8140H6n0N9j31l3J85N8j88O1j0K69l13nP9J02k03R9j32L5L5n9j9K09Q2l48K91
8165A59l79J66P5K03j95j11K7J57Rk40R5L04k46J35j62J79j32m9J75j96k39J53
8187a12R3J40M4j81
$$ plain form
8093 79 236 128 -35 99 -74 -37 -71 -60 -119 213 -8 -69 157 -251 146 180 129 -72 192 -157 -85 1 117
8116 117 308 281 -104 60 345 -67 -72 -54 215 -62 -140 164 83 32 -54 206 228 -77 -8 118 -151 -60 134 86
8140 86 36 95 -36 -69 116 174 -14 47 37 306 -7 -12 67 169 -34 65 -67 -32 3 -56 -75 134 216 -132 159
8165 159 -220 -54 21 224 29 -82 -55 102 111 -129 -34 270 24 159 -3 176 44 -5 170 -26 -265 -112
8187 -112 -19 121 165 -16
8191a6
$$ Imaginary data points
##PAGE= N=2
##DATA TABLE= (X++(I..I)), XYDATA
0@%%%%%%%%%%%%%%Qj6J6j6J6j8K6l2L5m3M8n6O8p6Q8j04J20j36J52j71J94k18
36a15K45k75L07l41L79m21M64n13N69o29O94p63Q39r26J022j127J241j368J513
55G95j676J862k079K332k630K992l440M011m767N811p354R862j4592K6406j06884
70h9351j63521L08781M7257k06021P5389J21506j10760j421M0217m5733M0220
81A6563L4304q8135J5414P9585p2631m3976J00899n515p1395J6912K9370j2302
93i07k1427J007L4739J4271l6239q281M4101k6803k5333O2000j3551o3436L0486
106i373L3596k2138N385J3643k6025L803K198l0087M9524L5234q0745j6990O9994
119B8019j8842n7886M3312L3686m9333j0657J9731j217R281P480O407J1449j2361
$$ plain form
0 0 0 0 0 0 0 0 0 0 0 0 0 0 0 0 8 -8 8 -8 8 -10 16 -16 19 -24 24 -32 36 -40 48 -56 64 -72 80 -91 103 -115
36 -115 130 -145 162 -179 200 -221 243 -270 299 -330 364 -399 440 -486 536 -591 650 -718 795
55 795 -881 981 -1098 1234 -1396 1596 -1844 2167 -2600 3211 -4143 5719 -8873 17533 -89351
70 -89351 -252872 55909 103166 -102855 -27466 94040 -16720 -18141 22076 -23657 16563
81 16563 50867 -37268 -21854 57731 -14900 -58876 42023 36508 -34887 -17975 11395 -907
93 -907 -22334 -21327 13412 27683 -8556 -16837 27264 461 -24872 37128 23577 -39859 -9373
106 -9373 24223 2085 7470 21113 -4912 -1109 1089 -28998 20526 55760 -24985 -41975 28019
119 28019 9177 -48709 -5397 28289 -21044 -31701 -11970 -13187 -3906 3574 9981 21430 9069
132I069k4632L261K0067n109k89J6274l23q767j4349L326K2001p782j8455K433
146c275j501j0659J1316J2130j4174P979Q533k3859O581J9850r446P08J948k6325
160b0194j076K7677j8347q772M1706j4908l1643L4405M964k8129K8934J6420m6283
173a5246K193L0219l2911l010L6730j8706r513K3826j7285j0149L8605n125l2574
186a2946K9133O200m5476R492L1551j2589j3802L542Q11J994n977j1352K2882
199C463J4685l3829j933K9820o620j0775J1114J780n442m053j0735J2117K3535
212B3127k5601j8020L0052o041k4464K3239J5586j9060M425P658k1655K271J3341
225D858j2871R048J1526k3095L86J9223j5046k883L3850q542l3192J6409J7376
$$ plain form
132 9069 -15563 -12302 7765 2656 2367 18641 18318 9551 -4798 -1472 20529 12747 -5708 -3275
146 -3275 -4776 -15435 -4119 8011 -6163 1816 10349 -13510 -6929 12921 3475 4183 6131 -20194
160 -20194 -21270 6407 -11940 -20712 20994 6086 -25557 8848 13812 -14317 14617 31037 -15246
173 -15246 -13053 17166 -15745 -18755 17975 -731 -10244 13582 -3703 -13852 24753 19628 -12946
186 -12946 16187 22387 -23089 -13597 17954 5365 -8437 -4895 -4084 -2090 -8067 -19419 3463
199 3463 18148 -15681 -17614 12206 5586 -5189 5925 7705 2263 -1790 -12525 -408 23127
212 23127 -2474 -20494 9558 3517 -20947 2292 17878 -1182 3243 10901 -10754 -8483 4858
225 4858 -8013 1035 12561 -10534 -10148 9075 -5971 -8854 24996 16454 -16738 -329 17047
238A7047j5775m798R359N215p705j7886J062K2422k864k3319R296J3132j4956
251i770p212Q612J2842O223j9472q155L1447L205l6634J3341L4904k5585j6847
264a3101K3462n618q767J6921o784j0640J5225j1975j5720L5571L250m1618J4455
277e339K2019l3224l715L1598j0831j4673J7334n805j1900J5413k56m317J2792
290I096p049j1279J5990K346j6331J1454J0071j7370o505O601K814N099o126m639
304e828J4691l161k1884J4520K2767j7782r758J2422p756n492O662l811O426R431
318A1447k1529n354L1120p234k6852K2314J4519k4021k050R982o659N040O724
331G447j5012J318J1758j2478Q25J8439q897r169J0421m580q807J0689M504o735
$$ plain form
238 17047 1272 -3526 5833 11048 3343 -14543 -13481 8941 6077 -17242 -7946 5186 -9770
251 -9770 -16982 -8370 4472 10695 -8777 -16932 14515 17720 -18914 -5573 29331 3746 -13101
264 -13101 10361 4743 -4024 12897 6113 -4527 10698 -1277 -16997 18574 21824 -19794 -5339
277 -5339 16680 -16544 -20259 11339 508 -14165 3169 -2636 -14536 877 621 -3696 9096
290 9096 2047 -9232 6758 9104 -7227 4227 14298 -3072 -9577 -2976 -162 4937 -1189 -5828
304 -5828 8863 5702 -16182 -1662 21105 3323 -6435 5987 -1769 -7261 -599 -4410 2016 11447
318 11447 -10082 -15436 15684 8450 -18402 3912 18431 -5590 -7640 2342 -4317 723 7447
331 7447 -7565 -6247 5511 -6967 -6142 12297 3400 -5769 4652 72 -8735 1954 6458 -277
345b77J405k438l724P292k277k268R508n916j1811J0669O094q946M268M119o147
360d49N243m453j2659J9389J1507k5744p02K0882j6106j3790K0967K212j0271
373c974O831q460o323K0332n481k1105K0816J3566k9161j671K5358o345r942P998
387B439l490j68Q793p496k079J5280n805j5912J0013O807j0533J378Q038k547
401D718p362o274L411R232l215m923Q244l606j2543P526P867o164L227L952p983
416c893l7L701l767R056O587j6665J334J7027j4220j3142K0951P642j7128p39
430c293O547m120l21n69q39Q762m573j2976J0558J0401j4531n070J3990J4q579
445d599L71O449P816o943j5635Q702J4186j2034m462J6985m179j4545O144M592
$$ plain form
345 -277 1128 -1310 -5034 2258 -19 -2287 7221 1305 -10506 163 6257 -2689 1579 5698 -449
360 -449 4794 341 -12318 7071 18578 -7166 -7868 13014 -3092 -16882 4085 6297 -3974
373 -3974 2857 -5603 -11926 8406 2925 -18180 2636 16202 -12959 -14630 10728 4383 -5559 2439
387 2439 -1051 -1219 7574 78 -2001 13279 7474 -8438 1575 8382 -2151 -773 7265 4718
401 4718 -2644 -8918 -5507 3725 510 -4413 3831 225 -12318 -4792 3075 -3089 138 4090 -3893
416 -3893 -3930 -229 -3996 5060 11647 -5018 -3684 13343 -877 -14019 6932 14574 -2554 -3293
430 -3293 3254 -866 -1187 -1756 -2595 6167 1594 -11382 -824 9577 -4954 -10024 3966 3980 -4599
445 -4599 -4228 2221 10037 3094 -12541 -3839 10347 -1687 -6149 10836 6657 -7888 -1744 2848
459B848l839N211j795l807P237r343j3507J6419Q725j5470P458J0765j9458k660
473a1216J9850n087p079J0037m866o448O995o921k086J9861o452k0131J7048J0996
487A4501k2337J896J9934r070j1550O844k64k577K873o311R88J1542p211j0639
501a1381J3600P740j3324l985Q685P9n104Q82P860J486r755k867P229P36j655
516B26N278j245n164K424k168m054Q684K173q130M532K057j2516L011J0828p349
531a413l070R186o628q048R768K836m947L667j45l498M040r95m106P624J263j0431
547d897R99O121j063J86m77q34N674l538r328R748Q034j3693j880Q496q606k452
563g510R460m885J075J0958j3758q661K1253j802j7055J5555P373k1116M319J2619
$$ plain form
459 2848 -991 4220 2425 -1382 5855 -3488 -16995 -576 8149 -7321 137 10902 -8556 -11216
473 -11216 8634 3547 -3532 6505 1639 -4809 2186 -4735 -6821 13040 6588 -13543 3505 14501
487 14501 -7836 -5940 13994 4924 -6626 218 -46 -2623 250 -6061 -5073 6469 -742 -11381
501 -11381 2219 9959 -3365 -7350 1335 1414 -3690 -2808 5052 6538 -3217 -6084 1145 1881 226
516 226 5504 4259 -905 1519 -649 -4703 3981 6154 -1976 2556 4613 -7903 -4892 5936 -1413
531 -1413 -4483 4703 -1925 -9973 -205 2631 -2316 1351 1206 -2292 1748 753 -3353 4271 5534 -4897
547 -4897 -3898 2223 1160 1346 869 35 5709 2171 -7157 2591 10625 -3068 -4948 3548 -5058 -7510
563 -7510 1950 -2935 -1860 9098 -4660 -13321 7932 6130 -10925 4630 12003 -9113 -4794 7825
577G825j2585L161J3283j3261j983J4089j4280o776K1985n430j7560J5613M305
590H386j8783P504J1023j3710k21R392o874j56P897o814l21P730r734l891J4960
605F388j468j0036P539L703p146q27K660K959K905q589n459J1767j038j3425R468
620e99J4011j2180r161P559J850m406K51Q24N099J001j2336j030J5864r85j3130
635g368O016J0258q244o892N978M931k186k867J471J398l932k514N311K282m537
650h95j761L700K188k556m072L267L189p719l300J0628J260q702M410O443p899
665a819l583O390J063k5j786l736O164L556j1971J896J7337p520j5435J0516N303
680F350j1678K453O593l294N81k157p014Q140O330j3455J627J3991r902r992J3626
$$ plain form
577 7825 -4760 -1599 11684 -1577 -3560 10529 -3751 -10527 11458 6028 -11532 4081 8386
590 8386 -10397 -2893 8130 -5580 -5801 3591 -3283 -3439 4458 -2356 -2677 5053 -4681 -8572 6388
605 6388 4920 -5116 2423 6126 -1020 -1847 813 3772 6677 -1912 -7371 4396 3358 -10067 -599
620 -599 13412 1232 -7929 -370 1480 -2926 -2675 -1851 3248 4249 -8087 -9117 6747 5762 -7368
635 -7368 -1352 8906 662 -6230 -252 4679 2493 -374 1097 2495 -1437 -3951 1360 3642 -895
650 -895 -2656 1044 3232 676 -3396 -129 3060 -4659 -7959 2669 3929 -4773 -363 6080 -1819
665 -1819 -5402 988 2051 2026 240 -3496 2668 6224 -5747 -3851 13486 5966 -9469 1047 6350
680 6350 -5328 -2875 3718 424 1005 -1152 -8166 -26 6304 -7151 -5524 8467 -1435 -11427 2199
695B199L334q556L222J732m256L890j270l837Q776J896r716L594N395q242O60
710a179O629n471l433L620j781J96L704l523q2L554p194j851J0371k931p149Q603
726B083K367q734K471M306k607L352p63p958O201N740j0278M02J1793m332r443
741e400N081K326l190J447k93r27L490l385m494O989L251p248j090M671q15l103
757b690L04M232L536m706m443M849Q95m280J870K808k557L52m85k700N292J749
773D026q195K779O622q818k048J1344l681p068P900m45q823N912M881o971J605
788i80K717n046L001L868o899K834Q199q632o061J0300J789p037J893L941j118
803B769l292l630L746O859n493o604P500J086r163J132P432q53k259k279n59N225
$$ plain form
695 2199 5533 -3023 199 1931 -2325 1565 295 -3542 5234 7130 -2586 1008 6403 -1839 -1179
710 -1179 5450 -21 -3454 166 -1615 -1419 2285 -1238 -1320 2234 -4960 -6811 3560 629 -6520 2083
726 2083 4450 -4284 -1813 2493 -114 3238 2475 -5483 718 6458 -3820 -3418 8375 4043 -5400
741 -5400 -319 2007 -1183 264 -29 -956 2534 -851 -5345 1644 4895 -2353 -3443 1228 413 -2690
757 -2690 -2386 1846 5382 676 -3767 1082 1977 -2303 -433 2375 -182 170 -315 -3015 2277 4026
773 4026 -4169 -1390 5232 -3586 -5634 5710 2029 -5039 2861 2416 -6407 -495 4386 -2585 -980
788 -980 1737 -3309 -308 3560 -3339 -505 7694 -938 -6999 3301 5090 -1947 -54 3887 2769
803 2769 -523 -4153 -407 6452 959 -5645 1855 2941 -6222 -5090 2342 1489 -770 -3049 -3608 1617
819A617j354p769P735P609j0415l994J0626j023n947N144K298l762J100j35j122
834F08L846k957m871O505L99q664L752O407o988l341N608r28l143K618J420M21
850F92j129m257K380O200m299l412P853J224r122L5P229J055l573k573L157K452
866C912o869l260R944K581r337P67N527l650l025J941J512K218j306o222M058
881a209O471p768k102J1161k581q684N618L843o506J376L433m094p34J781j848
896a843K332J617n497J652N470n124k821P696P23o910o67L454J52j622r18L741
912A435K243n822k925P195J507n320J650L770k005k500j494K433M476k809n501
927c667M655L470p087r11O738r56l692L91n3R98J457m143J77N468l069n692M948
$$ plain form
819 1617 263 -7506 229 7838 -2577 -6571 4055 3032 -2915 2229 4527 765 1865 1730 608
834 608 4454 1497 -3374 3131 3530 -5134 -1382 5025 -1963 -5304 304 -624 -3767 -1149 271 692
850 692 -437 -4694 -2314 3886 -413 -3825 4028 5252 -3870 -3835 3394 4449 876 -1697 1460 3912
866 3912 -2957 -6217 3727 6308 -3029 -2262 3265 -385 -3410 -1469 43 2261 955 -5267 -1209
881 -1209 5262 -2506 -4608 6553 3972 -4712 906 4749 -1757 -381 3052 -1042 -1776 5 -1843
896 -1843 489 2106 -3391 -1739 3731 -1393 -4214 3482 4205 -2705 -3372 82 234 -1388 -2306 1435
912 1435 3678 -2144 -5069 2126 3633 -1687 -37 3733 1728 -772 -2266 167 4643 1834 -3667
927 -3667 988 4458 -2629 -3540 3198 2242 -1450 -1059 -1112 -114 1343 -2800 -2623 2845 -224 -5916 -968
944i68L408m384m61J413n16J741Q02j400L346Q44m238J70K768j934K70K681k264
961A278j524K86j953R24L159k115n2K040m630j798N942j533m413N212R44n821
977d054J244K384r36L170k16m340N416K871r662J216J0221n450o944O409K037
992C366m637P72M25k26K346l903l160Q295J205r990K639P683n723l552P021J396
1008C957m113r42k89J528K028k954%M948k935n376L076L425l173l8L223k12l443
1025a290k342K521K964l387r18N074j479o643L378O097l129l026L669Q92k023
1040C58k232j49M336R13o134j58P630k070o226M036M517l288m150J786M370q23
1056B716m948L76M763k794m706M668L047l865j356J279o69R98o89j569M578M40
$$ plain form
944 -968 2440 -1944 -2405 -992 -1508 233 1035 -365 2981 3825 -413 -243 2525 591 861 3542 1278
961 1278 -246 40 -1913 -989 2170 55 3 2043 -2587 -4385 1557 24 -4389 823 1767 -4054
977 -4054 -2810 -426 -1362 1808 1592 -2748 2668 5539 -4123 -2907 7314 1864 -5080 1329 3366
992 3366 -1271 -499 -74 -300 2046 -1857 -5017 3278 4483 -5507 -2868 4815 -908 -4460 2561 3957
1008 3957 -156 -1098 -1387 141 2169 -785 -785 4163 1228 -4148 -1072 2353 -820 -858 2365 2153 -1290
1025 -1290 -3632 -1111 1853 -1534 -2452 2622 1143 -5500 -2122 3975 846 -2180 1489 2381 358
1040 358 -1874 -2023 2313 3226 -2908 -3066 4564 2494 -3732 304 4821 1533 -2617 -831 3539 2716
1056 2716 -2232 -1856 2907 113 -4593 75 3122 -743 -2099 -820 -1489 -491 -1180 -2749 1829 2269
1072B269p137K543N785n363j007Q283k734n959N166P92m733M308K063m587J670
1087A359L88m984L856L949p156m89P205m755n497O326J380m774J177J421l02J709
1103H13k370o94N606m41p133L322N365m703r70M092j464j393K76k009K586L393
1119D276n173k566N195j193m561L475K597l143l48J038j216J745R62k070J881
1134H99J630l617K43K920j836p73L057j328k750J770Q69j467M43M95j034j23l92
1151i94o08J150J131j640j219K074Q35j868l83L375K06m035M21L496j176j680
1167i15J258Q84j96j020j942K357M011m035l551N291Q26n795J090N053k512k610
1183a806J759n90Q24J115l290P86M685m697m027O329J221n895K246L739m095m37
$$ plain form
1072 2269 -4868 -2325 3460 -1903 -2910 5373 2639 -3320 1846 2638 -2095 2213 4276 -311 1359
1087 1359 1747 -3237 619 4568 -2588 -3077 4128 -627 -6124 202 1582 -3192 -2015 -594 -896 813
1103 813 -1557 -2251 3355 2914 -4219 -897 4468 -235 -1205 2887 1423 30 306 -1703 883 4276
1119 4276 -897 -3463 1732 539 -4022 -547 2050 -1093 -1441 -403 -1619 126 1088 -982 899
1134 899 2529 -1088 -845 2075 239 -534 2523 1195 -1555 215 1084 -383 60 555 -479 -602 -994
1151 -994 -1602 -452 679 -961 -2180 -106 729 -1139 -1522 1853 2059 -1976 -1555 1941 765 -915
1167 -915 343 1227 1031 11 -1931 426 4437 402 -3149 2142 2968 -2827 -1737 3316 804 -1806
1183 -1806 -47 -637 187 1302 -1988 -1202 3483 -1214 -5241 1088 2309 -3586 -1340 2399 -1696 -2133
1199b133K479j186J201J545k898O53K968l665M10N663l345m219M012J352m283
1214a446Q59K958j289j188j360n07L229j296m037M036L105o332p67N808m81l398
1230b106J217J215O74o17k792K685N005m777m452O830J648o879R59N305l183k820
1246b088J461P69K99l33k201J718K501m296k078N827Q07m761J262L413k286k086
1262b072K401K153j174k090J168J501j789j311K910Q31k780n89Q86N27j023j747
1278b198J728K695l252l120M830K407n780j44N332j440l572J545K070O47r26k244
1294a422J106L270k781k793M994J405n464J21L286m81j371Q10n09J00p04k066
1310b499J869K652k583j080K575j248j959J942K44j59Q41j035p39J671o31j113
$$ plain form
1199 -2133 346 -840 361 1906 -992 -339 2629 -1036 -626 5037 1692 -2527 1485 2837 -1446
1214 -1446 -587 2371 1082 -106 -1466 -1973 1256 -40 -4077 -41 3064 -3268 -4035 1773 1292 -2106
1230 -2106 -889 326 1000 383 -2409 276 5281 504 -3948 2882 4530 -2349 -1390 3915 732 -2088
1246 -2088 -627 142 441 108 -2093 -375 2126 -2170 -4248 1579 2386 -2375 -1113 2300 14 -2072
1262 -2072 329 2482 1308 -782 386 1887 98 -1213 1697 2528 -252 -841 45 572 -451 -2198
1278 -2198 -470 2225 -1027 -4147 683 3090 -2690 -2834 2498 1058 -2514 -969 1101 1748 822 -1422
1294 -1422 -316 2954 173 -2620 2374 3779 -1685 -1564 1722 1241 -130 680 171 271 -433 -2499
1310 -2499 -630 2022 -561 -1641 934 -314 -2273 -331 -87 -246 595 -440 -1179 492 -139 -1252
1326a252K721j64k946K103J419k706Q10K665k417m69J432j226J42J494k452o89
1342a535L330k088k556L492J426l675j10J610m07J43k39P3J809j63l781J334L800
1359B463j692k044K055J310j874j372N93K028R19l034j7K593j767k819K173J750
1375A265j048j395KP97N75j772M83L041j190k904K714J177k978N34K419j381r54
1392f15J374n63P9P24j767R17K114l075j089M415q13m874J915L002k759j284K371
1409G2J215j323j831rK586P23l437J688L425k617l498K851K531j627j456Q19J700
1426A812n09l807J303M588k309l429L037J466l257k46K142j88j051q39k04J708
1442B17l20k336K032K125k986q23L563k24k779J451J608j545j056J096J438J82
$$ plain form
1326 -1252 1469 1305 -1641 462 1881 -825 -15 2650 233 -236 1196 -30 112 1606 -846 -1535
1342 -1535 1795 -293 -2849 643 2069 -1606 -1716 -106 -513 -370 -609 -536 1273 1110 -2671 -1337 2463
1359 2463 771 -1273 782 2092 218 -1154 -561 1467 2386 -648 -665 1928 161 -2658 -485 1265
1375 1265 217 -1178 -1176 -379 196 -1576 -1093 1948 758 -2146 568 1745 -1233 -699 1720 339 -615
1392 -615 759 196 275 999 -768 149 2263 -812 -1901 2514 1701 -3173 -1258 1744 -1015 -2299 72
1409 72 1287 -36 -1867 -1876 710 1433 -2004 -316 3109 492 -3006 -155 2376 749 -707 112 1812
1426 1812 1303 -2504 -1201 3387 1078 -2351 686 2152 -1105 -1351 791 603 -448 -1287 -1491 217
1442 217 -103 -2439 -407 1718 -1268 -2091 1472 1248 -1531 -80 1528 -17 -1073 23 1461 1643
1458A643k473M8K882r69l168K448K543k719k061J331J174n05j770L71K795j198
1474C72l693J815L394k696j268L154M79k036l76O04J293J003k499n27L497j403
1490A113l410L112J600l264k81J840o96l84P31j308K78J315k139n8K894j140k432
1507b229K527L79k540J472J406j018M39N04j091M44N38r06J289O99k356R0J359
1524A006j007j172J719J69o64p10l67O27J039j670m58K662j55l431J483K068j171
1541c2o85L13P83L38p66j154K356J167k912q31L236j83k358Q7J698j54j769j84
1559a050J687M77j839k75J325j52j333J05J379M08j240m79Q85J116k218L46K896
1576B038j339k783K516J072k530J062J648j324p70P77p51J308M06k892J370L065
$$ plain form
1458 1643 -830 -782 2100 1131 -2037 411 2954 235 -1826 -495 679 174 -1596 -1225 1570 372
1474 372 -3321 -1506 1888 -808 -2076 1078 1557 -479 -855 -251 1042 2045 -454 -981 2516 1113
1490 1113 -2297 815 2415 -849 -1130 710 14 -370 361 -947 -669 646 -1493 -1551 1343 203 -2229
1507 -2229 298 677 -1863 -391 1015 -3 436 940 -151 293 831 -75 1214 1913 -443 -353 1006
1524 1006 -1 -1173 546 715 51 -659 -1026 -399 640 -1030 -1488 1174 1019 -2412 -929 1139 -32
1541 -32 -717 -404 379 717 -49 -1203 1153 2320 -592 -1423 1813 1630 -728 -641 1057 903 -866 -1050
1559 -1050 637 1114 -725 -1000 325 173 -1160 -1055 324 732 -508 -987 -102 1014 -1204 -858 2038
1576 2038 699 -2084 432 1504 -1026 36 1684 360 -410 367 -384 924 1330 -1562 -192 2873
1592B873l819k338M801J59m443J525K985k095j109Q91N90J160r69k754K608K594
1608B659l717q24M275k43l953J565K011q66q33n48Q91Q98j691j355L126J78l494
1625a921J158K087k207j086J972K19q57K4k55P62O87j371L92K236j770j966K783
1642H87J098k613K40K381j100j642L78J437m1j104j091J667Q34k523p25K841L30
1659A254k560l54J938Q9j575m5K118J31k001j94J860M77j044l90J138L47j128
1676F1j036K082P34k502m5J822r67j391J480l9o45M85n34p19J496m26j298J802
1694C60M86k878J024K622k230n53L103j108k280J933M33j137J134l36j168J852
1710A257n95k635K247J874l016n42K808j381j571J347J85k88N49j712J17K773
$$ plain form
1592 2873 -946 -3284 1517 1676 -2767 -1242 1743 -352 -1461 -570 20 1180 211 -2543 65 2659
1608 2659 -1058 -1882 2393 2150 -1803 -238 1773 907 74 -474 417 1315 -376 -1731 1395 1573 -1921
1625 -1921 -763 1324 -883 -1969 3 222 -635 -611 -866 -104 583 -788 -396 1840 70 -1896 887
1642 887 1985 -628 -388 1993 893 -749 -371 1066 1025 -79 -1170 497 1331 -1192 -1917 924 1254
1659 1254 -1306 -1660 278 367 -1208 -1253 865 996 -1005 -1199 661 1138 94 -296 842 1189 61
1676 61 -975 1107 1841 -661 -706 1116 149 -1242 238 199 -446 39 -495 -1214 282 -144 -1442 360
1694 360 846 -2032 -1008 1614 -616 -1169 1934 826 -1454 479 912 -225 909 573 -595 1257
1710 1257 662 -1973 274 2148 -868 -1410 1398 17 -1554 -207 -22 -310 239 -1473 -1356 1417
1726A417j436k058K560J015k842N59J881j10m83m92l45J493R8k561J242K066k248
1743b44j068K200k41j452J077N5o99N49j000m40J948o4k051J415J045k309l64
1760a643K520m67j248J209P94j131n14Q74P34m38o33j67P24l79j091N75J339k93
1778G65j691J12J814m98k392J655J811j916j636J836J555j939p42J035P50m13
1794A06j377O94K352o67k690J423K335j918j527K172N40j551o10N62J158m72j362
1811h32O57J416j889j509K443P93k355Q34Q19p55l53K18K47O57m16q63J423P30
1829A265k407M57L100j438k332J840J208j875o22R86P08m41j802J44K510n49l084
1846b332J617K593k481j542K418O38j464k39L47J270J73j857M62K208j250j958
$$ plain form
1726 1417 -19 -2077 483 1498 -1344 -785 1096 986 503 11 -334 1159 1257 -1304 -62 2004 -244
1743 -244 -1312 888 647 -805 272 327 -372 177 -823 -1263 685 621 -1430 -15 1030 -1279 -1643
1760 -1643 877 410 -838 371 1165 34 -480 394 1128 690 57 -110 614 235 -856 -281 1058 765
1778 765 -926 -814 1000 502 -1890 -235 1576 -340 -1976 -140 1415 -524 -1266 -231 519 106
1794 106 -1271 -577 1775 1108 -1582 -159 2176 258 -1269 903 1443 -108 -718 -156 1002 530 -832
1811 -832 -175 1241 -648 -2157 286 1079 -1276 -442 377 -378 -731 -513 -266 391 -25 -888 535 1265
1829 1265 -1142 -685 2415 977 -1355 485 1693 -182 -804 182 890 449 -1353 -1209 1301 752 -2332
1846 -2332 -715 1878 -603 -2145 273 911 -553 -792 -445 825 998 -859 -397 1811 561 -1397
1862a397J771J195j443j73J107j09j119k63L41P28q33p59J053L96j584K25J056
1879A92j27o96K48N37k07l07k69J286R3j763N66J825r11j432J820O82j242p48
1897d53R18J11Mo00m34J367l90k099J124J660j345j273J057M62m95L2j50J136
1915F32J86j580k95J730k80j100R78N83n39m45J08J08Q85l49j007J015L41j688
1933g17K91J248p35o41P45m07m85O40k26j3M82q46l9Q82k64p90J562J17j429Q3
1953e42J587p58o34M79L19K04m81o71J079P24k038m08J899j88j911P72J278rj496
1972g95m79J543N75k035k6K418n97j730M13J406k03m92l55Q03O70j416q88K245
1990A057N26k344L06J976j198j591J631M76j114J85m19N05J86p70J74J233q71
$$ plain form
1862 -1397 374 1569 126 -47 1060 951 -168 -431 -90 638 -195 -954 99 495 -1089 -864 192
1879 192 65 -631 -383 154 -53 -360 -629 657 750 -1013 -447 1378 467 -965 855 1537 295 -453
1897 -453 465 576 580 -20 -454 913 523 -1576 -452 1208 -137 -1410 -353 109 -386 -354 -504 632
1915 632 818 -762 -1057 673 393 -707 271 854 315 -130 -22 86 971 622 -385 630 971 -717
1933 -717 -426 822 87 -554 191 -216 -701 -61 -287 -300 182 -664 -703 179 -85 -875 687 804 -625 -542
1953 -542 1045 287 -347 132 451 655 174 -497 582 1306 -732 -1140 759 571 -1340 -568 710 701 -795
1972 -795 -1274 269 844 -1191 -1217 1201 604 -1126 -713 693 490 -2 -357 446 1116 -300 -1188 1057
1990 1057 1583 -761 -455 1521 323 -1268 363 839 -275 -90 -509 -4 182 -588 -414 819 -52
2007e2j581K059O04j826m3J835m85j345M65J210j06l45j012J125R07j856p45K679
2025A488K1k733M45J867p70j052K22R96J24j548o30J872N27j984R0J863n75j607
2043a384R96R88j23n61k26P97N29j427K82J270m77j196M15J110j211l32J051j72
2061C29o68k60K27M35j31o69P30K78q79n71J265M33o03n06J014L19r54n66J308
2080E31P79j956K45J413r4j404O65K80L15o97j001M62J396j334j064J687M61k238
2098a554N68J566l73o42K47m2M34M3q09N32J352j355j074J827J03j256N59Q85
2116A011r44m9K21o34N22L9n62R4Q56j173l94J724o45p99Q35K17r74O36L13j79
2136A15J37l11p42J305o4j140O65J212j266o95J310O09j048n42P00N21o82j133
$$ plain form
2007 -52 -1633 426 1030 -796 -839 996 511 -834 -369 841 735 390 -622 503 1410 -446 -1191 1488
2025 1488 1509 -1224 -779 1088 318 -734 -512 484 608 -940 -1570 302 829 -1155 -1065 798 223 -1384
2043 -1384 -388 600 477 -84 -310 487 1016 -411 -129 1141 664 -532 -117 993 -218 -550 501 329
2061 329 -339 -599 -372 63 -68 -737 -7 271 -608 -1179 86 519 -84 -590 424 743 -211 -777 531
2080 531 1310 -646 -401 1012 918 -486 179 459 774 77 -924 -462 934 -400 -1464 223 684 -1554
2098 -1554 -986 580 207 -435 -188 -230 204 247 -562 -30 1322 -33 -1107 720 823 -433 126 1011
2116 1011 67 18 239 -395 127 166 -396 -302 554 -619 -1013 711 66 -733 102 319 -655 -19 294 115
2136 115 252 -59 -801 504 440 -700 -35 1177 -89 -784 526 1135 87 -455 245 766 84 -1049
2154a049P25J217q24j123R02P74j162k31P97L19l06j253J093Q67p70n19L93J037
2172H87p71q09Q20N32n35r2L34O31r81l30O76J36p73L40M03l34p43K54L59J29
2192A33p23l85Q92N18j302L57J834j297j246J415Q24j358o2P70K14k71p14N7J600
2211A256j93j851M64J883j816q44J836L45j474k15O62j1N9j062L82J350n61j565
2229a355J190J183j544l39J953o30r29O19p8Q0o0R4k7R12j116p11J477Q3j521
2248g19L41J148j022p96J364p8q87k33L76N47J80q04o4J309o83j105J084J055
2266A013r62l61P33M00o26o80M21P78k45r10L48J153r88j081J039L97m60p86L63
2285d54R22m02r14N80O93o27m15O58M37k18l94k15Q56j97m73N66O01r27n06N78
$$ plain form
2154 -1049 -324 893 69 -1054 -152 622 -540 -771 26 345 39 -1214 -121 746 -24 -543 -150 887
2172 887 116 -693 127 659 124 32 366 997 16 -314 362 498 -275 65 468 134 -609 -355 4 133
2192 133 -590 -975 -83 435 -867 -510 1324 27 -1219 196 1020 -338 -400 370 584 313 -401 -344 1256
2211 1256 1063 -788 -324 1559 -257 -1101 735 1080 -394 -609 53 42 101 -961 -579 771 210 -1355
2229 -1355 -165 1018 -526 -865 1088 458 -471 148 70 150 90 184 157 1069 -47 -758 719 802 -719
2248 -719 -378 770 -252 -1048 316 238 -649 -882 -506 41 221 -583 -647 662 -21 -1126 -42 1013
2266 1013 51 -310 423 823 197 -483 -62 716 471 -439 -91 1062 74 -1007 32 429 -31 -817 -454
2285 -454 468 66 -848 -268 425 -202 -617 41 478 260 -134 -349 507 310 -163 403 1004 77 -429 149
2305A49K34n48J21M89n00n3K63n68N23k29n83Q14J03p90j88Q37J13r06Q12K08
2325C01l30q9p9P33J99q86m65J607l53j408O70J248j107k92J43L55J94l78p05
2344f42R33M72j742j84K184n56j618M97J509j077j59J92M28P1p91j69J185j43
2362C90j058R28J191j287r18Q83M81o61j63L74K12l98p41P99Q54j160m02O59M37
2381D20j189j23R46K95q24k56R51R5q79m39J596K85j381J11J380n42p89J63Q86
2400G06j92p23m09J113M62j465j40J453m34j327L36J241m17j244N92N24M8o89
2418e65J09J090l40q55M65O60p13k65Q24J81q53L17R5L76j46n77L73M86j050m87
2438h75J342m3j230L04O14l70m65J83L94M32m53m38P04M72j129J04J369l61j130
$$ plain form
2305 149 383 -165 -44 445 -55 -108 155 -413 110 -119 -702 112 215 -575 -763 74 187 -719 93 301
2325 301 -29 -118 -197 536 735 -151 -616 991 638 -770 -100 1148 41 -251 -108 247 441 63 -642
2344 -642 291 763 -979 -1163 1021 465 -1153 -656 853 -224 -383 -191 237 308 -483 -652 533 390
2362 390 -668 260 1451 164 -754 129 610 -51 -214 160 372 -26 -767 32 886 -274 -676 -17 420
2381 420 -769 -892 54 349 -475 -731 220 315 -564 -1003 593 878 -503 -392 988 446 -343 -180 706
2400 706 514 -209 -618 495 957 -508 -648 805 371 -956 -620 621 204 -1040 -448 76 124 -565
2418 -565 -456 634 294 -561 -96 564 -149 -414 410 591 -262 55 150 526 380 -197 176 662 -388 -875
2438 -875 467 424 -806 -502 112 -258 -723 -540 -146 286 -167 -605 99 571 -558 -454 915 554 -576
2457e76N14P56l88j22r5K34N08j096m08J242p6j024N9Q87l17o65P1L42N1j58p6
2478c37K63L88p38L12N87l05n46M74m8K20N0j75K99M0m45j29Q74n66m52P99k95
2499B70p84M37K51m11j9o2K43P8m07k61N47P07r85k58J049j50k86o5M52J5Qn62
2521a93K84M18q5q08M31P00r78l51Q19Q7m46l19P4M99l21m36L30N93p63k77Q60
2542A18L56r10K77O65l91k41k0K98L55n28p0N24J4q71N49O37n60o25L27K99k17
2563a4k31K01K98m16o01N08P73n86n45O16M34o35r17J065N93q98j63P50N19p57
2583fo41Q18R75j076p40R91J42m31m58O69K95o96p18R31P13j234l04R54N4q63
2603f25P0R07r0m60k94O66J70p21j81J019K76j144N99O85p74n40P94K43n60j48
$$ plain form
2457 -576 -62 694 306 184 89 323 831 -265 -673 569 493 -531 -472 415 98 -567 -496 -154 -103 -261 -337
2478 -337 -74 314 -424 -112 475 170 -376 98 50 270 320 145 444 484 39 -90 784 218 -234 565 270
2499 270 -514 -77 174 -237 -256 -318 -75 3 -404 -665 -118 589 -396 -654 395 245 -41 -106 346 361 369 -193
2521 -193 91 509 424 -384 47 747 -231 -582 237 324 -122 -441 -367 132 -189 -625 -295 298 -465 -742 118
2542 118 474 -436 -159 506 115 -126 -146 152 507 -21 -91 433 447 -424 125 762 202 -423 -96 203 -14
2563 -14 -245 -44 254 -162 -763 -255 518 -68 -613 3 437 -198 -1115 -50 543 -355 -518 232 751 -6
2583 -6 -647 171 1146 70 -670 321 463 32 -426 243 538 -158 -876 55 768 -466 -770 184 238 -625
2603 -625 -555 352 262 -198 -492 174 344 -377 -558 461 737 -407 192 877 103 -437 357 600 40 -108
2623a08r4L95J97r23J87R12n90r56J016M72j044j63O42L01m60j07K70N43j17q14
2643d41N44Q43q19q64J426o0o66l82Q09n6k20l80M39K05l74o82M30N98p72j41
2663e63O37K19p55J50L65m5l53J01K02J54l43K83L86m7l94jK11L24l18j19J99
2684B93m2p58N44M91o39p64Q79L80o52j37L93p3q4l74j3P82j69o42M51Q40p78
2705g2l57P13L2q1r5l5J05K07o18n0J011l08q64K03P55p12jJ75J24J6m03j70N57
2728A32K1q80N70O33l59p21O69J72k61m8J61j52K24Mj50P78n96n86P37K6p15J82
2750a59P27n67n40M00J55k27j11j63M75M37r32M8Q14m7j077N36Q52m93o00L64
2770a08P43k54n76n1Q36j24o40O6P97k37q81K57O10j31r42M03M47k96o45L29O81
$$ plain form
2623 -108 -202 193 390 -533 -346 566 -24 -980 36 508 -536 -699 -57 244 -216 -323 -53 490 373 -441
2643 -441 103 946 127 -737 689 629 -37 -419 390 334 114 -266 173 378 4 -678 -248 350 -422 -563
2663 -563 74 293 -462 -312 53 8 -345 -244 -42 112 -231 52 438 391 -3 -4 207 531 213 94 293
2684 293 251 -507 37 528 -111 -875 4 384 -268 -405 -12 -85 -169 -543 -556 226 57 -585 -134 706 -72
2705 -72 -429 284 316 235 140 105 210 417 -201 -251 760 452 -412 -209 546 -166 -167 8 132 148 -255 -425 132
2728 132 153 -727 -157 476 117 -604 65 237 -24 -72 89 -63 161 165 15 793 197 -389 348 374 -341 -159
2750 -159 568 1 -539 -139 16 -211 -322 -485 -10 427 -505 -457 357 310 -767 -231 621 128 -472 -108
2770 -108 635 381 -195 -246 590 466 -174 -108 689 452 -429 -172 438 307 -635 -232 215 -81 -726 -397 284
2791B84l72k97M17L09l77l30N18J30Qk97lK56m8k39L38K93p59j03R09m88p39N08
2813h2P15m89l79O7K82n3r22M47R94k33r99L10M64p2m10J53N42J22o82k05J151
2834G21O5j119K28P64n20o07Q53j16k81J1j98J58K24k85o3L92n14k73O36L06r47
2855e65K14N32m54J26K35k5j31L57l71K78J97l24k24R07l03q08J57N61m73n4J63
2876eR2R0p15P6O96J05q52K18N62m08k32L59j00L78m61P3L69K80r21J76O81R9
2898E60o65k9N90l71M1o3O7M7m57j2L85j22j84j36M71l54k21L39M03l47L90o89
2920c57L41j47k91N60L95o57K4K05L19k71j25L85p7l03m60O32L45n62q7O61j12
2941D18p68j66Q87l24k82K86rJ11k15n30L91Q78j117m05J113J30o30R4M33o7k03
$$ plain form
2791 284 -88 -385 32 341 -36 -366 152 282 290 -7 -10 246 198 -41 297 590 -169 -272 637 149 -590 -82
2813 -82 633 144 -235 -168 114 61 -861 -414 580 347 -652 -342 122 50 -360 -207 335 457 -225 -430 721
2834 721 786 -333 -105 659 139 -468 385 269 -12 -1 -199 -41 183 -102 -165 227 -287 -560 76 382 -565
2855 -565 -351 181 -273 -147 88 63 -68 289 -82 196 393 69 -155 752 449 -359 -202 359 -114 -168 -5
2876 -5 87 177 -538 -462 234 339 -513 -295 267 -141 -373 -14 -114 264 -197 -124 245 525 -396 -220 461 560
2898 560 -105 -134 456 85 126 63 130 177 -280 -292 93 -29 -213 -349 122 -232 -453 -114 289 -58 332 -357
2920 -357 -16 -163 -454 106 501 -156 -132 73 392 121 -4 381 304 1 -459 173 518 -44 -131 530 418
2941 418 -350 -516 371 47 -235 51 42 153 -62 -592 -201 677 -440 -845 268 398 -232 -138 295 228 25
2962B5j26K98J19m03N6J15L58n06k76O19K2o29K21K69j17k71j93M32J20m43l4
2983c44O22m5p41M96N10o56k3N76R9l53k43K50K41p7p63P50K84n60m68N55N62
3004F72j094J11L66K6j51o11P20J82l67l32M55M49m73m30O99J39n51K28jK52k30
3025E9k09K65K31k14l56N57m7n59J53K92l87J20j88L06L39p79j99O91M6k15J9
3046g5N24o30J56P7J56j50K4j8L27L1p03K90O60p64k29O08N9o03j34J67M02m08
3068b33j38L79K75l78n55N96M58n28j28K14N02m47o55N99K88j8n35O00M54o11
3088A39j84L23n8p3j82j64J86K11o07L78n2%n40N76J36l17m0M66m95R5K26j8j3
3111gK0k2Q9J87m22L78K72k91n77L48O12m32k12p6M03j39n97J01M91%p84N29L98
$$ plain form
2962 25 -101 197 316 -87 -31 84 442 -64 -340 279 301 -328 -107 162 45 -226 -419 13 133 -310 -344
2983 -344 278 233 -508 -12 498 -158 -181 395 494 141 -102 148 389 312 -451 299 583 23 -445 110 672
3004 672 -422 -311 55 81 -70 -681 39 221 -146 -478 -23 426 -47 -477 222 361 -190 38 37 289 59
3025 59 -150 115 346 132 -224 333 286 -273 -120 172 -215 -95 -283 23 362 -417 -616 75 121 -94 -75
3046 -75 449 -181 -25 52 208 58 82 64 391 422 -281 9 669 -95 -324 284 343 -260 -394 -227 175 -233
3068 -233 -371 8 283 -95 -650 -54 404 -124 -252 -38 464 17 -638 -39 249 231 -304 296 750 139
3088 139 -45 278 220 147 -35 -199 -13 198 -409 -31 -83 -83 -623 -47 89 -228 -268 198 -297 -202 24 6 -7
3111 -7 13 -9 80 267 -155 223 495 204 -373 -25 587 155 -57 -133 270 131 -466 -365 126 126 -658 -129 269
3134B69n02m89N72N39l10j57k18O33k19p17L88P42l83l64M60K93p93m1N31j15
3154A19j32j98q1K95K66o97K69L68l83k35O56j56n68M28L15l84O3j61L28J08m45
3175b25L8M85j13l58K41L78l61n15M05K14q7o62N91L73m61n76M52N64l82l69J78
3196a90M22j06m85l7P66m16k12N8P82p88l80P92j08m63L31K30N4k24K26j11K67
3217D08k51n37N05K18m03m19P73l09m13J46K20J02l74R4j2L86m36J13M33l3n19
3238c08M7Q16m99l0K48K35k35k09j87O18o3o98j8P16o5r05L86K42k82p6K33k8
3260f2o6k80j5P53j11o49J51Q11m60l23K86J81J71n61L23M9K94l05n65Q44j44
3281C22o70J72K81Q3m83O1p9J32p7J99J82k63j46K14J40k56m0L83P6k38j36L92
$$ plain form
3134 269 -233 -722 -150 389 79 -78 -296 337 118 -599 -211 531 148 -216 244 537 -256 -297 234 119
3154 119 -13 -211 -292 3 269 -428 -159 209 -174 -409 247 91 -477 -49 266 -118 -55 -216 112 220 -225
3175 -225 -187 298 185 -173 68 446 85 -430 -25 189 102 -560 31 404 -57 -633 -181 383 1 -368 -190
3196 -190 232 126 -359 -396 370 -46 -258 -200 582 -206 -586 206 98 -365 -34 196 250 26 252 141 408
3217 408 157 -380 125 343 -60 -479 294 -15 -428 -282 -62 40 -334 -240 -252 134 -302 -189 244 211 -308
3238 -308 -261 555 56 26 274 509 274 65 -122 496 433 -265 -283 433 368 -537 -151 91 -191 -267 -34 -62
3260 -62 -128 -408 -423 330 219 -430 -279 532 72 -251 35 216 387 -174 149 198 492 187 -378 466 322
3281 322 -348 -176 105 188 -295 -234 -313 -181 -258 -59 123 -140 -286 -72 68 -188 -228 155 231 -7 -143 249
3303B49K9m68N2M43j01j80n5K45j15j61J4K05J03n00PM78j4n65j68P54N4p68J77
3326b85M81k06k2k53O25j38j32l32N51J63p71K04N08r7l92n3N06j77l56K10j18
3347h4L54l82k46M51m1n94M19L11m12mN28P5o52Q6K82J50j97k66L24J73l07l35
3369c67N51M43p14j22N91J16q14K13R0L14k88m26O46J18l48m56N70L30q88J02
3389c39N28k77k74J79M06P1n09j24P35j37m20n4N19J5m21J4K29j0k61r7N00j53
3411A20l40K2L08l34k39M05L6j64r9K21J26q9l97O44O4m37j8O25J38o72RJ82j16
3434en3mL69j32l91r7L65L84q06j3M55q7l18K78R3Pk31J87NK32m50O3K14M04p92
3459c23K37K62k1o1k2K16k55J51k7k53K33M4k85K92k44k49R3L35m64J29J87Q4
$$ plain form
3303 249 278 -190 -138 305 204 24 -31 214 99 -62 -48 157 260 -240 -233 245 231 -334 -502 252 306 -462 -285
3326 -285 196 -10 -32 -285 340 202 70 -262 289 452 -319 -115 393 296 -96 -149 357 180 -176 34 -84
3347 -84 270 -112 -358 93 52 -542 -123 188 -224 -228 300 375 -277 -191 91 241 44 -222 102 275 -32 -367
3369 -367 184 627 -87 -209 382 498 -316 -103 -13 301 13 -413 233 351 3 -453 117 447 -441 -339
3389 -339 189 -88 -362 -183 223 294 -215 -339 396 259 -161 -215 304 319 -102 -88 141 131 -130 -227 273 120
3411 120 -220 -198 110 -224 -463 -58 -22 -186 -285 -64 62 -27 -424 220 284 -153 -171 454 592 -80 -71 111 -5
3434 -5 -58 -62 307 175 -216 -313 52 436 -370 -383 72 -15 -333 -55 38 45 -186 1 6 238 -212 -149 65 469 -323
3459 -323 -86 176 155 94 72 288 33 184 157 -96 137 181 -104 188 -56 -305 -212 123 -341 -212 -25 59
3481E9j70m9p5l8M37m54M01L43l52n08M44L50k01k82L39nj57l62M23J25l35j21
3503a88n3M95o54J98K18K78n41pP0K75J27n21L3P36n00k31O64l90j6j30L62p7
3525A48p3j98K08Rj84l5K28m6j94j52M35j96k53P1N07o2n17O2L68k01Rr6M37j96
3549G9o98P69L61m63j01j14N28j2n47p4R68k41r26M86L29m62k25L01L39m40j51
3570b94J7K48J42k23J04M26q48k61O03L26l00k52M76J80o39K92L12m96L24l55
3590b18M58J78n32pK62o2k48O7K90j41l89L68O8J17n95kN54m12j07O7M75l22k62
3613c93N52j61j73j94L25M29k56l74M76M45n16l30L72L12o65q7J38M70k58p29
3633f17M08L97l47j78L70J50n14q1L94J28k58m7J37K52l29L6M82j81J38n33J78
$$ plain form
3481 59 -111 -160 -235 -273 164 -290 111 454 102 -406 38 388 187 -95 244 239 82 -280 143 268 -67 -188
3503 -188 -241 254 -400 -202 16 294 -247 -254 -184 91 218 -303 -270 466 -34 -265 399 9 -7 -137 225 148
3525 148 75 -123 85 94 -90 -125 103 57 -137 -289 146 -50 -303 -232 275 213 -304 -242 126 -75 -66 -162 275 79
3549 79 -619 150 511 48 -53 -167 361 349 -198 -272 696 455 -471 15 344 -118 -343 -42 297 -143 -294
3570 -294 -277 -29 113 -110 -6 420 -428 -689 -86 240 -60 -312 164 344 -295 -3 309 -187 137 -218
3590 -218 240 418 -114 -121 141 79 -169 -102 188 47 -342 26 94 211 -384 -386 168 -244 -351 -284 191 -131 -393
3613 -393 159 -2 -175 -369 -44 385 129 -245 231 676 160 -170 202 514 -151 -238 -100 370 112 -617
3633 -617 -209 188 -159 -337 33 183 -331 -412 -18 110 -148 -195 -58 194 -135 -99 383 202 340 -193 -15
3654a5L77l08r7J84p7j69k7n7M69l82k49M82rn96M79K6p8j59P3M43l14K08l06
3677a02K91q4j14m8M27p8l16L8L07k03k41J58J12j29j92l8M2K78n23J39J55J67
3699D6l93M1M28j10q9q2N13j01k77o7L87j16l47M13L66l87N6p2q6N3j88pM90m55
3723A6j55L02k82oj11O9K05j28l4k1K35j81o6L08j08k46J10M16k36l61K36J3K5
3746@k42J40n3O49o37j23N59j64l98K2M17j0n48K04J83o1j22j19L60J94l02k86
3768c37O30l72j93L85J36l76O1J44J36n02K89m0L07J38n16R5K02m76J81R2R4l21
3790b43n9M74l72Kj70M69q0k64l6L25j50l05L55L12j67K9l95N84M0l51Q7K57M1
3813C83n22o3L22lo37J89J95J19k24K20o6J17l23K62j3j26l0J90Q0J17j31o1J62
$$ plain form
3654 -15 362 54 -43 141 64 -105 -132 -189 280 -102 -351 131 122 -474 5 31 -47 -206 -133 310 -4 204 -102
3677 -102 189 105 -9 -57 370 292 -24 14 321 118 -123 35 147 18 -174 -212 -170 108 -415 -276 -121 46
3699 46 -347 -306 122 12 -77 -159 354 253 -24 -91 296 180 -167 246 612 225 281 209 123 176 -12 -19 471 16
3723 16 -139 163 -119 -125 -236 -167 38 -90 -124 -145 90 -91 -157 151 43 -203 -93 323 87 -274 -38 -25 0
3746 0 -242 -102 -155 494 -143 -266 293 129 -269 -247 170 160 -388 -184 -1 -62 -184 -303 57 251 -51 -337
3768 -337 293 -79 -272 113 249 -127 -66 78 214 -288 1 -39 268 406 -110 -15 187 -289 -108 -16 78 -243
3790 -243 -302 172 -200 -198 -368 101 21 -243 -279 46 -104 -409 -54 258 91 120 -275 309 349 -2 85 342 383
3813 383 -139 -202 120 117 -520 -331 -136 -17 -241 -21 -87 30 -293 -31 -44 -170 -200 -10 70 187 56 -5 157
3836A57N6k46K11K09l94j32R6K65m6n77N31k8l27K80J59j83k16m2M5M52o89J37
3858b82L94r7m22K46L38l2j35N4K20J31m78q9J80N82p77J7L48J71m48q1L55k92
3880i7L70o09K67M1j37j57L43K73o43Q1M69o9l16K44R8N4j34k18K39J37l72K62
3902A26J38l57K2K07%k9K5k37J05N6k11j56L22k05m3K71K63l48j72J34K18k12
3924h3N4J69J44k40l17K88L10l40j67J02L52l68o1L25L54n07l41N05J08k42l79
3945c34L98Pm79k9M10j12J11k50J07N02k38k69M98n9o34J12L30J87n34N48k3k05
3967D4J78l57J95J32l43j4L58j10n05K74N40m64j34K44K00k15k50q8M87j40j36
3988a04J99J85j26l17J49L20l59l2J40L01m73k28L74L15m52k00K77J3k75J34Q7
$$ plain form
3836 157 213 -33 178 387 -7 -139 -43 222 176 -401 130 102 -225 55 214 31 -185 -227 -182 270 -419 -282
3858 -282 112 15 -407 -161 177 145 10 64 284 415 -63 -152 28 610 -167 -150 198 369 -79 -160 195 -97
3880 -97 273 -336 -69 -28 -165 -322 21 294 -349 -268 201 132 -184 60 158 212 78 -140 99 236 -136 126
3902 126 264 -93 -71 136 136 107 132 -105 0 56 -155 -311 11 -194 -237 34 297 -51 -223 -89 129 -83
3924 -83 -29 140 284 44 -273 15 325 -15 -182 -80 272 -96 -157 168 522 15 -326 179 287 45 -334
3945 -334 64 71 -408 -437 -27 -139 -28 -278 -171 331 93 -176 322 263 -371 -259 71 258 -276 272 249 44
3967 44 222 -135 60 192 -151 -165 193 83 -422 -148 392 -72 -206 38 238 23 -227 -315 172 32 -104
3988 -104 95 280 154 -163 -14 306 -53 -85 55 356 -117 -345 29 344 -108 -308 -31 -18 -293 -159 -72
4009g2N3l17j09N62N3k93K44Q2l4j99k35L83P3l91K61jO9j83j00K98mo0k0O0o0
4034F0k15K21K32j04k47j18J35j18j76L49l6R1n60M98J04k93J04k2K88j18j83
4055a08K83L9q8j74J99q2M7n01J57N50j49k98L44k80j68L7K94m2k98J1N0K94j38
4078b1l49J41L99m74J23L68m6j13K8J22j29p6O4JK71l81J1L55J57q31K77K58M2
4101A97l90M3L15j63j47j19M10kk26J43K87k52j63J18L8M7k64N1L75q0m97J35
4123a44L84j51o36M82K65k93l4R7P0k25K88k98K71P4l65K47M0o0j33N2J31rJ47
4146B00j55N25n44l2Q0J49m93J58L86j65p5j7J02J32k17j86R5J22k08j20M47J3
4168A97n11J38K97%m03mL50l00j13K82K06j49j95P3K75j16q9RL71j61j87K53K65
$$ plain form
4009 -72 -19 -336 -445 117 170 -123 121 203 169 -30 -265 118 191 -200 61 60 129 -54 -154 144 140 80 60 120 60
4034 60 -155 66 298 194 -53 -171 -36 -154 -330 19 -17 74 -486 12 116 -177 -73 -95 193 75 -108
4055 -108 175 214 126 -48 151 69 116 -385 -228 322 173 -125 219 -61 -229 -192 102 60 -238 -227 -177 117 -21
4078 -21 -370 -229 170 -304 -181 187 141 28 56 178 49 -27 37 38 309 -72 -61 294 451 -380 -103 155 197
4101 197 -193 -150 165 2 -145 -264 146 144 -82 61 348 96 -67 51 89 136 -128 -77 298 218 -279 -144
4123 -144 240 89 -547 -65 200 -93 -127 -30 40 -185 103 -195 76 150 -215 32 72 12 -121 -69 62 53 200
4146 200 45 570 26 -6 74 223 -270 -112 274 109 34 17 119 251 34 -152 -57 65 -143 -263 184 197
4168 197 -314 -176 121 121 -282 -286 64 -236 -349 -67 139 -10 -205 -132 143 27 -62 -53 318 157 -30 223 488
4191D88l33j19l00M64k44n9J9M2j79j76K63J27M2O9L5j57k24L60j87P1k13Q1N4
4214g6L37l67J11K44q1q1j25K45k62k37J92K21J07m41k06M54M8l39P5J49k07r8
4236c37K58N2J67k00O0J96k60J4O2R1k3q6j82L64J3q8k51K46J89l96j61K01Q4
4259A3j49P9J56j19j73J20k3Q8r8j47M58k85rK82O6k18M1N8l6R0j94J25J31k35
4283B1k12J14K60k07l14K43nO1Q0M6Rj73j17n1M72k32k50N2M87j47m00M48J90
4306C75k87k07L46J16l91m0J19J65n12N5M58j65Jj7k47M90n2k74R7j79r3o3L71
4329F6Q9l00j7J05Q8q9O9PK21l41J66K80l98P1N7N7j14j48K51J37k99r5K2K28
4353A13k43P2J04K37J28q21L62P7N5l17M07J82n44m7L53L1P6m54L80J60m98n4
$$ plain form
4191 488 155 36 -264 200 -44 -103 -84 -42 -221 -397 -134 -7 35 104 139 -18 -242 118 -69 2 -211 -130 -76
4214 -76 261 -106 5 249 168 87 -38 207 -55 -292 -100 121 228 -213 -419 35 83 -256 -181 -32 -239 -337
4236 -337 -79 -27 140 -60 0 196 -64 -50 12 103 80 -6 -188 176 189 101 -150 96 285 -111 -272 -71 13
4259 13 -136 -57 99 -20 -193 -73 -96 -8 -106 -253 205 -80 -89 193 259 41 82 140 104 194 0 125 256 21
4283 21 -191 -77 183 -24 -338 -95 -100 -39 41 87 96 -77 -194 -245 227 -5 -255 -203 284 137 -263 185 375
4306 375 88 -119 227 343 -48 -88 31 196 -316 -261 197 32 33 16 -231 259 207 -67 30 -149 -242 -305 66
4329 66 155 -145 -162 -57 31 -58 11 18 239 -102 64 344 -54 17 74 131 17 -131 120 257 -42 -137 -115 113
4353 113 -130 -58 46 283 411 -410 -48 29 84 -233 174 356 -188 -235 118 149 225 -229 151 311 -187 -241
4375b41K76K45l55j3L73j10j02k02P6J45k49P3L5R1j69k52N15k43l0J12N8J97
4397B30l10J04j12K66J1mQ9r7j85k72N34l14k01L77k22q4j22K94M0n3l10J26L01
4420H6j67l01M51K20m12r8N3L43k46j05L11o0L4j27O8J43k79m8L56j08j09k02
4442a97K42j48j00J35J12j60m8R0J8J14k05N8N5k2P9k04K63L0k60J64j32M61k60
4465H5P6j39J33j0j30K04j26l4j45L01p0n30K76K1J99l71L22r2j34K51q1J49k34
4488g9K0L7L22r7l32J12J40j36j33L11j64K38m66K32K5K17j22k21L76k35m45N05
4510A05Mr5q3j4K97l20K05j47L48k67m3O7J05%j08L89j74p12L84L66k10k22L14
4533A89l7q1k25K73n9L0p6j95K15K6l09Q9K82j83j31j79N79j77k19J77J18P6k75
$$ plain form
4375 -241 35 280 -75 -88 285 175 73 -129 -53 92 -157 -84 -49 42 -127 -379 136 -107 -137 -25 33 230
4397 230 -80 24 -88 178 189 185 274 177 -8 -280 254 -60 -261 116 -106 -190 -312 -18 22 -31 -341 -215 86
4420 86 -81 -382 69 289 -123 -221 -168 175 -71 -176 135 75 109 -18 50 193 -86 -134 222 114 5 -197
4442 -197 45 -103 -203 -68 44 -116 -164 -74 -56 58 -147 -89 -34 -56 23 -181 82 112 -148 16 -116 345 85
4465 85 161 22 155 145 15 219 93 59 -86 215 145 -385 -109 -88 111 -260 62 -30 -164 87 6 155 -79
4488 -79 -59 -22 300 203 -129 -17 123 -13 -146 165 1 239 -227 5 30 247 125 -96 280 45 -400 105
4510 105 109 14 -69 -83 214 -106 99 -48 300 33 -10 57 162 162 54 443 269 -443 -59 307 97 -125 189
4533 189 152 71 -154 119 60 90 14 -181 34 60 -249 -160 122 -61 -192 -371 208 31 -188 -11 107 183 -92
4556i2k5K88m4j69M6oJ80k08J31K16r1k99K25m6k31j01J81J73j23p8L46n2l02
4579h1J32L8L0j74j33L72O3m87N4L68j56n1j37L41J7j84P3K53m46Q7K66k82J69
4602A32j48j13K11k5m63K69J22K0k54j70P20l02k21O4M76o4l28P3J22J39j14j54
4624hL2J72k08q1J93q5j56K70j33k54K79P5k13K06m21K52J61j38m9J91J16m37
4646b36l3K84J51r5j95J49J96k92J06p0J48j42o8L08p3k26q3J90J66k82P4k59
4668b82M90k33l65M49j56l2j18K54J08j79k17L05J50p9q2K67N2m13J81L6k07j11
4690a82K38J43p6l33K43m3N6k93J41M19l45J28j60K52l04J71j82J40m2k9L06j11
4712A37k90Q9J28J97k98LL09j46k10J90k66N76m05p3l1K95l50j3R4J19J34l90
$$ plain form
4556 -92 -117 171 127 -42 4 -2 178 -30 101 317 226 -73 152 106 -125 -226 -45 128 5 -73 273 221 -81
4579 -81 51 89 119 -55 -188 184 247 -240 -186 182 26 -25 -162 179 196 12 85 338 -108 -21 245 -37 132
4602 132 -16 -129 82 57 -406 -137 -15 5 -249 -419 301 -1 -222 -158 318 254 -74 -1 121 260 146 -8
4624 -8 24 196 -12 -93 100 15 -141 129 -4 -258 21 96 -117 89 -332 -80 81 -57 -106 85 201 -236
4646 -236 -269 15 166 71 -124 25 221 -71 35 -35 113 -29 -97 211 138 -88 -171 19 185 -97 -23 -282
4668 -282 208 -25 -390 59 -97 -129 -247 7 115 -64 -281 24 174 95 13 280 332 -81 100 136 -71 -182
4690 -182 56 199 123 -210 33 -10 46 -247 -106 313 -32 96 -64 188 -116 55 -127 13 -29 -58 248 137
4712 137 -153 -64 64 261 -37 -34 275 129 -81 109 -157 419 14 -59 -90 205 -145 -158 -64 55 189 -201
4734b01K32K72k44m74N27J10l73j07L66J22m72Q9J39L12j94n5J36J33k75j00J57
4755A00k2p2m1J32j52k73j5M49N8l75J84j1J36j87M5K10k02M4j84J68J44m52L65
4778D9L26l56j81L42r0K32k65o3R5k99Q4K65J08n35N1K38j20M1k6K33l50J3J11
4801i7J8P1r0N5K41m8l77L53J13L0l21K75k1Jj49k57J64L52m76J49K85l25l25
4824c79K60L88k33l24J48J92M4k41K31J1j57j47L99l3n1k09L65j74l3j10o2K29
4846A14r8j23j34K95k40Q6K07Qk91m7L36Qq0k67L45J9m6k80l9J12K6q4J58J63
4870A48k65J4k27M39R3m84M29J2k71k40M24o2k70J28L07j54l22K54J71O9m42K59
4892A0J61l4j54k2J54kj05m4J56j09L9k24J92O6l2j09M26l50j70J57N92n59j61
$$ plain form
4734 -201 31 303 59 -415 112 222 -151 -258 108 230 -242 -153 -14 298 104 49 185 318 43 -57 100
4755 100 78 6 -35 97 -55 -328 -343 106 164 -211 -27 -38 98 -89 -44 166 -36 8 -176 -8 136 -316 49
4778 49 375 19 -162 180 90 322 57 -6 89 -210 -126 139 247 -288 -237 1 -119 -78 -104 129 -221 -208 -97
4801 -97 -79 -8 -98 -43 198 150 -227 126 239 269 -52 223 202 203 54 -203 -39 313 -163 -14 271 -54 -379
4824 -379 -119 269 36 -288 -140 52 96 -145 86 97 -60 -207 192 159 108 -101 264 90 57 -53 -115 114
4846 114 16 -107 -241 54 -186 -100 107 115 -176 -223 113 121 41 -226 119 138 92 -188 -227 -115 -89 -173 -15 148
4870 148 -117 -103 -330 109 202 -282 147 159 -112 -352 72 10 -260 -132 175 21 -301 -47 124 193 -249 10
4892 10 171 137 -17 -39 115 113 8 -36 120 11 50 -174 18 84 52 -57 369 19 -151 6 598 39 -122
4915a22J9K82j81k13R7L05m58J41j98L40n0j88O6L41l63O6R3k17K87J4k35L10
4937A36k06J4K17J30n8l95K77k82O6J89j64J59pp7J46r4k56J85J32q1j28L2j01
4960a66L58k24J69J21J57l90j17J73L13n27J21J03K74l47o7Q3k05R1RR7J86k36
4982b4j12L12j27k69L31N1k70l0ML75o9L20m74N1J68k95J11k7j26o6J71J08j48
5005c5Mq2N4N4k96O62k54l99J51l7J67l90K33m0J49lj24L47k25j53O8J69P0J9
5029A09jJ90k18M9j73K04j7j18R2j41J80j68J97n4k0l61J43J95k06o1R6m8K17
5052H6j97q5K93Q2j28j3J71j5r9j56L36k16j30K66j05K13n68jN94l78J51L9n0
5075I0m6j7r9q2J19N2j35J35j77L33J2J43l98m2K66l96J39K9K37j0k2qL9k03j47
$$ plain form
4915 -122 -103 179 -2 -215 -118 187 -271 -130 -328 12 -38 -226 -160 181 -182 -116 -23 -240 47 61 -174 136
4937 136 -70 -56 161 291 233 -162 115 -167 -101 88 -76 83 76 -1 145 51 -205 -20 112 31 -97 -65 -166
4960 -166 192 -32 137 258 415 25 -92 81 394 -133 -12 91 365 18 -49 34 -171 -80 -71 26 212 -24
4982 -24 -136 176 49 -220 111 162 -108 -138 -134 241 172 492 18 69 237 -58 53 26 -100 -166 5 113 -35
5005 -35 -31 -113 -59 -5 -301 361 107 -292 -141 -178 -11 -401 -168 -208 -59 -62 -186 161 -64 -217 -149 20 90 109
5029 109 108 298 80 129 -44 160 143 25 117 -24 156 -12 185 131 111 -250 -107 88 -118 -179 -83 -131 86
5052 86 -111 -196 97 179 51 38 209 194 95 -61 275 59 -71 195 90 303 -265 -266 328 -50 101 140 90
5075 90 44 27 -72 -154 -35 17 -118 17 -160 173 185 328 -70 -112 154 -242 -103 -74 163 153 131 123 162 -41 -188
5100a88o5J77o2N4j89L60j40q7o6R3J94k42O3K07M8k10k11L27l5o8p6K08K5k59
5124a42l6J58J42k73K73q0J19k31r6J76rO5q0j30r8M36l08J94j75n2n2K60O5k01
5148g5J54k78K27J81N9l57%J14m5J7k52L94J07M3n75L51q7K86m12k0K50r6j02
5171a16k5K15K00k69j08J2N9L3Ll3J1J91j77K59j37L5n5K3L8m17L28R6k06j1J28
5196G7q5N0q5J24q0J6j17r3K83j92K03j51k6M2r4M8J02j9K1J7J49k4m09L88K74
5221D19m82K87J7j56j41J25j45L23j91k73J52J74k55P7M9j84k8k3M79k57J57k45
5243a21L03p0l15J51K34k12K11Qo4o7k51L1J95Rm7K14j77L4k14m3K97M6m09L9
5267b18K43k39p5M75k97j7K46l08J20j3J3O4L66l58j65K99R2n2l18N6K97n3l02
$$ plain form
5100 -188 -253 -76 -138 -84 -273 87 -53 -140 -206 -113 81 -161 -98 109 157 -53 -264 63 28 -40 -116 92 117 -142
5124 -142 -178 -20 122 -151 122 42 161 -70 -166 10 1 66 -14 -144 -242 194 -114 80 -95 -147 -199 61 126 -75
5148 -75 79 -199 28 209 268 -89 -89 25 -20 -3 -255 139 246 289 -286 65 -22 264 -148 -168 82 -14 -116
5171 -116 -141 74 274 5 -103 -91 -32 1 4 -29 -18 173 -4 255 118 153 98 121 159 -258 70 166 -40 -51 77
5196 77 -8 42 -43 81 1 17 -100 -193 90 -102 101 -50 -76 -34 -128 -80 22 3 24 41 190 166 -243 145 419
5221 419 -63 224 241 85 -56 69 -76 247 56 -217 -65 109 -146 -69 -20 -204 -232 -255 224 -33 124 -121
5243 -121 182 112 -203 -52 182 -30 181 189 125 58 -193 -162 33 42 -5 209 32 66 -148 -191 106 152 -257 -218
5267 -218 25 -214 -289 186 -111 -128 118 -190 -70 -83 -70 -6 360 2 -163 136 228 176 -142 -86 211 158 -144
5290a44J33J83j01r3j20L55q1k55N0r4J86j81K1L58j69N7r0R8j12j10K2J30n7
5313a4j26K83J90k91k27K33R7j37j74J87j0j42R1J89r8k47K19L7J67l27j99L46
5335D7L30m74J41Q5m09J06m4M66k36l3Q5N9p9k7r5RJ57k52lK68J31k67O4q7l6
5360i4P4j30J80l26K50m4K1l1MK67m2k91J80J85qqn15L38K54l53K2K59j76q1k04
5385b69M78oj86k03J85n6j21J57j4r5L08j69j73L59n19N05k50J16j61L1K07J37
5407B61m25J44K58j50j46l7J60R6k21M3n3J09j65K50K66n05mJ06j56R2K9J14R3
5430A59j1j22j22K58j32J2J42j48m9K9j12K76k77j29M24k65J02k34J94J94j06
5451H3m0O8j09K22m02K37n8l63M03L0N3k07J2J11L0j44K40k87K45n92N30L3J29
$$ plain form
5290 -144 -11 172 71 -22 -142 213 132 -123 -73 -167 19 -162 -141 217 48 105 15 113 1 -109 -87 43 -14
5313 -14 -140 143 333 42 -185 48 145 8 -166 21 11 -131 -40 149 51 -196 23 60 227 -100 -299 47
5335 47 377 -97 44 129 -280 -174 -218 248 12 -21 64 123 44 17 -78 -69 88 -164 -167 101 232 -35 29 -58 -94
5360 -94 -20 -150 30 -296 -46 -90 -69 -100 -96 171 129 -162 18 203 195 187 -328 10 264 -89 -67 192 16 -65 -269
5385 -269 209 203 17 -186 -1 -57 -178 -21 -35 -130 178 9 -164 195 -324 181 -69 47 -114 -83 124 261
5407 261 -164 -20 238 88 -58 -95 65 161 -60 -17 -70 39 -126 124 390 -115 -119 -13 -169 -77 -48 66 159
5430 159 148 26 -96 162 30 42 184 36 -13 16 -96 180 -97 -226 198 -67 35 -199 -5 189 83
5451 83 43 111 2 224 -178 59 1 -362 41 71 124 -83 -71 40 70 -74 166 -121 124 -468 62 95 224
5474B24m1O8K4P7m81K85k13K06l99L09k55m8L7J82n7L1j05L54Q1m95j14J43J30
$$ plain form
5474 224 183 251 275 352 -129 156 -57 149 -250 59 -196 -244 -207 -25 -82 -51 -156 198 279 -216 -330 -187 -57
$$ [...]
8191B2
##END NTUPLES=NMR FID
##END=
