##TITLE=1H_SL4-DAU(forC13)
 CDCl3
 8 sc, 
 26.10.2022
##JCAMPDX= 6.0         $$ Bruker NMR JCAMP-DX V2.0
##DATA TYPE= NMR FID
##DATA CLASS= NTUPLES
##ORIGIN= UXNMR, Bruker Analytische Messtechnik GmbH
##OWNER= root
$$ XWIN-NMR		Version 3.5
$$ Wed Oct 26 13:53:17 2022 Russian Standard Time (UT+4h)  she@DPX200
##.OBSERVE FREQUENCY= 200.1313499994
##.OBSERVE NUCLEUS= ^1H
##.DELAY= (6, 6)
##.ACQUISITION MODE= SIMULTANEOUS
##.ACQUISITION SCHEME= undefined
##.AVERAGES= 8
##.DIGITISER RES= 18
##SPECTROMETER/DATA SYSTEM= spect
##.PULSE SEQUENCE= zg30
##.SOLVENT NAME= CDCl3
##.SHIFT REFERENCE= (INTERNAL, CDCl3, 0, 15.7039)
##AUDIT TRAIL= $$ (NUMBER, WHEN, WHO, WHERE, WHAT)
$$ ##TITLE= Audit trail, XWIN-NMR		Version 3.5
$$ ##JCAMPDX= 5.01
$$ ##ORIGIN= Bruker BioSpin GmbH
$$ ##OWNER= she
$$ F:/spectra/data/she/nmr/H-F/1/audita.txt
$$ ##AUDIT TRAIL=  $$ (NUMBER, WHEN, WHO, WHERE, WHAT)
(   1,<2022-10-26 13:52:15.98 +0400>,<she>,<DPX200>,
      <created by zg, POWCHK disabled, PULCHK disabled
       configuration hash MD5:
       00 E9 B6 7A A2 85 ED C7 34 08 36 98 17 FE 4E 26
       data hash MD5: 16K
       A6 58 4B 7F 91 CD 3E A0 CA 6E BF 47 FE 2E 9C 0D>)
$$ ##END=
$$ 
$$ hash MD5
$$ D1 D1 25 6A FB CA E6 EA A7 39 DC 53 D4 10 3A AD
##$RELAX= 
##$RELAX= 
##$RELAX= 
##$RELAX= 
##$RELAX= 
##$RELAX= 
$$ Bruker specific parameters
$$ --------------------------
##$DU= <F:/spectra>
##$EXPNO= 1
##$NAME= <H-F>
##$PROCNO= 1
##$TYPE= <nmr>
##$USER= <she>
##$AMP= (0..31)
100 100 100 100 100 100 100 100 100 100 100 100 100 100 100 100 100 100 
100 100 100 100 100 100 100 100 100 100 100 100 100 100 
##$AQSEQ= 0
##$AQ_mod= 1
##$AUNM= <au_zg>
##$AUTOPOS= <>
##$BF1= 200.13
##$BF2= 200.13
##$BF3= 200.13
##$BF4= 200.13
##$BF5= 200.13
##$BF6= 200.13
##$BF7= 200.13
##$BF8= 200.13
##$BYTORDA= 1
##$CFDGTYP= 0
##$CFRGTYP= 5
##$CHEMSTR= <none>
##$CNST= (0..31)
1 1 145 1 1 1 1 1 1 1 1 1 1 1 1 1 1 1 1 1 1 1 1 1 1 1 1 1 1 1 1 1 
##$CPDPRG= <>
##$CPDPRG1= <>
##$CPDPRG2= <>
##$CPDPRG3= <>
##$CPDPRG4= <mlev>
##$CPDPRG5= <mlev>
##$CPDPRG6= <mlev>
##$CPDPRG7= <mlev>
##$CPDPRG8= <mlev>
##$CPDPRGB= <>
##$CPDPRGT= <>
##$D= (0..31)
0 1.2 0 0 0 0 0 0 0 0.06 0 0.03 0 0 0 0 0.0002 0 0 0 0 0 0 0 0 0 0 0 0 
0 0 0 
##$DATE= 1666777935
##$DBL= (0..7)
120 120 120 120 120 120 120 120 
##$DBP= (0..7)
150 150 150 150 150 150 150 150 
##$DBP07= 0
##$DBPNAM0= <>
##$DBPNAM1= <>
##$DBPNAM2= <>
##$DBPNAM3= <>
##$DBPNAM4= <>
##$DBPNAM5= <>
##$DBPNAM6= <>
##$DBPNAM7= <>
##$DBPOAL= (0..7)
0.5 0.5 0.5 0.5 0.5 0.5 0.5 0.5 
##$DBPOFFS= (0..7)
0 0 0 0 0 0 0 0 
##$DE= 6
##$DECBNUC= <off>
##$DECIM= 32
##$DECNUC= <off>
##$DECSTAT= 4
##$DIGMOD= 1
##$DIGTYP= 9
##$DL= (0..7)
0 120 120 120 120 120 120 120 
##$DP= (0..7)
150 150 150 150 150 150 150 150 
##$DP07= 0
##$DPNAME0= <>
##$DPNAME1= <>
##$DPNAME2= <>
##$DPNAME3= <>
##$DPNAME4= <>
##$DPNAME5= <>
##$DPNAME6= <>
##$DPNAME7= <>
##$DPOAL= (0..7)
0.5 0.5 0.5 0.5 0.5 0.5 0.5 0.5 
##$DPOFFS= (0..7)
0 0 0 0 0 0 0 0 
##$DQDMODE= 0
##$DR= 18
##$DS= 0
$$ [...]
##$SUBNAM2= <"">
##$SUBNAM3= <"">
##$SUBNAM4= <"">
##$SUBNAM5= <"">
##$SUBNAM6= <"">
##$SUBNAM7= <"">
##$SUBNAM8= <"">
##$SUBNAM9= <"">
##$SW= 18.0517283424941
##$SWIBOX= (0..15)
0 0 2 0 0 0 0 0 0 0 0 0 0 0 0 0 
##$SW_h= 3612.71676300578
##$TD= 16384
##$TD0= 1
##$TE= 0
##$TE2= 300
##$TE3= 300
##$TEG= 300
##$TL= (0..7)
0 120 120 120 120 120 120 120 
##$TP= (0..7)
150 150 150 150 150 150 150 150 
##$TP07= 0
##$TPNAME0= <>
##$TPNAME1= <>
##$TPNAME2= <>
##$TPNAME3= <>
##$TPNAME4= <>
##$TPNAME5= <>
##$TPNAME6= <>
##$TPNAME7= <>
##$TPOAL= (0..7)
0.5 0.5 0.5 0.5 0.5 0.5 0.5 0.5 
##$TPOFFS= (0..7)
0 0 0 0 0 0 0 0 
##$TUNHIN= 0
##$TUNHOUT= 0
##$TUNXOUT= 0
##$USERA1= <user>
##$USERA2= <user>
##$USERA3= <user>
##$USERA4= <user>
##$USERA5= <user>
##$V9= 5
##$VALIST= <valist>
##$VCLIST= <CCCCCCCCCCCCCCC>
##$VD= 0
##$VDLIST= <DDDDDDDDDDDDDDD>
##$VPLIST= <PPPPPPPPPPPPPPP>
##$VTLIST= <TTTTTTTTTTTTTTT>
##$WBST= 1024
##$WBSW= 4
##$XGAIN= (0..3)
0 0 0 0 
##$XL= 0
##$YL= 0
##$YMAX_a= 151278
##$YMIN_a= -296787
##$ZGOPTNS= <>
##$ZL1= 120
##$ZL2= 120
##$ZL3= 120
##$ZL4= 120
##$ABSF1= 10
##$ABSF2= 0
##$ABSG= 5
##$ABSL= 3
##$ALPHA= 0
##$AQORDER= 0
##$ASSFAC= 0
##$ASSFACI= 0
##$ASSFACX= 0
##$ASSWID= 0
##$AUNMP= <proc_1d>
##$AZFE= 0.1
##$AZFW= 0.1
##$BCFW= 1
##$BC_mod= 2
##$BYTORDP= 1
##$COROFFS= 0
##$CY= 11.3945322036743
##$DATMOD= 1
##$DC= 2
##$DFILT= <>
##$DTYPP= 0
##$F1P= 2.36226072786647
##$F2P= -0.459571619588291
##$FCOR= 0.5
##$FTSIZE= 0
##$FT_mod= 4
##$GAMMA= 1
##$GB= 0.15
##$INTBC= 1
##$INTSCL= 1
##$ISEN= 128
##$LB= 0.24
##$LEV0= 0
##$LPBIN= 0
##$MAXI= 10000
##$MC2= 0
##$MEAN= 0
##$ME_mod= 0
##$MI= 1.114404
##$NCOEF= 0
##$NC_proc= 0
##$NLEV= 6
##$NOISF1= 3.799351
##$NOISF2= 2.8
##$NSP= 1
##$NTH_PI= 0
##$NZP= 0
##$OFFSET= 15.70392
##$PC= 1
##$PHC0= -18400.62
##$PHC1= 19.4007
##$PH_mod= 1
##$PKNL= yes
##$PPARMOD= 0
##$PSCAL= 0
##$PSIGN= 0
##$REVERSE= no
##$SF= 200.130013532006
##$SI= 16384
##$SIGF1= 3
##$SIGF2= 2
##$SINO= 400
##$SIOLD= 16384
##$SREGLST= <1H.CDCl3>
##$SSB= 0
##$STSI= 0
##$STSR= 0
##$SW_p= 3612.71676300578
##$SYMM= 0
##$S_DEV= 0
##$TDeff= 0
##$TDoff= 0
##$TI= <>
##$TILT= no
##$TM1= 0
##$TM2= 0
##$TOPLEV= 0
##$USERP1= <user>
##$USERP2= <user>
##$USERP3= <user>
##$USERP4= <user>
##$USERP5= <user>
##$WDW= 1
##$XDIM= 8192
##$YMAX_p= 0
##$YMIN_p= 0
$$ End of Bruker specific parameters
$$ ---------------------------------
##NTUPLES= NMR FID
##VAR_NAME=  TIME,          FID/REAL,        FID/IMAG
##SYMBOL=    X,             R,               I
##VAR_TYPE=  INDEPENDENT,   DEPENDENT,       DEPENDENT
##VAR_FORM=  AFFN,          ASDF,            ASDF
##VAR_DIM=   8192,          8192,            8192
##UNITS=     SECONDS,       ARBITRARY UNITS, ARBITRARY UNITS
##FACTOR=    0.0002768,     1,               1
##FIRST=     0,             0,               0
##LAST=      2.2672688,     0,               0
##MIN=       0,             -296787,         0
##MAX=       2.2672688,     151278,          0
$$ Real data points
##PAGE= N=1
##DATA TABLE= (X++(R..R)), XYDATA
0 0 0 0 0 0 0 0 0 0 0 0 0 8 -8 8 -8 16 -16 24 -25 32 -40 48 -56 64 -80 91 -105 123 -144 164 -187 216 -243
33 -243 275 -312 351 -395 443 -492 551 -612 682 -757 837 -926 1023 -1130 1246 -1374 1511
50 1511 -1666 1837 -2024 2233 -2466 2729 -3028 3372 -3768 4236 -4795 5479 -6336 7444 -8945
65 -8945 11097 -14461 20491 -34634 140627 -35117 -233926 122372 64609 -83600 -13634
76 -13634 56818 -23582 -6094 -12690 -71269 -7016 88525 5309 -37310 1534 13548 -25990
88 -25990 -2627 33813 -9890 -47171 -19385 11 1713 -911 38610 28502 -10496 -2400 -11176
101 -11176 -377 40672 16627 -11243 -2345 -11013 -37650 9404 45479 -18364 -9859 33743 -42046
114 -42046 -65897 38735 62717 -31401 -31917 15175 -28245 -21091 27500 12485 15562 23566 -15121
127 -15121 -26307 24390 28018 -16291 9025 20681 -30292 -34029 2321 22708 2528 -24158
139 -24158 -5013 24521 15438 -19148 -3434 30809 2965 -26930 -25084 -2680 18197 -2128
151 -2128 -11920 11205 11574 -17303 -13872 30876 29580 1850 253 -8503 -13176 -15326 -15182 7468
165 7468 19155 102 -21228 -5971 9259 -1584 6343 8355 -1828 327 -4999 -3299 8864
178 8864 9149 -948 -545 3576 -14023 -3867 20209 -2808 -12313 8261 -543 -23739 -6353 22978
192 22978 5232 -8957 3704 500 -3257 -5412 -7673 4868 14514 -3165 -28449 -2487 31208
205 31208 7547 -8249 14563 15847 -18983 -21946 16358 17266 -5933 -8111 -7696 -4667 -4905 -10765
219 -10765 -260 23845 15183 -27327 -16511 21841 2743 -16943 6284 14919 -10691 -14757 7219
232 7219 10529 8655 4876 -8200 -487 8214 -5006 -7981 14213 16875 -15270 -20190 765 1081
246 1081 897 9856 3583 -13272 -6923 7330 -5170 -2378 16598 4811 -14576 -7917 2147 -1061
260 -1061 6064 10677 -5756 -2104 6358 -10457 -635 26777 8678 -23775 -6971 11895 -8185
273 -8185 -7855 10411 5642 -1346 -7171 -11524 2885 16318 1244 -9434 7617 2499 -20616 -8502
287 -8502 15105 11561 -9172 -13873 3520 8930 -655 -947 10819 8917 -10493 -13650 -130 10185
301 10185 7128 -4670 258 6268 -6845 -10472 6983 15194 1039 -7677 -5018 -5058 2668 2320 -5413
316 -5413 2409 4302 -9489 -8440 5812 3294 -537 10252 -1841 -17957 3408 12966 -3914
329 -3914 1286 15038 -2138 -14946 2098 5657 1137 6597 -1940 -7327 2954 -1276 -10825 5488
343 5488 17212 -7092 -19171 -293 8998 604 -7328 -405 8292 -3738 -13932 876 15481
356 15481 7036 -4692 -792 3167 669 -5526 -2824 13498 7608 -14252 -7001 9233 666 -6808
370 -6808 4361 4818 -3902 -4150 -9289 -4280 12531 3603 -11916 106 6430 -8792 -2572 15691
384 15691 4219 -6110 1736 -2058 -5251 4544 5878 -1299 -394 -1211 -7191 574 6821 1205 1706
399 1706 993 -5866 -3229 3195 1470 -2169 234 -10 -4283 -4607 -734 7674 6839 -4724 -2553 5814
415 5814 1657 -5130 -837 7935 6042 -7008 -14307 -1150 10447 -3395 -7503 8138 5350 -9078
429 -9078 -4072 8484 6930 404 -3066 -3392 4047 972 -8499 3947 14019 -4742 -15367 1552
443 1552 9749 -1124 -1407 2298 -713 -1238 -4090 -4420 4159 5694 -5572 -5228 4846 -1243 -7012
458 -7012 4002 7484 -1760 -3329 1633 1689 988 5158 4733 332 -391 -918 -2520 -1862 1134 1120 -1908
475 -1908 -3503 -6457 -5110 4502 5028 -3996 -1816 6093 -1901 -9379 5872 11722 -3044 -7566 960
490 960 2777 -443 -314 1496 5311 5230 -6752 -6883 10745 8616 -8431 -4350 8017 -1994 -13127
505 -13127 -1798 6990 145 -5739 -4857 -605 2504 -927 -3664 4092 9520 -2919 -8393 4957
519 4957 9275 -1107 -1635 5726 458 -7050 -884 4278 1671 52 -1764 -3787 -1864 822 -303
534 -303 1016 4086 -2015 -5614 -452 1133 -1372 1408 2135 -3939 -5081 2175 2660 -950 2694 5558
550 5558 794 -3875 74 5037 3568 -746 -3243 -924 49 -4788 -5105 3473 6403 -4049 -8343
565 -8343 2842 6048 -2252 -1728 5773 4548 -4448 -6373 449 6128 1486 -6148 -1218 4574 -2805
580 -2805 -5748 4464 8608 -253 -5402 -1141 2545 2218 -2085 -1286 4508 367 -8005 -3109 5723
595 5723 2928 -2579 515 893 -1956 221 1330 1977 2760 -924 -3966 -833 1127 -1391 48 2807
611 2807 -1584 -3985 -577 772 554 1466 2857 -580 -4119 -229 4252 1227 -1562 2242 2816 -3819
627 -3819 -3041 1803 2411 2557 -900 -4838 -212 3739 -4213 -3319 8630 2615 -10254 -2450 6127 -99
643 -99 -3168 1719 2054 -1231 -2320 -3536 2541 8120 -1250 -6830 3233 5709 -3979 -2969 6979 4306
659 4306 -4308 -3820 787 2141 -213 -1896 -471 349 -1668 -3670 -823 3650 1820 -2373 -1587 1624
675 1624 -760 -2989 2915 3479 -2300 -1542 1439 -2321 -330 5760 1589 -3456 868 1725 -2046 489
691 489 1872 -415 1544 -745 -6441 -791 6810 -841 -5194 1947 2484 -3904 -2223 3072 2895 -875
707 -875 -2588 -1485 2109 374 -2539 1759 4319 -1189 -4865 68 4806 1354 -3080 204 3780
722 3780 -227 -5097 250 5429 691 -3423 -1514 1204 480 -1898 -947 2865 1786 -4298 -3411 3261
738 3261 1792 -2104 45 1473 -1000 -1992 -75 1531 2564 762 -1858 -279 1320 -422 611
753 611 2642 -210 -1622 100 -1 -1542 898 1967 -936 -1814 -1449 -213 738 -443 -844 638 728
770 728 -3002 -2552 3115 2593 -1797 -684 2475 610 -3085 -97 3895 2307 -1963 -2392 1425 1836
786 1836 -1253 -1748 2024 2755 -3401 -5258 2063 4128 -1928 -3067 1950 1533 -3734 -2298 2868 2917
802 2917 -638 -3152 -831 2388 976 -2160 884 4500 -257 -4436 579 3548 85 -1070 869
817 869 98 -1584 -295 -65 -488 969 197 -1580 -1199 286 425 821 1276 -841 -1648 478 -85 -1549
835 -1549 1564 2977 -1857 -3335 1442 1884 -684 167 2034 891 -1250 -2063 151 3226 1104 -3365
851 -3365 -1509 2715 -516 -3077 1159 4322 -72 -3830 -436 2668 953 -1347 -498 1731 -104
866 -104 -3335 -2002 2334 2161 -2069 -1624 1977 900 -2379 -319 3508 1519 -2049 -1073 1036 933
882 933 198 -144 737 1059 -1012 -2271 1139 2807 -788 -1247 902 -510 -1796 381 1398 -274 -203
899 -203 -213 -1832 -723 720 453 322 -88 -1267 -40 1391 30 -2 2954 1318 -2070 -562 2326
916 2326 1757 -1399 -1520 944 329 -2788 -2293 1668 2334 -1465 -2266 883 2037 -821 -2524 1097 2990
933 2990 -1720 -3580 755 2683 -1052 -1439 1478 1560 -268 -599 747 2755 1838 -1751 -1099 1973 -319
950 -319 -2831 528 2009 -1366 -2602 -190 276 -65 10 133 -2 370 -689 -520 1365 703 -602 -62
968 -62 639 -697 -224 1000 530 -670 -53 65 -147 -418 172 1446 264 -1266 -371 621 -399 -963
986 -963 454 949 -714 -2245 -719 1687 845 -1686 -206 2377 219 -2220 779 3000 645 -1458
1002 -1458 -1457 362 894 -1238 -1018 1890 1278 -2518 -1517 2479 1471 -1286 76 1259 140 -1320
1018 -1320 -1220 895 1340 -878 -2477 461 1532 -966 -1057 1417 1207 -818 -1070 -28 512 560 272
1035 272 127 38 -421 -481 305 1131 430 -177 89 -109 -542 116 1097 -38 -741 -122 440 -768 -174 1432
1055 1432 458 -1598 -1011 753 -45 -505 -238 287 478 -712 -1798 928 3054 -130 -2259 1022 2097
1072 2097 -1611 -1525 1321 1291 -949 -1421 -211 1658 984 -1241 -410 2226 -129 -2493 -505 2087 25
1089 25 -2092 -576 1049 -587 -1396 520 1595 600 -705 -411 568 762 -104 -181 823 428 -1093 -330
1107 -330 1215 438 -733 253 433 -896 -250 831 -278 -463 62 -85 -685 -251 261 504 496 -562 -793
1126 -793 492 454 -985 -446 1322 293 -1545 -320 1321 451 -1042 -200 974 326 -948 -412 1334
1143 1334 1013 -1261 -1207 765 741 -1460 -764 1594 1131 -1688 -1182 1200 1143 -717 -603 786 820 -624
1161 -624 -1300 883 1727 -456 -1260 556 1183 -277 -458 460 927 -547 -1049 71 917 81 -483 -31
1179 -31 636 -497 -942 -14 302 -108 -318 65 -259 -706 14 266 -182 -304 400 392 -337 -101 627 640 -63
1200 -63 -788 -140 870 17 -935 477 1417 -659 -1530 613 1208 -576 -1078 408 619 -460 -1128 -53
1218 -53 1139 342 -1731 -472 1908 301 -1257 460 1568 -317 -954 225 1190 374 -448 -162 977
1235 977 403 -1017 -369 1272 505 -989 -623 536 155 -1011 -372 992 284 -878 -176 392 -100 4
1253 4 556 228 -72 -2 -430 45 614 32 -159 317 -313 -537 947 574 -697 -232 1019 -30 -935 415
1273 415 794 101 -477 -575 343 309 -652 -684 767 543 -882 -904 1298 660 -862 -716 700 687 -475 -571
1293 -571 1232 1007 -498 -935 356 908 -524 -678 767 1202 -250 -1063 408 1260 -517 -852 382
1310 382 494 -596 -540 219 565 -58 -968 -357 524 320 -607 205 799 -287 -405 533 535 -147 79 -11 -123
1331 -123 29 139 -5 -15 -135 139 416 -115 -370 192 608 -554 -962 3 427 -558 -678 151 610 -445
1351 -445 -969 229 1022 116 -719 164 1091 109 -1107 -26 1236 317 -945 -305 990 193 -1179 -63
1369 -63 1081 132 -622 -110 543 370 -729 -434 589 416 -1091 -788 1062 113 -807 -479 565 238
1387 238 -554 -55 536 513 -10 -324 136 430 -379 -260 108 97 -553 -128 147 -117 -200 138 38 -322 -297
1408 -297 317 326 -96 -59 253 -47 -447 -475 79 450 -627 -731 514 567 -277 -374 1039 523 -744 -575 948
1429 948 564 -403 -456 272 548 -684 -814 177 919 -260 -882 139 911 -342 -813 362 827 -290
1447 -290 -634 188 350 14 -431 279 478 242 -577 -53 888 378 -895 71 588 -159 -212 111 641 -341
1467 -341 -414 -150 -121 -181 66 87 61 -176 -260 -100 203 -271 26 396 -12 -426 96 528 8 -506 -8 524
1489 524 -101 -400 146 745 60 -498 -146 817 229 -784 -91 650 141 -746 -482 743 -91 -811 -97
1508 -97 445 216 -509 -100 661 388 -511 -493 194 717 -680 -301 823 555 -715 9 545 334 -421 -53
1528 -53 67 19 -132 -240 235 333 -284 -488 125 216 -623 31 345 -127 -329 -63 294 221 -93 272 222 -60
1550 -60 -183 154 202 -1 -150 136 295 -113 -364 399 473 -447 -645 310 365 -488 -541 679 381 -374 -585
1571 -585 269 441 215 -450 126 356 -277 -715 240 731 -401 -625 372 601 89 -297 140 801 -108 -507
1591 -507 -253 538 136 -621 60 499 53 -755 -71 352 -96 -182 -52 267 -275 -486 -15 424 148 -316
1611 -316 -69 183 100 -181 149 320 -4 -147 253 136 -280 134 555 18 -344 30 34 12 -210 105 240
1632 240 135 -324 -130 421 348 -229 -309 381 19 -666 -41 472 6 -502 -74 452 334 -279 -382 715
1652 715 380 -474 -456 544 587 -623 -625 469 418 -497 -347 304 207 -376 -416 -8 110 -184 -525 13 435
1673 435 -81 -246 688 366 -126 -222 335 108 -232 142 -19 127 -151 247 168 37 -70 63 21 -19 -336
1694 -336 -324 224 38 -164 181 211 -1 -437 214 330 -484 -333 9 458 -132 -129 134 555 122 -640 73
1715 73 661 -157 -447 243 454 6 -740 50 420 -80 -413 64 456 -19 -278 -132 445 -28 -865 -89
1735 -89 744 -93 -613 -119 474 23 -201 87 371 8 -280 -108 145 148 -351 -196 225 305 -264 -149 207
1756 207 -110 -5 84 47 -80 -411 33 -129 -161 -112 -27 -105 -211 -262 112 86 25 -38 411 -68 -320 -198 291
1779 291 192 -397 68 385 203 -330 -215 416 264 -298 -268 290 384 -195 -354 167 346 -371 -390 653 167
1800 167 -388 -211 220 278 -323 -191 -50 591 -305 -348 283 226 8 -109 1 425 -233 -240 282 189 173 -403
1822 -403 97 -10 -52 -168 38 77 -201 65 85 110 1 44 246 -48 -351 56 26 58 75 43 41 -195 55 337
1846 337 203 155 -154 47 637 -220 -391 -91 324 -232 -422 94 494 -169 -600 -240 209 -233 -556 -71
1866 -71 401 -79 -569 -99 347 191 -359 -123 635 273 -250 -310 498 -190 -337 -25 276 35 -43 -289 189
1887 189 167 -277 -471 -44 299 -342 -181 104 -221 -361 -17 66 -15 -190 -156 -47 139 -132 70 -104 48
1908 48 -158 60 236 19 240 152 22 -320 -138 304 398 -362 -347 255 -36 -250 -406 261 -40 -168 -106 82
1930 82 416 -354 -171 263 192 -136 -217 371 536 -116 -314 503 258 182 -96 271 163 101 -489 130 437 -215
1952 -215 -445 -70 440 -129 -196 101 153 -168 -76 -20 298 141 -40 95 288 220 -94 -56 56 51 -161 40 308
1975 308 -187 -101 130 69 51 -46 66 -11 -137 -47 226 -117 -128 33 182 186 -491 -103 362 -123 -288 -38 296
1998 296 14 -170 114 382 63 -243 -272 253 192 -216 -37 446 172 -315 -187 315 106 -445 93 83 44
2019 44 -334 -306 257 125 -523 -179 97 325 -208 -77 200 295 24 -4 240 311 -284 -54 -158 9 -249 -230
2041 -230 278 83 105 -236 200 131 -102 -90 9 -22 -115 62 330 -324 -168 227 -32 -115 -183 146 299 -341 -119
2064 -119 241 483 70 -168 148 258 -134 -194 142 -51 -244 -291 253 397 -70 -163 166 142 -74 -449 208
2085 208 303 -62 -311 -202 446 -241 -434 258 290 -65 -45 -9 397 158 -70 231 256 273 -439 96 429 -111
2107 -111 -410 126 319 30 -227 76 76 -61 -183 63 44 -151 124 -17 -290 -7 28 198 -60 39 -48 206
2129 206 -188 -104 -205 374 22 -202 -158 33 155 -24 -66 22 -69 -98 -235 171 227 -229 -195 17 318 -236 -48
2152 -48 324 -50 -384 -255 311 163 -172 -195 183 418 -296 -129 295 394 -324 -229 334 205 -277 -212 56 255
2174 255 -178 -177 -100 -108 -243 -266 -102 137 -267 132 338 59 150 -211 127 77 29 -212 47 38 -156 52 225 -91
2198 -91 126 99 52 20 -18 -20 186 -170 -223 47 269 -9 -228 172 134 -288 -504 189 128 -188 -44 -81 298 159
2222 159 -140 95 212 74 -390 -144 338 155 -160 276 158 234 -26 -185 260 39 -288 0 135 128 -279
2243 -279 -11 103 119 -50 -96 316 63 -134 -60 -28 59 -227 227 142 -238 -98 264 59 62 -31 143 186 11
2266 11 24 16 119 33 -122 42 101 -20 79 198 110 -61 -357 274 26 -317 -276 223 -36 -216 -261 75 78 -233
2290 -233 -213 303 -14 -52 -310 272 158 -223 -94 254 381 -290 -301 218 268 -278 -369 181 155 -194 -348 132
2312 132 95 -53 139 -74 314 -224 -43 65 -116 -17 -213 -7 -4 -43 -92 78 89 -87 -106 96 -8 -170 -30
2335 -30 216 46 -124 -135 -44 23 -153 -274 86 103 -134 73 273 -94 -107 326 157 23 -196 146 385 -245
2357 -245 -174 61 127 -116 5 316 449 70 -419 -101 263 -94 -127 234 556 -144 -407 -60 133 172 -346
2378 -346 -148 242 -46 -276 175 280 112 -450 -191 98 138 -208 277 138 111 -123 -34 126 10 -103 -58
2399 -58 27 -168 -33 -48 255 -15 -157 175 -105 -176 -78 -165 141 -61 41 12 -26 -189 -439 123 28 -20 -150
2422 -150 137 -23 -208 -273 191 196 -598 -6 322 145 -153 -245 167 -56 -52 -350 -100 118 -24 -245 38 100
2444 100 -170 -119 226 309 -120 -324 18 26 -332 -301 272 257 -19 -132 222 207 57 -132 182 71 -332 92
2466 92 77 56 -122 -244 130 300 -7 -90 112 -255 -82 -190 -23 113 -91 -251 123 -137 -117 -46 463 26
2488 26 -290 114 34 15 -124 106 270 195 -285 135 -23 27 -111 5 191 52 -283 -26 -88 -223 -188 -82
2510 -82 120 -296 -310 1 123 264 -95 -335 208 12 -39 -67 208 112 -136 55 524 513 30 -4 63 25 -15
2533 -15 47 127 115 -312 -173 187 -90 -140 -31 376 141 15 118 -79 -263 -186 76 -51 -174 -54 -135 141
2555 141 -60 -152 240 183 48 -215 194 130 -228 91 -59 46 -99 -237 236 291 -241 37 204 320 24
2576 24 -169 251 207 -132 -88 48 102 -33 -113 262 237 44 20 54 71 -80 -362 28 107 -215 -28 -48 71 -36
2600 -36 -55 -164 -6 -94 -131 -42 223 216 -428 72 129 -171 -215 -39 169 112 200 230 226 50 -13 132 75 -13 22 39
2626 39 -309 -50 -119 19 89 -82 -212 -152 128 -134 -120 147 111 -182 95 79 29 -105 113 106 57 20 -58 91
2650 91 219 -277 1 -96 82 40 -200 94 224 -129 -132 332 29 -223 0 195 172 -365 -52 17 4 -39 -248
2673 -248 170 378 -85 39 -16 203 -217 -52 131 11 152 -49 -65 192 -173 -122 -39 75 14 -121 17 125
2695 125 134 -70 66 20 -293 -202 60 -73 116 75 258 -110 -123 119 143 41 124 -16 114 130 -158 293 162
2718 162 -110 -205 10 260 -187 -78 -57 203 6 -87 179 137 -228 -105 -6 178 -288 -103 65 441 -156 -139
2740 -139 -152 -105 -73 -160 -38 220 -234 -158 103 190 -49 -269 140 151 111 -248 -54 -161 78 -127 -68 -24 106
2763 106 130 107 157 -45 15 -14 -46 228 -13 64 186 53 -113 -42 -13 -87 -133 24 -155 -38 -170 -56 -427 -159
2787 -159 -85 307 -53 -177 36 -123 281 -205 -12 349 40 -200 -203 222 -49 -83 -267 19 207 -248 -86
2808 -86 176 119 -196 -113 252 10 -145 -28 308 36 78 -8 171 81 -163 -8 12 393 -105 166 -15 219
2830 219 82 24 8 233 -208 -100 169 243 11 -41 -8 -34 -101 -37 189 -22 -8 102 289 11 73 78 -123 -93
2854 -93 -270 146 176 -4 154 328 158 -84 -317 -74 3 -41 -66 -37 98 -92 -59 102 83 152 -255 141 117
2877 117 114 -168 278 193 -56 -232 20 199 146 -117 187 204 174 -115 120 497 -12 -148 -114 -5 -33 -168 -35
2900 -35 146 -70 -129 38 94 43 -248 98 -60 134 22 -30 -47 -70 -85 181 225 64 -29 -128 167 6 -29 -52
2924 -52 -23 206 -152 -74 -137 -266 54 -5 130 84 -139 -68 36 -298 -99 161 -42 -74 -19 -16 392 37 -56 468
2948 468 150 -137 -118 260 -38 -132 -7 284 61 -100 -145 207 58 -341 114 -67 135 55 -153 112 241
2969 241 117 122 -24 -95 -114 222 77 156 -22 -67 -177 -151 -80 -111 -150 -10 -138 126 -70 -202 -159 -122 143 -42
2993 -42 101 -29 84 74 -107 161 86 -8 -149 -129 28 80 -195 -288 127 -63 -18 291 166 61 -228 94 116
3016 116 36 -73 188 122 -182 63 70 106 319 -124 -174 174 -104 8 -198 163 160 -46 237 176 203 6 113
3039 113 212 163 -107 35 84 86 228 176 -11 197 -216 -60 157 127 -6 110 255 5 92 161 150 0 -93 177
3063 177 295 -153 -120 161 -41 -205 -74 71 46 -153 -59 9 -61 57 -165 335 102 -213 34 239 194 -270
3085 -270 -140 362 128 -7 -124 67 122 14 -67 18 172 -240 -232 298 34 -76 -4 -95 219 -269 -429 132
3107 132 231 0 -105 -165 80 -221 -69 -1 65 -49 -119 -133 -70 94 -339 166 100 -118 -57 -32 -64 -187 146 211
3131 211 34 -23 -227 300 29 -84 -10 43 204 -187 -24 113 110 -311 -55 107 -51 -76 55 129 -227 -105
3153 -105 -63 27 -89 -174 -16 -239 -83 -97 51 60 146 181 39 170 139 -134 66 58 -74 -65 -113 144 -109 -13 -94
3178 -94 -118 54 -116 -101 -88 -80 -46 54 162 79 23 -135 -46 10 -133 -278 72 20 -73 -20 4 182 -203 8 353
3203 353 -43 10 264 -30 69 111 317 83 -41 -177 -173 -33 -105 -61 -213 -17 -42 5 528 -125 21 -54 -196
3226 -196 242 130 -231 139 -72 -15 -129 186 20 216 -113 5 132 -139 230 -194 187 -25 47 202 241
3247 241 -11 163 -102 -25 -71 -26 235 40 122 -179 -32 188 -103 -18 18 28 189 198 33 199 -12 -70 26 165
3271 165 -112 130 63 115 24 3 190 31 44 -44 64 -107 -51 65 -92 59 -206 67 221 195 56 299 187
3294 187 -29 -183 24 -109 59 -255 24 78 52 -155 90 11 -14 -166 -53 -70 -18 -241 159 147 80 -150 -258
3317 -258 -51 30 -103 -50 -73 -60 33 -81 283 -186 -119 66 -161 -51 -202 -76 50 -11 -181 166 -167 -222 11
3340 11 -193 65 -130 -220 -73 -187 100 -195 132 -201 -209 134 -12 -73 94 57 252 -21 -184 32 74 350
3362 350 213 -51 22 -24 191 -216 177 -196 18 116 -255 26 33 -60 -35 62 114 -93 -6 -121 136 209 141 184
3386 184 0 -167 -237 58 92 47 152 -11 -170 -28 17 89 18 -207 187 279 164 -162 -16 116 231 -83
3408 -83 -16 55 -192 49 -3 3 1 -83 -29 -56 -230 -242 105 -136 -33 -262 113 183 22 19 129 83 194 -71 28 94
3434 94 -242 -65 -110 -21 -314 0 38 6 2 -272 1 -238 -6 -227 263 -125 46 -58 96 237 -121 181
3456 181 -130 -110 21 57 135 112 -102 -177 -96 99 -101 86 124 -114 -62 -107 85 160 -221 13 111 128 -224 103
3480 103 34 -139 29 31 201 21 -191 -95 14 28 113 124 -112 -117 -166 25 271 30 22 -127 -162 -92 -6 35 156
3505 156 -4 -62 184 10 -195 46 -172 234 212 -252 -146 129 16 -86 292 398 177 -58 -77 145 49
3526 49 -72 30 -138 -90 -5 110 263 71 -70 63 -70 -62 -300 72 -199 -28 -175 -10 183 -96 3 -21
3548 -21 51 217 55 -202 115 42 -271 392 185 -60 159 71 -125 72 56 17 -149 -17 -101 116 98 -142 98
3571 98 -190 256 5 -107 -2 -81 78 8 120 -10 -108 -157 -17 -108 -116 -105 2 83 112 -70 178 -62 -23 -110
3595 -110 -19 -17 -25 -319 194 -36 90 52 117 73 -24 154 -67 -150 -88 -9 51 -239 140 96 244 -5 -76 8 154
3620 154 -22 146 4 72 12 -5 -150 195 21 -166 105 268 163 57 156 257 142 -213 -57 67 -15 -173
3642 -173 69 14 133 168 -14 158 27 -79 36 -39 8 4 -264 -126 -38 -207 8 -140 -16 19 -184 -18 -117
3665 -117 -119 -82 -80 123 72 185 170 -213 -138 -228 -222 67 -34 -50 293 23 55 -179 142 22 26 -218 117 82 -4 -28
3691 -28 -164 42 -101 43 -3 49 29 130 -76 -35 -95 34 232 133 -159 75 -205 -96 -31 89 266 -111 85
3714 85 -27 -137 -194 -40 335 -5 -86 -169 -128 127 -160 -161 -117 40 -25 -57 -178 -157 -80 -36 142 -33 175 -33
3738 -33 -53 -19 -39 0 -61 -179 -23 84 -70 514 121 77 54 -5 -165 1 28 239 -105 -108 48 -80 -26 114
3762 114 -140 -46 -38 156 -34 176 -177 55 -54 -8 71 82 174 -365 128 -295 78 32 -31 174 167 -118 131 -9
3786 -9 136 131 -29 -38 156 66 -95 -98 -108 102 38 -2 42 22 -73 171 -161 -88 -144 70 313 260 -83 367 107 -31
3812 -31 284 20 -65 63 24 151 32 -166 102 -45 -207 -113 -12 -121 -38 68 73 -33 98 129 -14 208 125
3835 125 95 -90 -58 58 0 -92 114 103 -15 -30 -39 351 2 -64 -93 50 367 108 176 251 36 -54 38 -84 -149
3860 -149 -270 145 -228 -172 81 227 281 -37 -60 60 164 123 -49 -107 70 12 47 110 25 -74 -48 161 38 96
3884 96 -51 83 58 120 128 -45 119 -61 -38 16 44 -319 -262 92 53 -46 68 -58 -227 -273 7 112 75 -35
3908 -35 -133 -91 -132 125 -157 -38 61 -53 -101 -56 -66 -51 -350 212 -34 -144 -26 -9 8 -126 -52 195 105 -71
3932 -71 111 194 -54 -34 47 -146 -96 -141 -134 -223 -193 -14 -17 -133 -9 -55 -141 -67 31 -69 -73 -70 85 -283 -101 -6 -276
3959 -276 -174 56 43 4 50 -239 -2 182 -89 243 58 4 -158 -233 45 105 -247 211 240 -62 61 97 -62
3982 -62 22 -123 -216 -116 -60 -98 -216 339 -134 64 -178 88 -90 15 -130 62 -135 -41 111 28 -3 -35 37
4005 37 -217 -18 40 -72 -22 -276 -109 -32 75 -75 -4 -20 -93 -135 60 -19 5 243 -33 52 249 -36 77 60
4029 60 26 -46 -118 -156 311 -14 -21 -66 -24 59 -146 267 12 47 80 1 130 71 28 -79 19 93 138 92 -44 -148
4055 -148 -216 69 -64 -114 106 -135 -286 40 -116 245 -41 306 99 30 -117 150 26 138 51 167 80 143
4077 143 165 49 -195 -112 -21 12 33 81 130 -113 -88 70 62 55 43 -103 164 -38 170 212 -16 49 -33 -70 120 -58
4103 -58 56 17 -64 28 -93 -127 -213 -123 84 72 76 -120 -12 -32 22 17 -128 6 -43 -216 -72 -48 117 89 -133 -18
4129 -18 33 199 -159 -26 81 -179 -274 115 -114 32 -143 67 11 -33 61 33 20 64 72 184 18 -4 -37 -78 -170
4154 -170 -38 83 -217 232 96 -16 211 93 -48 -116 214 181 -16 131 215 -114 -203 -24 171 -44 -87 -5
4176 -5 -2 -35 -40 -19 -27 -319 -100 35 -57 -152 63 119 -104 -95 -117 -118 -1 35 -4 55 117 146 142 15 118 142 -105 -73 144
4205 144 101 34 -161 -91 -143 -46 31 115 16 -151 -210 77 -102 -165 47 -367 -157 3 109 98 -208 -67 -111 68
4229 68 22 144 -51 7 -272 -90 87 26 161 -239 368 147 -87 97 -184 -105 69 -30 125 172 -110 3
4251 3 60 34 23 21 -91 93 78 52 -90 188 -227 167 -80 -78 -43 -111 30 -49 -9 4 93 56 -76 139 -81 82
4277 82 -93 51 -22 19 -1 148 -18 -73 -241 162 -55 52 -75 -23 -17 -23 -229 -51 -27 -66 -342 -86 290 88
4301 88 -136 59 -200 155 78 -168 215 -165 20 10 97 -48 62 8 114 -124 102 290 -7 -396 129 -248
4323 -248 27 -71 -49 -76 1 60 -265 -13 -190 -48 -23 66 178 -214 26 -24 -175 -86 -40 76 63 175 127 -9
4347 -9 123 -126 56 -235 -41 87 250 -15 29 253 -123 93 214 123 73 149 -166 -78 1 172 242 -200 -57
4370 -57 -9 -54 -51 23 13 49 -40 15 144 129 252 309 -178 -115 120 -74 -75 88 -204 -83 -34 57 54 31 -116 57 -135
4397 -135 -299 163 -160 99 -131 -139 212 17 -78 -49 70 -16 69 209 113 220 -153 110 -158 8 219 40
4419 40 -89 -48 -141 101 -145 -140 20 17 161 -1 -107 28 -11 -45 121 -16 -101 48 -157 74 -175 -245 -26 117
4443 117 165 -303 -265 -117 -112 -94 -12 68 -339 -125 51 -121 0 50 -19 13 -61 81 -135 22 -184 -70 46 74
4467 74 -87 53 276 12 29 148 -32 -5 45 -12 -106 76 -108 -56 104 -134 70 109 -114 12 3 -31 113 20
4491 20 6 -212 -292 59 -53 -228 194 -12 -194 -74 -137 -158 52 -68 -45 -156 7 -35 -45 -196 38 215 -136
4514 -136 -9 -70 -167 53 56 -15 -6 -337 -94 98 169 33 -214 -114 157 -40 162 86 29 -61 37 -148 385 8
4538 8 98 -113 -7 42 -120 -180 38 -259 -71 -8 -245 -145 -245 135 22 126 -137 -107 -22 12 53 -1 -327 37
4562 37 77 173 -55 -43 91 -115 -77 31 119 78 -127 -193 -143 31 134 162 -99 -45 109 87 48 -277 20 60 172
4587 172 63 87 -39 268 -180 -120 3 75 21 257 100 -204 72 107 123 36 -43 21 84 -49 47 -95 77 -78
4611 -78 -212 74 -173 32 23 -66 27 -156 104 -96 -19 -157 15 66 -93 -194 -72 40 -26 -2 218 76 98
4634 98 -16 -43 -205 -106 -41 -92 -74 -159 -205 135 151 -62 -38 -33 -275 -30 57 -137 -64 164 105 204 29 -33 36 1
4660 1 -10 113 90 -24 -80 -5 -106 -7 -126 -57 135 123 298 126 52 53 -167 -2 -38 -62 57 -117 176 167 -71
4685 -71 4 89 -262 204 277 42 -20 -212 51 26 109 -243 34 16 -74 -139 -210 -60 -157 3 203 -73 97 360
4709 360 150 -41 -8 -83 91 185 78 314 -105 -31 169 -177 -150 -35 135 147 58 -61 3 182 -77 -177 -88
4732 -88 169 128 -106 -126 205 -76 70 -274 -123 21 -67 107 -3 5 -9 45 12 -57 89 61 -51 -72 -135 173
4756 173 115 29 -134 -51 43 -74 7 -16 173 -109 95 -6 27 50 -47 -175 -112 -22 43 334 137 179 -197 81
4780 81 -28 144 123 -299 -51 67 -8 163 -75 -68 196 84 -133 -14 -58 33 -47 98 18 -36 -164 135 33
4803 33 197 -94 34 -295 73 243 181 1 94 -4 -84 -48 9 204 -157 37 -36 67 -96 -124 262 -50 62
4826 62 60 24 -57 33 -173 -12 -8 6 -68 105 145 -134 -204 59 -25 42 -36 470 -34 -31 -5 -156 108 138 -99 -125 -36
4853 -36 103 36 224 199 -97 -177 163 151 -7 11 102 -50 40 -76 -69 75 94 -115 18 -39 -225 -152 -38 -7 219
4878 219 -46 -264 177 -94 156 160 39 -172 40 -19 -8 -219 -152 -110 80 -114 -119 143 32 -66 42 -75 33
4901 33 88 125 -1 -69 179 -68 233 -49 186 141 25 -162 -128 -286 3 -278 -11 -200 -358 65 109 204 305
4924 305 -190 -35 -54 108 -31 70 100 152 -20 160 74 -194 110 -158 -278 -26 104 235 -59 -55 -83 37
4946 37 -102 -262 -82 202 -89 109 135 -66 51 15 210 59 -69 -78 -52 -66 2 154 103 71 -179 -156 224 87
4970 87 69 132 19 70 -148 -285 159 -168 -110 -98 -151 -144 -96 -93 -77 152 -1 40 38 -28 106 175 73 -19 -138 -31
4996 -31 -70 5 111 -216 -120 -130 -162 -12 41 174 58 -72 89 30 39 -29 222 16 -118 225 -28 52 48 -41 39
5021 39 44 332 -41 65 -144 111 -111 191 121 19 13 -84 64 95 212 -41 19 5 -19 18 103 -88 22 58 -49
5046 -49 -180 49 -5 94 -47 40 48 -299 -75 58 254 109 103 83 -62 -72 34 -12 191 202 -82 -6 119 0
5070 0 113 25 -101 43 -194 113 -58 65 -225 -102 24 21 168 35 -171 192 -39 255 153 63 58 119 144
5093 144 -67 26 -43 45 -54 74 129 -108 39 -6 -58 -86 26 231 -222 142 109 -18 -57 -45 180 -111 -44 128
5117 128 116 -51 218 77 47 220 -292 137 -218 6 157 -40 -154 2 30 -226 -140 -65 -188 -87 -36 -5
5139 -5 -225 -96 -10 172 1 7 -80 46 -43 70 3 151 -99 -52 -92 80 46 -3 -18 105 22 -102 70 -171 -157
5164 -157 193 -25 -68 -96 -140 320 141 -128 364 -210 -55 -2 44 54 146 -97 61 -250 166 41 94 -1 64
5187 64 105 46 18 -80 40 52 128 -46 0 114 184 13 199 -28 -20 -190 -269 -255 77 33 194 411 -138 57 -236
5212 -236 -40 29 272 23 -93 -119 165 -11 -25 -20 222 22 24 83 52 -51 -113 23 131 65 153 -71 71 -134
5236 -134 -91 81 -92 47 44 9 -43 -116 53 -160 -76 -101 -155 341 -8 -57 54 90 142 106 73 51 -125 -298 -161
5261 -161 51 -40 -96 -30 -87 153 -189 -62 18 10 -45 -282 14 -98 -17 92 -75 -58 -111 59 77 179 -171 46
5285 46 -20 85 174 269 -23 -100 12 -230 42 64 -111 24 29 17 263 59 -255 -23 -64 -169 25 -59 -255 180
5309 180 107 -89 223 -199 -178 -361 8 -8 14 39 73 18 233 41 -115 91 219 15 -62 -49 60 -255 -90
5332 -90 121 -298 55 -62 -109 145 -49 -169 -87 116 1 -113 -44 68 171 165 151 -23 -42 266 108 -5 -128
5355 -128 -15 104 -50 86 -52 197 -80 186 49 97 -59 -28 -112 120 246 -5 -139 114 -23 92 -49
5376 -49 -313 -209 -153 -154 11 -146 -125 104 55 210 -35 103 -27 -82 -122 -67 80 -106 57 94 50 44 11 157 -49
5401 -49 125 47 73 87 -31 167 -172 -122 -169 23 72 254 162 -241 -15 140 -211 -93 -101 120 107 123 -214 113
5425 113 -52 -71 -4 -40 27 -204 -120 212 -91 105 146 132 161 -80 -50 7 -12 -117 -140 136 -73 163 152 26
5449 26 -84 36 128 -63 18 -65 -267 94 -54 78 84 115 155 22 -52 -5 100 -75 46 26 176 29 23 -225
5473 -225 -11 -50 -215 98 32 -94 173 312 -101 149 -103 -3 247 -33 117 98 220 81 -95 -124 72
5494 72 113 -167 31 -121 158 -106 -21 -29 137 -246 -123 27 -97 289 -59 336 17 139 67 -196 -41 -29
5516 -29 -139 -79 356 -153 -74 208 46 193 -112 28 -161 136 -36 -230 -54 54 197 101 -116 97 22 30
5538 30 157 -83 80 -83 20 58 94 182 -126 22 -55 146 -27 36 237 -283 -26 -130 106 95 5 30 -297
5561 -297 121 38 -34 -198 31 -77 -175 124 -211 67 113 -10 114 110 -40 -151 88 82 84 -110 170 -38 -247
5584 -247 176 -36 173 -27 195 76 274 1 -19 81 -8 -147 -101 -76 84 -195 -245 170 -120 99 -155 22
5606 22 119 -35 -210 -1 -336 -164 -56 133 -265 -82 107 -122 50 -126 7 154 374 -301 -243 141 18
5627 18 -115 -205 -23 72 141 40 120 -70 100 -45 0 -315 -107 -90 50 54 -140 -48 128 77 -160 94 148 180
5651 180 -69 110 22 165 202 -64 -123 95 105 103 -138 68 -64 -83 -117 148 196 -15 -33 200 -7 -63 85 -196
5675 -196 -163 -2 -332 -274 -80 60 -121 -115 -66 -76 0 -34 -50 116 -139 -6 -76 -43 -72 6 -83 -127 36 110 18 87
5701 87 -288 -129 -286 58 -19 -142 -6 26 -190 210 -6 -54 88 130 83 2 -101 45 113 141 106 -112 -40 -38
5725 -38 -93 -149 -12 54 115 137 127 -9 -146 -92 -133 117 -119 86 31 -245 -231 50 80 -71 57 -1 -407 -2
5749 -2 -122 -32 71 -153 13 -159 168 -198 -40 -79 -85 181 -8 129 -28 -154 -33 61 71 -236 -61 -98 163
5772 163 136 -247 -5 -88 36 -42 -79 66 222 61 -58 -31 -84 47 -97 16 -218 356 -40 142 13 46
5794 46 -68 -5 60 276 -60 120 126 -189 -135 -91 -68 30 -75 81 146 130 165 8 24 224 30 -6 -115 2 87
5819 87 116 165 -200 84 -110 14 -109 44 287 -249 -289 203 20 -64 -52 -59 -52 -27 223 -136 -125 10 70 -74
5843 -74 120 9 117 159 -10 13 48 -30 52 -278 -111 -31 62 169 119 -147 191 -29 -73 78 -123 13 -33 -202
5867 -202 60 56 -9 180 117 127 -76 21 45 127 17 -1 222 36 -158 -153 51 -84 34 102 12 45 49 -212 -128 -22
5893 -22 82 134 25 -81 -76 -176 200 76 -127 109 -31 148 -39 177 176 -84 265 168 5 5 64 -51 -252
5916 -252 162 -220 141 -215 -3 -225 62 76 -138 122 -9 61 6 106 -142 5 -107 -45 -29 -6 -105 -79 -74
5939 -74 -174 -97 -87 -10 -13 268 97 108 -112 -70 12 -117 386 -21 -69 125 -28 59 211 80 -225 148 137 151
5963 151 -315 98 95 -65 -14 -7 91 -8 138 -62 -160 21 71 -46 96 264 115 205 -71 50 -211 30 72 192
5987 192 178 345 -124 15 -69 -107 58 82 121 9 127 -250 189 37 60 -259 -80 -30 25 -140 126 168 168 -4
6011 -4 -55 1 39 -59 43 49 -153 152 38 89 84 322 -3 124 134 166 9 99 -78 82 18 -49 80 62 177 101
6037 101 -145 117 194 -142 -155 253 -172 76 -28 -139 -75 -42 101 63 56 -26 -86 122 68 125 89 54 75 26 218
6062 218 -90 -42 133 132 -59 -155 114 153 -126 -110 165 -114 91 139 9 -46 -144 8 201 115 80 -143 11 -80
6086 -80 -111 -5 125 63 -103 96 -27 385 120 -19 -103 107 -84 -148 -237 -38 86 -153 81 30 154 85 -69
6109 -69 67 63 210 -76 -118 126 -35 -170 74 156 112 209 20 12 -34 181 112 34 -31 23 -184 -151 -42 -49 -15 181
6135 181 10 -40 -98 38 148 103 -194 -57 114 115 -45 202 28 -274 -207 -114 -13 43 -37 29 154 376 -153
6158 -153 21 -358 104 32 110 -87 -71 -19 -23 119 76 39 -234 351 159 62 -152 181 59 113 165 -111 -30 80
6182 80 -97 -135 21 14 -85 18 -94 23 49 -16 -43 -124 289 60 44 78 -109 -36 7 -308 105 -170 104 -54
6206 -54 -94 259 -214 -65 -258 -54 -19 -124 56 63 -270 98 187 171 -146 -104 166 -3 4 -100 39 -183 112
6229 112 -93 125 -89 -159 -252 269 -15 -241 -142 111 -75 237 2 172 96 -131 24 21 -244 -90 14 -195
6251 -195 -8 0 -92 -119 30 54 -174 -127 52 197 9 -88 -59 294 -158 -289 -76 -353 198 75 -35 -115 -44
6274 -44 102 -183 -100 -109 88 -15 148 -84 130 -50 164 -58 -290 -50 162 -127 -340 114 -45 233 -104
6295 -104 -53 -2 112 -69 75 32 165 -114 -132 154 134 147 -188 -105 73 -44 -90 253 196 107 108 -223 -67 3
6319 3 23 73 18 21 33 -191 57 -25 38 -103 19 -130 -126 -74 -47 -104 -111 -46 124 -130 -57 80 332 44 -123 -41 -65
6346 -65 -179 30 -256 -264 -333 99 -44 -56 18 162 138 99 21 282 82 69 -109 43 -110 215 71 -136 82
6369 82 -93 155 215 -376 110 -151 104 -14 -50 109 158 -109 -161 -105 28 179 323 -58 -16 67 -135 159 201
6392 201 -7 61 -8 -52 24 -141 243 -40 -55 228 -236 185 -161 64 188 86 -23 -120 65 -4 194 209 -68
6415 -68 -62 75 134 -83 95 2 187 115 -119 166 -330 42 -209 -91 -109 20 40 -151 47 -90 163 90 41
6438 41 14 -113 87 -105 89 -104 144 -92 175 -178 11 -49 98 -96 37 -27 -162 -93 62 -203 4 189
6460 189 -17 -138 13 66 0 -338 128 -25 -46 -151 33 73 -148 -127 -18 -65 81 -14 196 -59 -100 124 227
6483 227 -158 22 108 107 85 -181 50 -110 -66 47 26 -135 156 173 -153 -136 -163 -47 120 101 -70 33 -104
6506 -104 86 79 -3 15 -24 -8 12 111 -180 -41 -279 153 -50 46 -188 42 112 -46 -137 -252 -41 151 -144 33
6530 33 114 48 -224 -76 161 133 6 228 200 -43 -169 50 -333 -13 72 401 -109 91 -183 -91 -188 81 -58
6553 -58 122 -244 -138 142 -195 52 -145 200 -68 -125 -12 -98 18 -222 -28 -162 100 -117 136 -58 53
6574 53 116 -22 -52 -52 24 -130 -96 60 62 -321 -24 -167 -103 -253 88 -19 44 -30 189 34 -75 37 12 -29 93
6599 93 25 -32 159 -20 24 6 12 102 57 -183 32 68 -226 73 -143 238 -33 -50 97 -140 29 -67 -107 266
6623 266 78 31 -32 -32 82 -1 187 99 -102 -39 -205 -84 -49 94 82 -158 -57 58 -59 -91 1 -3 1 3 1 27 133
6650 133 19 47 90 -79 136 72 -26 12 -242 95 -149 54 -82 -37 -70 181 103 79 -218 -81 62 -191 -21
6673 -21 -144 105 -85 446 41 96 -10 118 -44 -30 134 94 212 55 31 23 -156 90 -19 142 -2 26 40
6696 40 148 87 -72 -168 139 -182 -72 -38 -53 1 75 89 42 48 -116 305 184 -106 -177 -32 -295 -26 -110 86
6720 86 -62 -217 -54 24 137 -69 106 223 -27 247 -123 120 20 161 -59 -140 -192 30 -189 -53 -123 -76
6742 -76 -30 73 -117 -259 -146 301 33 122 112 -196 8 -32 123 148 -164 -161 -84 -47 -7 78 60 11 143 89 -44
6767 -44 142 366 -49 -129 -28 -117 20 -50 8 -384 -2 -228 3 -130 -103 -180 24 7 109 109 -158 86 -80
6790 -80 -148 -67 -31 117 -84 196 157 -159 -215 -111 -142 -79 39 -124 141 -147 74 12 22 143 191 4 163 -125
6814 -125 59 -186 -3 1 60 105 -78 10 4 -93 -43 19 -110 7 -69 292 172 193 -97 -263 93 204 -23 -6
6838 -6 248 -180 -38 -171 210 282 -91 17 -159 -70 -131 -97 -58 -271 142 142 -106 -27 133 40 -219 -1 22 -56
6862 -56 276 -116 200 101 -141 65 39 16 -88 14 129 203 -183 -61 66 188 176 32 -123 -36 84 29 -169
6885 -169 133 94 -70 109 -101 -27 65 -269 193 -6 133 249 -29 -119 16 -31 14 -125 -137 44 -103 44
6907 44 -148 72 -30 -29 46 39 207 23 86 104 16 26 -127 -110 29 95 249 -11 -58 28 -184 150 -216 -185 70
6932 70 -30 14 109 35 57 -6 71 -68 -144 -165 -147 -46 87 -119 -4 -143 -130 -135 7 25 91 223 160 -31 -175
6957 -175 19 17 11 -119 -4 -121 -90 228 92 31 43 -10 -104 -79 119 -358 -202 -170 30 -243 52 153 96 -137
6981 -137 61 2 -143 -200 -90 -27 6 -35 8 125 -111 -41 64 -149 -42 -13 185 227 -167 157 -90 201 -110
7004 -110 15 82 52 75 140 -83 -206 131 259 342 -11 100 77 60 49 88 198 95 -93 -124 33 -53 47 -50
7028 -50 29 -208 -114 17 -78 33 -58 211 81 -92 57 68 -45 155 -184 118 211 123 -60 -31 149 34 64
7051 64 179 19 131 -89 -78 31 -25 -44 139 64 24 37 -302 -76 181 -224 -7 -50 -35 268 -41 98 35
7074 35 -344 2 -4 13 14 -91 -88 87 276 -54 95 -96 -62 51 227 20 112 262 -28 158 123 -27 -54 65
7098 65 -107 -50 -186 17 83 -4 -127 128 -82 132 219 -50 213 47 26 13 -34 -23 189 -84 -105 68 9 20
7122 20 173 57 115 97 -78 -65 25 -46 67 13 21 107 -103 -34 -9 -37 225 -83 -49 97 70 -154 -70 -87 -44 204
7148 204 -60 5 124 -138 130 170 -189 -37 81 6 -240 176 38 -255 -2 -63 150 49 -6 58 -169 69
7170 69 -25 108 -151 -290 -159 -91 118 -84 -221 0 191 -60 80 -99 204 -104 108 26 14 153 153 -41
7192 -41 -161 -169 -127 31 37 31 -262 96 14 -104 116 181 -102 -116 -31 53 -112 -7 -43 59 200 208 -327 57 -148
7217 -148 -109 -157 37 134 22 118 3 232 52 173 144 -23 -1 68 -157 115 69 -55 -165 83 -112 -240 -70
7240 -70 -68 68 -155 63 -51 111 -64 150 246 -203 -52 -52 75 94 48 -125 -61 110 -87 -209 46 -196 -83
7263 -83 -72 -186 -148 -33 110 -16 78 -195 191 215 70 -178 -30 144 79 149 50 -128 -120 -48 128 56 -113 -29
7287 -29 135 152 243 -160 76 272 169 171 -62 59 45 -124 -13 198 15 -58 98 41 -204 -2 98 -195 -123
7310 -123 -113 -150 240 284 67 19 -109 -78 84 55 -8 -60 -32 -147 205 -27 171 24 117 -43 17 23 -6 8 42
7335 42 110 65 16 -44 28 128 302 61 317 -159 -175 25 144 -180 -17 8 -139 -140 -100 -29 7 -58 108 -28 -137
7360 -137 186 -170 -47 -250 85 78 32 -96 -19 3 -242 3 61 -124 35 -29 4 56 -27 -116 71 152 82 -232
7384 -232 214 91 150 -37 -72 -140 105 74 -256 -4 -157 -103 76 225 52 -135 50 59 14 -12 237 -224 -59
7407 -59 181 238 -10 -297 105 77 34 -65 82 -296 -70 -153 35 12 86 297 175 -27 -183 -47 -464 -115 16
7430 16 -21 100 -33 9 80 186 -107 -53 -251 -116 -125 14 -65 207 115 18 -26 -79 -98 125 102 -80 -24 -94 -180 88
7456 88 65 3 129 -78 -113 63 -62 89 -190 -72 45 -272 -221 210 -101 22 -45 128 -64 106 -57 -235
7478 -235 211 143 -29 100 46 -114 -203 -212 63 -62 119 -249 31 183 -63 -153 141 -99 39 -60 -153 -193 -29
7501 -29 55 -141 -77 -9 -88 53 -62 226 -105 6 -7 49 54 124 198 -102 2 145 50 22 34 20 -36 -46 46 79
7527 79 -177 -203 81 -158 -53 -129 59 -15 37 2 28 137 -92 -132 46 77 13 -171 -44 -173 69 124 102 58
7551 58 105 68 -240 31 -117 84 -273 -108 46 158 -41 18 -122 -241 -189 60 82 73 86 -212 -126 68 -67
7574 -67 -257 -103 133 52 116 -161 -115 173 -264 -189 3 -58 223 153 -96 133 112 232 51 -109 99 205 -253
7597 -253 69 289 150 -281 29 -39 96 -68 -108 164 -147 -206 -137 78 -113 61 -266 142 135 85 45 -7 -23
7620 -23 179 -164 -4 3 17 -48 143 -70 56 -13 -88 255 -138 297 5 29 -150 -287 -76 298 9 0 -186
7643 -186 143 84 32 -76 4 277 78 17 11 29 155 75 -4 78 -113 10 -9 -66 14 26 -142 -104 -42 243 175 -123
7669 -123 70 -85 -127 88 -7 7 56 -41 149 164 74 111 350 154 -161 16 67 -83 135 -104 -69 29 67 25
7693 25 -109 119 -137 188 54 -70 11 -205 81 44 65 -147 18 -44 184 80 -258 -82 145 -243 -19 63
7715 63 208 -59 -175 119 174 -89 65 48 89 -129 -141 -196 -125 -135 -162 -42 -159 122 -104 -52 44 146 -299 34
7739 34 84 120 43 26 -97 -37 -29 213 -230 -58 -214 108 -110 -191 112 -7 23 -46 -137 -61 -147 293 -68 -106 132
7764 132 47 -72 -3 -34 -187 -140 -182 -168 -41 -101 37 45 52 110 -84 27 96 143 -90 190 -77 77 73 -3 189 -48
7790 -48 -18 253 -157 -82 -64 -199 222 -63 100 23 45 70 93 80 -15 -102 -55 -169 -34 -213 301 -171 124 -197
7814 -197 -4 285 10 51 77 -69 -19 -33 -52 -54 148 150 45 -97 -115 -123 57 211 92 53 -58 -220 143 75 128
7839 128 135 46 -102 -72 -178 98 210 -37 -73 136 61 -241 83 -230 71 39 -28 -49 -208 44 -42 -21 -210 -286
7863 -286 222 132 -88 -358 64 -84 142 376 -59 45 31 10 -185 96 184 111 -6 -128 215 285 42 -221
7885 -221 181 -32 -168 186 -125 -23 66 160 73 -2 -29 106 114 14 -65 -87 -99 -34 18 -90 -243 -307 -149 -1
7909 -1 64 -11 -71 16 -169 135 -211 15 9 -10 88 13 190 -63 -52 212 53 215 -268 45 159 -108 -57 43
7933 43 205 212 36 -156 20 -193 63 46 -95 25 -122 74 71 -13 -79 -115 115 -237 -248 -69 50 -248 117
7956 117 84 92 -167 -317 -14 -51 -25 17 8 -24 139 -10 7 -203 -164 -236 -55 -51 -94 -136 -175 -47 -125 268 -63 -145
7982 -145 -7 90 413 -9 -284 69 53 -28 43 49 -85 -25 -128 127 21 125 79 -34 209 72 -68 64 -36
8005 -36 -98 51 28 257 -196 115 27 -57 -42 41 360 67 31 -189 75 5 -62 -184 -148 179 -3 -70 83 -132
8029 -132 -145 149 -14 21 206 -2 85 216 -81 73 -82 -29 49 -344 -18 38 -80 239 173 191 27 -1 31
8052 31 -50 42 -2 57 -70 -34 11 -262 -157 -35 114 -83 -158 -140 29 71 -61 -5 -180 -12 157 -159 -194 -232
8076 -232 3 264 262 -62 62 -34 -92 138 -128 138 143 -111 -244 -77 -7 18 -12 122 -41 -124 14 -162 37
8099 37 -79 137 24 -137 11 -87 -68 113 62 26 206 28 -68 101 -273 -151 253 -234 -84 183 124 -53
8121 -53 47 36 -147 -275 83 191 -240 52 100 40 187 62 -83 48 -54 -135 67 15 -14 230 71 -59
8143 -59 121 167 -29 -24 112 -133 -218 -58 -16 198 -76 -155 -79 171 58 122 -115 102 -40 4 -6 57 33 -62 128
8168 128 258 -148 61 215 -33 58 149 -227 36 8 -39 -6 72 -109 37 193 -139 -152 152 -125 116 -36
8190 -36 121
8191A21
$$ Imaginary data points
##PAGE= N=2
##DATA TABLE= (X++(I..I)), XYDATA
0 0 0 0 0 0 0 0 0 0 0 0 0 0 0 -8 8 -8 8 -8 16 -16 18 -24 26 -32 40 -43 50 -58 66 -77 88 -99 114 -129 146
35 146 -162 182 -203 225 -252 279 -311 344 -382 420 -464 513 -564 622 -684 754 -832 915 -1011
54 -1011 1121 -1242 1382 -1542 1731 -1956 2232 -2573 3012 -3598 4419 -5660 7734 -11825 22875
69 22875 -113031 -296787 74885 151278 -74695 -24563 118016 2311 -13065 21436 -33224
80 -33224 7743 83498 35 -75111 -12083 20890 -22994 3040 26264 -1738 -36279 -15816
92 -15816 32635 7171 -6401 21633 -6697 -32589 -28361 -10902 7261 24494 19404 -22482 -9784
105 -9784 11486 -15126 23242 52473 -7391 -23359 23168 -9207 -50833 47197 73173 -45772
117 -45772 -51804 8239 -13084 -24801 17439 16916 -14827 1792 -11443 -27557 34459 39499 -10978
130 -10978 1912 17121 -18840 -33479 12059 25371 -9802 -23823 -9518 24946 17410 -19579
142 -19579 2437 29650 7539 -25156 -18764 13552 14446 -5604 -22358 -8552 6991 -21233 -11793
155 -11793 33260 26641 -2948 -10509 -911 -2206 -2849 6578 10481 16615 -7152 -31571 -6470 8636
169 8636 632 -351 2799 -1154 -6215 731 812 5431 10415 -8445 -6429 2675 -9107 850 19203
184 19203 5594 -12402 5911 11119 -17118 -179 25893 2133 -16518 -7368 242 -7712 -7231
197 -7231 -252 2933 12312 -3042 -23401 3371 28989 6475 -21001 -1528 10707 -21258 -17058
210 -17058 22723 24263 -2945 -9398 4162 5083 3556 2740 1361 16489 3653 -34370 -21451 17769
224 17769 7705 -21438 161 17965 -10688 -12449 11542 13180 2706 -5280 -9655 -5556 6398
237 6398 547 -8286 13366 15109 -14283 -14737 9981 16267 3747 5708 2314 -16461 -7491 7900
251 7900 -1117 -4552 7767 2422 -19368 -8802 9872 2374 3920 6199 -7557 -7239 4193 -2278
265 -2278 -3248 19910 6689 -28098 -6801 19235 867 -5698 11469 9237 -6685 -7054 -4331 3673
279 3673 16270 -1071 -14650 2645 2596 -14470 -5728 18894 11225 -14226 -12503 4736 11194 -728
293 -728 -6430 5257 1774 -13647 -12131 4305 14459 4879 -5778 -2257 4549 -1280 -7566 8941
307 8941 15497 -4021 -10990 -4410 1077 5299 4193 -2028 -147 4670 -6064 -8443 8620 4854
321 4854 -5116 1642 -4560 -16708 189 16038 -2865 -6643 11176 -3293 -15550 4397 11728
334 11728 2716 1740 -31 -6752 2197 5518 -6195 5438 15788 -7646 -18364 2640 14512
347 14512 671 -9306 -1286 4314 -4038 -13092 530 15501 1454 -11262 -4843 2241 1555 -3533
361 -3533 394 11292 6370 -12221 -7549 14034 6324 -6739 4622 6221 -4253 -4652 -3211 167
375 167 10080 3619 -14896 -5202 7920 -6652 -4715 13074 3025 -11212 -1948 3000 -2626 4915
389 4915 7427 -3965 -3210 -1065 -4752 1572 7353 1471 -2074 643 -2525 -1608 6873 3750 -2758
404 -2758 -777 -1420 -4333 -4214 -221 5408 2100 -6807 -5172 5537 4088 -4003 2228 8836 4173
419 4173 -6510 -11412 2674 12105 -1725 -9760 3917 5340 -10212 -5251 9430 5170 -3668 -5408
433 -5408 -2699 3680 2356 -4667 1851 11963 -3564 -15075 4385 13890 -373 -4424 1465 193
447 193 -2686 -1432 -1354 3782 5883 -5146 -5934 4904 1208 -6107 1759 6146 -4577 -8324 -359
462 -359 543 -1174 2148 1730 -1102 -824 2020 2612 2981 6035 3988 -333 -2119 -3238 -1473 3620 3519
479 3519 -6423 -6759 3368 -1744 -8231 4425 11062 -3840 -10276 1963 4753 -1674 -1525 -452 1340
494 1340 877 -6601 -5277 10127 10380 -7029 -4176 11321 3055 -8549 2355 11130 1081 -7715
508 -7715 -4277 111 716 -2190 -5448 317 4598 -5506 -9838 3332 9615 -2021 -4685 4639 1478
523 1478 -5560 933 7517 2895 -1504 -1582 -2205 -393 3217 1007 855 2636 -1873 -4937 834 4314
539 4314 -40 -224 1225 -4513 -5160 1477 2299 -2727 -1659 1930 -1886 -4690 867 5666 4270 -720
555 -720 -1730 1323 2606 -620 -1721 4035 5137 -5403 -8867 1768 6088 -2607 -4129 4243 3026
570 3026 -4745 -4491 3042 7457 1086 -6218 -1484 4615 -1132 -5799 3212 7022 -3253 -7395 -545
585 -545 4253 2580 -1575 -668 3530 1259 -6001 -2102 7572 3110 -4778 -1856 238 -1755 -597 2042
601 2042 1284 792 -824 -3176 514 4161 607 357 2227 -1272 -3893 -410 1764 -356 -378 -31 -2649
618 -2649 -4285 -317 4224 1308 -2695 1109 2707 -2890 -2247 3439 3637 548 -1119 -3735 -134 4499
634 4499 -1905 -3138 7056 2781 -9647 -2960 8866 1325 -4991 984 1550 -2526 -3025 -2134 1894
649 1894 5424 -2525 -7946 1784 6767 -3181 -3186 6967 4435 -4716 -3735 3370 3748 173 -1007 -196
665 -196 882 -1142 -2420 569 3523 1089 -3270 -2691 1624 -100 -2478 1634 2930 -3116 -3751 1418
681 1418 -391 -1090 4470 1163 -4507 -17 2840 -1261 61 3228 -294 -384 110 -3950 455 7076
697 7076 80 -5929 1181 3602 -3217 -2168 3540 1600 -2558 -3352 -1187 2098 568 -2347 316
712 316 3222 -1674 -4664 1405 5133 1000 -3471 -838 3579 23 -4430 1037 5180 529 -4290
727 -4290 -938 2512 1327 -826 -399 2243 1645 -3764 -2919 3712 2386 -3137 -1780 1219 -1316 -2242
743 -2242 428 1414 1498 -487 -2565 -647 1813 270 -124 1945 -15 -2098 383 1150 -414 1405
759 1405 2248 -411 -1836 -78 1150 927 178 -1189 -30 229 -2921 -1916 2616 2166 -2853 -2444 1939
776 1939 335 -3016 -80 3737 1733 -2757 -2467 1817 2499 -697 -1232 2134 2512 -2303 -3631 2974
792 2974 4980 -1719 -3887 1974 1744 -3180 -1986 2881 2186 -2367 -3630 -517 1929 786 -2559 132
808 132 3549 -843 -4517 677 4792 279 -2273 735 1043 -863 279 1148 550 354 156 -1488 -1054
825 -1054 1150 484 297 264 -1051 -1957 307 943 -978 752 2262 -2274 -3362 1508 2558 -989 -1070
842 -1070 1221 305 -1866 -1309 1386 3252 729 -3303 -1235 2467 200 -2890 601 3484 -1232 -4509
858 -4509 -377 3253 1239 -1403 -271 1688 335 -2476 -606 3263 2015 -2962 -2414 1389 851 -2419
874 -2419 -1019 2711 709 -2826 -1221 1599 1269 -227 -395 198 586 -747 -1548 1489 2883 -496
890 -496 -2079 857 784 -1282 806 2141 -255 -899 43 -1044 -173 1203 125 -893 -840 -1414 -839 947
908 947 -823 -1155 939 456 -2307 -405 3219 1992 -1180 -593 1592 1268 -1450 -1255 2125 1791 -2150
925 -2150 -3033 562 2075 -908 -2005 1302 2665 -1303 -3434 1180 3049 -1111 -2759 444 815 -1215
941 -1215 -1518 689 2325 1050 -1762 -820 2544 1645 -1618 849 2950 -733 -2315 413 1358 -645
957 -645 -493 -404 -521 -116 -730 -297 853 472 -1082 -373 615 -552 -336 1190 624 -764 -445 334 228
976 228 -433 325 1015 33 -1261 10 1194 331 -499 931 1361 -472 -1928 -736 1636 377 -2339
993 -2339 -1266 1455 -732 -2399 710 2749 467 -1764 -530 1705 1232 -437 -1054 1424 792 -2795
1009 -2795 -1637 2177 1329 -1849 -332 1568 485 -1079 -355 1491 1640 -931 -2126 402 1689 -953
1025 -953 -1754 1077 1129 -1504 -1103 551 1018 561 -203 -544 -134 -182 -572 272 784 -104 -421 -179 -39 -142
1045 -142 557 1070 264 -1274 10 907 -30 -171 1157 385 -1552 -733 1306 761 -378 -510 -167 -26
1063 -26 -881 -1550 457 2131 -537 -2620 832 2213 -1420 -1481 1823 1757 -1023 -1411 284 1235 397 -1073
1081 -1073 -646 1720 402 -2129 194 2774 472 -2182 -434 1166 -378 -1546 171 1118 -262
1096 -262 -1404 -673 441 765 96 -444 293 534 -973 -412 1244 728 -790 82 818 -495 260 992
1114 992 333 -632 -45 53 -656 -41 320 143 56 -775 -766 711 345 -888 -550 1081 268 -1970 -391 1375
1134 1375 343 -1261 -257 907 39 -900 -128 1221 1031 -1169 -1040 1276 1109 -1261 -881 1645 894
1151 894 -1924 -1346 1203 1023 -743 -1231 524 717 -1245 -1191 789 1126 -1021 -1664 387 1337 -398
1168 -398 -913 566 813 -306 -963 177 1358 344 -344 147 556 90 -716 341 738 -250 -382 -8
1186 -8 -394 -503 154 490 -193 -597 124 169 -503 -260 518 578 -432 -788 14 703 284 -702 378 1218 -586
1207 -586 -1379 915 1811 -397 -789 830 637 -125 -738 -94 989 -16 -1341 -737 1471 119 -1700
1224 -1700 189 1332 -472 -1581 237 1153 16 -794 -305 1073 139 -702 -460 1104 886 -757 -429
1241 -429 899 641 -811 -146 1090 243 -1087 -142 650 1 -64 -95 -500 -624 -18 -69 -118 361 -174 -469
1261 -469 207 281 -205 651 462 -829 -529 882 102 -608 -81 929 -120 -785 -22 513 583 -357 -790
1280 -790 112 576 -915 -984 1203 674 -962 -987 715 594 -980 -438 1004 740 -1078 -1037 718 967
1298 967 -124 -589 641 848 -349 -1064 549 1413 -257 -998 283 792 -179 -258 282 533 103 -773
1316 -773 -286 540 50 -598 -216 557 -575 -757 264 539 -245 110 353 -70 203 159 113 136 -30 -67 65
1337 65 83 -368 15 738 -107 -375 376 958 188 -729 73 733 -489 -1058 -238 734 -235 -927 -2 565
1357 565 -211 -1166 74 1298 383 -962 -273 1107 8 -875 -69 908 34 -826 -211 750 689 -393
1375 -393 -469 674 547 -695 -541 922 289 -751 -345 537 -154 -810 -253 384 224 -46 -481 253 689
1394 689 -96 -156 365 464 -122 113 395 87 -414 -53 66 -328 -137 433 236 78 -403 385 -204 -259 -188
1415 -188 460 299 -349 -789 18 384 -612 -580 641 474 -798 -339 913 841 -609 -442 606 816 -347
1434 -347 -537 252 746 -342 -1028 148 924 -144 -770 474 888 -359 -897 349 664 -284 -704 -16
1452 -16 504 -414 -803 120 781 137 -718 -17 727 -56 -92 356 264 -331 -469 100 264 -140 -213 81 -283
1473 -283 -263 -227 -60 289 -304 -342 219 147 -480 253 625 -32 -520 -222 379 240 -361 370 687 -78 -600
1494 -600 380 570 231 -389 -165 755 255 -716 -345 1020 239 -728 -432 968 34 -459 76 821 175
1513 175 -718 -420 422 566 -590 -611 650 239 -637 -154 826 474 -609 -320 290 442 -231 -119 120
1532 120 515 -52 -403 189 167 -247 -67 290 184 -593 -305 193 -195 -71 70 196 -91 -246 172 133 151
1553 151 -353 110 104 -64 -306 372 543 -288 -258 195 460 -199 -251 441 455 -129 -531 187 541 -221 -482 143
1575 143 413 -520 -759 -14 693 -61 -719 360 677 -481 -681 239 493 -164 -647 -8 640 252 -895
1594 -895 -85 1024 -11 -330 -115 502 -50 -508 -54 406 -100 -480 -153 88 -141 -541 -85 184 -15
1613 -15 -66 196 281 -260 -227 199 161 -87 35 391 183 -396 178 413 123 -208 255 204 407 -215 -437 581
1635 581 263 -470 -263 678 20 -664 -301 583 -49 -594 -180 537 287 -447 -371 436 497 -458 -642 391
1655 391 478 -403 -230 502 544 -323 -18 672 741 -159 -459 163 311 -325 -298 171 345 -326 -580 34 320
1676 320 -159 -309 247 172 -316 -243 274 135 -326 39 166 -216 22 54 -5 246 -128 -87 42 61 -242 130
1698 130 301 -298 -353 382 131 -87 -173 321 108 -191 -624 154 267 -146 -452 117 474 114 -469 190 469
1719 469 -336 -507 67 524 47 -366 168 421 -169 -475 -45 397 211 -413 82 402 107 -636 -69 656
1739 656 -47 -598 35 220 76 -353 -214 271 150 -120 -69 489 121 -344 -90 129 -88 -114 52 158 234
1760 234 -30 252 90 42 -200 145 159 -185 -146 185 31 -171 83 377 184 -497 -216 273 203 -385 -88
1781 -88 303 77 -201 -92 209 282 -217 -155 468 463 -391 -376 325 396 -359 -260 327 142 -434 -307 157 274 -445
1804 -445 -506 -26 453 -92 -477 213 80 -148 -425 398 326 -171 -245 -107 206 -108 -108 165 181 29 -10 303
1826 303 194 -261 -21 -106 -26 33 -208 141 26 -415 124 355 8 -173 -13 73 -134 -26 -33 236 -184 -295
1848 -295 -209 266 -32 -391 213 447 -3 -414 198 547 56 -466 125 472 -141 -601 -31 360 -150 -287
1868 -287 -191 405 -52 -520 76 642 182 -406 -167 338 133 -290 58 485 -32 -159 -156 113 246 -191 -174
1889 -174 -45 238 -220 -151 301 -88 -238 -100 106 45 0 106 60 -10 -239 -34 74 -21 -137 128 271 -61
1911 -61 42 150 275 -230 -78 333 242 -222 -35 320 -18 -7 -270 231 390 -174 -249 285 135 -58 -343
1932 -343 211 463 -174 -378 226 143 -510 -271 202 216 -279 -142 174 213 80 -394 -22 255 -29 -432 -1
1953 -1 464 -365 -256 -170 281 -236 -162 20 -203 198 -332 186 -236 7 -142 77 164 -133 -128 80 87 -243 -66
1976 -66 136 84 -20 76 124 108 -111 -59 198 6 -303 149 288 22 -158 16 396 281 -497 -280 19 44
1998 44 -613 -3 231 -202 48 -181 166 40 -303 -155 293 276 -209 194 206 115 -416 -116 427 116 -301
2019 -301 -127 112 183 -283 -212 221 160 -318 -408 322 111 -252 -5 248 159 -77 -35 68 164 -102 37 106 249
2042 249 -265 -139 -65 -184 -13 28 450 168 -121 219 310 -209 -164 73 245 -265 -169 295 67 -187 -222 -310
2064 -310 279 -105 -260 441 173 -336 -108 23 311 -338 -110 7 294 54 -457 327 152 -24 -165 204
2084 204 342 -222 -137 164 424 -219 -250 261 143 -285 -245 25 215 -117 -353 39 349 61 -259 -146 555
2105 555 44 -35 -62 432 327 -319 204 194 23 27 134 338 221 -78 -270 -1 -171 78 188 139 -124 -211
2127 -211 -22 49 -53 -221 73 28 19 -57 432 216 -108 -26 32 -81 -117 -128 410 266 -103 84 236 245 -400 -198
2151 -198 418 97 -342 -1 -5 154 -277 -83 210 260 -420 -131 104 251 -216 -286 151 61 26 3 249 166 -198
2174 -198 -199 344 -51 -273 -209 -139 206 -13 -150 245 28 -233 -117 -57 -108 -259 -71 143 148 -109 -24 402 -131
2197 -131 -92 -66 64 -51 50 154 239 -258 -354 57 143 -106 -250 217 -1 -197 -589 -12 43 -76 -185 -163
2219 -163 368 -67 -237 82 350 -28 -186 4 179 14 -425 87 150 199 -409 238 370 39 -271 126 214
2240 214 75 -192 -184 85 186 -300 129 247 125 -371 -83 144 50 -58 16 137 -221 -231 -75 43 -75 -221
2262 -221 -5 214 155 -132 135 -52 -129 -69 270 -211 -324 -33 358 94 -254 -118 275 44 -204 106 1
2283 1 218 -301 -28 187 81 -260 -222 212 196 -411 -261 319 320 -105 -240 403 385 -66 -84 322 65 -57 -303
2306 -303 173 250 -251 -200 26 257 -386 -263 98 -119 -164 -372 -88 123 -219 -161 -21 105 -106 -76 61 -10
2328 -10 260 18 47 101 -56 186 11 66 -142 58 3 19 16 -120 92 -143 -200 170 -3 -190 -21 -87 244
2351 244 48 -41 -22 192 -35 -48 -43 -28 30 -224 38 246 41 -224 105 174 126 -137 40 420 78 -157 262
2374 262 209 -22 -124 -258 365 96 -296 137 391 -76 -505 -238 282 3 -330 213 268 -2 -270 -140 41
2395 41 -25 -128 2 29 31 -157 69 80 -84 -154 3 50 -282 -28 69 -4 -291 36 -171 -70 -60 99 143 165
2419 165 -58 -59 279 229 -390 -125 170 -216 -147 -68 138 192 -82 77 138 -6 -182 -80 248 206 -68 -211 77
2442 77 84 -263 -260 133 211 22 -233 257 352 -274 -100 45 -85 -117 -300 78 223 -63 -207 123 188 -38 -211
2465 -211 113 207 -181 129 -8 -17 -259 84 60 377 130 -184 -193 110 49 -8 -40 -13 31 128 53 5 -163 -13 222
2490 222 -227 98 -58 166 161 -83 115 138 -112 -149 -72 22 16 -349 67 575 -186 -214 30 305 98 -207 16
2513 16 106 18 -202 -204 172 177 -208 -98 312 6 -404 -91 237 317 -277 -194 133 111 -285 -18 197 263 -153 -23
2537 -23 271 161 2 -15 -165 208 -246 -45 -159 -36 187 164 69 126 -163 126 144 113 -162 43 106 -75 -50
2560 -50 89 127 -40 -16 6 184 25 -195 -143 130 65 -127 185 -84 -211 -249 134 22 -400 -282 97 62 -465
2583 -465 -236 99 272 61 -116 156 266 -32 -109 106 26 114 34 342 115 -226 -4 123 317 73 -91
2604 -91 60 103 39 -230 -23 125 -227 -283 8 156 -104 -120 89 115 -28 -194 45 238 -107 -90 250 50
2626 50 19 -26 320 7 122 79 172 161 -115 -127 41 -99 -63 -165 262 -25 -423 26 152 3 -255 -206 275
2649 275 -35 -126 -284 157 -99 -328 72 119 116 -258 -206 274 156 -267 -20 120 104 -179 -215 72 214 -301
2671 -301 -92 106 -15 -103 -150 286 25 -212 -23 200 340 -156 -165 130 129 -203 85 230 301 -97 -277 -10
2693 -10 -133 -141 145 95 -171 26 37 132 100 -2 121 263 -59 -215 -4 225 -28 -86 -99 17 -140 -277 126
2716 126 248 -24 24 70 301 146 -172 -46 569 -103 -160 174 141 -234 -236 -64 -15 -241 -291 -67 45 93 -87
2739 -87 230 159 -13 -230 158 222 -154 -182 30 122 -12 -119 116 174 -73 43 296 417 -109 -288 -72 -227
2761 -227 68 -265 248 105 -187 -162 -23 185 78 -20 113 231 -280 9 -63 147 -85 81 57 -49 -122 -191
2783 -191 73 39 25 147 198 94 -194 -59 242 184 -9 -124 205 -15 31 13 68 402 -247 -316 -60 36 -490
2806 -490 139 278 -61 -67 -64 148 119 -230 -53 157 226 -214 -60 138 -110 -242 -221 45 59 -42 -2 -399 -125
2829 -125 -123 -98 205 40 -53 -116 199 -5 -172 -141 166 4 -265 268 229 54 -142 3 20 -216 8 45 87
2852 87 -57 -58 93 40 3 -52 -22 159 -102 -200 300 44 -22 -4 -23 167 -52 -159 -72 38 8 -161 99 -19
2876 -19 87 -135 278 142 114 -25 -131 214 175 -32 126 131 141 -59 -65 450 69 -338 -96 49 -121 -7 -14
2899 -14 266 -55 168 -93 -38 33 181 135 -39 -32 -13 92 48 160 4 121 73 57 -85 205 181 -43 -82 94
2923 94 132 196 -84 -99 -161 -140 17 -102 8 -33 -412 37 164 -347 -40 215 147 -149 31 19 166 -66 -80
2946 -80 71 290 197 134 56 277 32 -122 -65 399 -43 -109 66 -54 -177 75 -3 38 -109 -221 -108 -47 10
2969 10 97 239 102 -76 -162 -80 -114 -2 -81 132 1 -171 5 170 33 -4 153 106 106 148 113 243 36 58
2993 58 60 -55 187 1 -96 -33 87 -184 145 38 -225 -36 105 -6 53 28 7 234 174 -276 212 236 -41
3016 -41 -200 74 104 126 -303 -261 157 65 -54 -379 383 -39 -25 52 197 -28 55 19 33 106 -99 -4 119 -11
3040 -11 -269 -78 182 150 156 -91 167 -26 -59 72 181 -34 63 156 89 -34 -320 186 -50 -87 -107 -110 52 -251
3064 -251 -21 -83 202 -239 -50 -32 -105 -212 -200 144 350 -183 -157 -213 -156 36 -85 -208 123 36 -130 164 15
3087 15 -124 -192 -76 -115 62 -54 212 37 81 -285 170 -142 -122 -257 -38 -73 -85 -185 0 -9 -145 103 -17
3110 -17 -189 -204 -152 0 47 35 -132 78 305 -52 -89 5 184 3 -300 -96 -85 -81 -178 74 -46 -130 29 6
3134 6 31 31 233 -98 13 -85 113 7 -2 131 50 135 -177 -231 -115 101 114 87 0 -38 97 -70 32 251 -85
3159 -85 -96 27 176 69 -239 169 160 -30 -79 -24 358 77 -108 247 -84 -36 -138 3 6 76 14 -11 186 -148
3183 -148 -93 122 69 -100 14 -129 113 47 -351 -305 335 -17 -227 -35 -73 -167 5 -63 199 -39 0 147 138
3206 138 45 -58 -49 62 43 -18 -26 -95 -95 125 196 86 -57 -163 -165 72 266 10 106 108 -200 -39 95 167 28 -232
3232 -232 -7 19 -163 -160 124 90 -113 -125 93 124 34 -174 31 52 29 77 207 -189 -58 -263 7 -165 179
3255 179 -65 -5 -125 -66 -82 -6 39 -92 3 133 213 -152 130 155 76 -207 -20 -22 -19 -38 45 337 7 127 110
3280 110 -281 388 -28 118 -32 38 -167 54 188 229 164 49 148 -125 -268 45 17 60 22 186 318 17
3302 17 -287 108 123 61 -131 -12 46 -15 -206 119 45 -102 -25 44 118 31 -272 140 394 2 -390 -68 32
3325 32 72 -86 20 150 10 -145 148 208 216 -82 -30 -51 170 -23 34 -142 -109 -243 -207 -27 -141 209 22
3348 22 193 -272 -161 199 -57 98 -121 -40 2 -41 -331 -73 18 -245 7 300 120 6 -164 -280 -69 -169
3370 -169 104 64 81 -97 -177 -189 42 84 42 272 -21 -62 -124 -35 -2 15 -139 1 50 16 -227 126 -77 24
3394 24 -60 145 -74 4 -189 37 143 -73 -78 -62 86 220 -105 229 80 98 -55 214 -22 78 -32 38 302
3417 302 125 -55 117 103 152 -203 -102 89 -114 -126 -121 110 14 103 -18 45 -240 77 -73 21 -93 160 67
3440 67 -37 -201 24 180 156 14 -39 176 163 -119 -154 -17 -196 -125 123 2 31 -196 -29 -100 -6 -109 191
3463 191 175 55 6 -116 -35 -109 11 -95 13 -59 -335 -33 110 -18 -171 149 -31 -95 57 133 344 -56
3485 -56 -103 -42 175 -63 5 -203 133 64 -16 18 -134 101 -83 198 252 83 -14 -177 125 -155 69 147 189 -44
3509 -44 -86 96 -143 -221 -123 -295 147 49 -205 32 249 -228 -39 92 173 -59 -4 -38 81 -236 -385 98 211
3532 211 57 -96 -49 -8 103 -140 -155 132 58 -13 -22 41 34 -146 -99 -40 122 159 124 1 -18 -196 23 2 -26 92
3558 92 -89 210 -107 -85 153 19 120 -21 281 104 -118 -69 86 -42 1 -101 -35 38 23 -199 38 75 -284
3581 -284 345 83 -37 155 -107 -182 -125 -155 -149 107 -35 -116 -229 8 126 68 196 144 -146 -95 -11 -16 174 -134
3605 -134 2 -121 19 -29 -48 82 258 -188 21 96 -107 71 -64 50 198 -41 -119 103 145 -212 47 -6
3627 -6 154 -152 10 -151 94 11 233 32 -243 -44 -233 155 -12 155 -64 135 -27 -291 -135 -128 -241 -92
3649 -92 162 -11 -28 309 -96 -26 -2 -98 -67 244 -111 -113 -34 -64 27 -217 129 141 -84 29 -22 109 41 -228 -31
3674 -31 -39 -415 -28 1 -72 -32 -128 33 190 104 -60 76 -39 -203 -403 421 -92 187 -5 -390 -111 -72 -128
3697 -128 -138 0 138 -18 310 128 196 -58 -28 -26 -183 -118 246 -193 23 -125 -75 44 4 -214 -231 188 -29
3720 -29 -183 176 -57 -116 -76 182 317 -51 -247 -210 -64 -100 54 134 -110 -36 -56 80 -90 34 -348 161 220
3743 220 17 131 -47 206 -105 124 24 197 -21 45 -64 289 154 -73 24 192 -275 55 -58 100 36
3764 36 -79 181 -93 -247 -92 -189 72 -27 -131 2 133 -143 84 112 -65 -4 42 160 -29 -116 132 109 169
3787 169 -42 -54 -181 -295 -23 86 -50 308 364 -91 -190 14 38 -127 18 -266 3 11 -38 57 250 -37 200
3810 200 141 -66 -335 -236 -247 2 81 139 145 -302 -126 -48 33 103 -276 -109 7 -59 114 -375 -289 62 -136 -28
3834 -28 131 27 107 -91 -95 94 -114 85 111 41 -259 200 0 83 136 -70 189 -132 20 -54 -218 -224 -13 25
3858 25 68 12 -55 192 -6 -103 -72 -142 -94 44 -97 -25 60 49 40 -35 -149 104 -56 -18 66 6 -174 127 246 -106
3884 -106 -161 108 165 -74 -81 44 -75 -127 -58 17 45 -95 -97 291 -66 -22 -99 179 20 25 -178 -180 34 -61 209 24
3910 24 82 -68 -208 5 -42 152 204 212 48 54 41 -94 112 -48 -72 -30 -117 -148 309 -94 -342 214 31 -57 -206
3935 -206 -88 -5 -18 -112 170 -237 -73 -138 -17 245 185 -31 -8 204 -141 -7 41 -30 28 17 10 -80 75 151 71
3960 71 15 -328 113 146 -105 -36 28 -89 -215 84 113 -8 -19 -79 105 -40 -106 42 16 108 241 -110 -102 -65 -146
3985 -146 -187 -307 37 95 -117 -51 -78 -208 154 275 58 183 -86 33 -26 -34 2 46 -218 12 -12 -175 -180 21
4009 21 121 -139 -55 15 214 -97 22 152 91 21 315 -24 -31 92 -206 71 -136 93 101 104 -131 -147 -34 2
4033 2 -86 -26 48 -233 -43 -7 -25 -29 87 224 57 5 120 -116 49 66 184 138 170 51 -109 -273 -157 -149 -119
4058 -119 135 42 -217 32 2 -77 92 -43 -92 103 -18 89 200 98 -293 29 -6 50 6 -32 -53 251 -138
4081 -138 27 55 8 -183 -228 -36 -7 96 -9 2 -14 125 -30 3 -2 -21 -203 59 -126 67 -74 -160 -97 68
4105 68 -34 -41 236 -3 89 77 114 2 -71 -41 80 -54 77 95 52 94 -122 131 -3 74 -39 82 -50 -66
4129 -66 177 122 60 93 -96 -145 83 -185 120 73 -58 -72 -283 -96 -107 103 47 7 -15 9 -113 237 155 -74
4153 -74 -244 -90 206 203 -2 139 -29 -42 125 106 83 184 -51 -31 -27 -121 -149 286 96 -80 166 42 -114 188
4177 188 -40 -41 17 -231 194 -44 -11 110 49 -43 87 81 -53 -158 94 -89 -260 217 -269 -64 -114 12 -158
4200 -158 83 172 -219 -78 -124 -171 175 171 160 39 -84 -25 -55 -76 -69 81 97 -81 -38 -71 -110 -85 108 -36 -204
4225 -204 -100 -119 184 -37 45 -209 -3 -68 123 50 -147 -23 112 108 -26 22 77 -29 -92 43 -84 191 -99
4248 -99 208 -161 51 -109 34 -18 -18 159 -75 -74 -177 196 -83 -96 217 -113 -29 247 277 -106 103 -75 100
4271 100 155 88 -52 9 -177 39 -200 40 -108 -96 16 -142 25 -27 130 -5 243 -65 170 -82 -236 -99
4293 -99 -30 -15 44 -68 189 179 105 28 12 69 60 -30 108 302 -10 132 116 -171 -44 -278 143 -56 -321 -227 -29
4318 -29 145 -75 -16 101 -90 23 6 -170 134 223 24 -168 79 -96 26 -27 119 32 33 -215 153 -72 -53
4341 -53 71 -156 99 -108 -85 -362 245 -53 -21 111 30 -129 91 230 225 -142 206 82 169 -66 -218 72
4363 72 -119 47 182 -139 140 -56 -119 17 10 2 114 -70 137 -60 -121 -12 -28 -161 -199 -4 -59 191 -89
4386 -89 13 -23 20 22 -133 32 112 -19 69 95 -336 135 81 -177 75 15 -181 -16 75 -198 307 34 51 263
4410 263 -8 -102 106 194 160 128 -89 -142 126 206 -161 -152 -49 5 135 -145 -193 -44 0 106 -175 -244 -60 -93
4434 -93 -144 -110 -73 156 293 -253 155 -54 95 138 197 -18 -97 54 14 307 64 102 146 18 9 321 -164 200
4458 200 -47 -192 100 94 159 90 11 23 114 -9 -99 61 82 -125 76 -39 101 69 -167 -170 58 120 -60 -10 -60
4483 -60 -62 16 4 -82 -144 125 145 -48 -13 -201 128 118 271 17 -23 222 124 -52 73 -319 -137 156 -7 156
4507 156 -69 26 69 90 -98 181 77 20 73 -40 77 -200 -18 298 190 55 -36 195 182 -107 -72 50 -86
4530 -86 60 244 -217 16 -40 41 9 105 86 -26 -64 -178 48 90 11 71 113 -29 5 -26 -80 38 34 254 256 -93
4556 -93 42 -186 -130 18 37 135 -75 144 56 135 -52 -32 84 89 -67 121 -26 133 -79 50 -132 73 5
4579 5 10 177 73 -120 -104 172 -34 -84 -201 -63 39 -136 25 130 208 -53 -200 28 -175 5 154 -78
4601 -78 71 -101 40 -164 -190 -124 134 60 129 182 -76 -7 119 110 35 -7 -168 63 62 -25 30 13 13 31 125 -96 69
4628 69 -29 -86 -120 -17 16 43 -190 106 -220 212 -32 -90 154 99 -106 96 18 -113 -138 121 -152 -124 96 -14
4652 -14 104 140 -52 -247 -83 80 -280 -44 37 -98 22 -114 -152 31 72 -339 94 -206 -40 113 137 101
4674 101 -53 -13 -224 -93 -56 195 35 -169 -184 57 66 -189 -278 26 -194 -2 188 12 -135 -215 7 -23 194
4697 194 40 83 127 -27 -55 -141 -120 -1 105 102 -129 -17 128 -70 -58 -156 -110 -298 -76 17 147 -132 16 -208
4721 -208 -19 -112 144 -90 -110 125 184 82 -185 76 -195 -80 209 -58 74 3 -138 93 -10 61 38 -95
4743 -95 132 -109 202 -93 20 253 -167 108 243 197 -239 47 135 174 -183 -124 -32 -125 27 -178 304 195
4765 195 -256 79 -236 -102 341 -221 3 125 26 129 -56 214 -86 -42 -234 -151 -77 -38 -66 32 19 -169 -89
4788 -89 -134 87 125 16 204 160 -206 -80 -84 52 -15 -256 -17 24 105 86 170 33 146 -223 -104 -227 -155 2
4812 2 -24 59 111 51 -167 73 -79 82 99 -196 -173 89 271 -15 63 90 -80 153 83 -50 114 -147 77 286
4836 286 0 47 59 92 -137 39 264 81 -327 288 -192 -126 66 161 -39 28 153 7 118 3 -24 46 2
4859 2 -210 -81 -35 149 -32 174 -35 144 -60 -55 115 -95 191 39 -182 88 100 -135 23 -244 180 97
4881 97 -247 92 61 94 -77 185 -3 -16 -204 -43 -158 -165 167 9 -106 -239 -84 68 -31 34 -1 -11 81 -177
4905 -177 -11 44 105 -18 50 39 126 61 116 -44 -84 122 117 -57 -262 116 -233 52 16 -104 -198 242 22 -6
4929 -6 -38 99 -82 -132 0 88 128 -192 152 270 -87 103 -78 18 -20 -88 -41 -197 41 39 -300 144 -63 77
4953 77 -198 21 -165 168 -57 19 18 -16 -165 -13 34 13 -69 -35 52 -174 -46 -234 -13 -29 -107 -202 -128 -125 72
4978 72 -225 121 166 232 -296 -117 46 -138 -156 -184 -233 113 225 25 82 -185 140 87 -171 166 120 185 21
5001 21 35 -17 -301 -113 158 -134 -174 -117 25 81 194 -254 -14 -30 78 -14 24 160 -202 -70 -197 173 8
5024 8 125 94 340 8 -56 275 -85 283 -10 -34 88 -190 -49 3 -83 17 -46 -68 276 -125 -188 -31 -143
5047 -143 222 23 -274 117 62 106 107 -37 264 -324 -181 -24 197 87 -11 -33 -1 -101 -240 -27 -24 64 -184
5070 -184 -159 -212 35 2 -92 92 -128 248 26 22 -151 133 -60 129 -161 -156 -7 81 92 -37 -121 46 -138 60
5094 60 1 105 311 73 158 -110 -35 100 -87 -20 -109 -178 4 -303 -117 -91 -127 -330 10 -39 -169 -142 15 -21
5118 -21 103 105 -100 108 68 110 33 48 161 79 -148 112 -15 -88 -97 -116 75 -115 56 -107 156 -9 -15 31 -63
5143 -63 -86 44 -115 1 -105 -263 -162 0 52 -66 232 113 -255 25 -37 -46 241 42 -150 -306 52 -13
5165 -13 83 120 -115 -96 105 -38 179 -170 121 147 -147 -109 -127 136 60 -18 -126 -70 161 193 -66 -65 -205 -151 -66
5190 -66 151 -75 -153 293 102 95 -114 188 55 -16 40 -49 -21 59 77 174 209 103 41 -128 80 -51 -215 118
5214 118 -67 253 278 -77 -33 -142 188 -53 4 179 66 51 -140 -137 195 -84 51 59 -82 92 -23 256 -128
5237 -128 -132 -145 -162 189 -110 -8 205 -25 18 -125 -126 146 5 -76 115 86 181 -64 -12 -16 39 92 7 63 22 121
5263 121 -301 141 -41 26 -122 0 -51 36 -197 -61 78 32 -53 41 137 -36 -20 105 -216 27 -79 -20 -54
5286 -54 109 194 184 -18 127 -167 -89 105 -29 -42 2 -82 -158 -31 23 131 -7 -74 -123 109 -26 -225 266 -19
5310 -19 60 -84 -117 139 -68 -81 123 -90 -128 65 -326 -159 126 127 -43 -52 -54 -28 -97 -167 -60 152 46 62 -27
5335 -27 -77 -5 -10 -176 231 -48 -235 0 158 -21 214 92 -277 -80 -16 -60 18 -135 -243 -312 5 201 200 -34
5359 -34 -319 89 -40 166 -55 179 -177 38 95 227 85 150 29 -34 -54 46 19 6 -1 -84 45 179 72
5382 72 -43 130 135 109 71 -206 226 -116 -75 16 113 -11 -22 -132 -210 280 -87 245 -76 196 -26 135 95 -3
5406 -3 187 164 -32 -7 -206 -49 71 317 -17 -45 -57 -148 2 11 69 -1 45 37 -100 -98 90 25 -56 -273 -46 144
5432 144 -27 -86 -85 -302 69 -2 75 145 16 -156 4 249 222 -82 -262 21 -96 -296 -56 1 154 -22 -188
5455 -188 147 75 -110 154 38 36 312 -34 -181 -109 14 -125 -99 177 -31 19 97 -201 32 300 -121 -33 -44
5478 -44 97 211 -55 -191 210 -124 -59 -265 -259 233 -201 -123 -188 -3 -204 -92 -131 -57 8 -91 -129 154 -113 -37
5502 -37 259 -63 64 61 48 177 -230 -58 215 -99 -1 74 -86 28 -208 -47 1 -174 -105 142 -210 -17 -15
5525 -15 107 -18 -126 -98 -49 -64 89 141 108 -62 -81 47 -79 68 -211 66 340 164 217 37 98 -72 42
5548 42 210 156 -213 -24 38 -97 11 -164 91 -285 30 140 -155 87 90 226 -25 -58 19 -63 34 122 157 -230
5572 -230 -63 220 119 -82 157 133 160 145 -66 85 -96 167 98 175 -166 -82 22 -131 77 47 -169 97
5594 97 152 82 10 256 36 278 -69 -133 125 -192 -52 -2 -19 117 40 239 -14 138 -55 -177 36 122 -76
5617 -76 38 201 53 -72 327 108 -28 -17 -193 -119 -117 30 -49 -161 256 219 -207 -90 -208 -1 217 319
5639 319 122 264 -63 169 86 -279 -118 9 15 -142 96 200 -181 -100 -156 -229 22 -110 -318 -205 3 28
5661 28 29 56 -1 55 -5 88 35 154 177 -43 -86 -87 -20 -166 -87 44 191 81 46 44 189 -23 28 125 -37 1 -25
5688 -25 -86 -73 153 150 -278 -177 -151 -91 -122 71 -128 -2 -199 162 -120 -151 135 14 12 177 -158 -21 4 -212
5712 -212 47 45 -85 -44 -67 -132 100 -238 -107 162 5 -277 -102 25 -12 137 118 96 -142 -33 -158 130 93
5735 93 -93 99 -92 -96 -103 -133 8 14 -173 -67 -73 21 -9 -50 58 -48 -164 -176 -25 -111 24 112 57 108 182 15
5761 15 -70 39 -39 -49 144 282 -243 -25 211 16 50 95 138 -79 -48 156 69 45 57 164 180 231 -63 41
5785 41 -225 -293 -127 83 18 176 238 -90 56 -144 16 -120 -152 37 -98 83 98 -63 123 -25 99 -121
5807 -121 106 -66 -3 11 109 -40 -119 220 7 -79 -59 -87 97 -176 54 -6 -91 -26 -181 -10 77 59 99 -66
5831 -66 277 -11 -6 -19 16 26 -168 30 -69 -134 33 -68 -234 -171 26 -56 14 -9 -87 -126 -10 147 102 -99 -324
5856 -324 -16 56 246 -74 100 127 194 -179 -191 -221 60 16 -106 238 115 196 -110 -83 -136 -28 94 -65 29
5879 29 -177 -172 -21 66 166 -337 -121 -20 -135 150 -14 -21 -10 25 1 169 263 60 84 107 -187 24 151 -117
5903 -117 142 142 82 -248 -16 -53 79 44 -43 -8 275 69 -5 -118 52 -177 -189 128 -8 219 -47 104 -38
5926 -38 98 -41 256 -43 -11 -62 297 200 42 36 19 167 -154 7 45 34 143 258 243 123 63 0 -147 -8
5950 -8 273 13 218 26 -128 -50 179 134 -25 -27 6 52 41 -37 -54 -260 282 277 -8 137 15 20 114 3 -68 -246
5976 -246 82 -20 30 -312 50 120 -92 249 -124 51 146 -85 -52 -50 -186 -97 106 126 -30 284 26 164 -184
5999 -184 -143 149 108 173 -252 19 -83 -110 84 88 63 -60 114 -14 86 -64 -19 -153 157 74 198 -34 149
6022 149 -130 -14 -120 55 -21 -304 2 -111 -126 2 37 14 84 -88 29 315 69 -174 -71 -160 235 -12
6044 -12 136 34 -27 96 -311 108 -176 -43 -100 221 149 136 -155 60 101 -157 34 -26 -359 34 111 -75 -66
6067 -66 197 129 -158 -84 -15 -63 -119 -41 -26 -186 -147 183 141 87 -57 213 -166 -27 47 -232 1 -61 -89 167 55
6092 55 -32 141 142 72 -128 -3 -185 81 100 -17 218 35 9 151 303 -39 207 227 -106 -75 -138 -242 92
6115 92 62 -159 113 128 69 -87 -34 130 70 164 -154 -41 137 -96 -2 192 24 -3 3 -105 -130 87 91 40 101
6140 101 -126 118 -185 36 -97 237 -244 98 65 -67 -113 32 156 0 -49 221 -31 -168 -152 -176 -12 -101
6162 -101 -18 115 70 -85 -47 -104 -47 -30 -197 105 -226 -111 57 -14 413 -3 161 106 -105 -85 28 -98 11
6185 11 -98 -147 -288 -81 141 -18 163 60 154 -127 -103 -72 -56 389 43 -40 -21 -143 135 -144 32 -161 -74
6208 -74 -166 101 173 1 -2 -21 -41 -182 -93 -10 -122 -174 234 -262 -124 89 -121 29 37 -143 17 -43 -20 -68 31
6233 31 14 38 -130 -79 39 167 -74 104 -54 -77 254 65 370 95 -23 -20 -36 -41 2 -6 97 112 -260 -252 33
6258 33 -55 56 -170 -71 -204 34 28 -15 -51 283 -43 -108 24 1 -233 -79 -78 47 9 -32 -172 81 93 102 -245
6283 -245 234 49 70 115 -120 -47 -76 -82 -83 -38 -93 -167 225 -124 -77 -125 44 -184 60 21 249 7 -64 106 44
6308 44 32 20 -12 228 -72 97 -27 221 -38 -127 2 232 110 263 -55 74 -182 -109 -7 -158 73 151
6330 151 -46 -112 197 -22 -142 96 -44 54 -124 208 -54 156 80 -47 -3 -58 55 -48 192 7 -12 -132
6352 -132 93 76 -104 -37 -60 -11 -223 22 260 -137 -88 -57 -60 95 -22 -19 -97 -169 -145 -5 245 -74 19 43 -6
6377 -6 28 115 56 61 -70 -19 16 135 89 -130 97 -219 -252 -47 320 -66 10 97 -157 28 24 -38 63 -226 294
6402 294 -151 -39 -72 -17 20 116 -151 -104 123 -201 8 273 18 -120 70 -136 -195 125 249 -39 245 -266
6424 -266 111 -65 139 -11 152 91 198 65 -69 -37 -123 -113 37 156 -49 -155 -103 215 140 20 11 -93 -17
6447 -17 -4 92 104 191 -121 -43 141 143 90 20 73 -113 -145 127 15 -353 -61 -80 68 -364 -223 -56 -57 -30 113
6472 113 -105 -12 -40 16 80 62 136 -98 84 -65 219 104 -110 -233 -106 127 -20 -29 183 191 22 -58 -30 -164
6496 -164 -32 -26 62 -39 180 127 9 89 42 281 151 -243 32 -230 -187 -97 -102 -37 -51 206 -109 106 -273 -143
6520 -143 -67 -53 -44 -218 125 -1 81 -63 2 144 65 46 18 -96 262 25 -101 178 83 -154 -49 297 -14
6543 -14 -220 -192 40 144 2 207 -28 7 225 -31 65 -188 118 -101 -90 3 -30 37 7 199 -63 37 -204
6566 -204 -195 235 -90 60 14 84 38 -18 -105 -135 -161 201 -65 -300 281 91 -55 5 18 -144 91 -12 -85 73
6590 73 217 56 -294 -123 81 157 -61 104 -85 65 -40 -164 165 154 120 -40 -140 -36 76 -40 46 173
6612 173 -91 -46 -37 209 -126 -14 101 -157 2 -16 0 179 2 -69 40 -180 -61 -60 107 -57 7 61 -216
6635 -216 -105 103 81 -285 -2 159 -104 98 -27 310 -121 -134 32 -80 -197 240 73 37 113 73 95 -32
6657 -32 58 -25 -83 110 -22 165 188 -12 105 226 67 -31 -105 -87 53 202 -83 -164 3 127 135 100 91 79 50
6682 50 18 -30 13 56 52 -46 117 -206 20 -134 10 168 -143 -48 7 -10 155 -22 34 32 -81 11 -5 -6 374 16
6708 16 316 -39 201 -127 104 315 161 188 134 -52 -64 -73 -31 -131 104 56 91 -129 63 -66 -146 -18 9 -77
6732 -77 230 -84 162 31 -143 428 156 112 -50 -33 44 -91 -163 -264 -114 119 58 197 20 -234 -40 -21
6754 -21 64 -263 67 17 149 141 -77 -83 -52 217 161 -120 21 -121 -218 -71 -200 -92 -239 -96 -118 53 104 -233
6778 -233 25 -117 -90 -77 -38 257 -78 20 -67 145 -22 118 -128 165 72 127 38 -63 83 31 -199 -41 -49 -35
6802 -35 -281 6 -51 -20 99 126 -79 -70 325 -82 -270 47 -161 88 175 -16 -163 -19 -8 -20 -3 -106 -29 -82
6826 -82 131 184 24 7 -66 -28 4 246 -104 -236 31 42 20 87 17 -71 58 3 -52 -64 235 -34 -33 268 273 124
6852 124 -105 85 -35 51 -38 31 -29 13 216 -85 -2 142 -26 82 -151 163 45 169 -114 33 -129 -88
6874 -88 -124 118 -51 4 -28 -27 171 -102 130 5 -164 248 -136 -72 144 -13 -22 291 167 22 -115 -149 115
6897 115 -22 -156 121 -276 56 226 149 -13 37 95 48 -1 -24 1 -26 -92 -247 -130 -68 62 80 -41 98 -1
6921 -1 42 15 20 23 24 46 -151 340 4 -270 -90 -5 -139 -12 -258 86 66 40 22 -164 -8 65 9 18 49 6 124
6948 124 128 -1 137 -20 -101 114 185 28 53 71 58 -77 104 127 -43 41 164 -79 -194 11 17 -86 -68 -183
6972 -183 -42 190 -222 -122 -146 57 -150 -239 108 14 106 133 86 -174 -178 38 -203 31 -211 -201 -155 100 -115
6995 -115 204 -96 -150 108 -59 183 48 -94 116 68 173 -36 69 162 158 -169 -87 -201 -99 93 171 171 -278
7018 -278 -96 -34 130 3 25 15 -98 97 -247 49 22 31 -14 -212 34 -81 -21 -191 -27 42 30 220 -222
7041 -222 -57 -234 46 66 119 31 126 -250 169 -158 -114 -98 -42 -100 215 39 -31 -68 -50 -75 223 116 41 62 26
7066 26 -54 -118 34 8 -26 -175 -138 -127 -103 40 -22 -175 47 -36 123 62 -28 -36 -75 65 112 -56 240 -26 73 -42
7092 -42 -65 22 12 -124 52 131 -139 -118 336 81 36 -285 118 34 -2 158 -143 234 -137 19 -41 -11 -98 99
7116 99 157 92 -113 -24 -89 -36 -208 -73 -4 -114 -74 91 -263 -53 26 189 27 -86 -237 12 56 -87 -276
7139 -276 -30 -159 -277 -13 -15 304 -84 -360 -91 148 -188 -309 99 3 -173 300 -347 131 82 -214 -29
7160 -29 30 -111 -119 135 314 99 209 -139 87 -18 34 -9 -49 12 -48 10 -136 52 280 303 3 168 -33 -106
7184 -106 -96 -136 194 -94 97 -50 -119 134 -6 1 129 -65 17 147 139 110 -205 50 -385 99 135 62 -89 138
7208 138 75 -79 50 -126 -232 -84 -224 -79 -303 -85 117 -7 -56 152 -144 -215 -94 -84 141 221 -166 35
7230 35 -92 68 -126 -224 229 84 18 52 -95 -12 -227 -51 19 -198 -7 -124 -235 -179 -197 130 182 121 173 -229
7254 -229 22 83 -74 76 246 -68 3 -13 164 77 -55 4 -38 155 69 230 -302 -81 54 14 43 -185 15
7277 15 -168 -148 -124 -34 13 -243 -55 -55 6 135 -173 81 206 53 -60 -140 -180 155 96 -107 101 53 -88 -17
7301 -17 7 -75 2 -213 75 154 224 156 -286 53 62 6 78 35 -110 -121 -198 -23 259 -14 83 223 283 183 -265
7326 -265 234 -113 13 74 -158 -90 -16 292 88 299 47 4 -178 -51 -104 -233 -54 7 184 120 144 -67 134
7349 134 7 -175 -129 -22 -21 -88 -135 4 36 37 142 -233 236 115 -194 94 414 -11 -212 -57 6 -139 197
7372 197 57 -116 155 -112 -32 -159 -328 87 -7 -24 141 -415 -42 -29 -156 -253 66 -57 -118 58 79 -13 -247
7395 -247 125 -4 167 219 324 134 -13 31 154 10 24 -127 -28 282 -122 207 5 74 11 82 -140 -197 269
7418 269 -114 -81 -1 26 107 129 263 241 -221 -254 -21 -229 100 11 87 -52 -414 3 -128 -249 36 89 -61
7441 -61 -146 29 30 -96 89 -32 95 -42 29 8 -40 -49 3 -133 -182 -105 18 -148 4 -329 -120 -172 7 129
7465 129 -69 -129 91 -137 -197 94 -31 -139 -106 40 109 -283 -162 39 -102 -26 90 9 -166 32 -53 28 50
7488 50 158 -73 64 -41 -31 207 118 -195 -185 393 -15 63 -10 -40 -113 72 -106 -72 46 53 109 -62 -178 -60
7512 -60 172 -42 19 110 305 -112 49 -185 158 143 -6 -222 80 41 -232 -133 -21 53 -276 -205 -79 -65 -145
7535 -145 156 -130 -39 -101 -85 12 21 -54 -46 169 129 75 97 -149 -138 27 82 -30 -56 23 94 266 5 -71 58 163
7561 163 30 69 75 263 -17 104 -22 16 76 54 -106 -163 -51 -151 75 -212 -87 -37 -258 28 148 38 133
7584 133 97 67 -10 -126 7 -114 20 23 58 -95 290 44 79 -320 27 -10 138 253 6 -103 -75 29 -120
7607 -120 -17 -16 89 -94 -79 -420 175 -116 -60 159 -181 -74 -15 -200 118 -277 179 -200 -70 62 259 -83
7629 -83 -216 -52 -29 -53 241 -107 -91 96 289 27 200 158 -126 191 -71 -89 -130 139 126 374 116 -105 -82
7652 -82 56 32 170 145 -149 -359 -87 -24 -39 278 318 4 -175 85 -35 139 59 107 19 63 69 -24 -137 7
7676 7 117 66 -10 -239 11 150 176 26 52 197 -65 111 234 124 148 -83 190 -41 -41 31 -142 -70 -205 68
7700 68 102 -15 188 77 -175 -44 -61 -101 -4 -30 -103 -187 40 106 -48 -181 -57 135 -6 -53 111 115 90 -22
7724 -22 -67 -112 -20 -3 40 -1 9 184 -26 -211 119 -149 -8 105 -94 186 -151 24 133 -31 94 218 -8
7747 -8 201 -139 -35 119 -52 49 180 50 203 81 31 93 34 2 5 248 -117 185 -59 151 -69 50 -258
7770 -258 99 -192 -150 -121 -100 -167 57 -65 -65 -19 -4 -64 81 40 3 -232 108 -202 -229 250 -81 263 92 80
7794 80 99 161 -96 -1 218 135 81 11 -80 71 -144 -163 -112 -258 -26 32 16 -73 -392 -83 13 26 -97 92 -2
7819 -2 -154 83 85 38 119 -124 95 -64 261 86 63 -192 77 165 -32 -7 -150 108 28 -75 122 -34 -189
7842 -189 42 -82 -168 197 179 -42 192 240 -116 139 223 -397 87 -119 24 152 53 184 153 26 21 14 61 -116
7866 -116 93 74 -3 -121 110 -15 -240 -234 -28 -259 68 -236 -169 326 -65 72 3 -240 34 -89 58 175
7888 175 51 -102 67 -124 -30 60 -38 45 17 -46 38 -165 29 77 53 236 -37 173 56 -32 55 -15 -145 -18
7912 -18 -193 -92 53 246 -53 380 -83 -130 337 -212 121 -89 84 199 -213 255 -134 -139 -7 180 39
7933 39 -250 65 -57 223 -35 18 224 -46 17 6 60 -253 -99 -207 78 -114 -154 86 -272 -183 39 -86
7955 -86 214 34 -32 -7 -164 -108 -146 4 46 -27 34 128 119 -103 22 -24 -2 166 121 260 -255 -147 -213 -66 -36
7980 -36 -37 -84 53 -46 -38 -176 -11 117 129 181 172 -25 126 -117 -273 -56 5 -76 100 127 -95 1 -61 -55 234 -11
8006 -11 -179 141 -148 -172 -217 -92 -149 153 61 -210 -109 -70 325 -40 -47 -55 -228 -74 -109 -154 -39 48 -53 -67 -36
8031 -36 -52 -67 -45 -33 139 -68 36 -57 -23 71 -74 304 -67 -133 -12 -3 234 65 186 191 -125 -95 90 -29 96
8056 96 -29 -15 -80 20 -210 153 36 -218 -15 -22 -93 58 159 40 -84 128 -25 -45 -165 -8 -69 -54 100
8079 100 -177 -308 -31 -116 -155 169 217 -5 80 -141 -7 213 -155 161 -4 -19 -34 -161 -11 -114 -112 9 -85
8102 -85 -28 29 146 -76 243 -2 -20 -76 -11 68 -294 -62 139 -241 13 -80 -55 -145 34 -4 -86 -57 35 -179 8
8127 8 105 68 153 235 17 -89 -131 -53 25 76 252 138 100 6 102 -208 -36 91 -135 -252 -101 -152 -104 -121 -143 -156
8153 -156 -5 55 153 136 79 57 95 -131 69 -305 38 -30 -26 -2 192 57 74 222 -143 166 8 125 -27 -221
8177 -221 23 227 192 -136 53 -57 -41 -254 105 88 -61 -113 67 104
8191A04
##END NTUPLES=NMR FID
##END=
