##TITLE=1H_SL38-DAU-B(for500)
 CDCl3
 8 sc, 
 20.11.2023
##JCAMPDX= 6.0         $$ Bruker NMR JCAMP-DX V2.0
##DATA TYPE= NMR FID
##DATA CLASS= NTUPLES
##ORIGIN= UXNMR, Bruker Analytische Messtechnik GmbH
##OWNER= root
$$ XWIN-NMR		Version 3.5
$$ Mon Nov 20 14:03:17 2023 Russian Standard Time (UT+4h)  she@DPX200
##.OBSERVE FREQUENCY= 200.1313
##.OBSERVE NUCLEUS= ^1H
##.DELAY= (6, 6)
##.ACQUISITION MODE= SIMULTANEOUS
##.ACQUISITION SCHEME= undefined
##.AVERAGES= 8
##.DIGITISER RES= 18
##SPECTROMETER/DATA SYSTEM= spect
##.PULSE SEQUENCE= zg30
##.SOLVENT NAME= D2O
##.SHIFT REFERENCE= (INTERNAL, D2O, 0, 15.7039)
##AUDIT TRAIL= $$ (NUMBER, WHEN, WHO, WHERE, WHAT)
$$ ##TITLE= Audit trail, XWIN-NMR		Version 3.5
$$ ##JCAMPDX= 5.01
$$ ##ORIGIN= Bruker BioSpin GmbH
$$ ##OWNER= she
$$ F:/spectra/data/she/nmr/H-F/1/audita.txt
$$ ##AUDIT TRAIL=  $$ (NUMBER, WHEN, WHO, WHERE, WHAT)
(   1,<2023-11-20 14:02:11.59 +0400>,<she>,<DPX200>,
      <created by zg, POWCHK disabled, PULCHK disabled
       configuration hash MD5:
       00 E9 B6 7A A2 85 ED C7 34 08 36 98 17 FE 4E 26
       data hash MD5: 16K
       57 69 DD 64 D2 91 C7 24 49 E2 B3 07 37 61 99 42>)
$$ ##END=
$$ 
$$ hash MD5
$$ D7 08 C3 10 B3 6D E8 57 6F 9C CE 20 2E F1 C1 89
##$RELAX= 
##$RELAX= 
##$RELAX= 
##$RELAX= 
##$RELAX= 
##$RELAX= 
$$ Bruker specific parameters
$$ --------------------------
##$DU= <F:/spectra>
##$EXPNO= 1
##$NAME= <H-F>
##$PROCNO= 1
##$TYPE= <nmr>
##$USER= <she>
##$AMP= (0..31)
100 100 100 100 100 100 100 100 100 100 100 100 100 100 100 100 100 100 
100 100 100 100 100 100 100 100 100 100 100 100 100 100 
##$AQSEQ= 0
##$AQ_mod= 1
##$AUNM= <au_zg>
##$AUTOPOS= <>
##$BF1= 200.13
##$BF2= 200.13
##$BF3= 200.13
##$BF4= 200.13
##$BF5= 200.13
##$BF6= 200.13
##$BF7= 200.13
##$BF8= 200.13
##$BYTORDA= 1
##$CFDGTYP= 0
##$CFRGTYP= 5
##$CHEMSTR= <none>
##$CNST= (0..31)
1 1 145 1 1 1 1 1 1 1 1 1 1 1 1 1 1 1 1 1 1 1 1 1 1 1 1 1 1 1 1 1 
##$CPDPRG= <>
##$CPDPRG1= <>
##$CPDPRG2= <>
##$CPDPRG3= <>
##$CPDPRG4= <mlev>
##$CPDPRG5= <mlev>
##$CPDPRG6= <mlev>
##$CPDPRG7= <mlev>
##$CPDPRG8= <mlev>
##$CPDPRGB= <>
##$CPDPRGT= <>
##$D= (0..31)
0 1.2 0 0 0 0 0 0 0 0.06 0 0.03 0 0 0 0 0.0002 0 0 0 0 0 0 0 0 0 0 0 0 
0 0 0 
##$DATE= 1700474530
##$DBL= (0..7)
120 120 120 120 120 120 120 120 
##$DBP= (0..7)
150 150 150 150 150 150 150 150 
##$DBP07= 0
##$DBPNAM0= <>
##$DBPNAM1= <>
##$DBPNAM2= <>
##$DBPNAM3= <>
##$DBPNAM4= <>
##$DBPNAM5= <>
##$DBPNAM6= <>
##$DBPNAM7= <>
##$DBPOAL= (0..7)
0.5 0.5 0.5 0.5 0.5 0.5 0.5 0.5 
##$DBPOFFS= (0..7)
0 0 0 0 0 0 0 0 
##$DE= 6
##$DECBNUC= <off>
##$DECIM= 32
##$DECNUC= <off>
##$DECSTAT= 4
##$DIGMOD= 1
##$DIGTYP= 9
##$DL= (0..7)
0 120 120 120 120 120 120 120 
##$DP= (0..7)
150 150 150 150 150 150 150 150 
##$DP07= 0
##$DPNAME0= <>
##$DPNAME1= <>
##$DPNAME2= <>
##$DPNAME3= <>
##$DPNAME4= <>
##$DPNAME5= <>
##$DPNAME6= <>
##$DPNAME7= <>
##$DPOAL= (0..7)
0.5 0.5 0.5 0.5 0.5 0.5 0.5 0.5 
##$DPOFFS= (0..7)
0 0 0 0 0 0 0 0 
##$DQDMODE= 0
##$DR= 18
##$DS= 0
##$DSLIST= <SSSSSSSSSSSSSSS>
$$ [...]
##$SUBNAM2= <"">
##$SUBNAM3= <"">
##$SUBNAM4= <"">
##$SUBNAM5= <"">
##$SUBNAM6= <"">
##$SUBNAM7= <"">
##$SUBNAM8= <"">
##$SUBNAM9= <"">
##$SW= 18.0517328524113
##$SWIBOX= (0..15)
0 0 2 0 0 0 0 0 0 0 0 0 0 0 0 0 
##$SW_h= 3612.71676300578
##$TD= 16384
##$TD0= 1
##$TE= 0
##$TE2= 300
##$TE3= 300
##$TEG= 300
##$TL= (0..7)
0 120 120 120 120 120 120 120 
##$TP= (0..7)
150 150 150 150 150 150 150 150 
##$TP07= 0
##$TPNAME0= <>
##$TPNAME1= <>
##$TPNAME2= <>
##$TPNAME3= <>
##$TPNAME4= <>
##$TPNAME5= <>
##$TPNAME6= <>
##$TPNAME7= <>
##$TPOAL= (0..7)
0.5 0.5 0.5 0.5 0.5 0.5 0.5 0.5 
##$TPOFFS= (0..7)
0 0 0 0 0 0 0 0 
##$TUNHIN= 0
##$TUNHOUT= 0
##$TUNXOUT= 0
##$USERA1= <user>
##$USERA2= <user>
##$USERA3= <user>
##$USERA4= <user>
##$USERA5= <user>
##$V9= 5
##$VALIST= <valist>
##$VCLIST= <CCCCCCCCCCCCCCC>
##$VD= 0
##$VDLIST= <DDDDDDDDDDDDDDD>
##$VPLIST= <PPPPPPPPPPPPPPP>
##$VTLIST= <TTTTTTTTTTTTTTT>
##$WBST= 1024
##$WBSW= 4
##$XGAIN= (0..3)
0 0 0 0 
##$XL= 0
##$YL= 0
##$YMAX_a= 88909
##$YMIN_a= -111647
##$ZGOPTNS= <>
##$ZL1= 120
##$ZL2= 120
##$ZL3= 120
##$ZL4= 120
##$ABSF1= 10
##$ABSF2= 0
##$ABSG= 5
##$ABSL= 3
##$ALPHA= 0
##$AQORDER= 0
##$ASSFAC= 0
##$ASSFACI= 0
##$ASSFACX= 0
##$ASSWID= 0
##$AUNMP= <proc_1d>
##$AZFE= 0.1
##$AZFW= 0.1
##$BCFW= 1
##$BC_mod= 2
##$BYTORDP= 1
##$COROFFS= 0
##$CY= 11.3945322036743
##$DATMOD= 1
##$DC= 2
##$DFILT= <>
##$DTYPP= 0
##$F1P= 15.7292609196834
##$F2P= 12.9074282941183
##$FCOR= 0.5
##$FTSIZE= 0
##$FT_mod= 4
##$GAMMA= 1
##$GB= 0.15
##$INTBC= 1
##$INTSCL= 1
##$ISEN= 128
##$LB= 0.24
##$LEV0= 0
##$LPBIN= 0
##$MAXI= 10000
##$MC2= 0
##$MEAN= 0
##$ME_mod= 0
##$MI= 1.114404
##$NCOEF= 0
##$NC_proc= 0
##$NLEV= 6
##$NOISF1= 3.799351
##$NOISF2= 2.8
##$NSP= 1
##$NTH_PI= 0
##$NZP= 0
##$OFFSET= 15.70392
##$PC= 1
##$PHC0= -23872.06
##$PHC1= 12.45269
##$PH_mod= 1
##$PKNL= yes
##$PPARMOD= 0
##$PSCAL= 0
##$PSIGN= 0
##$REVERSE= no
##$SF= 200.130013532006
##$SI= 16384
##$SIGF1= 3
##$SIGF2= 2
##$SINO= 400
##$SIOLD= 16384
##$SREGLST= <1H.CDCl3>
##$SSB= 0
##$STSI= 0
##$STSR= 0
##$SW_p= 3612.71676300578
##$SYMM= 0
##$S_DEV= 0
##$TDeff= 0
##$TDoff= 0
##$TI= <>
##$TILT= no
##$TM1= 0
##$TM2= 0
##$TOPLEV= 0
##$USERP1= <user>
##$USERP2= <user>
##$USERP3= <user>
##$USERP4= <user>
##$USERP5= <user>
##$WDW= 1
##$XDIM= 8192
##$YMAX_p= 0
##$YMIN_p= 0
$$ End of Bruker specific parameters
$$ ---------------------------------
##NTUPLES= NMR FID
##VAR_NAME=  TIME,          FID/REAL,        FID/IMAG
##SYMBOL=    X,             R,               I
##VAR_TYPE=  INDEPENDENT,   DEPENDENT,       DEPENDENT
##VAR_FORM=  AFFN,          ASDF,            ASDF
##VAR_DIM=   8192,          8192,            8192
##UNITS=     SECONDS,       ARBITRARY UNITS, ARBITRARY UNITS
##FACTOR=    0.0002768,     1,               1
##FIRST=     0,             0,               0
##LAST=      2.2672688,     0,               0
##MIN=       0,             -111647,         0
##MAX=       2.2672688,     88909,           0
$$ Real data points
##PAGE= N=1
##DATA TABLE= (X++(R..R)), XYDATA
0 0 0 0 0 0 0 0 0 0 0 0 0 0 0 0 0 0 0 0 0 0 0 -3 8 -8 8 -8 8 -8 9 -14 16 -16 17 -21 24 -27 30 -33 37 -41 45 -50 56
43 56 -62 68 -74 82 -92 101 -111 120 -134 149 -165 182 -200 224 -251 283 -322 367 -427 503 -607
64 -607 756 -989 1394 -2247 4735 -25798 -111647 -15624 79201 10249 -34513 25426 37250 -4190
78 -4190 -16233 2229 -7355 -6976 17257 12507 -8895 -11309 -2805 -9109 -9711 783 -1334 -2087 -7991
93 -7991 -13035 -360 20306 15114 -7604 13479 38073 -338 -39755 -12287 23980 440 -16267
106 -16267 9941 8589 -20856 -17752 4660 -4648 -6506 23691 20212 -17557 -20918 10780 12820
119 12820 -6768 3048 17457 3027 -16770 -11516 4663 5416 -1391 1024 11696 8104 -12617
132 -12617 -19209 -4262 5498 -2020 -5487 2052 1389 -440 5831 8335 2327 5579 15701 4884
146 4884 -16867 -15945 1135 2672 -6399 43 10508 1969 -14742 -14154 2279 11016 5933 1237
160 1237 2631 719 -6633 -6519 1735 5816 7078 9266 2577 -10916 -6943 8084 2984 -11389 -2124
175 -2124 12895 -1166 -17713 -5617 9197 1505 -6923 19 4189 -21 -1739 -1590 -583 8882
189 8882 16657 6430 -7992 -6839 -461 -1718 -4373 -566 4056 3602 -3198 -12253 -9409 3566 6356
204 6356 -2309 330 9566 857 -11781 -1200 14566 7365 -3618 1087 3467 -4852 -4395 2083
218 2083 -2429 -3591 7662 6919 -10208 -11569 4601 4427 -8869 -4675 8648 4659 -6916 -4877
232 -4877 3346 7053 7944 6130 1861 -359 -1349 -4972 -5154 354 3247 -426 -3325 -4513 -7691 -4823
248 -4823 2642 3272 1321 6646 6459 -6274 -7568 9162 12737 -2822 -6601 5861 6349 -5895 -7871
263 -7871 -954 -765 -490 2120 -2561 -8710 -2697 3812 -1248 -2333 7274 8612 -3122 -5938 3829
278 3829 7704 1710 -405 4867 7355 -1168 -12492 -10908 1864 4920 -4593 -7258 731 887 -6061
293 -6061 -3683 5500 6921 4690 4927 1702 -2759 1752 7003 -231 -5098 2219 4372 -6416 -11202
308 -11202 -2329 2548 -1883 -3235 948 2317 -977 -3360 -1542 4579 7136 3792 -577 -181 378
323 378 -1836 -1250 1304 1731 2092 1797 -4154 -8958 -2495 5379 1517 -3523 1086 2542 -4250 -5448
339 -5448 2834 5294 1393 1702 3127 -34 -1997 81 -152 -957 2238 3343 -1754 -5064 -1726 1150
355 1150 626 -340 -469 1062 1612 -2427 -6304 -1303 5894 3695 -1183 802 2257 -3115 -4343 2461
371 2461 5555 2282 1038 510 -3527 -3819 711 503 -3931 -1180 3089 -1778 -8192 -3580 5030 5703
387 5703 1267 1015 3271 2712 -55 -1812 127 3878 2607 -2083 -2995 -1013 -1693 -4498 -3205 413
403 413 1261 -294 -3149 -5272 -1031 6346 6020 998 3185 7946 2550 -5605 -2979 4230 3532 -2656
419 -2656 -4146 -2896 -3245 -3606 -2464 -1093 976 1930 -169 -2830 -1985 1499 3886 3607 3508 3790 2903
436 2903 -359 -2997 229 3525 -368 -5381 -2670 1799 -2583 -8163 -4140 3634 3913 397 -689
451 -689 -1027 -393 3489 5335 2065 1547 4292 1615 -4653 -4687 -963 382 -936 -522 42 -1420 -2682
468 -2682 -2620 634 4518 2556 -3348 -2953 2196 1090 -2391 779 6372 4431 788 335 -934 -3215
484 -3215 -504 1690 -2848 -4100 1710 1631 -5961 -4688 4505 5548 -657 -900 1704 -973 -2984 -235
500 -235 1540 2425 4531 1978 -3341 -1875 2318 -89 -2736 157 1823 -2131 -3823 -2799 -2416 726
516 726 4629 1062 -3574 1384 4748 -1314 -3687 5033 7122 -612 -2560 1779 -459 -4549 -931
531 -931 1881 -1052 -981 1149 -3063 -5308 747 4319 -239 -1995 2083 1662 -2391 -1329 2185 3757
547 3757 4622 3435 -921 -2031 552 -1566 -4334 -945 1799 -2235 -4786 -1228 439 -552 1611 3158
563 3158 460 435 1777 -1437 -3556 2118 6271 1612 -2003 1115 2537 -1487 -3517 -964 1082 -233
579 -233 -1881 -3278 -3216 -1052 348 1160 1890 2404 1426 -177 -966 -472 2252 4400 1157 -1534 402
596 402 1312 -3119 -4989 639 3390 -1083 -4096 -1934 160 -789 -560 426 1521 2931 1793 -1779
612 -1779 -1819 2130 3721 2201 828 708 -154 -764 -2467 -4157 -1685 2132 -656 -5007 -1584 2500
628 2500 -1060 -3104 4119 7110 923 -2425 310 987 513 2089 1855 -968 544 2455 -2709 -6700
644 -6700 -1596 3007 -576 -3564 -1635 -159 -1061 -397 1454 2643 4339 2929 -1204 -1061 2883 1144
660 1144 -2354 564 4031 -351 -4726 -2679 -1146 -2362 -423 1271 -1607 -2207 1509 1170 -2528 476
676 476 6462 3832 -1852 -390 2052 -225 -1833 494 1812 579 -646 -2339 -3217 -2140 718 263
692 263 -1341 -186 854 -311 -1511 172 2281 3363 2270 -284 -1072 430 678 -1535 -1103 2582
708 2582 2420 -2096 -3199 -558 -232 -1355 -442 1495 191 -1266 -927 -987 -42 2577 3062 96 -439
725 -439 1569 1579 -1783 -2185 2194 3611 -752 -3892 -1789 319 -925 -1809 -597 818 891 -841 -1769
742 -1769 -921 1692 2643 1234 803 1605 1176 -923 -1424 178 1768 1856 -1416 -3485 -1412 442 -2193
759 -2193 -3089 154 2595 -53 -2373 -750 1255 1491 1615 2405 1851 1434 608 -983 -1393 444 1156
776 1156 -615 -2241 -1452 -438 -1935 -3109 -901 2117 1749 -1418 -1649 985 1972 913 571 2508
792 2508 2960 913 -889 -803 -444 232 481 -954 -1729 -1501 -743 -1881 -1934 662 1790 827 -751 -34
810 -34 743 757 515 1355 2471 2278 56 -1652 -349 928 -615 -1200 -541 -626 -1780 -2283 -1973 -1770 836
829 836 3216 923 -1625 355 2921 622 -1197 1868 3334 866 -1519 -835 -137 -648 -886 -707 -618
846 -618 -277 -1326 -3140 -1991 1016 1447 -124 301 1466 999 625 402 479 1876 3265 631 -2606
863 -2606 -1347 906 -985 -3179 -667 1401 -1676 -2859 -853 174 286 1369 1756 958 855 903 -138
880 -138 -955 1340 2525 864 -1027 -636 58 -724 -1728 -1652 -108 936 -1193 -3096 -1434 1275 978
897 978 -312 1257 2591 1007 -457 -185 344 386 916 817 -1060 -975 92 -595 -1721 35 1865 44
915 44 -2296 -1453 -133 12 -155 163 1411 1846 733 -1116 -637 1167 1725 243 -386 380 -375 -1323
933 -1323 -919 -491 -328 325 11 -1452 -1824 515 874 -1118 445 2978 1568 -1141 -872 917 879 423
951 423 798 918 467 308 -769 -1766 -666 578 -587 -2207 -1701 -780 -819 -606 258 1707 2331 1952 204
970 204 -215 1429 1723 -392 -603 1193 828 -1790 -2224 -268 130 -642 -762 -905 -1339 -620 -321 -1071 -21
989 -21 2954 2805 602 -112 1693 1375 -213 -11 425 -90 -1156 -2021 -2270 -906 -7 -1092 -1079 116
1007 116 469 -443 -975 1185 2324 1852 1524 779 -173 366 838 -394 -1355 614 535 -1518 -2683 -1127
1025 -1127 -365 -714 -699 214 -209 -301 21 256 850 2076 2291 1180 530 561 172 -1137 -555 31 123 -801
1045 -801 -1631 -2166 -116 946 -252 -1459 849 1471 -523 -1216 571 1570 1042 792 834 318 182 529
1063 529 -1022 -832 534 409 -1234 -1568 -379 -139 -581 -324 185 947 804 -602 -1327 411 2360 1027
1081 1027 -509 843 1673 -528 -1527 126 601 -261 200 -501 -1694 -902 241 -435 -1174 976 1527
1098 1527 -1222 -1513 919 1543 128 421 1331 1100 494 -141 -1235 -408 1282 593 -1651 -1029 541
1115 541 -625 -1560 -191 947 -82 215 350 -867 -219 1361 996 -117 982 2491 -96 -1512
1131 -1512 85 1218 -368 -1123 7 -488 -1056 -1139 -513 -445 125 870 -128 -718 389 922 388 474 1405
1150 1405 1136 823 2 -492 -742 84 81 -1262 -917 88 -847 -2037 -958 717 544 56 -63 42 586
1169 586 1278 802 609 1451 1663 653 -914 -585 -27 -124 -1280 -1496 -581 -340 -1329 -1813 -256 821 840
1188 840 -256 483 1319 923 132 338 1037 1464 862 -476 -1060 -359 -23 -901 -1526 -361 279 -1167 -1660
1207 -1660 -1071 484 987 957 242 694 1375 393 -317 250 1722 882 -520 -654 -407 -930 -1047 -953 -554
1226 -554 -50 81 -871 -1432 -62 1195 506 113 1247 1554 539 -372 286 1179 911 139 -475 -396 -288
1245 -288 -1034 -1331 -702 14 350 -469 -866 -471 161 439 472 793 1039 970 195 -317 93 905 774 -326
1265 -326 -708 -57 -225 -1130 -915 -26 925 -44 -1067 -762 -99 167 109 203 523 614 866 -91 -623 289 1131
1286 1131 308 -406 5 754 -974 -1419 -97 361 190 -692 -823 -840 204 54 -530 -10 1543 1297 -417
1305 -417 -355 840 886 617 -124 24 -153 -86 -938 -1585 -859 667 -195 -1458 -468 252 -363 -1054 448 1522
1325 1522 667 556 345 158 573 928 407 -238 650 508 -1132 -1929 -783 -200 -695 -580 -628 -297 -562
1344 -562 -5 -156 426 1774 1148 -27 123 1021 230 -399 -18 500 -9 -483 -1002 -1347 -621 -113 -316
1363 -316 -816 -329 298 -169 -561 654 1271 1011 1110 909 256 316 476 -38 -555 -249 214 -1527 -1731 -837
1383 -837 -486 -487 -106 44 417 657 195 -346 442 1503 1131 -127 256 941 279 -936 -473 84 19 -412
1403 -412 -1275 -1416 -796 134 -384 -398 454 965 227 -425 560 1057 955 278 29 561 323 -362 -1128 -592
1423 -592 746 92 -1334 -851 178 -15 -875 -263 685 310 528 -275 -227 613 1291 686 104 574 962
1442 962 -248 -1147 -204 655 -272 -651 -743 -692 -491 -515 -749 -14 1044 741 -476 -456 307 724 124 447
1462 447 720 426 156 -186 -472 -59 521 92 -881 -613 -146 -603 -1183 -452 385 772 165 -227 104 406
1482 406 238 438 437 800 726 -111 -537 -434 -18 -60 -92 -533 -428 -355 -442 -739 -497 533 803 -73 -466 584
1504 584 484 -107 132 823 1195 558 -236 -494 -215 38 -322 -903 -931 -233 -486 -1210 -704 295 506 448 33
1525 33 321 533 507 122 418 887 1101 -77 -767 117 -145 -498 -999 -470 -52 -427 -842 -1075 53 772
1545 772 603 400 209 1144 742 -109 -259 1212 874 -1 -496 -340 -321 -604 -740 -672 -452 -206 -340 -938
1565 -938 -544 455 608 -259 512 890 534 165 191 488 86 255 58 -604 -400 -63 -879 -1289 -180 192
1585 192 -581 -732 -207 293 333 268 565 645 453 782 200 -254 393 536 76 -411 -262 -530 -787 -886 -369
1606 -369 29 19 45 -706 -374 450 371 127 667 871 583 5 -377 516 621 180 -162 -398 -218 -331 -804
1627 -804 -1011 -144 517 171 -547 -90 196 480 461 512 620 1123 224 -72 58 632 236 -216 -125 337 -32
1648 -32 -529 -598 -527 282 348 -472 -770 -159 311 -339 -463 864 1156 356 -79 128 539 532 269 -381 333 -42
1670 -42 -579 -827 -465 -172 -85 -534 -316 -22 10 36 -63 121 751 1002 202 220 396 613 -74 -116 112 249
1692 249 -255 -677 -855 -767 3 -82 -473 -324 59 251 -141 -78 464 952 634 330 609 134 259 30 -26
1713 -26 85 120 -334 -841 -547 -116 -18 -531 -165 147 387 -199 -258 318 866 943 292 155 278 424 13 -461
1735 -461 -283 348 32 -669 -1014 -528 -239 -539 -404 -292 408 470 46 83 689 803 513 269 31 733 47
1756 47 -516 -452 246 -138 -692 -704 -671 -240 -497 -614 -137 544 526 292 -59 239 1174 569 0 376 705 -55
1778 -55 -457 -319 -149 -90 -104 -809 -610 -107 14 -262 -336 381 743 218 13 430 690 152 350 144 99 73
1800 73 -125 -610 -476 291 201 -531 -381 -6 -488 -741 -252 -23 149 407 154 -103 557 562 585 27 383 275
1822 275 -65 -609 -215 -402 -379 -61 -152 -361 -179 -140 -455 -451 560 520 -16 -259 337 2 420 302 287 200
1844 200 557 73 -641 -134 145 -119 -373 -591 -249 -403 -592 -424 -17 166 674 38 -16 461 505 9 49
1865 49 623 591 -31 -97 -180 -121 -195 -288 -227 -456 16 -192 -984 -577 540 -6 -249 258 371 377 30 -75 231
1888 231 666 550 0 -341 -208 -25 -594 -563 -136 -131 -516 -690 -381 128 162 461 434 531 630 556 -92 -40 698
1911 698 475 -27 -46 90 -264 -521 -524 -514 -451 -29 -421 -603 -307 406 287 477 173 586 291 74 281 103
1933 103 32 412 -97 -504 -491 -269 -593 -411 -95 -68 -204 -146 -108 -46 291 509 546 593 560 428 -219 -66 405
1956 405 190 -139 -370 -284 -161 -286 -594 -382 82 191 -176 -412 -49 716 225 230 339 612 216 163 210 73
1978 73 181 118 -316 -449 18 -497 -710 -585 -155 36 -494 -353 -145 302 227 39 184 576 692 89 73
1999 73 57 249 -58 -282 -40 -111 67 -349 -672 -93 49 -154 -134 38 112 -26 -505 63 626 427 309 283
2021 283 326 -25 217 20 47 -154 -86 -158 -678 -495 -185 -171 -166 92 -97 43 -149 94 124 198 235 76 -16 450
2045 450 102 -320 198 -286 66 -210 -453 -374 -222 -127 -182 -387 -76 65 102 -239 -23 235 543 384 277
2066 277 233 127 163 -171 -348 -127 281 -83 -506 -516 -356 -395 -262 -351 151 253 -76 58 393 651 645 314
2088 314 183 481 54 -275 -292 -268 -16 -408 -505 -426 -300 -230 -488 -115 112 232 231 38 224 305 595 281 95
2111 95 323 328 40 -281 -525 -27 -296 -248 -418 21 -212 -363 89 12 599 136 269 251 276 332 258 -123 294
2134 294 368 -155 -249 -349 -93 -21 -371 -672 -405 -146 -168 -179 63 196 308 327 190 78 286 525 293 -4
2156 -4 286 77 -307 41 -74 -177 -132 -247 -357 -72 -192 -275 -244 155 570 681 15 233 356 250 58 310
2178 310 -2 131 55 -464 -344 -298 -97 -207 -353 -418 48 67 -343 -220 251 403 179 -105 173 231 328 -99
2200 -99 -32 484 164 172 -320 -341 -50 -130 -201 -183 21 -304 -92 -36 -11 344 -35 220 36 55 95 55 -85 212
2224 212 265 -153 -273 -121 -280 -181 -385 -229 -17 -62 -397 -297 -50 157 138 23 -140 287 296 30 30 162 254
2247 254 -127 14 -65 -167 -248 -275 -141 -117 -68 -135 -334 -227 -129 51 66 313 537 391 206 234 287 80 472
2270 472 282 -244 -482 -379 -361 -261 -307 -351 -140 -575 -501 -77 249 163 271 -71 279 307 176 -88 511 171
2292 171 38 -62 -152 -179 -91 -214 -547 -286 -139 -57 -145 -262 235 274 155 27 563 564 311 -98 -92 285 146
2315 146 -185 -76 -336 -112 -537 -436 -144 59 -147 61 70 -82 278 232 137 131 667 257 -59 155 224 -65
2337 -65 -248 -126 205 -115 -87 -584 -344 -149 158 -139 -174 -127 349 -50 134 225 246 368 101 244 -84 67
2359 67 123 -267 -243 -37 -12 -500 -144 -77 -305 -141 -150 -105 23 424 456 -193 296 409 106 147 149 197 -166 -135 -125
2384 -125 -121 -31 -172 -293 -12 -85 218 35 22 97 293 -121 -168 20 224 64 365 -52 -244 276 101 -198
2406 -198 -72 20 -108 -381 -305 -31 -52 -222 148 94 35 156 170 -26 162 471 -2 21 218 220 -4 -298 33
2429 33 92 -273 -114 -470 -302 81 159 -280 -11 614 -17 -212 -125 237 155 188 284 299 114 481 -255 -120 11
2452 11 122 -311 -466 -364 -306 -215 -340 1 -276 76 71 -69 -165 502 373 -81 135 194 -173 -85 -252 -241 -239 -318
2476 -318 -174 -561 -44 -82 126 -49 100 426 74 40 110 323 228 117 224 50 75 13 -299 -238 -161 -73 -268
2499 -268 -51 -154 -205 -280 -28 -1 -106 171 275 102 -176 334 270 13 305 372 59 -211 -86 -277 -365 -13
2521 -13 -182 -267 35 -131 -307 -22 -149 189 120 151 177 -269 121 -94 51 250 135 -57 -325 -286 -336 7
2543 7 -468 -17 -116 72 -115 -45 -90 196 357 53 -48 226 217 -127 63 -78 310 -346 -162 -355 -233 -204 -227
2566 -227 -225 -148 40 -152 -207 -85 35 225 21 -90 146 -266 153 35 -285 -153 -11 -101 -191 -324 75 -192
2588 -192 -277 40 6 133 -380 -120 -134 17 188 50 -78 -13 -79 -48 214 174 183 34 -35 -145 -412 11 43 -218
2612 -218 -192 -52 63 -120 -145 136 201 181 147 11 237 186 194 129 80 145 -159 -58 -184 -16 -417 -225 -88 -146
2636 -146 -95 -315 -104 -156 162 501 196 128 440 275 260 145 58 197 86 -269 -37 -202 -234 37 -421 24
2658 24 105 -20 7 -223 -53 25 -28 292 303 186 404 59 111 6 39 -256 -115 -130 77 -510 -194 -219 -5
2681 -5 -61 -67 -173 285 158 280 225 53 532 66 -155 -337 93 -114 -53 -202 -103 -228 -206 -540 -108 116 -190
2704 -190 -256 11 -18 269 62 88 180 285 164 257 -41 81 -212 59 -262 -91 -27 -288 -354 -357 -135 -15 117
2727 117 -188 -83 222 92 58 158 95 141 27 112 9 190 31 13 -142 -94 -144 -58 -215 24 67 267 -138
2750 -138 73 -70 156 -69 -181 382 188 515 55 100 -1 234 230 -214 123 24 -167 -302 -226 67 196 -297
2772 -297 -11 130 378 88 -63 -218 169 373 274 11 101 315 -269 -391 -106 -8 -226 -91 -146 -99 -229 -173
2794 -173 -51 -58 244 394 120 -166 235 212 -19 -85 251 -5 303 -14 -76 -106 -65 -144 -255 -244 -27 184 -46
2817 -46 -120 -10 -23 -285 152 19 153 157 143 -74 116 13 226 -220 -44 -35 -414 -340 -169 -72 -47 -17 -38 15 193
2842 193 136 232 85 317 313 -15 22 -34 150 -136 -494 -26 -132 66 -42 -241 -70 65 126 -308 2 20 93
2865 93 -31 62 -55 364 317 183 154 -15 -17 -44 -22 -141 27 -135 -441 86 -151 -40 -149 67 7 405 169
2888 169 84 46 214 304 -298 -59 -107 142 -37 -60 -260 -231 -129 -197 -249 142 97 56 -120 -171 115 266 -15 285
2912 285 133 -67 -74 -201 110 155 -179 -130 -184 70 94 -224 -171 -104 250 -151 134 -16 -25 265 256 -2 72 -52
2936 -52 0 -126 47 -26 -152 -154 17 99 -265 7 -11 -352 -64 277 -109 -245 -83 331 -70 -53 155 341 -87
2959 -87 173 17 -36 26 165 26 -346 -135 -30 -199 -38 -29 -195 -227 -285 33 -14 -83 -7 -5 68 246 118 -98
2983 -98 99 318 -157 -110 -461 126 -85 -36 -329 -220 -37 104 -217 -137 135 72 -61 -191 87 286 222 360
3005 360 384 -43 191 -84 -34 -390 28 -126 -190 -52 -2 -174 -81 127 -71 201 266 -136 -190 57 145 124 177
3028 177 207 5 8 81 -140 -101 -8 -171 -131 -39 92 65 -321 -41 279 -157 158 -234 304 158 -66 -241 165
3051 165 -152 -20 -306 -162 -243 -183 -98 -273 81 -208 -203 45 -22 43 234 44 186 48 356 112 27 -46 -162
3074 -162 72 -168 -269 -18 -492 193 -11 -245 -300 67 185 185 349 172 -17 78 190 66 -52 90 -147
3095 -147 -86 160 -226 -225 -107 -282 -266 -3 -39 -214 -102 -17 25 170 108 -94 -47 209 276 93 -75 -166 248 181
3119 181 -30 122 -47 -71 46 88 -288 -393 -91 -22 1 236 -271 31 81 -110 61 241 197 98 87 35 52
3142 52 -58 72 -91 176 41 -149 82 -148 45 67 -115 298 -4 -114 20 118 132 126 -87 88 221 323
3164 323 -81 -187 -37 -192 44 -163 -104 73 -86 -253 57 108 152 10 72 32 133 215 -180 -103 34 -10 48
3187 48 -22 -166 -22 -239 82 -101 -1 -90 -94 -51 -2 31 219 34 57 283 -26 160 410 -16 147 -181 15
3210 15 -95 25 -15 -33 -160 -21 -56 -231 -126 54 17 25 -219 -44 6 25 217 -42 163 -48 -80 -35 -184 -468
3234 -468 -71 -63 -196 -128 -152 31 -259 208 -64 310 173 123 194 205 114 103 -42 75 -7 141 132 -115 86 -179
3258 -179 -77 -163 -142 -80 212 -243 -145 -25 115 -47 91 29 136 100 90 30 70 -18 15 -255 -211 -57 109 -160
3282 -160 52 -109 16 4 21 67 120 406 -103 230 36 87 48 27 104 138 239 -196 -193 -210 272 57 -46 156
3306 156 9 -130 138 439 -108 -92 283 51 124 67 43 -54 -80 60 249 -273 162 -27 280 -76 -164 -135 -260
3329 -260 -1 -223 -239 -307 13 -204 248 -132 195 166 -6 314 134 99 -60 -101 32 -180 -174 -189 28 224 263
3352 263 -82 -64 77 17 152 90 63 99 280 -86 -147 177 157 178 322 160 -258 -252 -15 -327 -43 -106 11 225
3376 225 -12 71 85 337 -91 -61 86 59 143 -135 -55 -131 53 -35 4 23 80 -55 138 -82 -7 -17 -85 -75 63
3401 63 9 11 43 62 -86 99 269 -75 67 4 -141 -35 -203 -28 -67 -105 -88 -133 37 33 84 -102 57 194 111
3426 111 110 185 -19 146 -43 42 116 193 -482 -168 -126 -60 5 -113 -152 -14 35 -124 91 415 116 143 240 62
3450 62 309 254 -199 75 30 -105 -321 -188 24 -133 -320 147 -58 -21 -266 20 133 2 150 -141 -56 48
3472 48 -45 87 -75 194 -43 49 -203 12 -224 21 0 -299 -222 121 152 -206 34 -106 177 -21 -91 110
3494 110 146 -46 -155 -10 292 -443 38 109 -338 86 -256 26 -77 9 148 -208 -229 -234 84 337 69 72 40
3517 40 251 226 -1 111 -113 -76 -116 -243 278 -143 -149 19 -232 -68 7 348 107 194 195 -5 -39 130 239 36
3541 36 36 37 -92 167 38 -269 175 334 -58 63 42 51 -63 17 -182 225 184 -74 259 146 26 69 -45 162
3565 162 343 -50 -348 -59 -252 -185 142 -27 -213 -149 93 -162 -91 -40 67 366 131 -20 -9 120 184 206
3587 206 10 262 -242 -79 -193 68 -20 -314 152 -1 -82 -222 -78 -205 231 416 42 293 79 133 200
3608 200 -1 -82 -99 27 -180 -453 -185 -147 -113 -290 -105 -12 -198 110 60 245 104 259 -79 -35 44 -39 -4
3631 -4 76 83 -133 -75 104 -145 -153 -35 175 -59 127 -201 67 3 148 117 125 252 98 427 -75 -41 -93 -10 130
3656 130 267 -113 174 -72 -21 185 -136 -120 -152 -17 -62 17 -92 -85 213 210 110 199 -72 -41 -22 154 0 321
3680 321 -84 -231 -60 28 -141 -126 -19 76 53 -241 150 127 317 -20 180 128 -35 -84 -206 114 256 -26
3702 -26 -177 163 -107 -81 14 14 -15 207 -215 -119 -172 -61 -196 -68 178 161 245 120 -122 28 156 38 77 -269
3726 -269 -45 89 62 -6 -18 39 14 52 -139 175 145 -18 103 -130 156 16 111 155 117 87 27 -81 -19 -261
3750 -261 -30 302 -66 -194 -327 -77 193 4 104 203 -73 72 206 95 227 -134 -21 72 -207 -18 169
3771 169 60 139 -126 26 -336 -31 -211 -128 -144 -11 331 105 0 128 102 163 -205 189 82 -153 -350 164
3793 164 -14 -405 -99 -41 -68 -89 -61 151 -117 -9 201 -34 180 -71 -181 9 -81 -42 -107 61 -241 -336 -236
3816 -236 67 -153 155 -171 -254 -6 24 137 37 134 169 -3 230 266 57 -206 -111 30 -295 314 -25 -144
3838 -144 71 157 21 -157 136 1 6 -166 -14 -14 240 256 -132 -39 41 -102 68 -102 43 -104 -71 2 90 -340
3862 -340 -77 4 -116 57 -75 228 -3 229 280 -18 -3 5 -56 133 -106 45 -68 113 28 -281 -276 -138 38
3885 38 15 -159 -115 28 106 -71 134 82 -93 18 18 109 -153 -131 -253 -112 -48 52 -59 -50 -247 76 -223 -106
3909 -106 -221 -67 -167 -313 61 126 -43 -230 158 -12 236 103 -77 313 -69 11 -75 -29 -142 -120 86 -103
3931 -103 -230 194 -144 124 37 -184 113 26 129 -15 -67 90 50 -169 -48 71 -83 87 -98 -12 -100 -101 -217
3954 -217 74 -150 19 35 247 210 45 180 164 424 134 24 118 123 111 -79 42 13 -142 -311 -78 -66 -132
3977 -132 38 52 -30 184 75 9 -141 44 -110 230 -202 -4 21 -9 -62 -295 24 -80 -26 -205 -178 -21 132
4000 132 -2 269 51 37 229 159 -50 179 -295 97 -129 -39 -260 -34 -165 65 -41 -169 -87 -170 -60 197
4022 197 -205 -248 -40 -1 216 205 25 71 -223 277 -191 -191 23 -11 -214 -271 -127 -223 32 -86 -257 25 241
4045 241 -110 -6 -74 22 -148 -230 221 -6 21 -12 104 76 -107 120 -108 -83 -129 99 -108 -94 21 72 -21 -160
4069 -160 88 113 154 -112 76 -47 23 -24 -109 157 78 75 28 87 -3 -192 165 103 59 41 1 -26 214 -69 146
4094 146 171 241 -100 131 245 -163 157 331 87 251 27 -216 -36 186 -148 -165 160 -154 -231 -352 -80
4115 -80 -157 146 68 -92 170 -31 -16 43 24 61 150 152 -353 235 134 302 82 -126 -239 17 238 173 175 64
4139 64 101 -64 0 54 -55 -158 -101 312 -202 60 154 194 -84 -45 -232 -149 -52 63 114 -160 140 -7 51 -55
4163 -55 289 114 -74 41 98 87 141 242 -189 -158 24 14 -272 -160 -26 53 -155 27 -297 -53 171 48
4185 48 -33 65 20 -47 -234 -42 -59 -83 -165 105 -84 -172 -129 187 201 -82 -38 227 -3 -3 -110 -146 100 116 -188
4210 -188 -54 -174 -240 -230 0 -343 -8 -318 -39 144 -127 106 -61 -17 -240 -111 13 92 4 -30 114 -13
4232 -13 163 -51 -83 227 267 -253 -224 195 112 -53 59 -159 49 228 200 -54 -237 1 -411 124 66 -52
4254 -52 -12 186 -38 205 -135 -14 217 239 107 100 110 -47 -99 50 192 -204 -10 269 57 -14 293 56 87
4277 87 -101 45 -93 256 -56 -161 -65 6 198 77 196 80 -180 -81 -182 33 216 166 23 -52 -52 -45 134
4300 134 -239 -108 147 -145 29 191 -369 49 232 2 -58 -222 -32 91 230 -39 113 -59 268 86
4320 86 -20 -219 249 104 -196 -38 12 -34 -221 39 -13 -278 15 27 64 24 -42 91 62 157 -226 183 96 50
4344 50 -16 -34 154 -216 -32 41 -119 -106 -170 88 114 29 -185 144 -84 -207 71 -120 259 6 -137 121 155
4367 155 129 215 -29 156 50 100 -155 -238 203 -36 -75 22 -96 -86 110 56 -65 195 125 344 -18 -47 -132 89
4391 89 50 -141 -167 109 -88 -174 299 -87 -1 -127 -171 70 10 -50 -37 71 -16 85 47 -232 -18 -7 -8 120 -186
4416 -186 129 -206 -120 214 -127 -111 -141 -210 -47 40 246 -9 -14 82 6 37 -156 83 208 36 -133 21 134
4439 134 -13 22 -20 82 7 -106 87 -88 -44 377 -10 216 84 -193 58 -40 87 -128 46 -282 59 23
4461 23 -167 204 -188 192 112 -264 68 16 87 110 83 307 -48 -63 219 196 -40 67 -82 8 -127 -133 0 83
4485 83 -148 -164 34 -155 1 -57 1 221 -145 -3 -84 -87 -23 -53 -226 196 237 -131 26 -244 68 81 202 -137
4509 -137 -133 -293 116 -23 -62 59 27 11 -156 151 -223 17 0 78 -23 -263 -5 92 -142 143 313 -188 -153
4532 -153 -327 200 -77 -38 31 -178 -179 126 67 414 -24 160 -140 16 -42 -91 -218 -87 -193 -130 87 -184 152
4555 152 -332 -46 222 33 88 -97 -219 44 -18 194 78 113 68 160 -147 -18 228 -120 -55 -208 67 222
4577 222 -105 236 -8 84 -19 -202 -147 196 -227 57 117 85 -152 -60 108 -248 -179 -6 3 -50 -66 -306 -104
4600 -104 159 197 -108 125 -25 130 194 -217 -36 68 -215 -136 -69 332 -84 2 55 -98 164 -42 -9 -136
4622 -136 -136 79 -56 180 11 -30 183 -19 23 -31 -45 -54 124 18 -147 -49 -130 164 -219 316 -149 -42 162
4645 162 -4 -51 -198 97 -31 -74 115 203 -47 -272 5 104 114 -112 89 27 -151 168 18 131 150 -214
4667 -214 -151 62 -68 -57 -285 -365 -158 -19 126 9 245 -242 -237 59 209 29 -290 19 -26 166 -43 66
4689 66 -111 -51 318 -141 69 11 124 -166 -92 130 -95 22 -23 30 54 -15 174 -44 -46 -40 -235 6 73 -118
4713 -118 71 -15 38 -149 16 143 206 258 90 60 239 27 144 120 -84 -65 -80 286 -77 250 -264 -175 -20
4736 -20 -99 213 -37 281 126 160 189 72 -25 202 80 99 57 8 269 -74 73 134 -106 -26 -111 33 70 -148
4760 -148 -79 18 -205 -48 -85 -133 -160 -145 -104 -240 193 -25 171 41 108 98 12 28 -108 34 -190 102 173 -3
4784 -3 -298 -72 99 -53 -47 27 98 26 -65 -193 -22 -41 85 54 142 207 121 3 -42 155 91 63 284 -198 134
4809 134 -182 -96 144 -220 63 13 66 106 -57 39 -91 -122 -86 131 -238 -43 -56 -35 74 -32 -15 169 24
4832 24 29 -65 -79 -10 -10 65 267 -333 273 -289 -5 74 -169 120 -99 -73 -135 161 222 13 -98 120 216 221 -155
4857 -155 -145 -254 128 -212 -57 -180 -163 -103 -111 -12 60 -24 113 -140 -213 -177 83 -64 -113 94 66 4 -41 -47 -329
4882 -329 -270 123 295 -70 -92 -1 -70 105 93 -60 8 -260 52 -3 90 333 217 -1 -197 37 -137 48 -233
4905 -233 36 -27 261 15 114 62 64 -50 -92 -119 53 96 119 -3 80 112 -112 -134 -40 -87 174 -132 -103 -59 -62 -182
4931 -182 -88 316 -33 139 -96 54 33 -380 -226 213 -18 154 198 121 -8 -104 -123 116 124 37 204 152 -306
4954 -306 60 5 131 137 -183 -89 170 -64 122 -60 281 -5 179 -94 2 112 50 -98 -49 -29 -47 -101 -195 -114
4978 -114 37 228 -147 -71 73 196 -133 31 -2 60 114 84 -22 42 198 -211 -85 -56 -327 120 -74 83
5000 83 -116 -181 17 -27 -122 -33 -76 -15 61 -156 130 -359 171 177 -15 190 -85 -223 -106 -344 168 -146 -20
5023 -20 -21 -132 -10 -34 -50 20 25 100 -188 -113 117 -31 -46 101 -59 -116 111 112 -52 -102 -77 -85 -55 -97 -152 -296 54
5050 54 -91 115 207 46 -72 -111 297 96 -35 -168 77 100 -22 145 23 288 48 -52 -280 166 295
5071 295 -200 149 123 -33 65 65 94 146 -156 138 373 -37 -40 -218 -159 45 189 106 -163 -83 -119 84 -99 -2
5095 -2 -31 98 89 90 161 101 -51 -137 -36 -195 -10 17 -67 187 -137 -232 -228 43 22 206 -95 15 -123 17 -125
5120 -125 71 40 -116 -89 -184 74 -145 -13 -17 -12 -18 -85 117 -136 -142 209 -154 249 75 -228 16 121 -45 68
5144 68 -226 48 -40 232 -315 150 297 -82 -66 -241 20 -223 258 160 147 152 -103 -120 0 46 13 77 -35 -87
5168 -87 -7 -244 129 156 229 45 -86 -23 63 168 -219 53 -274 -57 51 -127 -25 -34 -172 -229 132 310 97
5191 97 -44 -61 -294 -86 91 61 -190 169 -85 139 -102 -31 -83 23 -197 -198 26 -126 111 240 176 -257 92
5214 92 -175 -57 1 -147 -65 -66 117 -78 -158 -55 349 -181 -181 -201 -222 -28 55 34 -116 70 79 26 31 162 201 -5
5240 -5 -111 -61 10 176 65 -140 111 15 224 290 -148 -121 85 422 44 -109 -84 -23 85 -30 43 257 208 39
5264 39 44 -50 45 58 22 -143 -48 -267 39 357 136 -69 -195 209 71 -48 -44 -37 12 137 183 -45 -214 175 -21
5289 -21 71 71 128 36 92 125 -80 -67 1 235 -161 -335 -12 -65 179 -60 -185 103 131 -181 -95 -91 71 -41 57
5314 57 -164 148 196 -219 63 -69 -78 -120 -114 -9 13 -142 -169 -94 -19 25 -170 -285 34 -139 -25 35 -3 123 -107
5339 -107 99 133 1 -89 -34 -37 -3 -116 263 78 3 276 -162 62 -57 141 138 130 43 27 -120 -92 34 -153 -17
5364 -17 30 206 65 85 -137 46 152 -204 -167 70 93 18 164 45 -131 47 -248 -18 -120 205 -20 -13 -29
5387 -29 119 -32 -33 26 -231 83 192 -154 130 17 -294 -104 229 111 -40 53 -5 115 96 154 66 142 -34
5410 -34 -119 51 114 18 -31 -201 110 -8 27 103 -5 -101 30 -268 125 98 6 -88 -195 -81 97 -22 32 37 10
5435 10 -40 -223 20 324 -70 119 169 -155 -51 3 152 -12 140 -254 125 19 70 66 -111 85 -54 292
5457 292 -238 85 113 -102 54 79 -211 84 -219 -157 -30 127 1 60 66 233 50 -31 188 -141 166 -21
5479 -21 194 -44 320 -6 -119 -293 15 252 -68 -56 -76 -53 48 33 -2 112 -89 -84 103 210 -39 -146 125
5502 125 -78 -32 -144 -54 154 72 -75 -1 -60 -126 229 -29 139 -63 -35 -59 137 -69 -195 -21 116 52 119
5525 119 -21 -103 176 51 -87 26 8 -201 232 -9 -91 -191 -181 164 -17 135 -201 -139 -65 -123 241 182 -27
5548 -27 -15 56 173 -370 -223 78 150 -13 -10 10 -317 -116 188 118 293 -139 -109 -43 294 116 -42 154 -188
5571 -188 232 -151 -332 -228 -74 -66 -52 -160 177 27 36 -32 31 32 -11 63 13 71 -259 -149 65 -230 -365 53
5595 53 17 104 35 -148 -141 73 -11 -161 155 -13 -112 -40 -70 -21 10 -249 55 -32 -86 238 -154 127 119 -183 -2
5620 -2 80 93 107 -183 239 324 -15 174 -78 77 -196 182 23 -376 -173 -56 174 15 105 385 -169 186
5642 186 148 75 -118 110 -97 -170 108 -165 117 -196 83 138 -86 -56 62 33 -2 83 -54 120 -190 -140 0
5665 0 133 54 41 -107 -155 -123 -276 -268 -120 141 285 146 -71 -159 -91 200 -141 -154 72 8 144 25 -194 -106
5689 -106 154 27 -21 -71 78 13 256 190 -31 -121 57 76 27 127 221 -115 93 228 -46 61 -24 -87 225
5712 225 84 -137 -111 97 -72 -193 131 -223 -51 92 -51 -141 270 256 191 -4 13 162 -114 239 -3 111
5734 111 -23 127 136 413 15 -189 26 22 -23 -6 -151 162 108 -21 -166 50 -121 -34 -33 80 -27 297 95
5757 95 166 -332 -65 -40 -197 -17 -147 -94 89 151 -96 38 -270 24 -71 78 369 33 -178 29 -211 -358
5779 -358 -165 155 -5 165 107 126 104 227 18 192 270 50 52 28 56 19 12 -66 304 -385 -160 68 -50 12
5803 12 -106 -267 156 41 114 -162 -16 148 -249 -46 263 13 129 -164 152 72 -343 -330 -130 4 -2 -86
5825 -86 256 7 209 246 -196 235 -5 129 22 284 -274 -216 94 -217 43 302 -117 53 -43 -67 52 -138
5847 -138 -78 81 42 -42 64 72 -104 -194 103 135 66 336 -112 -255 74 44 252 19 -400 -11 217 -10 -46
5870 -46 227 -175 50 -132 -63 -131 75 169 -187 26 -257 79 152 -13 142 61 -211 -49 181 -106 -16 38 -223
5893 -223 110 64 -184 -35 299 95 -217 -382 -52 -159 75 -39 -73 -119 -273 -110 -44 -225 -130 94 -180 201
5915 201 256 -75 -18 64 2 -124 130 8 58 78 167 -38 49 77 -18 -183 -112 -105 -8 -48 -162 -133 112 42 -136 65
5941 65 -123 79 14 -243 -51 -1 -261 -96 -50 -142 268 31 -110 108 79 136 -35 -123 108 114 -214 -103 -113 20
5965 20 25 223 177 -12 -36 62 6 -99 45 -244 -69 62 218 -8 117 169 133 10 10 11 222 32 51 92 77
5990 77 -7 209 203 24 -429 -120 34 -131 309 290 43 -144 42 -49 139 -150 -122 19 -220 121 18 -66 37
6013 37 -18 -72 107 153 36 16 -76 -17 -212 128 44 -115 136 243 -127 338 0 122 -208 15 -97 -100 45
6036 45 -53 121 221 -20 41 -152 41 -121 26 -24 -47 228 -30 21 -74 152 71 -13 57 24 225 -217 -71 -16
6060 -16 -95 23 -134 132 40 -61 79 -66 -228 72 287 -6 -114 209 158 -146 -43 -251 -77 292 -68
6081 -68 -46 -61 105 35 -7 -257 54 -52 75 -167 -53 -134 -69 -13 -25 -126 -298 223 -85 -61 61 61 2 53 75
6106 75 -248 194 59 -111 16 117 -158 141 25 -190 -148 -213 164 -96 85 -28 -206 70 42 -109 -280
6127 -280 -115 58 -199 40 380 182 22 -32 -125 -174 -133 91 -14 61 -191 223 56 75 55 100 -43 -12 -40
6150 -40 44 -343 87 124 143 -100 -5 163 -156 -163 83 50 41 76 -264 79 215 67 22 62 -255 -9 52 29 -73
6175 -73 -16 87 -30 148 -64 -247 4 -202 11 -96 -57 -24 -48 37 -29 -83 -13 209 -48 210 7 91 135 66
6199 66 94 78 -199 -8 1 -142 -22 -60 -28 -18 115 -95 -65 90 202 -149 -139 115 74 -79 -188 198 -285 121
6223 121 -54 -34 172 -200 -205 -96 43 -245 168 124 -40 -144 177 198 -123 145 16 196 62 -82 165 154
6245 154 -19 352 -147 -101 -87 -262 87 -256 -32 -112 0 282 123 -171 -95 -173 -52 58 -70 217 41 24
6267 24 -109 58 97 -15 78 52 -66 -14 68 74 -156 174 -172 -166 30 129 98 -34 -39 74 146 403 -62 5 117
6292 117 -124 101 -160 -6 -87 -22 14 187 45 14 -189 -199 36 16 -142 58 170 1 -159 84 35 23 -10
6315 -10 13 -87 -118 138 -336 -91 212 40 -71 -388 -103 -50 -5 -368 103 115 -67 -193 32 -117 -56 30 176
6338 176 -96 -72 146 -259 -85 -34 121 26 14 -71 -186 -180 297 122 6 -185 117 -53 197 -208 51 17 -176
6361 -176 152 -14 93 -114 46 112 73 189 18 128 -145 188 -44 -121 27 109 112 61 -31 155 -130 55 61
6384 61 -9 -30 -4 63 -102 161 83 81 -101 -243 -69 -142 -187 177 -46 204 -9 67 -223 -83 -196 -113 -121 93 -55
6409 -55 -56 44 145 84 -179 228 -31 -209 -41 -132 -104 -116 29 46 62 -234 8 -103 -36 -6 -186 51 302 121
6433 121 -28 436 19 34 267 -198 -101 -159 -184 -84 67 -47 137 72 -117 171 -16 77 -54 151 54 -117
6455 -117 238 -46 -14 194 117 -182 42 407 40 -55 -267 104 -144 -144 -8 25 49 1 85 -52 197 -95 107
6478 107 212 134 34 83 255 -92 140 81 125 261 -65 141 66 49 55 -121 71 -48 -78 10 -8 -176 74 96
6502 96 17 287 -127 -210 62 129 -160 -247 -284 95 13 287 160 -298 49 20 -179 1 -115 320 -104 79 142
6525 142 -11 96 163 106 -125 -104 154 -32 247 140 36 -155 -64 -120 -36 -88 18 179 -23 -97 58 -95 17
6548 17 37 67 207 227 202 44 -13 236 165 33 25 27 218 -127 98 21 -88 -11 -95 -31 45 23 149 101 295 -14
6574 -14 -69 -219 -97 -23 43 -7 -18 -132 62 -96 -186 -46 -119 206 337 28 -28 141 -139 116 229 -96 47
6597 47 -128 -33 10 24 101 163 -56 91 -153 -49 23 -155 -78 -42 -3 166 -4 -189 -159 215 137 -279 -205 -34
6621 -34 112 304 81 -3 52 -242 318 7 216 119 118 85 0 167 -28 36 217 -27 -135 257 -224 -7 -7 -37
6645 -37 -9 -156 213 215 330 192 -55 -211 233 57 -76 -125 1 -60 -238 -203 -47 2 77 -16 65 -156 4 -203
6669 -203 -32 -131 -22 121 -5 22 -88 -37 156 159 -62 50 -22 -291 93 -66 55 96 -364 115 -126 -55 120
6692 120 -325 41 10 196 30 -71 155 51 -65 -117 -73 16 -79 -32 13 99 -46 -63 -4 46 34 121 186 -159 -166
6717 -166 3 203 83 243 -71 -61 -175 -112 168 -60 -40 -28 -81 -161 -34 -83 62 105 -49 -271 -138 -114 -132
6740 -132 -282 31 -216 225 -39 100 -110 87 335 -77 103 39 233 -10 -4 -44 61 -55 -68 19 -37 -21 118
6763 118 -2 -97 146 143 -184 215 -12 87 248 74 30 -83 11 -108 -235 -21 -67 -71 -147 -389 101 21 -38 -80
6787 -80 57 -104 -371 -65 163 -76 49 -98 -163 -74 -79 242 -62 -101 -198 78 -73 44 -4 -225 60 -139 -151
6810 -151 -221 24 135 -100 198 75 -214 -29 126 -208 27 127 -216 -74 155 342 -74 -154 202 30 56
6831 56 351 221 -130 -51 70 -80 -256 86 -109 22 116 -64 -11 66 13 113 156 188 -41 217 -89 258 -122
6854 -122 101 -99 89 127 254 -15 137 5 84 128 233 12 -56 24 -26 -195 -134 -27 -15 -53 -190 -84 192
6877 192 46 91 155 -128 99 -51 -76 39 75 -147 53 54 202 10 101 35 293 -81 -8 -282 -139 -30 35
6900 35 -187 -19 79 -4 -39 -19 -11 182 266 -21 -190 47 237 -80 -111 -114 197 -94 26 -122 86 158 -3 35
6924 35 -45 -150 -140 156 -85 44 160 -53 99 -15 -204 -75 27 79 1 -115 -101 91 91 125 -212 58 56 15
6948 15 -50 -31 197 -109 -139 -55 10 -13 15 5 -64 -111 192 29 -177 54 98 56 290 116 108 -50 -11 34 16 58
6974 58 132 267 -197 126 21 120 76 -153 -221 -108 -1 -67 82 109 -179 67 -74 136 251 -172 -137 81 62
6997 62 114 -11 308 34 141 -78 233 -25 134 168 -58 -87 0 71 232 -242 45 -111 -42 -253 126 282
7019 282 -75 163 -193 -213 -126 -100 -40 -113 407 50 -304 120 -150 -97 -153 16 -298 -158 143 -187 58 61 -107
7042 -107 158 256 -222 -145 -171 -68 165 146 -2 -13 79 21 39 -83 -119 33 -3 -35 -144 -160 130 -6 1 23 234
7067 234 -128 -73 -123 131 109 -414 -104 -1 -42 -138 370 -110 -94 81 145 167 -142 -324 8 90 -199 -288 93
7090 93 141 35 47 40 -64 55 306 -59 -152 102 -53 151 101 10 6 18 71 -147 -213 148 65 -49 41 -27 -127
7115 -127 -89 -13 36 101 50 -44 -250 -145 233 -5 -133 151 -59 -31 -72 17 -25 -40 -234 242 122 -113 40 98
7139 98 -45 -17 190 101 239 204 -59 34 92 -59 100 1 92 297 -25 -20 62 -39 -45 -189 81 270 -39 88
7163 88 155 224 146 37 200 91 -106 -282 60 -225 123 144 111 249 27 92 34 -32 108 -74 -175 -28 -176
7186 -176 -52 155 273 -187 141 -161 104 -3 10 -74 -3 19 -34 89 127 83 198 -208 120 133 303 59 133
7209 133 -79 -146 214 33 98 35 118 -28 -142 258 -40 109 -109 -85 79 9 -24 64 -29 24 78 236 -161 109
7233 109 -128 53 -248 78 129 -102 -55 10 -200 -420 -99 -228 50 134 -26 101 -155 -61 90 -4 170 -96
7255 -96 104 88 -176 43 168 148 65 -187 180 -100 -9 -59 -38 106 -105 83 271 -250 77 -35 160 155 -14
7278 -14 67 6 -76 30 48 22 -57 -140 -89 82 115 71 -28 -84 32 -41 33 249 8 26 -118 -105 133 -3 45 135
7304 135 93 -133 18 88 -229 159 -183 142 -7 94 -148 86 148 -10 -153 -212 10 41 -277 -279 38 -59 26
7327 26 -146 181 17 27 -69 213 -135 -35 90 -52 -141 -122 -9 203 274 168 -216 -93 156 -109 58 169
7349 169 -88 137 8 -12 -221 -178 -227 -84 27 -165 182 -85 -23 -299 75 -56 -112 10 -86 137 -31 62
7371 62 -85 160 -52 -387 210 -18 -185 -56 249 -49 165 144 -132 -2 -49 151 268 108 -90 108 -149
7392 -149 -44 136 4 126 -23 -151 -135 -79 104 229 -45 100 -159 -14 28 108 28 -212 221 185 -24 -475
7414 -475 -159 -111 34 -45 -148 -52 -25 260 -190 64 163 36 -84 50 -50 33 -109 -181 -340 -4 201 -155
7436 -155 -62 42 -267 -151 -11 110 45 53 106 -272 14 139 280 -331 278 164 -202 270 -9 13 73 -149
7458 -149 -236 -143 -143 -5 -119 187 65 123 125 223 -86 -100 -202 104 55 215 111 41 265 -39 -76 -251 75 -149
7482 -149 82 100 283 7 -7 111 75 53 208 -30 -248 -46 7 -227 -117 -34 -154 106 -186 220 -321 -49
7504 -49 -399 -92 60 -115 -14 90 33 -42 153 -197 -142 -83 -179 55 118 100 83 13 -227 -101 58 -295 131
7527 131 -261 528 -65 146 29 -20 -399 -122 28 123 -139 -158 270 49 -124 175 -86 -99 13 -260 -174 73
7549 73 46 -56 66 -195 -57 -183 -27 -118 -24 124 -50 -43 -136 133 90 102 -309 75 13 19 -12 -137 -136 -3 -182
7574 -182 112 153 -139 189 -15 51 92 44 -80 -77 -25 132 -15 -145 -134 42 -90 155 376 69 -23 -186 -298
7597 -298 43 105 139 149 82 227 -16 187 208 -419 -222 13 -62 -146 100 102 223 -8 112 13 -40 -280 -4 -49
7621 -49 -310 -54 49 22 -41 150 -58 -52 -79 77 106 146 42 -5 295 268 -185 -82 -155 -62 -91 90 -180 -183 111
7646 111 -35 -64 -20 -216 -217 -41 -159 22 -182 241 128 -185 -28 -115 -120 92 106 -31 -20 -29 -67 -20 40 23 6
7671 6 -211 5 59 -59 228 -163 66 -92 124 67 12 123 20 8 56 -44 -286 -154 -297 -65 -469 118
7693 118 -83 -110 126 113 -12 82 290 79 -291 -32 -40 -77 95 40 157 -39 42 -30 -152 70 3 -219 25
7716 25 102 101 -79 -15 13 -271 -322 -96 109 -16 38 -49 9 136 163 -67 15 24 -200 -72 127 149 -97 90 -81
7741 -81 213 104 -119 -180 82 264 71 -48 -74 -34 41 174 25 100 -55 -54 -195 -16 186 9 202 98 -136
7764 -136 -252 290 -65 -65 -320 222 169 66 29 137 4 73 97 215 -158 -134 22 -212 -64 -323 4 -188
7786 -188 128 -162 82 -80 -24 -98 80 -70 174 140 -124 -87 -63 -77 31 -107 139 150 91 200 -2 40 112
7809 112 106 -320 254 13 23 -332 228 113 260 196 -54 -298 -163 -8 67 -160 68 -33 -34 123 22 139
7831 139 286 -158 -145 21 155 138 97 127 147 146 -126 -181 -104 -205 -69 29 97 -69 -83 -136 -32 100 -241 32
7855 32 -79 62 45 -128 35 148 -111 112 12 30 177 -122 -76 -115 71 38 -149 -240 -11 -302 -8 -164
7877 -164 -41 -146 -66 65 160 -98 122 46 136 163 58 -42 34 -6 -182 208 -152 115 379 106 -226 135
7899 135 41 -299 -124 127 71 -135 50 -124 -109 308 -208 39 110 102 -39 -91 -28 -29 20 142 -68 -123 26 -187
7923 -187 -61 88 179 -38 81 118 -50 45 -262 137 -103 -99 8 -160 63 123 -208 -185 30 -35 -132 -253 22
7946 22 -198 -98 -110 -233 178 -199 -211 21 -279 -220 -21 -35 92 -142 -145 302 250 219 160 -27 -25 1 204 135 -118
7971 -118 356 -45 -125 22 74 188 73 255 -10 -193 -236 106 131 -168 -63 254 -52 79 51 223 -242 2
7993 2 32 -186 90 143 -228 -190 -62 -298 -117 -28 171 -124 37 31 -61 -221 -133 -109 -141 -201 -56 194 189 34 151
8018 151 181 48 263 158 256 -90 -12 91 142 361 157 -38 -166 199 35 12 146 175 -176 8 102 68 -104
8041 -104 73 -258 -66 32 239 167 60 -151 176 1 6 176 -81 29 229 11 -58 166 3 -43 -39 -55 -156
8064 -156 -283 -157 -90 -32 2 171 4 35 -55 -355 -15 19 -37 -324 39 -15 39 15 -110 102 -49 -261 2
8087 2 130 79 -48 77 108 -17 63 144 56 -75 108 87 -155 45 -33 60 -15 23 -154 -63 134 216 234 -17 121
8112 121 45 84 159 -8 -69 28 -80 -108 -6 -177 20 103 170 162 -232 264 -27 -1 68 -186 144 48 12 46 -39
8137 -39 229 -226 85 130 -23 130 -98 94 77 -170 -106 -262 -57 -87 208 142 18 -8 84 -49 -189 -212 90
8160 90 7 -133 -161 196 91 -39 166 -8 -113 136 -59 -87 93 65 523 146 77 92 -91 -236 1 -268
8182 -268 258 80 16 -114 121 263 171 41 -181
8191a81
$$ Imaginary data points
##PAGE= N=2
##DATA TABLE= (X++(I..I)), XYDATA
0 0 0 0 0 0 0 0 0 0 0 0 0 0 0 -2 8 -8 8 -8 11 -16 16 -24 24 -32 32 -40 48 -56 64 -72 80 -93 104 -120 135
35 135 -151 170 -189 213 -237 265 -294 326 -361 400 -441 488 -538 593 -652 718 -791 873 -962
54 -962 1064 -1177 1307 -1455 1627 -1831 2074 -2372 2747 -3236 3900 -4863 6391 -9192 16045
69 16045 -73039 -37404 88909 -5573 -46050 4584 50117 -6677 -13524 15775 14934 4723 20162
82 20162 12650 -13067 -14713 3176 -2146 -1198 1188 1093 -10225 -13444 -13680 -6347 12392 6095 -13869
97 -13869 3524 24925 -481 -34620 2208 41963 14158 -13504 5588 11172 -19675 -18008 9801
110 9801 2539 -8222 8790 6940 -28597 -27221 13675 19187 -1691 3211 18777 5099 -14668
123 -14668 -5118 10469 7668 -4178 -4795 3356 -130 -14168 -14399 5538 15428 3025 -4938 -527
137 -527 70 -4583 -383 4242 -556 1923 9824 1978 -14834 -9869 9283 8595 -4489 -3498 5100
152 5100 -1616 -13486 -5489 13901 19416 7706 -3305 -3956 -5646 -11431 -10348 -924 3664 1677
166 1677 1826 -1687 -7500 -1120 13994 9927 -5113 849 13976 1705 -15036 -2061 13792 3119
180 3119 -10073 -4006 780 -5452 -8244 -4650 -1173 5157 9732 -359 -11349 -4979 7102 7010 3114
195 3114 5793 8176 4690 -2610 -7777 -3196 7421 6847 -5907 -8314 -1116 -7549 -17605 -5356
209 -5356 11905 5289 -6322 1073 8569 2704 1893 8731 5515 -54 5969 4738 -11106 -12312 4667
224 4667 5578 -9107 -7251 5168 469 -11457 -7227 4062 6974 4913 2734 442 -146 2250 1553
239 1553 1258 5906 5755 -1115 -5518 -5053 -5559 -2753 3383 3079 -2062 -535 -398 -9064 -8386 7678 11597
256 11597 -3968 -6981 7902 10074 -2768 -4106 4944 5225 816 454 -3410 -8767 -3866 3220 -1710
271 -1710 -5406 2038 3323 -7212 -8354 3897 8651 2001 25 5486 6862 -934 -8266 -2969 8554
286 8554 8807 -3523 -8126 -597 776 -6680 -5238 4096 3745 -1692 -2268 -2645 -4065 1106 6603 1207
302 1207 -3390 3836 7075 -2483 -6265 3940 8596 1032 -2830 -207 165 -4536 -6105 -2939 1876
317 1876 2847 -1568 -4897 -2298 834 560 1038 4082 4181 2375 943 -2636 -5250 1821 8397 2479
333 2479 -4677 -1198 1353 -5109 -6008 2405 4524 -1524 -2822 40 -1481 -2680 443 1740 754 2536
349 2536 3315 -1296 -3264 1166 4520 2570 588 168 519 -68 -3178 -5848 -1323 4597 1127 -5024
365 -5024 -3313 587 -2327 -2634 4547 7117 1969 -682 694 -913 -417 4199 4088 -1044 -1164 2249
381 2249 -2979 -8788 -4287 3692 1871 -3759 -3163 505 1382 41 -47 2883 5494 3733 -1530 -2108
397 -2108 1810 1759 -375 994 3108 1680 -2507 -5583 -6501 -3138 2067 424 -5036 -2575 3917 1544
413 1544 -3580 1586 10159 7886 200 -1770 317 48 -1425 -806 -108 166 -699 -3414 -5523 -3903
429 -3903 142 1294 204 -520 559 695 -252 -303 3879 6818 2981 -2127 238 3506 -525 -6148
445 -6148 -1727 5029 2149 -3977 -5010 -3820 -2420 764 2422 -351 -692 2852 2122 -1615 -581 4397
461 4397 4495 1055 -529 -806 -2295 -3221 -1490 1687 3959 1177 -4347 -3832 1081 394 -4276 -2029 3689
478 3689 1599 -2299 -559 1532 1382 3677 5771 763 -2843 1005 591 -6367 -4630 4524 4742 -3250
494 -3250 -3258 1266 -433 -2911 43 1525 771 526 -646 -3813 -1017 4645 3915 529 2303 3198 -1180
511 -1180 -3403 -1323 -523 259 1824 -1860 -6652 -2137 2449 -2697 -4797 3558 6371 -1741 -3217 3400
527 3400 3173 -695 2106 4957 614 -1677 -183 -2625 -4253 1084 4233 -1163 -4186 -163 21 -4082
543 -4082 -3258 847 1892 1693 831 -1271 -70 4033 3993 1085 2515 3921 -1553 -5276 -1993 -98
559 -98 -1935 -846 964 -830 -1834 333 -1043 -2791 1605 5231 -78 -4237 313 3607 666 -710
575 -710 2694 4268 1688 -1272 -2550 -2515 -1141 3 -482 -926 -1127 -1325 -2047 -2001 -259 2455 3357 625
593 625 -1756 532 2943 -22 -1479 3294 5197 -956 -4756 -1511 409 -770 -1565 -263 199 46
609 46 -798 -3385 -2398 1304 3079 722 -19 949 1373 1068 1438 940 2154 4213 283 -5103 -3080 1201
627 1201 -2524 -4904 1086 3944 -2185 -5243 -255 2023 827 1686 2115 -296 1088 3518 -59 -2698
643 -2698 2502 6540 1089 -4641 -2697 -653 -2763 -2580 -1091 -228 161 -454 -2767 -1414 2945 2827
659 2827 -414 1915 4943 756 -3221 -216 2742 808 507 1256 -2041 -4192 -920 -467 -4246 -1454
675 -1454 4244 1399 -3931 -1834 2607 1563 -386 2147 3149 995 -213 -651 -740 564 2403 836
691 836 -1716 -1409 -1074 -2172 -3013 -1105 1254 1701 -1 -1444 -1317 1341 2208 178 255 3134 2424 -1916
709 -1916 -2576 936 1706 -477 -8 1216 -825 -2744 -1949 -1201 -649 929 1302 -1438 -1948 669 1590
726 1590 -1239 -875 3340 4274 -446 -3371 -52 2241 864 -728 55 879 -459 -2367 -3031 -1653
742 -1653 617 876 -1078 -1369 309 698 -442 26 1670 3288 2230 -626 -1821 555 2393 -368
758 -368 -1977 572 1822 -1841 -4240 -2185 466 -158 -473 -177 -92 -8 -9 158 829 2694 3134 1327 -980
777 -980 -72 1089 -498 -1635 -250 1734 -295 -3348 -3414 -448 300 -602 -1211 826 1404 84 -762
794 -762 396 2263 2548 2280 1038 -471 0 471 -1095 -1441 99 641 -1718 -2933 -1693 -629 -387
811 -387 -355 458 1091 1071 -464 -1003 1216 2980 1869 229 1198 1228 -639 -1254 -877 -1022 -35 1223 -1644
830 -1644 -3942 -1783 1410 -101 -1849 958 3169 543 -1264 571 1921 1478 1045 1295 639 550 -755
847 -755 -2309 -1634 796 325 -1986 -2181 -614 -608 -1236 -527 404 1682 2522 529 -1694 623 3499 1669
865 1669 -937 1294 2475 -1043 -3332 -1457 83 -737 -889 -341 -1161 -953 -216 -617 -493 1509 2650
882 2650 197 -1133 316 1196 958 441 517 1779 1419 -1205 -3002 -1752 991 -386 -2416 -955 671
899 671 -803 -1601 419 1654 1478 1259 1112 -488 -931 869 693 -388 591 2506 327 -2108 -1224
916 -1224 565 248 -935 -582 -90 -270 -795 -1598 -908 1559 1705 268 -178 847 440 -304 271 809
934 809 707 505 119 -1672 -2041 596 396 -1408 -782 1226 236 -2282 -1306 824 941 -198 357 174
952 174 451 657 295 232 1565 2771 1039 -1330 -1244 -240 -1006 -1732 -1076 -668 -426 -878 -1255 -572 1254
971 1254 2226 386 -91 1827 1405 -743 -944 1734 1973 360 -336 -331 -914 -908 -717 -1838 -1892 97 17 -2486
991 -2486 -2004 966 1784 805 1523 2378 1847 132 63 412 1069 959 -214 -1704 -1044 -969 -2319 -2084 -358
1010 -358 621 -200 -652 -432 -145 955 2016 1002 866 1551 1999 -162 -1347 423 1335 -11 -561 -567
1028 -567 -1270 -1880 -1725 -856 -812 351 270 -353 -1 1069 1176 959 1356 1701 1564 210 -1164 -1642 73
1047 73 1099 -755 -1778 188 717 -1822 -2211 87 936 36 -538 -330 -134 298 1088 667 673 1671 1297
1066 1297 -717 -910 238 352 -632 -736 262 56 -353 -1650 -1651 61 1701 107 -1542 197 1408
1083 1408 -99 -880 1086 1801 363 280 -62 -634 -433 752 46 -899 433 806 -1515 -2683 90
1100 90 960 -850 -826 692 310 96 418 100 793 2084 1575 -881 -469 1166 75 -1200 -51 1180
1118 1180 -306 -1004 -826 -1271 -1103 291 263 -1047 -196 1109 -278 -1353 899 2578 860 -147 971
1135 971 464 -397 -443 -245 -287 1 11 -1346 -1808 -585 88 -715 -574 652 647 -38 235 321 1025 1895 1252
1156 1252 153 -221 621 -144 -1402 -919 600 10 -1033 -1572 -838 -746 -308 -185 -164 514 1065 443 -427
1175 -427 744 1979 1939 351 -113 686 424 -1188 -1491 -447 554 -557 -1770 -1342 -103 -440 -704
1192 -704 400 1098 1383 929 108 25 1217 1308 568 -111 672 786 -907 -1755 -1214 243 9 -999 -1371
1211 -1371 -695 -212 -228 -680 417 2004 1200 -250 259 1129 689 111 433 559 167 -69 -1064 -1578 -607
1230 -607 541 -313 -1162 -211 745 -201 -948 341 1407 1257 202 119 446 725 -32 104 272 546 92
1249 92 -1085 -1128 -870 -71 -49 -526 -274 155 -118 -707 -764 295 1182 999 -69 -78 656 637 -226 63 811
1270 811 869 -382 -1126 -998 -504 -17 -374 -259 -17 -220 -357 -666 -563 739 1555 696 -389 445 938
1289 938 -198 -699 761 1562 369 -449 -955 -688 -41 9 -708 -779 107 143 -1511 -1447 467 1030 619 648
1309 648 565 662 891 340 -189 487 1130 -8 -1665 -580 434 -759 -1544 -214 719 -253 -906 -404 -336
1328 -336 454 855 665 287 1008 1330 -76 -434 693 1268 -137 -610 -517 -869 -912 -914 -786 -633 122 141 -1138
1349 -1138 -495 850 1057 246 751 1471 563 91 154 -215 151 815 -69 -1057 -667 96 -788 -1336 -629 236
1369 236 -228 -608 -164 -121 413 1225 953 931 1172 1026 -313 -472 37 363 -460 -439 -260 -674 -442 -960 -659
1390 -659 55 734 540 -750 118 1034 339 -169 590 1351 1057 245 -136 -630 -143 572 -581 -1080 -323
1409 -323 -154 -1265 -1444 -509 626 138 77 73 421 508 560 197 648 1590 743 -874 -840 480 155 -737 -503
1430 -503 421 -141 -768 -1071 -836 -2 612 55 -491 54 1238 -48 -300 710 1552 765 -116 -301 -168
1449 -168 166 -421 -709 -389 256 -233 -1206 -722 233 451 -66 1 597 356 -281 52 155 474 1192 647
1469 647 -394 316 478 -50 -503 -504 55 -282 -859 -897 -511 -27 -33 -136 31 289 332 -138 -249 96 965 809
1491 809 152 338 104 22 -216 -423 -131 -25 128 -896 -1194 -326 76 -319 -455 344 691 293 -202 76
1511 76 763 848 678 -77 56 513 -45 -855 -680 -166 226 -810 -934 -454 -253 30 -477 235 779 762 -83
1532 -83 -630 441 1270 636 162 499 466 -145 -952 -601 -277 -31 -344 -889 -623 -232 5 -583 -342 1071
1552 1071 1339 236 -105 631 819 581 428 201 151 -3 -563 -1090 -812 -285 -436 -900 -685 -341 -557 -647
1572 -647 -41 766 626 897 407 140 599 811 47 -216 378 596 -530 -1033 -537 -444 -365 -527 -280 -554
1592 -554 -177 -200 -260 -101 729 982 510 138 445 633 182 -204 398 184 23 -563 -710 -800 -34 -154 -634
1613 -634 -370 272 158 -510 -469 385 755 479 104 121 315 409 -178 -117 330 360 -150 -1042 -445 -10 -188 -397
1635 -397 -217 -29 333 -2 -599 44 963 683 -91 -5 567 338 -166 -443 389 461 297 -504 -687 -113 -98
1656 -98 -686 -540 130 273 -286 -555 -370 499 635 498 326 260 560 146 -228 77 744 354 -437 -215 -251
1677 -251 -468 -564 -739 -210 90 -8 -200 -497 -67 570 415 186 355 864 439 127 -141 585 150 334 -228
1698 -228 -418 -554 -207 -718 -738 165 69 -42 -317 -5 124 274 199 646 791 726 250 -132 -82 601 271 -210
1720 -210 -497 -321 -609 -746 -1095 -563 251 50 -181 -310 281 532 109 205 738 680 858 -96 -226 30 438
1741 438 -166 -778 -608 -129 -713 -909 -828 133 430 157 -221 8 543 910 87 437 956 821 -62 -441
1761 -441 -233 -41 -535 -784 -334 -279 -125 -794 -535 -161 524 130 -479 57 802 165 -146 618 617 613 474 5
1783 5 -90 -73 353 -158 -735 -147 31 -851 -764 -132 -54 175 193 326 388 428 202 -273 350 674 533 -160 -298
1806 -298 100 -381 -595 -148 90 -326 -215 -472 -773 -299 -30 13 -133 245 874 124 139 573 830 269 173
1827 173 -61 -23 -26 -187 -412 -367 150 361 -469 -365 135 30 -143 177 -142 161 246 9 -107 154 714 544
1849 544 42 53 290 90 -495 -445 -268 -40 -54 -660 -382 -69 56 -400 -86 395 415 18 -10 424 361 528
1871 528 243 83 97 135 -240 -813 -458 176 -12 -509 -443 -149 -287 -303 75 369 517 566 144 -31 452 624
1893 624 119 -2 392 478 -666 -563 -129 -270 -485 -116 -219 -306 195 37 -463 -6 725 627 -161 151 579
1914 579 306 443 455 382 286 165 -78 -860 -565 -53 -544 -627 -275 29 -273 -266 127 346 722 635 276 113
1936 113 86 577 -20 7 188 247 -537 -720 -350 -510 -263 -134 -499 -235 51 32 -294 -183 536 527 400 160
1958 160 433 268 -79 -167 -108 78 -153 -394 -773 -393 -105 -194 -464 -3 226 67 -68 112 352 466 272
1979 272 112 166 306 229 -594 -41 288 42 -397 -511 -431 -288 -80 -198 -262 252 222 -29 -55 305 599 392
2001 392 211 528 313 71 140 -256 296 295 -140 -289 -167 -157 -310 -424 -303 150 148 171 -364 140 459 252
2023 252 1 -102 451 418 -125 69 197 330 -63 -91 -18 -26 -270 -400 -577 -42 288 -303 -151 -489 33 353
2045 353 482 -127 492 611 262 -20 -80 184 434 33 -467 -218 -167 -82 -294 -265 -304 15 25 -321 168 266
2067 266 101 194 -46 301 454 10 -163 41 -5 15 -286 -15 -305 -310 -522 -688 -146 276 83 -159 -163 135
2089 135 674 189 231 451 652 255 -57 -189 184 -137 -306 -551 -271 -226 -444 -564 -474 -192 -194 -53 34 335
2111 335 315 77 -86 551 430 451 -198 -43 22 -53 -459 -386 -48 -250 -289 -473 -243 -46 90 -94 250 191
2133 191 337 297 136 256 602 707 292 -130 63 38 -380 -430 -458 0 -145 -387 -403 -44 231 265 -15 535
2155 535 316 228 350 133 269 264 104 -188 -157 -80 -77 -171 -149 92 -19 -128 -253 -198 134 157 -6 119 537 290
2179 290 74 -98 199 310 232 -232 -223 -130 237 -101 -516 -490 -194 -22 -159 -353 -41 58 143 -83 174 364
2201 364 -104 149 117 103 207 140 152 98 -132 -111 -401 -387 -17 -57 -246 -283 -290 21 83 -134 205 104 345 141
2225 141 -249 -5 243 380 -201 111 179 -42 -307 -308 -384 -131 -214 -505 -394 -140 56 -109 -51 225 62 5
2247 5 -143 201 340 337 19 145 163 114 -411 -474 -324 -95 -20 -365 -225 -32 -10 -304 -52 205 42 217 239
2270 239 89 92 371 290 20 -264 44 -171 -281 -638 -369 -222 -4 -442 -279 63 -53 -84 -47 20 88 89 239
2293 239 221 292 157 9 90 -60 -87 -122 -591 -341 7 -112 -264 -75 -2 84 -99 138 183 244 271 82 -37
2316 -37 214 275 10 -73 171 9 10 -265 -311 -402 -305 -14 -416 -161 439 77 -138 41 544 446 291 287 275 76
2340 76 -38 -142 -33 6 182 -424 -400 -280 -110 -30 -400 127 263 -29 33 -25 90 286 -50 22 30 319 -109
2363 -109 -306 -210 212 9 16 -45 6 -321 -250 23 -109 229 41 20 -85 -69 348 -83 216 443 162 215 -145
2386 -145 292 -390 167 122 -267 -240 -42 -161 -330 -474 127 153 24 72 276 -67 169 246 99 117 518 255
2408 255 -33 -292 214 -196 -160 16 36 -21 -246 114 -406 -93 48 -113 -344 -86 189 138 298 321 344 163
2430 163 56 86 -68 157 397 -342 -263 138 -137 -558 -265 101 -1 27 -13 -149 159 87 179 277 217 579 -65
2453 -65 -26 -35 125 2 -428 -223 -161 -294 68 -303 -357 -20 392 -101 105 131 335 -63 140 264 69 192
2475 192 84 -118 124 -205 -478 -376 -159 -278 -75 -315 -400 -60 -159 -13 246 4 222 179 240 395 282
2496 282 404 -14 -48 47 -79 -240 -381 -185 -188 -138 -74 -215 -210 28 342 21 97 128 185 -145 200 -59 25 208
2520 208 57 -301 93 -114 -220 -254 -280 12 -111 -308 34 -132 4 328 201 145 269 120 -32 98 289
2541 289 -59 -270 -92 59 17 -79 -251 -137 218 105 -190 -266 104 211 86 27 271 162 218 -145 70 217
2563 217 177 -158 -4 -373 59 43 -512 -441 157 -117 -13 -299 -63 251 13 231 -201 265 148 18 -168
2584 -168 269 15 -63 115 40 73 -305 52 -10 -34 -342 -65 -73 -111 4 -81 39 -258 254 304 -30 309 -42
2607 -42 247 181 6 78 181 236 -66 -53 -225 -88 190 7 -340 74 -172 -152 -189 85 246 322 -151 -164 46
2630 46 27 -46 -151 170 -189 -30 -447 -305 -272 -174 -86 -450 -171 -109 256 155 -230 119 346 302 -220 79 -37
2653 -37 375 224 -8 108 -219 -331 -359 -306 43 -323 49 -335 -236 -24 117 225 149 354 484 205 -128 308
2675 308 181 334 -190 50 -186 96 -64 -148 -246 -302 -235 -320 -37 36 -334 -255 -50 223 142 77 226 210 226 -67
2699 -67 -198 -154 -176 -176 -336 -195 -91 -88 -161 -426 -31 -159 -45 318 269 279 506 174 51 25 163 -25 -108 -28
2723 -28 -141 65 -66 -97 -132 -115 -174 -65 -305 253 125 4 370 380 92 377 121 156 297 134 107 -426 -216
2746 -216 195 -40 -105 -410 -27 -223 -11 2 -65 316 53 -101 75 223 204 203 12 -73 218 33 65 -141 164
2769 164 -57 -351 -33 10 -246 -109 -241 -315 120 147 63 -111 -294 292 -34 120 217 104 15 204 -126 185
2791 185 -179 65 5 -257 -94 -236 -234 -142 -154 -353 -61 184 78 -12 136 69 182 140 78 -125 12 -16 180
2814 180 -266 -118 -236 -250 -241 -325 -244 -263 114 -144 171 -80 92 97 -51 32 -92 354 -20 -83 -50 202 -57 -120
2838 -120 -124 -62 39 -49 -63 29 181 233 -71 179 132 36 445 166 165 112 47 -75 -57 151 145 15 -289 -161 -46
2863 -46 -70 -217 -128 -135 -36 169 127 133 -83 44 281 121 228 269 219 29 -30 -263 -170 -50 -169 -580 -99 -245
2887 -245 -231 23 -77 148 -104 251 -87 -7 347 -79 -39 -154 194 -148 -6 46 70 21 -23 -117 116 -164 -190
2910 -190 122 -112 149 266 101 91 379 54 -103 -153 176 -148 -237 -128 -32 54 -127 80 241 3 -225 19
2932 19 -155 263 241 30 40 -98 176 147 191 142 -62 -110 59 -132 -97 211 65 67 -201 -52 122 68 -95 -174
2956 -174 -169 -130 90 -120 -282 53 411 -38 -228 -47 136 69 -134 -44 22 -316 -125 -14 75 -67 -82 -152 7
2979 7 -141 -8 -49 56 186 121 106 184 56 -73 160 131 202 260 -111 -29 -225 -92 48 -187 -10 -68 165 40
3003 40 323 -118 245 468 193 220 153 125 157 62 -69 242 -37 -189 -69 -118 25 -342 -304 -311 63 9 8 -25 406
3028 406 421 113 225 464 5 260 67 -101 -168 24 170 -213 -98 -130 -287 -72 -30 131 27 -215 -159 176
3050 176 302 297 121 197 49 96 -37 -119 -107 -20 -75 -74 -126 73 -56 -26 -232 59 -128 113 -85 -276 125 210
3074 210 -36 -51 -7 239 89 -403 -232 109 47 189 -347 178 38 116 50 -60 158 -64 337 -133 272 162
3096 162 304 -53 16 220 -13 -252 -141 -357 -244 -163 -272 -48 -230 52 -183 -4 27 88 171 181 -110 -82
3118 -82 6 59 102 54 -117 327 152 -40 129 29 21 -265 -69 37 17 -193 -99 -14 -127 -55 52 239 -23 -174
3142 -174 20 -2 233 -203 -10 86 28 -138 8 -184 -152 -92 -126 -176 -239 -117 -88 101 -128 -115 -161 -24 -56 -2
3166 -2 286 23 130 141 77 -144 82 -294 -71 -54 -85 50 69 -7 1 -120 -61 47 -70 80 147 217 133 10 38
3191 38 -210 -70 -129 24 -153 -92 -237 -195 -116 -204 -9 9 169 147 -92 276 -35 253 191 -170 222 99 -130
3214 -130 -200 -57 210 -23 -355 -198 -147 -64 7 -313 -248 -172 -97 130 30 323 -74 370 71 221 -46 -13 -7
3237 -7 177 91 -22 -38 -217 51 -51 -185 19 -125 -78 230 225 86 -65 203 102 135 34 -133 40 -89 20
3260 20 56 12 -387 -234 16 -475 -145 148 97 -3 119 -23 11 111 -102 48 4 -145 85 -192 -59 1
3282 1 -159 210 -158 -129 -202 -223 147 -113 -85 269 185 135 183 -64 48 169 195 93 -19 191 -165 39 15 -46
3306 -46 -74 151 -66 -102 45 224 88 124 -192 -100 -70 -62 157 -139 121 -116 66 34 -162 43 24 -113 -33 -219
3330 -219 -358 22 61 292 15 -35 16 5 -17 -42 257 263 99 131 34 165 150 -5 -118 -95 -77 43 -215 -188 34
3355 34 -41 -7 -228 -196 173 -30 -38 146 150 13 79 303 48 56 46 169 -77 308 26 -95 -121 -38 -241 -15 132
3380 132 42 33 182 215 -28 472 215 114 357 472 -34 259 -138 -188 2 3 -192 -219 -111 -18 21 -89 -38 108
3404 108 -68 91 62 -12 214 -45 170 197 71 -112 63 -228 91 -61 89 22 -55 35 -151 -194 38 -162
3426 -162 -13 243 331 -14 54 32 -23 269 77 -39 -92 -348 4 -175 -9 -242 163 -296 -195 19 -19 -145
3448 -145 -59 24 -40 92 32 116 -42 54 72 -48 219 -32 94 10 -61 -342 24 -59 -3 -300 -133 285 -10 65
3472 65 85 -39 -12 -234 212 29 24 177 217 -104 67 -81 92 52 -87 -74 -278 1 73 -5 0 136 -18 -225
3496 -225 55 85 119 77 225 489 63 -11 171 74 -119 62 72 43 -156 55 -63 -19 -181 50 -36 -89 -144 199
3520 199 220 156 -157 116 159 -164 116 61 202 -36 72 -35 83 72 33 -70 -7 -183 -4 176 -133 72
3542 72 213 82 44 35 -47 205 174 180 149 103 -167 -68 -130 -287 -35 -172 -150 44 -45 165 -129 -112 176 100 -102
3567 -102 51 37 144 -15 -31 -234 -128 71 -129 -313 -452 -123 70 -223 -118 153 -188 -21 -100 -164 20
3588 20 217 271 91 3 88 -5 29 -57 -263 -68 148 196 -3 -4 -417 62 150 -260 -5 227 156 -106 214 103
3612 103 8 76 -117 -325 -19 -87 -241 -221 32 -149 -74 61 -62 87 238 55 146 64 168 192 -31 286 27
3635 27 289 -5 174 99 140 -89 137 22 -19 -166 26 -139 82 -40 -50 153 77 -44 49 130 132 -143 -292
3658 -292 -202 70 69 -136 -202 56 7 -207 -101 -252 5 -49 -48 -69 -76 -31 149 37 133 160 -44 132 -68 -47 42
3683 42 8 -22 -72 -82 87 -256 -11 105 21 155 -24 161 -217 -76 -176 300 169 121 31 32 247 246 29 129
3707 129 78 -166 -62 36 -38 -114 -218 -131 111 129 -9 -334 -189 -151 -125 38 -170 -21 308 189 263 -20 128
3730 128 -206 90 18 -175 -49 -135 -175 -72 -80 36 -178 97 230 -164 297 9 18 -258 -102 101 162 251 -97
3753 -97 -94 -285 65 -54 117 34 90 -134 -175 63 67 -162 -121 196 209 -152 -62 0 -7 -10 68 28 -76 72 -126 -249
3779 -249 -71 -110 -26 -308 -214 104 -206 -11 166 150 99 114 339 412 -28 -109 201 -64 5 -371 -155 -134 -64 190
3803 190 110 -262 -274 11 167 160 22 167 75 88 204 417 -3 118 -267 -194 246 -151 127 -215 200 -35
3825 -35 -157 -28 151 -214 -253 351 223 -264 53 146 -28 118 -45 -95 -38 216 175 182 -273 -191 107 -143 17
3848 17 -40 -98 -202 84 -93 155 -105 8 49 185 -71 252 245 -250 158 -91 200 -157 65 -244 26 -177
3870 -177 -193 74 -49 111 -27 -126 -38 -98 14 -29 19 -132 38 70 -57 10 34 61 -10 -71 43 -240 224 -204
3894 -204 16 -168 -64 27 89 -180 -25 99 252 72 312 156 -32 -64 -358 118 100 -28 -213 122 -179
3915 -179 41 71 134 -120 -29 84 40 -20 226 259 101 181 230 188 87 -55 -59 135 -73 -155 136 -75 -6 258
3939 258 -289 179 -219 -14 42 172 213 127 25 -131 20 -26 -217 15 -25 -2 14 16 175 40 -55 -108 -191 -255
3963 -255 170 83 -46 92 151 365 59 17 186 49 214 -132 -120 -80 145 -341 -85 5 72 -130 -8 69 -87
3986 -87 70 -55 -201 264 277 -43 1 55 -72 -185 -85 -202 -324 1 -154 -105 -96 -354 -178 301 49 135 -195
4009 -195 276 29 -140 -12 32 -265 30 -83 92 70 59 -93 245 -6 148 -38 -37 -254 -103 21 -51 -111
4031 -111 -223 44 -118 66 31 -52 -28 -42 209 -73 168 -72 -1 -371 21 -170 -193 28 152 -4 -3 105 108
4054 108 173 63 96 192 -167 -39 81 223 48 -103 84 153 54 -71 -56 184 -123 -59 123 -197 38 132 20
4077 20 -236 11 39 118 56 88 32 -41 -67 -121 -7 131 -249 -63 -36 20 40 23 -212 69 -181 148 -23 163
4101 163 34 109 -120 57 -63 -29 -85 8 23 -69 -148 42 8 -66 -118 -37 -67 -249 -51 252 96 216 -194 134
4125 134 21 -157 121 78 -111 -294 173 -76 -122 -142 43 403 294 -113 -74 -223 56 116 147 9 38 114 217
4148 217 367 105 -118 -47 -171 36 -179 59 179 -115 -95 -72 -194 -145 -58 -124 -6 267 37 -98 148 170
4170 170 -25 -69 -14 9 -106 -103 -1 182 -65 -170 51 249 383 -18 -109 63 -163 185 117 123 177 -86 -3 -252
4194 -252 -282 15 186 132 -149 -46 164 62 -194 17 -224 -4 13 -100 -113 -31 111 117 103 53 109 -91 -235
4217 -235 92 72 99 156 -225 -124 -108 -23 246 118 10 34 127 -171 72 -4 178 94 45 -61 75 55 -23 -132
4241 -132 -110 -28 -111 -147 42 -5 -213 118 -112 10 -316 147 8 404 61 165 -135 -68 -25 76 76 -42 66
4264 66 -127 -68 248 -202 101 43 50 17 -46 171 94 125 -27 -171 -78 -213 168 -249 -137 160 -306 105 -138
4287 -138 68 151 -206 -160 -314 -115 173 -106 -105 -150 7 -56 257 -107 209 120 74 48 154 286 -77 19 44 -147
4311 -147 88 -189 -34 89 -90 -62 55 -334 -100 168 256 231 94 227 -41 179 -165 -165 208 -48 98 -70
4333 -70 -202 80 -243 -172 -251 -50 37 108 -49 3 52 -97 127 -55 -59 235 261 58 152 68 -48 64 92 -2 -2
4358 -2 6 -179 -97 191 -21 -172 -46 7 135 167 161 -132 140 -40 -18 255 -143 116 64 -143 -127 -41 78 -195
4382 -195 130 -10 155 -5 -41 -14 213 -163 21 -32 65 135 192 -83 139 110 -56 117 -204 -287 -31 -248 -302
4405 -302 3 347 279 156 -26 -117 169 38 19 2 12 -131 -237 222 164 -30 -164 170 27 -75 77 13
4427 13 -319 176 195 -44 89 26 -27 -72 39 -196 405 161 161 346 -54 61 173 -85 69 -39 -184 102
4449 102 -287 138 -203 -59 -313 -187 9 -20 -51 103 -182 -55 -118 129 223 143 211 -291 100 203 -108 38
4471 38 -90 66 -71 -63 -116 -150 -22 43 10 -25 -204 -126 61 -24 -135 305 101 118 93 8 -264 -31 -122 -88 18
4496 18 -110 243 -87 139 30 160 17 84 -63 114 -22 -51 -173 110 -415 40 185 -290 -34 -81 -224
4517 -224 -93 13 -223 23 -1 -31 118 279 125 49 101 61 333 -149 37 126 49 -10 168 -226 -30 -113 -153
4540 -153 -123 -54 -98 -150 -61 -104 -142 -227 24 -39 263 -1 -14 244 7 -128 -206 34 -176 70 191 -143 249 24
4564 24 161 35 204 -134 84 53 -41 129 -61 -192 -135 52 -33 178 -54 45 -103 -43 10 26 22 -159 64 149
4588 149 101 213 122 -166 -88 -281 96 104 -11 -15 -86 113 -14 -71 80 156 -96 -209 136 -434 112 -271 -259 -138
4612 -138 -138 21 132 -95 102 191 -54 74 -111 -58 100 -62 -138 -64 31 -265 170 67 -81 121 -14 21 -145
4635 -145 61 -33 212 124 281 -138 117 34 45 20 -204 -350 70 -54 116 136 -93 -168 -237 -213 133 -292 23
4658 23 174 116 -111 21 115 82 225 -89 2 -22 57 21 187 -201 137 -280 -257 81 -103 -68 -17 -36 -46 -91 214
4683 214 129 -30 -16 12 59 173 -1 38 211 52 -134 -113 -84 136 13 -202 102 -8 -97 -82 -105 40 -78
4706 -78 -186 -154 -211 -67 405 -32 63 -204 -10 57 -140 167 -75 -97 -96 70 19 56 -249 -235 -57 67 -59 172
4730 172 121 87 -167 67 121 33 103 -57 -179 139 12 -206 -145 -41 -19 -279 -90 -247 239 -144 -61 -36 -112
4753 -112 2 267 106 -240 -78 -83 -1 213 -98 69 -98 43 52 70 10 88 168 9 60 -36 -90 11 72 8 -62
4778 -62 133 -89 -36 -101 285 -67 -1 60 -43 344 100 130 -61 -121 -120 0 172 -43 162 -95 -77 63 64 -61
4802 -61 -173 77 -204 -16 148 31 -24 78 58 -156 243 -73 -18 -139 -91 125 -5 -192 -40 -103 47 41 -148
4825 -148 -174 12 4 326 -169 -53 38 96 83 100 -15 -26 13 -157 -5 -58 200 194 -25 262 76 -167 -39 307
4849 307 299 -187 -20 -69 -123 383 -8 -19 -32 -125 -153 170 -49 205 134 54 232 -76 100 -171 87 -116 -20 -16
4873 -16 212 46 -14 261 -148 166 3 29 127 261 164 -146 -132 -7 -85 83 147 -151 38 40 -58 -57 46 -220
4897 -220 107 -46 29 -40 227 -215 197 -173 184 161 -16 151 -312 -242 91 -192 -8 -7 14 21 -191 20 50
4920 50 87 -120 -101 107 257 -67 248 133 4 59 95 -174 6 -41 52 -120 -24 55 -44 110 -171 -229 -107 15
4944 15 79 -55 290 -77 113 7 -197 236 214 97 -2 -120 9 -68 54 -84 -116 120 -29 -94 -30 -90 150
4967 150 -49 -17 20 215 -44 -80 -237 75 151 17 -34 -33 89 -16 58 66 -24 187 132 -19 -5 -3 99 157 -72
4992 -72 -276 -145 233 13 48 16 88 91 -275 -35 41 -308 2 -56 14 -10 33 97 -46 -76 38 87 -55 35 12
5017 12 139 216 24 49 -24 215 75 -221 53 155 52 87 66 -105 -78 58 -152 14 -135 105 -58 -43 -157
5040 -157 81 151 -132 57 360 51 -221 -113 -61 -189 199 178 -206 27 -47 5 -39 -102 280 -130 177 -174
5062 -174 -54 43 67 58 -21 8 -98 240 43 -85 -278 -87 -141 -252 -194 -4 48 -132 288 208 180 198 290 -15
5086 -15 -195 300 93 205 14 -107 75 -171 -133 -23 -112 -85 82 -56 100 59 -164 101 172 184 -102 49
5108 49 -99 123 -55 -392 233 -94 75 83 218 39 328 -1 53 35 11 -35 28 19 74 -76 248 -171 96 115
5132 115 104 284 -107 -47 191 55 20 -80 133 24 59 -196 -179 64 -129 62 144 -235 -131 31 11 14 80
5155 80 -370 -45 -20 101 -146 141 161 -31 -76 280 -121 -6 -159 41 326 215 7 1 -98 -86 236 294 126
5178 126 -201 -20 -365 -55 192 57 -41 0 53 134 443 113 -112 211 -109 27 242 -83 46 144 104 33
5200 33 -112 103 125 135 143 189 242 -74 122 75 225 -57 76 231 135 157 -52 -336 90 -80 95 -341 -40
5223 -40 -57 -136 -33 150 -140 -264 153 -39 -59 243 86 -98 139 -194 100 96 260 81 -294 55 99 335
5245 335 117 -108 66 -2 -60 -206 -91 132 -92 -133 110 -136 -345 107 102 167 26 -39 -164 -20 -54 -121 -4
5268 -4 117 -117 -128 -174 33 98 92 -325 -105 -129 -26 50 -205 22 47 194 -16 -71 -206 -42 39 -134 -91 86
5292 86 -16 130 -76 -116 -81 161 8 -19 106 79 15 109 -17 -100 8 -159 -69 55 259 -68 -40 179 -121
5315 -121 208 -83 -99 67 -27 58 16 10 33 -205 -117 21 212 -76 144 -235 86 -78 -40 -6 -39 183 -183 -78
5339 -78 -48 -44 -68 15 199 -12 155 76 -163 225 -32 -173 -33 234 168 -152 219 235 132 -333 174 146 155 -124
5363 -124 -1 142 -159 -247 -12 -209 -318 -57 -115 -175 88 18 -92 -42 88 221 -225 -282 3 -112 132 179
5385 179 -121 136 -283 -256 28 -33 279 117 30 -21 -104 138 289 113 -139 144 219 -206 -52 -148 -71 -147 -31
5408 -31 -141 1 14 -12 62 36 -61 -100 -125 -76 226 -46 -201 158 186 -223 -299 -75 86 301 16 -124 106 -71
5432 -71 -114 199 64 12 -155 -19 -39 -4 -12 59 -64 -15 23 93 95 -49 134 123 168 -233 110 180 -236 -74 138
5457 138 -56 105 186 55 53 -404 25 221 -195 11 48 -120 -6 -195 -245 -166 75 32 -206 234 -261 -153
5479 -153 -97 40 -100 111 80 -24 351 -200 55 332 -21 102 92 -148 -16 206 158 -89 27 206 203 -171
5501 -171 45 5 234 26 -107 -68 167 -46 102 116 265 26 -58 258 -200 152 -248 187 -40 -24 -257 14
5523 14 -50 149 -14 -276 77 321 114 137 -70 11 175 93 144 -114 -391 23 73 236 50 -86 249 -177
5545 -177 -66 57 -71 -106 -33 -100 -211 55 -61 -35 59 228 146 -21 170 123 -31 247 14 135 78 55 155
5568 155 128 -91 14 122 118 105 219 173 -123 31 207 59 -140 -156 344 92 90 114 -42 202 -281 108 -36
5591 -36 -196 24 -144 39 -345 78 294 27 -171 83 -83 163 305 -103 166 57 -233 -223 166 -171 -49
5612 -49 -34 -117 -25 302 22 -290 51 -98 68 -171 125 -147 15 -208 218 -56 220 -10 52 -134 -45 33
5634 33 29 -224 -210 1 -167 -101 -266 69 -97 290 -107 257 130 150 39 -261 -4 -57 210 -332 -312 -135 -205
5657 -205 174 21 -34 198 121 18 -121 9 14 -190 219 -270 -121 -227 -163 29 78 24 -144 -147 -190 -135 68 -38
5681 -38 27 -8 11 105 -236 -323 -121 -29 -45 -113 -140 -225 342 -25 -14 304 2 -114 -74 -36 180 135 -296 -150 185
5706 185 -149 -25 99 -78 -55 -1 67 67 100 -277 34 64 -237 224 -31 19 -17 -242 -20 -55 3 143 209 122
5730 122 -80 222 130 241 -130 -94 -118 -353 55 160 -49 -167 18 108 -11 -176 98 -151 -1 -69 69 14
5752 14 -150 -107 32 20 -63 -70 -292 93 133 -32 64 -115 -115 -293 -27 206 -360 119 67 -53 117 248 -129 -124
5776 -124 312 -121 -152 156 202 165 319 -150 49 73 5 18 -105 -105 -179 159 -12 -116 -122 -227 -157 -5 -100 178
5800 178 -209 -128 -74 130 3 -124 116 -110 -195 -255 -17 189 -121 -30 94 -43 398 -10 91 -68 219 141
5822 141 -108 -190 37 -24 4 5 267 -12 -155 -165 -136 53 -192 -62 -8 -29 -79 114 -407 -147 -243 152 69 -117
5846 -117 103 -18 246 -49 304 -312 204 45 153 -57 166 -248 -77 -182 -261 203 59 183 124 -27 87
5867 87 -68 158 121 -105 -73 -73 -205 -43 -124 -222 -105 -73 -280 -150 -56 -161 18 184 -72 -29 -77 -292 -98 135
5891 135 -330 12 -2 -95 -217 -29 -210 9 -5 22 -78 95 180 47 -36 -309 -58 -159 114 -2 -158 109
5913 109 63 -67 12 42 -82 -176 -227 -162 187 -11 -156 35 -15 -106 -72 -51 -288 76 26 -100 -129 -112 -255 -89
5937 -89 127 90 -240 156 -22 -84 88 51 79 -42 67 65 81 261 -207 272 -29 -212 -145 -54 -77 202 80 61
5961 61 -55 -79 -173 140 -184 -274 64 -127 440 43 -1 -72 97 49 -64 -67 -29 -201 35 -180 85 -19 0 74
5985 74 9 13 -225 -201 -185 215 324 59 189 132 -31 47 42 -106 93 44 34 -171 1 46 -66 -123 -25 -102 25
6010 25 72 -222 -89 25 -102 7 189 -74 107 -106 -165 251 -242 -353 74 -162 87 -142 107 -26 -137
6031 -137 3 -16 4 46 138 -135 299 45 110 174 60 -31 89 49 181 -90 183 -244 -159 179 72 -87 258
6054 258 -39 -10 112 -60 -158 198 6 -25 126 30 -25 -9 -48 -366 33 44 -80 -272 88 -4 187 8 127
6077 127 -91 49 46 290 -94 -151 315 4 200 -465 126 -96 34 -90 -21 -32 73 -134 215 -136 145 104
6099 104 -76 -53 -73 50 -79 229 -35 95 76 -179 -1 361 63 -203 -12 -43 127 148 -47 -211 108 -1
6121 -1 329 4 -34 17 -49 106 -375 -14 83 191 -103 -10 103 148 119 -266 -150 -264 -163 -127 -215 -233 -281 -240 -10
6146 -10 129 -199 252 80 0 106 -25 11 -87 213 -89 170 -88 76 44 -175 -133 -48 -249 181 286 290 69
6169 69 234 -187 206 -37 73 35 -44 149 82 -53 249 -183 -96 42 126 -115 7 238 99 39 -67 -224
6191 -224 -54 176 81 -112 29 -65 -34 151 120 52 228 90 56 2 -172 129 155 -62 -219 61 -121 57 -123
6214 -123 260 -43 -103 -258 39 89 -55 22 132 49 -65 -35 -66 164 -70 -411 37 -254 14 -96 -224 -96
6236 -96 335 -210 54 139 -124 -124 29 25 -180 89 -16 106 209 199 58 -91 96 -73 -31 72 27 339 -183
6259 -183 -25 46 -65 -30 169 196 39 -206 64 -121 -128 -224 28 -38 -208 24 -109 -140 -6 -65 252 -15 -66
6282 -66 285 -41 -79 -174 20 267 -136 69 119 -101 -131 -189 -21 -115 57 -129 -215 111 -65 -229 20 40 -128
6305 -128 -98 109 143 -122 -38 -73 -216 57 95 -257 -101 94 99 142 55 117 130 157 -45 -13 -71 -23 213 263 43
6330 43 90 -63 45 22 41 58 -106 45 -166 111 -111 -53 -165 -127 -203 -150 69 257 137 169 69 -63 -75 -26
6354 -26 34 -23 143 -66 158 33 -81 103 -134 295 -91 61 38 -20 -16 -137 -363 -203 19 99 69 -168 238
6377 238 126 -128 155 -68 176 117 -32 171 -80 145 131 4 -498 -31 -105 -201 223 -241 -185 -167 -34 94
6399 94 -5 54 -214 -8 -82 271 -77 44 71 194 -46 74 39 -159 -102 -154 -12 39 208 173 -158 -102 -117 1
6423 1 -50 1 211 -118 187 160 -29 -23 -344 115 -39 -40 -99 9 96 -111 310 -41 24 -280 -252 145 54 68 46
6448 46 -124 -40 -15 -149 -65 13 87 -66 -92 187 213 19 216 208 151 141 202 295 64 -5 -52 110 58 -27 -66 -94 -243
6475 -243 148 -60 4 82 149 -20 -59 76 113 108 199 -16 -5 -280 83 6 39 86 -32 -98 -18 -110 -77 -51 54 -23
6501 -23 -90 -105 17 61 -108 303 143 -131 -226 100 3 93 168 -83 -95 -4 93 2 -109 13 156 114 -237 0
6525 0 -4 -363 42 -38 -20 13 142 15 176 37 -106 57 -18 10 22 27 -74 -22 16 -134 -95 126 157 -206 -18
6550 -18 -96 -227 81 242 62 -60 59 25 148 16 24 301 23 -62 52 202 -12 -154 -25 -41 -143 67
6572 67 69 -66 -8 -113 34 -139 -5 35 -152 -247 207 -46 -81 -183 210 94 -274 48 96 -247 159 -25 -161
6595 -161 44 -26 -80 -88 70 -75 163 41 18 -115 -76 37 -163 -115 -4 -156 51 -255 181 50 112 -312 108
6618 108 150 -81 200 89 188 -213 -27 -100 -2 -174 188 67 -40 123 -126 -1 -85 -49 -155 147 280 27
6640 27 -31 28 -6 -85 -76 -56 170 -132 -167 -43 81 47 -34 -24 54 140 -140 58 -295 -34 274 -53 -282 260 127
6665 127 -3 -111 76 66 -34 -89 -7 -151 311 296 -86 -111 16 148 -65 -83 66 -225 -246 -242 -158 -47 -83 128
6689 128 50 80 -8 2 -41 46 64 155 -105 47 -4 128 113 -61 364 -56 -137 66 -45 -81 10 -19 -24 52 39 119
6715 119 63 88 248 102 -179 91 -199 40 -106 4 -13 72 34 111 18 -67 -206 103 -115 181 208 218 37
6738 37 142 147 105 63 82 -135 -129 61 -149 21 117 116 -93 -153 64 -158 -244 263 -112 91 -30 322 -164 175
6762 175 138 -39 111 3 28 -163 -77 -61 27 -17 -61 -226 -160 226 -32 -241 -202 -159 146 -237 70 99 29 166
6786 166 -188 -184 -154 107 -73 273 -64 -17 -153 -133 -48 1 -188 112 -268 -44 -75 176 -200 27 -102 132 13
6809 13 -22 -20 -53 3 -85 -250 -182 175 128 -43 -90 -79 -165 -68 -20 -219 -106 20 136 555 37 179 326 92 14
6834 14 188 -71 -138 71 51 -49 -8 311 34 -127 14 -53 -64 -25 -68 167 -58 -162 -24 60 -118 87 -122
6857 -122 63 2 -48 -14 184 276 47 -13 -287 -79 -54 109 141 118 149 -55 207 -35 -85 -20 -38 28 -436 -120
6881 -120 -260 38 -12 -210 32 224 -122 -65 124 -388 -95 44 10 13 82 -45 84 65 218 -175 161 -149
6903 -149 -110 -155 30 -227 -78 163 99 20 -2 142 47 -90 -45 120 -74 -110 -50 -1 -343 71 -61 -89 149 -170
6927 -170 -83 -64 63 -39 -68 -286 370 15 30 -122 -74 -312 -158 69 103 56 24 38 -274 -6 -142 28 -208
6950 -208 -47 -112 -62 -24 20 -12 163 103 40 -58 174 75 -38 -71 53 22 98 131 -31 132 47 -93 323 -24 -266
6975 -266 16 8 -56 -119 97 -136 -111 -43 205 -193 -197 222 -207 163 -160 -158 145 -178 -208 470 -237 -269 3 17
6999 17 56 -116 104 0 10 210 -58 267 -158 3 -3 -130 -174 159 148 -201 -279 -39 24 90 61 363 -168 -174
7023 -174 69 -45 201 19 163 -184 -158 -27 194 28 -186 101 -253 -157 -14 -108 96 -153 -215 -97 -43 -56
7045 -56 76 -81 13 241 -88 -117 -110 -138 71 135 -318 -15 -128 -348 -273 -92 -251 -73 -189 -95 -130 -9 -146
7068 -146 42 120 -110 208 144 -132 229 -93 41 -188 -53 35 -255 221 -2 96 147 43 -133 -179 -183 -67 180
7091 180 167 148 -80 179 119 20 -140 73 -42 -113 19 -4 58 -160 -89 137 -34 -229 -25 74 -60 24 130
7114 130 -91 -76 231 -316 32 166 25 161 -161 42 57 48 -114 233 202 80 -87 97 -36 -16 181 -50
7136 -50 -224 125 28 193 -200 -120 63 19 -35 58 -183 -125 60 -49 95 -118 -190 160 107 117 105 94 39 166
7160 166 -140 224 7 -11 -51 -267 86 45 61 -28 -91 268 226 -133 45 127 -38 58 300 -263 3 205 95
7183 95 125 -40 -155 53 159 197 -212 -117 -17 -5 -122 -64 71 136 294 -176 -80 49 270 -160 -212 179 -94
7206 -94 114 25 -87 -30 -6 -49 39 -8 37 24 -10 137 36 58 193 -50 407 -24 -133 350 10 -306 59 -178
7230 -178 -93 -54 -67 52 -212 -131 133 17 -189 4 -143 253 -34 -195 -297 295 291 28 176 138 -237 -23
7252 -23 -14 28 -91 221 231 68 -70 -69 167 -77 0 -99 -228 201 -62 130 139 124 247 -18 -56 135 180 30 -43
7277 -43 -128 -191 -3 -74 15 -128 -25 -205 -81 -259 53 -237 65 107 21 -5 -116 -105 -230 -37 -25 230 -241
7300 -241 -104 76 82 47 -119 189 14 -59 49 17 84 110 22 76 -196 127 247 -66 40 41 -33 133 26 344
7324 344 117 -53 48 -213 -72 45 136 -158 43 -132 2 -24 -105 42 -15 -208 -44 138 11 -216 -82
7345 -82 -59 -113 8 163 95 337 91 -289 -29 111 25 171 -93 -12 102 -112 45 118 -221 -97 -8 -80 -21
7368 -21 -59 -105 68 176 -111 146 46 -25 -143 -29 74 184 -160 -261 -258 80 -127 180 169 170 73 -193 -14
7391 -14 -159 -47 -180 89 107 -93 -82 325 -45 -156 -303 -111 182 -73 119 -90 -178 -201 116 50 143 223 191
7414 191 31 -73 -96 -103 131 -138 96 -217 234 86 -139 34 238 84 -71 185 -6 -7 9 -67 144 -186
7436 -186 2 -66 52 -77 18 96 119 -234 -90 -190 92 1 -312 -291 -56 227 -61 71 37 13 82 278 -134
7459 -134 -197 98 141 -134 -178 -141 4 182 -148 247 206 135 -235 34 183 206 -166 3 -42 -63 115 95 77 -115
7483 -115 40 -40 72 87 55 200 -49 86 78 339 119 -111 56 241 -144 -86 278 94 150 -120 123 43 39
7506 39 232 150 -185 -50 -182 -22 -130 102 -6 -70 -74 -207 61 -242 129 -64 -323 126 -156 -193 182 -138
7528 -138 180 153 86 58 -57 44 -103 74 34 215 35 -25 61 89 -3 -68 121 -101 158 -161 283 156 -70
7551 -70 -206 -148 -96 72 -32 85 -123 -129 71 -208 -229 -31 -170 -118 84 -122 -189 -56 0 122 -254 -168 -28
7574 -28 33 -251 -231 -8 -153 -17 42 181 -58 333 24 121 -268 11 283 96 93 -66 -87 -3 249 -200 11
7597 11 -64 -305 90 -176 -242 -151 -158 -64 207 -147 63 67 -97 22 -75 243 4 25 26 160 6 -271 -241 401 44
7622 44 39 74 -128 207 -143 -20 303 34 -3 119 -48 -102 106 -23 160 -31 -125 -57 -4 175 -202 -52 14
7645 14 -343 -89 -191 -83 30 -56 -90 -122 -91 89 -54 -160 -311 59 48 -75 -1 -175 67 71 209 -20 67
7668 67 81 3 5 -286 21 118 23 -263 115 98 -13 -115 48 235 58 149 -21 -95 6 313 -140 78 -70
7691 -70 -87 111 -205 267 47 31 -242 39 224 48 -81 -73 -90 127 64 267 19 -40 0 395 12 -164 144
7714 144 233 -63 72 -129 -98 -72 -223 -121 -143 -52 -309 -41 -114 -6 -12 144 -181 -145 -106 193 190 19 17 -53 54
7739 54 -70 137 126 -103 146 218 25 23 173 293 -82 -77 147 261 -29 216 -40 -11 176 62 -113 -154 136
7762 136 0 18 -128 197 28 -30 -47 18 -121 97 21 -16 252 -189 6 -30 -88 23 161 24 -124 -79 -43
7785 -43 17 9 -24 55 -39 14 -143 -65 65 150 -66 13 202 48 -180 138 -153 62 29 -69 -63 32 36 -178 -123 114
7811 114 25 -23 -16 -52 37 50 -168 -440 -110 -63 -151 12 97 -100 190 -87 -19 225 -123 95 -124 209 -94 -169
7835 -169 -40 -143 -103 -84 103 47 104 54 -36 -44 -289 96 24 -18 -66 -225 -143 109 -47 33 15 84 -72 298 26
7860 26 132 81 38 -112 -87 278 300 -146 94 140 71 144 153 -171 166 -117 213 117 155 -7 -328 139 -91 -3
7884 -3 -84 -62 149 -148 374 182 -127 8 -64 53 107 -251 165 181 -249 -169 -121 -92 83 10 59 8 -91 -11 14
7909 14 -82 92 -91 123 23 -94 207 -21 175 89 -56 -105 -105 -106 144 -144 -32 -35 -135 89 4 -48 -13 -166
7933 -166 281 121 -210 -67 183 142 -247 115 180 -135 -42 45 93 29 -114 -200 -38 -53 -111 -241 5 -6 -177
7956 -177 -184 -199 127 -200 268 -64 46 4 -38 283 -233 54 -77 96 57 -6 109 192 -110 -201 113 142 83 -11
7980 -11 -98 -55 -118 23 -58 -88 -152 29 -27 0 145 58 -151 82 -222 68 -19 147 -4 44 130 -294 -24 75 140
8005 140 99 58 82 -129 98 -107 285 -44 -144 83 -155 107 151 -223 -152 -109 -128 83 -73 50 -213 -27
8027 -27 -187 -192 -31 -101 -237 54 77 32 16 -44 -171 32 -27 -49 155 21 238 56 69 102 38 175 122 23 -55
8052 -55 138 -59 36 -75 87 209 -83 -168 224 288 -159 -102 140 96 73 103 14 -112 -177 -72 318 -88 49
8075 49 -52 -123 54 -133 230 46 -277 -107 -24 -116 -452 -62 -126 -174 126 -242 -163 14 -37 -185 -153 -75 -1 -49
8099 -49 23 186 8 80 -153 -27 309 -260 -68 85 -64 -178 5 -226 -7 178 -68 -59 194 -131 77 17
8121 17 35 143 130 -109 122 8 178 -292 165 -12 152 206 -481 214 153 -74 233 75 -138 66 -9 -71
8143 -71 86 156 -272 -119 109 136 -14 256 -13 -194 -58 -68 135 -22 -242 -357 -12 63 -96 144 150 84 92
8166 92 -158 11 117 -91 152 70 19 -57 241 -99 -87 31 -316 398 -263 -70 -69 -133 37 111 -145 -70 16 -89
8190 -89 234
8191B34
##END NTUPLES=NMR FID
##END=
