##TITLE=1H_SL38-DAU-A(for500)
 CDCl3
 8 sc, 
 20.11.2023
##JCAMPDX= 6.0         $$ Bruker NMR JCAMP-DX V2.0
##DATA TYPE= NMR FID
##DATA CLASS= NTUPLES
##ORIGIN= UXNMR, Bruker Analytische Messtechnik GmbH
##OWNER= root
$$ XWIN-NMR		Version 3.5
$$ Mon Nov 20 14:17:04 2023 Russian Standard Time (UT+4h)  she@DPX200
##.OBSERVE FREQUENCY= 200.1313
##.OBSERVE NUCLEUS= ^1H
##.DELAY= (6, 6)
##.ACQUISITION MODE= SIMULTANEOUS
##.ACQUISITION SCHEME= undefined
##.AVERAGES= 8
##.DIGITISER RES= 18
##SPECTROMETER/DATA SYSTEM= spect
##.PULSE SEQUENCE= zg30
##.SOLVENT NAME= D2O
##.SHIFT REFERENCE= (INTERNAL, D2O, 0, 15.7039)
##AUDIT TRAIL= $$ (NUMBER, WHEN, WHO, WHERE, WHAT)
$$ ##TITLE= Audit trail, XWIN-NMR		Version 3.5
$$ ##JCAMPDX= 5.01
$$ ##ORIGIN= Bruker BioSpin GmbH
$$ ##OWNER= she
$$ F:/spectra/data/she/nmr/H-F/1/audita.txt
$$ ##AUDIT TRAIL=  $$ (NUMBER, WHEN, WHO, WHERE, WHAT)
(   1,<2023-11-20 14:16:02.75 +0400>,<she>,<DPX200>,
      <created by zg, POWCHK disabled, PULCHK disabled
       configuration hash MD5:
       00 E9 B6 7A A2 85 ED C7 34 08 36 98 17 FE 4E 26
       data hash MD5: 16K
       5E C0 A4 41 8C B8 65 09 2B FE 54 03 A4 5D 13 D9>)
$$ ##END=
$$ 
$$ hash MD5
$$ C4 2D 33 03 56 B0 39 52 D0 A4 F9 2D 37 69 11 72
##$RELAX= 
##$RELAX= 
##$RELAX= 
##$RELAX= 
##$RELAX= 
##$RELAX= 
$$ Bruker specific parameters
$$ --------------------------
##$DU= <F:/spectra>
##$EXPNO= 1
##$NAME= <H-F>
##$PROCNO= 1
##$TYPE= <nmr>
##$USER= <she>
##$AMP= (0..31)
100 100 100 100 100 100 100 100 100 100 100 100 100 100 100 100 100 100 
100 100 100 100 100 100 100 100 100 100 100 100 100 100 
##$AQSEQ= 0
##$AQ_mod= 1
##$AUNM= <au_zg>
##$AUTOPOS= <>
##$BF1= 200.13
##$BF2= 200.13
##$BF3= 200.13
##$BF4= 200.13
##$BF5= 200.13
##$BF6= 200.13
##$BF7= 200.13
##$BF8= 200.13
##$BYTORDA= 1
##$CFDGTYP= 0
##$CFRGTYP= 5
##$CHEMSTR= <none>
##$CNST= (0..31)
1 1 145 1 1 1 1 1 1 1 1 1 1 1 1 1 1 1 1 1 1 1 1 1 1 1 1 1 1 1 1 1 
##$CPDPRG= <>
##$CPDPRG1= <>
##$CPDPRG2= <>
##$CPDPRG3= <>
##$CPDPRG4= <mlev>
##$CPDPRG5= <mlev>
##$CPDPRG6= <mlev>
##$CPDPRG7= <mlev>
##$CPDPRG8= <mlev>
##$CPDPRGB= <>
##$CPDPRGT= <>
##$D= (0..31)
0 1.2 0 0 0 0 0 0 0 0.06 0 0.03 0 0 0 0 0.0002 0 0 0 0 0 0 0 0 0 0 0 0 
0 0 0 
##$DATE= 1700475362
##$DBL= (0..7)
120 120 120 120 120 120 120 120 
##$DBP= (0..7)
150 150 150 150 150 150 150 150 
##$DBP07= 0
##$DBPNAM0= <>
##$DBPNAM1= <>
##$DBPNAM2= <>
##$DBPNAM3= <>
##$DBPNAM4= <>
##$DBPNAM5= <>
##$DBPNAM6= <>
##$DBPNAM7= <>
##$DBPOAL= (0..7)
0.5 0.5 0.5 0.5 0.5 0.5 0.5 0.5 
##$DBPOFFS= (0..7)
0 0 0 0 0 0 0 0 
##$DE= 6
##$DECBNUC= <off>
##$DECIM= 32
##$DECNUC= <off>
##$DECSTAT= 4
##$DIGMOD= 1
##$DIGTYP= 9
##$DL= (0..7)
0 120 120 120 120 120 120 120 
##$DP= (0..7)
150 150 150 150 150 150 150 150 
##$DP07= 0
##$DPNAME0= <>
##$DPNAME1= <>
##$DPNAME2= <>
##$DPNAME3= <>
##$DPNAME4= <>
##$DPNAME5= <>
##$DPNAME6= <>
##$DPNAME7= <>
##$DPOAL= (0..7)
0.5 0.5 0.5 0.5 0.5 0.5 0.5 0.5 
##$DPOFFS= (0..7)
0 0 0 0 0 0 0 0 
##$DQDMODE= 0
##$DR= 18
##$DS= 0
##$DSLIST= <SSSSSSSSSSSSSSS>
$$ [...]
##$SUBNAM2= <"">
##$SUBNAM3= <"">
##$SUBNAM4= <"">
##$SUBNAM5= <"">
##$SUBNAM6= <"">
##$SUBNAM7= <"">
##$SUBNAM8= <"">
##$SUBNAM9= <"">
##$SW= 18.0517328524113
##$SWIBOX= (0..15)
0 0 2 0 0 0 0 0 0 0 0 0 0 0 0 0 
##$SW_h= 3612.71676300578
##$TD= 16384
##$TD0= 1
##$TE= 0
##$TE2= 300
##$TE3= 300
##$TEG= 300
##$TL= (0..7)
0 120 120 120 120 120 120 120 
##$TP= (0..7)
150 150 150 150 150 150 150 150 
##$TP07= 0
##$TPNAME0= <>
##$TPNAME1= <>
##$TPNAME2= <>
##$TPNAME3= <>
##$TPNAME4= <>
##$TPNAME5= <>
##$TPNAME6= <>
##$TPNAME7= <>
##$TPOAL= (0..7)
0.5 0.5 0.5 0.5 0.5 0.5 0.5 0.5 
##$TPOFFS= (0..7)
0 0 0 0 0 0 0 0 
##$TUNHIN= 0
##$TUNHOUT= 0
##$TUNXOUT= 0
##$USERA1= <user>
##$USERA2= <user>
##$USERA3= <user>
##$USERA4= <user>
##$USERA5= <user>
##$V9= 5
##$VALIST= <valist>
##$VCLIST= <CCCCCCCCCCCCCCC>
##$VD= 0
##$VDLIST= <DDDDDDDDDDDDDDD>
##$VPLIST= <PPPPPPPPPPPPPPP>
##$VTLIST= <TTTTTTTTTTTTTTT>
##$WBST= 1024
##$WBSW= 4
##$XGAIN= (0..3)
0 0 0 0 
##$XL= 0
##$YL= 0
##$YMAX_a= 113928
##$YMIN_a= -138704
##$ZGOPTNS= <>
##$ZL1= 120
##$ZL2= 120
##$ZL3= 120
##$ZL4= 120
##$ABSF1= 10
##$ABSF2= 0
##$ABSG= 5
##$ABSL= 3
##$ALPHA= 0
##$AQORDER= 0
##$ASSFAC= 0
##$ASSFACI= 0
##$ASSFACX= 0
##$ASSWID= 0
##$AUNMP= <proc_1d>
##$AZFE= 0.1
##$AZFW= 0.1
##$BCFW= 1
##$BC_mod= 2
##$BYTORDP= 1
##$COROFFS= 0
##$CY= 11.3945322036743
##$DATMOD= 1
##$DC= 2
##$DFILT= <>
##$DTYPP= 0
##$F1P= 15.7292609196834
##$F2P= 12.9074282941183
##$FCOR= 0.5
##$FTSIZE= 0
##$FT_mod= 4
##$GAMMA= 1
##$GB= 0.15
##$INTBC= 1
##$INTSCL= 1
##$ISEN= 128
##$LB= 0.24
##$LEV0= 0
##$LPBIN= 0
##$MAXI= 10000
##$MC2= 0
##$MEAN= 0
##$ME_mod= 0
##$MI= 1.114404
##$NCOEF= 0
##$NC_proc= 0
##$NLEV= 6
##$NOISF1= 3.799351
##$NOISF2= 2.8
##$NSP= 1
##$NTH_PI= 0
##$NZP= 0
##$OFFSET= 15.70392
##$PC= 1
##$PHC0= -23871.11
##$PHC1= 13.45269
##$PH_mod= 1
##$PKNL= yes
##$PPARMOD= 0
##$PSCAL= 0
##$PSIGN= 0
##$REVERSE= no
##$SF= 200.130013532006
##$SI= 16384
##$SIGF1= 3
##$SIGF2= 2
##$SINO= 400
##$SIOLD= 16384
##$SREGLST= <1H.CDCl3>
##$SSB= 0
##$STSI= 0
##$STSR= 0
##$SW_p= 3612.71676300578
##$SYMM= 0
##$S_DEV= 0
##$TDeff= 0
##$TDoff= 0
##$TI= <>
##$TILT= no
##$TM1= 0
##$TM2= 0
##$TOPLEV= 0
##$USERP1= <user>
##$USERP2= <user>
##$USERP3= <user>
##$USERP4= <user>
##$USERP5= <user>
##$WDW= 1
##$XDIM= 8192
##$YMAX_p= 0
##$YMIN_p= 0
$$ End of Bruker specific parameters
$$ ---------------------------------
##NTUPLES= NMR FID
##VAR_NAME=  TIME,          FID/REAL,        FID/IMAG
##SYMBOL=    X,             R,               I
##VAR_TYPE=  INDEPENDENT,   DEPENDENT,       DEPENDENT
##VAR_FORM=  AFFN,          ASDF,            ASDF
##VAR_DIM=   8192,          8192,            8192
##UNITS=     SECONDS,       ARBITRARY UNITS, ARBITRARY UNITS
##FACTOR=    0.0002768,     1,               1
##FIRST=     0,             0,               0
##LAST=      2.2672688,     0,               0
##MIN=       0,             -138704,         0
##MAX=       2.2672688,     113928,          0
$$ Real data points
##PAGE= N=1
##DATA TABLE= (X++(R..R)), XYDATA
0@%%%%%%%%%%%%%%%%%%%%Lj1J6j6J6j6J6j9K5l0L2l5M1m6N1n8O6p2Q0r2J04j14
$$ 0 0 0 0 0 0 0 0 0 0 0 0 0 0 0 0 0 0 0 0 0 3 -8 8 -8 8 -8 8 -11 14 -16 16 -19 22 -24 27 -31 35 -37 43 -49 55 -59
42e9J24j37J52j70J88k05K27k54K78l04L36l72M12m56N08n68O38p19Q18r45J107
$$ -59 65 -72 80 -90 98 -107 120 -134 144 -160 176 -196 216 -240 268 -300 338 -381 437 -508 599
63E99j323J627k088K858m374Q424l7016j07411J19516J16458r0101n1478P4713
$$ 599 -724 903 -1185 1673 -2701 5723 -31293 -138704 -19188 97270 7169 -44309 30404
76C0404P066m2586j0078J2395j2355R865K8860q723k1227l871M510l890Q398K592
$$ 30404 37470 -5116 -15194 -2799 -15154 -5289 23571 14848 -6379 -10250 -5740 -9630 -1232 1360
90A360j3828J3357o489j1813J5499K3897J006l5031K3177L6770m7353m8342K5329
$$ 1360 -12468 889 -5600 -17413 -1914 21983 22989 -12042 11135 47905 552 -47790 -22461
103b2461N1770j8731k9276K4451J733k6891M926K0024k2036M307N0986r135n6519
$$ -22461 29309 10578 -18698 5753 7486 -19405 -14479 5545 -16491 -12184 38802 29667 -26852
116b6852q884N1366J0389l1914N736Q777j392j3175j2054J6423J0969k499q193
$$ -26852 -35736 15630 26019 -5895 -159 8618 7226 -5949 -18003 -1580 9389 6890 -1303
129a303J2618M220l6279q919K6826J1455j4468j69J0453o084P812M748r687m503
$$ -1303 11315 15535 -20744 -29663 -2837 8618 -5850 -6019 4434 -1650 6162 10910 1223 -3280
143c280J6509J4595k8726j9406N727J0660Q496p101L094K948m665q207m701J7428
$$ -3280 13229 27824 -902 -20308 -14581 -3921 4575 -2526 568 3516 -1149 -9356 -14057 3371
157C371R996m907n333j064n270j2987Q470J4939K830l855K421j032k3012N226
$$ 3371 13367 8460 3127 2063 -3207 -16194 -7724 7215 10045 6190 8611 7579 -15433 -10207
171a0207K3289j1116j7872J5440K3285k7530k1278K8067Q868j7092l71J5740q982
$$ -10207 13082 1966 -15906 -466 22819 -4711 -25989 2078 10946 -6146 -6517 9223 241
184B41j0805J4324j350p295J5436J3325j8539j9607Q706K002l21M229j0K199K795
$$ 241 -10564 3760 2410 -4885 10551 23876 5337 -14270 -5564 -3562 -3883 346 336 2535 5330
199E330m191j9183M411K6677m884j5599P180J2883j5680j4037K2660J2730j4835
$$ 5330 1139 -18044 -13633 13044 8160 -7439 -259 12624 -3056 -17093 5567 18297 3462
212C462q263R523k769j3305J0157O722j0029J43J6561k995k7200L456K0058k575
$$ 3462 -4801 4722 1953 -11352 -1195 5527 -4502 -4359 12202 9207 -17993 -14537 5521 2946
226B946r664N254J2271p652r294R51M960J2045k5q937k491L734o578j0678J0985
$$ 2946 -6718 -1464 10807 3155 -6139 -5188 -228 11817 11792 2855 364 4098 -2480 -13158 -2173
241b173O872p015k455L240m724p143J4785R236q393K77N951n173j4710O008J8148
$$ -2173 4699 -2316 -4771 -1531 -6255 -13398 1387 10623 2230 2507 8458 3285 -11425 -5417 12731
256A2731k911j2255k429J1715j99j3958n177P257J0386j639n092k410j755L331
$$ 12731 9820 -2435 -4864 6851 6652 -7306 -12483 -5226 5160 3521 -1571 -3981 -5736 -2405
270b405J725L573m68K36L131n659n057K720J0762m7r908M914M803j2079j4770
$$ -2405 -680 2893 2425 2661 5792 133 -4924 -2204 8558 8511 -1397 3517 8320 -3759 -18529
285a8529R293J8168m345r905k93M658k3j815K086J509O955J755q707m219K171
$$ -18529 -9236 8932 4587 -5318 -5611 -953 -976 -2791 -705 804 7759 9514 807 -3412 -1241
300a241N291j760k301r93j88M195n667q783N246J3222l49j2076M127O494r005
$$ -1241 4050 2290 -11 -1004 -1192 3003 -2664 -11447 -6201 7021 6672 -5404 -1277 5217 -3788
315c788o408R765J1020n992l980K368l380l916K697M560k877J666N765p558j0005
$$ -3788 -10196 -431 10589 4597 617 2985 -395 -4311 -1614 2946 69 1735 7500 -58 -10063
330a0063K362J2119J875q440k056K255L316l793l707O772P897j214r378J179M858
$$ -10063 -7701 4418 6293 -2147 -4203 -1948 1368 -2425 -6132 640 8537 7323 -2055 -876 3982
345C982n700k528M830N535m580k013J020o355j47P242L034o273l43P981m739j0147
$$ 3982 -1718 -4246 584 6119 1539 -474 546 -5809 -5956 1286 4320 -1953 -2296 5685 946 -9201
361i201J903J1285M049o923k007P88Q72j148j270N260L956k156r166j591M596
$$ -9201 -7298 3987 8036 1113 -894 -106 766 -382 -1652 3608 7564 5408 -3758 -5349 -753
376g53j816m44K558J651k092n23m32o833M615J1953P7r162J028R272n315q370
$$ -753 -2569 -3013 -455 1196 -896 -1419 -1851 -8684 -4069 7884 7961 -1201 -173 9099 3784 -4586
392d586L444M892j128l705j35l491j468M435J241Q77J307Q25m595n354K951N411
$$ -4586 -1142 3750 2622 -1083 -1218 -4709 -6177 -1742 -501 376 1683 2508 -2087 -7441 -4490 921
408I21M778n82k254J359P79l557o964L507Q910k930r995j814P662o37o360L708
$$ 921 5699 5117 2863 4222 5001 1444 -5520 -2013 6897 3967 -6028 -7842 -180 -817 -7177 -3469
424c469O712J4l666K13j415j935Q016K773o047k384O333l6r794p39P414K732m739
$$ -3469 3243 3257 -409 -196 -1611 -3546 4470 7243 1196 -1188 5145 5109 -4685 -5424 1990 4722 -17
441a7m506K488K49l710k632P756R692n070p716J219M399n39o65K922j630k82J877
$$ -17 -4523 -2035 -1786 -5496 -8128 -372 9320 4250 -3466 -2247 2152 1613 948 3870 2240 1958 3835
458C835l479o903O98R246R11o681k685L764L441m907j877P375N640o091q178M783
$$ 3835 356 -6547 -5849 3397 4308 -2373 -5058 -1294 2147 -2760 -4637 2738 8378 2287 -5891 -1108
474a108M196n237l391O139O602l546l967M05O7q20J424K778n582m252N067J347
$$ -1108 3088 -2149 -5540 599 7201 3655 -312 93 160 -660 764 3542 -2040 -6292 -1225 122
490A22o794J090J3624K395j2175l030O524r82n556K661N708K89j106l330k213
$$ 122 -6672 -5582 8042 10437 -1738 -4768 1756 774 -4782 -2121 3587 3876 2770 -560 -2773
505b773L014K626k605j052M729l121o210J722J776q31J910M229m249k916O505
$$ -2773 241 2867 262 -790 3939 818 -5392 -3670 -1894 -2725 -815 3414 -835 -3751 2754
520B754J562p528OJ0971J618j1317k756N615J514n268R76N454k688m628p75J312
$$ 2754 4316 -3212 -3206 7765 9383 -1934 -4690 925 2439 -2829 -1853 3601 913 -3715 -4490 -3178
536c178l96L588M640l555j437K827j802n153K157P553M21l188j178j609J028J051
$$ -3178 -3574 14 4654 1099 -338 2489 687 -4466 -2309 5244 5665 2477 1299 -310 718 1769
552A769l611l402N092L686q172m238O221L187l31J989J998k082kJ91m254jN254
$$ 1769 -1842 -5244 -152 3534 -4638 -8876 -2655 532 201 2190 4188 2106 2104 2295 -1959 -1960 3294
569C294J841n847k670L970J503l976k680N286M959n996p250J618N923J56m27K988
$$ 3294 5135 -712 -3382 588 2091 -1885 -4565 721 5680 -316 -7566 -5948 -25 131 -296 2692
585B692O95j001n62j819k268K311M393r59m557j580K257N90m535j82O530K616
$$ 2692 3387 2386 1824 5 -2263 48 4441 3482 -1075 -2655 -398 192 -4343 -4525 2005 4621
601D621o313l373N020J036k634J185L412K53j698j434k711K022M024j447k248
$$ 4621 -1692 -5065 -45 991 -1643 -458 2954 3207 1509 75 -2636 -614 3410 1963 -285
616b85J221p3l095K35J235j796M384L946q558o357Q366M916p773P87J0472j302
$$ -285 936 863 -2232 -1997 -762 -2558 1826 5772 -2786 -9143 -777 4139 -3634 -2847 7625 6323
632F323q904O56N368l722k143M105J562l298j531J434j973o12M704J515m770l081
$$ 6323 -2581 -1925 3443 -279 -2422 1683 3245 -53 -1584 -150 -2123 -2735 1969 3484 -1286 -4367
648d367K900R50k154O52L034K811R15l666m477K871O292l954n342O180L047r147
$$ -4367 -1467 -517 -2671 -2019 1015 3826 4741 1075 -3402 -531 5761 1807 -3535 2645 5692 -3455
664c455m077Q361J134n212L435K205n300j230N720k067l166P232L872p357k832
$$ -3455 -7532 829 1963 -3249 186 2391 -2909 -4139 1581 -486 -3652 3580 7452 95 -2737
679b737M396Q80l467L98K528R68j875m599j436L603L202k270j765K675K83k422
$$ -2737 1659 2539 -928 -530 1998 2966 1091 -3508 -4944 -1341 1861 -409 -2174 501 784 -1638
695a638j083J495K425J902Q59k992k059J130K430j894k393L434K673n543n167
$$ -1638 -2721 -1226 1199 3101 3960 968 -1091 39 2469 575 -1818 1616 4289 -1254 -6421
710f421L374M911k421j167K253J035j721k266k58K595L581l41k836P45M49j847
$$ -6421 -3047 1864 -557 -1724 529 1564 -157 -2423 -2681 -86 3495 3154 318 1063 1512 -335
726c35K21O61n11J037K187n287m526N462M065n159j376O361K79o349j47L700L13
$$ -335 -114 547 36 1073 3260 -2027 -6553 -1091 2974 -2185 -3561 2800 3079 -3270 -3417 283 596
743E96J104J737j947k254K291n44k784R48L417k95l529r30k16L27J039K1p2J974
$$ 596 1700 3437 1490 -764 1527 983 -1801 -853 2564 2269 -1260 -2190 -2406 -2079 -1040 -1019 -1091 883
761H83J219l934k738N389M133l311l198M313J453n604j416L757N77j373J217j312
$$ 883 2102 -1832 -4570 819 4952 1641 -1557 2756 4209 -1395 -2811 946 1523 150 1367 55
777E5m461J385L769k200k037M806K767n261j735L620R78q58P44M90l41O4k330
$$ 55 -4406 -3021 748 -1452 -3489 1317 4084 -1177 -2912 708 1686 828 1572 2062 1721 1785 -545
794e45k730L347L427k711l018J350M36k647L71J964M61J483J375k732k933L256
$$ -545 -3275 72 3499 788 -2230 -880 -444 -3091 -2720 -756 -295 1188 2563 -169 -3102 154
810A54L859k331k775K836K037l540m093K318L153k05j853j57k8p24o09k61J169
$$ 154 4013 1682 -1093 1743 3780 240 -3853 -1535 1618 1413 -440 -597 -625 -1349 -1958 -2219 -1050
827a050K325N47k117j159J301J350K32o63J26K095j51m332l446M107M113k951
$$ -1050 1275 1822 -295 -1454 -153 1197 1429 766 892 2987 2836 -1496 -4942 -835 3278 327
843C27k882K903J342l383j750K889J081k29N02o38j325N23J557l15M30J208L91
$$ 327 -2555 348 1690 -1693 -3443 -554 527 298 800 162 -1163 -640 917 602 1032 2240 2631
860B631k042j866l50K042J059j451j581J799K57l114k044L612L834k066k190K157
$$ 2631 589 -1277 -1627 415 1474 23 -1558 241 498 -2616 -4660 -1048 2786 720 -1470 687
876F87J095k037r17K415P14m16K73j456k392N38K710p07j849J171J821k617k931
$$ 687 1782 -255 -1172 1243 1957 1541 1814 358 -2034 -1496 1214 507 -1342 -171 1650 -967 -3898
893c898J000L225L18j339j00J971O01j920q17K938K612k205l053K1L94j057n26
$$ -3898 -2898 327 645 -694 -794 1177 1778 -142 -959 1979 4591 2386 -667 -646 -252 -1309 -1835
910a835J320m4K79R09j635k027J548L902p86l328J782K401j980k527J819L393
$$ -1835 -515 -559 -280 629 -1006 -3033 -1485 2417 1631 -1697 85 2486 506 -2021 -202 3191
926C191J66j920j321m08L96j357j367J059K561q39j979l57P12R18J484K66r22
$$ 3191 3357 1437 116 -292 104 -1253 -2620 -1561 1000 161 -1818 -2175 -1463 -545 939 1205 283
943B83M55J828j787k642K127L156j613l180Q31J050j668j029J238J800j62l52
$$ 283 738 2566 779 -1863 264 3420 1807 -1373 -542 508 -1160 -2189 -951 849 687 335
959C35j537j044J539J206p18q28K119J726k541j709J007K509O62j483j176o60
$$ 335 -1202 -2246 -707 499 -219 -1047 1072 2798 257 -1452 -445 2064 2726 1243 67 -593
975e93Q36j277k565J647L938r39l061J318J883j462n86J768L91j345R62r46k038
$$ -593 243 -1034 -3599 -1952 1986 1047 -2014 -696 1187 -275 -861 907 1298 -47 915 -31 -2069
992b069J709L340j009k416J035J667k508k147O38J728N17j122j399Q74J074o0
$$ -2069 -360 2980 1971 -445 590 2257 -251 -2398 -1760 -32 485 -637 -2036 -1162 -88 -148
1008a48p36J460J454l07j115q58q8K88J253K03p67l87k55o29j811N78K860o0k746
$$ -148 -884 576 2030 1723 608 -250 -338 -50 1203 1406 639 252 -3 -632 -2443 -1865 995 935 -1811
1027a811pK840p96k636J434L124j14j752p30N69J125N2n32k24N16o44j631m75
$$ -1811 -1818 1022 226 -2410 -976 2148 2034 282 -448 121 1246 1298 766 542 1058 414 -1217 -1692
1045a692m95M11K231k86j703O13K239j291k015K638K665j771j855O21O17p40k83
$$ -1692 -2187 -1776 455 169 -1534 -921 1318 27 -1988 650 3315 1544 -311 310 927 187 -96
1062i6L10J086N84j337k665K64J087K11o28N87j00N75M90o38o63J853K082j034
$$ -96 214 1300 1884 547 -2118 -1854 -767 -556 -1184 -597 -697 -122 368 -270 -933 920 3002 1968
1080A968k343J55J332k59k173N46K678o85k943L0J613p69q09J399L02l74P74l51
$$ 1968 -375 -220 1112 853 -1320 -774 1904 1219 -1724 -1694 -81 -850 -1659 -260 42 -332 442 91
1098I1j781J130L277j069j815R40N55j311p10N88O51P27m4k762m27J702k27j380
$$ 91 -1690 -560 2717 1648 -167 773 1328 17 -693 -105 546 1273 1229 -1533 -1960 -258 -485 -1865
1116a865R57K142o13j317j0N15Q46P83m02m02j52R7o59p28K59J518Q39k553j711
$$ -1865 -908 1234 621 -696 -706 -191 655 1438 1036 634 482 579 -80 -808 -549 969 1808 -745 -2456
1135b456K015O94k221J18K732K99j853J4L71K09J385k11r09P21N62j198j360K69
$$ -2456 -441 253 -1968 -1850 882 1181 -672 -658 -287 -78 1307 1096 187 908 1470 272 -1088 -819
1153h19J389M18r90q40k65N62Q9j375N88K237L6j755j97J253M78R1o73Q89P97
$$ -819 570 988 -2 -842 -1107 -545 -456 -1831 -1243 994 1030 -725 -922 331 809 900 227 1116 1913
1172A913j407j314j51J166L06l60k56o67K2N08j041j021K182K138j803j802J079
$$ 1913 506 -808 -959 207 513 153 -103 -770 -748 -240 -1281 -2302 -120 2018 215 -1587 -508
1189e08J723o95r01R62J204r3j695j405Q77J017o42k1k26l62L45l13r50Q53J764
$$ -508 1215 520 -381 581 1785 1692 -3 -1408 -531 486 -156 -177 -403 -765 -420 -733 -1683 -830 934
1208I34Q0j866M08J357n23m24L60O20Q55n11k009q78K480K05k201j21J769p51
$$ 934 1014 -852 -444 913 390 -34 326 946 1801 1290 -719 -1597 883 1088 -1113 -1234 535 -216
1226b16j513m1J090J64J222K99j371j68J553J79j601N59J716J46k339p82J451
$$ -216 -1729 -1770 -680 -516 706 1005 -366 -534 1019 1198 -403 156 1872 2018 -321 -1103 348
1243C48j92r67M4J016L6j035o68j49Q84J600o10p69Q10R62r82p93R74P28J12r0
$$ 348 156 -811 -767 249 285 -750 -1418 -1567 -683 917 307 -462 348 1310 328 -465 509 1237 1349 1259
1263A259j347j398J203J068j584p60K332N4k526k13J588M04j55K59M49k1J13o59
$$ 1259 -88 -1486 -283 785 -799 -1559 773 827 -1699 -1912 -324 80 -75 184 633 612 725 66
1281F6m21Q08J259o57r79m91M57L4o72n94Q92J064o74k238P29J964R5r94K55J440
$$ 66 -355 453 1712 1055 76 -415 42 76 -596 -1190 -298 766 92 -2146 -1417 547 642 -352 -97 1343
1301A343q5j077j048R68J256k49p14p07K95Jk02r33K10J357k40j434l92Q49J050
$$ 1343 1258 181 -867 101 1357 1108 394 -313 -18 -17 -219 -1152 -942 415 175 -1259 -1651 -802 248
1320B48j11r7L80J017J62k017o99K329N12j644n69J308o60j119L35J76K20P23
$$ 248 137 40 420 1437 1599 -418 -1117 1212 1724 80 -489 819 159 -960 -625 -449 -229 494
1338D94K57j820p37J797L28j367O10J985l92j154k09N84L90M91o30n57L79M2j613
$$ 494 751 -1069 -1806 -9 319 -1048 -438 1547 1155 1 -208 376 766 1257 627 70 449 491 -1122
1357a122o16J257Q98l88p84L33K01j31K43J33M83O43K09j569m13J185P27j405
$$ -1122 -1738 -481 417 29 -755 -422 -221 -352 -109 24 507 1150 1359 -210 -623 562 1289 -116
1375a16j03J488n37j684k33M99P17l28m7m89q6P14K89p36J123J053L9j198m09
$$ -116 -219 1269 732 -952 -1185 -686 31 -297 -344 -833 -919 -205 84 -652 471 1524 1563 365 -44
1394d4K07K36j94o38K94Q69l40j961r7J720L02r34k33Q18Q5o65l03M10J051P82
$$ -44 163 399 205 -433 -139 730 390 -1571 -1668 52 354 -580 -813 5 90 -575 -878 -468 583 1365
1414A365k28r35q5Q42j62j014K73M72j35j171p65K39J479O6q09K6J167k81j224
$$ 1365 1137 202 117 959 797 -217 56 528 393 -778 -1543 -1304 175 241 -568 -542 625 344 -880
1433h80N2J383R23q64m74L39k93l15J01NP1P30m00j407m10J156M02p61m83J232
$$ -880 -828 555 1478 614 140 479 186 -129 -28 -23 48 778 378 -1029 -1439 -283 119 -642 -1125 107
1453A07L61r40l46N90J109M33o49k50N0L69r05n14N34P87q11q02J28l7M82Q9P6
$$ 107 468 -472 -818 -228 881 1314 665 415 465 834 -71 -585 -51 736 -75 -877 -749 -786 -304 -215 -139
1474a39j23P87n3j229o25J393J192p06j53K96L27k55r01K24M65Q2q45o92M21J10
$$ -139 -262 525 472 -757 -1382 11 1203 497 344 640 967 712 -189 35 500 582 -263 -955 -534 -424
1494d24l94P2M28N63J72n05m30N05M26M73k58k86M46j74q18n72Q25O95o44p80
$$ -424 -818 -746 -318 245 417 -88 -518 -13 413 886 628 342 788 614 -204 -776 49 744 100 -680
1514f80K03M07o59k06M60P46K68l17n20m81J154N92o21J69P64m93o69m47oM82
$$ -680 -477 -70 -729 -935 -475 271 539 222 -298 -779 375 967 346 515 1279 786 117 -330 -336 146
1534A46L66o91o68N31N22j050m86J311P73n75p29L84K48k4J52Q1J2N69j08q37
$$ 146 512 -179 -847 -316 206 -844 -1330 -19 754 179 -550 -166 82 58 210 291 303 872 764 -73
1554g3n51N82P80j073l05M48l3m47l23L85O77J7K11l49j37P03J73q03M48J099
$$ -73 -624 -42 738 -335 -640 -192 -225 -672 -995 -610 67 84 295 -54 -191 512 685 -118 330 1429
1574A429k91j479r9L50j04K56j75m07k0O43p75n37P58J321p07q62R53K66n21Q1
$$ 1429 1138 -341 -440 -90 -194 62 -113 -520 -540 103 -672 -1209 -451 870 163 -699 254 520 -1 80
1594H0J10N30K63l37q65k87Q09l71n51K02M18j23m25m53O3J219J88j06l75P51
$$ 80 190 720 983 646 -219 -506 303 -68 -619 -417 1 -122 -547 -1000 -937 282 470 364 -11 740
1614G40K0r40OO71O21m84r96P9M60k52m61l4L84j10N6n88j38P47P09m79J00L18
$$ 740 760 -180 -174 497 1118 634 -362 -283 177 -75 -536 -570 -186 -296 -240 -828 -966 -219 490 11 111 429
1636D29om71%J39M57K80m38p97J48N13p14p67R79P28n33p72J22K79J28L59j63
$$ 429 423 -48 -48 91 548 828 390 -407 -259 254 -460 -1227 -248 480 -53 -825 -703 -424 -296 63 -100
1657a00PQ01R5j133j32R45M92o82m31p6M66j93o17j19M89O77j063n67M14O90r4
$$ -100 -93 708 803 -330 -462 483 975 293 -138 -214 252 59 -558 -677 -188 489 -574 -1141 -727 -37 -131
1678a31j69M71P17k29m30l29M10R7J72k87n93M19jl20q91Q56O43l17q53N6O29
$$ -131 -300 171 888 659 229 -100 310 407 579 292 -301 118 117 -203 -1094 -238 405 88 -765 -709 -80
1699h0R6j22p0L99L49lo14l36P78N25q13q5L76m21j65n36J71J63R40r14l44M95
$$ -80 16 -106 -176 223 572 569 -45 -381 397 922 109 24 400 -21 -186 -722 -551 -388 552 -362 -706 -211
1721b11K98k31j94M56Q06k3p22l63N31L40l52m13L31J21p02j99j43M89L57k22
$$ -211 87 -144 -338 118 924 901 179 -184 347 687 335 -78 253 374 -328 -527 -670 -181 176 -46
1741d6p58J57M79K37p24N27R60P4l46n64K57R8j36k84J0M02lo20m32K81K94K83
$$ -46 -804 -647 -168 69 -655 -128 832 906 560 -4 253 351 215 -69 -59 343 340 -280 -712 -431 -137 146
1763A46p02J14K83K0k34N2N10N40J02l04o16M34J48l64n93P57K43r29l98O38J70
$$ 146 -556 -442 -159 -139 -373 -321 189 729 831 527 -89 345 493 129 -464 293 536 -393 -791 -153 17
1784A7k72l0M9r3N00k54m34L79Q98j97j80R2j85K90n31j76J38N94o8r78l52K98
$$ 17 -255 -285 -236 -329 171 -83 -517 -138 760 563 383 475 290 580 49 -127 11 605 537 -441 -793 -495
1806d95L13r5K2K11N19o02J34n25Q07K12k03J00j84Kj50rl36O17J76m32p69L64
$$ -495 -182 -277 -255 -44 475 -127 7 -518 289 501 298 398 214 216 66 57 -279 338 514 82 -687 -323
1828c23L09q9p75M21O36m1n18m4M01N57J09j00L3k29R5k21n98K93K95on30m28
$$ -323 -14 -103 -878 -457 179 138 -380 -424 -23 534 643 543 576 347 442 221 -377 -84 211 205 -325 -753
1850g53M84P9m04J69P23p7l50j28kJ61O58l59k73P54K74j180P9J75K95O3n60m38
$$ -753 -269 -190 -594 -425 298 221 -129 -257 -259 -98 560 201 -72 682 956 -224 -145 30 325 388 -172 -610
1872f10J98M6L80n80K83O67r2l60m50O72M60k69l4k3L61k78n28j40L95K8j86l34
$$ -610 -412 -366 14 -566 -283 384 292 -68 -518 154 614 345 311 288 649 371 -157 -297 98 126 -60 -394
1894c94L19M2k02m04K70M37J25j24m03M32K63j50j84K61L35O4q24j38K19J77j93
$$ -394 -75 -33 -235 -639 -369 68 193 69 -334 98 361 211 27 288 623 687 -137 -275 -56 121 -72
1915g2l23j04M28K52o30m16Q17O52l32m95J86J50k8m8J05J74K52j03o05J72J9
$$ -72 -395 -499 -71 181 -449 -865 -48 604 272 -223 -37 113 85 37 142 316 568 465 -140 32 51
1936E1J05o91P0K12j23k53J66L4K39M12j58k25K86K94l72j26K70P04m84m29r6
$$ 51 156 -535 -465 -253 -376 -629 -463 -429 -190 222 64 -161 125 419 47 -79 191 895 411 -18 -114
1957a14J60j00j62p6K9J52J10n79n1L90O20k14j88L12m2j81J92k8J9J94jn67R9
$$ -114 46 -54 -216 -292 -263 -111 -1 -580 -631 -241 379 165 -23 289 247 66 258 230 249 443 442 -125 -26
1980b6J11m67k75N51J04k47j28j80R3M70L10m97J31N67j9o87O6M74L73n79l0j94
$$ -26 85 -382 -657 -106 -2 -249 -377 -557 -464 6 316 -181 -50 517 498 -189 -123 351 724 145 115 -79
2002g9O1M6l00k24L61K7Q6n97K38L98M0k06L70L5M11n17j94Q3K74J47m30m98N72
$$ -79 -18 28 -272 -496 -135 -108 -22 -619 -381 17 57 -149 221 256 667 150 -44 39 313 460 30 -468 104
2025A04j46p00L75K47O5K3l27m19M73O48k24j78K97K44j23n60K01L44l4m56J95
$$ 104 -42 -742 -367 -120 -55 -32 -359 -778 -305 343 119 -59 238 482 359 -201 0 344 310 -146 49
2046D9m8j61J21o67L59K40J87k45l95K29L68j45k7L05L13L1l76j52N7M78k46j98
$$ 49 1 -160 -39 -706 -347 -107 80 -165 -560 -331 37 -108 -135 170 483 514 138 -14 43 521 275 77
2068G7l97N99k49l35j85K54M29n08J36Qk49L99j5l36N70L74k87j46k7J51J80l68
$$ 77 -320 279 30 -305 -490 -236 193 -315 -179 -171 -420 -21 -36 -372 198 572 285 139 112 263 443 75
2090G5q8j6N9M5p84L62M63k25j07l73N88J58Rl56J83L28j3j97k89K21J14o7j07
$$ 75 -13 -29 30 75 -709 -347 116 -109 -216 -589 -1 157 166 -190 -7 321 308 111 -178 43 157 90 -17
2113a7L56k36O4m44j2O6K78l03k01K71m4K41l87J68O75N7k94k73K40J39m36J65
$$ -17 339 103 167 -277 -289 -223 55 -248 -449 -178 -222 19 -368 -200 475 532 238 -35 205 344 -92 73
2135G3k72N62m90m6j13L5K07j89j07L26k4J28m57L21J11R1K36j72K66l47q2l1
$$ 73 -199 363 -127 -173 -286 -251 -44 -233 -340 -14 -38 90 -367 -46 65 156 392 220 486 139 57 26
2157B6k07K48N6k98k33N5K86k85j3r1N59L2k76K2l4L17K11l07o5J12J65l78j37
$$ 26 -181 67 123 -175 -408 -353 -67 -352 -365 -456 103 135 -141 -119 -153 164 375 68 3 115 280 -98 -235
2180b35J57K91o1k72k31k6J72Q7J59k18K74J19n57J97O08n1m1j23M4K01l13k56
$$ -235 -78 213 152 -120 -351 -377 -205 -118 41 -177 97 216 -341 -144 464 413 372 249 293 494 181 -75
2202g5M7K42j41j43m53K50K96m83J89J24P32m52n26K15L40L79m05R9q9Oj50J29
$$ -75 -28 214 73 -70 -523 -273 23 -460 -271 -147 585 133 -393 -178 162 541 136 235 146 152 2 131
2224A31m13M76K7k66k04L6Q3q1R2j95M14J05k48o3J91M4J14m10K39J65o8j8j1
$$ 131 -282 194 221 -45 -249 -213 -130 -211 -119 -314 100 205 -43 -106 85 129 243 -167 72 237 169 151 140
2247A40j12N5l31J04l02N05k37k35M4K58M2J83l64n8M10L25l72J2k7L65k71l81
$$ 140 28 83 -248 -144 -446 59 -178 -413 -369 -111 -69 114 -250 -308 102 427 55 67 40 405 134 -247
2269b47L41J13k47j96N5L10l1j49k44L7K66P6Nm25L81j04j3KN92j23l04j83J39
$$ -247 94 207 -40 -236 -181 129 98 -51 -295 -258 8 84 89 -336 45 -59 -72 -70 522 399 95 -88 51
2292E1R9O5k15r8j26K00Rl44J69J22K12j44j4j97N07Jj24q9M95o1n03j81J82J23
$$ 51 150 215 0 -98 -224 -24 -15 -359 -190 -68 144 0 -14 -211 296 297 173 84 579 518 15 -166 16 139
2316A39k38K3r2m24O78l89l0J89K93K14n42L78k09J61Q1j78J71k64J91k65J34
$$ 139 -99 -76 -168 -592 86 -303 -333 -144 149 363 -179 199 -10 151 232 54 225 -39 152 -113 21
2337B1k6m5m96N02K46k44n2K7k74K17K21p0j26n5O39j30m56J84M61j82m53N2R1
$$ 21 -5 -50 -546 -44 202 -42 -94 -67 -341 -124 97 27 -99 -154 485 355 -101 83 544 362 -91 -39 52
2360E2P1l02k10L61J76l8m50PK74J94k96j5O4R4K80j67n6K22j67J02j20o9J34
$$ 52 123 -179 -389 -28 148 110 -340 -333 -59 135 -161 -176 -112 -18 262 95 39 261 94 196 76 7 141
2383A41j42o27L24J61N9J19L1j30L71j9m31J37L29R8k38k23K18K05j67R5k59J3
$$ 141 -1 -628 -304 -143 -84 35 66 -64 307 288 -143 -6 323 421 183 -40 178 383 216 311 52 65
2405F5j34k21J8K78j1P0k99j49L29K39m42m2L77K40o2l4l03M04J67l34p9j41Q3
$$ 65 -69 -290 -272 6 -5 65 -234 -383 -54 185 -257 -299 78 318 256 222 -81 323 490 156 77 -64 19
2428A9k12j6NJ91K22l92J20l1Q8J16l78L75J40l7j16n8K30ln2Q4k93jJ68k36k73
$$ 19 -193 -209 -204 -13 209 -183 -63 -94 -6 110 -268 107 247 210 94 36 266 263 211 295 2 1 169 -67 -340
2453c40L34j26K44o67K11K71K12j63j8O7L80j99j23O9Ko8j16r1L84l4m00K13o6
$$ -340 -6 -132 112 -555 -344 -73 139 -24 -42 25 405 206 83 152 154 86 -30 -121 263 229 -171 42 -24
2476b4lj68K54j1J73j55N9j78K55J84j43m25J46R0J85j92J0l2P3j00k33L8J60
$$ -24 -27 -195 59 48 221 66 125 -53 202 386 243 -182 -36 54 239 47 57 25 98 -2 -235 -197 -37
2499c7M4m07L13M7L48m90J57L07j00J88j36o0J65o6j06j28o9J02k61N9K7k04J67
$$ -37 7 -400 -87 -40 308 -182 -25 282 182 370 234 174 339 273 167 39 -30 72 -189 -130 -103 -307 -140
2522a40Q4j04N0L0O4l17K7K74K77R3j71J05N6k04k42K12rK29j19m31L85p9j60
$$ -140 -56 -160 -110 -80 -16 -333 -306 -32 245 338 167 272 328 124 -118 94 85 314 195 -236 149 70 -90
2545i0k28L25j14K66l64J06J91K33j78j33o6J37P9l40K95k24Lk35L52J31Rk55
$$ -90 -318 7 -107 159 -205 -99 92 325 147 14 -52 85 164 -176 119 -105 -102 -337 15 146 155 -100
2567a00r9k69M19l1n2K10j08K81k05j00L32O4l61O0k4q2JK72m15J35k18J71j68
$$ -100 -199 -468 -49 -80 -132 78 -30 251 46 -54 278 342 -19 41 17 -65 -64 208 -207 -72 -290 -119 -287
2590b87pJ51M07k81q8J58N8j94J81L00l37L8l0k2k57L49j61p3K86m51K41k13J29
$$ -287 -294 -143 264 -17 -105 53 111 -83 98 398 61 99 69 47 -210 139 -22 -95 191 -260 -19 -232 -103
2613a03J7l5K04p8j50P6L99n24J3L76k27J2K96n06L28k75R9J9Qk51J58Q2J4p5
$$ -103 -86 -121 83 5 -145 -69 330 -194 -181 195 -32 -20 276 -230 98 -177 -78 -59 -51 -302 -144 -62 -48 -123
2637a23j34L82k49l9K72o5R6j49K47l92L25k26Q6n7K96l10j17J67l4L1r6M5p4
$$ -123 -257 125 -124 -163 109 44 140 -9 238 -154 171 -55 31 -26 270 -40 -157 10 -24 7 -89 -44 -118
2660a18J53j60J91K67l05j64J88J10M32n47j67K02N8l60K58l15r8L80j10n8P0
$$ -118 35 -125 66 333 28 -136 52 162 594 47 -120 82 140 -220 38 -277 -375 5 -105 -163 -93
2681i3j83K05K49m24K10K08k07J33j24J72K1Nl62L98q8l16o4M09j51J01l08k19
$$ -93 -276 -71 178 -246 -36 172 -35 98 -26 146 167 172 -190 208 120 -196 -260 149 -2 99 -209 -428
2703d28J83K30j29l4J87k2Q0j25J48J71m8l71J37J8k41L41k20J19l4L36l16j71
$$ -428 -245 -15 -144 -178 9 -13 67 -58 90 261 213 -158 -21 -3 -244 97 -123 -4 -38 298 -18 -189
2725a89j13L49m8K06j22j23LmK91k91q0M51j56j93o9k17J54Pk00K56n0j07M19
$$ -189 -302 47 -1 205 83 -40 -37 -41 250 -41 -121 330 174 -19 -88 -305 -151 -144 -344 -88 -138 -245 174
2748A74k55J19n9j82N22j5l35R3J71R9j49k69K24q2L3l6k00K01j46K00j46r8K86
$$ 174 -81 38 -21 -203 319 304 -31 62 233 332 183 -86 138 56 89 53 -147 54 -92 108 -38 -136 150
2771A50k46o1k04L12L4r2K12q7J16l1p6J30q7k9N0j7J09l55j10o5N30k25M4j57
$$ 150 -96 -157 -361 -49 -15 -107 105 18 134 103 27 157 70 41 91 74 183 -172 -282 -347 183 -42 2 -155
2795a55K28j01J99k72K14J48j09j54J9o7M6Q8k76J8K4j8K91k96J83m20L06k3J02
$$ -155 73 -28 171 -101 113 261 152 -2 17 -50 -4 84 -192 -174 -150 -168 123 -173 10 -410 -104 -127 -25
2818b5K00j34J58K50k28j43k5p7rn7M0l3J67l16L06j22J63k35q8J69J33R4l12
$$ -25 175 41 199 449 221 78 53 -24 -33 -90 -50 -83 84 -232 74 -48 115 -120 -208 -39 94 188 -124
2841a24j30L77J03k04q6J94m4J99J65m47K0j5q2p5M5K12n2l89M08j48k80N37k69
$$ -124 -254 123 226 22 -64 130 86 285 450 3 23 8 -74 -149 -104 108 56 -333 75 -73 -353 184 -85
2864h5K34k67L30m3O6j30J32l49n2K68l23NJ08O5J45j67p8J33n3j6Lm5L76k31
$$ -85 149 -118 212 169 235 105 237 -112 -164 104 -219 -214 -106 -41 104 -63 -141 -8 -61 -77 -74 -119 257 26
2888B6k3j48L29l06J86l2J9L2R4p3k27k20N52k20j87J20J94k0l58j3L52j56J79
$$ 26 3 -145 184 -122 64 32 51 83 177 104 -123 -343 209 -11 -198 -78 116 96 -262 -275 77 -79 100
2911A00j64k20M07R4l40M58l26J74k96R8k37K46j36O3j22J78k9J73j12j04K19
$$ 100 -64 -284 123 217 -123 335 9 183 -113 -15 -252 -6 -142 -79 -201 -23 -52 121 9 -95 124
2932A24O2k81N7K46k01K97k60n6p8J36l69j33K49K21j0N0k97L86L9qm5J8j24J03
$$ 124 186 -95 -38 208 7 304 44 -12 -90 46 -323 -456 -207 14 4 54 -243 143 182 174 129 147 23 126
2956A26k49Q4J34k5j30J65k8K9k96Q8J12k05K49k56lP0n1qJ34j00J12k93K31J94
$$ 126 -123 -39 95 70 -60 105 77 106 -190 -102 10 -195 54 -202 -205 -135 -186 -194 -60 -160 -48 -341 -110 84
2980H4n7Mj11L9nK23j9Jk92N8j80j28Q6N42k97J19j46k1O2J84k54Q9J84q4J03
$$ 84 27 31 -80 -41 -46 177 158 159 -133 -75 -255 -383 -297 245 -52 67 -79 -100 -38 146 -108 -19 165 81 184
3005A84m12L27j8j7J6K3o8n2J37k71J18n6K11l37j24M37n8J22k07m8K75rq0j87
$$ 184 -228 99 81 64 80 103 35 -17 120 -151 -33 -89 122 -215 -339 98 40 162 -45 -93 182 173 93 -94
3029i4J37K25l68R8l4J73j2j25j97R7K39j47K03l88J65L04j82m20M00J15k71J14
$$ -94 43 268 -100 -2 -36 137 125 0 -197 -100 139 -8 195 -193 -28 276 94 -326 74 189 -82 32
3051C2j56J17j57J02P4R5j53oj81J29k4K96J25l20J52j45J35k00J2R4M8o2J07
$$ 32 -124 -7 -164 -62 12 107 -46 -52 -233 -104 -128 168 293 -27 125 -20 115 -85 -73 21 69 7 114
3074A14K0l17J82PO3j70J53j35j49K42j49K00j07J15J66k82Q9M7k57J26p9j17
$$ 114 134 -183 -1 6 69 -101 52 -83 -232 10 -139 61 -46 69 235 -47 42 89 -168 -42 -121 -238
3096b38L86l7r5P5m9j62J46O6k82j42N20j2l5n03L45J34k03J28M2R3N9j17K27
$$ -238 148 111 16 91 42 -120 26 92 -190 -332 188 176 141 -362 -17 117 -86 42 84 177 236 119 346
3119C46m25R0j56j59K02O5j64j27M15k93L06J16j69krJ78j63J93k90J8M6K7Pp
$$ 346 -79 11 -145 -304 -102 -37 -201 -328 87 -206 100 216 47 45 36 214 51 244 -46 -28 18 45 52 45
3143D5p9o1J23l29K98P9l05L51j76K1l8J53P3O6l23J82n2j01J91j44J46k32N9
$$ 45 -34 -95 28 -301 -3 76 -229 122 -54 -33 -71 82 155 221 -102 80 28 -73 118 -26 120 -112 -53
3166e3l5R6K2j99j37K24J15J9q9J72l78M81j86K10j55k81L58k69j27K49J22j38
$$ -53 -88 8 30 -169 -306 -82 33 52 -37 135 -243 238 52 262 107 -174 184 -85 -212 37 159 21
3188B1K35k11K8j65J51m59L92k11R0j9K31r2k86N27l25O1j1J49k9M5j6j62J12
$$ 21 256 45 73 -92 59 -400 -8 -219 -129 -148 83 -9 -295 232 -93 -32 -43 106 77 122 106 -56 56
3211E6k09J13J16k83J92m3J18J1L4q0K76j81k45J7K2J87l05K04q8L06k28N6l17
$$ 56 -153 -40 76 -207 -15 -58 60 71 105 25 301 120 -125 -108 -86 101 -204 0 -88 218 -10 46 -271
3234b71K23N1j81k3K92o7j92K43l56K50k4j10K50mj62J40J63r8j06l2K02k89J35
$$ -271 -48 3 -178 -201 91 24 -168 75 -281 -31 -55 -165 85 81 -81 59 222 124 18 -14 188 -101 34
3257C4L07l65J2J02q9O9l34J5j0K91p2J44k82L66k36J13J67j87J50o2K1j94j73
$$ 34 341 -24 -12 90 1 70 -264 -249 -259 32 -40 104 -178 188 -48 65 232 45 195 133 154 -40 -213
3280b13J25K60M9j52j34P3j41k2j2J9L50l23K16k85L37j66J56k27J02Rl8n8Q6
$$ -213 -88 172 221 69 -65 8 -133 -155 -167 -148 202 -121 95 -190 147 -19 137 -90 12 21 -17 -75 11
3303A1q9k91Q8M3J48J28k02M7K73j37M5L10l21J45m6j67j8j36L15k80R9j4Q7J78
$$ 11 -78 -369 -281 -238 -90 38 -164 -117 156 19 64 374 53 198 152 -15 -33 -169 146 -134 -35 -49 38 216
3327B16m97L87J50m40K79nM5j52k19K18j69L81L5q3Kk67K19p2k57M7J46J18r5
$$ 216 -281 106 256 -184 95 90 135 -17 -236 -18 -187 194 229 146 148 -119 100 28 -229 -182 -36 82 -13
3350a3p3J75J04j47L0j23K87k18R8j14O6Q2o7l83J95R5J77l18PL67j51p5j13K65
$$ -13 -86 89 193 46 76 -47 240 22 120 6 72 154 87 -296 -101 -6 171 -147 -140 227 76 1 -112 153
3374A53j23j07J1j88M4J65Q8L1N0O7l44k9L01N2j55P7K20k78m7j7k92L76K33k35
$$ 153 30 -77 -66 -254 -210 -45 43 74 124 191 -153 -182 119 171 16 93 313 35 -12 -29 -321 55 288 53
3398E3l4L0Nlk54K45j02L21j70j45L14j75k72J90k76K16k31K33J65K5j13Qo3J8
$$ 53 19 49 54 51 -203 42 -60 261 91 -54 260 85 -187 3 -273 -57 -288 -55 110 135 22 30 -33 -15
3422a5K01j30J37k73J49k82O2J85j66L61k97K04j35J38j27o5k13J88K62k5q7j77
$$ -15 186 56 193 -80 69 -213 -151 34 -132 229 -68 136 1 139 12 -53 -266 -78 184 159 72 -105
3444a05j43o6M37P7m6j83P4o1Q2J3j84j73L65M3k04R2j75K88j33q3j85K88j44
$$ -105 -248 -314 123 200 154 -29 45 -16 66 79 -105 -278 87 130 -74 18 -157 131 -2 -85 -270 18 -126
3467a26J05k9J71l8k84N9L04k03L9K2J73k81o3J46k29J04J9K70k93L64k62P1p7
$$ -126 -21 -50 121 83 -201 -142 162 -41 -2 20 193 -88 -151 -5 -234 -130 -111 159 -134 230 -32 39 -38
3490c8N9J71r0k23M3J74L85m91K43j25N4j45k12K6J66K35n41K49j28J38Q0n4K05
$$ -38 21 192 102 -121 -78 96 481 -10 233 108 162 17 -195 -169 -3 232 -309 -60 -188 -50 30 -24 181
3513A81l6l21K05n5Q0m8J13j73J85R7j29j66l7P2n7J29r3m3j61K73j40m1K78m9
$$ 181 145 -176 29 -26 54 6 119 -54 131 228 99 -67 -104 -32 -89 40 -53 -96 -257 16 -124 -165 113 64
3537F4k46L64r6k09J02K9K98l04J45j03J09k18K02m06J28J32n6K03j94N9Qk47
$$ 64 -182 182 86 -123 -21 8 306 2 147 44 153 -65 137 -269 -141 -9 -65 138 -56 3 11 -236
3559b36K26J04k46K71Pn8l24K07O3QjO9n9n1K09p0l08J39k13L33R8n7k2q9M21
$$ -236 -10 94 -152 119 126 68 -256 -49 14 22 21 90 31 -20 189 119 -189 -50 -263 70 168 111 89 0 421
3584D21k94k23J44J19L0K6k60K64k29n4j81L33l80J54P3p0J18P5j00L7j99K30
$$ 421 127 -96 48 167 197 223 -37 227 -2 -56 -237 96 -284 -130 -57 -127 -9 66 -34 3 -196 34
3606C4q6J00Qj56K49j38N3o0L9j3jj70J66o24L97r8L13j88J06J33k20L49j41j07
$$ 34 -52 48 56 -100 149 11 64 4 43 30 29 -141 25 -599 -202 -300 13 -175 -69 64 -156 193 52 -55
3630e5Q8L7m0M4k03J87k32j83L05L5j06M7n1J8J65K08k81K06j25O4j70oK88k55
$$ -55 33 70 30 74 -129 58 -174 -357 -52 -17 -123 -76 -127 -109 56 264 -17 189 64 128 -42 -48 240 -15
3654a5L4nJ32l49L72k55L36l56L3K0k06K76j49J10k24L88j72j09J53P2R8k08m2
$$ -15 19 14 146 -203 169 -86 250 -106 -73 -53 -259 17 -132 -22 -246 142 -30 -139 14 86 184 -24 -66
3677f6K32j21j6j57M82m27J5J29J49j01j55j73L4J02J81J37q1j92K67J15o9o43
$$ -66 166 45 29 -128 354 -73 -58 71 220 119 -36 -209 -175 -73 108 245 164 -28 239 354 285 -358
3699c58M76K83m36j73L4k30L87P9l70N74m62Q7K28k39P5k1R9j30J1J37k5J94l36
$$ -358 118 401 -35 -208 -174 -404 -17 62 -308 266 -196 -109 119 -120 -45 -66 33 -97 -86 51 26 220 -116
3722a16J51M4l89J62J01L8K11m01M19j44k71L80k56j28K99N9l00K43j5n9j29K81
$$ -116 35 79 -310 -148 -47 -9 202 -199 220 76 -195 185 -71 -199 100 159 -141 102 87 28 -101 180
3744A80o4k35O7K33r4o6o3M6q5r7L50k48J66j60K39j33R8J37k32J96j26L4J42
$$ 180 116 -119 -52 181 87 21 -42 4 -81 -178 172 -76 90 -70 169 36 134 271 39 235 109 143 285
3767B85j9j03k78N2o5J82L8j07j25r9J22J71k8qJ87k94R5m6Q3J4k35K23j72J71
$$ 285 266 163 -115 -63 -128 54 92 -15 -140 -239 -117 54 26 18 205 -89 6 -40 43 57 -178 45 -127 44
3791D4Q1Mj59L2R9k39O0r1J03R3j35rN00m57J53Oj4j18m4Q3p6P6k55M26l2l4j16
$$ 44 125 129 -30 2 101 -138 -78 -169 -66 27 -108 -117 383 -74 79 85 71 -47 -91 -8 -84 -8 -263 163 131 97 -19
3818a9q2J66O0j63j02k5K28j32J90k99J60j27l7K91q4j52N6K30l6p5j97J27j07
$$ -19 -101 65 125 -38 -140 -165 63 -69 121 -178 -18 -145 -182 109 25 -127 -71 159 123 48 -149 -22 -129
3841a29o2Q1M7J27l36M52MN1k68L35l34K43k58O1m6M5P8J01j55l74J63J22J29
$$ -129 -191 -110 -63 64 -272 180 184 235 -33 302 -32 211 -47 14 -32 13 91 192 37 -337 -174 -52 77
3864G7k43M11k05o8l5j22L51k83m9J87L06k02l6j88M9L07l10j71K35J43l48J55
$$ 77 -166 245 40 -28 -63 -185 166 -117 -166 21 327 125 89 -99 -50 257 -53 -224 11 154 -194 -39
3886c9j54k0K51l51K01P7k54K53O4O3l2m4j10j44J02M59Mm64L13q9Kn9Oj33o6
$$ -39 -193 -213 38 -313 -112 -35 -289 -36 28 91 59 15 -95 -239 -137 322 326 -138 175 86 88 29 35 -98 -164
3911a64J64j0J45p7L4j19j3J08n0R4P7oJ38m57j96N74l58j58L16M3o5L0k4l36
$$ -164 0 -10 135 58 92 -27 -40 68 18 112 189 183 321 -136 -332 242 -116 -274 42 85 20 50 26 -310
3935c10K59J21r8j72K72j98L43m1j39n1K40j18m08L01P0P3r2j53J07r4j25K35
$$ -310 -51 70 -28 -200 72 -126 217 176 37 -14 226 108 -300 1 71 144 52 -101 6 -88 -213 22
3957B2P2K8m4n7j31K86q4l3K0O8j84O8K9K24l90J20L3R6k53j49K90j88o2K39p
$$ 22 94 122 78 21 -110 176 92 59 79 147 -37 31 60 284 -106 14 47 143 -110 -259 31 -157 -219 20 13
3982A3q5O9K0j30L60j31P4k54J63N2oj8m92K45K7OJ14n9r4J34k14K43j00J05k48
$$ 13 -72 -3 17 -113 247 116 190 -64 99 151 145 127 -365 -120 -93 -87 27 -32 -126 8 -206 37 -63 42 -206
4007b06J80J77P1j2k4L6l90K50J4j69j8J77k97r7O31o4m36R6K27k53j4j5J02J24
$$ -206 -26 151 222 210 186 222 -168 82 96 -73 -91 86 -211 -308 323 259 -177 -81 146 -107 -121 -136 -34 90
4031I0o3j7k45K30J79k61q1J66q7O4R4j58K9J77j98L63m40J43j18R7Q6Q2J83r4
$$ 90 27 10 -235 -5 174 -87 -168 -2 -89 -25 69 -89 -60 117 -81 282 -158 -15 -133 -36 50 132 315 221
4055B21N5k03j18J61l1n6j32K81j85Q3m7j89J35j95J05O8k5J38k93K58K43l53
$$ 221 276 73 -45 116 85 29 -103 178 -7 76 29 -160 -25 -220 -115 -47 -72 66 -227 31 274 -79
4077g9J34j74L9L14l15J73l80L14m5j59K39k14K47q8l03L74R1k83j36K98m6p5
$$ -79 55 -119 -80 234 -81 92 -288 26 -19 -178 61 -153 94 6 -297 77 168 -115 -251 47 1 -74
4099g4J03O1K3j15j50J85%K14p4n00L12j67L83j45j15k33L17n7R1K6J50k47J47
$$ -74 29 90 113 -2 -152 33 33 247 173 -327 -15 -182 201 56 -59 -292 25 -32 59 85 235 -12 135
4122A35P6k33Q7k02o2K40K2j16J11N5l65M40j63j00P2J74j57k03J67qQR5N2O9
$$ 135 211 -22 65 -137 -199 41 63 -53 58 113 -252 188 25 -75 -3 171 14 -189 -22 -30 -22 73 125 194
4146A94k02K63j13k54l71M76k76N16k09r1J27k92P9Q3o8jM14l05m3J29j69J25
$$ 194 -8 255 142 -112 -483 -7 -283 233 24 -67 60 -232 -153 -70 -138 -139 275 -30 -73 56 -113 12
4168A2J07k34R1r7l0J80k00M9o6j3j22K35K15q1L8j01J23k7j3J76r0Jj31kK58
$$ 12 119 -115 -24 -121 -151 29 -171 -122 -188 -201 -323 -88 127 46 84 -17 106 79 66 242 152 153 22 20 278
4193B78j46j64n8L54k47j1j88M8j0L47j28N1k65R2J71k57J35NNJ8qJ5J30m7l66
$$ 278 132 -32 -90 264 17 6 -182 -134 -144 203 75 126 -139 -47 124 -133 2 7 12 30 22 37 167 120 -246
4218b46K56L8k38J00J4q9R8N1J03l40O44n72L87k04j92L16j58K18j70j33P8Kp0
$$ -246 10 48 -190 -90 -76 -165 -67 -16 87 -253 391 -181 206 2 -190 126 -32 186 16 -117 -39 -37 -107
4241a07j23K04p5R5j39J18l9O%K91k95K1L77j17k82Q2q6J32q6J58q8M7o6M6j29
$$ -107 -230 -26 -101 -6 -145 -27 -66 -60 -60 231 -64 -43 334 217 -65 17 -69 63 -23 135 47 94 28 74 -55
4266e5K18k62J16m0o6O6j37k5K7K82j42M6m7K63m63K68O2j00j04K27k28M5q4J50
$$ -55 163 -99 17 -23 -89 -23 -160 -185 -158 124 -18 28 -19 244 -219 49 111 11 -93 134 -94 -49 -133 17
4290A7j55J75p1J55o6J23m6j64L60k56n1J67L6k43J14l29J70j93M78l66o8j5J70
$$ 17 -138 37 -34 121 55 178 132 -32 328 72 21 188 224 -19 95 -234 -64 -257 221 -145 -213 -228 -58
4313e8N2l31M03Kj87ML27k07Q0n0P5k46L75k86M6q5J20L1j43K41k79J61q4J67
$$ -58 -6 -337 66 68 -119 -115 212 5 85 35 110 -136 239 -47 -1 -86 34 65 -78 163 -116 45 -39 128
4337A28m34J83k9J20L3j27R2O0J04j54J71k11Mn6J12j92o9J72K04j30Q9Q3k13
$$ 128 -306 -123 -152 -32 1 -126 -34 26 130 -24 147 -64 -60 -116 -4 -196 -265 -93 111 -19 70 153 -60
4360f0J6J15n2K20m21K6J73K0J95o9k92K97j80j45K21j0L7Q1j66k97L46k56J61
$$ -60 -44 71 19 239 -182 -156 17 37 232 163 -129 168 -12 -157 64 54 91 172 6 -291 55 -201 -40
4383d0O9J79j77j80J44o5K11j68Q7k16K46k21J81k8j2Jj6j31R6M4j64M7J30J42
$$ -40 29 208 31 -149 -5 -70 141 -27 60 -156 90 -131 50 22 10 11 -5 -136 -40 4 -160 -113 17 159
4407A59k06P4k13L08k68K99l34L37j84m6O2j26L39j74j74K46k74J86j91m8K59
$$ 159 -47 27 -186 122 -146 153 -181 156 -28 -74 -12 -138 201 27 -147 99 -175 11 -180 -228 31
4428C1j29L14l26K07j42K31j86J04k16k7N4L31j82j41O1J18k89M43k84P9N5K3
$$ 31 -98 216 -110 97 -45 186 0 104 -112 -139 -85 246 64 -77 -16 102 -187 256 -28 51 106 129
4450A29j29O4j43j0L10j30j71R5r5J52J03l82J54m9R9P0j67N9J43l1n7m4J95k02
$$ 129 0 64 -79 -89 221 91 -80 15 -80 72 175 -207 -53 -102 -3 67 -100 -41 102 71 14 -30 165 -37
4474c7l8L32l01p1L36l08J61j41K7P9J6J76j14k26P0nN1P5l09J80K2M2j00J83
$$ -37 -75 257 -44 -115 221 -87 74 -67 -40 39 55 231 117 -109 -39 -44 7 82 -227 -47 -25 17 -83 100
4498A00j87J23O4j98L12j43k29J05J67k56P7q3J54J51k3o8O5j19j1L4j52J36j20
$$ 100 -87 36 100 -98 214 71 -158 -53 114 -142 -65 -148 6 157 134 66 131 12 1 35 -117 19 -101
4521a01N0J90k83K48J56j45o2n4J22k12p3J22j0L4rQ1M6q7j79L79k22K05l5j38
$$ -101 -51 139 -144 104 260 115 53 -1 121 -91 -164 -42 -52 -18 -27 54 100 13 -166 213 -9 196 161 23
4545B3k9J62m8m8J6p3k28J58J31j62P9L5k3k33QK32j5J42k64J10o1r5L23k04K26
$$ 23 -6 156 108 60 76 3 -225 -67 64 -98 -19 16 -7 -240 -232 0 -15 127 -137 -27 -88 -183 140 -64 162
4570A62j86J18r4J94n2k04J76l91L39j15J19j73j52L28j50K67j78k0k4J08k9p
$$ 162 -24 94 0 194 142 -62 114 -277 62 -53 66 -107 -259 69 -81 186 8 -12 -36 72 43 36
4592C6J26k05O4R2J07l09J49j28j50L0J98j02N7L2Q9m52K65J56L17k85r0j49J84
$$ 36 162 -43 21 113 220 -89 60 -68 -218 -188 10 -92 -35 -3 86 -366 -101 55 372 87 -3 -152 32
4615C2J13j91J5l0J54r0j26m02O24K82m40l13L82j08K49l1k27J85J49j25q9K00
$$ 32 145 -46 -31 -61 93 3 -123 -525 99 381 -59 -372 10 -98 151 120 -107 78 227 102 13 213
4637B13n64M32k89K23J45r3q7M4l1R3J0j63J54l9p6Q5K3k06L15l77J15J80p9j82
$$ 213 -351 81 -208 15 160 67 -20 24 -7 86 96 -67 87 48 -28 57 80 -126 189 -188 -73 107 28 -154
4661a54J19M59l56j14k10L08n4r1J4j7n8jL98k48J48l16K29J56k54j15J69j08
$$ -154 -35 424 68 -46 -256 52 -2 -93 -79 -96 -154 -155 243 -5 143 -173 56 212 -42 -157 12 -96
4683i6N9J74j74K27m09K84p2%p4m9K17r6K7J11K7j42j58L13p1j82j04L43k26R8
$$ -96 -37 137 -37 190 -219 65 -7 -7 -81 -130 87 -9 18 129 156 14 -144 169 98 -84 -188 155 -71 27
4707B7p3L24m50K14%k19j77J21J45Q7p1J59j75J96Q3k28M8p9J81j68K32k29m4
$$ 27 -46 278 -172 42 42 -177 -354 -233 -88 -1 -72 87 -88 108 191 -37 11 -68 113 -55 177 -52 -96
4730i6M1n2K80l48J49j21J73J21j18j4l1N4j25K02j47Q2l9K9p4Q0n6m5K17jr0
$$ -96 -55 -107 173 -175 -26 -147 26 147 29 15 -16 38 -87 115 -32 50 11 40 -34 46 -10 -55 162 161 71
4755G1k09J41j99L05k41J50P7k73j2K42K15k31q1R9n8n5j22J83j19Q6K79j87P7
$$ 71 -138 3 -196 109 -132 18 95 -178 -190 52 267 36 -45 54 -4 -59 -181 2 -117 -31 248 61 138
4778A38l4P2j41j85J03k32J49p8R5K59Mr2O0l00M11J3k11k58K32k05M30n3j32
$$ 138 104 176 35 -150 -47 -279 -130 -208 -113 146 150 58 118 -182 229 242 31 -227 5 -200 230 177 45
4801D5k39J12R4K19l79J14L09pj16l26K08Q6J49l45J45j39k39L47J61n9l5l97
$$ 45 -194 -82 12 231 -148 -34 275 268 152 -174 34 120 269 -76 69 -70 -309 38 199 140 105 -292
4823b92K03k18L44N7J0k42j21J87RQ2Np7l0K42j85k69R3O1Q2J58k44L42k91J09
$$ -292 -89 -307 37 94 104 -138 -259 -72 -63 19 24 -53 -83 159 -26 -295 -202 -141 -59 99 -145 197 -94 15
4847A5o2j91J46J62j35Jp2M5K82P0m32L3K37J16j24n7N8J2J67o2L5k93j02N1J87
$$ 15 -47 -238 -92 70 -65 -64 -136 -91 191 261 -171 -138 99 215 91 34 92 104 271 209 244 -49 -151 -100 87
4872H7k5N9m59K14J31p6l07M13j98J65Lq6l1J69j77J63k4j78R3M6M5J1J15n06
$$ 87 62 121 -338 -124 7 -69 -376 37 -161 4 7 -79 -110 59 -118 45 21 -157 -64 -18 27 38 153 -353
4896c53J24N41l73O8L5M44m71L7J14k60J99k71P7lk5K52l35J36N7K8j08K58n0
$$ -353 -229 312 -61 7 42 486 15 52 166 -94 105 -166 -89 -92 -117 135 -200 -64 -7 21 -87 171 121
4919A21p9K8k2k06K80n3k38P2o7J02M9L2m0k15K55k3K80m03K30k12J37o0P8j60
$$ 121 42 70 48 -158 122 69 -169 -97 -164 -62 -13 19 -21 -236 19 -4 276 -127 103 -109 28 -32 46 -114
4943a14P0Q5Mj59J94L6m5O3J55j88p3K49j71po6l05K65l3J03k19m9M1K56k15j15
$$ -114 -44 41 45 -114 80 116 71 134 289 101 28 277 106 99 33 -272 -7 -40 63 -156 -205 -164 92 -123 -238
4968b38M63k90J73l6j18K18r2O0l3k87J83n2oM7J18j72n9K2K4L7K66k10k3j76
$$ -238 225 -65 108 72 -46 172 80 140 107 -180 3 -49 -55 -8 110 -62 -121 -99 -75 -38 228 18 -5 -181
4992a81K94j08k39K30J07P1L3k44K23j62j72K74j93J48J03k37p2m6J58j33J59
$$ -181 113 5 -234 -4 103 174 207 -37 186 24 -148 126 -67 81 184 -53 -125 -171 -13 -146 13
5013A3o6J52j42K95k78M8j20J10R8j55N3m1P2k4M1qJ17q7QJ67k94j68M4L70o8
$$ 13 -53 99 -43 252 -26 22 -98 12 110 -45 8 -33 39 15 56 48 165 78 86 253 -41 -209 -165 205 137
5038A37k64J19K18k34l4J07k57K2M47j33k14Q3L8L9O2j71K19k93k12K57K08K47
$$ 137 -127 -8 210 -24 -58 49 -208 -186 261 128 -86 -3 35 74 136 -35 184 -109 -321 -64 144 391
5060C91k49M2l6j73J6j24J41k32P3o7L54j89k7O7mn0J05r0Q1J12l4k06K33k58
$$ 391 142 184 148 -25 -9 -133 8 -224 -151 -218 136 -53 -80 -13 -17 -67 38 -52 29 141 107 -99 134 -124
5084a24P9K55q3J46l45l7J54k66O7J21j15K01j93lL0M1N7J29r5p0J31j96L56j09
$$ -124 -45 210 127 273 -72 -109 45 -221 -154 -33 -148 53 -140 -143 -113 -72 -15 114 19 -51 80 -116 240 131
5108A31K02m66J51p0k51K49Q7j05oj36O2l7K53q1R2k20N8O2n7J44j9K8N8k32j6
$$ 131 333 -133 18 -52 -303 -54 33 -72 -78 -214 -152 -189 64 -17 75 -145 -87 -25 -82 62 43 71 129 -103 -119
5133a19J05j36N5K4Pp8J07K6n5m7K10j81O8L0K7P6k27J30p9J01O7l13m1J69J36
$$ -119 -14 -150 -95 -71 -64 -142 -35 -9 -64 -111 99 -82 -14 16 43 119 -108 22 -57 44 111 -202 -243 -74 62
5158F2j92PJ29J35k15qo5K59j67q9J7LJ01O2Q2R2l79J34J76l08J02j47L61k06
$$ 62 -130 -123 6 141 -74 -82 -147 112 -55 -144 -127 -124 -23 39 121 213 -166 -32 144 -164 -62 -209 152 -54
5182e4j56K86j07j10O9PQ5K44l15k1P6l2o1j13Q1L74l0j64k6O2L7j96n5K52m3
$$ -54 -210 76 -31 -141 -72 -65 20 264 -51 -72 4 -28 -89 -202 -121 253 223 59 33 95 132 -64 -119 133 90
5207I0j78J49lJ53l81M97l24J10N2j46q9k32M11j21q3j24L93k88L61l44N3K80
$$ 90 -88 61 58 211 -170 327 3 113 165 19 -70 -302 109 -12 -95 -219 174 -114 247 -97 -44 236
5229B36l14r7J47J24O0j13Qr1K03J59l97K54q9j57L4m5Q1q1j79M97m59J00K60
$$ 236 -78 -175 -28 96 156 43 51 -40 163 322 -75 179 90 -67 -33 -78 3 -78 -257 240 -219 -119 141
5252A41J57k10j28K35o8j05L25l62j39m2J34LJ6j23J00P1R6l80M64l76J34j39
$$ 141 298 88 -40 195 127 22 347 -15 -154 -196 -62 -59 -43 -166 -66 5 101 -279 185 -191 -57 -196
5274a96J95J50k30J5J87K4j53L49R9m05M40n12K2oJ69k99K83j44m1J36R9m48K78
$$ -196 -1 149 -81 -66 121 145 -8 341 440 35 475 -37 -15 -21 148 -151 132 -12 -53 83 182 -266 12
5297A2o5K37p1J3KJ04l19L7j60K30n8j58J05L9m9K61k35l7J99J71m16J58j58K4
$$ 12 -53 184 113 126 128 232 -87 -50 -210 20 -38 -196 -91 -52 -101 160 -75 -112 87 258 -158 0 -158 -134
5321a34P7m0O2l2K43l33J24J25j67k1p4L32l27K31j75lM1J54j85J74K23l07R8
$$ -134 -57 -97 -35 -67 176 -157 -33 92 -75 -96 -170 162 -165 66 -109 -112 -71 83 -102 72 295 -12 86
5344H6K62l05p7q9L01j84Q4K6r6j24m0M58j25o4Pj62j13Q6P9O3oO6r2jj41k5J27
$$ 86 348 43 -34 -123 178 -6 78 104 8 -116 -156 302 177 113 120 -42 -155 -69 10 73 67 133 41 40 -101 -126 1
5371Arj27M42j99r1oM5l30K23n6O0J96o0j49J18o5J59j55j03K02o6J83k75R2l6
$$ 1 -8 -135 307 108 17 11 56 -274 -51 -107 -47 149 89 -60 58 -7 152 -3 -106 96 30 213 -62 30 -6
5396frK89m36K07r8P2j61J20LO5k02J86K01r6Mk8j69J25J26j35m8J7j53J2R9K87
$$ -6 -15 274 -162 45 -53 19 -142 -22 -19 46 -156 30 231 135 139 111 -58 67 193 58 10 27 -126 -114 -15 272
5422B72l31KK03l9n3k02j26K06p8L67j00k6N7j10o2O2k39L2K16k7L29l62K28l4
$$ 272 -59 -57 146 107 54 -148 -274 -68 -146 221 121 95 152 42 -20 42 -197 -165 51 24 353 -9 219 185
5446A85L2j70j73J91k34Q7K71k05o2J38j24J39k14Q7j25k11K79M67m53l3JJ08
$$ 185 217 47 -126 65 -169 -82 189 -16 -78 60 -64 75 -139 -52 -177 -388 -109 358 -95 -128 -127 -19
5468a9R9j02j63lJ38J28j83k0L92l68J07J25N8k95J28j71J98j10M0J65p6q3M0
$$ -19 80 -22 -185 -188 -50 78 -105 -125 267 -101 6 131 189 -106 22 -149 49 -61 -21 144 68 -15 25
5491B5k84L06J9j25K33r5j11j38J88o2J60J08k25N5J31r4j26J24k13M0j1J00k2
$$ 25 -259 47 66 -59 174 79 -32 -170 18 -44 116 224 -1 54 185 91 -35 89 -124 -84 -95 5 -17
5514a7R7j18k76M14L5j03M0J27k56J92M3j90o7l0l9K84k36m8J27j2J06P2J04l38
$$ -17 80 -38 -314 100 135 32 72 199 -57 135 178 -12 -79 -109 -148 136 -100 -148 -21 -33 73 145 249 -89
5538h9J65O7L1n9K9k00M5M4J4j56Q9J06jr0j32Q6n8m2J5L38n8k89J30k61L46k0
$$ -89 76 143 174 115 144 -56 -11 33 47 -109 -20 86 85 -5 -137 -51 -109 -151 -136 202 144 -145 -15 -276 70 50
5564E0p1Q7l11R6J15l37M29j29J94l4Rj36J70j1kl61J60J40l58PJ26L99j47Q9
$$ 50 -21 66 -245 -149 -34 -371 58 -71 123 89 98 -38 132 121 119 -242 -82 58 -300 -293 -167 232 85 174
5588A74l36L27l34J87J89r1k15K39J86k85J63L5l80L16K3k40mJ80m15K54K54k64
$$ 174 -162 165 -169 18 207 116 -99 140 326 41 204 239 -141 175 198 -42 -46 134 -281 -27 227 -37
5610c7o5L26k45l36K81J05K9L1m2m3j84J66j0R9j31J46j49J71l46K27P1l87L00
$$ -37 -102 224 -21 -357 -76 29 58 89 47 4 -180 -14 -24 75 -56 90 -59 112 -234 -7 64 -323 -23
5633b3K29l84K83n5j21K36o9K5J17k32L34M0l38M3j93K0N1O2J60j01j3j6j67J86
$$ -23 206 -178 105 50 -71 165 96 121 238 6 340 380 42 85 -108 -88 -37 25 185 84 71 55 -112 74
5657G4Q0k83K06j27JJ7o5R4J52j25L08n61J18J47p2Q9k61k3J97J57l76L88J37
$$ 74 154 -129 77 -50 -49 -32 -97 -3 149 24 332 -229 -111 36 -36 53 -208 -231 -34 123 -253 135 272
5680B72j42p6l8J39j79N7K3N0L48m19q3L9L2m3k20L79j45p2j65L22j2K0j72J76
$$ 272 130 54 16 155 -24 33 56 106 454 35 -48 -9 23 -20 -240 139 -6 -78 -243 79 67 87 -85 91
5704I1j38j14P1J33p4k11L78j5j55k01K93L24k91j13O6k16O2L38k45k69K17l2
$$ 91 -47 -161 -90 43 -31 -242 136 121 -34 -235 58 382 91 -22 44 -172 -110 228 -17 -286 -69 -101
5726a01M7J83J07k76k10N54l02J06q9q3Q0l6J42k60K5L60l47J6J74J38m7j34k05
$$ -101 -54 129 236 -40 -250 304 2 108 19 -64 16 -20 122 -138 -113 247 -100 -84 90 228 181 47 -158
5749a58L36l9J2Mj08P3k30L05r0J08l50J46j70J70J15k61J04l5J41j94J62nl9
$$ -158 178 139 151 155 47 120 -110 195 105 213 -137 9 -161 9 124 -137 -33 -68 73 -121 41 36 -3
5772cJ16p7J21j2K4j58K3o7rr8J24K52l35oL3j72J96J2j35O2K32j92O6O7K50r9
$$ -3 113 36 157 145 169 11 34 -33 -42 -140 -16 236 -99 -105 -72 -244 -48 -36 -171 -109 123 -69 -3 64 314 215
5798B15j65J31l23J05L10n27L10K5j02q6O4NJ9l1k6K28j71K01j66j58L32j97j2
$$ 215 50 181 -142 -37 273 -254 56 81 -21 -107 -43 -38 -19 -50 -76 152 -19 182 16 -142 190 -7 -19
5821a9J12j41j31J49J46J10k97K6J06o3P9m05Q6kN20j73J31j90j6N9J23j44Jj61
$$ -19 93 -48 -179 -30 116 226 -71 -45 61 -2 77 -328 -242 -244 276 103 234 44 28 87 210 66 67 -94
5845i4K66p3qj94p7J18K65k53j53K03j89J46J34Q8n2N3l15J32Jj7l4l6M3n0l2
$$ -94 172 99 91 -103 -180 -62 203 -50 -203 0 -189 -43 91 179 127 180 -135 -3 -2 -19 -53 -89 -46 -96 -128
5870a28M73j21o51M64N7j48j13j25M02K4j65M3mJ55nl97K40K46q7j31j4r3N2K7
$$ -128 345 224 -427 37 94 -54 -167 -292 110 134 -31 12 8 163 158 -239 1 247 160 29 15 -78 -26 1
5894An6M6j75K25m06L94K16k31j8j4Nj8L0M5j14j5J00J94Pl12J92k02j25J67J19
$$ 1 -55 -9 -184 41 -365 29 245 14 -4 -18 -13 -31 -1 44 -70 -85 15 209 216 -96 96 -106 -231 -64 55
5919E5j38J11j16K24m31M10m81N35l98Q5j2J40J37l28K82j87m8O5Q1j9K08Pk55
$$ 55 -83 28 -88 136 -295 115 -366 169 -229 -144 -156 -16 121 -207 75 -112 -160 -95 -14 -33 175 182 -73
5942g3L05j14l95M73l30M29k13j09J64l3J54j37l05M31m00K20J0p6k10P4k79K69
$$ -73 232 118 -277 196 -134 295 82 -27 137 104 258 121 -184 247 -153 67 77 1 -209 -135 -414 -145
5964a45K36j21j50k5K41o4K0K03k05P7J65j09p7J7n4J55l4l18k13K88K28m0j59
$$ -145 91 -30 -180 -205 36 -28 -8 195 -10 67 232 123 46 63 9 164 130 -188 -401 -113 115 75 -84
5987h4L52l00R5k8Nj17J95k35J8m4J18K5q8M77l07J20r9j74J23J53j89j09j86
$$ -84 268 -32 63 35 40 -77 118 -117 -99 -143 -25 0 -88 389 82 202 103 -71 52 205 16 -93 -279
6010b79N29l76j97M14k13R2q5J81p9J50q8j76J86j62K52k77l75N74M9m3J90l89
$$ -279 250 -126 -323 91 -122 -30 -115 66 -13 137 49 -127 59 -103 149 -128 -503 71 120 77 267 -122
6032a22K41k20L27j82K65r3l59K11J99kk24r1k32L08l0m1L6J39j91O1q1K65k44
$$ -122 119 -101 226 44 309 216 -143 68 267 265 41 -50 -282 26 -4 -45 -9 130 -61 0 -81 184 -60
6055f0J33n4L6J34k15J67q1m32J55M24k04J83j74j8k18L55k11j85L36lj23J35
$$ -60 73 19 55 189 -26 141 60 -372 -217 207 3 186 12 -6 -224 131 -80 -265 71 68 -55 80
6077H0q3l6l3J71J71m45K04j26K89j93J02R7k21K17Ok58K59j90p2j6L5r1R9J93
$$ 80 -3 -39 -72 99 270 -175 29 -97 192 -1 101 198 -23 194 200 -58 201 11 -61 -77 -42 -133 -34 159
6101A59L2j78j39J50L13m65j7K17P5k15p8K44r7l32J86J50M7j25K9j5r8J46N0
$$ 159 191 13 -126 24 337 -128 -145 72 147 -68 -146 98 1 -331 -145 5 52 -73 -44 -59 -157 -11 39
6124C9o8j62L16K8J35l49L04k29N2P4Nk58K73p3j48j7k04K21J65j11Q4j07J44
$$ 39 -29 -191 125 153 288 -61 243 14 66 140 145 -113 160 87 -61 -78 -282 -61 104 -7 77 -30 114
6147A14k29N8L18Pk32l5J85k61M0J75k59K59j34p6L51m04j26K60P7k0j55K60o9
$$ 114 -115 -57 261 268 36 1 186 -75 -35 140 -119 140 6 -70 281 -123 -249 11 88 68 -87 173 104
6170A04j06j39K54j75J61j70J4J78k32J03r7N1j2J28M6jm18L50K79m94O7M0J30
$$ 104 -2 -141 113 -62 99 -71 -57 121 -111 -8 -105 -54 -66 62 108 107 -311 39 318 -176 -109 -69 61
6193F1j95J02J42N2j57J2J15j06J99J21l70k31K85J53p6Nl89M60l00%j4J81j65
$$ 61 -134 -32 110 162 5 17 132 26 225 346 -24 -255 30 183 107 112 -277 183 -117 -117 -131 50 -115
6216a15K92J08l16L60k41oj86jJ72n9n7Q1O2l79L00j60j4m7K79O4j54p1j71K04
$$ -115 177 285 -31 329 88 82 -104 -105 67 8 -49 32 94 -285 15 -145 -159 -206 73 137 -17 -88 -259 -55
6240e5j26J24q8J8L08j8j08j09j26O3J8Q0p8l57M55J9j76j24R1M0J49n0o2K68
$$ -55 -181 -57 -145 -127 181 163 55 -54 -180 -117 -99 -19 -97 -454 1 20 -156 -280 -189 -149 0 -50 -112 156
6264A56J55n59J62M8K63M4l06J69j03j61k47K65K76n3J23o0k06J31j07p3J93o
$$ 156 311 -248 -86 -38 225 269 -37 132 29 -132 -379 -114 162 109 232 172 -34 97 -10 -83 110 104
6286A04m84L26k8J32k86M02j12j8M3q6K20l11J10J50l30J63k78K93J8j87J53q5
$$ 104 -380 -54 -82 50 -236 166 54 36 79 -7 213 -98 12 162 -168 -5 -283 10 28 -159 -6 -91
6308i1jJ47j90K9M5p1K6K22J05M9n7l01K00J5k1k15M6K02j15k7J62n5o4j69P2
$$ -91 -92 55 -135 -106 -61 -132 -106 116 221 270 213 -88 112 127 106 -109 -63 139 24 -3 159 104 40 -129 -57
6333e7R7n7R0P0j08nk5j0P6l3j08K58j89o4R5n9Rl1k2J99j29K7J11k31L82l68
$$ -57 40 -17 73 143 35 30 5 -5 71 38 -70 188 -1 -65 30 -29 -20 -51 -73 126 -3 24 135 -96 286 -82
6359h2J93q9p6j33J67J23j95J01k50N0N4K90j69O2O7Q8j72r5M7J69j6J60qj63
$$ -82 111 22 -54 -187 -20 103 -92 9 -241 -191 -137 153 -16 46 113 201 29 -66 -19 150 134 294 286 123
6383A23j08J89j89J01Ll50L3M20j35j22K20l91J71J37k13J16K89k56j55K99j52
$$ 123 15 204 15 116 119 -231 -198 222 87 -35 185 -206 -35 102 -111 5 294 38 -117 182 30
6404C0o7P1J90j06j62J68j75m8MJ95O0j80q2P1L28l30k5j16M5J61nJ53k57J22
$$ 30 -37 34 224 118 -44 124 -51 -99 -95 100 160 -20 -102 -31 297 -33 -58 -174 -129 32 27 180 -77 45
6428D5p8K6k08K74J4l04Q9K50k35M2R9J19j32j55L96k51k6k95M23j16JL79m72
$$ 45 -33 -7 -215 59 73 -231 -142 108 -127 -85 14 133 1 -154 242 -9 -35 -330 93 -23 -22 357 -115
6451a15K82n7j17kj62J18l7J11k24M57j01j60Q4K2m6j14L3K43m67N6J74Nk97L28
$$ -115 167 110 -7 -9 -171 -53 -90 21 -203 254 153 -7 77 99 53 -61 -28 215 -252 -196 -22 -17 -314 14
6475A4m6J41j02j05J89L5k98K32k8j19o0J70J36k16Q3K27o9k79P8L7J89k68N9
$$ 14 -32 109 7 -98 91 126 -172 60 32 -87 -147 23 159 -57 26 253 184 -95 -17 20 209 -59 0
6498@Q0j6j69L1N7R2j6RM6k48R3K8J67j09j85k7Rj03o9K10J22Mp8L13l42J62r
$$ 0 80 64 -105 -74 -17 75 59 68 114 -134 -41 -13 154 45 -140 -167 -158 -261 -330 -120 2 6 -72 241 -101 61 52
6525E2k8k6K14j79j45J35K07j55k38K85l40L61j36K5j50K17q0K8j44L42l47J14
$$ 52 24 -2 212 33 -112 23 230 75 -163 122 -218 143 7 32 -118 99 19 47 -97 245 -102 12
6547A2p3M9k17R7K41l10L9K72K7q0o9j21J26J29k10J14j56k20L41l2M11j23j99
$$ 12 -61 -12 -229 -132 109 -201 -162 110 137 57 -12 -133 -7 122 -88 26 -130 -350 -9 -41 370 247 48
6570D8j17n6K56O2l44J1Q5Q6R8k1M7l01K6K13Nr8J20j17K79l93k2m6Q9K43k76
$$ 48 -69 -125 131 193 -151 -140 -55 31 129 108 155 -146 -120 93 98 0 120 3 282 -111 -133 -179 -90 153 -123
6595a23j90K02K25m8J09p7j96J0K33j01K7j48J55l1j94J83M2n6o0k5K15j12K1
$$ -123 -313 -111 114 66 175 98 -98 -88 145 44 71 -77 78 47 -147 36 78 22 -38 -63 152 40 61
6618F1n6j50K57j89kr8J0L16p8K1j72n4j34J93Q6P2O2o9J53j25L8n2q3J00q2j17
$$ 61 5 -145 112 -77 -79 -177 -167 149 71 92 -80 -134 -268 -75 11 83 145 76 229 104 142 90 7 107 25 -92
6644i2J26j9j08L59l64m1J70J95n10L82j34Q0j73R5K35l19R7PJ39K06m75L48n8
$$ -92 34 15 -93 266 -98 -139 31 226 -284 98 -36 44 -129 -34 201 -118 -21 -14 125 331 -144 204 146
6667A46k45r4K19PL6Q4k26kj37L80j33R9l59K47J60m20L87K2m5k24M1J82J5o6
$$ 146 -99 -193 26 33 69 153 -73 -75 -212 168 35 134 -225 22 182 -238 149 171 126 -98 -57 125 140 74
6691G4K24l47k6R1L4J07k22J2j44R9J62k97J98R7Q2q4J23l02L05k40J91j11K43
$$ 74 298 -49 -75 16 50 157 -65 -53 -197 -98 64 -233 -35 62 144 60 183 -119 186 -54 137 26 269
6714B69n7k43L77l41k10L64l6j30q9J04j61J44J1m3K3O1J49l58J83%j06J37r3
$$ 269 212 -31 346 5 -205 159 123 -7 -96 8 -153 -9 2 -41 -18 43 192 -166 17 17 -89 48 -45
6737d5O8r9lJ79Q4l13J08p4K24k27n8O8m8L27m86L39N0L4j79m1J41K51l38k76
$$ -45 23 -76 -79 100 184 -129 -21 -95 129 -98 -156 -88 -136 191 -295 44 94 128 -51 -92 49 300 -38 -314
6761c14L72j06j26J70J6j22J22m2J28n5j69K34l04J82J3k8J62r5J6j12J16j17
$$ -314 58 -48 -174 -4 12 -110 12 -30 98 43 -126 108 -196 -14 -1 -29 133 38 54 -58 58 -59
6783e9J79K3k09K01o5R5k02J86k03k7j40L40k82J88J23J72l65K44k6j96j04j21
$$ -59 120 143 -66 135 70 165 -37 149 -54 -81 -221 119 -163 25 148 320 -45 199 173 -23 -127 -248
6805b48L47r1R4k07Q5j0j01j63L43K03k03j58K15j45p7O5L2J05O9j36K02l77J30
$$ -248 99 8 102 -105 -20 -30 -131 -294 49 252 49 -109 106 -39 -116 -51 -19 86 155 19 221 -156 -26
6828b6L5k5Q2R6k61L4q7L8J71nj30K2N8p9J2k0K27l80L90L4j96q3q7Q4r2J84p5
$$ -26 9 -16 66 162 -99 -65 -152 -114 57 52 -78 -56 2 -77 -65 -85 142 -238 152 186 -10 -93 -180 -96 -188 -4 -79
6855g9k3J50r0L60j72j50J19P3j2k85O0K15J61j41j94m1J0J0OkJ33j98J56k89
$$ -79 -102 48 -42 318 146 -4 115 188 176 -109 -49 166 327 186 -8 -49 -39 -29 -23 -25 108 -90 66 -223
6879b23J14K54l90J36j2J06j2J6J81k71J55n2J86k18K52k04k88K05K5m8p0K57
$$ -223 -109 145 -245 -109 -121 -15 -27 -11 170 -101 54 2 188 -30 222 18 -270 -65 -40 -88 -158 99
6901I9J18j0j41Rp1n4nJ39n1J2O2J07m9l41O7K17J7K07m33J44o8J08L87l06k71
$$ 99 217 207 66 75 4 -50 -55 84 33 45 107 214 165 -176 -109 108 125 332 -101 43 -25 83 470 164 -107
6926a07K3N6j36M80k93q9j85L72J09M1j95j11J97j72q7K02k67L38k84m1J8J16
$$ -107 -84 -28 -164 316 23 -66 -251 121 230 271 76 -35 162 -10 -97 105 -162 176 -108 -149 -131 -15
6948a5L1n0K9P9j17J55k22k4L85Q1l79j7J80k41J64j15o0L02R7k53j10r6J79r9
$$ -15 16 -34 -5 74 -43 112 -110 -134 251 332 -47 -64 116 -125 39 -76 -136 166 263 10 -100 -196 -17 -116
6972a16M05l26j87J9J25O2K98m51K18k09P9K12lk25J87Q3l51K6m5J34j43P3QL27
$$ -116 289 -37 -224 -205 -80 -18 280 -171 47 -162 -83 129 126 -99 88 171 -180 -154 -199 -65 -208 -135 -127 200
6996B00n2n5k40O5P8J20J62l22J33P0m18O21l48J22k6j93oR2K84L8k08o3m9J19
$$ 200 148 93 -147 -82 -4 116 278 -44 89 159 -259 362 14 136 110 -83 -89 3 287 325 117 54 5 124
7020A24N0k24j63M32j28k5p0k42L22j37J14j02rN8L4n3n2N5K27q0j80O6K4M2j66
$$ 124 174 -50 -213 219 91 66 -4 -246 76 -61 53 -49 -58 0 34 -19 -71 -16 211 131 -49 17 41 83 -83
7045h3N9L5q9n1J72q6J27lj94J17k16J21J0J9j6M4Lj47J91q3J63l01K00Mr8Rj03
$$ -83 -24 11 -78 -129 43 -43 84 81 -113 4 -212 -91 -81 -62 -78 -34 -31 -178 13 -70 93 -208 -8 -4 -102 -93 -196
7072a96j56N92J0j41Ol17L5J99J55k24N4j82K13m9k15L25k82m3J60J95p5k78L70
$$ -196 -352 240 250 109 115 -202 -167 32 187 -37 17 -165 48 -1 -216 109 -173 -216 -56 139 64 -214 156
7095A56m9k41L54k88N0l1k45L01J3J42q2l03J65o8l8L33m8n0j39n2L01j54Q0k80
$$ 156 107 -134 220 -68 -18 -49 -294 7 20 162 80 -223 -58 -126 -164 169 121 71 -68 -120 181 27 107 -173
7119a73k2Q4L08k04j20P4J48j04k09J81j19K13K03k07K3L2O2k81k5J3J38J7MR6
$$ -173 -195 -111 197 -7 -127 -53 95 -9 -218 -37 -156 57 260 53 76 108 170 -111 -136 -123 15 32 36 132
7143A32n5j72J78l17L30J69k05j81J80J11j23J42l84j72N03o5j55N0J67k05J97
$$ 132 77 -95 83 -234 96 265 60 -121 59 170 47 189 -195 -367 136 71 -84 -34 133 -72 125
7164A25j21O3j06j55K08K36l26j64Q8L24q8r8L3P0q9K23j65k43L3K74j3Q2k57
$$ 125 4 67 -39 -194 14 250 -76 -240 -152 172 84 -14 19 89 0 223 58 -185 -152 122 109 191 -66
7187f6q1J38N3J9J8n7J71P0k96P0m9P1NR8M2K09l07j55K69j99K71l06L05k42l3
$$ -66 -147 -9 44 63 81 24 195 265 -31 39 -10 61 66 164 206 415 108 -47 222 23 294 -12 293 51 18
7212A8j0j14J50q7kk23L46n0L20k05l2OK9P4k90K34j83K43m04OJ60J11k27n2J21
$$ 18 8 -106 44 -43 -45 -268 78 28 348 143 111 117 146 220 -70 164 -19 224 -180 -174 -14 97 -130 -182 -61
7237f1n9J78J07p5j29n3pJ31K06r7k86L3R2P8k39Q0K19j42K54k56O2o8J66j31
$$ -61 -120 58 165 90 -39 -92 -99 32 238 141 -145 -112 -20 58 -181 -101 118 -24 230 -26 36 -32 134 3
7261Ck12K51r9j11J69K39l43O2L60j87k48K70j31R5K65o21J42l9J51j0r7q0l9
$$ 3 -209 42 -57 -168 1 240 -103 -41 319 132 -116 154 23 118 383 -238 -96 -135 16 6 -91 -171 -210
7284b10J28j16L80q1K6k30J16K00k51j82L51k7q7Jj87J46j14L94m83K30J4l08
$$ -210 -82 -198 182 101 127 -103 13 213 -38 -220 131 104 17 18 -169 -23 -137 257 -226 4 18 -290
7306b90M20J71Jl39Q0J09R8k35j25J37o5R0q3K35j67j05m9j43L51m4j24J63k81
$$ -290 130 301 302 -37 43 152 250 15 -110 27 -38 52 -31 204 37 -68 -117 -260 91 47 -77 86 -195
7329a95O09o15L43j85K55k34m9K03j47K06n92L86n2j24K89K73n29J46j73K95j36
$$ -195 414 -201 142 -43 212 -22 -71 132 -15 191 -401 -15 -67 -191 98 371 -158 -12 -185 110 -26
7350b6n8J98m6j98L58k63k81M78q8j73N5J71M4j26kk04K39j42j9nL4J5k34N24
$$ -26 -84 114 68 -130 228 -35 -316 162 74 -99 -44 127 171 45 43 -161 78 -64 -83 -88 -54 -39 -273 251
7374B51j78k72N02l98P0k4J63J21r9L7l99J92J08O9j95J66j49o8Q7Kj64J45j47
$$ 251 73 -199 303 -95 -25 -49 114 235 136 173 -226 -34 74 143 -52 114 -35 -103 -16 -14 -178 -33 -180
7397a80j11L62j33K41j93K57l15Q9J15Ml1o5j60k1J07KN3M1q5n3j55K48J38k18
$$ -180 -291 71 -62 179 -14 243 -72 17 132 136 105 40 -120 -141 -34 -32 21 62 -23 -76 -231 17 155 -63
7421f3j47J96N9K0J41nj39L6K67l32J69m78K18j34L57k73J35P7l28J27J84j3j92
$$ -63 -210 -14 45 65 206 201 62 98 365 33 202 -276 -58 -192 165 -108 27 104 -224 -97 87 74 -118
7444a18K97k13n7j68J84K6L85l65K1m3J61J27l42j26L09k77J92j72K43j4K0n9
$$ -118 179 -34 -91 -259 -75 -49 336 -29 -8 -51 110 237 -105 -231 78 -199 -7 -179 64 50 70 11
7466A1j61L17m6J00k56K73l05K13m1n2j72P1J95p5j9k04N5K47n4k42L93j69j54
$$ 11 -150 167 121 221 -35 238 -67 146 105 53 -119 -48 147 72 53 -151 -96 151 97 -145 248 79 -75
7489g5R6j96J0L46m08j28L63M3J65j93j10J26L4L0l42K16M2J12p5l33M18Jq0k13
$$ -75 21 -175 -165 181 -227 -355 8 51 216 23 -87 39 73 103 -239 -23 19 131 56 -277 141 142 62 -151
7513a51K64k83L41m42K86O5M0j59j69J51J51K8j01n7K68k03K1j8j27P5q0Q2O9
$$ -151 113 -170 171 -271 15 80 120 -39 -208 -57 94 122 21 -36 232 29 50 32 -95 -20 -100 -18 51
7536E1n2L11j02j40N5l33K66M2n4k79L33k42j58J71L8K53k75k36M80Q0j22k11
$$ 51 -1 310 208 68 123 -210 56 98 44 -235 98 -144 -302 -131 -93 160 -115 -351 129 209 87 -124
7558a24j07K66q5J93k49K19j19L8k43J40j83M95l02j15L32n7k8n6m3J40J99j72
$$ -124 -231 35 -50 143 -106 113 -6 32 -211 -71 -254 241 -61 -176 156 99 71 15 -28 112 311 139
7580A39j52R5O6k69R1N2R6k56K28l9k8k75J01K39j57Ml9j55M90j98l13q6L12J16
$$ 139 -13 82 148 -121 -30 22 118 -138 90 51 23 -252 -151 88 -69 -65 -104 -259 231 33 -280 -366 -54 62
7604F2r4oK42J10l24K42k39j59j7J00K8K97j2j87r4L14q1j96j03O0M4j65K55r
$$ 62 -32 -38 204 314 -10 232 -7 -166 -183 -83 -55 242 230 43 -51 263 182 -14 -117 -57 -13 -178 77 68
7628F8J33l35k0P3P2L57l71q7K61j31J26j97L9J69j43j09J9J1J0N9M4o6M14m41
$$ 68 201 -134 -154 -81 -9 348 -23 -110 151 20 146 -51 -12 157 14 -95 -76 -65 -55 4 48 -18 396 -45
7652d5P4j54m9L1J35J52K5l82Q9k2K4K67l1j46J62l87N1K95j54J51J85l66J59
$$ -45 29 -125 -174 -143 -8 144 169 -213 -124 -146 -122 145 114 -32 130 -257 -206 89 -65 86 271 -95 64
7675F4KK10l3Mj49l48L59k99N3j74L10l30M28l35K18L9q0J02K0M9j73K80j86J3
$$ 64 66 276 243 247 98 -250 109 -190 -137 -311 -1 -331 97 -238 -20 19 -61 41 61 110 -63 217 31 44
7699D4L0j24L08l28%O0J58j62P6m7l02J77K21ok11j55J83NQ5M0j69Jk7R6L5Q3
$$ 44 74 -50 258 -70 -70 -10 148 -14 62 15 -287 -110 111 105 -106 -261 -78 -73 12 52 -117 -116 -143 -47 -12 71
7725G1j11k79M65k36J01K84m39K62O7m89K79o8j01J60J08L9n2j41J83q1k2J1l25
$$ 71 -40 -319 146 -90 11 295 -144 118 185 -304 -25 -93 -194 -34 74 113 61 -80 103 22 0 11 -314
7748c14K92l5J03K15m11J90p5o7L36N9k22r7RK41j76M9o3j36M4J21J04l6k45J77
$$ -314 -22 -57 46 261 -150 40 -35 -102 234 293 71 -26 -17 224 48 97 34 -102 -58 63 167 131 -114 63
7772F3j03K33k88J56r7P9k01K89k6l41L11K3j37P5J11k27j33K79qj8J23l54L14
$$ 63 -40 193 -95 61 -36 43 -158 131 105 -236 75 98 -39 36 147 -80 -213 66 58 40 163 -191 123
7795A23n3k45J7K20PK2j97r9N2J40K41m46J79L54k40l4J10k97J20M3J55j21j46
$$ 123 70 -175 -158 62 69 91 -106 -205 -153 -13 228 -218 -39 315 75 41 151 -146 -26 17 172 51 -95
7818i5q4N1M2j43K85M8k41K50P8k65n5M13m98J46o6L04k39j2N9N6J13k74M8j8
$$ -95 -179 -128 -86 -229 56 104 -137 113 191 -74 -129 284 -214 -68 -134 170 -69 -81 -22 34 147 -127 -79 -97
7842i7J9J10J64j95k9q2kJ93q5O6O0K9p7Q9k11J12J51Q2m33J53J91k50O3k64O42
$$ -97 -78 32 196 1 -28 -110 -112 81 -4 62 122 151 74 163 -48 64 215 297 -136 17 208 -42 21 -243 399
7867C99l36J50l18Qk27L80J77j56O0rJ88j88J23j67o6j68P5J55Oj67P0j74L5L49
$$ 399 63 213 -105 -97 -324 56 233 77 137 128 316 128 251 84 18 -150 -75 80 86 -81 -11 -185 -150 199
7891A99j12j4J9J2j16j03n0J74l25K34r9K48Q8j4k43Q2P3l57L88R0l64J55N2J49
$$ 199 87 73 92 104 -12 -115 -165 9 -316 -82 -181 67 155 141 -102 -20 53 -304 84 174 -190 -35 17 166
7915A66j27J9j61K12p5j22P8o3K40k09J44Ok03J41j41J66J63j7k98OJ99k52J67
$$ 166 39 58 -103 109 34 -88 -10 -73 167 -42 102 108 -95 46 -95 71 234 217 -81 -75 124 -128 39
7938C9j58K73l55L95l63L43l90K08R0k78K38j63J98J18k37jJ20j24J05k13M9J81
$$ 39 -119 154 -201 194 -169 174 -216 -8 82 -196 42 -121 77 195 -42 -43 77 -47 58 -155 -106 75
7960G5k87K45O0j16J16k65o7L2L31p6N9q8l44K66J45j3j9n1l9L7Q5j2j13K48j09
$$ 75 -212 33 93 -23 93 -172 -239 -207 124 48 107 19 -325 -59 86 73 54 3 -36 1 86 74 -39 209 100
7985A00J88k29p2K3L4M0%j60J5M3J78l00J24J31k2j89J40j22Q4j56j2L85j7J27
$$ 100 288 59 -13 10 44 84 84 -76 -61 -18 160 -140 -16 115 93 -96 44 -78 6 -150 -162 223 206 333
8009C33l41L9l19K64J00j77N9J0j81K10k20M35m41J15L49j25k87L21n1k49j05
$$ 333 -8 31 -288 -24 76 -101 -42 -32 -213 -3 -223 212 -229 -114 235 110 -177 144 93 -156 -261
8030b61L8L47J9k20K9N5J67r7L13j58m91K31n5j45K37Q0o4m4p2j71M22P7l40k4
$$ -261 -223 124 143 -77 -48 7 174 77 390 232 -259 -28 -83 -228 9 89 25 -19 -91 -262 160 237 -103 -127
8054a27J96j0j05J55l61L86j31N4l49n5J10K56J62k25l2mj18K18jm0N7l9r9J02
$$ -127 69 59 -46 109 -252 134 3 57 -292 -347 -237 19 181 -44 -76 -80 -198 20 19 -21 36 -3 -102 0
8078@p1Q7O2j51Q0l73L77j40J33K44m73K76j78m4K34j11j64J62Q2J57k69J84k47
$$ 0 -71 16 78 -73 7 -366 11 -129 4 248 -225 51 -127 -171 63 -48 -212 -50 32 189 -80 104 -143
8101a43K43K7k42L33l51N0l0L40k73M1r2q6p4J35K39k94J71l3M8k1O6j34Q8j78
$$ -143 100 127 -115 218 -133 -83 -113 227 -46 -5 -97 -183 -257 -122 117 -177 -6 -39 9 -12 54 -80 8 -170
8125a70J65J75k15K9J0j28p1K97l37L28j09O4J14k34J56q8J36k88J67P7r4j34
$$ -170 -5 170 -45 -16 -6 -134 -205 92 -245 83 -26 38 152 -82 74 -14 122 -166 1 78 -16 -150
8147a50J47R7r8q7K24k43K04j58k30L70n1J3K16l61M58m81Q4K54K1j85j65K00
$$ -150 -3 94 -4 -91 133 -110 94 -64 -294 76 25 38 254 -107 351 -130 -46 208 229 44 -121 79
8169G9j45J29l1j03k8J14J2J31l23J21lj03P4K43j67pp4K12l23J63l5l2
$$ 79 -66 63 32 -71 -99 15 27 158 -165 -44 -47 -150 -76 167 0 -7 -81 131 -192 -29 -64 -96
8191i6
$$ Imaginary data points
##PAGE= N=2
##DATA TABLE= (X++(I..I)), XYDATA
0@%%%%%%%%%%%%%qJ6j6J6k0K8l2M0m8N6o5P3q8J04j20J39j63J85k09K40k72L08
$$ 0 0 0 0 0 0 0 0 0 0 0 0 0 0 -8 8 -8 8 -12 16 -16 24 -24 32 -33 40 -48 56 -64 75 -88 97 -112 128 -144 164
35A64l47L88m35M89n46O07o77P52q34R23j020J127j242J368j507J661j831K018
$$ 164 -183 205 -230 259 -287 320 -357 395 -439 484 -536 591 -651 717 -790 871 -960 1058
53A058k224K455k714L009l348L735m190M733n391O207p252Q651j0625J3639j8869
$$ 1058 -1166 1289 -1425 1584 -1764 1971 -2219 2514 -2877 3330 -3922 4729 -5896 7743 -11126
68a1126L0496j05271M5099J54730j20543m7135O1915N1385o7698n234K8420o490
$$ -11126 19370 -85901 -40802 113928 -6615 -53750 8165 59550 -8148 -13382 15038 8548
80H548k470K1198j7700k7273J816J3554j101J0426q274k644n452K015m758l34
$$ 8548 6078 27276 9576 -17697 -15881 -2327 -3428 6998 -1276 -3920 -9372 -7357 -12115 -12449
94a2449L2860j0298k9212K3031K2909k3093m7619L7938N7811k9768l8772J4902
$$ -12449 20411 10113 -19099 3932 26841 3748 -43871 -5933 51878 22110 -16662 -1760
106a760J2323k8009J151K5775j4174m574L0291l868o0423K459O4751N196k8639
$$ -1760 10563 -17446 -16295 9480 -4694 -9268 21023 17155 -43268 -40809 23942 29138 499
119D99p216J8824L91k2055K615P102J1568n772j7535J3149J725k1134l625L3020
$$ 499 -6717 12107 12498 -9557 -6942 160 11728 5956 -11579 1570 3295 -17839 -21464 11556
133A1556J4422k4739o166O109k647m229N737k932q397K2939O062k2605j4803J0010
$$ 11556 25978 1239 -4927 1182 -1465 -5694 43 -2889 -11286 11653 17715 -4890 -19693 -9683
147i683K2614n123q137j528j634L721p844O264J6130O273j0430j5606j160o421
$$ -9683 12931 7808 -329 -1857 -3491 230 -7614 -1350 14780 21053 10623 -4983 -6143 -12564
161a2564n926P330J5633K856j1862N611j73j0291P780J9441j569k6355J3354K0314
$$ -12564 -18490 -11160 4473 7329 -4533 1078 905 -9386 -1606 17835 16266 -10089 3265 23579
175B3579k8001j8483K3444J8513k4255p799J8698r507j1386J1084O838q128R098
$$ 23579 -4422 -22905 539 19052 -5203 -13002 5696 -3811 -15197 -4113 2725 -5403 3695
188C695J3981k0571j3606J3585J2667j751j883L775p300Q53l700j5240Q992J9297
$$ 3695 17676 -2895 -16501 -2916 9751 8000 6117 9892 2592 3445 -255 -15495 -6503 12794
202A2794k530k3572J616J6275j5170r340K0800J6515j5347j0241J5483J729q734
$$ 12794 10264 -13308 -11692 4583 -10587 -19927 873 17388 2041 -8200 7283 9012 278
215B78M870Q783j0501q923J3924o909k2649M432K2944J915j7275O986R845r157
$$ 278 5148 13931 3430 -5493 8431 1522 -21127 -16695 6249 8164 -9111 -2125 7720 -1437
229a437p747J837J1442O020j196q812m094Q445l952n607P972P554r381r151O427
$$ -1437 -9184 -7347 4095 10115 8919 107 -3987 4458 506 -5101 2871 10425 1044 -8107 -1680
244a680l433l802J2253P281q305q693P809l231j1628R622J4980r99j6317j1J4014
$$ -1680 -5113 -8915 3338 10619 2314 -6379 1430 -1801 -13429 -3807 11173 10174 -6143 -6154 7860
259G860j272j0428m021J2143P058o176p891m158K838J574K770J884l341P88j257
$$ 7860 6588 -3840 -7861 4282 11340 5164 -2727 -6885 -4047 -2473 297 2181 -1160 -372 -1629
274a629j317l657M230J1371l048p683O96O411p591j0881J4084J6114o935j5721
$$ -1629 -2946 -6603 -2373 8998 5950 -1733 -1037 5374 -2217 -13098 986 17100 10165 -5556
288e556n14P254k373j220K91J577L732k097o036n001P893O319k565p38j432K925
$$ -5556 -6070 1184 -1189 -2409 -2118 -541 3191 1094 -4942 -9943 -2050 4269 1704 966 -466 2459
304B459J910k583m873L656J2934m940j4330K90O662n269q081J1081Q975p902o316
$$ 2459 4369 1786 -3087 569 13503 8563 -5767 -5477 1185 -4084 -12165 -1084 7891 -11 -6327
319f327K847K791l194N631N601l359o2J286l986r346M873J2532k300r577m437
$$ -6327 -3480 -689 -3883 1748 7349 3990 3928 5214 1228 -8118 -3245 9287 6987 -2590 -7027
334g027M740L128m165j649M020P344m454r035K415O314o17l393O918M563o762
$$ -7027 -2287 841 -3324 -4973 -953 6391 1937 -7098 -4683 1631 1014 -2379 4539 9102 2340
349B340l114p4r72j317O530L509r068j093N567k799r058K966J2657k61q352l449
$$ 2340 -774 -848 -1820 -3137 3393 6902 -2166 -3259 2308 -491 -9549 -6583 6074 5813 -2539 -5988
365e988L615L595j326J739K714L006m407q222J020N202J692k291J661J637n012
$$ -5988 -2373 1222 -104 1635 4349 7355 2948 -5274 -4254 948 2640 349 2010 3647 -1365
380a365n27q44l189K840Q707p92j2231J676J0260k473p102M043Q932l319m617
$$ -1365 -1892 -2736 -5925 -3085 5622 4830 -7401 -5725 4535 2062 -5040 -997 7935 4616 -1
395ak02j751M98L057K775k274o44l0n571k561K574N579J161m304k320%L378o57
$$ -1 -203 -1954 -1456 1601 4376 2102 1458 1428 -4143 -6704 -4130 1449 2610 -1694 -4014 -4014 -636 -1293
413a293j566O513P741j947j1561j136P519j221p329P02O981k591n638P54K17J392
$$ -1293 -2859 3654 11395 9448 -2113 -3249 4270 3049 -4280 -3578 3403 812 -4826 -4072 -3855 -2463
429b463M433K429o514m056P993P36o210J142R104L252p923l278J440J295l521
$$ -2463 1970 4399 -2115 -6171 1822 2558 -3652 -2510 6594 9846 1923 -1355 85 1380 -2141
444b141k713O856M498o680r279K508P708j322q50K171J55o37J379J16m972M237
$$ -2141 -4854 2002 6500 -180 -9459 -6951 757 -565 -1415 756 911 274 1653 1769 -3203 1034
460A034Q366r91r229m658M408J824m441j716O043N522p056o058N562N386m307
$$ 1034 9400 8409 -820 -5478 -1070 754 -3687 -5403 640 6162 -894 -6952 -1390 3996 -311
475c11m627O175M225n411m508J948M412J09K636J267m950m342K517K935o946o05
$$ -311 -4938 1237 5462 51 -4457 -2509 1903 2012 4648 5915 965 -3377 -860 2075 -4871 -5476
491e476J0931N60j2103k668J0778J501n725K789M329j982m865k176m79L576N089
$$ -5476 5455 6015 -6088 -8756 2022 3523 -2202 587 4916 2934 -1931 -4107 -4586 -1010 4079
506D079k387n78M124j812o206O10M225k266j079K997m315l454N313L362o755j75
$$ 4079 1692 1114 5238 3426 -2780 -2170 2055 -211 -1290 1707 -2608 -6062 -749 2613 -4142 -4317
522d317J0131m6j0258k281R669L111n545J021M263k495o647j22L508j383K039
$$ -4317 5814 5768 -4490 -6771 2898 6009 464 1485 5748 3253 -3394 -3516 -8 -1391 648
537F48K300l522l355K498Q69m703K657P243j539m950q13J901J774L086o22k939
$$ 648 2948 -574 -3929 -1431 -562 -5265 -2608 4635 3096 -1854 -2667 -766 1008 4094 3472 533
553E33M585K136q658o011N457L290m157N0J812j664L65J908m21l7N813Q61p106
$$ 533 5118 7254 -1404 -7415 -1958 1332 -2825 -2775 -963 -2627 -2262 -354 -775 -812 5001 5862 -1244
570a244k355L933K851l276j479N592L031o318p200L130N915k102k930O92O76j820
$$ -1244 -3599 334 3185 -91 -1570 4022 7053 735 -6465 -3335 2580 478 -2452 -1760 -1084 -2904
586b904k5J087K82L896L745j719n162j285L363P12k982k41M879J731p811l541
$$ -2904 -2929 -1842 -1560 2336 6081 4362 -800 -2085 1278 1990 -992 -1233 3646 5377 -2434 -5975
602e975N029K231l597J24L747j211j947m64k8K778L307j322l757Q48R31k184J311
$$ -5975 -946 1285 -2312 -2188 1559 348 -1599 -2063 -2091 687 3994 2672 -1085 -237 694 -1490 -179
619a79K152l70J877J520p051o321Q131N385q619k323Q951L76r629J657P697j309
$$ -179 1973 1603 3480 5000 -2051 -8372 -241 5144 -3475 -5798 3153 3529 -6100 -4443 3254 1945
635A945k758L672J811n272j797K284n6K3L423J223n051l178L258J342k776o09
$$ 1945 -813 2859 4670 -602 -2399 -115 -171 -148 3275 4498 -553 -3731 -473 869 -1907 -2516
651b516K570P59j416k751j889M605O287k500n298M324M014q685l547R238K430
$$ -2516 54 813 -603 -3354 -5243 -638 5649 3149 -2149 2175 6189 -2496 -6043 3195 5625
666E625o606M25L350n280k358N736n67m593M734L461p456l275P182K854k930L87
$$ 5625 -981 -556 2794 -2486 -4844 892 325 -4268 466 3927 -3529 -6804 378 3232 302 689
682F89L033O7l278k579n83M127K864l651k630J657N81k394j227K036J754N10q33
$$ 689 3722 3789 511 -2068 -2651 1476 4340 689 -1941 -284 297 -2097 -3324 -1288 466 976 143
699A43k141j361K525L785j190j614K549J654m366m711M372M718k779l191J564
$$ 143 -1998 -3359 -834 2951 1761 147 2696 4350 -16 -4727 -355 4363 1584 -1607 -43
714d3J129l108j528J002K386K147j165k984O7J787q6Q3J935L65K78R00l921l213
$$ -43 1086 -2022 -3550 -2548 -162 1985 820 -2164 -2097 -310 -396 -313 1622 1987 2265 3165 -756 -3969
732c969M728M695n831k963N310J39o588k07N284M39j377J243j891k020K704J674
$$ -3969 759 5454 -377 -3340 1970 2109 -4479 -4686 598 1037 -340 903 -988 -3008 -304 1370
748A370k099J531L644j355l612m29J050O07L10l01j552Q67M04l799k107N216L899
$$ 1370 -729 802 4446 3091 -521 -950 100 707 1017 716 -836 31 435 -3364 -5471 -255 3644
765C644m449l121M371K293m602q58N130J813k443J32m23l795J087M030j769l737
$$ 3644 -805 -3926 445 2738 -1864 -2722 2408 4221 1778 1910 1487 -2308 -1221 2809 1040 -2697
781b697L416J406n678j624M322K248k323O68J108q87K80q90m99L203K871k843
$$ -2697 719 2125 -3553 -5177 -855 1393 -930 -262 846 -41 239 -651 -1150 2053 4924 2081
797B081l899K018J358k494l42J718K87r55j22k561k174M103L764j926l057K622
$$ 2081 -1818 200 1558 -936 -1278 440 727 -228 -350 -2911 -5085 -982 2782 856 -2201 421
813D21K916l482k664K545M011q90k950j44N04k00o63J37Q63O57q23k532q82J659
$$ 421 3337 -145 -2809 -264 3747 2857 -93 -237 267 67 -596 -459 404 1061 238 -2294 -3176 -1517
831a517J407K41m19M08J620J9l027j774M276L815l553l904K664J929l510j298
$$ -1517 -110 131 -288 120 1740 1759 -1268 -3042 1234 5049 1496 -2408 256 2185 -1325 -2623
847b623L046J378j313p34o62j382N46J727J35j51L25M06j345j016J673J915J182
$$ -2623 423 1801 488 -246 -908 -2290 -1744 -17 118 -33 292 698 -647 -1663 10 1925 3107
864C107k037j213J241M10k847j740L855K445l493l170J700J688j914l82K916Q65
$$ 3107 1070 -143 1098 1508 -1339 -3079 776 3221 -272 -3442 -1742 -54 -1968 -2350 566 1431
880A431n16m42k16j454J293K760q67j920M37J760k277k556K236K571j029l005
$$ 1431 915 473 257 -1197 96 2856 1989 69 506 2266 -11 -2567 -331 2240 1211 -1794
896a794r90J773Pj717j38L691K609k139k284J117K044m99r27Q60p48p51k38j254
$$ -1794 -2784 -1011 -1004 -2721 -2859 832 3441 1302 -982 135 2179 1680 753 1613 865 114 -124 -1378
914a378j600J784L562j308l569Q02K295j716k469K765L160k09k120n73J270R95
$$ -1378 -2978 -1194 2368 1060 -2509 -1707 588 -1128 -3597 -832 2328 2119 -1 -574 696 1691
930A691k22r41P17J573j902l150j51J224N46K46L45j489M03J568j168j641K542
$$ 1691 1469 528 1245 2818 916 -2234 -2385 -1161 -615 -369 -24 -1513 -1110 458 -710 -2351 191
947A91L852k269l136J016K041r73j464J310J182q22j427j379L59J315J631j160
$$ 191 4043 1774 -1362 -346 1695 722 -742 568 1750 928 -499 -1878 -1519 -204 1427 267
963B67j416Q38J005k377j753K373K744J17j075n95N77Q88o14j957J106K769k098
$$ 267 -1149 -311 694 -1683 -3436 -1063 1681 1798 723 128 705 1593 979 -978 128 2897 799
980G99l806J102K605j186r72K189O78k078K29m5j938J114L334j075k402J511K313
$$ 799 -3007 -1905 700 -486 -1458 731 1409 -669 -440 -485 -2423 -1309 2025 950 -1452 59 2372
997B372j645j448J563J915m80k461j869M95J327m28r58J158R58l11j562j29R25
$$ 2372 727 -721 842 2757 2277 -184 -2053 -1558 -231 -659 -1617 -459 499 188 -1374 -1503 -578
1014e78J282K49O55q52l50J87m53o98R44K132l54l870J4K509r92k477J162K900
$$ -578 704 953 1608 756 406 593 140 -558 386 2518 2164 -1706 -1692 817 -175 -2652 -1490 1410
1032A410o85k542l02J053J553J10p3m0J232K70j942L72J28L19M94p16k636l01
$$ 1410 725 -1817 -2119 -1066 487 597 524 484 1716 1986 44 416 544 863 1357 641 -1995 -2296
1050b296K082q42j969K598K973j978k554J347J114m98J23M55P54N45r31j818O83
$$ -2296 -214 -1056 -3025 -427 2546 568 -1986 -639 475 -23 100 555 1309 1854 923 -895 -212
1067b12J895k41j347l86m94m28K34m72l95J618J781j385k245J037K459q2j831
$$ -212 1683 1442 95 -291 -785 -1213 -979 -1451 -1846 -228 1553 168 -2077 -1040 1419 1337 -494
1084d94Q08K169n77l192L21K161k21j219N16L1j137n15K92j302J191K651p70k695
$$ -494 314 2483 1906 -1286 -965 1196 975 -244 272 303 -834 -1349 -1057 -2359 -1168 1483 713 -1982
1102a982J101J658r56j32Q59Q50L53q75j627l0J962J85k054L40J020q10j978k8
$$ -1982 -881 777 -179 -311 548 1398 1751 876 -751 -781 1181 1366 -688 -348 672 -138 -2116 -2144
1120b144J451P53K72m58j46L85J81l3k62N67J522n4k177j160J986J180k421m44
$$ -2144 -693 60 332 -126 -272 113 294 261 -1 566 2088 2034 -143 -1303 683 1863 -558 -1002
1138a002K337n21k689m28J124M50O63N52r98J90J305q42r98J414J370k10q57j092
$$ -1002 1335 814 -1875 -2303 -1179 -729 -66 486 -512 -322 983 141 -857 557 1927 1717 860 -232
1156b32j31R37j22j109R5J484o89k287k10J613Q76m89j52N24R75r00j095P12J568
$$ -232 -363 574 452 -657 -562 922 233 -2054 -2264 -651 225 -264 -416 108 1083 183 -912 -200 1368
1175A368J97p39j72q58J63N88p43q35J474J125k251k132J543J588o89n21P25J169
$$ 1368 1565 826 654 -204 -41 547 -196 -1031 443 1568 -683 -2815 -1272 316 -373 -894 -169 1000
1193A000l04j055n4J217J003p38p83K22n47l07J92o51L57J311n91k097P4J628
$$ 1000 696 -359 -413 804 1807 1069 286 508 -39 -346 -154 -805 -448 863 272 -1825 -1751 -123
1211a23j88q61J053Q29J43m34j335l30K480J408k500q53K317n54k024%R00o1L01
$$ -123 -311 -1172 -119 710 853 419 -916 -1246 1234 2642 142 -711 1606 1052 -972 -972 -72 -133 168
1230A68l6j382p11J617M25j241M72K182j38j977m05J786Q83q73p13J601o71j106
$$ 168 132 -1250 -1961 -344 81 -1160 -688 1494 1356 -621 -1026 760 1643 770 57 1658 987 -119
1248a19j059M22Q13K54o99j144J40R76m56m85J129J134K6r1q62q00J350J230j358
$$ -119 -1178 -756 57 311 -388 -1532 -1392 -416 -872 -1357 -228 906 932 841 -21 -821 529 1759 401
1267D01r04J782J63k854n02K351J0r86l16M75l49j48L32m21J400J139p50j002
$$ 401 -503 1279 1442 -1412 -1914 437 447 -539 -855 -380 -729 -877 -545 -966 434 1573 823 -179
1285a79J86Q22J63l21n30M01Q39j359j765K64J988Qj556L57P58K22j533j46J470
$$ -179 7 829 992 671 141 542 1381 22 -1743 -1479 509 517 -1039 -682 76 298 -1235 -1381 89
1304H9J210l23q17m12K66P64n7l89K8Q88j42j881n13R84M62n42m95k37J222j00
$$ 89 1299 976 159 -253 13 777 720 331 359 1247 1105 -776 -1289 -305 157 -385 -880 -1117 105 5
1324Ej295MK064J218j894m31J307p6j299M53N63%J86q3j833k18J949j60j786M93
$$ 5 -1290 -1286 778 1996 102 -329 978 902 -397 56 619 619 805 722 -1111 -1329 620 460 -1326 -833
1344h33J596q90j298J37J158O58L75l29l64M70L41j069k12Q86R97j283j113M55
$$ -833 763 -127 -1425 -1288 -130 528 903 574 210 680 1021 -48 -260 626 1623 340 -773 -318
1362c18l33l9K57M02m4K17k59q94j75J564O88j175l23J477J52j804K09J407K48
$$ -318 -651 -690 -433 -31 -75 142 -117 -1011 -1186 378 1066 -109 -432 1045 1197 -607 -398 1009 1257
1381A257l68o37o70m64L22j76m48L33J215k89j286L93J136L25L71j49m79P02m70
$$ 1257 889 252 -418 -882 -560 -736 -1184 -851 364 75 -1211 -818 318 643 1014 865 386 1088 618
1400F18j491J06J517M58j426l24P06q7r09J37L61j12M62r11l26N20J068M62n47
$$ 618 -873 -767 750 1208 -218 -542 164 77 -832 -695 -334 -446 16 -895 -1221 -701 367 829 282
1419B82J85J086l06j238l27N67P03j72j120m33N42m7r89P2J353O04j017k84M48
$$ 282 467 1553 1247 9 -318 249 952 780 -340 -773 -231 -278 -1267 -1195 158 762 -255 -539 -91
1438i1o6J02J74O26N0j46j53r40j64J217N09j026p19N93K16j171m50P77J057m06
$$ -91 -157 -55 119 745 795 649 496 -444 -608 609 1118 92 -627 -34 182 -989 -1439 -662 395 -11
1458a1n73l4N56N94m24P6P59M54o75j088K23K97J20K70m42l37L80l43r51k71J470
$$ -11 -584 -618 -62 532 108 184 943 1397 722 -366 -143 154 274 544 102 -235 145 -198 -1149 -1420 50
1479E0N99r79o49Q41O63p86j34J024P54l19o25n51L12M93o29k98l2P28p27n30
$$ 50 649 -330 -979 -138 525 -261 -395 629 1383 1064 439 -112 200 693 64 -234 -266 462 -265 -795
1499g95l89M17J284l82j84q9M05N3o91J40J124N25p14j023P95j85q3n96L28L56
$$ -795 -1184 -767 517 135 -49 -138 267 320 -371 -231 893 1418 704 -319 476 291 208 -388 -60 296
1519B96j69p22n44K26Q65P6l40n6N27J48n80L26M26O88j68k46q09K30M86j011
$$ 296 127 -595 -1139 -913 -48 28 -312 -368 159 307 -273 53 479 1167 999 753 -56 174 660 -351
1539c51m59J118M24j281n06J05N42J24K83j08K03M42k39q44K24J262N33q73p79
$$ -351 -810 308 732 -549 -1055 -950 -408 -284 -1 -109 94 536 297 -547 -323 939 1472 599 -180
1558a80P48N4q46m64K95N15nq35l46L60N43J07l49J70J079k35r54J20R82O9Q7
$$ -180 568 622 -224 -688 -393 122 117 -718 -1064 -704 -161 -54 -403 -233 846 611 -343 -223 759 828 915
1579I15l90l44l5J79m08j050J156Q08j343m90N57L21m51l5O55K19K01m64l79N16
$$ 915 525 181 146 325 -83 -1133 23 831 -512 -1002 -445 -124 -575 -610 45 264 465 1 -378 138
1599A38N26O6o68N8N59k59p37j61j02N82J84o90l77L05M24l69N4N82O14m72k67
$$ 138 664 730 62 120 679 420 -317 -478 -580 2 186 -504 -881 -576 -152 -521 -467 115 729 257 -10
1620a0j89R61m28J1k91N84m9o83n39J43M72K96o26n06N00L03p13J4K52Q57K57
$$ -10 -199 762 334 345 54 638 589 -94 -633 -490 -18 278 -348 -854 -354 -51 -764 -750 -498 359 616
1641F16k46o96N77P41n90p16P80M60q71n79J67J22j7L07m38k86O80L4m51l0J176
$$ 616 370 -326 251 992 402 -314 466 926 55 -524 -357 -235 -252 55 -383 -669 11 45 -406 -436 740
1662G40M3n45km9L58j03k56j29L99M91j003p89N74L73l46l86J95N24m34l73L47
$$ 740 783 238 236 187 545 442 186 57 456 947 -56 -845 -271 102 -244 -630 -435 89 -345 -718 -371
1683c71P02l1J42M9n67K80M44m42l39K84R98p68r19L43K43l05k96O3J73L61l90
$$ -371 331 300 442 491 -76 204 648 206 -133 151 1149 381 -538 -195 48 -257 -553 -490 -317 44 -346
1704c46j85Q3J025L1m41%M91j51m39pJ74K43J57o41q12M87L92m05k06K45Q45n79
$$ -346 -531 -448 577 608 167 167 658 507 68 61 235 478 635 -6 -818 -331 61 -344 -550 -305 540 -39
1726c9q38K40M75P16k88k38P32k18n79k58M67K27J68j24r69j67P92j88p80P32
$$ -39 -877 -637 -162 554 266 28 760 542 -37 -295 172 399 567 443 -526 -693 99 -89 -869 -137
1746a37K31j08l68k81N73L83k04l4J57L06k14k40k68N75L40m75n03o1K34r2o83
$$ -137 94 -14 -382 -663 -90 293 89 55 212 518 304 64 -204 371 711 236 -267 -328 -94 -186 -869
1767h69L16N75R2j78m04J05K05O57k45l12N97N88j005o36P46J46k41J7k16k21
$$ -869 -553 22 114 -64 -468 -363 -158 499 254 -58 539 1127 122 -514 232 378 137 154 -62 -283
1787b83J92j39m40k04J074Q3n76k24M81K90l00k3N26N58n7r90l44P88l3o00lK06
$$ -283 -91 -230 -670 -874 200 283 -293 -517 -36 254 -46 -69 457 1015 958 -32 -376 412 379 -221 -224 -18
1809a8j86k10l97K29N45N12p40j68O07O8o4j97K52K60K48p56n51O32K99j11o14
$$ -18 -204 -414 -811 -582 -37 475 -265 -433 174 242 178 -19 233 493 741 -15 -566 66 365 254 -360
1830c60J82N29n90m46mM48K80J42p20N38rj5K97o30O88K29J65r57j58N92j82k38
$$ -360 -178 351 -239 -685 -689 -241 39 181 -539 -1 -10 -25 272 -358 330 559 724 -233 -391 201 19 -219
1852b19K11N2j37j62j25l01N44L24j73j95M15K34p33l7P64K95q0k28k83j99R9
$$ -219 -8 44 -93 -255 -380 -681 -137 187 14 -181 234 468 -265 -302 462 757 677 449 166 -33 66
1873F6K95n82q2N78n37m51J95N37j92J27k46J63L60k97r2m1P71j24l47L3J4K11
$$ 66 361 -221 -303 275 -262 -713 -518 19 -173 -46 -292 -129 231 -66 -158 -199 572 448 101 134 148 359
1895C59l64k36K22K84j76n10m17pO42k21K99J6M02J35m92k77J029k26J52k51k71
$$ 359 -5 -241 -19 265 89 -421 -838 -845 -203 -424 -125 -109 293 428 -64 -341 688 462 614 363 92
1916I2L09k98j42l32L75M32n59m54K82j5n4P6J26J03L17n5n60J07O59J59l34R2
$$ 92 401 103 -39 -371 4 436 -123 -577 -295 -310 -364 -288 -162 -59 258 203 -357 -250 409 568 234 326
1938C26L69n89k18j09RJ17M9k61k94M6M91j67J88J20M59k08n02J52K48K99j80
$$ 326 695 106 -112 -221 -212 -95 -46 -307 -601 -555 -64 -231 -43 77 536 328 -174 -22 226 525 345
1959C45%K19j2n51k69l33M48R8j04l97K80L5k25L02l1M00L39m22k60m1O67K01
$$ 345 345 564 552 1 -268 -601 -153 -55 -159 -556 -276 -241 -466 -164 -195 205 544 122 -138 -179 488 689
1981F89p41K04L17j45o70j49N65k03K31o27K61J69J91n66J63J59N65j96l13J24
$$ 689 -52 152 469 324 -346 -495 70 -133 98 -529 -268 -99 92 -474 -311 -152 413 217 -96 28
2001B8J87K92k75J08r8J59o40P0k4L20O3q25M19K18m09Q3M8K53L98p6k24k2M43
$$ 28 215 507 232 340 242 401 -239 -169 -193 127 190 -635 -216 2 -407 -324 -276 -23 375 299 75 53 496
2024D96L1m15q1L35K89o78j41l24L38J44o4m34K79K96K0o21M15N62J55l69m41
$$ 496 527 112 31 366 655 -23 -164 -488 -150 -6 -70 -504 -225 71 91 -530 -115 447 602 233 -208
2045b08L32J94j50k88M15q6o3m22j45L23R5p6n70M11J96k48k13o6P47Q4J25l49
$$ -208 124 318 168 -120 295 209 146 -276 -421 -98 -3 -79 -649 -238 -42 -290 -503 -569 178 262 387 38
2067C8J8M47L2m36l1J47K52l72k17j12K07j45j07K36j30J47j83j12J82K51J32
$$ 38 56 503 535 99 68 215 467 95 -122 -234 -27 -172 -279 -43 -173 -26 -209 -321 -139 112 244
2088B44k7p3J1kl5l22L22L13j63k79N4j18J98m84k51O62p8j24p8j70N35Lm6K10
$$ 244 217 144 155 153 118 -204 118 431 268 -11 43 -75 123 -361 -612 50 -28 -152 -230 -400 135 138 92 302
2112C02k2j18K7m41O5L21K00m81j57K72j02j25j45P9L62Q5o8l59O9O26m00j40
$$ 302 280 162 189 -252 -187 134 334 -147 -304 -32 -134 -259 -404 -325 37 122 54 -305 -236 390 -10 -150
2134a50L96J22m46Q2Q4J35p2J98m68j98J79m7n69M02N20l2j09l24J02N84l08j32
$$ -150 246 368 -78 4 88 223 151 349 -119 -317 -138 -185 -754 -352 168 136 27 -297 -195 389 81 -51
2156e1M6J70L65k67k24j00K78j86k0j77p9L16p51J69N80j70p4m0j90M68L95k47
$$ -51 -5 165 530 263 39 -61 217 31 11 -166 -245 71 -680 -511 69 -101 -175 -215 -405 63 458 211
2178B11k53L08M69l97p53P40k90j1J98l57q7L32k89j55l09P11r4O7q1j03L30l17
$$ 211 -42 266 735 338 -415 325 35 24 222 -135 -222 110 -179 -334 -643 68 -26 41 -40 -143 187 -130
2200a30J38l04O79K47m53k09L01j13k99j8J27j43QQl54K65K07P1k39Q1L17q8j78
$$ -130 8 -296 383 630 177 -32 269 156 -143 -161 -34 -177 -169 -161 -515 -250 -43 28 -211 -130 187 99 -79
2223g9J45J61m0P1k27J55k04O5j6k85K34n3q5m30K69M00m70J41J57K68j41j9j00
$$ -79 66 227 187 258 31 186 -18 47 31 -254 -20 -73 -158 -588 -319 81 -389 -248 -91 177 36 17 -83
2246h3L21L77j82l73l95P77k32m00KJ71k99L8k0JK28R5k15n9M05N5M1n51O42l0
$$ -83 238 615 433 60 -335 442 210 -190 -188 -17 -316 -278 -298 -297 -69 26 -189 -248 157 212 253 -298 344 314
2270C14j59k10J20L67o8k94k92K7M12j74m18j55M01J16j64M0J12K29K45m91J55
$$ 314 155 -55 65 432 364 70 -222 -195 217 43 -375 -530 -129 -13 -177 -137 -25 204 449 -42 113
2291A13J40NJ58n27K57K13m62j92P5J93J07j20j85l17N17j19o1M6L65n0r1K2Q6
$$ 113 253 258 416 -111 146 359 -103 -295 -220 -27 80 -40 -225 -542 -25 -144 -205 -159 206 156 65 87 173
2314A73J04p4O8K9l5k39j90QL0K45l37J69j81j59M9J82J43J20K33j05n20K79N76
$$ 173 277 203 271 300 265 26 -164 -156 -126 119 -218 -49 -230 -389 -340 -158 -15 105 338 233 -287 -8 568
2337E68J10p64MK40j87k55L7J91j6J51m70J6j83N88k98q0K71L44j1k02J56j0K4
$$ 568 678 -86 -82 158 -29 -284 -247 -56 -72 79 -391 -375 -558 30 -268 -348 -77 267 256 54 210 200 224
2360B24R5m11K15K25j60n55L04qK69l18R9J09j36j9j22L1J89K17l14n6O1J22L2
$$ 224 319 -92 123 348 188 -367 -63 -71 198 -120 -21 88 -48 -67 -189 -158 31 248 -66 -122 -61 61 93
2383I3r6mM60l08k4j35j60L24m09j54M24j33j4J82l76K10O23l56p9l7N0O0l9J5
$$ 93 -3 -7 453 145 121 -14 -174 150 -259 -413 11 -122 -136 46 -330 -120 503 147 68 31 81 141 102 117
2407A17j1K39k14l92R1K63k16j0J64J08m7k3m44J88K10L82m09j12J65L31l87j8
$$ 117 106 345 131 -261 -170 93 -123 -133 31 139 92 69 -375 -187 23 405 -4 -116 49 380 -7 -25
2429b5J64J42k94nr0J30k49K5j34j6J90J81k40P4L17P0k35P4K00J24j99j22J34
$$ -25 139 281 -13 -18 -108 22 -227 -202 -336 -352 -162 19 -221 -147 170 240 5 79 279 403 204 82 216
2452B16r1K8k35J52j00R0k25J93J53j07n6j10R4J82n2m9N3r4p5K0j0j33K93K1
$$ 216 125 153 -82 70 -30 60 -165 28 181 74 18 -92 2 184 132 83 136 42 -33 -13 -23 -156 137 158
2476A58l10J9q1k4J95j80%L25k42K66l79K50J39j95L4K37m6k36J92k20o8jL87
$$ 158 -152 -133 -214 -238 -43 -223 -223 102 -140 126 -253 -3 136 -59 -25 212 166 -70 122 -98 -166 -167 220
2499B20k47j13r6J84j98J37j69K01J01j57N4J4K37k52R0J45J88k2j61j42O5K68
$$ 220 -27 -140 -236 -52 -250 -113 -282 -81 20 -137 -83 -69 168 -84 6 151 339 317 156 14 79 347
2521C47n00K4j48J41p9k76K17K12J14l39L68j80J64l5k01L36p6J93j77j30Q9k03
$$ 347 -153 -129 -277 -136 -215 -491 -274 -62 52 -287 81 -99 65 30 -171 165 89 282 105 -25 64 -139
2543a39L02l9rQ1k04l66J46Q7O9j56J73o5J86Q3j39J46rK27j14m65K67J91m45
$$ -139 163 124 115 196 -8 -374 -228 -141 -72 -228 -55 -120 66 149 10 156 147 374 260 -205 62 253 -192
2566a92L98j71n0N7k98j74J37K44J5LL3J96j40j67J56r8L55j52l5K0J41%o41K56
$$ -192 206 35 -15 42 -256 -430 -293 -49 -34 -31 2 198 58 -109 47 -51 304 152 117 137 278 278 -363 -107
2590a07M6K53k31m66J72K81k13L01j32k45M09j39J44l6L41J5n64K59j17N79n32
$$ -107 -61 192 -39 -505 -333 -52 -265 36 -96 -341 68 -71 73 37 378 393 -171 88 -29 550 18
2611A8k76K68j47k0K95l36M9J81j77m4kK86k16J54L8kj34J67k1j13K97j74l11
$$ 18 -258 10 -137 -157 138 -198 -149 32 -145 -189 -191 95 -121 33 71 69 -65 102 81 -32 265 91 -220
2634b20J31J03j5r8r4j62J76K18m25L02L16k80j74K71M8J5J18l95K43O4J41l55
$$ -220 -89 14 -1 -99 -193 -355 -179 39 -386 -84 232 -48 -222 49 97 112 230 -165 78 142 283 -72
2656g2j66K38m9J37j74k08n5J77Q6j49K85J25J0l15J83O06p04J95r4K5j57L0k06
$$ -72 -238 0 -49 88 -86 -294 -349 -172 -86 -235 50 175 185 -130 53 659 -45 150 56 81 -76 -46 -252
2679b52J44N4q5R7k04J20n9L53n52M88j1m9Pr4K03p0j00M8n8P1j23k16J22J84
$$ -252 -108 -54 -139 -42 -246 -126 -185 168 -384 104 93 44 51 -43 160 90 -10 38 -20 51 -72 -288 -166 18
2703A8l3k9j31K5P2q0r2K12P7P9J71l76K52J39l92k8K49j48K10Pp32J60L50k75
$$ 18 -15 -44 -175 -150 -78 -158 -250 -38 39 118 289 -87 165 304 -88 -116 133 -15 195 202 -530 -370 -20 -295
2727b95K21K35j19M6Jk78J14o3K13k24J09K87k30K06k16mK93k88K66j77j95k2
$$ -295 -74 161 42 88 89 -189 -75 -138 75 -149 -40 247 17 223 7 3 296 8 274 97 -98 -120
2749a20LL6K33n8j36J17j52N29k41l32j3J7K50j72J42k63Q1L21l57J10O6j35M0
$$ -120 -117 -81 152 94 -42 75 -77 452 211 -121 -134 -117 133 -39 103 -160 -79 242 -115 -5 61 -74 -34
2772c4k63M7P7J39R6q3j75O89k61p2j93J49j7k91K59J57p8O1n8l97K17j0l40L36
$$ -34 -297 -250 -173 -34 62 -21 -196 493 232 160 -33 116 99 -192 67 224 146 207 149 -248 -31 -41 -381 -45
2796d5m1O7l3J07K7Q5k85J30J45J72k93j46K9J89K68k73j52j45K33k45L01j58
$$ -45 -86 -19 -52 55 82 167 -118 12 157 329 36 -110 -81 108 376 103 -49 -194 39 -206 95 -63
2818f3J83J6K4k21o3O3K36l5l40J39M59k71k1J24j42k2j83j50K99k67M5p6K58
$$ -63 120 136 160 -61 -124 -61 175 140 -200 -61 398 127 106 230 88 66 -117 -267 32 -235 -190 -266 -8
2841hp1M8l30K79K11J10j77k69N03j82j3j97K39k56J83J37m59O08l03j14k15J37
$$ -8 -79 -31 -361 -82 129 239 62 -207 296 114 101 -96 143 -113 70 207 -252 356 53 -61 -276 -139
2863a39K49j78k0n1RK88k0k42L93k92pK16k10J63j81j85Q8qL90l71M3J52M0L8
$$ -139 110 -68 -88 -139 -130 158 138 -104 289 -3 -10 206 -4 159 -22 -207 -119 -127 263 -108 -65 87 127 165
2887A65m06L30n9rm8rJ18j53K54Pk95J78l12P12n29o9K87k36j38K91nM5l67K85
$$ 165 -241 89 30 21 -27 -36 82 -71 183 190 -105 73 -239 473 -56 -125 162 -74 -212 79 74 119 -248 37
2911C7m4P8o9N4j88L92n4k63L06p2j6l5O5l8j34j71J53k63Q9L12k7n4j61L17k77
$$ 37 -7 71 2 56 -132 260 206 -57 249 177 161 126 191 153 19 -152 1 -262 -173 139 112 58 -103 214 -63
2936f3o0R4J43o3J21m5m1rN2o8j67k49N55k28p5O2L6K25l55K04j36Km5K03j96
$$ -63 -123 -29 114 51 172 127 86 77 129 61 -106 -355 200 -28 -103 -41 -5 220 -135 69 -67 -65 -110 93 -103
2961a03J09K06j11p6K48j14n0j82n7q3K30k19J34j98J38J07P9j61K2L51m09j5
$$ -103 6 212 101 25 273 159 109 -73 -130 -213 17 -202 -68 -266 -128 -21 58 -103 -81 270 -139 -154
2983a54J5j89M59j40k07J95M69n51M5J72k2r5m76O07k29n1P9j93K99J0M5J01k87
$$ -154 -139 -328 131 -9 -216 -21 448 -103 -58 114 92 -3 -479 128 -101 -152 -73 -266 33 43 88 189 -98
3006i8J03K58j96l06K13n7l3L89n26K15J83k66m4M5L42k83j30R2L13K0l00J17
$$ -98 5 263 67 -239 -26 -83 -116 273 -253 -38 145 -121 -165 -120 222 -61 -191 -99 214 234 -66 51
3028E1j15J76nj75L6r3K01P6j22p3qR3j09K22n00J16J30K26l15M86l13L6QJ39
$$ 51 -64 112 107 -68 -32 -125 76 152 30 -43 -51 42 -67 155 -345 -229 -99 127 -188 298 -15 21 29 168
3052A68O9k21j39K12J34k76l1P3j10n6o8J96pj00M1k00L9K16P3J21j37P6j05K41
$$ 168 237 16 -123 89 223 -53 -84 -11 -121 -177 -245 -49 -56 -156 -115 -315 -276 -60 13 134 -3 73 -32 209
3076B09qk94J73p8k9m4K6J30p9n5K51n92M79k4L9Q8J27Q4m22J99j89J8r0j3J84
$$ 209 201 -93 80 2 -27 -71 -45 85 6 -49 202 -390 89 65 104 192 319 403 -19 180 -9 9 -81 -94 90
3101I0Q8k42j2m1lK35k0k56J08J86k60K40k20j15J54J51O1j87L3R1J73k41N9j29
$$ 90 178 -64 -76 -117 -120 115 95 -161 -53 133 -127 113 -107 -222 -68 83 144 -43 -10 81 254 13 72 -57
3125e7k40N00k43m8J05j57k21J26K38k36K05k0Q2M7R2J11l64K42k12O3Q8J80k67
$$ -57 -297 203 -40 -88 17 -140 -361 -235 3 -233 -28 -48 34 81 173 284 -80 162 -50 13 101 281 14
3148A4l4L2J6l04M8K36J70k75J99j20k47O01l44j88J53k9J70j45J55j38n4J51
$$ 14 -20 12 28 -276 -228 8 178 -97 102 -18 -265 336 -8 -196 -43 -72 98 -47 108 -30 -84 67
3170F7J28j23k58n1N1L90l20R1R1M3k55L22j65Q1j4K56j20l27j27J46L22l19L9
$$ 67 195 72 -186 -237 -186 204 -116 -25 66 109 -146 176 11 92 78 334 214 -113 -240 -94 228 -91 -52
3193e2o6K7J08Q3p3L9j28K28m19L53k86J16J01Q6r0J51J51m95L09Q2k91P3K60
$$ -52 -118 -91 17 100 27 66 -62 166 -253 100 -186 -70 31 117 27 178 329 -166 143 225 -66 7 267
3216B67n62L97j65j07K22q8o5m5K5J25j03o6J63J26Q6k39m6L17m1p5j34p1J37
$$ 267 -295 102 -63 -170 52 -36 -101 -146 -121 4 -99 -165 -2 124 210 -29 -75 242 201 126 -8 -79 58
3239E8j26k8o4J07N5m48P6L17l46L76r4Q2k0K76j27mk07Q8j78J84O9n6j53K20
$$ 58 -68 -96 -160 -53 2 -446 -370 -53 -399 -23 -117 -35 -55 221 94 90 -117 -29 -207 -23 46 -10 -163 57
3263E7p6k79K32K4J28m68L45P6j74M32k13j37L01l86P6LL07l60k0L39M8k28j75
$$ 57 -19 -298 -66 -42 86 -382 -37 39 -135 297 84 -53 248 -138 -62 -59 248 -112 -132 207 255 27 -148
3286a48k04M16K02n59M00j86n4j5J06QJ66p8j04R6j28J12j20K94j60J48j50k12
$$ -148 -352 64 266 -293 107 -79 -133 -148 -42 -34 132 54 -50 46 -82 30 -90 204 44 192 42 -170
3308a70J35Q1l26P2Q8K18l4j46J17l9J96j24l3J65k27N0L31k00j46J30p6O6j47
$$ -170 -35 46 -280 -208 -120 98 64 -82 35 -4 192 68 35 200 -27 23 354 154 8 138 62 128 -19
3331a9Jk72R5J07J79J00k11L11m04L56k46L7NJ09q2K83k89K0l84L36q7k46K81
$$ -19 -18 -290 -195 -88 91 191 -20 291 -113 243 -3 34 39 148 66 349 60 80 -304 32 -55 -301 -20
3354b0l30K54M1l2k61O02j86j7o0J45j39J1L92m00J30k23J14R1k02l7j02N4J08
$$ -20 -350 -96 -55 -87 -348 254 68 51 -9 136 -3 8 400 0 130 -93 21 112 -90 -127 -229 -175 -67
3377f7J48j07J91j71K70m95J87j6P8K40j34k20L45l33R6l3m0K80m6k15m3M2r7
$$ -67 81 -26 165 -6 264 -231 -44 -60 18 258 124 -96 249 -84 12 -21 -61 219 173 -42 -85 -43 -140
3400a40R0m7j37j95N34J7r1k95M25R4k49l0J26m7J35j05M0j76J73j53L8J28k45
$$ -140 -50 -97 -234 -429 105 122 31 -264 161 255 6 -24 102 55 190 85 125 -51 122 -31 7 135 -110
3423a10j19L48l45M63k29J81p0N5r3po5m5J47J47j39k35K35k8j03j82K0L18k44
$$ -110 -229 119 -226 237 8 189 119 174 81 74 9 -36 111 258 119 -116 119 91 -12 -194 -174 144 -100
3446a00k1l8p2L31J8j22K10L9n6%J61j28k93m6m7Q2J40j24l2J88p0M6j84J07j81
$$ -100 -121 -159 -231 100 118 -4 206 245 189 189 350 222 -71 -117 -164 -82 58 -66 -98 90 20 66 -118 -11 -192
3471a92K06j1j2n6M4L22m21L68k00MJ97j65m4j69L75k08l2k27J65j17J85J61r1
$$ -192 14 3 -9 -65 -21 301 -120 248 48 52 249 84 40 -129 246 38 6 -221 -56 -173 12 173 82
3494H2O5j46J12m9Q9p7M1oj27J02j69K13j33j2m6m6K8R6j68J67j75k46L89k17
$$ 82 147 1 113 64 153 76 117 111 -16 86 -83 130 -3 -15 -61 -107 -79 17 -151 16 -159 -405 -16 -233
3518b33K92J96m07M4J36r7J03J75l55P8M2L19m99J87k6K29j49k99K77K69l68L24
$$ -233 59 255 -152 -108 28 -69 34 209 -146 -68 -26 293 -206 -19 -45 184 35 -264 13 282 -86 238
3540B38l63L52N2k41L5k63J82K29j64j31J82k42M9N9n5N9R8j32M3J02N0j59K46
$$ 238 -125 227 279 38 73 -190 -8 221 57 -74 108 -134 -85 -26 -81 -22 76 -56 -13 89 139 -20 226
3563B26k78J26O1j92K56m37L97k66OJ35k5J93j33j05m1J86P2l30J19K6L9L44n29
$$ 226 -52 74 135 -57 199 -238 159 -107 -101 34 9 202 69 -36 -77 109 181 -149 -30 -4 35 379 -150
3586a50J11L6J09J66k69k8R1j57O2K11j91P4l09J59K52k11k96K25P0j26J36j82
$$ -150 -39 -3 106 272 3 -25 66 -91 -29 182 -9 65 -244 -85 167 -44 -340 -115 -45 -171 -35 -217
3608b17J98L6M7m2Jo3R8p0n8J80j24j74K15R1k42J91m35K78J98k63J16O7R6L5
$$ -217 -19 17 64 22 23 -40 58 -12 -70 110 -14 -188 27 118 -124 67 -368 -90 108 -155 -39 28 124 159
3632A59J32m37J82P6j03J1j1K25j57k08K20R0l84K34k29Q8j41K91P5j45K08j01
$$ 159 291 -146 36 112 9 20 9 234 77 -131 89 179 -205 29 -200 -112 -253 38 113 -32 176 75
$$ [...]
8191A51
##END NTUPLES=NMR FID
##END=
