##TITLE=1H_SL35-Dau(f5)
 CDCl3
 8 sc, 
 9.12.2021
##JCAMPDX= 6.0         $$ Bruker NMR JCAMP-DX V2.0
##DATA TYPE= NMR FID
##DATA CLASS= NTUPLES
##ORIGIN= UXNMR, Bruker Analytische Messtechnik GmbH
##OWNER= root
$$ XWIN-NMR		Version 3.5
$$ Thu Dec  9 14:03:03 2021 Russian Standard Time (UT+4h)  she@DPX200
##.OBSERVE FREQUENCY= 200.131346
##.OBSERVE NUCLEUS= ^1H
##.DELAY= (6, 6)
##.ACQUISITION MODE= SIMULTANEOUS
##.ACQUISITION SCHEME= undefined
##.AVERAGES= 8
##.DIGITISER RES= 18
##SPECTROMETER/DATA SYSTEM= spect
##.PULSE SEQUENCE= zg30
##.SOLVENT NAME= CDCl3
##.SHIFT REFERENCE= (INTERNAL, CDCl3, 0, 15.7039)
##AUDIT TRAIL= $$ (NUMBER, WHEN, WHO, WHERE, WHAT)
$$ ##TITLE= Audit trail, XWIN-NMR		Version 3.5
$$ ##JCAMPDX= 5.01
$$ ##ORIGIN= Bruker BioSpin GmbH
$$ ##OWNER= she
$$ F:/spectra/data/she/nmr/H-F/1/audita.txt
$$ ##AUDIT TRAIL=  $$ (NUMBER, WHEN, WHO, WHERE, WHAT)
(   1,<2021-12-09 14:02:10.39 +0400>,<she>,<DPX200>,
      <created by zg, POWCHK disabled, PULCHK disabled
       configuration hash MD5:
       00 E9 B6 7A A2 85 ED C7 34 08 36 98 17 FE 4E 26
       data hash MD5: 16K
       8F AF 81 42 B3 AE BD 46 20 F9 6A 5A F0 6C 31 05>)
$$ ##END=
$$ 
$$ hash MD5
$$ 67 E9 4E 06 9D 2C 69 B4 B0 90 54 01 B7 A7 EE DD
##$RELAX= 
##$RELAX= 
##$RELAX= 
##$RELAX= 
##$RELAX= 
##$RELAX= 
$$ Bruker specific parameters
$$ --------------------------
##$DU= <F:/spectra>
##$EXPNO= 1
##$NAME= <H-F>
##$PROCNO= 1
##$TYPE= <nmr>
##$USER= <she>
##$AMP= (0..31)
100 100 100 100 100 100 100 100 100 100 100 100 100 100 100 100 100 100 
100 100 100 100 100 100 100 100 100 100 100 100 100 100 
##$AQSEQ= 0
##$AQ_mod= 1
##$AUNM= <au_zg>
##$AUTOPOS= <>
##$BF1= 200.13
##$BF2= 200.13
##$BF3= 200.13
##$BF4= 200.13
##$BF5= 200.13
##$BF6= 200.13
##$BF7= 200.13
##$BF8= 200.13
##$BYTORDA= 1
##$CFDGTYP= 0
##$CFRGTYP= 5
##$CHEMSTR= <none>
##$CNST= (0..31)
1 1 145 1 1 1 1 1 1 1 1 1 1 1 1 1 1 1 1 1 1 1 1 1 1 1 1 1 1 1 1 1 
##$CPDPRG= <>
##$CPDPRG1= <>
##$CPDPRG2= <>
##$CPDPRG3= <>
##$CPDPRG4= <mlev>
##$CPDPRG5= <mlev>
##$CPDPRG6= <mlev>
##$CPDPRG7= <mlev>
##$CPDPRG8= <mlev>
##$CPDPRGB= <>
##$CPDPRGT= <>
##$D= (0..31)
0 1.2 0 0 0 0 0 0 0 0.06 0 0.03 0 0 0 0 0.0002 0 0 0 0 0 0 0 0 0 0 0 0 
0 0 0 
##$DATE= 1639044129
##$DBL= (0..7)
120 120 120 120 120 120 120 120 
##$DBP= (0..7)
150 150 150 150 150 150 150 150 
##$DBP07= 0
##$DBPNAM0= <>
##$DBPNAM1= <>
##$DBPNAM2= <>
##$DBPNAM3= <>
##$DBPNAM4= <>
##$DBPNAM5= <>
##$DBPNAM6= <>
##$DBPNAM7= <>
##$DBPOAL= (0..7)
0.5 0.5 0.5 0.5 0.5 0.5 0.5 0.5 
##$DBPOFFS= (0..7)
0 0 0 0 0 0 0 0 
##$DE= 6
##$DECBNUC= <off>
##$DECIM= 32
##$DECNUC= <off>
##$DECSTAT= 4
##$DIGMOD= 1
##$DIGTYP= 9
##$DL= (0..7)
0 120 120 120 120 120 120 120 
##$DP= (0..7)
150 150 150 150 150 150 150 150 
##$DP07= 0
##$DPNAME0= <>
##$DPNAME1= <>
##$DPNAME2= <>
##$DPNAME3= <>
##$DPNAME4= <>
##$DPNAME5= <>
##$DPNAME6= <>
##$DPNAME7= <>
##$DPOAL= (0..7)
0.5 0.5 0.5 0.5 0.5 0.5 0.5 0.5 
##$DPOFFS= (0..7)
0 0 0 0 0 0 0 0 
##$DQDMODE= 0
##$DR= 18
##$DS= 0
##$DSLIST= <SSSSSSSSSSSSSSS>
$$ [...]
##$SUBNAM2= <"">
##$SUBNAM3= <"">
##$SUBNAM4= <"">
##$SUBNAM5= <"">
##$SUBNAM6= <"">
##$SUBNAM7= <"">
##$SUBNAM8= <"">
##$SUBNAM9= <"">
##$SW= 18.0517287032376
##$SWIBOX= (0..15)
0 0 2 0 0 0 0 0 0 0 0 0 0 0 0 0 
##$SW_h= 3612.71676300578
##$TD= 16384
##$TD0= 1
##$TE= 0
##$TE2= 300
##$TE3= 300
##$TEG= 300
##$TL= (0..7)
0 120 120 120 120 120 120 120 
##$TP= (0..7)
150 150 150 150 150 150 150 150 
##$TP07= 0
##$TPNAME0= <>
##$TPNAME1= <>
##$TPNAME2= <>
##$TPNAME3= <>
##$TPNAME4= <>
##$TPNAME5= <>
##$TPNAME6= <>
##$TPNAME7= <>
##$TPOAL= (0..7)
0.5 0.5 0.5 0.5 0.5 0.5 0.5 0.5 
##$TPOFFS= (0..7)
0 0 0 0 0 0 0 0 
##$TUNHIN= 0
##$TUNHOUT= 0
##$TUNXOUT= 0
##$USERA1= <user>
##$USERA2= <user>
##$USERA3= <user>
##$USERA4= <user>
##$USERA5= <user>
##$V9= 5
##$VALIST= <valist>
##$VCLIST= <CCCCCCCCCCCCCCC>
##$VD= 0
##$VDLIST= <DDDDDDDDDDDDDDD>
##$VPLIST= <PPPPPPPPPPPPPPP>
##$VTLIST= <TTTTTTTTTTTTTTT>
##$WBST= 1024
##$WBSW= 4
##$XGAIN= (0..3)
0 0 0 0 
##$XL= 0
##$YL= 0
##$YMAX_a= 46999
##$YMIN_a= -79863
##$ZGOPTNS= <>
##$ZL1= 120
##$ZL2= 120
##$ZL3= 120
##$ZL4= 120
##$ABSF1= 10
##$ABSF2= 0
##$ABSG= 5
##$ABSL= 3
##$ALPHA= 0
##$AQORDER= 0
##$ASSFAC= 0
##$ASSFACI= 0
##$ASSFACX= 0
##$ASSWID= 0
##$AUNMP= <proc_1d>
##$AZFE= 0.1
##$AZFW= 0.1
##$BCFW= 1
##$BC_mod= 2
##$BYTORDP= 1
##$COROFFS= 0
##$CY= 11.3945322036743
##$DATMOD= 1
##$DC= 2
##$DFILT= <>
##$DTYPP= 0
##$F1P= 2.36226072786647
##$F2P= -0.459571619588291
##$FCOR= 0.5
##$FTSIZE= 0
##$FT_mod= 4
##$GAMMA= 1
##$GB= 0.15
##$INTBC= 1
##$INTSCL= 1
##$ISEN= 128
##$LB= 0.24
##$LEV0= 0
##$LPBIN= 0
##$MAXI= 10000
##$MC2= 0
##$MEAN= 0
##$ME_mod= 0
##$MI= 1.114404
##$NCOEF= 0
##$NC_proc= 0
##$NLEV= 6
##$NOISF1= 3.799351
##$NOISF2= 2.8
##$NSP= 1
##$NTH_PI= 0
##$NZP= 0
##$OFFSET= 15.70392
##$PC= 1
##$PHC0= -15513.24
##$PHC1= 11.6008
##$PH_mod= 1
##$PKNL= yes
##$PPARMOD= 0
##$PSCAL= 0
##$PSIGN= 0
##$REVERSE= no
##$SF= 200.130013532006
##$SI= 16384
##$SIGF1= 3
##$SIGF2= 2
##$SINO= 400
##$SIOLD= 16384
##$SREGLST= <1H.CDCl3>
##$SSB= 0
##$STSI= 0
##$STSR= 0
##$SW_p= 3612.71676300578
##$SYMM= 0
##$S_DEV= 0
##$TDeff= 0
##$TDoff= 0
##$TI= <>
##$TILT= no
##$TM1= 0
##$TM2= 0
##$TOPLEV= 0
##$USERP1= <user>
##$USERP2= <user>
##$USERP3= <user>
##$USERP4= <user>
##$USERP5= <user>
##$WDW= 1
##$XDIM= 8192
##$YMAX_p= 0
##$YMIN_p= 0
$$ End of Bruker specific parameters
$$ ---------------------------------
##NTUPLES= NMR FID
##VAR_NAME=  TIME,          FID/REAL,        FID/IMAG
##SYMBOL=    X,             R,               I
##VAR_TYPE=  INDEPENDENT,   DEPENDENT,       DEPENDENT
##VAR_FORM=  AFFN,          ASDF,            ASDF
##VAR_DIM=   8192,          8192,            8192
##UNITS=     SECONDS,       ARBITRARY UNITS, ARBITRARY UNITS
##FACTOR=    0.0002768,     1,               1
##FIRST=     0,             0,               0
##LAST=      2.2672688,     0,               0
##MIN=       0,             -79863,          0
##MAX=       2.2672688,     46999,           0
$$ Real data points
##PAGE= N=1
##DATA TABLE= (X++(R..R)), XYDATA
$$ [...]
1788A17J38M63o44l97M68K87n10k14J20J87Q9n41m9P18J69o07k96N23k3k71Q0
$$ 117 255 718 74 -323 145 432 -78 -292 -172 15 104 -437 -486 232 401 -206 -502 21 -2 -273 -193
1809a93N1K40r2m61L61L80k21l0M21o2o60J30M82J59m49lJ10q1r6j72nK65k20
$$ -193 -142 98 6 -455 -94 286 65 35 456 394 -266 -136 346 505 56 53 163 82 -14 -186 -191 74 -146
1832a46l28L23Q4J0q0o1k7q1M3P8J12r2K62J0J1k94L22L28j58K11j73L2l49J50
$$ -146 -474 -151 -67 -57 -137 -198 -225 -306 -263 -185 -73 -165 97 107 118 -176 146 474 316 527 354 386 37 187
1856A87j43O7k4k32m2J58k40l53N51P7l42k28P9L95K56m97rL84J47m11Q1O20k09
$$ 187 44 111 87 -145 -187 -29 -269 -622 -71 6 -336 -564 -485 -90 166 -331 -340 44 191 -220 -139 481 272
1879B72l47J35O43m74J41l33N06N0p43k89N70J01m76k28K28O6m13k05K16N47J2
$$ 272 -75 60 703 229 370 37 543 593 -150 -439 131 232 -244 -472 -244 -178 -591 -796 -580 -33 -21
1900b1j05M3K59j38k26M30J69r9j75O5L51k23J91j79o7J07j00l19J3P0r1J51n34
$$ -21 -126 -83 176 38 -188 242 411 312 137 202 553 330 521 342 275 382 282 -37 -24 46 -45 106 -428
1923d28L1R2L03m59K89o6j8Q3l45M67Q3J23k78J45J62j9k50K57M19l77q7j67K06
$$ -428 -397 -305 -2 -461 -172 -238 -256 -173 -518 -51 32 155 -123 22 184 165 -85 172 591 214 127 -40 166
1946A66M1k29m9K82L1o92N9L71k8l33J8L60K6m48J15K09L18n88L23J00K10J3k67
$$ 166 207 -22 -71 211 242 -450 -391 -20 -48 -381 -363 -3 23 -425 -310 -101 217 -371 -48 52 262 275 8
1969HK45N9l40j63K78K17k08j22J22l5ok88K68J76k1l54L1j04K61k83L9J65j64
$$ 8 253 312 -28 -191 87 304 96 -26 96 61 55 -233 35 211 190 -164 -133 -237 24 -259 -220 -55 -219
1992b19J71j02O1m2K7K50n02J50K03M27l20k5K04l44j7J75J98Q2k97r1N4M08m89
$$ -219 -48 -150 -89 -131 -104 146 -356 -206 -3 424 104 79 283 -61 -78 97 295 377 80 -11 43 451 -38
2015c8q0K27Q7j79m73J66M84k88n29M60J21l13K16j56M14J30l48J7J89L1l21J89
$$ -38 -118 109 196 17 -456 -290 194 -94 -623 -163 -42 -355 -139 -295 119 249 -99 -82 107 138 -183 6
2037FJ84K45m05n3K67j27J43m68N15j03m96j74N84nj34l52J19J73j19l02L35K19
$$ 6 190 435 30 -23 244 117 260 -208 307 204 -292 -466 118 113 -21 -373 -254 -81 -200 -502 -167 52
2059E2O9k06k11M59r6O2j3J32J42j20K28l30K34J36j50k30l14J92p5j27n0J40
$$ 52 121 -85 -296 163 67 129 116 248 390 270 498 168 402 538 388 158 -156 36 -39 -166 -216 -76
2081g6l4j36m70N48J3r0K8M4O43m56k32J38L95J9j96P2J84M6o6j03q2L1m05J22
$$ -76 -110 -246 -716 -168 -155 -245 -217 -173 470 14 -218 -80 315 334 138 210 394 440 374 271 189 220 -185 -63
2105f3L99k62k74k31O61l13k90k1N36P8o35J5J20K82j10k44L62M32o40L3K97J58
$$ -63 336 74 -200 -431 230 -83 -373 -394 142 220 -415 -400 -280 2 -108 -352 10 442 -198 -165 132 290
2127B90K24m38J45q7J48m13N7J18O0p5j91J24m9n2L01n0m32QK2Q0J0k44L04m4
$$ 290 514 76 221 134 282 -131 -74 44 104 29 -162 -38 -87 -139 162 112 -320 -312 -290 -210 -200 -444 -140 -184
2151a84q4M92j05o7K10K9k79m4ol6L96m7l42K78K21m53l84N51Op9k03l4L16j57
$$ -184 -268 224 119 52 262 291 12 -32 -38 -74 322 275 -67 211 432 -21 -405 146 152 73 -130 -164 152 -5
2175ej42K43L7m7n13L64J39p9K5j01n8L77l11m05N84O7j20j02RJ46R0j42J09J21
$$ -5 -147 96 133 86 -427 -63 76 -3 22 -79 -137 240 -71 -476 108 175 55 -47 -38 108 198 56 165 286
2199B86j74k77K60J34k15k82K87K1Nm74K41K28n5Q2m76K07K23o0l19M18K9k9j67
$$ 286 112 -165 95 229 14 -268 19 40 45 -429 -188 40 -15 67 -409 -202 21 -39 -358 60 89 60 -107
2222a07K72l3J34R1k21M2J06q3k3k76J99j25o5r0K00j49K0Q4l02K15q3o8r1N64
$$ -107 165 132 266 357 136 178 284 201 178 -98 101 -24 -89 -179 21 -128 -108 -24 -326 -111 -194 -262 -353 211
2246B11k30j49k1J63K01l21r0O79j17l8l48J93K79k73p0j41M04n27j62N28N8p31
$$ 211 -19 -168 -189 -26 175 -146 -236 443 326 288 -60 133 412 139 69 -72 332 -195 -357 171 229 -502
2268e02J21M0N09o56k11O27J4l42J1M80N5L7O9l78L54r0j59L20k5L8k58OM2K2
$$ -502 -381 -341 168 -488 -699 -72 -58 -400 -389 91 146 183 252 -126 228 138 -21 299 274 312 54 60 102 124
2292A24j20M48l71k23r6j70l3M5L31k07M12j94p8L18j82j27K13J38j52j64K34
$$ 124 4 452 81 -142 -238 -408 -441 -396 -65 -272 140 -54 -132 186 4 -123 90 228 76 -88 146
2313A46j44K02k69L54M3k80Kl45P68j85l99m8K93K5m15L2L39M1l20j45M41K4m47
$$ 146 2 204 -65 289 332 52 54 -291 477 292 -107 -155 138 163 -252 -220 119 160 -160 -305 136 160 -287
2336b87R5L88j98j0k96L86L29l84k25K70L74n69K11L0M3K13l48O6J28j48K5k48
$$ -287 -192 196 -2 -12 -308 78 407 23 -202 68 442 -127 84 114 157 370 22 88 216 68 93 -155
2358a55P5J12k75J67K96j55l62K92q4J56l41K05N0K4P5Nj06j56L66Jr7q2n7M11
$$ -155 -80 32 -243 -76 220 65 -297 -5 -89 67 -274 -69 -19 5 80 85 -21 -177 189 190 93 11 -46 365
2382C65k78M9l9j11J50k14j95q5N16l07J49Lk42j22L61p6K28l67j75J53N16n92
$$ 365 87 136 97 -14 136 -78 -273 -358 158 -149 0 3 -239 -361 0 -76 152 -215 -390 -237 279 -313
2404c13j69L44K38l87O8M24j56l2J54J81P9l30j58L40k4l37j91J73K77k85J22
$$ -313 -482 -138 100 -287 -219 205 49 17 171 352 431 101 -57 283 259 -78 -269 -96 181 -104 18
2425A8k12L62n98n62J80N78J39l57L27J49J25l67J64J27N7j27K29j55J15om7L5
$$ 18 -194 168 -430 -992 -812 -234 -95 -452 -125 24 149 -218 -54 73 130 3 232 77 192 186 139 174
2447A74j68J7k9K43l62j91K59j45P1l35L33M4k05M2J48J27l61K34K90r1J8k3J37
$$ 174 6 23 -6 237 -125 -316 -57 -202 -131 -466 -133 -89 -294 -252 -104 23 -338 -104 186 95 113 90 227
2470B27K82m56k71N31k6j58RmR5j49j33J62P0j20j68J40M8m30J84j12K83O0l01
$$ 227 509 53 -218 313 287 129 138 134 229 80 -53 109 179 59 -109 31 79 -351 -167 -279 4 64 -237
2493b37R7K53n25L04K27J47o0n09L97K92j72j93L05k29j83k11K72j21rN8K1j4
$$ -237 -140 113 -412 -108 119 266 206 -303 94 386 214 21 326 97 -86 -297 -25 -146 -155 -97 -76 -90
2515i0L8o1J46Nj38j83K61J52j38o9l7q8n0L35j94J44J4J62L4r0%N5j35K11k98
$$ -90 -52 -113 33 38 -100 -283 -22 130 -8 -77 -114 -202 -252 83 -111 33 47 209 243 153 153 208 73 284 -14
2540a4R7K40j08n19K60K75k6k30l49L73K82l56j3J41m46K01n2K85l6j37k75K17
$$ -14 83 323 215 -304 -44 231 205 -25 -374 -1 281 -75 -88 53 -393 -192 -244 41 5 -132 -407 -190
2562a90K40J5n7J54O5n9l10L21P7K5k86o5J55Nm1p0M9P2l36J18K97l55J04l0K
$$ -190 50 65 8 162 227 168 -142 179 256 281 -5 -70 85 90 49 -21 28 100 -236 -118 179 -176 -72 -102 -100
2587a00l1j43r5J98K94o2j47m4p0J66J76p0J69o8j47J36j98J61n1n1r7n2J29J9
$$ -100 -131 -274 -369 -171 123 61 -86 -130 -200 -34 142 72 241 173 26 162 -36 125 74 23 -74 -126 3 22
2611B2n9o8p9j25q1J52K81m0j89O6K41k09L9M8K79l8o6k56K34n1j32J07R8p7p0
$$ 22 -37 -105 -184 -309 -390 -238 43 3 -186 -120 121 -88 -49 -1 278 240 174 -82 152 101 -31 76 174 97 27
2636B7O8j59O7p3k23K98q7mj61J99K5l3m16K85R3J29P3k21L50k77M0P4K29j80
$$ 27 95 -64 3 -70 -293 5 -82 -86 -247 -48 -23 -56 -472 -187 -94 35 108 -113 237 -40 0 74 303 123
2660A23j44p0M22L8j44j90L43l25j49q9M35l75j92R5K21N8K8o8j37J88j79K30
$$ 123 -21 -91 331 369 225 35 378 53 -96 -185 250 -125 -317 -222 -1 57 85 17 -120 68 -111 119
2682A19l5l22J25J2Q0J47l9J58k24o1J78r8O2J3j76L51k18k03N9N5P9j17q4J40
$$ 119 84 -238 -113 -101 -21 126 87 245 21 -40 138 40 102 115 -61 290 72 -131 -72 -17 62 -55 -139 1
2706AN1j75M9J62O8l52j3N0K20o9o7K03p4l0j31J43J28J74l99J01N9k6j52K34
$$ 1 52 -123 -74 88 156 -196 -209 -159 61 -8 -75 128 54 24 -107 36 164 338 -61 40 99 73 -79 155
2730A55O3k25k23L34j83J60k89J17L72l47q0o9J93k67J31N0K39k15J35P3k6j83
$$ 155 218 -7 -230 104 -79 81 -208 -91 281 -66 -146 -215 -22 -289 -158 -108 131 -84 51 124 98 -85
2752h5L1L57k3k30J08J60k36j10J06Nn2j68J10r8L24l68N9O0L4l83J51j01J88
$$ -85 -54 303 280 50 158 318 82 -28 78 83 31 -137 -27 -125 199 -169 -110 -50 -16 -399 -248 -349 -161
2775a61n5R1Q4K80m76K40J81J17k52l3J96qk50j1J40j29R1j10J47O6n9k45L5j6
$$ -161 -216 -125 -41 239 -237 3 184 301 49 16 212 204 -46 -57 83 -46 45 -65 82 148 89 -156 -121 -137
2799a37k4k77R7L80k61k8L0K41J82j94K9J27k59K48k46Q1L47k22j27O0N5J17R9
$$ -137 -161 -438 -341 39 -222 -250 -220 21 203 9 38 165 -94 154 -92 -11 336 114 -13 47 102 219 318
2822C18m55K08j86O1K0j30p1P4m0o2j00J36O0%k4K33K07k05r7K27N6j64QK23Q0
$$ 318 -137 71 -115 -54 -34 -164 -235 -161 -201 -263 -363 -227 -167 -167 -191 42 249 44 -53 174 230 66 74 297 377
2847C77l61j58M33k64j49K8J57Qj38l10L29J15k14rK85j89q8J0L14j44pm3n3K53
$$ 377 16 -142 291 27 -122 -94 63 71 -67 -377 -48 67 -147 -156 129 -60 -148 -138 176 32 25 -18 -71 182
2871A82%n00K80J67k72l7K12r5K5J86l39L3M13k55o4J0J6O4O6K12j69k70n1O6
$$ 182 182 -318 -38 129 -143 -180 32 -63 -38 148 -191 -158 255 0 -64 -54 -38 26 92 304 135 -135 -186 -120
2895a20K08l2j24O7r0K23j82J7J06L6j91J14r2R7N2R9j79J42O5p5k82K52Q7j6
$$ -120 88 56 -68 -1 -91 132 -50 -33 73 109 -82 32 -60 37 89 188 9 151 216 141 -141 111 198 182
2919A82m42k6K82J57j06n20N53j01j60j83L78j96K45k49r5P16l06k83K2M03l95
$$ 182 -260 -286 -4 153 47 -473 80 -21 -181 -364 14 -182 63 -186 -281 435 129 -154 -132 271 -124
2940a24J18K38k2j75Oo2P8j4k03J59N4J83m43J45j8J48m04K87K65j2l97m3J58
$$ -124 -6 232 210 35 41 -21 57 43 -160 -1 53 236 -207 -62 -80 68 -336 -49 216 204 -193 -236 -78
2963g8N5J02Qj7N6j39Q1J52m2m2J01J46k49k6k32O4J4O6Oj73J21J2j84L00j98
$$ -78 -23 79 87 70 126 -13 68 220 178 136 237 383 134 108 -124 -60 -46 20 26 -147 -26 -14 -198 102 -96
2988i6M9L8o3m06J71L9K38q5J87RL2k45L37o8K70k34k49j82N63k83j38J81o5J34
$$ -96 -47 -9 -72 -478 -307 -268 -30 -115 72 81 113 -132 205 137 407 173 -76 -258 305 22 -116 65 0 134
3012A34j58J12ll07j49K46O0L5j78K42P8rl76K60Q9o0j02J74J92r6J6k35K03o3
$$ 134 -24 88 85 -222 -371 -125 -65 -30 -208 34 112 103 -273 -13 76 16 -86 88 280 184 200 -35 168 105
3036A05n3j13l23K74K21l3K9j4k75N08m31K22j98K29p8k2r2n0J06k47J60o8K51
$$ 105 52 -61 -384 -110 111 78 107 93 -182 326 -105 117 -81 148 70 48 -44 -94 12 -235 -75 -143 108
3059A08j3j39j8J19K35k86J01o4j6J01J09j20j01J3q0K11l02o6L73J24m56n9K45
$$ 108 95 -44 -62 57 292 6 107 43 27 128 237 117 16 29 -51 160 -142 -208 165 289 -167 -226 19
3082A9K92l10q1J19J02l50J35k58N50k95R3j16o3K34j41r3J06Q4N1J67P9l62r0
$$ 19 311 1 -80 39 141 -209 -74 -332 218 -77 16 -100 -163 71 -70 -163 -57 27 78 245 324 -38 -128
3105a28K55o8Q9m36K14QJ91m96L23J3j40J03L6n6R9r8K10N2k02N0M5L6l13K7L95
$$ -128 127 59 148 -288 -74 -66 125 -371 -48 -35 -175 -72 -36 -92 7 -91 119 171 -31 19 64 100 -213 -186 209
3130B09j53K26j34k2m5L2o9k5j07j36J73j51K93j69o2K05j09m1N2k1J43r3k95
$$ 209 56 282 148 126 81 113 44 19 -88 -224 -51 -202 91 -78 -140 65 -44 -85 -33 -54 89 -4 -299
3153b99L54K78p48L09J91Nl5j32K34R3j08m0j64J98k6j59O3n0m1j79K08r1m4N5
$$ -299 55 333 -415 -106 85 90 55 -77 157 250 142 102 -62 136 110 -49 14 -36 -77 -256 -48 -139 -183 -128
3177a28O5J77K5k26K72k05m2N5O8J13k6l3j53J29R0j45J10m9j19R2k27J72Oj04
$$ -128 -63 114 139 -87 185 -20 -62 -7 61 174 148 115 -38 91 181 36 146 97 -22 70 -157 15 21 -83
3201h3K9J52O7j02l04L79k64j48N24l39l5j12L96O8k21JK09k7j64J34j62K9P5
$$ -83 -54 98 165 63 -241 138 -126 -274 250 -89 -124 -236 160 228 7 8 217 190 26 160 -2 27 102
3224A02j47Q2p0L97p10L36k43L08k85J39M6j22J60M6k92L46k89J72K4J42k90J80
$$ 102 -45 37 -33 364 -346 -10 -253 55 -230 -91 -45 -167 -7 39 -253 93 -196 -24 0 142 -148 32
3246C2J66l98J89J21l4N2K09k24M9j14M6j52j1Q0q2L2R4M7j68J57k38j46J80P7
$$ 32 198 -200 -11 110 76 128 337 113 162 48 94 -58 -69 11 -71 -39 55 102 -66 91 -147 -293 -113 -36
3270c6R4j43k3R9jj67l1J16o5L19l17L57J8q5j6k13J99j98j05J31L24m94L21J9
$$ -36 58 -85 -108 -9 -10 -177 -208 -92 -157 162 -155 202 220 135 119 -94 105 -93 -198 -67 257 -237 84 103
3294A03j65M2j60K72j31m4O3j23L79l62K03j76J28k92J61R0M6k0J14M4q7J38q0
$$ 103 -62 -20 -180 92 -39 -83 -20 -143 236 -126 77 -99 29 -263 -102 -12 34 14 128 172 85 223 143
3317A43q7NL4J00m79N85j08l45J55p5Mn6r9J97R2n0n8p3K7R5j74K38k4l1j62J79
$$ 143 56 61 95 195 -284 301 193 -152 3 -72 -68 -124 -223 -26 66 16 -42 -115 -88 7 -167 71 47 16 -146 33
3343C3L1OJ74k79K15k04J5J27j22p9K02j3o1l0j94J73j60o8L80l74M90k03q7J
$$ 33 64 70 244 -35 180 -24 -9 118 -4 -83 119 106 45 15 -179 -6 -166 -234 146 -228 262 59 -28 -27
3367b7R6k51L06j91J96j46l7J79j5J05r9M5k13P5NJ01k46N1L80k64k61p8J19J47
$$ -27 69 -182 124 -67 129 -17 -54 125 110 215 116 161 -52 23 28 129 -117 -66 314 50 -211 -289 -170 -23
3391b3l7j11K60q5j25j1j66L32Mj61M9K27L4j44j71J20l0K98j68o8R7j25J08L4
$$ -23 -60 -171 89 4 -121 -132 -298 34 38 -123 -74 153 187 43 -128 -8 -38 260 92 24 121 -4 104 138
3415A38j81J42j47N2K09j52l37K03J50j82O1J16o7j03j22J64k15J79J44k06m1
$$ 138 -43 99 -48 4 213 61 -276 -73 77 -105 -44 72 5 -98 -220 -56 -271 -92 52 -154 -195
3436a95N9J76l4P5j45J73j89L90k78J29O0l27Q6J63N7k28L6j15PQ5p4J13QL3q0
$$ -195 -136 40 6 81 -64 109 -80 310 32 161 221 -106 -20 143 200 -28 8 -107 -100 -15 -89 24 32 65 -15
3461a5k8J06m3j60k12L17k61J82M92k99j03J94k02n8N22n50K17l01K26O0l1J32
$$ -15 -43 63 20 -140 -352 -35 -296 -114 378 79 -24 170 -32 -90 432 -118 99 -202 24 84 53 185
3483A85k30Ok13O22n28J30l44L51L7j64j59L22J10o1m7j39K26r0j65L06k25K13
$$ 185 -45 -39 -252 370 -158 -28 -372 -21 16 -148 -307 15 125 64 17 -122 104 14 -151 155 -70 143
3505A43p1l8j24K73j29J21j35k4k22K25nL2j86j37K45j58J90Q3k03n0J63P8N0
$$ 143 72 34 -90 183 54 175 40 16 -206 19 14 46 -140 -277 -32 -190 0 83 -120 -170 -7 71 121
3528A21l54K76j10KK01j8r5J12O1j11J7j04J64k16L18k13M4j28J24m6j05oP7J37
$$ 121 -233 43 -67 -65 136 118 23 135 196 85 102 -2 162 -54 264 51 95 -33 91 45 -60 -66 11 148
3552A48k62J17K6J67k59L34l43K45p8nJ28p0l06J73r1PQ3l8J46q1j62o0J47j23
$$ 148 -114 3 29 196 -63 271 -72 173 95 90 218 148 -158 15 -76 -69 14 -24 122 41 -121 -181 -34 -157
3576a57J35k04J84n3o4j56M55j69J30J39j08p7mp1J59k08J52l06K38K51n29M62
$$ -157 -22 -226 -42 -95 -159 -315 140 -29 101 240 132 55 51 -20 139 -69 83 -223 15 266 -263 199
3598A99j44j12K5j61K85q5n7j83L38p8P1j53nN6k30J12J9O6L60m18L5J59l38J71
$$ 199 55 -57 -32 -193 92 7 -50 -233 105 27 98 -55 -60 -4 -234 -122 -103 -37 323 -95 -60 99 -239 -68
3622f8J04J76j78K2J37k33q4J13p3J72k5j33J47n7j67J20J38O4m73Q0K23RL6k68
$$ -68 36 212 34 56 193 -40 -124 -11 -84 88 63 -70 77 20 -147 -27 111 175 -298 -218 5 14 50 -218
3646b18L22k65L55l57L43n8k67J29J24J8j09L0J01j43J54n8k10M0K17j62j34K72
$$ -218 104 -161 194 -163 180 122 -145 -16 108 126 17 47 148 5 159 101 -109 -69 148 -14 -148 124
3668A24k24K63r3j84K57l22L26k41J08k31Q7J8lj32M30l2j84J69j7q2k33oK36
$$ 124 -100 163 70 -114 143 -179 147 -94 14 -217 -130 -112 -115 -247 183 151 -33 136 119 37 -196 -202 34
3691C4oj85K14K21j63j3j34j3j15J98j91Q1J33k31p2J70p3J42p2J46J07k14J63
$$ 34 28 -157 57 278 115 102 -32 -45 -160 38 -153 -72 61 -170 -242 -72 -145 -3 -75 71 178 -36 127
3714A27j19Q4N5k5M8O0j93J49j92k1p7K78k13j79J95J74l26J38L2p2l2j46R9j9
$$ 127 8 92 147 122 170 230 37 186 -6 -27 -104 174 -39 -218 -23 151 -175 -37 -5 -77 -109 -255 -156 -175
3738a75J95k25j40M49j58K36k90L62j62n6J66j36j93K21J7r6L6k9J54j03q9J42
$$ -175 20 -205 -345 104 -54 182 -108 254 92 36 202 66 -127 94 111 15 51 22 176 73 -16 126
3760A26n8k38J56O0o6j69R1J73k96J3L46o4k85lO6K85J05k67M6J1J8k00L46o2
$$ 126 68 -170 -14 46 -20 -189 -98 75 -221 -208 138 74 -211 -214 -148 137 242 -25 21 32 50 -150 196 134
3784A34k35K4M93l10k36O5J28O4mk42M3O6M2m4k12K07k53K98k31K35o1J31j00
$$ 134 -101 -77 416 106 -130 -65 63 127 123 -119 -76 -10 32 -12 -224 -17 -270 28 -203 32 -29 102 2
3807BK3l6M9j14J34j5J51Kj55L7j46Q3M9j39l14M97j33N0J22j31J76l99K7J10
$$ 2 25 -11 38 -76 58 43 194 196 41 78 -68 15 64 -75 -389 108 -25 25 147 16 192 -207 -180 -70
3831g0pk94L33O4j58O4j56K85O4q6p2M3j51j1l5L34p7M4q2Rj18n2J30J41K4k92
$$ -70 -77 -371 -38 26 -132 -68 -224 61 125 39 -33 10 -141 -152 -187 147 70 114 32 41 -77 -129 1 142 166 -126
3857a26J96k66N3J75o2%J50k95J44Lj21R0Q2N1J63k54kK4J66l35J48n5J09J73
$$ -126 70 -196 -143 32 -30 -30 120 -175 -31 -28 -149 -59 23 74 237 -17 -19 5 171 -164 -16 -71 38 211
3881B11j14L0j20j80Q4M1J48K9k65J07j87Q8J2J60j47r8L44j80J39j52J7R1M9
$$ 211 97 127 7 -173 -89 -48 100 129 -136 -29 -216 -128 -116 44 -103 -201 143 -37 102 -50 -33 58 107
3904A07m6K79k79k9K47j51n2p1r4J26J83n46L82Mj69J32j23J38j12N7j75J1L01
$$ 107 61 340 61 32 279 128 76 5 -89 37 220 -326 56 60 -109 23 -100 38 -74 -17 -192 -181 120
3927A20n5j71M0pQ5k6L3J53O8k61J50j5L6k3k95M27k23J40j32k70K29pJ53k19
$$ 120 65 -106 -66 -73 12 -14 19 172 240 -21 129 114 150 127 -168 259 36 176 44 -226 3 -4 149 -70
3951g0K8J6j60j09K67qJ45k25M8J77k3J60j42K1j41M6J3J29Oj54j50J72j7r3N1
$$ -70 -42 -26 -186 -295 -28 -36 109 -116 -68 109 86 246 104 125 -16 30 43 172 178 24 -126 46 29 -64 -13
3976a3K27l46K2J6J2K6r4L55k38o7N8k40L6J84K7k0k18K99J33k37J39K2j47K92
$$ -13 214 -132 -110 -94 -82 -56 -150 205 -33 -100 -42 -282 -246 -62 -35 -55 -273 26 159 -78 61 83 -64 228
4000B28m06K41o0Q7p4J18l1k22L6J12Q5p7r6Q2n7J06j23M8M8j82J91J02j8J8j47
$$ 228 -178 63 3 90 16 134 103 -119 -83 29 114 37 -59 23 -34 72 -51 -3 45 -137 54 156 138 156 9
4025IO2P6j45l40M14m32L26J41m1M4k20J95k64R7J79k45K03M7k20J09r7Q2j68
$$ 9 71 147 2 -338 76 -356 -30 111 70 114 -106 89 -175 -78 101 -144 59 106 -114 -5 -102 -20 -188
4048a88j81K77J40k21J51K0P8K1l17Q3L51k98K08K5R2j16l7j68J42j65J05K36
$$ -188 -369 -92 48 -173 -22 -2 76 97 -220 -137 214 -84 124 149 241 125 88 -80 62 -103 2 238
4070B38j60O9j06K5m7mr8n4O8L25l58j12L27n3j36r0L08k66J23L41m99J89j13
$$ 238 78 147 41 66 19 15 -83 -137 -69 256 -102 -214 113 60 -76 -166 142 -124 -1 340 -159 30 -83
4093h3N2K79j09j17j68K55P2k63Q4J1n7r5k5J73R4j84j58M65r0n00J06J31N12
$$ -83 -31 248 139 22 -146 109 181 -82 2 13 -44 -139 -164 9 103 -81 -239 226 136 -364 -258 -127 385
4116C85l49q7M4N9K5j81J24J18l12K55j62K42j48r7j27L48k76J93L3k36J97k68
$$ 385 36 -51 -7 52 77 -104 20 138 -174 81 -81 161 13 -84 -211 137 -139 54 87 -149 48 -220
4138b20K80j10L29l69J72n5Nr1N4J21J05l99K47lj28O1O4L9m9k47L5J68o4R2j64
$$ -220 60 -50 279 -90 82 27 32 -59 -5 116 221 -178 69 66 -62 -1 63 102 53 -194 -159 9 -55 37 -127
4163a27O7J91k26L4J3j19j24K38O9R5q5k28k8J23J11O0J18j92J29m6p1p9J34R0
$$ -127 -60 131 -95 -61 -48 -167 -291 -53 16 111 26 -202 -230 -107 4 64 182 -10 119 73 2 -77 57 147
4187A47k46j2K28j03o8l3P2J82K2k45K91q8l47J25j10K58j48k4J28J29j91K84
$$ 147 -99 -111 117 14 -54 -87 -15 167 189 -56 235 147 -200 -75 -185 73 -75 -99 29 158 -33 251
4209B51j93k15L85l31J16j8O3P2k16K36O3k86K92k27J65k02M7K29N2k61j69J58
$$ 251 58 -157 228 -103 13 -5 58 130 -86 150 213 -73 219 -8 157 -45 2 231 283 22 -147 11
4231A1p9K18k58K65l10K82j20j00K34k4l46M11o7j69K84j12J3n8j29K05L11m29
$$ 11 -68 150 -108 157 -153 129 9 -91 143 119 -227 184 117 -52 232 120 133 75 -54 151 462 33
4253C3j14Rm3P9j00J72K5p0k02J92p3K57l07K38j26j12k5N3P4j22P1R1Q5J00R4
$$ 33 -81 -72 -115 -36 -136 36 61 -9 -211 -19 -92 165 -142 96 -30 -142 -167 -114 -40 -162 -91 0 85 185 279
4278B79m02L26m26M25k85Q4J25K7l7j01P3p1k48P2J22p1K05nj72p0L44j04q9j02
$$ 279 -123 203 -223 202 -83 1 126 153 116 15 88 17 -231 -159 -37 -108 97 92 -80 -150 194 90 1 -101
4302a01q2K44j85K69l36M58l15J09J81k50j49N2L47j63n0m08K82M8Ok9j14J04
$$ -101 -183 61 -124 145 -191 267 -48 61 242 -8 -157 -105 242 79 29 -379 -97 -49 -43 -72 -186 -82
4324h2O6j18K39r9l03K87lk1J12l09J72j4O7P7J6Q3n4j25q0J49J88l45k52L50
$$ -82 -16 -134 105 6 -297 -10 -13 -34 78 -231 -59 -73 -6 71 87 170 116 -9 -89 60 248 -97 -349 1
4348Aj32J45L85k60qm7k0j6Jk00J32Q1j09J5J15Rj88J80j40l9P3jk01L10k49J01
$$ 1 -131 14 399 139 131 84 64 48 49 -151 -19 62 -47 -32 83 92 -96 84 -56 -95 -22 -23 -224 86 -163 -62
4374f2L30l30Q4J37j41J1J07p9j35K31N6k27n9K02r3l48M06j10Q0l6l8o8K74k79
$$ -62 268 -62 22 159 18 29 136 57 -78 153 209 -18 -77 125 32 -316 90 -20 60 24 -14 -82 192 -87
4398h7j03O6Jm2J97J52k55J18o3J99n8o7j52P4J23l36J79N5p2r4K35k61J45J58
$$ -87 -190 -124 -123 -165 32 184 -71 47 -16 183 125 58 -94 -20 103 -233 -54 1 -71 -165 70 -191 -46 112
4422A12k39Q1J5mK4k05l3K41j43Q3j4L6Q2l04M28m85J00J26j20J62M63l69j45
$$ 112 -127 -46 -31 -35 -11 -216 -249 -8 -151 -68 -82 -46 36 -268 160 -325 -225 -99 -219 -57 406 37 -108
4445a08J26k03K0J40nJ68Q3l62j56M13O0p5kl9j05J61l32J50J60j41k2Q6J11r3
$$ -108 18 -185 -165 -25 -30 138 221 -141 -297 116 176 101 99 60 -45 116 -216 -66 94 -47 -69 17 128 35
4469C5R2J16k43N5R5p6j57m5J60l61K64K1m0K36k54k7o7K30N8k17L24k60J89o7
$$ 35 127 243 0 55 150 74 -83 -128 32 -329 -65 -44 -84 152 -102 -129 -196 34 92 -125 199 -61 128 61
4493F1M5kj21K85j54k2o8J49l61J79J62k34J6j03L54k15k1k1J24j16K2l27J90
$$ 61 106 104 -17 268 114 92 24 173 -188 -9 153 -81 -65 -168 186 -29 -50 -71 53 -63 -41 -368 -178
4516a78m1J52l9K81m6l06R1p4L23m7J10j90l9N8M9Q8j95O3O4Mj00J29O1j30M4
$$ -178 -219 -67 -106 175 129 -177 -86 -160 163 116 226 36 -3 55 104 192 -3 60 124 128 28 157 218 88 132
4541A32kl35j1K47J65k46K46k20J07k27J8J59r6P6p1l9pJ69p5J65j93K31k17j52
$$ 132 130 -205 -216 31 196 -50 196 -24 83 -144 -126 33 -63 13 -58 -97 -104 65 -10 155 -38 193 -24 -176
4565a76K59j09j46K73M0k19r8J16pJ63j03R3k23L86p9l78K39j68L61n41K08K0
$$ -176 83 -26 -172 101 141 -78 -176 -60 -67 96 -7 86 -137 249 170 -208 31 -137 224 -317 -109 -89
4587h9J12k41n6L54j74J87j86M40l47J21r7L7O7L8m54L03n2j0n3K34j7K7k67n7
$$ -89 23 -218 -274 80 -94 93 -93 347 0 121 24 61 128 166 -288 15 -37 -47 -100 134 117 144 -123 -180
4611a80M44m02m4J38j24j0J39PK54j22k4j29O8l11K15J66J31k56j1K09j89K13
$$ -180 264 -138 -182 -44 -168 -178 -39 -32 222 100 76 -53 15 -296 -81 85 216 -40 -51 158 -31 182
4633A82Ok09l25J40J55k54L24O3n9K5K5j67J85J66Ll43N7O5J28k21j26n9R7K2
$$ 182 188 -21 -346 -206 -51 -305 19 82 23 48 73 -94 91 257 260 -83 -26 39 167 -54 -180 -239 -142 -120
4657a20q8M41k20P5j08k34J91j37K24j87K30j62J02j54M6L4%j15K76o8K5%j84
$$ -120 -208 233 13 88 -20 -254 -63 -200 24 -163 67 -95 7 -147 -101 -67 -67 -182 94 26 51 51 -133
4680a33K53j30P7l7K38l69K16n4jj10J61N9j99k31K68k4K3R5m53K93J13r4k9l4
$$ -133 120 -10 67 30 268 -101 115 61 60 -50 111 170 -29 -260 8 -16 7 102 -351 -58 55 -39 -68 -102
4704a02J65k6k4k00Q1j04k0J88j20K66k51L42j24o0L0M8j18K24Lk37oN5J30j6
$$ -102 63 37 13 -187 -106 -210 -230 -42 -162 104 -147 195 71 11 41 89 -29 195 198 -39 -45 10 140 124
4728A24j3j46P3O5k1k20K99l31J16K02K0k10P6Q1k72M8p3M5L13l04J65o6P2O7
$$ 124 111 -35 38 103 82 -138 161 -170 -54 148 168 -42 34 115 -157 -109 -182 -137 176 -128 37 -29 43 110
4752A10j79KJ96m7j87L97j88nk27R6Q0J5Q2l01N6PJ36k95L69M9j68No1J81l7j30
$$ 110 -69 -67 129 82 -105 292 104 99 -128 -32 48 63 145 -156 -100 -93 43 -252 117 166 -2 3 -58 123 86 -44
4778d4K6P5O1j34J44lk52K43j01J47J45k63J26L3k74r5P4q0K28k21mP0L7J0n1
$$ -44 -18 57 118 -16 128 125 -127 116 15 162 307 44 170 203 -71 -166 -92 -172 56 -165 -169 -99 -62 -52 -103
4803a03J65R9l31L20m9k7J1n7P7J10k36o9R9P8Q0l28K59j68j08k6J85m3M16l70
$$ -103 62 161 -170 150 101 74 85 28 105 215 -21 -90 9 87 167 -161 98 -70 -178 -204 -19 -62 354 -16
4827a6J25l59R8J33R6l21K59J03j57k09K92j22o8J84k01K74j58K07j73j27K86
$$ -16 109 -250 -152 -19 77 -244 15 118 -39 -248 44 -78 -146 38 -163 111 -47 160 -13 -140 146
4848A46j92R2k60J42K88j14k02j44K28j0K0j11M7m2j34K53k9o4M2R3K4m2KJ18
$$ 146 -46 46 -214 -72 216 102 -100 -244 -16 -26 -6 -117 -70 -112 -246 7 -22 -86 -44 49 73 31 33 151
4872A51M6N7j69m0j31j45J47K48j61K93l52R9P5k07J41j45j68J83R4L9j55J0R5
$$ 151 197 254 85 45 -86 -231 -84 164 3 296 -56 43 118 -89 52 -93 -261 -78 16 55 -100 -90 5
4895Er8J01k60J01J25R3r6j95J72J89m17N7M19l3q3K7l19K39L4j89M1R1j62K6
$$ 5 -93 8 -252 -151 -26 67 -29 -224 -52 137 -280 -223 196 163 80 107 -212 27 61 -128 -87 4 -158 -132
4919a32J92L4o52M75K43o9k45J90R1j68J00m2l1l2j66J54Q1j49O6J07k90L92j28
$$ -132 60 94 -558 -83 160 91 -154 36 127 -41 59 17 -14 -46 -212 -58 23 -126 -60 47 -243 149 21
4942B1q6K23k31J14j53K42Nk39P3N0o0J00k53oK97j12r5J78O1l83L01J80m93J44
$$ 21 -65 158 -73 41 -112 130 135 -104 -31 19 -41 59 -194 -200 97 -15 -110 68 129 -254 47 227 -266 -122
4966a22K11L6O7n7k94K10q2J86k77K29j5j10O9l8Qk62P4J84J35k85J74k15L60
$$ -122 89 125 192 135 -159 51 -31 155 -122 107 92 -18 51 13 21 -241 -167 17 152 -133 41 -174 186
4989A86K3j50M0j97L96j99k00J85N9j19J01k26K88k45J63N6j76r0J73o2L2R5k02
$$ 186 209 59 99 -98 298 99 -101 84 143 24 125 -101 187 -58 105 161 -15 -105 68 6 38 133 -69
5012f9K2n9J56l17K06K9k1K24k84j47L45j10j13J84j02K34k52o0%J04o9O6P3J18
$$ -69 -47 -106 50 -267 -61 -32 -53 171 -113 -260 85 -25 -138 46 -56 178 -74 -134 -134 -30 -99 -33 40 158
5036A58k93K9j58L19o4PK5j52J59P4j79J77Qj06j5l4N5j43m4K78j49M2m0OJ95
$$ 158 -135 -106 -264 55 -9 -2 23 -129 30 104 -75 102 110 4 -11 -45 10 -133 -177 101 -48 -6 -46 -40 155
5061A55l41L56k18R4j14J91J3m43K36J69j91J63j75J52Jj60j14L38O4k24p0K72
$$ 155 -186 170 -48 46 -68 123 136 -307 -71 98 -93 70 -105 47 48 -112 -226 112 176 -48 -118 154
5083A54m9p3m4k0J8L6qM2O0j41J8j16j59N56j09k7l3k24J55N2J98m57Q9Q1j91
$$ 154 105 32 -12 -32 -14 22 14 56 116 -25 -7 -123 -282 274 165 138 105 -119 36 88 286 -171 -82 -1 -192
5108a92J09K08O2m31L89j44j16j3J07m8k6L1K27J67m78K14k18J77j41K13J73k50
$$ -192 -83 125 187 -244 145 1 -115 -128 -21 -69 -95 -64 163 330 -148 66 -152 25 -116 97 270 20
5130B0J64j85N7j0j54m4j3L24k59J96l8j75km9J48l8J80J5lk27j80N95k94j79
$$ 20 184 -1 56 46 -108 -152 -165 159 -100 96 58 -117 -119 -168 -20 -58 122 137 134 -93 -273 322 28 -151
5154a51J75J39j15j41J64J32l40J53J45j12m8N0n0M1l8k23N1Q9o8K4q8R5J49J50
$$ -151 24 163 48 -93 71 203 -137 16 161 49 1 51 1 42 4 -219 -168 -79 -147 -123 -211 -116 33 183
5178A83k31K14l6j59K5M7j7K8J30J87l29Q9p1M3r3J14k63L08l07J59k51M58k94
$$ 183 -48 166 130 -29 -4 43 26 54 184 371 42 131 60 103 10 124 -139 169 -138 21 -230 228 -66
5201f6p8J64q0N9j40K4L15k69l3K2J83n2k06J13J11MJ48j90l4J36j73L7l4MO3
$$ -66 -144 20 -60 -1 -141 -117 198 -71 -104 -82 101 49 -157 -44 67 71 219 29 -5 131 -42 -5 -39 -35 28
5226B8j68J21nM3o9j8O6j9k0J9J30k3r1qK8P9n5r9K80l93K25j0J33l21M27q2k10
$$ 28 -140 -19 -24 19 -50 -68 -2 -21 -41 -22 108 85 -6 -14 14 93 38 -61 219 -174 51 41 174 -147 280 198 -12
5253a2l37J94K56p4j10J02K35j34k75J01Q0l3j39K6K08m8K04k91J38Q6q8k21L87
$$ -12 -349 -155 101 27 -83 19 254 120 -155 -54 26 -7 -146 -120 88 40 244 -47 91 177 89 -132 255
5276B55p8k42m6J55J07j16j48J80k6l1j17J1O2M6j62J74n7j53Q0K35q7j37j73
$$ 255 177 -65 -111 44 151 35 -113 67 41 10 -107 -96 -34 12 -150 24 -33 -186 -106 129 42 -95 -268
5299b68K36k6l1J07j48%J23rK6j17Q1q4K55jj69j0j20Q3m8JmJ57J70j64j35n5
$$ -268 -32 -58 -89 18 -130 -130 -7 -16 10 -107 -26 -110 145 144 -25 -35 -155 -72 -120 -119 -123 34 204 40 -95 -150
5325a50J24k0J59m3j28rJ8N3m31K96J96j96m4K1K07K5j7J27l9J5o6m9j95N6K00
$$ -150 -26 -46 113 70 -58 -67 -49 4 -427 -131 65 -131 -175 -154 53 78 61 188 149 164 98 49 -146 -90 110
5350A10k9k0q1l20M06j1j74k3J97R8k36j58J61k9R6j6O5j80J57L2k61K94J03j74
$$ 110 81 61 -20 -340 66 55 -119 -142 55 153 -83 -241 -80 -109 -13 -29 36 -144 13 45 -216 78 181 7
5374GJ94l01K99R2m31L46j91m2Q2nl6l59K54R9Q5l27P9L97k66k5J26K0j30o6Q4
$$ 7 201 -100 199 291 -140 206 15 -27 55 50 14 -345 -91 8 93 -234 -155 242 -24 -49 77 97 -33 -99 -15
5399a5l2j30J49QM55k53k70J67J90k23J15J40l91j16l4K38j09M12l02MO9k14L5
$$ -15 -47 -177 -28 -20 435 182 -88 79 269 46 161 301 -90 -206 -240 -2 -111 301 -1 3 72 -142 -107
5422a07j29K40m1J96k27J39N5m7j26K61j42l8k87K83K03k56p3L5P8k23J09K92
$$ -107 -236 4 -37 159 -68 71 126 79 -47 214 72 34 -253 30 233 -23 -96 -61 17 -206 -97 195
5444A95k31N6LJ71k97P8Q1j11K79k91j68L51qj06j36J56k2K8J04l9n3l4j03j2
$$ 195 -36 20 23 194 -103 -25 56 -55 224 -67 -235 116 108 2 -134 22 0 28 132 93 40 6 -97 -109
5468a09M3k4K62j7N5j05j76J92o6j46L06j05P3k81l2K08p9Q7P8r2j82m8Q0J60
$$ -109 -66 -90 172 155 210 105 -71 121 55 -91 215 110 183 -98 -130 78 -1 86 164 72 -110 -158 -78 82
5492H2L1J44o2R5M2k29j37Oo3l5L88j33%k34J28K9k15K07j6N2k34M2N3jL80l40
$$ 82 113 257 195 290 332 103 -34 -28 -91 -126 262 129 129 -105 23 52 -163 44 28 80 -154 -112 -59 -60 320 -20
5518b0k14L03Pj41Q4k77M62k71k90L37J9k00J45M3l9q8MK27k51J20J78k16j79
$$ -20 -234 69 76 -65 19 -258 204 -67 -357 -20 -1 -201 -56 -13 -52 -140 -136 91 -160 -40 138 -78 -257
5541b57K39m5J14j98L63k75k8J19k24L22j77J4O9j90J45r5Q8j0J18l2M7j21j8
$$ -257 -18 -63 51 -147 216 -59 -87 32 -192 130 -47 -33 36 -154 -9 -104 -16 -26 92 60 107 -14 -32
5564c2N3J52j55Mj0K84l94P5o3j2J68Oj2J52l64K24l1m2R8l1P4l70K03J83j44
$$ -32 21 173 18 22 12 296 -98 -23 -86 -98 70 76 64 216 -148 76 45 3 101 70 144 -226 -23 160 16
5589A6j64M37j40k23p3J96o1K75k01O0r1j61O9j12J86O4p0J25O4j93j89Km3K94
$$ 16 -148 289 149 -74 -147 49 -12 263 62 122 31 -130 -61 -173 13 77 7 132 196 3 -186 -184 -227 67
5613F7k8k08J11l7Q0K2m2Pl4m1J06J13m0j64k8M77n27N5j00K81j87j12M30j46
$$ 67 39 -169 -58 -95 -15 7 -35 -28 -62 -103 3 116 76 -88 -116 361 -166 -111 -211 70 -117 -229 201 55
5637E5q3K62k84J27o4lJ00j57j6k12J99K8J85r0j66K75p3j2q1K65k62j63J39O4
$$ 55 -28 234 -50 77 13 10 110 -47 -63 -275 -76 -48 137 47 -119 156 83 71 -10 255 -7 -170 -31 33
5661C3K4j87R0j17K04J91k63k76M01m2J77k32j63K64j65O6j44J72N2j75J41J6
$$ 33 57 -130 -40 -157 47 238 -25 -301 100 58 235 3 -160 104 -61 5 -139 33 85 -90 51 67
5683F7K60k65J3l25M94j58M0J0J40j85j97J17k01K84l06J2J54LO4j05j84K63M1
$$ 67 327 62 75 -250 244 86 126 136 276 91 -106 11 -190 94 -212 -200 -46 -43 21 -84 -268 -5 36
5706C6j73n6K19M2J11l86L3K43k52L90m6j72M0L7O1j89N0R1k1l7J5k58J97j08
$$ 36 -137 -193 26 68 179 -207 -174 69 -183 207 161 -11 29 66 127 -62 -12 79 58 21 36 -222 -25 -133
5730a33l8K42K7P7l29Q6K09j59j0R1l46K38K46l24n6L50k01J11R8k21q5P9MO7
$$ -133 -171 71 98 175 -154 -68 141 -18 -28 63 -283 -45 201 -123 -179 171 -30 81 179 -42 -127 -48 -44 23
5754B3j56J65L2o3p8j3L06j99l09K52l1m3M3Q5j45J57j77R2L3K39l93M50k30k6
$$ 23 -133 32 64 1 -77 -90 216 17 -292 -40 -71 -114 -71 14 -131 26 -151 -59 -26 213 -180 270 40 14
5778A4n6J20n7r6P4Q0k13p3K94k9k5q8q7L0J35o4Q4j35L11j88m03K16K01r1N6
$$ 14 -42 78 21 -75 -1 79 -134 -207 87 58 33 -55 -142 -112 23 -41 43 -92 219 31 -372 -156 45 -46 10
5803A0J06r7J02k19L9J29pj14Jn5J8Jn1K9O4j5J49j31J46j76K75k19k6o0k11M14
$$ 10 116 19 121 -98 -59 70 63 -51 -50 -105 -87 -86 -137 -108 -44 -59 90 -41 105 -71 204 -15 -41 -101 -312 102
5829A02k22J01NL0K48m03q4K46k4j24o0K06p0q5J21j3O5J25j92J6J58j50J78j97
$$ 102 -120 -19 -14 16 264 -139 -223 23 -1 -125 -185 21 -49 -134 -13 -26 39 164 -28 -12 146 -4 174 -23
5853b3k4J05q3j82L13m5j65p9L09n9j7j09Nk77L69K95k83k99M18k08p1J32L1q
$$ -23 -47 58 -25 -207 106 61 -104 -183 126 67 50 -59 -54 -331 38 333 50 -249 169 -39 -110 22 53 45
5877D5j58K21j05n9Q9j56J12K5mJ55l65K65l23M23l00o7M1o7K25J23j30M7J44
$$ 45 -113 108 3 -56 33 -123 -11 14 10 165 -200 65 -258 165 -135 -202 -161 -228 -3 120 -10 37 181
5900A81k66N9J66k55L87k63j61K08J6L4l35L22l5kK0j62J32j19N1r7p5J64P4R9
$$ 181 -85 -26 140 -115 272 9 -152 56 72 106 -229 93 58 56 76 -86 46 -73 -22 -119 -194 -30 44 143
5924A43l00J16j20K64k53J29p6J1j44P3J47K04k16P2nL44l71J5O4j52M8J48k89
$$ 143 -157 -41 -161 103 -150 -21 -97 -86 -230 -157 -10 194 -22 50 45 389 18 33 97 -55 -7 141 -148
5947a48J19m5p5J45L5O7k46J71j56J74j38J18J01o7j32P8n1kp5J48r3p1J56j75
$$ -148 -29 -74 -149 -4 31 98 -148 23 -133 41 -97 21 122 55 -77 1 -50 -52 -127 21 -72 -143 13 -162
5971a62L19r1j11J13K56k16k67J20l9J82k8jJ23k70j23N7L2K34j52N6o7P7J14
$$ -162 157 66 -45 68 324 108 -159 -39 -78 104 76 75 198 -72 -195 -138 -106 128 -24 32 -35 42 156
5994A56l05J82q1J56q8r4J49o9lk21J89P6j95J21r5P8J47j72R8j24q8L45k90j31
$$ 156 -149 33 -48 108 20 -74 75 6 3 -218 -29 47 -148 -27 -122 -44 103 -69 29 -95 -183 162 -128 -259
6018b59L48K31n38J86k8j3j16J02J49J9j3j1j41J23p8j6N9J15j0j72M9p9KK7n
$$ -259 89 320 -218 -32 -60 -73 -189 -87 62 81 68 57 -84 39 -39 -55 4 119 109 -63 -14 -93 -91 -64 -69
6043f9Q8R9q3j27J84j68o9J11N2j13J27k57L90p7k72L47m3mNq6Rn8j0K28k32R0
$$ -69 19 118 35 -92 92 -76 -145 -34 18 -95 32 -225 165 88 -184 163 120 116 121 35 44 -14 -24 204 -28 62
6069F2J59j82J72j63J19k24M7j58L34k47J38j76J9J35l42M55k75K8r6L53%P3k65
$$ 62 221 39 211 48 167 -57 -10 -168 166 -81 57 -119 -100 35 -307 148 -127 -99 -195 158 158 231 -34
6092c4J29r4N1Q6k79K23N4J18m90L30rk5j7Mj90L82l73K88l67K06K73k36j22O6
$$ -34 95 1 52 138 -141 82 136 254 -236 94 85 60 43 47 -143 239 -134 154 -213 -7 266 30 -92 -26
6116b6K23M1l65O5J02o7J70j39J9j00r4J6K35k85R8J65J11k33K24j97J40k53j57
$$ -26 197 238 -127 -62 40 -27 143 4 23 -77 -171 -155 80 -205 -107 58 169 -64 160 -37 103 -150 -307
6139c07M17l5r4M9n4J02J33j71L5Kj84O2J04P7Pk05K07O8k77K18p2P4q4n0J4j52
$$ -307 110 75 -19 30 -24 78 211 40 75 77 -107 -45 59 136 143 -62 145 213 -64 154 82 156 72 22 36 -116
6165a16L3J12QJ3k04J06J06j63j49j9J98O7j3L1o9L1L0O5o6NO2k87L37k51K98
$$ -116 -83 29 37 50 -154 -48 58 -105 -254 -273 -75 -8 -21 10 -59 -28 2 67 1 6 68 -219 118 -133 165
6190A65j23J04L7L5l02O6M08l86Q2k44J87j46j7J52n6o8J2p6J60n6m0j3J34j37
$$ 165 42 146 183 218 -84 -18 390 4 86 -158 29 -117 -134 18 -38 -106 -94 -170 -10 -66 -106 -119 15 -122
6214a22J73j31M6K7K93l23L6K53l80K29j25r1K64k5j12l6L8J2q8J18k0M8j72J85
$$ -122 51 -80 -34 -7 286 -37 -1 252 -128 101 -24 -115 149 124 12 -24 14 26 -62 56 36 84 -88 97
6238I7k9L10o77K27j1L1l2J24R6J15q4l67M7L23o4L1l19L87o6j48l9o7Q1L1r2
$$ 97 68 378 -299 -72 -83 -52 -84 40 136 251 167 -200 -153 170 106 137 -182 205 139 -9 -48 -115 -34 -3 -95
6263i5R1J60j3j08k09J32P4k36K22J49J30m50K01q5N55p03LK56k97K75K12k89
$$ -95 -4 156 143 35 -174 -42 32 -204 18 167 297 -153 48 -37 518 -185 -182 74 -223 52 264 -25
6285b5R6j33oK63l54J30J69q5k12K24k77l0K05j46J78k9P8J85r2J04j21k7j79
$$ -25 71 -62 -68 195 -159 -29 140 55 -157 67 -210 -240 -35 -181 -3 -32 46 231 139 243 122 95 -84
6308h4J88K44l48j13K06j9n7O0l4n5Q8m84M68Pp4L8o1n6Rm7M8K46k82j30L08K61
$$ -84 104 348 0 -113 93 74 17 77 43 -12 76 -408 60 67 -7 31 -30 -86 -77 -124 -76 170 -112 -242 66 327
6334C27l30q4J1J31j5J18j28k3j55L01M2k35k14M08j02j34j11L71j78j49K65j03
$$ 327 -3 -87 -76 55 40 158 30 7 -148 153 195 -40 -254 154 52 -82 -193 178 0 -149 116 13
6356A3K72l25j71K35j79O3K26m5o5l6j8K14j11K5j9r3J81k84R4N4o3J1r4J07j02
$$ 13 285 -40 -211 24 -155 -92 134 89 24 -12 -30 184 73 98 79 -14 167 -117 -23 31 -32 -21 -115 -8 -110
6381a10J40J16n6j69q2L13j89l2K6m7M0J0r2L29k04J29j60j4q0J45k57K28j46
$$ -110 30 146 90 -79 -161 152 -37 -69 -43 -90 -50 -40 -132 197 -7 122 -38 -52 -132 13 -244 -16 -162
6404a62J05j29K85L02k14j46K07j42m0k1j14J1k1J86l49J41J61k09O8j32j8J12
$$ -162 -57 -186 99 401 187 41 248 106 66 45 -69 -58 -79 107 -242 -101 60 -149 -81 -213 -231 -119
6426a19l20M51J55k00K2j03J35R1j05k9j8M8Q4j82J30QP3R8l28L2k00N01l00J77
$$ -119 -439 12 167 -33 -11 -114 21 112 7 -22 -40 8 92 -90 40 48 121 219 -109 -77 -277 224 -76 101
6450A01k02R9k9m6j97L09j08Q2j7q5k9P6J77k76R6p5J20O3j16O8p3Nl3Q8J65j77
$$ 101 -101 -2 -31 -77 -274 35 -73 9 -8 -93 -122 -46 131 -145 -49 -124 -4 59 -57 11 -62 -57 -90 -2 163 -14
6476a4O6j5J8J00l86jM15k87j6Q1K14k18j50M39j2j10J38l56m0K21k1p0J32j50
$$ -14 52 37 55 155 -231 -232 183 -104 -120 -39 175 -43 -193 246 234 124 262 -94 -134 87 66 -4 128 -22
6500b2J18j81J6L47k60k05J02J72p4j03Q9j63J98j00L4J89p5N0m23J17K62j10
$$ -22 96 -85 -69 278 18 -187 -85 87 13 -90 -1 -164 34 -66 -32 157 82 132 -291 -174 88 -22
6522b2j33J84j98J07K60k42J88k23K01k19J94j51J56J87l10j02L9K0K85k28Q7
$$ -22 -155 29 -169 -62 198 -44 144 -79 122 -97 97 -54 102 289 -21 -123 -84 -64 221 -7 80
6543H0J61n14K15J9q9L77m97Q5N19l30J20j05q2J34Q5k85K08J5%r5Q1j78J3j85
$$ 80 241 -273 -58 -39 -128 249 -248 -163 356 26 146 41 -41 93 178 -107 101 116 116 21 102 -76 -63 -248
6567b48K54K11l13j11K00M8k67Q9J84L8j60j17J88N6j04J21k53R0J83P6o6l16
$$ -248 6 217 -96 -207 -7 41 -226 -137 47 85 -75 -192 -4 52 -52 69 -184 -94 89 165 99 -217
6589b17J71l5L29p6m6K50l05j06mk9K39k42K15l52L88m5l51K49k25J74Jr1L5P7
$$ -217 -46 -81 248 172 126 376 71 -35 -39 -68 171 -71 144 -208 180 135 -216 33 -192 -18 -17 -108 -73 4
6613Dm6R5Q6k37K30l93K95R1r8k60K00L8J55j98p9J48j13R5j20N9K1j50P3K34
$$ 4 -42 53 139 -98 132 -261 34 125 27 -233 -33 5 160 -38 -117 31 -82 13 -107 -48 -27 -177 -104 130
6637A30j60j6k0J97k45K33j87r8O0K35j93K4J59l4N3O5j16O3l6k2j37n5k3K29
$$ 130 -30 -46 -66 131 -114 119 -68 -166 -106 129 -64 -40 119 85 138 203 87 150 114 92 -45 -100 -123 106
6661A06j75r4K30J1l03K04J30k96J66J24l3j38j17M66k33k73M63j99j38J06r0
$$ 106 -69 -163 67 78 -225 -21 109 -187 -21 103 70 -68 -185 281 48 -225 238 39 -99 7 -83
6682h3J35J00k28J16k1R1j96K56k04M5J92j8k23NM1J27k45K80k71L7J20l4j32
$$ -83 52 152 -76 40 19 110 -86 170 -34 11 203 185 -38 -33 8 135 -110 170 -101 -64 56 22 -110
6705a10K7J6j92K76J04mr1q1K07k08r8J59q9o0J15M4k7j59K6j70L48q7J29lj20
$$ -110 -83 -67 -259 17 121 117 26 -55 152 -56 -154 5 -84 -144 -29 15 -12 -171 -145 -315 33 -54 75 72 -48
6730d8R5kj54k5q0J45K41j78J0J75k33k38J85O7N3K1j61k2J87k24J73R9j10N8
$$ -48 47 45 -109 -134 -214 -69 172 -6 4 179 -54 -292 -107 -40 13 34 -127 -149 38 -186 -13 86 -24 34
6754C4j70N0P5r8J29No2L9m6J32r4pj28l5K08j57J62m7j17J35j98J66K28k66K34
$$ 34 -136 -86 -11 -109 20 25 -37 2 -44 88 -6 -13 -141 -176 32 -125 37 -10 -127 8 -190 -24 204 -62 172
6779A72k44RJ54l01L45k6j85J40j86J77K1r8j12j7R8J40l3m7P6k6k2p2J24r3J27
$$ 172 -72 -63 91 -210 135 109 -76 64 -122 55 76 -22 -134 -151 -53 87 54 7 83 57 35 -37 87 -6 121
6804A21l33K26K4J10j15J02k23L0q9O7K49k69J13j41J58j04j50K59m8R3J72k11
$$ 121 -212 14 38 148 33 135 -88 -58 -147 -80 169 -100 13 -128 30 -74 -224 35 -13 80 252 41
6826D1j59J8Q6r5k2rL23k87J93j24M17k31j20K8J1N0j30K39l83NJ82Q1l2p5j07
$$ 41 -118 -100 -14 -109 -131 -140 183 -104 89 -35 382 151 31 59 70 120 -10 229 -154 -149 33 114 82 7 -100
6851a00K13J33j96Mk83J59k10L81j64k8K20k28J20j92K9J21P5p6J00l00K07L06
$$ -100 113 246 50 54 -229 -70 -280 101 -63 -91 129 -99 21 -171 -142 -21 54 -22 78 -222 -15 291
6873B91k93j43J59j9k58K11J75m09L52J76l50J40k84L20O5l25K61n9O3k4p8R1
$$ 291 -2 -145 14 -5 -263 -52 123 -286 66 242 -108 32 -252 68 133 -192 69 10 73 49 -29 62
6895F2j36J65m71L21J22L6j91N8NJ34J9R5l15kJ71j51N0P1J24l80J41L0J90k40
$$ 62 -74 91 -380 -59 63 99 -92 -34 -29 105 124 219 -96 -98 73 -78 -28 43 167 -213 -72 -42 148 -92
6919i2p3J35j56J82P7L4j31j11O8n7J14L20j66j11L4k66K11M63m08k9j6M6j84
$$ -92 -165 -30 -186 -4 73 107 -24 -135 -67 -124 -10 310 144 33 67 -199 12 475 67 38 22 68 -116
6942a16P7J67k63K26m05K32L11k24J20k55q4K41j14m2Q3K59k49k0J08q7k21L21
$$ -116 -39 128 -135 91 -314 -82 229 5 125 -130 -214 27 -87 -129 -46 213 -36 -56 52 -35 -256 65
6964F5P3j97p4J80J54o4NM3l68K16n8K77m38K66k43K69m1j22l3p7J25J17r9O6
$$ 65 138 -59 -133 47 201 137 142 185 -183 33 -25 252 -186 80 -163 106 65 -57 -90 -167 -42 75 -24 42
6988D2M6J76k73q6K21k08K5J75m7j91L7K85l22K50j42K6j7kO7rJ03l57K62j53
$$ 42 88 264 -9 -95 126 -82 -57 118 71 -120 -83 202 -120 130 -12 14 -3 -5 62 53 156 -201 61 -92
7012i2Nk9K20k40L7n7L02m17K27J08j39L4M2j99JN1L36m4j87J17j20RJ06O1j92
$$ -92 -87 -116 104 -136 -99 -156 146 -271 -44 64 -75 -41 1 -198 -197 -146 190 146 -41 76 -44 -35 71 132 -60
7037f0J12L4j90J15R1J0o2q6J38j73MMp4J54m9J07j28oKk4l4n5J11O7p1J62k3
$$ -60 52 86 -104 11 102 112 50 -36 102 -71 -67 -63 -137 17 -32 75 -53 -59 -57 -81 -115 -170 -59 8 -63 99 76
7064G6J14k79l5j1K44k03L2K55k28J97l2O1k05K10jl11J15J34p2r2j26K03Pr0
$$ 76 190 -89 -124 -135 109 -94 -62 193 -35 162 130 191 -14 196 195 -116 -1 133 61 -31 -157 46 53 -37
7088c7J58q9k21K90J05l89J68p9J42j05m1Ol5K73Jj09J40k33mp6O5Q3k08Q2M6
$$ -37 121 32 -189 101 206 -183 -15 -94 48 -57 -98 -92 -127 146 147 38 178 -55 -59 -135 -70 13 -195 -113 -67
7113f7P8k74K40Q4j70l10L63P4O4J8J8r2j79M2j97K64j26%K80L2j30M2r8J45j9
$$ -67 11 -263 -23 61 -109 -419 -56 18 82 100 118 26 -153 -111 -308 -44 -170 -170 110 142 12 54 -44 101 82
7138H2m2J87o6l88J82j19K21l51K72J09O8r1k09R1K01l6k45L21O9k39O4P7r4k1
$$ 82 40 227 161 -227 -45 -164 57 -294 -22 87 155 64 -145 -54 147 111 -134 187 256 17 81 158 64 43
7162D3N1m01J63K32q1M5J1j39pMk8O8OK22l30K21K5m7K41l12L00k54M5j39J24
$$ 43 94 -307 -144 88 7 52 63 -76 -83 -79 -107 -39 -33 189 -141 80 105 58 299 -13 287 33 78 -61 63
7187F3j3n5J4l13L84j13J17k70L74k00J12n26L22j08J18J04nR3J60p7j20j13P
$$ 63 50 -5 9 -304 80 -33 84 -186 188 -12 100 -426 -104 -212 -94 10 5 98 258 181 61 -52 -45
7210d5J00J90k52j35K43k3j28q8K92j46J5j07J56jp2m8L06j52P0j96q7M6K92k10
$$ -45 55 245 -7 -142 101 78 -50 -138 154 8 23 -84 72 71 -1 -49 257 105 175 -21 -108 -62 230 20
7234B0j11J97O6O3k76R8J08K4J7l59K4K55n1L8k3j06J15j2oJ12j32p0J38l25J66
$$ 20 -91 106 172 235 -41 57 165 189 206 -153 -129 126 75 113 90 -16 99 87 81 193 61 -9 129 -196 -30
7259c0l4m5K73q3k14o5K4K00J7p2K17k23l24L87J76k35K25k30m5J39j98R7J43
$$ -30 -64 -109 164 81 -133 -198 -174 26 43 -29 188 -35 -359 28 204 -31 194 -36 -81 58 -140 -43 100
7282A00j52J6J14k8j7j4k85N25j53n8K00j2k69k8M2j54L34q4j94j54J11K56O3
$$ 100 -52 -36 78 50 33 19 -266 259 106 48 248 236 -33 -61 -19 -173 161 77 -117 -271 -160 96 159
7305A59n6k49P9M77l36j73j08J96k03L36l1n3j88K01m8k88K86j2J05k35K85k15
$$ 159 103 -146 -67 410 74 -99 -207 -11 -214 122 91 38 -150 51 3 -285 1 -11 94 -141 144 -71
7327g1K20n2q0j54P2j22J9J51J11j22LP6n2J2J00J52m73M28k06jj2J5KQ9j0j13
$$ -71 149 97 17 -137 -65 -187 -168 -17 94 -28 -25 51 -1 11 111 263 -210 218 12 11 -1 14 16 105 95 -18
7353a8j7o6K64j73l3N6j9j67Q9J79n1qj63NL89j91j73N6K1P7P8k88O6l3q2K48
$$ -18 -35 -101 163 -10 -43 13 -6 -173 -84 95 44 36 -127 -122 267 76 -97 -41 -20 57 135 -153 -87 -120 -202 46
7379D6k9O0lj61J73j49J33q3j45K87j07L5L4r3L3j18L7K91j15j6Np1Q4q3q3J56
$$ 46 17 77 74 -87 86 -63 70 -13 -158 129 22 57 91 -2 31 -87 -50 241 126 110 115 44 128 45 -38 118
7405A18J21l35n5N6j08M08l23p8K07K17l7p3k71J76J86k49P7k48K83J07l78J09
$$ 118 239 -96 -151 -95 -203 205 -118 -196 11 228 191 118 -153 23 209 -40 37 -211 72 179 -199 -90
7427i0J99J8k81K13j31J75l10j7M0J19L1N6N1l89M54k05Q2K6o0R5J15k0k43m8
$$ -90 109 127 -154 59 -72 103 -207 -224 -184 -65 -34 22 73 -316 138 -67 15 41 -19 76 191 171 -72 -120
7451a20QJ45r0M6j13L08j51J61l70L03R0k60l0L97l48q0L1j07J54J70j31j27J20
$$ -120 -112 33 -57 -11 -124 184 33 194 -176 127 217 -43 -73 324 -24 -104 -73 -180 -26 144 13 -114 6
7474FJ8Nk35K43j66J85p6K64l68J35NRj67K41J03j84J11n4j71J42K06l06N8J66
$$ 6 24 29 -206 37 -129 56 -20 244 -124 11 16 25 -142 99 202 18 129 75 -96 46 252 -54 4 170
7498A70k64L13l42K61l17q0L09J36p2k03L52l04o7L7Q7j14l9j19M5L2J07J16j32
$$ 170 -94 219 -123 138 -179 -259 50 186 114 -89 263 -41 -108 -71 16 -98 -137 -256 -211 -179 -72 44 -88
7521h8K64j67p8J71r3K77l93K65l49J53p4K28k40L06k52K07P0k39l7K7j62M22
$$ -88 176 9 -69 102 9 286 -107 158 -191 -38 -112 116 -124 182 -70 137 207 -32 -69 -42 -204 218
7543B18k74Q8o4l2k6K6K19l40M20k48K31l66J80j1J19p9q0J4j55K15N4j5K98n77
$$ 218 -56 32 -32 -64 -90 -64 155 -185 235 -13 218 -148 32 21 140 61 -19 -5 -160 55 109 94 392 -185
7567a85J23j23qJ05k3n3K00o3J18Jrj84K32l1j44K25j84N4p6K48%l28j24J66J56
$$ -185 -62 -185 -193 -88 -111 -164 36 -27 91 92 83 -101 131 100 -44 181 -3 51 -25 223 223 -105 -229 -63 93
7592I3j31M8O4j31j3j13P4R0l6J40n3R2j64j81K03q4M5N0o3RM7K74j40o7q1J75
$$ 93 -38 10 74 -57 -70 -183 -109 -19 -55 85 32 124 -40 -221 -18 -102 -57 -7 -70 -61 -14 260 120 53 -28 147
7618A47q4J3l7l0r3L30l57oj61M07j44J7l7J13p9j88N1J89j16J19j58J95P1j04
$$ 147 63 76 39 9 -84 246 -111 -117 -278 129 -15 2 -35 78 -1 -189 -138 51 -65 54 -104 91 162 58
7642E8L2k27L18Q5m09O8J87j63J56q7K72j75k73J30R8N8p8J51l0q5k75m1L23j84
$$ 58 90 -137 181 266 -143 -75 112 -51 105 18 290 115 -158 -28 70 128 50 201 171 86 -189 -230 93 -91
7666i1R6J86j87n3J82k66P5J3j61L32k13J31p3J1k28K98q3N3k6pJ1O3k89K24o0
$$ -91 5 191 4 -49 133 -133 -58 -45 -206 126 -87 44 -29 -18 -246 52 -31 22 -4 -11 0 63 -226 -2 -62
7691f2J8K02k02K5nr6J12r2M5J65l87N14m68L11J4q4j00K3m7J80o7J30k50J76
$$ -62 -44 158 -44 -19 -24 -120 -8 -100 -55 110 -277 237 -231 80 94 10 -90 -67 -114 66 -1 129 -121 55
7715E5R7k63n1L58j07JN3k56L01j52l3K0j88K43j18K00l10J1P9M0q6J94j2j50
$$ 55 152 -111 -162 196 89 90 143 -113 188 36 3 23 -165 78 -40 160 -150 -139 -60 -20 -106 88 76 -74
7739g4k7pK77j1r5r4R5J3o0LL8J67k35K59m20J95j2q6J25k00J95Q9k63K11n3N7
$$ -74 -101 -108 169 158 63 -31 64 77 17 20 58 225 -10 249 -171 24 12 -74 51 -149 46 135 -128 83 30 87
7765H7n0k11Q5j67J79J52o9L1J36j35o1j9N7k04oK84N2k38J90j19QJ05o4O6j62
$$ 87 37 -174 -89 -256 -77 75 6 37 173 38 -23 -42 15 -189 -195 89 141 -97 93 -26 -18 87 23 89 -73
7790g3k11L26n3k55K40K52k64p2N6k8K15N4m58L47j72O1J1L9l2k2K30k96R9J61
$$ -73 -284 42 -11 -266 -26 226 -38 -110 -54 -82 133 187 -271 76 -96 -35 -24 15 -17 -39 191 -105 -6 155
7814A55k42k24J99J54L5j63J57L3k57J80Q8p4j70K29j49R3J36k54J14m8o2J17
$$ 155 -87 -311 -112 42 77 -86 71 104 -153 27 115 41 -129 100 -49 44 180 -74 40 -8 -70 47
7836D7K6j16k77K98J86j70j07K13j06K15k90N2P3M3k59K7K34j2k2O7m6j00m7J67
$$ 47 73 -43 -320 -22 164 -6 -113 100 -6 209 -81 -29 44 87 -172 -145 89 77 55 122 76 -24 -71 96
7860I6J04k75J87r7J39j10p9K20l7j50Q5j14J96k94K47M5p3l3P5l03J72J03l03
$$ 96 200 -75 112 15 154 44 -35 185 148 -2 83 -31 165 -129 118 163 90 57 132 -171 1 104 -199
7883a99J51K89j96k71J52L7K48l21K01r9q2j03K27k3q6Q4O0%k83L06j78NJ53l
$$ -199 -48 241 45 -226 -74 -37 211 -110 91 -8 -90 -193 34 11 -75 9 69 69 -214 92 -86 -81 72 69
7907F9q8O0J32l40K90j78K2l0P8k55K08L9j88R9J45J25k30J30q5l4J85o5l5j9
$$ 69 -19 41 173 -167 123 -55 -33 -63 15 -240 -32 7 -181 -82 63 188 -42 88 3 -31 154 89 54 35
7931C5k29K35J73k87J93R6j49l9pl5J71l6k1j93J69q0r2J17N0k13L7J49k92L55
$$ 35 -194 41 214 -73 120 216 67 28 21 -14 157 121 100 -93 76 -4 -96 21 71 -142 -105 44 -248 107
7955A07k6NPK77j14j98J11K1k25J80l39Q7J4K12r8L0o5q4J53Q0j10j27J8lJ13
$$ 107 81 86 93 370 256 58 169 190 -35 145 -194 -107 -93 119 21 51 -14 -98 55 135 25 -102 -84 -87 26
7980B6L58m96L2K04j69j62P9K03k8j4n1J07J94k90M4l1Q5j0o8J10j66K86l05J5
$$ 26 384 -112 -80 124 -45 -207 -128 75 47 33 -18 89 283 -7 37 6 91 81 13 123 -43 243 -62 -47
8004d7j87K58k44K97m3p7p0J84o9j10P1K9j09L99j85k14R2m0j44K94k5j99R5o5
$$ -47 -234 24 -220 77 34 -43 -113 71 2 -108 -37 -8 -117 282 97 -117 -25 -65 -209 85 60 -139 -44 -109
8028a09q2L36k39p8K42n8O3k24L06j76K94l0l44P8m5P9J66P9l78j4K44J81k74
$$ -109 -191 145 -94 -172 70 12 75 -149 157 -19 275 245 -99 -21 -66 13 179 258 -120 -134 110 291 17
8051A7J40l97J23L32q9m6M3m58N17k23J63Rp6p3O2K15j4k29k87K85Q4q2J38j66
$$ 17 157 -240 -117 215 126 80 123 -335 182 -41 122 131 55 -18 44 259 245 16 -271 14 98 16 154 -12
8075a2l0J92j96J37R2J3m2k40J33j3R2j00L5rMO4j36R1m8k10J48P4k78M16l62
$$ -12 -42 150 -46 91 183 196 154 -86 47 34 126 26 61 52 56 120 -16 75 27 -183 -35 39 -239 177 -185
8100a85J75j88J34j15J60r3L6j38L85l46J76M2N8r8r9K57j6m40J63J29p4J27o1
$$ -185 -10 -198 -64 -179 -19 -112 -76 -214 171 -175 1 43 101 3 -96 161 145 -295 -132 -3 -77 50 -11
8123a1L6k9L2j95K81l37q4K99p6J37j59L37l02j92J62nK04M9j76O9KJ07k60p1
$$ -11 25 -4 28 -167 114 -223 -307 -8 -84 53 -106 231 -71 -263 -101 -106 98 147 -29 40 42 149 -111 -182
8147a82J07m9L57m59M33j4k26p8LJ20j82J99M9O3j79O3j19L5R9R1p1k25K73j32
$$ -182 -75 -124 233 -226 207 193 -33 -111 -108 12 -170 29 78 141 -38 25 -94 -59 40 131 60 -165 108 -24
8171b4q1j08J07N4p6J96oO4J08l07N3k7J14Q2k03P4q7N6J09l3
$$ -24 -105 -213 -106 -52 -128 68 62 126 234 -73 -20 -47 67 149 -54 20 -67 -11 98 65
8191F5
$$ Imaginary data points
##PAGE= N=2
##DATA TABLE= (X++(I..I)), XYDATA
0@%%%%%%%%%%%%%%%%%%%qJ6j6J6j6J6j9K7l2L2l8M6m9N7o5P3q3R2j05J17j29J43
$$ 0 0 0 0 0 0 0 0 0 0 0 0 0 0 0 0 0 0 0 0 -8 8 -8 8 -8 8 -11 16 -16 16 -22 24 -25 32 -33 40 -43 49 -56 61 -68 75
41G5j60J78j96K18k40K64k93L24l57L91m31M76n25N80o41P12p93Q88j003J139
$$ 75 -85 93 -103 115 -125 139 -154 170 -187 204 -227 249 -276 304 -337 375 -418 470 -533 606
61F06j304J514j790K169k720L600n240R263l6313m9648Q8827L0055m1638L798
$$ 606 -698 816 -974 1195 -1525 2075 -3165 6098 -30215 -79863 8964 39019 -2619 1179
75A179K2699k0950L969m81j2865J7951R240k3205J66O503j7893K172K4046q700
$$ 1179 23878 2928 6897 6416 -6449 11502 20742 -2463 -2297 4206 -13687 -11515 12531 3831
89C831j3091L250L422J462m290l063N277K225l588l015k987L160K4322N412l2604
$$ 3831 -9260 -6010 -2588 -1126 -5416 -8479 -3202 -977 -4565 -7580 -10567 -7407 16915 22327 -10277
104a0277N98K5163j4760q924K5690r69j7995P989q511j8109K4813J5311k2881
$$ -10277 -9679 15484 724 -8200 17490 16521 -1474 6515 -1996 -20105 4708 20019 -2862
117b862k614P025j5779n74J5813m227J130J4102j2438j0644J6428O5j1142R887
$$ -2862 -5476 1549 -14230 -14804 1009 -3218 -2088 12014 -424 -11068 5360 5425 -5717 4170
131D170O964j6544r920J0650J2285l81j1723L62J3028j322q546N651M427o298
$$ 4170 11134 -5410 -15330 -4680 7605 7224 -4499 -4137 8891 7569 -977 4674 9101 2803
145B803n613m801j164P942J149n789R580N129j4711j910J3517m59m622L527m656
$$ 2803 -2810 -7611 -8775 -833 316 -5473 4107 9236 -5475 -7385 6132 5673 1051 4578 -78
160g8o457K290m280k913J5099P815j2985o411P875L469p56J417j189k554j312
$$ -78 -6535 -4245 -8525 -11438 3661 11476 -1509 -7920 -45 3424 2668 4085 2896 342 -970
175i70l58J911L212P10j909l067r31J704J784L36o75k438m831p55K903K433J568
$$ -970 -1328 583 3795 4505 2596 -471 -1402 302 2086 2422 1747 -691 -5522 -6277 -3374 -941 627
192F27L01l763j218K976j902l638P345Q010o271p587N195N461k829j555M239K212
$$ 627 928 -2835 -4053 -1077 -2979 -6617 728 8738 2467 -5120 75 5536 2707 1152 5391 7603
208G603k195p274m432P055O506p466n549O637K9q108K956Q310k303p238k017K622
$$ 7603 5408 -1866 -6298 757 7263 -203 -5752 885 914 -7194 -4238 4072 1769 -5469 -7486 -4864
224d864L862m99k103N039M971q195n754Q812R206j894o599l027K635J812l812
$$ -4864 -1002 -1501 -3604 1435 6406 -1789 -7543 1269 10475 8581 1982 -1045 1590 3402 -410
239d10K49N297j651m689Q03m03k432K271J291j501M57l284m838N657N152m731
$$ -410 -161 5136 3485 -1204 -401 -804 -3236 -965 326 -1175 -718 -4002 -8840 -3183 1969 -2762
255b762J37M225l745o27N788j078r66N265j667o481J323L631J820O83m272l179
$$ -2762 -2625 1600 -2145 -2772 3016 1938 972 6237 4570 -1911 -588 3043 4863 5546 1274 -1905
271a905L793j945n929N588O483n020o194O4J930L388p12l555L723J294q065O67
$$ -1905 1888 -57 -5986 -398 6085 1065 -5129 -5065 -3135 253 -459 -4014 -291 1003 -7062 -6395
287f395R588n31m251L975R90k395L44l26K289N342o653r455O716P226o198l200
$$ -6395 3193 2662 -1589 2386 3376 981 1325 999 3288 8630 1977 -7478 -762 6464 266 -2934
303b934M102N68j185j945l205K926M990l794l223J944j627j866L396K833J649
$$ -2934 1168 1736 551 -1394 -4599 -1673 3317 -477 -3700 -1756 -3383 -5249 -1853 980 2629
318B629L83m458j275M724Q54k230L122k4n108j055J635J816L483j397o572J747
$$ 2629 3012 -1446 -2721 2003 2857 627 3749 3725 -1383 -2438 -803 1013 4496 3099 -3473 -1726
334a726M765m018j017M450r36l351n65j762J856N996k091o064L975K497n325n90
$$ -1726 3039 -979 -1996 2454 1518 -1833 -2398 -4160 -2304 3692 1601 -4463 -488 2009 -3316 -3906
350c906N035J799p74k376k951K319K716k138O54M347k506n085M18L525J703p30
$$ -3906 1129 2928 2154 -222 -3173 -854 1862 -276 378 4725 2219 -2866 -2448 1077 2780 2050
366B050k477J135K766m480l830O413M107o408m155K704J765R6k071n37M290q2
$$ 2050 -427 708 3474 -1006 -4836 1577 5684 -724 -4879 -2175 -410 -314 -2385 -2922 1368 1286
382A286p657Q65Q966J35m724J925R14k434J36J617J892L230l083n913K450L675
$$ 1286 -6371 -5506 3460 3595 -1129 796 1710 -724 -588 1029 2921 6151 3068 -2845 -395 3280
398C280l084n1K853j792k295n10j730J385K013k455o07K417k404k144M046P72
$$ 3280 196 145 2998 1206 -1089 -1599 -3329 -1944 69 -2386 -2993 -576 -2980 -5124 -1078 -306
414c06l15L338k265l641M963L575l053O0J229k232j10k93j414M708J812q158k654
$$ -306 -621 2717 452 -3189 1774 5349 2296 2356 3585 1353 1243 950 -464 4244 6056 -2102 -4756
431d756N262q90l148L142J223l070k702j271L051N589k775l141M748J410n416
$$ -4756 506 -384 -3532 -390 833 -2237 -4939 -6210 -3159 2430 -345 -3486 1262 2672 -2744
446b744N64M251J004J09j972j610L838K75n004L133N477n969m653K802O85j070
$$ -2744 -2180 2071 3075 3184 1212 -398 3440 3715 -1289 1844 7321 1352 -3301 -499 186 -884
462h84N05l491k25M119k841l017P030K679n451K34J698j961J153K202q99J334
$$ -884 -379 -3870 -4095 24 -2817 -5834 1196 3875 -1576 -1342 356 -1605 -452 1750 851 2185
478B185m83m931J659M695o32l1J005k352j762J431j753l39L154j398k581M07r14
$$ 2185 1702 -3229 -1570 3125 2493 2462 3467 1115 -647 784 -969 -1308 1846 448 -2133 -1726 -2640
495b640J019L457k308k306M548o30n204L254M173l274j696J343m33J502P6k174
$$ -2640 -1621 1836 -472 -2778 1770 1140 -4064 -810 3363 89 -1607 -264 -697 805 881 -1293
511a293K271K907n316k858N398J736l002R43J370j180j440j033J807L427j452
$$ -1293 978 3885 -1431 -4289 1109 2845 -157 786 2156 976 -464 -1497 310 3737 2285
526B285m469Q99J010j977j55J448K067O73l711k224M204K663l828j47L206j874
$$ 2285 -2184 -1285 -275 -2252 -2407 -959 1108 1781 -1930 -4154 50 2713 -1115 -1262 1944 70
542G0k481J422R01R70J290k273m40L630p80k058K758O03l932q92J457j095j85
$$ 70 -2411 -989 -88 882 2172 -101 -541 3089 2309 251 3009 3612 -320 -1212 245 -850 -1035
559a035J451j088j979N92N26p14R27K029M17k140j603P00J881N61j76M95J404
$$ -1035 416 -672 -2651 -2059 -1533 -2247 -1320 709 1126 -1014 -2617 -1917 -36 525 349 844 2248
576B248m79k456j12M023J300l947j414K619ok765J67K116m87j844j362M35J707
$$ 2248 1769 -687 -799 3224 4524 577 -837 1782 1776 -989 -822 1294 807 -1037 -2399 -1964 -257
593b57k69k529P51K192j860k905L937M632k728l207K522L002j918j128J354J444
$$ -257 -526 -3055 -2304 -112 -1972 -4877 -940 3692 964 -2243 279 3281 1363 235 1589 3033
609C033j79k256k978L004K392k798q59K971j061l604J016J648q91p83n3j037L24
$$ 3033 2854 598 -2380 624 3016 218 -641 2330 1269 -2335 -1319 329 -562 -1345 -1398 -2435 -2111
626b111M06l79J046J612l86o51J32Q81J091K82j165J00L5p85P24L63J99R29q67
$$ -2111 -1705 -2084 -1038 574 188 -463 -331 550 1641 1923 758 858 893 108 832 1195 1394 2323 1456
645A456l478Q35L686k224j969K099m92k521P58k11N11L038j497l332K589K422
$$ 1456 -2022 -1187 2499 275 -1694 405 -87 -2608 -1850 -2061 -1550 1488 -9 -3341 -752 1670
661A670l659M86M070j038k373N97P97J135J70j581N77K126k513k597K401J834
$$ 1670 -1989 -1503 2567 1529 -844 -247 550 1685 1855 274 851 2977 464 -2133 268 2102
677B102r08k263m98R68P05j677J2L449j196l630Q14K118m31Q03j87j071J636n41
$$ 2102 1194 -1069 -1567 -599 106 -1571 -1559 1890 694 -2936 -2122 -4 -435 368 181 -890 746 205
695B05k705K661L633l038j537K303j350j380K549P6j152J268j429k193K209J246
$$ 205 -2500 161 3794 756 -781 1522 172 -1208 1341 1417 265 1533 104 -2089 120 1366
711A366j553O18L11j776j15P52r72J276J560j868j893J235O10O31L9o34J181M4
$$ 1366 -187 431 742 -1034 -1149 -397 -1369 -93 1467 -401 -2294 -1059 -449 182 221 -413 768 812
729H12k773L58L737k82j992N71L13m48K52k35P20K141j969l947K350K125k514
$$ 812 -1961 -1603 2134 1852 -140 431 744 296 548 313 1033 3174 1205 -2742 -392 1733 -781
746g81n50J927m54j651o77l5K163J290k645p24K673o37k543K233K338m33j769
$$ -781 -1331 596 142 -1509 -2186 -2221 -58 1232 -1413 -2137 536 -101 -2644 -411 1927 1494 -275
763b75l05R27J913r06p35J518J87k446l74J312j79j1n08j187k03O8l99N03J484
$$ -275 -580 347 2260 1354 619 2137 2324 -122 -496 816 637 626 118 -1069 -1272 -1204 -1603 -1100 384
782C84j288j066P09J66l2J206L73q66Q79M50j265Q89J652j11k57q10q65R30O65
$$ 384 -904 -1970 -1261 -1095 -1127 79 452 -414 465 915 -350 539 2191 2080 1823 1013 148 1078 1743
801A743j214n33J616j264k636J32J563N41p59q17p5J450j031j034K337J666j679
$$ 1743 529 -4 1612 348 -2288 -2156 -593 -52 -811 -1628 -1703 -253 -1284 -2318 19 1685 6
818Fj072R78P51J39k79N95R73n08k450P75K638l90k594L44Q60p58j211n4J273
$$ 6 -1066 -88 663 802 523 1118 2091 1583 -867 -92 2546 2156 -438 -94 766 8 -1203 -1257 16
837A6Q56j550j938J208J346j035L71J064k04j136J9L25J188Q62j052P2P41j026
$$ 16 872 -678 -2616 -1408 -62 -1097 -726 338 134 -1002 -983 -658 530 1392 340 412 1153 127
855A27q37J501O27o84l25l56o95R01O02q51M10K87j028n72M81J29K98K94j709
$$ 127 -710 791 1418 734 409 53 -642 259 861 10 420 707 -321 -893 -412 -283 15 309 -1400
874a400l58J774j43n58O34J093o95r55j84N71J798r09j143O42P15j180n05J674
$$ -1400 -1758 16 -127 -685 -51 1042 347 -608 -792 -221 1577 668 -475 167 882 -298 -803 871
892H71Q19o48j359k88J432K91k151P91K097j379k690J088J344j78o08m22P84L12
$$ 871 1690 1042 -317 -605 827 1118 -1033 -242 1855 476 -2214 -1126 218 40 -568 -990 -206 106
910A06j507p22K477J145k323l59J875Q9p51M30P14J95r14j323P76J640n21j077
$$ 106 -1401 -2123 354 1499 -824 -1183 692 781 30 460 1174 1369 455 -868 -92 1548 1027 -50
928e0N33j57q28J87O88j7N3n06j113k45L80M2M27N8m82M20K02m95J051J514m34
$$ -50 483 326 -502 -315 373 356 409 -97 -1210 -1455 -1075 -1033 -606 -548 -1030 -610 -408 -903 148 1662 1228
949A228m28l8K84m95l28L48O35P9j804o35J769Q88j556r47J085M0j324m53Q31
$$ 1228 800 762 1046 551 223 571 1206 1285 -519 -1154 615 1503 -53 -1000 85 125 -1199 -1652 -821
968h21J230n50j896L26J444l3q51J296J004n73j339M96J710K86q53k08R96l00
$$ -821 409 -141 -2037 -1711 -267 -300 -1151 145 1149 576 -763 -267 1443 1729 876 668 1664 1364
986A364j687k53K035k0j673r29P80K34n50k45J27J230n67j539O23Q94o2q6M07
$$ 1364 -323 -576 1459 1439 -234 -1163 -383 -149 -699 -944 -817 413 -154 -1693 -1070 -176 -238 -324 83
1005H3n93pL83K91M78K71k52k8K53J86m55M78P2n07o97p82j17L02J160q57l27
$$ 83 -510 -517 -134 157 635 906 654 626 879 1065 610 1088 1160 653 -44 -826 -943 -641 519 -338 -665
1026f65k29M22L54l14m11J468K73j816n61R11R24o29J62K56O19Q2j292O75J525
$$ -665 -894 -472 -118 -432 -843 625 898 -918 -1479 -568 356 -273 -111 145 764 846 -446 229 1754
1045A754m91j919O44Q68j001m05J058L19k65j424p30J805P51k045N7J346l83j690
$$ 1754 1263 -656 -12 856 -145 -550 508 827 562 -862 -1592 213 964 -1081 -1024 322 -61 -1751
1063a751M79J552N32l73j073l8J368p52j22J154j9j051j18N27j69N31N4o50O86
$$ -1751 -1272 280 812 439 -634 -672 696 -56 -178 976 957 -94 -212 315 146 677 731 81 767
1082G67k67j519J016R37r01l26N81j233J81J055n42m49J068k51j397N45M05K43
$$ 767 500 -1019 -3 934 33 -293 288 -945 -764 291 -251 -700 368 117 -1280 -735 -330 -87
1100h7Q14o58j223J079O43q63J89J494j29j048n41L22J102q0j025M07O32j463
$$ -87 727 69 -1154 -75 568 -295 -106 1388 1259 211 -330 -8 1094 1014 -11 396 1028 -435
1118d35p45J103N24l06p71l02K95L98j239R4J917l18j905P24J467l72k81N38L0
$$ -435 -1180 -77 447 141 -630 -932 -637 -239 -1478 -1384 533 215 -1690 -966 501 129 -152 386 416
1137D16K23l51l88Q19J318j127j386J406l24r14K80N73p8o87p20j33O14K14l92
$$ 416 639 288 -100 719 2037 910 -476 930 606 -308 -28 545 467 -220 -940 -1073 -459 -245 -637
1156f37l26L35j05j98J49M56Q49q9n60K58J3J36P28Q2m10J77P2q77j57J065j58
$$ -637 -963 -628 -733 -931 -782 -326 523 434 -126 132 145 281 1009 1091 681 858 930 53 -104 961 803
1177H03r55R7l74j84nO9q6P16p56j264J067J375q54p57J142O69j128m68R46J044
$$ 803 -152 -55 -429 -613 -618 -549 -635 81 -675 -1939 -872 503 -351 -1108 34 703 -425 -893 53 1097
1197A097r3o28k38O94j26n80j05J291m3j522l24Q39J52j010j81Q48q9j268J45
$$ 1097 1004 376 138 832 706 126 21 1312 1269 -253 -577 262 414 -596 -777 71 -18 -1286 -1141
1216a141R99O05m46o74j09P98j67m33N07J119n18q43K87N53m58J38P13m73l06
$$ -1141 -142 463 17 -657 -766 32 -135 -568 -61 1058 540 -303 -16 537 79 217 930 457 151
1235A51P6j05P3K9K49m15j18k19q9M46P2k61k52K87q58J68J173k06m61j99N53
$$ 151 227 122 195 224 473 58 -60 -279 -368 78 150 -111 -363 -76 -934 -766 407 201 -260 -459 94
1256I4P5n45J62Q37L66p46r34O73P86Nq93M06O32p77o10J40J025j06j428P73L98
$$ 94 169 -376 -214 623 989 243 -691 -18 768 773 -120 286 918 141 -469 -329 696 590 -838 -65 333
1277C33n62p25O12O43k49o93o78R01R01r87k66J162K46j254k7J133K98l53m61
$$ 333 -229 -954 -342 301 52 -641 -1319 -418 483 -504 -770 392 638 -616 -643 490 788 435 -26
1296b6J50M97k48m19N24O40n49o86j10J01J68j17j08r0J57o68j55P90P3l19K90
$$ -26 124 621 373 -46 478 1118 569 -117 -227 -126 42 -75 -183 -273 -116 -784 -939 -149 -76 -395 -105
1317a05m74k09M75K38P4K97L00j67j67O6K34O93l58p00J68L45p78k23O13M4p00
$$ -105 -579 -788 -313 -75 -1 296 596 429 262 328 562 1255 897 197 365 710 -68 -291 322 366 -334
1338c34p48K72O00k70k71K50P74n69j147N82J261m72j91P1M81J15o87M44Q88M44
$$ -334 -1082 -810 -210 -480 -751 -501 273 -296 -1443 -861 400 -72 -263 -192 289 404 -283 161 1049 1493
1358A493j268k56R59k71o15KL61J80r68o74O19N10j99n38J57L99o97o1Q67k7p9
$$ 1493 225 -31 928 657 42 44 405 585 -383 -1057 -438 72 -127 -665 -508 -109 -806 -867 0 -27 -106
1379a06M1l78M17N04k52J31L37l65l43J76L84k66L91k81m30L5j40j4O9j70J49
$$ -106 -65 -443 -26 478 226 357 694 329 -14 162 546 280 671 390 -40 -5 -145 -159 -90 -260 -111
1400a11r3j29q37Q20M29o25q4P43R4n15j9O35L04l84l67J53O97k43q61P28O35
$$ -111 -204 -333 -1170 -350 79 -546 -630 113 207 -308 -327 308 612 228 -139 14 711 468 -393 335 970
1421I70q04q26N45O23L29r85k15P75l29r23Q9J123l6n66l93K10M43l59k13P11
$$ 970 166 -660 -115 508 837 -148 -363 412 83 -840 -751 372 336 -230 -623 -413 30 -329 -542 169
1441A69O63j004n45O57N27k64l98N25o9l65K97n2M67J52q41m0M78k35OM9K99m31
$$ 169 832 -172 -717 -60 467 203 -195 330 261 -104 193 141 608 760 -81 -121 357 122 128 177 476 45
1463D5j37j15k69L75R8j18m66M4j05M00J02o3N76l8o55K6N95J09j28M3j1P5j80
$$ 45 -92 -207 -476 -101 -3 -121 -587 -543 -648 -248 -146 -209 367 329 -326 -300 295 404 276 319 308 383 203
1486B03m62N16O65o03q71P75L39p26m10N13M31o09n61l89Q39L21r04L26R16n91
$$ 203 -259 257 922 319 -552 223 562 -164 -574 -61 370 -239 -800 -1189 -350 -29 -933 -607 309 -282
1506b82j21Q2P72J84o92k05N73O76p90k90J063J84r46q1J18J45k37j55jP2l86
$$ -282 -403 -321 451 635 -57 -262 311 987 197 -93 970 1154 208 127 245 390 153 -2 -3 69 -317
1527c17m12L7Q39k35n06J25k44K37L56J05l4L60j55R9J97J11%L32l30m42K33R2
$$ -317 -729 -692 147 -88 -594 -469 -713 -476 -120 -15 -49 311 156 255 452 563 563 895 565 123 356 448
1549D48k08j29R0j83m82m7n5O35M9o33J75L00p40j10J194J19m37m92K96M99M4
$$ 448 240 111 201 18 -464 -511 -566 69 118 -515 -340 -40 -780 -890 304 423 -14 -506 -210 289 333
1570C33l14P0O90K07j300L14O71j37n22J52K10p7p36j06Q87k80m20k08K95M0k00
$$ 333 19 89 779 986 -314 0 671 534 12 164 374 297 -439 -545 342 62 -358 -566 -271 -231 -431
1591d31K1O10J47o95k46M07L00qm13M48J78k26l94L63N78k43k02n1p5K00n60L29
$$ -431 -410 200 347 -348 -594 -187 113 105 -308 140 318 92 -302 61 639 396 194 143 68 268 -292 37
1613C7K2M7R6Ql01M8O3Nj77k36R0J27j19J66J60O4j70j26J8N49j80l21L95J85
$$ 37 59 106 202 210 -91 -43 20 25 -152 -388 -298 -171 -290 -124 36 100 -70 -196 -178 371 191 -130 265 450
1637D50l18l62K48P39l07m38J01L85m20l37L04M50j39q44Q2M81k04k35k56N97
$$ 450 132 -230 18 757 450 12 113 498 78 -259 45 495 356 -488 -406 75 -129 -364 -620 -23
1657b3J61q58j12J079j07m19k5M32m9op9L00M23l42o10L05O18k45m16M45K06o32
$$ -23 138 -720 -832 247 140 -279 -304 128 79 73 -6 294 717 375 -235 70 688 443 27 472 678 46
1679D6l06P4J87j73j0m90K14Q9k3k55L78J32k35J02K5R2L89K98k83q5J69J48j24
$$ 46 -260 -186 1 -172 -182 -672 -458 -369 -392 -647 -269 -137 -372 -270 -245 -153 236 534 251 166 335 483 359
1702C59k69L79L45m24l57L26j32k98m4J28Pm60l62L04M52k7p54L19O13k99m94
$$ 359 90 469 814 390 33 359 227 -71 -115 13 20 -440 -802 -498 -46 -73 -827 -508 105 -194 -688
1723f88Q58J58m0l19q2L97K64k81k67M95q3l73j62M32L37m56k75j3O9l58j55L62
$$ -688 170 328 288 -31 -113 284 548 267 0 495 412 39 -123 309 646 190 -85 -98 -29 -387 -542 -180
1745a80K73n46j15J12L67Jj27J98K35N5o03K91M07k25lL11j12J05m31L09k68L56
$$ -180 93 -453 -568 -456 -89 -88 -215 -17 218 273 -330 -39 368 143 140 451 339 444 13 322 54 410
1767D10m4l38k42j18L82k1p9j37kL07k33m77M64R8l57k7L11K42p9P7j69J88k1
$$ 410 366 28 -214 -332 50 29 -50 -187 -189 118 -115 -592 -128 -30 -387 -414 -103 139 60 137 -32 156 135
1790A35k94K24M23l10k26J81J48N8n85K78M97j86p50R7L46L18n82K37O5J67n16
$$ 135 -159 65 488 178 -48 133 281 339 -246 32 529 343 -407 -310 36 354 -228 9 74 241 -275
1811b75j03M07J86l65k29J95M15l33k06L53K45k22j24J68L25q3m26J67M67o04
$$ -275 -378 29 215 -150 -379 -184 231 -102 -308 45 290 68 -56 112 437 354 -72 95 562 -42
1831d2j1K0K27q3k73J93m85L90j01O7J84Jm73MK97m15K81J82R2j99J74Q2j28j11
$$ -42 -53 -33 194 111 -162 31 -454 -64 -165 -98 86 87 -386 -382 -85 -500 -219 -37 55 -144 30 112 -16 -127
1855a27K99L25j44l00p1N21k07n25N19K18n05j65rK04N7k52k14L23N1o42mP55
$$ -127 172 497 353 53 -18 503 296 -229 290 508 3 -162 -171 33 90 -162 -376 -53 -2 -644 -648 107
1877A07O2p39k17Q67n6l06N01M47j57k94j67N04J57l45j71O0P9o15K38K80J26
$$ 107 169 -570 -787 80 24 -282 219 666 509 215 48 552 709 364 193 253 332 -283 -45 235 361
1898C61l87m49P1L10k86P8j01L88l8l26J52P8L25k05R6J25m6J13k3J85J31j59
$$ 361 -26 -475 -404 -94 -380 -302 -403 -15 -53 -379 -227 -149 176 -29 67 192 146 259 236 421 552 393
1920C93q1o2j30L31j58j62k31j31l13K74j22J55K13j28m48M23K21l54OL02Q5N
$$ 393 312 250 120 451 293 131 -100 -231 -544 -270 -392 -237 -24 -152 -600 -177 44 -310 -304 -2 83 88
1942H8n23N21K22j20m47L89J73J57n63j11N51r1k99l00O02p6m47o4K12qm43Q9
$$ 88 -435 86 308 188 -259 130 303 460 -103 -214 337 246 -53 -353 249 173 -274 -338 -126 -134 -577 -488
1964d88M70j99l6M0J5J05j5k65P01j46j72m54O50j7m4J4j23N35l32j19k99L21
$$ -488 -18 -217 -253 -213 -198 -93 -108 -373 328 182 10 -444 206 189 145 159 36 571 239 120 -179 142
1986A42O3j09n3P4N0l1k30J36J07m34K76j82K3K02k59J04m34O02Q3l46j55M84
$$ 142 205 96 43 117 167 136 -94 42 149 -285 -9 -191 -168 34 -225 -121 -555 47 130 -216 -371 113
2008A13m3j20o6N6K34l1j30k64R23m70k55J75K92j81k79J48P0j90l94J66M33k15
$$ 113 70 -50 -116 -60 174 143 13 -251 672 202 -53 122 414 233 -46 102 172 -18 -412 -246 187 -28
2030b8j99k97M38R2k57k94N93k39k10L13K47K19o05J56K78L17l50J5O8K28l21
$$ -28 -227 -524 -86 6 -251 -545 48 -191 -401 -88 159 378 -227 -71 207 524 174 189 257 485 164
2051A64k17R0m1N3j17M4J24k70m70M85l66K91O0k00L3n5L37K04k3J70k93J34R0
$$ 164 -53 37 -4 49 -68 -24 100 -170 -640 -155 -521 -230 -170 -370 -337 -392 -55 149 126 296 3 137 227
2074B27j11K12K1M5j58P7L9o15J47K95L5k27l11K11j18j2m80L54M50m00J04j13
$$ 227 116 328 349 394 236 313 352 -263 -116 179 214 -13 -324 -113 -231 -243 -723 -369 81 -319 -215 -328
2096c28O01l69M2J24RK51l95k25O18L41o29j11L84j38p0j59L57J3l83o2J61J08
$$ -328 273 -96 -54 70 79 330 -65 -290 328 669 40 -71 313 175 105 -54 303 316 -67 -129 32 140
2118A40l51m54N07R0l75K66K26k6o5j70J55L43ol63K68l1l38J06J59j03K01J2
$$ 140 -211 -665 -158 -68 -443 -177 49 23 -42 -212 -57 286 280 -83 185 154 -184 -78 81 -22 179 191
2140A91j3L2k06j7R8l2j9m5j09P0p4r6K25Kl47K97m4o9Q6K06N2j00l55L58L27
$$ 191 178 210 4 -13 85 53 34 -11 -120 -50 -124 -220 5 7 -340 -43 -87 -156 -70 136 188 88 -267 91 418
2165D18n26M0J81P2J5k92R4L54M4m32k15O85r5o06j56Q46k19m06N0J01L33l48
$$ 418 -108 -68 113 185 200 -92 2 356 400 -32 -247 438 343 -263 -419 427 208 -198 -148 -47 286 -62
2187f2j75K07N11r10N9M28K7j65l88N46P8j54l25K17N14k05p6jK48j36k50N4J40
$$ -62 -237 -30 481 -429 -370 58 85 -80 -468 78 156 2 -323 -106 408 203 127 126 374 238 -12 42 182
2210A82O0k03l19J30Q6o5R7k62RO9O7r9k8K43N7Q3j3o0R7K20m34N32j63R2j06
$$ 182 242 39 -280 -150 -64 -129 -32 -294 -285 -216 -149 -248 -276 -33 24 107 94 34 131 351 -83 449 286 378 272
2235B72o2K90l30p8J77J0m12j69J30L67k85k84O7J26J30j73n0K52k18MK62J51
$$ 272 210 500 170 92 269 279 -133 -302 -172 195 -90 -374 -307 -181 -51 -224 -274 -22 -240 -236 26 177
2257A77P0j09m75P72j02k03j28M28J27m34J19n7K57m78j8K4o3k67M7P2L3K26k22
$$ 177 247 138 -337 435 333 130 2 430 557 123 242 185 442 -36 -54 -30 -93 -360 -313 -241 -208 18 -204
2280b04n9N45m70J71o0L33k17K3K4J44K52l40R8j85J02L2l9k37L83j22q0nj78
$$ -204 -263 282 -188 -17 -77 256 39 62 86 230 482 142 240 55 157 189 150 -87 296 174 94 89 -89
2303h9o8K54m17r0L13q5r0m3K92j88L09k05J20J95o7k79K16J45N3j18j12M3J72
$$ -89 -157 97 -320 -410 -97 -182 -272 -315 -23 -211 98 -107 13 208 141 -138 78 223 276 158 46 89 261
2326B61m78J36L42o3k18r7K61P2j4l21J32ql29L27J5j3qj53J44K05q3l17K98q
$$ 261 -217 -81 261 198 -20 -117 144 216 202 -119 13 5 -324 3 18 5 -3 -156 -12 193 110 -207 91 83
2350H3J95k40K17k26J90k95Q7j57P9RJ39Q1L6k05J69k95L32k67O2J52m25J67o4
$$ 83 278 38 255 29 219 -76 11 -146 -67 -58 81 162 198 -7 162 -133 199 -68 -6 146 -279 -112 -176
2373a76J96k77P1K85j37j54K37o6J42k68n8L69k71L28J97p8k01K4j71L87k48j50
$$ -176 20 -257 -186 99 -38 -192 45 -21 121 -147 -205 164 -107 221 418 340 139 163 -8 379 131 -19
2395a9m6J75o4j80J16M5K0p4l9P3J30n82j37O19n9k76J31K25j58K30n8L67j43
$$ -19 -65 110 46 -134 -18 27 47 -27 -66 7 137 -445 -582 37 -22 -298 -167 58 -100 130 72 439 296
2418B96o0j86K42j11J26j54J15r1p3n17q9Q78q6n80j77M40j74K4j98L44p5K5q2
$$ 296 236 50 292 181 307 153 268 177 104 -413 -502 376 290 -290 -467 -27 -201 -177 -375 -31 -106 -81 -163
2441a63L33o4k30J05J87K8k24N7K0O3R0J39j04l53K06Rp4j7pk10J80j41m25N25
$$ -163 170 106 -124 -19 168 196 -28 29 49 112 202 341 237 -116 90 99 25 8 1 -209 -29 -170 -595 -70
2465g0Rj32L27l97J65k37L42J85k29J25k46J32L75j00j61J50J73m03k00M00r4
$$ -70 -61 -193 134 -263 -98 -335 7 192 -37 88 -158 -26 349 249 88 238 411 8 -192 208 114
2486A14j33k18K4M07m70O1J48J63k54J89j3J0k19J56QJ52pj86Q7K11k10k93N04
$$ 114 -19 -237 -213 194 -276 -215 -67 96 -158 31 18 28 -191 -35 -27 125 118 -68 19 230 20 -273 231
2509B31j96j25J03oR2k5o7PJ2k72K73q3RJJ18o1Ok60J42Nk34J81O9J75j98j27
$$ 231 35 -90 13 7 99 74 7 14 26 -246 27 -56 -47 -46 72 11 17 -243 -101 -96 -330 -149 -80 95 -103 -230
2535b30M53j17j90l68L40O8J48r8j53K31j30j89K25K21O0k95NJ13j59J94k15K31
$$ -230 223 106 -84 -452 -112 -44 104 6 -147 84 -46 -235 -10 211 271 -24 -19 94 -65 129 -86 145
2557A45K32l08l02L30R8l08k08K23R5j6k26K25K58k96O7k65L49Q6k24K68l4Q0
$$ 145 377 69 -233 97 195 -113 -321 -98 -3 -19 -245 -20 238 -58 9 -256 93 179 -45 223 189 269
2579B69k51N9K98J6m46P7J72k22N2q1j73J91k52J45n1j84L66J1J83j12j22K15
$$ 269 18 77 375 391 -55 22 194 -28 24 -57 -230 -39 -291 -146 -197 -381 -15 -4 179 67 -55 160
2601A60K6N5k47K88p1j52k06L26l6j23KK16j49k05J70o7J22n23K11n9Q5p4K88
$$ 160 186 241 -6 282 211 59 -147 179 143 20 22 238 89 -116 54 -13 109 -414 -203 -262 -177 -251 37
2624C7Q7P2l86j71K52K32q6o6J37K25l79J51M5Q6j64k1P2J60k80J8J21K7j58l63
$$ 37 124 196 -190 -361 -109 123 37 -29 108 333 -46 105 150 236 72 51 123 283 3 21 142 169 11 -352
2648c52L46J69l36j50K30j35K35l7k89K53J18j29l1K37k16m1K75N6j75J06k00
$$ -352 -6 163 -173 -323 -93 -228 7 -30 -319 -66 52 -77 -108 129 -87 -128 147 203 28 134 -66
2669f6K05k6m8R8j08Qk0NO8l91j4K25j30K09o3j12j13J44P6k0K35k65J80on5K16
$$ -66 139 113 65 163 55 63 43 48 116 -275 -289 -64 -194 15 -48 -160 -273 -129 -53 -73 162 -103 77 71 16 232
2695B32q9L52m16l6j91M15j50ok92M22r1j17j37n6K33j26j51J06M4Jj52M7K05
$$ 232 143 495 79 43 -148 267 117 111 -181 241 150 33 -104 -160 73 -53 -204 -98 -54 -53 -205 -158 47
2718D7j22j01L37q4J3j59J72P4l69O1L53o6n6m6J02M2j34O7k03M37m15m6K09J25
$$ 47 -75 -176 161 77 90 -69 103 177 -192 -131 222 156 100 54 156 198 64 131 -72 365 -50 -96 113 238
2742B38k18J69j89j76J17rj18J97K94m22K28J69m67rJ84J10k3J8L7j4N0P0P3P5
$$ 238 20 189 0 -176 -59 -68 -186 11 305 -117 111 280 -187 -196 -12 98 75 93 130 116 166 236 309 384
2766C84m24k70N80n4l27np8K0J60k27K95lj24k38K90o7j61J15K3J11K52j62k03
$$ 384 -40 -310 270 216 -111 -116 -194 -174 -14 -241 54 51 -73 -311 -21 -88 -249 -134 -111 0 252 90 -113
2789a13N13k34m3K01n3j71j35K1K32R7m89J80l9Rm48M27l6k3J6k37L97l27J13
$$ -113 400 166 123 324 271 100 -35 -14 218 315 -174 6 -33 -24 -472 -45 -81 -104 -88 -325 72 -255 -142
2812a42J38k02L46m03K79J03Q2k81K20J46l28K83P4l03J59p6J77k64k22K49oJ41
$$ -142 -4 -206 140 -263 16 119 201 -80 140 286 -42 241 315 12 171 95 272 8 -214 35 29 170
2834A70l98o5J66Rl6J01J02M2j24pJ39r5P7n1NJ16J65k37m4L67l29k85K40J06
$$ 170 -228 -293 -127 -118 -154 -53 49 91 -33 -40 99 4 81 30 35 151 316 79 35 402 73 -212 28 134
2858A34j38j3L19l73K60k92K8L18n33l4M21k62Lj30K73J04J12m17P2L23j30p5
$$ 134 -4 -17 302 -71 189 -103 -75 243 -290 -324 97 -165 -162 -292 -19 85 197 -220 -148 175 45 -30
2880c0J94m3N0o2O1n0k27p6K14M0J79j22j77L85l22k90L54j54l42L43J36j05m3
$$ -30 164 121 171 109 170 120 -107 -183 31 71 250 128 -49 336 14 -276 78 -76 -418 -75 61 -44 -87
2903h7j12J13j29J45k7K31J00k44j96K63p2L9n1K49q3k24O7J43J52l31K04j17
$$ -87 -199 -86 -215 -70 -97 134 234 -10 -206 57 -15 24 -27 222 139 -85 -18 125 277 -54 150 33
2925C3J8k9p6J30O5J01l66J64j76L65l85j44L51j7l50L69l5r1q1L2M32k67J82
$$ 33 51 22 -54 76 141 242 -124 40 -136 229 -156 -300 51 34 -316 53 18 -73 -154 -122 310 43 225
2948B25m4J30l1m58L14k01J48P3l9J99l89O5k13K1K88l79L00qj43N8p5o5J98q
$$ 225 181 311 280 -178 136 -65 83 156 117 316 -73 -8 -221 -200 88 -291 9 1 -142 -84 -159 -224 -26 -34
2972c4rj56M42l51K8J61J4j9N1P9N1j98J25J04l31J9N7J93l85n2M0J15o1k3j96
$$ -34 -43 -199 243 -108 -80 81 95 76 127 206 257 59 184 288 -43 -24 33 226 -159 -211 -171 -56 -117 -140 -336
2997c36K53N8qL3J24k14q5J83j0J03k44k0J02J66j11K8J44Rj99N9K21m39L22l75
$$ -336 -83 -25 -33 0 124 -90 -175 8 -2 101 -143 -163 -61 105 -6 22 166 175 -24 35 256 -183 139 -236
3021b36L03j64J36m69L10J62r1M4j94K86n2n4K28k39l2J4M9M26n18J03J31M9j41
$$ -236 67 -97 39 -430 -120 42 -49 -5 -199 87 35 -19 209 -30 -62 -48 1 427 -91 12 143 192 51
3044E1K13l73J72K12m02J00J31j92m3J71j28K1k8K33r1l03K56K29k65J40Ll7k24
$$ 51 264 -109 63 275 -127 -27 104 -88 -131 40 -88 -67 -95 138 47 -256 0 229 -36 104 107 70 -154
3067a54K66r9K84N9k18j53J66j06j50J75o5J03j36P8Nj5k14j34L15L3k14J00L26
$$ -154 112 13 297 356 138 -15 151 45 -105 70 5 108 -28 50 55 40 -174 -308 7 40 -174 -74 252
3090B52j94k54nO8O3q5K18M6k2j18R6K1J06k5k88K6K24o6J62j47K03k99J48k88
$$ 252 58 -196 -201 -133 -70 -155 63 109 87 -31 65 86 192 167 -121 -95 129 63 225 78 281 -18 130 -158
3114a58L47k97Q4%k71K22L1L2Q0k21j66J68M2K28k30J41j2j50p5M09L1l50J96
$$ -158 189 -108 -24 -24 -295 -73 -42 -10 70 -151 -317 -149 -107 121 -109 32 20 -130 -205 204 235 -115 81
3137H1J01k28RL26l53r7K43k5qk90M8J55M0N6j9j95J22j16R1j22K04M8l50K47
$$ 81 182 -46 -37 289 -64 -161 82 57 49 -241 -193 -38 2 58 39 -156 -34 -150 -59 -181 23 71 -279 -32
3161c2J33J2j23O4p6K54j07l1J01j0n5k11Q6K97n72L5K84j64L9o4Q2Q0k83R8o4
$$ -32 101 113 -10 54 -22 232 125 94 195 185 130 -81 5 302 -270 -235 49 -115 -76 -140 -58 22 -261 -163 -227
3186b27J08L4J51j12m4J4K42p0N2j06J46l02J69r3J51J47j16j94j88L62k24K22
$$ -227 -119 -85 66 -46 -90 -76 166 96 148 42 188 -114 55 -38 113 260 144 -50 -238 124 -100 122
3208A22j20k21J65j4j66K23J3j24O2N7k98L78j14N7J09k13M06j90j6M1Q7N1j18
$$ 122 2 -219 -54 -68 -234 -11 2 -122 -60 -3 -301 77 -37 20 129 -84 322 132 116 157 244 295 177
3231A77j37j40M2J14o0K42j13k54j36L26j6J4k04j05L69k25o2J27m8L7n3P4Q0
$$ 177 40 -100 -58 56 -4 238 125 -129 -265 61 45 59 -145 -250 119 -106 -168 -41 -89 -52 -105 -31 49
3254D9L7r1m5K46l25K22j56J19J9L8k48K31J4l86L23k9R3j98m7K6R0l5kL19j92
$$ 49 86 -5 -50 196 -129 93 -63 56 75 113 -135 96 110 -276 47 18 111 -87 -134 -108 -18 -53 -55 264 72
3279G2k41J42J21j30o9k14K71J03j15J66p8N8P2j30J5J04K7j17J00j16j03p3R2
$$ 72 -169 -27 94 -36 -105 -319 -48 55 -60 106 28 86 158 28 43 147 174 57 157 41 -62 -135 -43
3302d3m9J20R8M4j38j02m1K01k44J77q1r6J66j37J95K97m12q0K21rM1l8K4J73
$$ -43 -92 28 126 170 32 -70 -111 90 -154 23 -58 -154 12 -125 70 367 -45 -125 96 87 128 90 114 287
3326B87L7n05J39J19P4j93lP4p8j38J50j12L6r5L36j60j0p3L4PL3K32l21L28n02
$$ 287 324 -181 -42 77 151 -42 -45 29 -49 -187 -37 -149 -113 -208 128 -32 -42 -115 -81 -74 -41 191 -130 198 -304
3351c04L32J45j60q9P0Q0J30k63M9J48r6r8k71R1q1O2J19K12j3k43jR4n4J6J32
$$ -304 28 173 13 -76 -6 74 204 -59 -10 138 42 -56 -327 -236 -317 -255 -136 76 63 -180 -181 -87 -141 -125 7
3376Gn1K89qm38K20j0J21l10K15J56k80l0J57J89j0k34r7J34R9mj33n4j89K32
$$ 7 -44 245 237 -201 19 9 130 -180 35 191 -89 -119 38 227 217 -17 -114 20 119 115 -18 -72 -261 -29
3400b9j17q9L89o3k80J69p4n3J55R4j30q9J56J21k12Q3j96K30j22J20r8J56q4
$$ -29 -146 -235 154 91 -189 -20 -94 -147 8 102 -28 -117 39 160 -52 31 -165 65 -57 63 -35 121 37
3423C7j47l4J09j00N8M02k78j04k53L07K8L4j19j18P0M3Q4L6P3l2j89l8L21k12
$$ 37 -110 -144 -35 -135 -77 325 47 -57 -310 -3 25 59 -60 -178 -108 -65 19 55 128 96 -93 -131 190 -22
3447b2J83k62m6L63j49p9p2K59k73J65Q5j3l2k16J39j2k48LM81k41n0Q2k91J43
$$ -22 161 -101 -147 216 67 -12 -84 175 -98 67 152 139 107 -109 30 18 -230 -227 254 13 -37 45 -246 -103
3471a03k8L08q7q0M4l2J45j1p2J07l12K15M9k46o3J65j9J07J99l60K9Q7j31J13
$$ -103 -131 177 90 10 54 22 167 156 84 191 -121 94 143 -103 -166 -1 -20 87 286 -74 -45 42 -89 24
3495B4r6l3P2j1j58J16l4L21j67j60N61l27J11k33j13J75J65k7j74J99l08M13
$$ 24 -72 -105 -33 -44 -202 -86 -120 201 34 -126 435 108 219 -14 -127 48 213 186 12 211 -97 316
3517C16k05l77L92j85R8l46O2N5O9J04r9j28R6K49m72M16m8m3m5J4Nq3m8K79R8
$$ 316 111 -266 126 -59 39 -307 -245 -190 -121 -17 -116 -244 -148 101 -371 45 -3 -46 -91 -77 -72 -155 -203 76 174
3542A74l2J98l62M04j90l87J87J6J07k47J11l41M90K4n5m06K61K7J18j56O3j79
$$ 174 142 340 -22 382 192 -195 -8 8 115 -132 -21 -362 128 152 97 -309 -48 -21 97 -59 4 -175
3564a75L5k1J98J9L59l27J11j59j59J25J03J62k87P5m2R5k42L21l73J34O6L6j16
$$ -175 -140 -161 37 56 415 88 199 40 -119 6 109 271 -16 59 17 112 -130 191 -182 -48 18 54 -62
3587f2j30J74l3j6J11j38P9K1J80j36K71k85J73k91K94M2l71N4p2K58l93R3K81
$$ -62 -192 -18 -51 -67 44 -94 -15 6 186 50 321 36 209 -82 212 254 -117 -63 -135 123 -270 -177 104
3610A04j22p7k4R6j25L16l94K35P4l80J70j38K72q2j69K73P9m4j53J55r5K3j60
$$ 104 -18 -95 -119 -23 -148 168 -226 9 83 -297 -127 -265 7 -75 -244 29 108 64 -89 66 -29 -6 -166
3633a66L84q2l52j63L46J03j67J59P0r6o4P0l0j5m2j62K86j05J24k74n2L47jj83
$$ -166 218 136 -216 -379 -33 70 -97 62 132 36 -28 42 12 -3 -45 -207 79 -26 98 -176 -228 119 118 -65
3657f5N6Q4k08J32j45J33l3J65l3M9l5j68K44L1k59J4K34j81l56N72l49J01J2
$$ -65 -9 75 -133 -1 -146 -13 -46 119 86 135 100 -68 176 207 -52 -38 196 15 -341 231 -118 -17 -5
3680ej26K20J12j51l07K34J70j96K04j10M8j60q1L07l49J39K1M4L35l41N0j03
$$ -5 -131 89 201 50 -257 -23 147 -49 155 45 93 -67 -148 159 -190 -51 -30 14 349 8 58 -45
3702d5J39j54K10j17o3j8j1N8k34J53K9j11J00j1Q1j27J06J8k1J0P4L6J63l44
$$ -45 94 -60 150 33 -30 -48 -59 -1 -235 -82 -53 -164 -64 -75 6 -121 -15 3 -18 -8 66 102 265 -79
3726g9n4J0K28J62m1j60K1mP4j93n1J47j79R7j6R3k45l9L44j01J66k20j23K30
$$ -79 -133 -123 105 267 226 66 87 83 157 -36 -87 60 -119 -22 -38 55 -190 -229 115 14 180 -40 -163 67
3750F7o7j73K86q6K13n31J12K23K81k88J9J85m5l62L50K38m08r8J20k14R0m6J37
$$ 67 0 -173 113 27 240 -291 -179 44 325 37 56 241 196 -166 184 422 14 -84 36 -178 -88 -134 3
3773CJ00k08K27k64J93M7ql61K57K07l19k8K79r1J47q5k12K41PM0p9J0k55P7l9
$$ 3 103 -105 122 -142 51 98 90 -271 -14 193 -126 -154 125 34 181 96 -116 125 132 172 93 103 -152 -75 -114
3798a14R3l2j48J90M8j2O5q0l2J39p2k72K52N2j68L1O4lo6j26M6J15N6k2K23m05
$$ -114 -21 -53 -201 -11 37 25 90 10 -22 117 45 -227 25 77 -91 -60 4 1 -65 -191 -145 -30 26 4 227 -178
3824a78J90J00N8j88k4J93j92J09k55K26kk2j54K26k8J9k50L2J37o3o5K63J36
$$ -178 12 112 170 -18 -42 151 -41 68 -187 39 37 15 -139 87 59 78 -172 -140 -3 -66 -131 132 268
3847B68j59q1P7K8l06J79m2K94l40J14K90j06j00j36m2N6q8L67o20L64n2k88M23
$$ 268 109 28 105 133 -173 6 -36 258 -82 32 322 216 116 -20 -62 -6 -94 273 -347 17 -35 -323 100
3870A00ok84M3K25J8k78K70j76J38J01l12L01K4j25l4NJ43l39J28%L12m17P6j61
$$ 100 94 -190 -147 78 96 -182 88 -88 50 151 -161 140 164 39 5 10 153 -186 -58 -58 254 -163 -87 -248
3894b48N0j9J45l8o3N1M4J16m8k40K02o6K5K10j63P2j9J31j20P5j34J9J17J2p5
$$ -248 -198 -217 -72 -110 -173 -122 -78 38 -10 -250 -48 -114 -89 121 -42 30 11 142 22 97 -37 -18 99 111 36
3919C6k09m7K84j32m8J16j53N5N0r7M1n6J71j84J47j02O5m9l7J14L9P3J13L9k92
$$ 36 -173 -220 64 -68 -116 0 -153 -98 -48 -145 -104 -160 11 -173 -26 -128 -63 -112 -149 -35 4 77 190 229 -63
3944f3l8K6J78J03o1j10NK3j31J50r3J34r1m2M0Pm2J62m3n9l9Rm0j16L22n4P3
$$ -63 -101 -75 103 206 145 35 40 63 -68 82 -11 123 32 -10 30 37 -5 157 114 55 16 25 -15 -131 191 137 210
3971B10p5k70J95J22n0j26O8J2j18J9j17J69j21K14j06Q9p0j85K35j72l43J87
$$ 210 135 -135 60 182 132 6 74 86 -32 -13 -130 39 -82 132 26 115 45 -140 95 -77 -420 -233
3993b33L69k13J17k27J70m5K18K16n14L34J38l78R2J42r4k6K7J5k96Q9R9j22O9
$$ -233 136 -77 40 -187 -17 -62 156 372 -142 192 330 -48 44 186 92 66 93 108 -188 -99 0 -122 -53
4016e3J0R2N6J61l44K74n05L67j39K13j71j5J63k81n1J65R5J7M3r3r5J58M5k02
$$ -53 -43 49 105 266 -78 196 -309 58 -81 132 -39 -54 109 -172 -223 -58 37 54 97 4 -91 67 112 -90
4040i0qK51k43K64j62J72j62K91o9q8k16M3L06m44L2Q5k1j9K88l02q9L13k07J9
$$ -90 -98 153 -90 174 12 184 22 313 244 156 -60 -17 289 -155 -123 -38 -59 -78 210 -92 -181 132 -75 -56
4064e6M7K38j77J33J4k03J95l20k3L65K73o27L3n1L16j95J04j61K12m8j22q5m0
$$ -56 -9 229 52 185 199 -4 191 -129 -152 213 486 -141 -108 -159 157 -38 66 -95 117 69 -53 -138 -178
4087a78K14j30m1L05j71l2K49m03P9j5K6J26j53Q1L05j8l27O1J0n5J48l9l9j00
$$ -178 36 -94 -135 170 -1 -33 216 -187 -108 -123 -97 29 -124 -43 262 244 -83 -22 -12 -67 81 42 3 -97
4111i7Q1Q0J09Q0l66K61l1k65K30j01m5k9K27k77K77J55k30l6P0j38PJ56j17K37
$$ -97 -16 64 173 253 -113 148 117 -148 82 -19 -64 -93 134 -143 134 289 59 23 93 -45 -38 118 1 238
4135B38j87q7L93j26J0n44L16q3K7k3N1J00j62j05J23J59j70J75j74K45k32lK5
$$ 238 51 -36 357 231 241 -303 13 -70 -43 -66 -15 85 -77 -182 -59 100 -70 105 -69 176 -56 -59 -34
4158c4K60l05R7m7J39j73J83k28P5j2P8K05k34J58r3j44J16R9P1j39oN2j31p0
$$ -34 226 -79 18 -29 110 -63 120 -108 -33 -45 33 238 4 162 69 -75 41 140 211 72 66 118 -13 -83
4182h3J27j25j02j47K46K1o3K75o9Mj57J83l1K0j97J92k2r8L5K70l06J23k17K24
$$ -83 44 -81 -183 -330 -84 -63 -126 149 80 84 -73 110 79 99 -98 94 72 -26 9 279 -27 96 -121 103
4206A03k13R2o1J65j18J06j59K29j29j96K40j50L22m11J76L2P1k36j27K73q5L52
$$ 103 -110 -18 -79 86 -32 74 -85 144 15 -181 59 -91 231 -180 -4 28 99 -137 -264 9 -76 276
4228B76m39L34k93K70mj35L5r5q9j03J95rJ13J3j27m5j09J00J52j51o1J61j66
$$ 276 -163 171 -122 148 144 9 44 -51 -140 -243 -48 -57 56 69 -58 -103 -212 -112 40 -111 -172 -11 -177
4251a77L5J82N4mj87l9J09P3JJ0k5K71k15O5k92L24k29O0j4J84l66M2L1K13l0
$$ -177 -142 40 94 90 -97 -136 -27 46 47 57 32 303 88 153 -139 185 -44 16 2 186 -180 -138 -107 106 76
4276G6k83O8l0J53J70r5n0J97n74K60J3J83k13L64j23Q1j63k57J03M5j34K07j16
$$ 76 -207 -139 -169 -16 154 59 9 206 -368 -108 -95 88 -125 239 116 197 34 -223 -120 -75 -209 -2 -118
4299a18J76L3k25K64k68J14J10J43l80j99K44K5L4J8L18l17J7J20pk6O0j35J00
$$ -118 58 91 -134 130 -138 -24 86 229 -151 -350 -106 -81 -47 -29 289 -28 -11 109 102 76 136 1 101
4322A01k26J91Q5j42l87M90k23k5K66k38J65O8j55J48j68K28n9k76K04l08K70
$$ 101 -125 66 151 9 -378 112 -111 -136 130 -108 57 125 -30 118 -50 178 119 -157 47 -261 9
4343IP4j84J71k44J75L5J06k17J76j81K68O5n80K37J73N2j29p8n2J19K6j17J12
$$ 9 83 -101 70 -174 1 36 142 -75 101 -80 188 253 -327 -90 83 135 6 -72 -124 -5 21 -96 16
4366A6p7M5P0j53J32m3J33j86J67O8l89K88j96J22J19l09J86JJ78r7j09J66p5
$$ 16 -61 -16 54 -99 33 -10 123 -63 104 172 -217 71 -125 -3 116 -193 -7 -6 172 75 -34 132 57
4389E7k3oK9o3l9J96k30j94M25J5k65K71k03j26k7K6P2N8j57K26mp5J60k67J26
$$ 57 34 28 57 -6 -45 151 -79 -273 152 167 -98 173 -30 -156 -183 -157 -85 -27 -184 42 38 -37 123 -144 -18
4414a8K42j64Ok59M47r8N8l21K29j05j75K60m6j86J22j41M2L6j03R7J07Q5j80
$$ -18 224 60 66 -193 254 156 214 -107 122 17 -158 102 56 -130 -8 -149 -107 -71 -174 -77 30 115 -65
4437f5L1J62j03j0L7L7p9M3P6K43k75J7j00K34k29j36L3j52K82k75J40r0Q9J02
$$ -65 -34 128 25 15 52 89 10 53 129 372 97 114 14 248 19 -117 -84 -236 46 -229 -89 -179 -90 12
4461A2L0Oj38J66l1N7k37n8K22J47m59L05j85L23q3K6n0q1j22Q1N8oj42R2L5J92
$$ 12 42 48 -90 76 45 102 -135 -193 29 176 -283 22 -163 160 77 103 53 -28 -150 -69 -11 -17 -159 -67 -32 160
4487A60l05N3J0k4Q5R2J45n95L61Ml1p1J86k6r1J98k58J70J46r0J47k53J92o6
$$ 160 -145 -92 -82 -106 -21 71 216 -379 -18 -14 -45 -116 70 44 -47 151 -107 63 209 119 266 13 205 139
4511A39J80j61j35J7P9o1q5K06k60o0j8K02J80m78L44j09N1J15j50j20J08oK68
$$ 139 319 158 23 40 119 58 -27 179 -81 -141 -159 43 223 -255 89 -20 31 146 -4 -124 -16 -22 246
4534B46j11l77K18p5K50J97m92o7m5J78m0J07L7J83j42kl04M24jk14J73p5q6J05
$$ 246 135 -242 -24 -99 151 348 -144 -211 -256 -78 -118 -11 26 209 67 65 -239 185 184 -30 143 68 -18 87
4558H7k29M3J88k2m9o1J55k8J29k67J43j27J36K4J35l83J86rj22J26j21Q1K3L
$$ 87 -142 -99 89 67 18 -43 112 84 213 -54 89 -38 98 122 257 -126 60 51 -71 55 -66 15 38 41
4582D1k6J4RJ17L4j99j42L16n5q6k57p2K67K39j1q4J3O8j54j70M58n40J24K82
$$ 41 15 29 38 155 189 -10 -152 164 109 23 -234 -306 -39 200 189 105 118 186 32 -138 320 -220 -96 186
4606A86l24o4J85j97K77r0o5j99K02J58m5l78M74j66J01l00K88j4K1k38K25l52
$$ 186 -138 -202 -17 -214 63 -27 -92 -291 -89 69 24 -354 120 -46 55 -245 43 29 50 -188 37 -315
4628c15K35J78k8m0J51L02l64o2j48P9L5P5k06K31k79L27r6K9m66L64N2j78K46
$$ -315 -80 98 70 30 181 483 119 57 -91 -12 23 98 -108 123 -156 171 75 104 -362 2 54 -124 122
4651A22j59K40k61l1L3j7R9K57k33n4J03J17r5j96J80k84K51l56K67K13m58M0
$$ 122 -37 203 -58 -89 -56 -73 26 283 50 -4 99 216 121 -75 105 -179 72 -284 -17 196 -262 -222
4673b22J75K26k36R4j84J32q0q9K32N2k7j27J63lj5j55K5j37K79j02L5O2M7k29
$$ -222 -47 179 -57 37 -147 -15 -95 -184 48 100 73 -54 109 106 91 -64 -39 -176 103 1 36 98 145 -84
4697h4j37L47q7j28K58M2r8k32j50K36j58K63j07k32L58l66K87K1j57M8J64NR8
$$ -84 -221 126 39 -89 169 211 113 -119 -269 -33 -191 72 -35 -267 91 -275 12 33 -124 -76 88 93 191
4720A91j30j64J43o5J51k42K41L4j29j2j42P2j08J52J20l4p9n1K55k62O8p0J0
$$ 191 61 -103 40 -25 126 -116 125 159 30 18 -124 -52 -160 -8 112 78 -1 -52 203 -59 9 -61 -51
4743e1poL8Q4j40J93K8m06K88j66L59L1j93j46J30l9M0R9l67L13k7k54K48j3j49
$$ -51 -58 -64 -26 58 -82 111 139 -267 21 -145 214 245 52 -94 36 -3 37 136 -231 82 55 -199 49 36 -113
4768a13K7J69kj68j93J86R9p2j7K67k19o3J34k29J97m9J82j02j00L2J21k10K37
$$ -113 -86 83 81 -87 -280 -94 5 -67 -84 183 -36 -99 35 -194 3 -46 136 34 -66 -34 87 -123 114
4791A14j07j72J86m1k1J89K5k60K00r6O2O0k95K44M0l03R0n7l6K01l7j12M22k43
$$ 114 7 -165 21 -20 -41 148 173 -87 113 17 79 139 -156 88 128 -175 -85 -142 -178 23 -14 -126 296 53
4815E3p7o8K39N4l51K77k9k5PK4k77J75Q7j74J04k07K60p4pQ7l24J60J65j23m3
$$ 53 -24 -92 147 201 -150 127 98 73 80 104 -173 2 89 -85 19 -188 72 -2 -9 78 -246 -86 79 -44 -87
4840h7k8N4J51k2k04J42L9J8k4L5r9Q1KJ49l00N3K03j73l53N54l02K75k09j66
$$ -87 -115 -61 90 68 -136 6 45 63 39 74 -25 56 58 207 -93 -40 163 -10 -363 191 -111 164 -45 -211
4864b11O6J20r7j38K88l7R5j98J01J59J98l19Qj44K06j44J18M8j6m37L18o8J01
$$ -211 -145 -25 -122 -260 28 -9 86 -112 -11 148 346 27 35 -109 97 -47 71 119 103 -334 -16 -84 17
4887A7O6m3k3m6Rk6l4k6L7L0p7K09j89L5l7O1O6J01o0o8r4n0K58M1J56j16k13
$$ 17 83 40 17 -29 -20 -46 -80 -106 -69 -39 -116 93 -96 -61 -98 -37 29 130 70 2 -92 -142 116 157 313 197 -16
4914a6R1L9m7j1J86m20J14k13O18k81j85K41J02j81J68l01L5J86l00K23j64P0
$$ -16 75 114 67 56 242 -178 -64 -277 341 60 -125 116 218 37 205 -96 -61 125 -175 48 -116 -46
4936d6n2K14O2j83j8j33J96R9r9J0P1j81J38J24p0k42J23m0o7Ll5K9J75p2j09
$$ -46 -98 116 178 -5 -23 -156 40 139 40 50 121 -60 78 202 132 -110 13 -27 -94 -91 -126 -97 78 6 -103
4961a03L21j40k15l1m2K01p8J0Q1L2Mn4j81L63k0k50J88J66n21J82J04J17J00
$$ -103 218 78 -137 -168 -210 -9 -87 -77 4 36 40 -14 -195 168 148 -102 86 252 -269 -87 17 134 234
4984B34l62J55j5N2j86J11J8M9j73K60k66J18Q2l12L04k89R7J66O3R9j83R3N7
$$ 234 -128 27 12 64 -122 -11 7 56 -117 143 -123 -5 77 -235 69 -220 -123 43 106 205 22 115 172
5007A72j99J7J74j65j5P4l88L54l6J29r2p5L2n1J91l77K99l7l46L37N7l8J34j97
$$ 172 -27 -10 164 -1 -16 58 -330 24 -12 117 25 -50 -18 -69 122 -255 44 7 -339 -2 55 17 151 -46
5031d6R5P0m0J42j07j17j60K80k26J99q2M3%l8N5k7j24N3J13j39K06k00L9q8O7
$$ -46 49 119 79 221 114 -3 -163 117 -109 90 8 51 51 13 68 41 -83 -30 83 -56 150 -50 -11 -99 -32
5056c2L6j19R8k8O3r6J69j16N0O7M5p0M4R0k95q3J24J1J9p5J36K5m3Q3k72J64
$$ -32 4 -115 -17 -45 18 -78 91 -25 25 92 137 67 111 201 -94 -177 -53 -42 -23 -98 38 63 20 103 -169 -5
5082ej3J63j42j78L78k61K07r2j55K23k1j67J12J1J75j53j21K11j04j94K79k90
$$ -5 -18 145 3 -175 203 -58 149 57 -98 125 104 -63 49 60 235 82 -39 172 68 -126 153 -137
5104a37M4J92j11Ml01K87j27J57j68J29J90k74J01N8j68K06j01J03J0k43n1J95
$$ -137 -93 99 -12 -8 -309 -22 -149 8 -160 -31 159 -115 -14 44 -124 82 -19 84 94 -149 -200 -5
5126ej8M5p8R4M3L25m81l2J69rR1j45J44j10J3J59j76L8n5j4o8K50L1P4l14P1
$$ -5 -23 22 -56 38 81 406 -75 -107 62 53 144 -1 143 33 46 205 29 67 12 -2 -70 180 211 285 -29 42
5152D2p2j52J74k6J9ko0L01O5l79m17N27K0j46K32k49J61%M8j28J03j27M2j46
$$ 42 -30 -182 -8 -34 -15 -17 -77 224 289 -90 -507 20 40 -106 126 -123 38 38 86 -42 61 -66 -24 -170
5176a70J76P4J75m4m58L4J83M2M7k55N42k61m8O2J75r4k24L45l15Q6o6M01l15
$$ -170 6 80 255 211 -247 -213 -30 12 59 -196 346 85 37 99 274 180 -44 301 -14 72 6 407 92
5199I2oq4M5k04qM6k05K01J21m2p6J93k11K00j01j11J40k5J3K4Q5J36l18L84j74
$$ 92 86 2 47 -157 -165 -119 -324 -123 -2 -44 -120 73 -138 62 -39 -150 -10 -35 -22 2 87 223 -95 289 115
5224A15j53J44l2K6j42MR0q6o0J55k2pJ03j16l6M3m1m7J4J00j17P6K7k51R5k2
$$ 115 -38 106 74 100 -42 -38 52 -34 -94 61 39 32 135 19 -17 26 -15 -62 -48 52 -65 11 38 -213 -118 -140
5250a40K37j38l5q1K09Q6j00J2j28M6J61k03K43K0k33J89j35J25k31L36m21J29
$$ -140 97 -41 -76 -157 52 138 38 50 -78 -32 129 -74 169 189 -44 145 10 135 -96 240 -181 -52
5272e2K3L5L47m22N0j0K85n5n43K95o3J42r5j27K25J62p2j78j0n6l2N0J01o4J87
$$ -52 -29 6 353 -69 -19 -29 256 201 -342 -47 -110 32 -63 -190 35 197 125 -53 -63 -119 -151 -101 0 -64 123
5297A23j50K03j37n9j72J73L00k90K41l16j30N04k89J5P9pj72J37k33K21p2K6
$$ 123 -27 176 39 -20 -192 -19 281 -9 232 -84 -214 290 1 16 95 88 -84 53 -180 41 -31 -5
5319eK55m38J78k7j21l7K59j70J55J9j10j05J14J34l42k7K90M8J41l07R4j9J4
$$ -5 250 -188 -10 -37 -158 -195 64 -106 49 68 -42 -147 -33 101 -241 -268 22 70 211 -96 -2 -21 -7
5342gk77L42o5p8n1J50j53L92j94l9j30P8L2K68k56k38L59j7j00lo5J0pm1J74
$$ -7 -284 58 -7 -85 -136 14 -139 253 59 20 -110 -32 0 268 12 -226 133 116 16 13 -52 -42 -49 -90 84
5367H4j46j29K27k73L19j28j74K66K0M5j62K25M3k13L9n3P2j90K65O6m49L55n4
$$ 84 -62 -191 36 -237 82 -46 -220 46 66 111 -51 174 217 4 43 -10 62 -128 137 203 -246 109 55
5390E5q9K13l48n9J81J8m5J2K39l15K01J26j84K23J1k05o1J97j60q4J65K37k47
$$ 55 -34 179 -169 -228 -47 -29 -74 -62 177 -138 63 189 5 228 239 34 -27 170 10 -74 91 328 81
5413H1k28L55j52O0l88J05J81j09K8k32K64L40l65K4L6l34L89K1o6n7K92j56j68
$$ 81 -147 208 56 116 -272 -167 14 -95 -67 -299 -35 305 -60 -36 0 -334 55 76 10 -47 245 89 -79
5436g9K31q7k68K57K02m41K48O9k96K83k38L08j39j68l0J40Lp9J21j03Q2o4j84
$$ -79 152 65 -203 54 256 -185 63 132 -164 119 -119 189 50 -118 -148 -8 -5 -84 37 -66 16 -48 -232
5459b32L70j08k57K67o1P6N6k5p2j92M9J97K6k9j54L28l38K82P7k90j29R1mJ66
$$ -232 138 30 -227 40 -21 55 111 86 14 -178 -129 68 94 65 -89 239 -99 183 260 -30 -159 -68 -72 94
5483I4L4q8j74l7p8M09k69J04K8o6M3J52j06r7J41k47L86j60j80L48n16J34P0
$$ 94 128 40 -134 -171 -249 160 -109 -5 23 -43 0 152 46 -51 90 -157 229 69 -111 237 -279 -145 -75
5506g5j51K81n11J94K17j9K03k31K44j69j11J54N3P0j27k36J51j07J81nj24o2
$$ -75 -226 55 -456 -262 -45 -64 139 -92 152 -17 -128 26 79 149 22 -214 -63 -170 11 6 -118 -180
5528a80M29j62M1j27O7k68K64J76j35K71j78p7o6m9J44l07L4J4k9L45n42L39k8
$$ -180 249 87 128 1 68 -200 64 240 105 376 198 121 55 6 150 -157 -123 -109 -138 207 -335 4 -24
5551b4j80J93k39M62k49R5k9k89M04l8n7Q9j60%J29J09j52N6r4L0R5j47O2p8J03
$$ -24 -204 -11 -250 212 -37 58 29 -260 144 106 49 138 -22 -22 107 216 64 120 26 56 151 4 66 -12 91
5576I1l96K12j17O6O7J43J3k62j17L72k1%j60MK80j04l7j41Q6P3O3j63Q9K33l90
$$ 91 -305 -93 -210 -144 -77 66 79 -183 -300 72 51 51 -109 -105 175 71 34 -107 -21 52 115 -48 41 274 -116
5601a16J03j3J28j5m2k9Q3M1n7l01J42JJ5N0j70M4K78m1o1O9K2j42K33j44j76
$$ -116 -13 -26 102 87 45 16 99 140 83 -218 -76 -75 -60 -10 -180 -136 142 101 40 109 131 -11 222 78 -98
5626i8q8J63k5k6J6O0q0qK1N4n1J0K79k99Q7L8J15K0k06r4J25R3o7j84L42j43
$$ -98 -186 -23 -48 -74 -58 2 -78 -86 -65 -11 -62 -52 227 -72 15 53 168 188 -18 -112 13 106 39 -145 197 54
5652E4j79N0j28J31L3L09l14p3J03K01q0k42J2p3L80P9k73j5j60J23Q5Q0j93K4
$$ 54 -125 -75 -203 -72 -39 270 -44 -117 -14 187 107 -135 -123 -196 184 263 -10 -25 -185 -62 23 103 -90 -66
5676f6j01N1J69k44N0K33j98l1k2L00m11N6J51J11oj21J32M7j88J22P3l29K23
$$ -66 -167 -116 53 -191 -141 92 -106 -137 -159 141 -270 -214 -63 48 42 -79 53 100 -88 34 107 -222 1
5699AR8k08Q3j19J40q1K46k86l5P6K47k41k5j77J3J45L5N0R2j14Q2k72J60j7J41
$$ 1 99 -109 -26 -145 -5 -86 160 -126 -161 -85 162 -79 -104 -281 -268 -123 -88 -38 54 -60 22 -250 -90 -107 34
5724C4M7k0k1k3q7M3J25k72K6R3L70l47J4r2o2J72k11J35j34K85o1k19L48j01
$$ 34 81 61 40 17 -70 -27 98 -174 -148 -55 315 -32 -18 -110 -172 0 -211 -76 -210 75 14 -205 143 42
5748D2P6k24N8j25J37q1P0L1j07O9L26n1k98L4J01k04K27p2J24O0l18j4J92l15
$$ 42 118 -106 -48 -173 -36 -117 -47 -16 -123 -54 272 221 -77 -43 58 -146 81 9 133 193 -125 -139 53 -262
5772b62K17j81K02N4j05K43J51k91k1l09K69o2m1K08OK25J5l76J63n2n2n9J20
$$ -262 -45 -226 -24 30 -75 168 319 28 7 -302 -33 -95 -136 72 78 303 318 -58 105 53 1 -58 62
5795F2j59R1p9K03k07r8J17Q7O0r7j44L92l09R7jn4K7n4J56m0p1j63P2K46j59
$$ 62 -97 -6 -85 118 -89 -187 -70 17 77 -20 -164 228 -81 16 15 -39 -12 -66 90 50 -21 -184 -112 134 -25
5820b5l53K92K4J27j61K80j60n3Pj65K79j52j7j4J65j21K16J63m61M26q2k80r6
$$ -25 -378 -86 -62 65 -96 184 24 -29 -22 -187 92 -60 -77 -91 74 -47 169 332 -129 297 215 -65 -161
5843a61P8l8J94p5n1k6K23k29J60j33N8r7J43N5j53n2K16J42k81j62J84L1k32
$$ -161 -83 -121 73 -2 -53 -79 144 -85 75 -58 0 -97 46 101 -52 -104 112 254 -27 -189 -5 26 -206
5866b06J52J9k4LR5l9K0j63Q1j5J11j41J70l09Q8J79L3M9jRj18j8J5J35PP5k41
$$ -206 -54 -35 -59 -56 39 0 20 -143 -62 -77 34 -107 63 -246 -158 21 54 103 102 111 -7 -25 -10 125 132 207 -34
5893c4p1Q7m6L2q9K07O3j61l1J4Q6p9j53l7K73j39J48m7o1k7R9O3l0j43j03k3
$$ -34 -105 -18 -64 -32 -121 86 149 -12 -43 -29 57 -22 -175 -212 61 -78 70 23 -38 -65 34 97 67 -76 -179 -202
5919b02L1K7J0J26k17J62m4J22j18p7R8l6K26m87K46K4K81K5l67L5K26j58K4K29
$$ -202 -171 -144 -134 -8 -225 -63 -107 15 -103 -180 -82 -118 108 -379 -133 -109 172 197 -170 -135 91 -67 -43 186
5943A86k24J99Q2q9o2R6j53o8K37k37j36r1K83j64O4P2J93l03J73o0Om0k94K78
$$ 186 -38 161 243 154 92 188 35 -33 204 -33 -169 -260 23 -141 -77 -5 188 -115 58 -2 4 -36 -330 -52
5967e2J07k02Q5J29k47K04j39Q5J34j10j79O2K54j43J25k4N1p7j66J60j59o2J41
$$ -52 55 -147 -62 67 -180 24 -115 -30 104 -6 -185 -123 131 -12 113 89 140 63 -103 57 -102 -164 -23
5990b3M4o5J06k33j2k14K63O6j29M47l46K64j24j15J75j76l4J15k39K51J82l37
$$ -23 21 -44 62 -171 -183 -397 -134 -68 -197 250 -96 168 44 -71 104 -72 -106 9 -230 21 203 -134
6012a34r5K63p0k9K74M4m7k37l4l4J78j7kj35Q2J09p5n8j90K25k6n8J5K04j85
$$ -134 -229 34 -36 -65 209 253 206 -31 -65 -99 79 62 60 -75 7 116 41 -17 -207 18 -8 -66 -51 153 -32
6037c2m2J96K3j50K70k33K5j31Q6K2Q8m4j85K94L8j84n2K3J8r9rN3j05J91j13
$$ -32 -74 122 145 -5 265 32 57 -74 12 34 122 78 -107 187 225 41 -11 12 30 -69 -78 -25 -130 61 -52
6062e2j34K07K33j77j84J47m5n2j28K56kn1J0q5J8P1K4k02J06j15M1j31J43nM8
$$ -52 -186 21 254 77 -107 40 -5 -57 -185 71 69 18 28 -57 -39 32 56 -146 -40 -155 -114 -245 -102 -107 -59
6087e9R0n9o0J04q4M8j8L30l61J0L1K73k82J75k15L1P8j41J60j37j23Q5N6N0M
$$ -59 31 -28 -88 16 -68 -20 -38 292 -69 -59 -28 245 -37 138 -77 -46 32 -109 51 -86 -209 -124 -68 -18 -14
6112a4J34k68L2K86m27J35K6K22o3j8K94k04j48m4J26j82J65j66K09o2r9J6K00
$$ -14 120 -148 -116 170 -257 -122 -96 126 63 45 339 135 -13 -57 69 -113 52 -114 95 33 -66 -50 150
6135A50k19j24L77k7j61pj09L45k84Q3M6r4j91L26Q5k12R1o5M1j3k16mK26J27
$$ 150 -69 -193 184 157 -4 -11 -120 225 -59 24 70 -24 -215 111 196 -16 75 10 51 38 -178 -182 44 171
6159A71P0j80j0Q4j90J17j48K30j82K30j73m9P0j70j76L03Q1j21j1q5K54j78L7
$$ 171 241 61 51 135 -55 62 -86 144 -38 192 19 -30 40 -130 -306 -3 78 -43 -54 -139 115 -63 -26
6182b6J54K10k35l8j49L03j54j06Q1m3m3J50k33R1J01k8M7R9l84M29j92N1o3P9
$$ -26 128 338 103 65 -84 219 65 -41 40 -3 -46 104 -129 -38 63 35 82 181 -203 226 34 85 22 101
6206A01N3j21k54o5K20j7m7K87P9m7k60n9O5j86J49Oj13N2R2r9n4J18J86R6oj85
$$ 101 154 33 -221 -286 -66 -83 -130 157 236 189 -71 -130 -65 -251 -102 -96 -209 -157 -65 -164 -218 -100 86 182 176 -9
6232iJ04j13j23K34J9p6L2k21K82q1J59n01N74l21J08N2j53N4n4L53k57M7j3Q
$$ -9 95 -18 -141 93 112 36 68 -153 129 48 207 -294 280 -41 67 119 -34 20 -34 319 62 109 96 104
$$ [...]
8191a62
##END NTUPLES=NMR FID
##END=
