##TITLE=1H_SL35(mCPBH)
 CDCl3
 8 sc, 
 17.11.2021
##JCAMPDX= 6.0         $$ Bruker NMR JCAMP-DX V2.0
##DATA TYPE= NMR FID
##DATA CLASS= NTUPLES
##ORIGIN= UXNMR, Bruker Analytische Messtechnik GmbH
##OWNER= root
$$ XWIN-NMR		Version 3.5
$$ Wed Nov 17 11:43:45 2021 Russian Standard Time (UT+4h)  she@DPX200
##.OBSERVE FREQUENCY= 200.131346
##.OBSERVE NUCLEUS= ^1H
##.DELAY= (6, 6)
##.ACQUISITION MODE= SIMULTANEOUS
##.ACQUISITION SCHEME= undefined
##.AVERAGES= 8
##.DIGITISER RES= 18
##SPECTROMETER/DATA SYSTEM= spect
##.PULSE SEQUENCE= zg30
##.SOLVENT NAME= Acetone
##.SHIFT REFERENCE= (INTERNAL, Acetone, 0, 15.7039)
##AUDIT TRAIL= $$ (NUMBER, WHEN, WHO, WHERE, WHAT)
$$ ##TITLE= Audit trail, XWIN-NMR		Version 3.5
$$ ##JCAMPDX= 5.01
$$ ##ORIGIN= Bruker BioSpin GmbH
$$ ##OWNER= she
$$ F:/spectra/data/she/nmr/H-F/1/audita.txt
$$ ##AUDIT TRAIL=  $$ (NUMBER, WHEN, WHO, WHERE, WHAT)
(   1,<2021-11-17 11:42:34.85 +0400>,<she>,<DPX200>,
      <created by zg, POWCHK disabled, PULCHK disabled
       configuration hash MD5:
       00 E9 B6 7A A2 85 ED C7 34 08 36 98 17 FE 4E 26
       data hash MD5: 16K
       B9 94 46 D6 E9 C3 D9 5D 55 A4 AA E5 E5 54 C1 09>)
$$ ##END=
$$ 
$$ hash MD5
$$ EB FB 1D F2 95 5B 6A 3F B0 21 2C 00 96 50 4C 72
##$RELAX= 
##$RELAX= 
##$RELAX= 
##$RELAX= 
##$RELAX= 
##$RELAX= 
$$ Bruker specific parameters
$$ --------------------------
##$DU= <F:/spectra>
##$EXPNO= 1
##$NAME= <H-F>
##$PROCNO= 1
##$TYPE= <nmr>
##$USER= <she>
##$AMP= (0..31)
100 100 100 100 100 100 100 100 100 100 100 100 100 100 100 100 100 100 
100 100 100 100 100 100 100 100 100 100 100 100 100 100 
##$AQSEQ= 0
##$AQ_mod= 1
##$AUNM= <au_zg>
##$AUTOPOS= <>
##$BF1= 200.13
##$BF2= 200.13
##$BF3= 200.13
##$BF4= 200.13
##$BF5= 200.13
##$BF6= 200.13
##$BF7= 200.13
##$BF8= 200.13
##$BYTORDA= 1
##$CFDGTYP= 0
##$CFRGTYP= 5
##$CHEMSTR= <none>
##$CNST= (0..31)
1 1 145 1 1 1 1 1 1 1 1 1 1 1 1 1 1 1 1 1 1 1 1 1 1 1 1 1 1 1 1 1 
##$CPDPRG= <>
##$CPDPRG1= <>
##$CPDPRG2= <>
##$CPDPRG3= <>
##$CPDPRG4= <mlev>
##$CPDPRG5= <mlev>
##$CPDPRG6= <mlev>
##$CPDPRG7= <mlev>
##$CPDPRG8= <mlev>
##$CPDPRGB= <>
##$CPDPRGT= <>
##$D= (0..31)
0 1.2 0 0 0 0 0 0 0 0.06 0 0.03 0 0 0 0 0.0002 0 0 0 0 0 0 0 0 0 0 0 0 
0 0 0 
##$DATE= 1637134954
##$DBL= (0..7)
120 120 120 120 120 120 120 120 
##$DBP= (0..7)
150 150 150 150 150 150 150 150 
##$DBP07= 0
##$DBPNAM0= <>
##$DBPNAM1= <>
##$DBPNAM2= <>
##$DBPNAM3= <>
##$DBPNAM4= <>
##$DBPNAM5= <>
##$DBPNAM6= <>
##$DBPNAM7= <>
##$DBPOAL= (0..7)
0.5 0.5 0.5 0.5 0.5 0.5 0.5 0.5 
##$DBPOFFS= (0..7)
0 0 0 0 0 0 0 0 
##$DE= 6
##$DECBNUC= <off>
##$DECIM= 32
##$DECNUC= <off>
##$DECSTAT= 4
##$DIGMOD= 1
##$DIGTYP= 9
##$DL= (0..7)
0 120 120 120 120 120 120 120 
##$DP= (0..7)
150 150 150 150 150 150 150 150 
##$DP07= 0
##$DPNAME0= <>
##$DPNAME1= <>
##$DPNAME2= <>
##$DPNAME3= <>
##$DPNAME4= <>
##$DPNAME5= <>
##$DPNAME6= <>
##$DPNAME7= <>
##$DPOAL= (0..7)
0.5 0.5 0.5 0.5 0.5 0.5 0.5 0.5 
##$DPOFFS= (0..7)
0 0 0 0 0 0 0 0 
##$DQDMODE= 0
##$DR= 18
##$DS= 0
##$DSLIST= <SSSSSSSSSSSSSSS>
$$ [...]
##$SUBNAM2= <"">
##$SUBNAM3= <"">
##$SUBNAM4= <"">
##$SUBNAM5= <"">
##$SUBNAM6= <"">
##$SUBNAM7= <"">
##$SUBNAM8= <"">
##$SUBNAM9= <"">
##$SW= 18.0517287032376
##$SWIBOX= (0..15)
0 0 2 0 0 0 0 0 0 0 0 0 0 0 0 0 
##$SW_h= 3612.71676300578
##$TD= 16384
##$TD0= 1
##$TE= 0
##$TE2= 300
##$TE3= 300
##$TEG= 300
##$TL= (0..7)
0 120 120 120 120 120 120 120 
##$TP= (0..7)
150 150 150 150 150 150 150 150 
##$TP07= 0
##$TPNAME0= <>
##$TPNAME1= <>
##$TPNAME2= <>
##$TPNAME3= <>
##$TPNAME4= <>
##$TPNAME5= <>
##$TPNAME6= <>
##$TPNAME7= <>
##$TPOAL= (0..7)
0.5 0.5 0.5 0.5 0.5 0.5 0.5 0.5 
##$TPOFFS= (0..7)
0 0 0 0 0 0 0 0 
##$TUNHIN= 0
##$TUNHOUT= 0
##$TUNXOUT= 0
##$USERA1= <user>
##$USERA2= <user>
##$USERA3= <user>
##$USERA4= <user>
##$USERA5= <user>
##$V9= 5
##$VALIST= <valist>
##$VCLIST= <CCCCCCCCCCCCCCC>
##$VD= 0
##$VDLIST= <DDDDDDDDDDDDDDD>
##$VPLIST= <PPPPPPPPPPPPPPP>
##$VTLIST= <TTTTTTTTTTTTTTT>
##$WBST= 1024
##$WBSW= 4
##$XGAIN= (0..3)
0 0 0 0 
##$XL= 0
##$YL= 0
##$YMAX_a= 68574
##$YMIN_a= -109122
##$ZGOPTNS= <>
##$ZL1= 120
##$ZL2= 120
##$ZL3= 120
##$ZL4= 120
##$ABSF1= 10
##$ABSF2= 0
##$ABSG= 5
##$ABSL= 3
##$ALPHA= 0
##$AQORDER= 0
##$ASSFAC= 0
##$ASSFACI= 0
##$ASSFACX= 0
##$ASSWID= 0
##$AUNMP= <proc_1d>
##$AZFE= 0.1
##$AZFW= 0.1
##$BCFW= 1
##$BC_mod= 2
##$BYTORDP= 1
##$COROFFS= 0
##$CY= 11.3945322036743
##$DATMOD= 1
##$DC= 2
##$DFILT= <>
##$DTYPP= 0
##$F1P= 2.36226072786647
##$F2P= -0.459571619588291
##$FCOR= 0.5
##$FTSIZE= 0
##$FT_mod= 4
##$GAMMA= 1
##$GB= 0.15
##$INTBC= 1
##$INTSCL= 1
##$ISEN= 128
##$LB= 0.24
##$LEV0= 0
##$LPBIN= 0
##$MAXI= 10000
##$MC2= 0
##$MEAN= 0
##$ME_mod= 0
##$MI= 1.114404
##$NCOEF= 0
##$NC_proc= 0
##$NLEV= 6
##$NOISF1= 3.799351
##$NOISF2= 2.8
##$NSP= 1
##$NTH_PI= 0
##$NZP= 0
##$OFFSET= 15.70392
##$PC= 1
##$PHC0= -15511.24
##$PHC1= 10.20081
##$PH_mod= 1
##$PKNL= yes
##$PPARMOD= 0
##$PSCAL= 0
##$PSIGN= 0
##$REVERSE= no
##$SF= 200.130013532006
##$SI= 16384
##$SIGF1= 3
##$SIGF2= 2
##$SINO= 400
##$SIOLD= 16384
##$SREGLST= <1H.CDCl3>
##$SSB= 0
##$STSI= 0
##$STSR= 0
##$SW_p= 3612.71676300578
##$SYMM= 0
##$S_DEV= 0
##$TDeff= 0
##$TDoff= 0
##$TI= <>
##$TILT= no
##$TM1= 0
##$TM2= 0
##$TOPLEV= 0
##$USERP1= <user>
##$USERP2= <user>
##$USERP3= <user>
##$USERP4= <user>
##$USERP5= <user>
##$WDW= 1
##$XDIM= 8192
##$YMAX_p= 0
##$YMIN_p= 0
$$ End of Bruker specific parameters
$$ ---------------------------------
##NTUPLES= NMR FID
##VAR_NAME=  TIME,          FID/REAL,        FID/IMAG
##SYMBOL=    X,             R,               I
##VAR_TYPE=  INDEPENDENT,   DEPENDENT,       DEPENDENT
##VAR_FORM=  AFFN,          ASDF,            ASDF
##VAR_DIM=   8192,          8192,            8192
##UNITS=     SECONDS,       ARBITRARY UNITS, ARBITRARY UNITS
##FACTOR=    0.0002768,     1,               1
##FIRST=     0,             0,               0
##LAST=      2.2672688,     0,               0
##MIN=       0,             -109122,         0
##MAX=       2.2672688,     68574,           0
$$ Real data points
##PAGE= N=1
##DATA TABLE= (X++(R..R)), XYDATA
0@%%%%%%%%%%%%%%qJ6j6J6j6K4l2L2m0M8n6O5p3Q8j04J20j36J53j77K01k26K58
36A37k90L24l64M08m54N04n59O19o85P57q36R24j019J123j237J362j501J656j827
55i58K019k239K488k775L111l511L993m589N351o360P772r905J3532k1329O9993
70E6593o8204n4904J35089o0293m9804P4410j055o0115M5205j2945m3418L8338
82a103K39m8281N6284J8920o5851K0712L9683o4134r61O3508j4903j7383L3058
95A9788k0347k5908K5494J0399j67P215k1963J2468L7345m1464l5245N3172K048
108B2835m0959L6140J7624m7229P621J4920l6085J6806L2683l2660J027K6300
120A9023m2663n412N3366k6389l2405M9754N44l7974L3782M653n1330K5548M0921
$$ plain form
0 0 0 0 0 0 0 0 0 0 0 0 0 0 0 0 -8 8 -8 8 -8 16 -16 16 -24 24 -32 33 -40 48 -56 64 -72 81 -96 105 -121 137
36 137 -153 171 -193 215 -239 265 -294 325 -360 397 -439 485 -534 589 -648 714 -787 869 -958
55 -958 1061 -1178 1310 -1465 1646 -1865 2128 -2461 2890 -3470 4302 -5603 7929 -13400 56593
70 56593 -11611 -66515 68574 8281 -41523 32887 31832 -28283 16922 3977 -39441 -1103
82 -1103 -864 -49145 7139 26059 -39792 -19080 20603 -43531 -44492 19016 4113 -13270 19788
95 19788 -559 -26467 -973 9426 9259 16474 -5489 6979 44324 2860 -32385 20787 22835
108 22835 -18124 18016 35640 -11589 -3968 10952 -25133 -8327 24356 -8304 -7277 19023
120 19023 -23640 -29052 24314 -2075 -34480 15274 15818 -22156 11626 16279 -35051 -9503 31418
133C1418l1802m247K4384k3701m552K1446k2512j400L5758k0787k7894L1371N98
146H080k8595J7645Q730k4497J3284K0361j9112n756P889j0671J0024J9256j6803
159a65q090J9886n320j0132J3487j581j0564J3354M662j5224K997R050q415n005
173a060M75j06P678m81j4543j665P719m535r00N434p186n272J1554L428r129j614
189a0203L764K387M200j439k901P094L251q445O45Q743j781j674P023l398r260
204a994Q045Q340j2025o371R713K302m636J569m020o814O259L024p437J211M014
219A180o169J836L898j0332M35J4310n820r612R982K863q608M569J266q506Q336
234c72Q080r812o73M992o659M880Q365j2346j696J5655o599r739J0387k127p891
$$ plain form
133 31418 -384 -4631 19753 -3948 -8500 12946 -9566 -10966 24792 4005 -23889 7482 8080
146 8080 -20515 -2870 5860 -18637 -5353 15008 -4104 -9860 -1971 -12642 -2618 16638 -165
159 -165 -8255 11631 6311 -3821 9666 8085 -2479 10875 15537 313 3310 12360 3945 -1060
173 -1060 -585 -691 6987 6506 -8037 -9702 -1983 -6518 -7418 -1984 -9170 -14442 -2888 540 -8589 -10203
189 -10203 -6439 -4052 148 -1291 -4192 2902 6153 -2292 -1647 7096 5315 3641 10664 7266 -1994
204 -1994 6051 14391 2366 -4005 5708 8010 3374 4943 923 -5891 368 3392 -4045 -2834 1180
219 1180 -4989 -3153 745 -9587 -9152 5158 -662 -10274 -292 2571 -6037 -1468 -202 -8708 -372
234 -372 7708 -2104 -2777 2215 -4444 436 8801 -3545 -5241 10414 3815 -5924 4463 2336 -5555
249e555J2970j1j4057R689P326j4000K458P447j0539M936J1333j5873m620J6119
263G623o518q474J1786m469q780J4312j289j6019R327O859j1470N451N584j2653
277h730O077J0666j3770n49J2823q699j729J2252j0772o964J7838l469j3350J1668
291C292J864j0920J1063J675j6965J0445J1876j7348k31J3504j0717k071J4002
304I469j0768o669J6613m404j2225J1934P84j1979J0842M961j4516M237Q867r870
318b724J132O379r797K003J1748j1583p226J2338k020p401P191k431n349J1479
332C739k156j3229R151P582j1314L629Q965r631N48J0521p782k930J1057m688
346C462m452J1820m417j2496J1166N278j2975K872P235p900J277N120j1790j534
$$ plain form
249 -5555 7415 7404 -6653 3036 10362 -3638 -1180 6267 -4272 664 11997 -3876 -8496 7623
263 7623 1105 -7369 4417 -52 -8832 5480 4191 -11828 -2501 4358 -7112 -1661 3923 -8730
277 -8730 -2653 8013 -5757 -6306 6517 -2182 -3911 8341 -2431 -9395 8443 4974 -8376 3292
291 3292 5156 -5764 5299 6974 -9991 454 12330 -5018 -5249 8255 -2462 -4533 9469
304 9469 -1299 -7968 8645 4241 -7984 3950 4734 -7245 3597 8558 -5958 -1721 7146 -2724
318 -2724 -1592 4787 -5010 -3007 8741 -2842 -10068 2270 250 -7151 40 -2391 -7740 3739
332 3739 1583 -11646 -2495 5087 -6227 -2598 6367 -3264 -2716 7805 23 -2907 8150 3462
346 3462 -990 10830 6413 -6083 5083 10361 -2614 258 7493 -407 870 5990 -5800 -7334
360g334J2727n703q710Q303Q35p184M197j139n631Q714L015r226N211O405r993
375e513P21J0512n421l914R713j075m241M525m384l228J1030j949j0945Q495N023
390I349j2584J505N693r376L172J0273j1350m549J3098o086r182J0606j0p948
404g389J0222J094j1877P970M504j2896Q001J1471j4609k00J5694j0407r775J2867
418D670j296p763J0721k891j0300J0900L73j4903Q431P888j1957M270Q488j3746
432g115p85J3180r245l896J3608m078o542J1274m390q920J1455Mq311J1295P19
447H253j3265Q897N527j6768M908J3147j2172j748J0583j0712l754J2276r278
460d106o331J6228n519j0759J4918k731j6670J4846P707j8162Q404J3343j5899
$$ plain form
360 -7334 5393 -310 -9020 -717 118 -7066 -2869 -4008 -9639 -925 2090 -7136 -1925 4480 -5513
375 -5513 -4792 5720 299 -3615 6098 5023 782 5307 923 -2305 8725 6776 -4169 4326 9349
390 9349 -3235 -1730 3963 -5413 -2241 8032 -3318 -7867 5231 -855 -10037 569 559 -7389
404 -7389 2833 3927 -7950 20 4524 -8372 -371 11100 -3509 -3709 11985 1578 -8197 4670
418 4670 3374 -4389 6332 3441 -6859 4041 4414 -10489 -2058 5830 -6127 -1857 6631 -7115
432 -7115 -7900 5280 -3965 -7861 5747 1669 -4873 6401 2011 -6909 4546 4550 -3761 7534 8253
447 8253 -5012 3885 9412 -7356 -2448 10699 -1473 -3221 7362 -3350 -7104 5172 -4106
460 -4106 -10437 5791 272 -10487 4431 1700 -14970 -124 7583 -10579 -2175 11168 -4731
473d731j77J3570j2417j891J6160q434o765J5214o417j1531J4560k516j4018J5111
487E718N350j8000O502Q482j5997J968J3119j0191k341J1851p850m798Q863o777
501d101l301J4081n599r187J4358o84j5157Q701O777j0918N642P927j0296O12
515a145O205q893O14Q745p701j44J0177q732o044J0800n215p272J3318J8j0900
530f169Q238K952j1826L649O462o134M711M963j0051K444P818j1074j831J3588
544G740n301o531J0438k993j0372P048K153q353O994M950r251J461N349q112j097
559e877Q502l230j261N917l459m293N082r68m839N870L660m124n6P89k855N6J345
576B59o96K074J544k582q65j99j610O47J276m18J430Q74l443n65K121k045j95
$$ plain form
473 -4731 -4908 8662 -3755 -5646 10514 2080 -4685 10529 4112 -7419 7141 4625 -9393 5718
487 5718 11068 -6932 -430 8052 -7945 -5977 7142 -3049 -5390 6461 -1389 -6187 2676 -4101
501 -4101 -7402 6679 1080 -8107 6251 5567 -9590 -889 5888 -5030 612 8539 -1757 -1145
515 -1145 5060 -3833 -3219 5526 -2175 -2319 7858 -874 -6918 3882 -1333 -8605 4713 4731 -6169
530 -6169 2069 5021 -6805 -3156 3306 -2828 1883 6846 -3205 -761 7057 -4017 -5848 7740
544 7740 2439 -4092 6346 3353 -7019 29 2182 -6171 823 5773 -3478 -2017 3332 -4780 -5877
559 -5877 2625 -605 -1866 4051 592 -3701 1381 413 -4426 1444 5104 980 924 1713 -1142 -1086 259
576 259 -437 1637 3181 599 -266 -465 -2075 -1428 -152 -570 860 1734 -1709 -2274 -153 -2198 -2393
593b393L797M67j687M27l43j666J171L00M84J024O47q11j276m04J79k66k44J880
611A286M59k172M10J6l151O88L301k092m22L794k201l305L059K04k862L978K029
628C019m267K280J936m819Q65M099l347J75M410l650j595L110l250j700M866j862
644B70k670N179k252m691M708l58n690O050K870p102K903M959p790K15P099n305
660a605k05P871n382l751P824l431o839Q663J485q147N555K763r139K745N205
675C612p528J802P068p043j713P228n472l788P873j981l731P335k286o210P030
690B196m44p109O951L853p959L744M191r029K469O637p744L33Q785o964m156Q692
706D446m939n711R141r37p193P510M90r482N837M364r246M107P560q464m90P179
$$ plain form
593 -2393 1404 1871 184 611 268 -1398 -227 73 557 1581 2228 1417 141 -263 -84 -350 -594 1286
611 1286 1745 -427 -17 -1 -3152 -2464 837 -1255 -1677 2117 -84 -3389 -330 -126 -2988 990 3019
628 3019 -1248 1032 2968 -1851 -986 3113 -234 -59 4351 701 -894 2216 -1034 -2734 2132 270
644 270 -2400 2779 527 -4164 544 186 -5504 546 3416 -3686 -783 4176 -3614 -3399 3700 -1605
660 -1605 -1810 6061 679 -3072 4752 1321 -5518 3145 4630 -3517 2038 4801 -4338 -1593 3612
675 3612 -3916 -2114 4954 -2089 -3802 3426 -2046 -5834 2039 58 -3673 3662 1376 -4834 2196
690 2196 1752 -5357 1594 5447 -2512 1232 5423 -3606 -1137 5500 -2244 -1911 6874 -90 -4246 4446
706 4446 -493 -6204 2937 2000 -5193 2317 2807 -6675 -838 3526 -5720 -1613 5947 -2517 -3007 4172
722D172o252j770Q433l800l746Q052k950o565P329q87o341P262J780q477M275
737E15L704q394J973O259o603O69O792p037k266P490l624l841Q122k026n628O621
753B726n17p379N775L500p229L582M857p923M10O053n425j342O458l558k764N624
769B848l717m814P075N04o043M757K167o060K231K735m965K366N262m994r99N676
785D029m176k534N687j131l394N070n19n055L335Q70n579L567L915n185n62L909
801B247l396j644K699j661kL913k816k971L937k23l834L137K360k211J329Q64
817A728l542J497K480l250J358L970l484k267L839j945k616L654m01k657M098
832B462k82o009K798L637n539L62N322k566j890K725k328j635M945j039l861N182
$$ plain form
722 4172 -2080 -3850 4583 783 -2963 5089 2139 -4426 2903 2016 -4325 2937 4717 -3760 515
737 515 4219 -4175 -2202 4057 -2546 -1877 4915 -2122 -4388 3102 -522 -4363 3759 1733 -3895 2726
753 2726 2209 -5170 605 4105 -3124 458 5315 -2608 -2198 3855 -1570 -2912 3546 -12 -2776 2848
769 2848 -869 -5683 1392 1896 -4147 610 2777 -3283 -1052 1683 -3282 -916 4346 -648 -1647 4029
785 4029 -147 -2681 3006 1875 -1519 3551 3032 -2023 1312 2182 -3397 170 4085 -1100 -1662 2247
801 2247 -1149 -2793 -94 -1755 -1757 2156 -660 -3631 306 83 -3751 -614 1746 -465 864 1728
817 1728 -1814 -317 2163 -1087 271 4241 757 -1510 2329 384 -2232 1422 1021 -1636 2462
832 2462 2180 -3829 -1031 2606 -2933 -2571 2751 185 -1705 1020 -1308 -2943 2002 963 -2898 2284
848B284J182n725J886L312m169J51M243k700n70K608l504j546M517k129k844M029
864A025K13l477J347Q8k498L399R29m118K775L029m392k10L543k540J14M007k491
881G43j165M423l191l093N252j1n133M019K227n293Q25K550m169Q60L210m124
897b070q7M874m126l083M298l92k775L575O5k975K855P54l990K494K440k862J586
914E81K593l296l8K495k942J79L581k400j164L646j980l612L145L98l141K907
930I52L57l148K388N40m767J750L732l170l06L917k728j864L340j366j818L765
946A574J41k676K267K42l381J884J778k827J100K339k804n26K045k208q99K945
962I94m90j673J756k08k182J002O17j233J923J115k036O81R53j712k3J600o39
$$ plain form
848 2284 3466 -2259 -373 2939 -1230 -1079 3164 464 -106 2502 -1002 -2548 1969 -160 -3004 1025
864 1025 1238 -2239 -892 -804 -3302 97 1026 -3092 -317 2712 -1680 -1890 1653 -887 -773 3234 743
881 743 -422 4001 810 -2283 2969 2958 -2175 1844 4071 -1222 -397 2153 -2016 -1156 2054 -2070
897 -2070 -2157 2717 -1409 -4492 -194 -586 -3361 214 279 -2696 159 913 -3077 -583 1857 -1005 581
914 581 3174 -122 -160 2335 -607 -428 3153 753 -411 3235 1255 -2357 788 1186 -1955 952
930 952 1309 -1839 549 1089 -3678 -1928 1804 -1366 -1672 2245 -483 -2347 993 -373 -2191 1574
946 1574 1715 -961 1306 1548 -1833 51 1829 -998 102 2441 -363 -889 1156 -1052 -1951 994
962 994 504 -1169 587 379 -1803 -801 -184 -1417 506 1621 -415 266 1219 -493 -516 1084 445
979D45l04J590j97j603M73l86o24J300J49j058O88L8j314m11N28l72N68P76l94
998a08j119L69L60q96M84Q23J88J47L78o74m11L96J65J55J205j88q56K61J17j519
1018g23N99J469j171l19J566j362j101J695j050r94J979L9j207J189n87k014J678
1035c14J286k230J154K270l058m60K721k225j235L286q78j557K510j004k307K488
1051D47P2k995K820K196m081Q29K352l170L55L505k498q71L611j753k502L374
1067A691p52k593K986L01k657K627J08l860K291J715l636J237L184l953m70L326
1083A545k608p56L206k621j345M884j945l816M059N12m043L581J608m056K426
1098F31K055n101J918M190m714q1M646l181k025M393k053l148M448q89m004M861
$$ plain form
979 445 141 1731 1534 -69 404 18 -606 694 843 -215 473 511 -803 -1214 -686 -1058 -490 286 -108
998 -108 -1227 -858 -498 -1394 -910 -87 101 248 626 -48 -459 -63 102 257 1462 1274 418 679 796 -723
1018 -723 -124 1345 174 -145 1421 59 -1042 653 -397 -1391 588 627 -580 609 22 -1992 -314
1035 -314 972 -1258 -104 2166 -892 -1352 1369 -856 -2091 1195 317 -1240 1270 266 -2041 447
1051 447 519 -2476 344 2540 -1541 -712 1640 -1530 -1175 2330 -168 -1039 2572 819 -1683 1691
1067 1691 939 -1654 1332 1633 -1024 1603 1711 -2149 142 1857 -1779 -542 2642 -1311 -1781 1545
1083 1545 -1063 -1819 1387 -1234 -2579 2305 360 -3456 603 1115 -2928 653 2261 -1795 631
1098 631 2686 -2415 -497 3693 -1021 -1102 3544 363 -1662 2731 678 -2470 1978 1089 -2915 1946
1114A946L94n627K758K375l997J163K954l835J039L145m200j08M483k766j970
1129b246M475r97k887L401j038l028M006N3m137L718J244n195J727L114m044L77
1145a457L137l297N22L550m138j545N006j693l180M693J96m146L022Q38l861L220
1161H67J984l906J165L224l954j08L097k516m05K779j843j555L206k040k995L672
1177F72M86l773K063J543k824O85J110j913J190K053k925K76L240k599j139L333
1193A478p50j716K920n94k272K337J91k407J510J408k077qJ525k103J54J237j692
1210h59qJ999k009j095K426o73j741J855M32j415J017K84j281Q96P33j185Q85
1227B61J218j855K44J154q25l96J437o87j066J668o08j629J121O27j223K64P33
$$ plain form
1114 1946 2340 -3287 -529 1846 -2151 -988 1966 -1869 -830 2315 -1885 -1993 2490 -276 -2246
1129 -2246 2229 1232 -1655 1746 708 -2320 1686 1739 -2398 1320 2564 -2631 -904 2210 -1834 -1457
1145 -1457 1680 -1617 -1095 2455 -1683 -3228 1778 85 -3095 1598 1794 -2352 670 1508 -2353 867
1161 867 2851 -1055 110 3334 -620 -728 2369 -147 -552 2227 384 -1171 2035 -5 -3000 672
1177 672 1158 -2615 -552 991 -1833 -1148 -38 -1951 -761 1292 -1633 -1357 1883 -716 -1855 1478
1193 1478 728 -988 1932 1338 -934 1403 1594 -813 697 2105 28 20 1545 -558 -404 833 -859
1210 -859 -867 1132 -877 -1972 454 -219 -1960 -105 327 -1088 -71 213 -1068 -172 561 -624 261
1227 261 1479 -376 -132 1022 197 -199 1238 551 -515 1153 545 -1084 37 664 -559 -295 438
1244D38q11K5K22p92M73R55p00l77J108m48j243J102J035j121L74J186r92p14
1262b80O27j41k82R33l72l75P45n06j073O04J79r14R22Q86j680m95J188m56o00
1281a090J166J88j068R58J30j251Q08Q35j167O37R86q07J28P54j518l38J655j1
1299I95r54Q06k64j322P34M31j216Q72O41j358O68Mj358M64J473j139j4J606j744
1318f75m90J701q99m75K027q2j747J183o0j674J748M60j960J326J500k304j48
1335e69J884k002l43K085p56j327J958o23j757J636K76j354J123R57j761L82J383
1352A192j549j48J668j214k19J664j062j231J452n04o57Q99Q8r29O96J80j441
1369a115O46O33j118P07R68j410J11J571j663k83J457k04p43J708n99j338R77
$$ plain form
1244 438 -373 -348 -126 -918 -445 510 -190 -567 541 93 -1150 -48 987 -134 240 1426 434 -280
1262 -280 347 206 -76 857 485 110 855 349 -724 -120 59 -855 67 953 -727 -1222 -34 -490 -1090
1281 -1090 76 264 -804 154 284 -967 -159 676 -491 146 1132 325 453 1207 -311 -649 1006 995
1299 995 41 847 583 -739 -5 426 -790 82 723 -635 33 37 -1321 -857 616 -523 -537 1069 -675
1318 -675 -1165 536 -363 -838 1189 1107 -640 543 483 -1191 557 1017 -943 383 1883 -421 -569
1335 -569 1315 -687 -1030 1055 299 -1028 930 307 -1450 186 462 -892 231 1188 -573 -191 1192
1352 1192 -357 -505 1163 -51 -270 1394 332 -899 553 49 -608 291 379 -550 146 326 -1115
1369 -1115 -469 164 -954 -247 721 -689 -578 993 -670 -953 504 300 -443 1265 666 -672 305
1386C05O55j516J124O87j469O72R33j864m55J593q87n72J311j29j172O48k8r88
1404a152Q36P63r31L28O12j059M43N52r63L51J787j336l89J144j031p63J305N2
1422E49p77O55L51j273K69M48j287O12J518j313n02J540r14j347J335J39o55J184
1440E32L53j678P56Q95j552K87J662r38k68J117j064p66J582o08r42J740n42j707
1458a141J240N12j730M73J004r28M08R65j776q9J524j414L5J872o99p76J457o67
1476B70j369J868L23j893J666P24k436Q33J167j572l8J440j024l77J469j681n88
1493a218J986r16j673K300J66j799J172M77k001J183J225j808N67J837j864nJ537
1510A166j503m71K223q41j218K047o68j971J908N1k219J528J283k211M82J149
$$ plain form
1386 305 960 -556 568 1255 -214 458 1391 -473 -928 665 -222 -794 517 388 -784 -136 -164 -1152
1404 -1152 -316 447 -484 -156 456 -603 -160 392 -571 -220 1567 231 -158 986 -45 -808 497 549
1422 549 -228 427 778 -495 -226 222 -1065 -453 1065 -248 -750 790 -124 -1471 -136 3 -652 532
1440 532 885 -793 -37 858 -694 -407 1255 317 49 1166 102 -664 918 310 -632 1108 566 -1141
1458 -1141 99 611 -1119 -646 358 -570 -162 803 -973 -1062 462 -952 -917 955 256 -520 937 270
1476 270 -1099 769 1092 -801 865 1589 -847 -14 1153 -419 -457 983 -41 -418 1051 -630 -1218
1493 -1218 768 -148 -1821 479 645 -1154 18 495 -1506 -323 902 -906 -339 1498 -366 -371 1166
1510 1166 -337 -808 1415 574 -644 1403 735 -1236 672 723 -1496 32 1315 -896 -414 735
1526G35j618Q5J672j760j51K265j406j317K307r18j300K052K57j889J471Q03k276
1543i88J049J124k028J043J206k120L84J641j679p05K200j107r28J671p10j782
1559a729K146j70j525J526N37k274J547J086k325N65J548j441J34J605j246m94
1575e10K019r37j601J904P7j505J140j07j516J368O06k084Q91J127j572K18J367
1592H85j616k68J692j065n15J686n91q92J273j05j167Q86M96j128R61K24j060
1609c04P09P77j841N17J184r07o69N57j91l72N76l17l33Q24k42q35P84L59r44
1628f68O44M79o99K81O16q12J42Q04o58l09P01j6k96l1J50m65J61K08o56M16M04
1649C96p46o4O39n14l16O81k42J04J79j46k19J95J7J60l14N37j45m80N93L5k48
$$ plain form
1526 735 -883 -798 874 -886 -1037 1228 -178 -1495 812 -106 -1406 646 903 -986 485 1288 -988
1543 -988 61 1185 -843 200 1406 -714 -330 1311 -368 -1073 1127 20 -908 763 53 -1729
1559 -1729 417 247 -1278 248 785 -1489 58 1144 -1181 -616 932 -509 -375 1230 -16 -510
1575 -510 1509 572 -1029 875 952 -553 587 480 -1036 332 938 -1146 -255 872 -700 -482 885
1592 885 -731 -999 693 -372 -887 799 208 -684 589 484 -683 203 699 -429 532 756 -304
1609 -304 405 1182 -659 -142 1042 135 -534 23 -168 -540 36 -281 -614 210 -32 -867 -83 276 -668
1628 -668 -24 455 -244 37 653 -159 -17 787 129 -180 521 505 209 178 328 -137 24 232 -424 -8 396
1649 396 -350 -414 225 -289 -605 76 -166 -62 117 -29 -248 -53 -36 124 -190 347 202 -278 315 350 102
1670A02J61O8n0p0N4k78M9J58k17m90L72J71m49L97K9o37K63O50p57J39O07n99
1692c27P7O61o38m6P75k72m61P56j31o30Q01qj163O96O14j151N25M42r06J44N81
1713C39j085J77Q94o02m17J027l93p56J252o7j110J320j87q20N98L91j052O09
1731A18Q44j237K12R12j052k60J297r14n49J301k63j559J263k5j103Q02M36j171
1749i48Q30Q98j496M84R37j656K48J702j132l64J491p72r46J231j80j056J247
1766E18K30j345O13N33j226P05N60j149K80R40j023o31J501q38m31J294n98r01
1784i68J501j58j283J109K72j077P64O98j342O66R18j500M44J024j010n68J432
1801I22r12n72J119k66j030Q61K66j193R84J96j072M13O80r34K92R36q32j74J132
$$ plain form
1670 102 263 331 281 211 265 -13 36 194 -23 -513 -141 30 -419 -22 7 -630 -367 283 -474 -335 272 -327
1692 -327 -250 411 -227 -273 502 230 -231 525 394 -236 565 557 -606 90 704 -447 78 520 -386 -242 339
1713 339 -746 -569 325 -277 -694 333 -60 -816 436 369 -741 579 392 -428 170 561 -491 118
1731 118 962 -275 -63 849 -203 -463 834 -80 -629 672 409 -1150 113 88 -1015 -213 223 -948
1749 -948 -118 780 -716 -232 705 -951 -703 999 -133 -497 994 222 -724 507 327 -729 518
1766 518 748 -597 16 549 -677 28 588 -561 -281 659 -364 -995 506 -332 -763 531 -67 -968
1784 -968 533 375 -908 201 473 -604 160 858 -484 182 1100 -400 44 1068 58 -510 922
1801 922 10 -562 557 291 -739 122 388 -805 179 375 -697 -284 396 -538 -246 690 -142 -316 816
1820H16r59m58J097k49q38J167j56p49P75Mp80N18N63j190L57P28r80M7Q59r20
1840c48m59J411o74n22N96j13q00Q63J02m68N59K82p90N30O96r12K1Q24p97j45
1860a44M67n6n69M94n3q40J126K57j087N4P47q58J70K87j45R9N13p32m35J006
1880C01j14o64R90K27q68K82K16p63O06K87p95N22O60j199j62R90n97l78Q93l32
1900A02l52N41k76p24P86J9p23M75N13l95k24L39l82m3P82m95q9J054p99n28O20
1921B01L04n41L81L45o45jJ34o65J68R68j031j40R79l93o21M10k65l28J036j61
1941A35p46R87k37q75O86O12o96L79L33o52j9N85q43O2J118k94q25J003o45n96
1961e28O40L1n44P64k2j105Q35J47r30K61Q82o57R0N48n54k41Q67n54m05J021
$$ plain form
1820 816 -143 -601 496 247 -591 576 420 -329 446 450 -330 188 751 -439 -82 646 -334 -287 572 -348
1840 -348 -807 604 -70 -592 4 -109 -909 -46 56 -412 147 429 -361 169 865 -47 -26 798 1 -144
1860 -144 323 267 -302 192 139 -701 425 682 -405 -351 396 -462 -292 -5 -150 -51 462 -270 -705 301
1880 301 187 -477 513 740 -128 154 370 -393 213 500 -295 227 887 -312 -474 516 -81 -459 434 102
1900 102 -250 291 15 -709 77 96 -627 -152 361 -34 -258 81 -301 -344 438 -57 -146 908 109 -419 201
1921 201 505 -36 345 690 45 44 178 -487 -319 649 -382 -522 457 64 -557 -147 -412 -740 296 135
1941 135 -611 376 139 -736 -50 562 -134 245 578 -74 -93 492 -351 -289 829 535 -290 713 68 -528
1961 -528 112 143 -401 363 341 -764 71 218 -712 -451 431 -226 -136 412 -142 -383 484 -70 -475 546
1981E46R8q91M93L02q99O47J39p28L23M57q15K12M29n34j30M14q7l75M50J7m15
2002c47L64j46m44P33J45n96J59L47l16M1P32r06l1O17q9n73N95j85k25M42l86
2023f9j35M37q1k97M6L17o01J72L27k68k9O13o25M8M67l61n1L41j73k07J77Lj84
2046a33L20J66k88OK78m97jL40r1j44J9k8l17K55J73j86j46L22l90K03J15N4k73
2069b43L90J12l82K98K1k88LJ58j59J82J99j45k20M13m95K64O7k03l57M89qm23
2091c27O8M92n45N5M29n47M44K72k74k52K49q8j62L92l1k38L74J01p42M85J46
2112C01n31Q9M80n99p2P54o54J96N48q72k53P84l33m65R25j80n16P34q5p13N29
2133F7O35r24L1Q01n75j49R43p32n39J329o66p74R27k14o66O49N3q59N27L87j126
$$ plain form
1981 546 644 -247 246 548 -351 296 435 -293 30 487 -328 -116 313 -221 -351 63 -24 -399 51 68 -347
2002 -347 17 -129 -573 160 305 -291 -132 215 -101 -60 672 -234 -265 352 263 -310 285 100 -125 317 -69
2023 -69 -204 233 152 -145 -99 218 -383 -211 116 -152 -181 432 -193 -145 322 -39 -90 251 78 -129 48 51 -133
2046 -133 187 353 65 71 349 -148 -149 191 100 -44 -25 -53 -370 -115 58 -128 -274 48 -342 -139 -24 30 -243
2069 -243 147 259 -123 175 196 -92 -89 69 -90 92 291 146 -74 339 -156 108 175 -28 -385 104 96 -327
2091 -327 -259 233 -312 -257 172 -375 69 341 67 -185 64 -24 -186 206 175 -63 311 412 -330 155 301
2112 301 -230 -141 339 -260 -332 422 -232 -36 512 -360 -613 171 -162 -627 298 118 -398 336 251 -462 67
2133 67 702 -222 -191 610 35 -114 829 97 -442 887 221 -553 374 160 -506 143 196 -663 -136 251 -875
2154h75L60Q42q05p6J139j034P3P93l01m02O17m65l31Q86J05r79P74K47r67P73
2174C74L97q91j1P85p64J10N30o85l76J115p32n18J014j61j141J022j08n68O09
2193AJ84r71Q38M14r00K20P70n87k46P63k68l73P59o06j76Q67l26o79L61K42q73
2214e86M74N09p52K17M49q75J83P55p61k23J018n11k19P53m89k48Q33j54q80P63
2234B56M07r87M34J97m30J56K66o52K33O94r99J45L37K8o20O15K9l48J81K0n55
2255e93O71J85q14L44M50n48L12N50n75L3K59o4m23Q57n48j15L48j77k64K07J52
2276B47m48P7L39m72K33K48m63J12L80k32l57K59K69m13K50l8j60K95J96o11K29
2297f0L85o49J76L75O5k07J49l18p3J00J83j28J96o9l00p9L54m19P8M62%m77N3
$$ plain form
2154 -875 -515 327 -478 -554 585 -449 -376 417 116 -286 331 -134 -465 421 526 -453 321 568 -399 374
2174 374 771 -120 -131 654 -110 0 530 -155 -531 584 -148 -666 348 187 -954 68 -40 -608 1
2193 1 185 -786 52 466 -434 -214 556 -31 -277 486 218 -155 604 -2 -178 689 363 -316 45 287 -586
2214 -586 -112 397 -355 -138 311 -564 -381 374 -387 -610 408 -103 -322 431 -58 -306 527 373 -507 256
2234 256 663 -324 110 307 -123 33 299 -353 -120 574 -425 -280 57 85 -535 80 109 -239 -58 -38 -593
2255 -593 78 263 -551 -207 243 -305 7 557 -18 15 274 210 -213 644 96 -19 329 152 -112 95 247
2276 247 -201 -124 215 -257 -24 224 -239 -127 253 21 -336 -77 192 -221 29 -9 -169 126 322 -289 -60
2297 -60 325 -324 -148 227 292 85 234 -84 -157 -57 126 -2 194 125 -175 -254 100 -319 -241 221 221 -256 -203
2320b03J27K2J39j7k93L13J68k88K30M0l03K57N3m07K71Q7k79j54M78l98J37K65
2342B45l07l3O2j56Q5l2k6r7J02N59l56j63L94k03j88M98j27l90M30n9k69k3Q6
2365C2k33M77k6n53J93L41m32j83P15m15nL8j11j11M93j64m27N18k9l14N79O9
2387D52r38M50L30j51j17K84k45n77M71K56o18O43k59p2P7m9m31M30M86p86K85
2408g9J50J3j89K07j22k39P17j58l57K37p5j86L51j70l3K6M6j63J90j95q4J59
2430D6rj87j12K09J76n17K39q7%K48j04k50L02j1r6M39j34k58K98K69j94k21L50
2453C96l90J06j40L76n56K41J1k71J53K92l92j59K00Kj03L18k51l0P1k4OL20j41
2476C5l7J07J04l29K88J38l16J23J66m07M8L78k39k44N21l07j79L71q3j64j65
$$ plain form
2320 -203 -76 -54 85 68 -225 88 256 -32 198 238 -65 192 245 -162 109 196 -83 -237 241 -157 -20 245
2342 245 -62 -95 -33 -189 -104 -136 -162 -259 -157 402 46 -117 277 74 -114 384 257 -133 297 238 -31 -54 32
2365 32 -201 276 250 -303 -110 231 -201 -384 331 -84 -89 -51 -162 -273 220 56 -371 147 118 -196 383 452
2387 452 -486 -36 294 143 26 310 65 -512 -41 215 -403 240 -19 -91 -14 -63 -494 -64 422 -364 -79
2408 -79 71 84 -105 102 -20 -259 458 300 -57 180 105 -81 270 100 67 93 139 -24 166 -29 -113 46
2430 46 37 -150 -262 -53 123 -394 -155 -242 -242 6 -98 -348 -46 -57 -153 286 152 -106 192 461 267 46 396
2453 396 6 112 -28 348 -208 33 44 -227 -74 218 -174 -333 -133 -131 -234 84 -167 -197 -126 -150 -144 176 35
2476 35 -2 105 209 -120 168 306 -10 113 279 -128 -80 298 59 -185 336 29 -150 221 138 -26 -191
2497a91K87o5m29L13j94N7J31p0j25N03l15k9K47P3m44N90l99j42L41L8j64J36
2519A49N9m10K83K20m54m8L99k46q4J34J09o82M76r2l28N94M5m61J40K84k03J47
2541C1L18k89m5K81k3k99J00N1K7k5Q0l09L84r6k28K43j7m60J98J74m63K21J70
2564B4k55k01Q60k96o36P54j29m48N20p6l49J48K52m21J84L66n83N88J33o22M5
2585a42M18j99k65N16l54l27L80M6m14N47l24k43L48J32l51K60L80n25J5K75m16
2606b43Q9M91k71k40M47j78l16L17Q2l65M64j8m72K27J12k14l1M57m57m8L80n80
2628c67J24L82l83j28P43l56k64L56k74o0M61k6o21M41L83n13k5L82l48M8K58
2649B13l34Q2J47l1l45M54k30l42N21r4m30M81M3k97L20j00j98q9N66m22o6K96
$$ plain form
2497 -191 96 31 -398 -85 -279 -222 -91 -161 -286 217 -98 -127 120 193 -251 339 -60 -202 139 177 13 149
2519 149 208 -202 81 301 -153 -201 198 -48 -132 2 111 -571 -95 -187 -515 79 124 -337 -197 87 -116 31
2541 31 349 60 15 296 273 -26 74 125 152 127 207 -102 282 186 -42 201 184 -276 -78 96 -367 -146 24
2564 24 -231 -432 428 132 -504 250 121 -327 193 117 -232 -84 168 -253 -69 297 -286 302 435 -187 -142
2585 -142 276 77 -188 328 -26 -353 27 73 -341 206 -118 -361 -13 119 -232 28 408 -117 -102 173 -243
2606 -243 -154 337 66 -174 273 95 -221 96 178 -187 277 259 -213 14 126 -88 -119 338 -119 -167 213 -367
2628 -367 -243 139 -244 -372 371 15 -249 107 -167 -227 234 208 -413 28 411 -102 -127 255 -93 -45 213
2649 213 -121 -39 108 77 -268 186 -44 -386 135 41 -389 92 135 -162 158 58 -140 -229 337 -85 -151 145
2671A45j36k23L21Q0l79K92P3m70M49j7k95J03O0p6J26K43m04k3R0r3O4K37l83
2694b16J50J80j9j44J23QM2p7J9j59lL41k21l03L82j3R6oj04O3k55M8j31K99k
2719I8k08m7L92o02J26J91J00k74J59m1P8K98J6k61J75P5q8JM5r8m49N58r6l11
2743a63R1M60n16M8R7j50J26p4j23j9Q6j7j68K57pr7L15J11l58J73P3k39K22q3
2767D5K6L8P6r3L3J04k44j92M03m86J38K05N2k68o1K48k09L4J99j96K14r0j44
2790a68j4R7n2J93p9K81l67L40o8l10K57J83k23K4J04n39M8K99l48K09L33l90
2812a90J29n2k76J47L43n25K95J65R9l89K88o5o1J60J48k60j63O31l57p2J12k63
2834a56l9M28l55j05L37j53l06M75pk84N0K10l16J50K6p6j9K96j58l26O60m81
$$ plain form
2671 145 9 -214 107 187 -192 100 173 -297 152 135 -160 -57 3 -73 53 296 -108 -131 -41 -134 -70 167 -216
2694 -216 -66 114 95 -49 74 82 124 47 66 -93 -96 245 24 -279 103 90 186 180 76 139 -116 -68 -199 100 98
2719 98 -110 -157 235 -367 -241 -50 50 -224 -65 -106 -28 270 286 25 200 275 187 188 233 135 -314 244 148 -163
2743 -163 -72 388 -128 -80 17 -133 -7 -81 -204 -223 -137 -154 -322 -65 -72 -169 146 257 -101 72 145 -94 128 45
2767 45 71 109 185 92 125 229 -15 -207 196 -290 -152 53 105 -163 -224 24 -185 -151 48 -148 66 -24 -168
2790 -168 -182 -85 -137 56 -23 258 -109 231 163 -147 110 293 70 94 198 -341 -293 6 -342 -133 200 -190
2812 -190 -61 -113 -389 -242 101 -424 -129 36 135 -254 34 -31 -92 68 216 -44 -207 424 67 -5 107 -156
2834 -156 -195 233 -122 -227 110 -43 -349 126 119 -165 -115 95 -221 -71 -45 -121 -140 156 -2 -328 332 -149
2856a49l43P15Q2m56J91K65l14L09k33m1p1K26k05k53O28n48K0J79l90K82J83
2877G7L2m06L74j98j48K03pk3NK65k05J00J25j86O3L9l49J77M52j84l44L28l20
2900a30n1M62k97k18L88L7m35K20J70k95p2J61j48R5L46j56k33K22J11k01J47
2921A23K1j29l3J5J77p6K55n34J39J26l67o1M40k93K04J25j12k65J60J56j99J33
2943En0j32L1J62j42J03L03k60J17o0O9l9N8j0l28J63j11j66K86J04k26q4M66
2966B59k38k16L53J5q3j0q8k96L58l13O8K02m9j98K23K59l92M18N6m73O3L25j38
2989A05o0O9m8k1J85k53J16m5Q9k89K16j57j73J46K85k63Q2J73j74J32r4j43p0
3012a92M64k78n8K24R4n50K40K45m46L85j8k65K27K37m63k76L97Mk83M14l68K6
$$ plain form
2856 -149 -492 223 305 -151 40 305 -9 300 67 26 -45 181 -24 -277 351 -197 -177 2 -388 -106 77
2877 77 109 -297 77 -121 -269 -66 -73 -96 -91 174 -31 69 194 8 71 110 -239 -62 390 206 -138 190 -130
2900 -130 -181 281 -16 -234 154 191 -244 -24 146 -149 -221 -60 -208 -113 233 77 -156 66 177 -24 123
2921 123 144 15 -18 -3 174 98 353 -181 -42 84 -283 -344 96 -197 7 132 20 -245 -85 71 -128 5
2943 5 -45 -177 -146 16 -126 -23 280 20 137 77 146 107 165 155 -173 -10 -121 -287 -1 103 -123 -207 259
2966 259 21 -195 158 173 90 80 -8 -304 54 -259 -191 11 -38 -236 -13 246 -146 272 328 -145 -82 243 105
2989 105 45 114 66 45 230 -23 93 48 137 -152 64 -93 -266 -120 165 -98 -16 157 -17 115 21 -122 -192
3012 -192 272 -6 -64 160 254 -296 -56 189 -257 128 110 -155 72 309 -154 -430 -33 -29 -312 102 -266 -240
3034b40K33K9j86J08K67m78J69L90m52K59m6o5j3j21L84k60j66J99J24k38M61
3055C58n78M16j74j01J40O6k49j82M57n29K37K33k04k9J59J3M4j96L6J53L05l15
3077F0Q7j59M69n05L17l70r4l7L17QJ5J94j74l14J60L2k80L63j69j16J2K50k01
3100a35O5j24J24K66j50N6k68K81k6k35L22j44J15l5J93k48l1L4J18l34K02M5
3122I1j14J88k22K0j47O2K41n1L6k54K47R5l78K92j00k00J63Q4N2k38Q0jR7r6
3146e3P1p3L07m8l31K05P1N0j42K6k58J28j0J59j26j07K04l61QM33k63nL49m69
3170b35J89J85l16K16J0j04J29j2j47P1M08l58M5l4O9m03J51J93j59Lm9q4J22
3193a10J7R0p8K3j46J7L52j63K8m1J73k75L84o0l68L28J88l07j59J0M4J12J51
$$ plain form
3034 -240 -7 22 -164 -56 211 -267 -98 292 -160 99 53 -12 -25 -146 238 -22 -188 11 135 -103 358
3055 358 -220 196 22 -79 61 127 -122 -304 153 -376 -139 94 -110 -139 20 33 77 -119 -83 70 375 60
3077 60 147 -12 457 -48 269 -101 -195 -232 85 93 108 302 128 -186 -26 6 -274 89 -80 -196 -184 66 -135
3100 -135 -70 -194 -70 196 46 102 -166 115 89 -146 176 32 147 112 305 57 26 60 178 -156 46 91
3122 91 -23 165 -57 -37 -184 -122 119 68 104 -150 97 192 -186 106 6 -194 -31 53 105 -133 -53 -54 43 -53
3146 -53 18 -55 252 204 -127 78 149 199 57 83 -175 -47 -57 102 -24 -131 73 -288 -280 153 -110 -115 234 -235
3170 -235 -46 139 -177 39 49 -55 74 62 -85 -14 394 36 81 47 116 -287 -136 57 -102 -99 -148 -232 -110
3193 -110 -93 -3 -81 -58 -204 -187 165 2 30 -11 162 -113 271 211 -157 171 359 52 -107 -97 -53 59 210
3216B10k74J50o9j02O6O1P7q7j70K45l97K90R1j57J16J34k16L7L38m64rM8Q5l12
3240c09M93k63K26j0k56j18L75k39j04J96j55n3M78k20j16n9J51l65N3N25j17
3261A13l1Q0R9m23J56j10Q9K21J36k63J50l44J84j95J34rp3K35j42N1j7J17m59
3284c01J38K48n8L3j57K72k55J35j02j60M02k95L3J3NJ10R9j08j44K11K8r5K11
3307B63k45j71j4J54j02JL42m50J46L22l26k43N65j92J16k23J85p9J25j86N6M3
3329H7P6r0n7Q1j13J34l5k4j00K32j50K45m73J14L44l05K3l5M7Q8k59Q7M32m92
3353a43K55M2k50K28N7k72J13K09k13K47j88L8j85J67r8J28J13j26J28j54m1L
3375E8j70J34l40K55k83J98J4Q9J63j51l33M78l99M8K91k69K98K8J26l14J80K1
$$ plain form
3216 210 -64 86 17 -85 -19 42 119 32 -138 107 -290 0 91 -66 50 184 -32 5 343 -121 -130 -82 3 -309
3240 -309 184 -79 147 137 -119 -237 138 -101 -205 -9 -164 -217 261 41 -75 -134 17 -348 -295 230 113
3261 113 82 162 261 -162 -6 -116 -27 194 330 67 217 -127 57 -138 -4 -13 -86 149 7 58 41 158 -301
3284 -301 -163 85 27 60 -97 175 -80 55 -47 -207 195 -100 -67 -54 -49 61 160 52 -92 119 147 52 263
3307 263 18 -153 -167 -13 -115 -114 228 -222 -76 246 -80 -323 242 50 166 -57 128 49 174 -12 44 87
3329 87 163 73 16 97 -16 118 83 59 -41 191 41 286 -187 -73 271 -34 -11 -46 1 89 -170 -83 349 -143
3353 -143 112 154 -96 132 189 -83 30 239 26 273 85 123 -62 105 7 135 248 122 250 96 55 58
3375 58 -112 22 -318 -63 -346 -148 -134 -45 118 -33 -366 112 -287 -239 52 -217 81 109 235 -79 101 122
3397A22j94J85J26n69L32N8k20K83k3m5P0k65J12k98N44k57Q1j2n2j06r7L45l10
3420a90K59l8j58R2K75l42J64K30k32j21K79J34l88J21o9p2o7J8O4L5J47k33m0
3443a32K33J59k87J73n8k79K99q9j48J65L4k19J21K72l95J91J26j69J44kn30M91
3465A00K8j71j97K03j10j11O6O8rL29j72O0Q2k90J70j63K33j08KL17k73J89j73
3488G0j1j26J65k7k65K55o9J57J7j40j94K51k48l6RK42L1j21J20j18P5K1oj47
3512i5K42O9k40j02J88k33L58j86q9K97l73J39J00j13K44j68q1l9j15K50k70J48
3534f9Q5M1k31l5N39k62k80K88J1j24j3J49m6m7O4K13k04q0j8J99kj82N7l1l40
3559c18J42J52J4l93N08k41N2J51k1j33J36j63r8L62k49J64k11J52K8Q4p4Q2j47
$$ plain form
3397 122 -72 113 239 -330 2 60 -160 123 100 55 125 -140 -28 -326 218 -39 42 30 -22 -128 -225 120 -190
3420 -190 69 31 -127 -35 240 -102 62 292 60 -61 218 352 -36 85 16 -56 -123 -105 -41 -6 141 -92 -132
3443 -132 101 260 -27 146 88 -191 108 19 -129 36 70 -149 -28 244 -151 40 166 -3 141 139 -391 100
3465 100 128 -43 -240 -37 -147 -258 -192 -124 -133 196 24 84 166 -124 46 -117 116 8 10 327 54 243 70
3488 70 59 -67 98 71 -194 61 -8 149 166 26 -168 83 -165 -201 -192 50 81 -40 80 -38 37 58 52 -95
3512 -95 147 216 -24 -126 62 -171 187 1 -88 209 -164 -25 75 -38 206 38 -43 -82 -197 53 -217 -69
3534 -69 16 57 -174 -209 330 68 -212 76 87 -37 -50 99 53 6 70 283 79 -1 -19 180 178 -4 53 22 -318
3559 -318 -176 -24 -10 -403 105 -136 -84 67 46 -87 49 -114 -212 150 -99 65 -146 6 34 118 44 126 -21
3582b1J10k1n3J8K8j61J22K04k51O6J30k39k37K09q2OJ19o8rK27j76M0J88J9k37
3607f9J2L2k40L16K62l69J42N9o5j0j1K2p6q7K66j05k19J1n2P6J78k76J9pJ01
3632i0K67j88j51J72j18PJ02j09L5K35q4j84K0O2L19l67J30J13m36L45J06k73
3654h7m1K36k05J74P7j34m6j09R8j92M23k41J32l1j22q1L25J9m33L52j33M6J02
3677A29J61l45j8J24J13r5J40O7n57L36j08l13N26j71R2JQL4k91QK91k17K41l29
3701a73K22J46m4j65QL4k38J99L00k84J03J38k76K25j63m0n4p4J38l3PL9j3p1
3725f9J62q2J51l04J43Rq3K41j85K05k41q1K01J91j96l2J0q8K9J33Q5k15R3k5
3749E2K7Lj11M5J14k25j79M23j04j13p9o0J2M33m19J17j29L50r4k81J62J18o3
$$ plain form
3582 -21 89 68 15 33 61 -100 22 226 -25 41 171 -68 -305 -96 -178 -172 -53 -121 -130 97 -79 -39 149 168 -69
3607 -69 -57 -25 -265 51 313 -56 86 145 80 70 59 81 5 -82 184 79 -140 -129 -181 -105 73 -203 -184 -191 -90
3632 -90 177 -11 -162 10 -108 -101 1 -108 -73 162 78 -106 -86 -24 295 -72 58 171 -265 80 186 -87
3654 -87 -128 108 -97 77 154 20 -26 -135 -37 -229 194 -47 85 54 -68 -149 176 195 -238 114 -19 27 129
3677 129 290 -55 -73 51 164 69 209 276 -281 55 -53 -366 160 -11 81 82 90 124 -167 -159 132 -85 156 -173
3701 -173 49 195 151 -14 -6 28 -210 -11 289 5 108 246 -30 195 32 -8 -62 -136 2 -31 -24 15 2 -69
3725 -69 93 11 162 -142 1 10 -73 168 -17 188 -53 -134 67 258 62 30 40 -48 -19 114 199 -16 77 52
3749 52 79 82 -29 16 130 -95 -274 149 45 -68 -147 -207 -195 238 -181 -64 -193 157 63 -218 -56 62 -1
3772ak78K64M4j60p4K14J36n7j2P3k98J02Q0J81j49p5OJ91k40R6m0k11J89j52
3796a71J21q1l3M55m29K82k62N8J52j3O3L6j45J3P5k24l5J99m2J40j39J97j06
3819A11j30R9l68J97o3K03n1j48J86J33Pk73PJ86j22j01L01r5l78O37l80L3J84
3842A75r2k91l9K69j1M3J3J0k64J53o7N4L37j62J47k20Qk16L78o4k97p5N40m43
3866a14M9L18k46J25l58K66J53k98O8l9M4J51l37rL99j81j3M1R7o3j8k05L57n9
3890A28o9n4J04j9l30K58R2o9J05J40l81R2J71l22L1J65k26J64M9j13K18k08m2
3913a16l2N5K42k98K2L09k36K44k04K05n1n3m4k80M63j49j68J14l8jJ56j80K72
3936B32k37M0L3k65L10k87J72Qk5p3J54J0j78m5K4J1J96j11m5K6j72J33L1J84
$$ plain form
3772 -1 -279 -15 29 -131 -205 9 145 88 76 149 -149 -47 33 214 65 -10 -4 187 -53 43 3 -208 -19 -171
3796 -171 -50 -131 -164 291 -138 144 -118 -60 92 79 142 178 33 46 121 -103 -138 61 19 159 20 217 111
3819 111 -19 80 -288 -91 -154 49 -2 -150 36 169 176 -97 -90 96 -26 -127 174 79 -299 338 -42 -9 175
3842 175 83 -208 -247 22 11 54 67 77 -187 -34 -101 -47 290 128 275 55 63 -153 225 161 -136 -211 329 -114
3866 -114 -65 253 7 132 -226 40 193 -105 -37 -76 -32 119 -218 -227 172 -9 -22 19 116 53 35 -170 187 128
3890 128 59 5 109 90 -240 18 110 41 146 286 -95 -3 168 -154 -123 42 -184 -20 29 -84 134 -74 -116
3913 -116 -148 -93 149 -149 -127 182 -54 190 -14 191 140 87 43 -237 226 77 -91 23 -15 -16 140 -40 232
3936 232 -5 35 68 -197 113 -174 -2 6 -19 -92 62 72 -106 -151 -127 -116 80 -31 -76 -50 -222 -89 -58 126
3960A26k82J34J86k49L00l44J43j44J24L4j97J75j58J50pj23P4oKj3J86j56O9
3983B4l2m4P5k26L33p0j47j93L66n1%L19l03nk63K79rrq8J70j87j4R0p4j60J66
4009e3Rk20L11M2j49k55M00j58p5J99J09j71m6k5J4K48Mj71P4m5J99p3k3r0k72
4034b17K13l0n2O8o1q3J97J53k76J23k47L06o2j51K18M4k28L7J68Q6k92j91M35
4057A58l97K49l4j26J09J71l8Q0j81J4J9k54mK81j31K2j57L9J65j47J86j19nJ66
4081F6P0k00J21K4M9j70P0J73l00K70j37M0k22K00o1j12K00k26M51j23k75%J6
4104g6N1m9l6P0k7NJ15r3k5M3Q5j77R9o5K10k29J80j46j52N07j84j74J39M7j74
4129e6n9K8M9MO4J18j94P3j63R7R6j27k04L79j40k7K80o1q5K21k91L4j72J18k2
$$ plain form
3960 126 -156 -22 164 -85 215 -129 14 -130 -6 28 -169 6 -152 -2 -9 -132 -58 -64 -62 -75 111 -45 24
3983 24 -8 -52 23 -203 130 60 -87 -280 86 35 35 354 51 46 -217 62 53 44 -44 126 -61 -75 15 -59 -219 -53
4009 -53 -44 -264 47 89 -60 -315 85 -73 -148 51 160 -11 -57 -82 -68 180 184 13 87 42 241 168 145 55 -217
4034 -217 -4 -34 -86 -18 -79 -162 35 188 -88 35 -212 94 32 -119 99 143 -85 -48 120 206 -86 -277 158
4057 158 -239 10 -24 -150 -41 130 92 172 -9 5 24 -230 -234 47 -84 -62 -219 -180 -15 -162 24 -95 -100 66
4081 66 136 -64 57 81 130 -40 30 203 -97 173 36 76 -146 54 -7 -119 81 -145 306 183 -92 -92 -76
4104 -76 -25 -74 -110 -40 -67 -62 53 -40 -65 -22 63 -114 -15 -80 130 -99 81 -65 -217 290 106 -68 71 118 -56
4129 -56 -115 -87 -38 -34 30 148 -46 27 -136 -39 57 -70 -274 105 -35 -62 218 157 72 293 2 36 -136 -18 -40
4154d0J06j51K26k07J8j45k15J95L49k76K65j27Q3M0j51J12k06O7j35K31l4k23
4176b18J29J2K06m05N20j67J68j87k53K04M7r7K69m49K25K1P1nl27J58M4qJ14
4199G2J6q2J76k05J89j23Q1P8m0k62P8j43J40L51k17k7p2O9p9p5K40n5Q1j60K5
4224E6j16nQ9k04L49l27R7J33j31J40m0J6o3j74J45k51K14p8M30l36J19j22l2
4247i1K11p7j43KL2J31o2R1j03M7J02k08M5J90j0j3k10j15K72J14l50J34K43m05
4271a73J31J49P2k79J77o7J37J27k19J77j60j2K9M9r3n09M32j14j64J71L01l47
4293a85K65n7k7oK4n3j3P9j40K15m1J9L0o3j0Rj07R7j59J12p3R4o9J94k65R6P0
4320C6l9j64K26j08J03j89K15P0J14k21j12j97K63J23j2k42J71J67k68J86j52
$$ plain form
4154 -40 66 -85 141 -66 -48 -193 -408 -213 136 -140 125 -2 81 121 -30 82 -124 -57 -192 39 5 -218
4176 -218 -89 -77 129 -276 244 77 245 58 -195 9 56 -41 228 -221 4 25 96 91 -236 -78 -34 -42 72
4199 72 88 6 182 -23 166 43 124 202 162 -100 -22 -165 -25 326 109 82 10 79 0 -75 165 110 191 31 56
4224 56 -60 -65 24 -180 169 -158 -61 72 -59 81 41 57 -6 -180 -35 -286 -72 -150 280 -56 63 -59 -91
4247 -91 120 43 -100 -98 -66 65 3 94 -9 38 140 -68 -23 167 157 144 -66 -181 91 205 -145 -11 232 -173
4271 -173 -42 107 179 -100 77 10 147 274 55 232 72 60 89 138 45 -464 -32 -146 -310 -139 162 -185
4293 -185 80 23 -4 -10 14 -39 -52 27 -113 102 61 80 110 47 37 46 -61 36 -123 -11 -84 10 -59 135 -130 -34 36
4320 36 -3 -167 59 -49 54 -135 80 150 264 43 -69 -266 -3 120 108 -134 37 204 -64 122 -30
4341c0J83l11O4J47P6l56K31J01k53K01o7j83J63l00J71J20Q2p6j07K04o3R6M1
4364A34j98J00j30J15K2l4L5l3J30j40j39LJ8J60J6J10p3k37p2n9Q4J85j85J52
4388c6n2L60m11L2L12m86K48O1jj43J95p4m4l7L42k19j16M8K93k32m9J44j05K0
4412E0j35O8M9j57l0K46j09M2P9j4k85l7K45j7k08L28J21j37m5P2J77k15O1L6
4436A85k11J15k69K24L8Oj71K56k12q9l4N8K40j57j20J29J39j2j27j57O4K11k06
4459a00J0J04O7L6j71J5P1p4O9K8J62j65J11j29L7J5l6j03J25l5p7k5l8K8M7j13
4485a41O8q2n1Q9n2j22K3K16l0J87M9j30M7j2J5j81J97J2r0K64j80r5m5J33k3
4510F6J53k24J44j73j04J8O2j05J70j51J19m9K48l21L70M6j12O1J7L0k88K84j91
$$ plain form
4341 -30 153 -158 -94 53 129 -227 4 105 -148 53 -14 -197 -34 -334 -163 -43 39 -37 -144 60 -3 93 134
4364 134 -64 36 -94 21 43 9 44 11 141 1 -138 -135 -117 43 59 169 96 -141 -213 -272 -188 -3 -188 -36
4388 -36 -88 272 -139 -107 205 -281 -33 28 27 -116 79 5 -39 -76 266 47 -69 -21 272 40 -9 135 30 50
4412 50 -85 -17 32 -125 -155 91 -18 24 103 89 -196 -233 12 -5 -213 115 236 99 54 126 303 88 149 185
4436 185 -26 89 -180 44 82 88 -83 173 -39 -128 -162 -104 136 -21 -141 -12 127 115 -12 -169 -105 106 -100
4459 -100 -90 14 81 117 -54 -39 32 -42 27 55 217 52 163 34 71 86 50 -53 72 37 -40 -65 -103 -75 -28 -141
4485 -141 -73 -155 -206 -117 -169 -291 -268 -52 -82 105 154 24 71 59 74 -107 90 102 12 276 96 1 -44 89 66
4510 66 219 -5 139 -34 -138 -120 -58 -163 7 -144 -25 -74 174 -147 223 269 157 218 235 265 -23 261 70
4533G0J48l03J66j14J43q7k20K22k2Q5l30J35lm2L19m39L6K36m1J0p7K96l13m8
4557a73J77M9m1M0j90L76k35K08j70J66k04P0q3j33k6K3K69p6j70Q3n2K84j88
4580DQ1J13j02mj57j23J29K05l64M56k06p6M6j06M25n40R9L25k75J16j01r2J67
4603B0q8J69j54q2L1o4O5n7L53j86j57J18J15M9J20l25K17o7n1O8O6l4n5M3j49
4628c5R7k2J47j69pj85J54k29O42k19j54k12J97k4j37l8l6K52j3j72M47j18p2
4651I4m4R2o6r4K24l65J13k4j28j82K85K05q2n0J0L7L8N7q4j4K0k55K20m9J42
4676A00k59J80j40o4O4J35J01p9l7k2m6L06l73J62R9j63jl0Q5n8j45J09L5J9J35
4701A13j20r0l9j00L41q1J23k9j38l8J53j22J93L5p4J4j26l7J0m0K03j50pK63
$$ plain form
4533 70 218 -85 81 -33 110 23 -197 25 3 88 -242 -107 -110 -152 167 -272 -236 0 -41 -31 -108 188 -125 -173
4557 -173 4 53 12 52 -138 238 3 211 41 207 3 73 -10 -143 -169 -146 123 47 -123 -40 -92 192 4
4580 4 85 198 96 92 -65 -188 -59 146 -218 238 32 -44 2 -104 321 -219 -120 205 -70 46 -55 -147 20
4603 20 -68 101 -53 -135 -104 -168 -103 -160 193 7 -150 -32 83 132 252 -73 144 77 26 94 160 126 71 114 -35
4628 -35 62 40 187 18 11 -174 -20 -249 393 174 20 -192 5 -19 -156 -194 -230 22 9 -163 284 166 94
4651 94 50 142 76 -18 206 -159 -46 -70 -198 -380 -95 110 28 -22 -12 25 63 120 36 22 42 -213 7 -42 100
4676 100 -159 21 -119 -183 -119 16 117 38 1 -21 -67 239 -134 28 127 -36 -37 -67 18 -40 -185 -76 -41 -22 113
4701 113 -7 -97 -136 -236 105 24 147 118 -20 -58 95 -27 166 201 127 141 15 -22 -12 -52 151 1 -6 257
4725B57k68o0j45K75q5J22k33pO9m5N7M6l9K94k19P4m4l8J20K4M9j14j45J90q2
4750E3q6k4J38J07j37KO5l0Pr8Mk00K57n8q0r0J85j11R0j63J81J75p5m6l5J57
4776A88k00M8j38J16RR7r8nP6k7n5ln9J31k24J00N9M1N4n4j59k1L0J23L23k49
4802A03j15L9M8J40k42J03J10j05j32n2J19k8K22o9p5m6j17L8K7P2J19q3j74K32
4826A34lk71L9R7N4j55K52j84n5K47L4r7l87L80l7j63L10k53J49j38O1R7j55j10
4850a54P6k3J39L6l4j74L78k22P0l02J09l7K38k67J53p8J49K6j31J75k18K27l53
4873b17L12m8k64L02m8R8J00j85J78j40j99K2L34l59R7j3m0l5kK48j52k1l1J61
4897I8k24K17l55J06K06K82l8o05K98K67l85M76j11m24O3k4J95J74l80k37K48
$$ plain form
4725 257 -11 -71 -216 59 -26 96 -137 -144 -75 -120 -63 -17 -56 238 19 93 49 11 131 155 204 90 -55 135 53
4750 53 -33 -57 81 188 51 53 118 88 95 -3 1 -199 58 0 -80 -170 15 -96 -6 -169 12 187 112 66 31 188
4776 188 -12 36 -102 14 23 120 22 17 93 66 11 8 -51 80 -144 -44 15 56 110 56 -103 -124 -94 29 352 103
4802 103 -12 27 75 215 -27 76 186 81 -51 -103 16 -12 210 141 66 20 -97 -59 -32 40 159 76 -98 134
4826 134 131 -140 -101 -4 50 -105 147 -37 -92 155 189 92 -295 85 48 -115 195 -58 91 -47 14 111 -44 -154
4850 -154 -78 -101 38 74 40 -134 244 22 92 -210 -101 -138 100 -167 -14 -92 57 83 -48 127 -91 136 -217
4873 -217 95 47 -217 85 37 135 235 50 228 88 -111 -89 245 -114 -17 -30 -70 -105 -107 141 -11 -32 -63 98
4897 98 -126 91 -264 -158 48 330 292 -313 -15 252 -133 343 232 -192 -129 -153 42 216 -164 -401 -153
4918a53J02J06o0R6q8q5K88j93M5j66M4K27j73M5O7j92K83j9j39j76J07M8m01
4941c87N79k44k09Q5J89J70k68j15K26J10l66J86K71l58J57N7M3j67L9r6K38o
4963A34m0N9Q6k06j39m2K92p1Ll89L09J97j21N5k92J95L6j24j24K5J46K44j1j59
4987F3J29k50j7J67p6K8j32j17L52j53k11N09j37k49M0K06k3N2k02R7Lj78J77
5010G8j17K99k83l22K52J3q2N8j7L5l3J1Ol3J8J94OJ20k45N3q0nm9J05pR3l2p1
5038c5J43j43k4J23q9N4J13l79K07L1J9J43N6l52J05J71k38pJ82q2LJ42j06J49
5062A86j08J78j86j26J79k82J03j29K44j51M2M3q0mJ95k83Q5m4K25J88l58L08
5084B25k75p5L71k27Q1k9r0N6j06J25L9p8K8l5L6l59J11J84NR0j65QO0o1q8K50
$$ plain form
4918 -153 -51 55 -5 91 3 -82 206 13 58 -108 -64 163 -10 35 102 -90 193 174 35 -141 -34 14 -387
4941 -387 192 -52 -261 -176 13 183 -85 -200 26 136 -230 -44 227 -131 26 83 126 -41 -2 -98 140 134
4963 134 94 153 239 33 -106 -148 144 73 76 -313 -4 193 72 127 -165 30 66 -58 -182 -157 -11 233 222 63
4987 63 192 -58 -75 92 16 44 -88 -205 147 -6 -217 292 155 -94 -54 152 129 181 -21 76 79 -99 78
5010 78 -39 260 -23 -345 -93 -80 -162 -104 -121 -86 -119 -108 -102 -135 -117 77 83 203 -42 11 -69 -74 -123 -18 -25 68 36 -35
5038 -35 108 -35 -59 64 -25 29 142 -237 -30 1 20 163 219 -133 -28 143 -95 -102 80 -2 1 143 37 186
5062 186 78 256 70 -56 123 -159 -56 -185 59 -92 -50 -7 -87 -91 104 -179 -94 -138 87 275 -83 225
5084 225 -50 -125 246 19 100 71 -19 37 -69 56 95 17 45 10 46 -313 -202 -18 -13 77 -88 -80 -20 -81 -169 81
5110H1j05J35l5p2l7P5J87j3q6k17R2R1J46j77j8l3j40L84m7k83j04J35J02P0
5134A31k51m9l7K6p8L47j32j05P3J60N0K2k43l0J69K8n4j58L58j93K56j76j97
5157h3l2Q6J65j8j5l33L72m6l33K33J5k1l29L79q7Q3RK04k25Q9R8j68j50K2J49
5182F4J72p8j50J8J43q3L2k60l0K19j82M61q9l8q6l20J63o7J06j98L72l67L36
5205A38j85J94k37M5J12K4j70j02K21k3Q4Q3j44j8K50j91n2n4J21j82J86r1j57
5228a48R7J54r3k25J69l3J28l40J67K00j6j78J44K1o5M01n17J33K5K52k47k8J51
5251A52N6k40j26M10j65k8O3j55J43k85r4K44Mk15J81O5K01j9j27K34k60k33J64
5274c0J63r6J15o6J2n0l2nK44j86Rj21K03j56R1r8oJ5O3n3q3K6j78K17k30K61
$$ plain form
5110 81 -24 111 76 4 -33 42 229 216 130 -87 5 96 242 65 47 14 -126 258 211 -72 -176 -41 61 131
5134 131 -120 -169 -206 -180 -258 89 -43 -148 -75 85 135 157 -86 -116 53 81 27 -131 227 34 290 114 -83
5157 -83 -115 -29 136 118 103 -230 142 96 -237 -4 11 -10 -339 40 -47 36 45 249 24 113 211 43 -107 -85 64
5182 64 236 158 8 26 169 86 118 -142 -172 47 -135 326 237 199 113 -207 -44 -111 -5 -203 169 -198 138
5205 138 -47 147 -90 -45 67 91 -79 -181 40 17 101 184 40 22 272 81 29 -25 96 -86 100 9 -148
5228 -148 -51 103 10 -215 -46 -79 49 -291 -124 76 60 -118 26 47 -18 383 -134 -1 24 276 29 1 152
5251 152 208 -32 -158 252 87 59 122 -33 110 -175 -269 -25 -21 -236 -55 10 211 192 65 299 39 -194 -30
5274 -30 133 37 152 86 98 48 16 11 255 69 78 -43 160 4 95 -3 -9 6 69 16 -67 -41 -219 -2 -232 29
5300B9k96K50r8J99l20K36JO4L4k40M39l39k08L35j78j76K92M9k10J72K49l31
5322d7J6J1rk41K10J93l28J58p4R1J43j06k67J85K16j46q5K53l05J62m5L1jK06
5346B21k55k08L20JM8L9j04j82K24j74M9j39K79q5J9k34Q6K51l30J11L7J60j15
5369A9J84r3j3l56L35n4m9J76l5P6j76j9J81l44N22n03J69l4j28L54k66j2k81
5392c47N78n42L78l21O1N4J7K23j57J79j4Q5q4J3j21m5n7K12P0j15n8j04L17l38
5416a16J71l3R6k04K24j93n4M8J67k44pJ68M1l3j44L0r2L47k22k45J42K10j27
5439g0L9K9J50j23J64J4l89K13j07j77J86K78o8K3l6j51J92N7k23j02J83k02q7
5462b07J04q9J31K11l11K94k2rk07m1L24l09J79l5j67j59M34m2j55P2j85J95J30
$$ plain form
5300 29 -267 -17 -115 84 -236 0 1 65 99 -141 298 -41 -249 86 -92 -268 24 73 -137 35 284 -47
5322 -47 -31 -20 -29 -270 -60 133 -195 -37 -111 -20 123 17 -250 -65 151 5 -80 173 -132 30 -15 16 15 221
5346 221 -34 -242 78 79 127 166 62 -120 104 -70 -21 -160 119 34 53 -181 -95 156 -174 -63 -26 134 19
5369 19 203 110 97 -259 76 22 -27 149 114 190 14 -5 176 -168 354 -149 20 -14 -142 212 -54 -66 -347
5392 -347 231 -311 67 -254 -193 -139 -122 101 -56 123 109 194 110 123 2 -43 -100 112 182 67 9 -95 222 -116
5416 -116 55 22 118 -86 138 -55 -109 -61 106 -138 -145 23 64 31 -113 -83 -175 172 -50 -295 -153 57 -70
5439 -70 -31 -2 148 25 189 203 -186 27 -80 -257 -71 207 139 162 126 -25 167 224 1 -101 82 -120 -207
5462 -207 -103 -192 -61 150 -161 133 111 102 -105 -146 178 -131 48 13 -154 -313 121 79 -76 -4 -189 6 136
5485A36l35J37K06j85N3k48K83o8K88j65l43K65j13K25k06J63l51M35k89K48m4
5506I2l2p3l0P5k00J9j37K82L6m3P2qNQj44j50M12l22kK76j21N1M0k6Q9l08K40
5533A01j38Q2k33L73k18J08j14n2J90l32L30j07j66J02J70l9M1J19k67kK57l63
5555a58M32k48J77k76J92j13m5k0K56j58J48j16j3J31l35P2J22j31j85K20j12
5576a60K57o8n0K02l26K86j66O4l1j71L01l07L57m8l01L26o01M32k8j08J10j31
5598a61L13q4J41j75q9J04j20r1J12o8N9j90L75j76R3j7O9j86M1m9K28p2j26K11
5622A42P6n7j60M1j84J18j48J94P1oq9K07o6l6qj48k8m4L5M5l1J97j35o3J42k6
5648C9r3L5J27J26m95M09J11k73j4J06p1J20L7m7j40r5K43m4q6J8o3j39K83k05
$$ plain form
5485 136 -199 -62 144 -41 12 -236 47 -21 267 102 -241 24 -89 136 -70 93 -258 177 -112 136 92
5506 92 60 -13 -43 32 -168 -149 -286 -4 32 -11 61 53 58 66 -78 -228 184 -138 -140 136 15 66 106 80 169 -139 101
5533 101 -37 45 -188 185 -33 75 -39 -91 99 -233 97 -10 -176 -74 96 57 98 217 -50 -52 205 -158
5555 -158 274 26 203 -73 119 6 -39 -59 197 39 187 71 58 189 -146 -74 48 -83 -268 -48 -160
5576 -160 97 29 -21 181 -145 141 -25 39 8 -163 138 -169 188 140 -161 165 -436 -4 -32 -140 -30 -161
5598 -161 152 68 209 34 -55 49 -71 -162 -50 -118 -59 -249 126 -50 43 26 95 -91 -50 -99 129 57 -69 142
5622 142 218 161 1 42 -142 -24 -172 22 93 87 -2 205 139 103 95 -53 -81 -125 -90 -45 -76 121 -14 -77 65 39
5648 39 -54 -19 108 234 -261 148 259 -14 -28 78 7 127 164 117 -23 -118 125 81 -5 13 -50 -189 94 -111
5672a11k76K96M9m9J93lR3j82j30P6J86k11J10O1L9p1m0m6J26J24j89j6J87q2
5696A34q4p6N9r5K02j99N4k5q6J94K35j90j32o7O3J43j14L8p4J72j00N5o0J11
5720A58k19J68q5j30K42j11R3l15K89k0k21J4J31j08Q1J34j60J3J19r7L5m3L30
5743B98m12K4N6j06J75j80J90m2j6r8O0K79j97j09r6Q8k13N07l21P6%M5K20k54
5767b6O8r0J75j74J71l38J86m1Q6o0l7K83n1p4Qo6nK07M6r0j31k25J70k26J09
5792a25L97m79jo6J80K02j42j21N6K05l17L5L65L7k76L09j83J9J3k13P3J88m22
5815b66K17r6L73n80J94L33j08j60M9L3J39k41j20M03O6k87j93m0L66r8J22K3
5837A29l0J32l58j31L67l6P6p7J48k78J54K9l43J87O0j75n7K75l24L72j16P1j44
$$ plain form
5672 -111 -387 -91 -42 -91 102 99 192 10 -120 -44 142 -69 41 102 141 70 30 -16 110 234 45 29 216 134
5696 134 50 -26 33 -62 140 -59 -5 -30 -116 78 313 123 -9 -76 -13 130 16 54 -20 152 52 107 47 158
5720 158 -61 107 22 -108 134 23 116 -199 90 70 -151 -137 -6 -114 -33 101 -59 -46 73 -24 11 -32 298
5743 298 -114 -90 -34 -140 35 -145 45 3 -13 -111 -51 228 31 -78 -174 -86 -299 208 -113 -37 -37 8 228 -26
5767 -26 42 -48 127 -47 124 -214 -28 -69 17 -43 -80 203 152 78 86 20 15 222 268 178 47 -178 -8 -234 -125
5792 -125 272 -207 -208 -274 -94 108 -34 -155 -99 106 -211 -176 189 226 -50 259 76 95 108 -105 -32 156 -266
5815 -266 -49 -145 228 -352 -158 175 67 -93 -44 -11 128 -113 -233 170 236 -51 -244 -284 82 -16 106 129
5837 129 99 231 -127 -258 109 73 149 72 220 -58 96 125 -218 -31 29 -146 -203 72 -252 120 4 75 -69
5860f9J9l3M0J73j68m2L0L2K59k07j76J48poK8ro4oJ34n6o9NJ06p3r7L7o1N0n9
5889a41K68j96q0L37j87J17o6j90K32j68Q0j66K90J14j11l09K03j06L36j39J8
5910A36k28M48j25m28J69j29Q5j23K1L06j86j22m3K22r6M09l03p8L1n9M28m34
5932i9J33K03nj48k29J08N3NJ37k32q9K72k62PJ0J23j86P7K06p1p2j6j78K35p8
5957i6j45J36Q7J10l7J02p8o3J14R2Rl30K6J01j18QJ63o1n8o3P5K9j15J41l5o3
5983f9J19k2l3p2N7p8K80j72m7r3M68k39P6l17J40nJ10q9plRJ17j16L72j68k50
6009c2n6j04J7O2N0j00J97j96J66l0P1n7K75j04j30j39l9J78o2K25k29k01M40
6032B02l46N3L46m07K64j32J16n9K43j56Pj68j17P5J03oJ39k13L26n66L82L7j28
$$ plain form
5860 -69 -50 -83 -43 130 -38 -80 -50 -18 241 34 -142 6 -1 -7 21 12 -52 -58 76 20 -49 -44 62 -11 -108 -71 -132 -82 -141
5889 -141 127 -69 -149 188 1 118 52 -138 94 -74 6 -160 130 244 133 -176 27 -79 257 118 136
5910 136 -92 356 231 -197 -28 -157 -72 -195 -174 132 -54 -176 -219 3 -93 316 13 -65 -34 -93 335 -99
5932 -99 34 237 232 84 -145 -37 16 21 158 -74 -163 109 -153 -146 -136 -13 -199 -122 84 13 -59 -75 -253 -18 -96
5957 -96 -241 -105 -18 92 55 157 79 16 130 222 231 -99 -73 28 -90 -82 81 20 -38 -101 -26 3 -112 29 -6 -69
5983 -69 50 28 -5 -77 -20 -98 182 10 -37 -130 338 99 175 -142 -2 -7 103 14 7 4 13 130 14 386 218 -32
6009 -32 -88 -192 -175 -113 -63 -163 34 -162 4 -26 45 -12 263 159 29 -110 -149 29 -33 192 -37 -238 202
6032 202 -144 -91 255 -152 112 -20 96 37 280 124 131 -37 -154 -79 24 18 157 -56 270 -296 86 123 -5
6055ej0l8j35l4L47l26K79r7J55l19L00p2M6k7K0n7j97K14K5j16K8R9No8m8P5
6081D4j48J15M4k77PM9J60r6m0K24NJ46p2j98Q8j49J70j36l1J08P5j39Q1J57j60
6106B7m5Mo2l2K47j62l40M30j65J52k26J03J69j90q5K95k53O7P1j02M0K10j96
6129d3j92K69J86Lm97K62r5K34M8k78K45k19%j24J02j9L21m9j30J9J22j88m3J29
6153F3j00j68L63q5j66L09j72P3j27m9O5K3j98K87k30O6k7l1J11K32k22O0KM3
6177A22k79R9r3K73J26j35p5j81K55j61J80j69LK25o3n0r1n6l5J90K0j1L3o9Q1
6202A39j91L1j00J67o5k2J26L4j92K04k98O3J97M5Rk59K90m6p0J49j86N2J5j46
6226e4J07M4j47Nj35K85M5j73lR8k32P8pQ4j17kK38qj42j8J34P3l77J43Q0R0k2
$$ plain form
6055 -5 -15 -53 -188 -222 125 -201 78 -19 136 -183 117 45 91 64 84 27 -170 44 69 -47 -19 80 85 17 -31 44
6081 44 -104 11 55 -222 -215 -166 -6 -102 -142 82 87 233 161 -37 51 -98 72 -64 -95 13 88 -51 30 187 27
6106 27 -18 -14 -76 -108 139 -23 -363 67 -98 54 -172 -69 100 -90 -175 120 -133 -66 5 -97 -57 153 -43
6129 -43 -235 34 220 223 -274 -12 -107 127 175 -103 142 -77 -77 -201 -99 -118 203 154 24 43 165 -23 -66 63
6153 63 -37 -205 158 73 -93 216 44 117 -10 -59 6 29 -169 118 -112 -46 -73 -104 7 239 17 77 79 122
6177 122 -157 -58 -151 122 248 113 38 -143 112 -49 131 -38 -35 190 127 77 -14 -70 -105 85 105 94 127 58 139
6202 139 -52 -21 -121 46 -19 -41 85 119 -73 131 -167 -104 93 138 147 -112 178 132 62 211 25 77 92 -54
6226 -54 53 97 -50 -45 -180 105 150 -23 -26 72 -160 -82 -89 -5 -122 -124 114 106 -36 -54 80 153 -224 -81 -1 89 67
6253F7K7k11K3K32j01N2j3j31m2J11q4j55L26p4K21l13N1P6p8J12n4p1J43k28
6277a14K36j07r8K62j70K46l23L8L56k81M4j42J38j23j51L60k15N0J03j98j23
6298b12J26M28m17K38k72K69j54j0J72n5Q9q7j18l8K9J40o7l0j21J35J98k04J03
6321A42j96J87l41J23J27m6n1J79k43p1j8K37k4j14j8M1K04j82J47k61M04n33
6343c07M38j9n9Jk16M64k98k57K09MK19R1j97k29K12p7k03K96n9N9r5r1M4p1N20
6368C79l71k31L63j91K7J61j45J11l34M27j89k52J85J66J75l35j98K08K05k06
6388d5M8k20K93l19L57k49jN9L41k97j8N3j66O4Q3N6J23l21jM20k03L5j31J58
6412A19r7J01J62k23l54K84J68Pm3N8k41O5N9j47P6o9NJ36K0j16o9L73l37j0L0
$$ plain form
6253 67 94 -117 -94 138 37 89 76 -55 -97 14 -70 -225 101 27 248 -65 -14 62 -16 96 42 -29 114 -114
6277 -114 122 15 -83 179 9 255 -68 -30 326 45 89 -53 85 -38 -189 171 -44 6 109 -89 -212
6298 -212 -86 342 -75 163 -109 160 6 -4 168 113 202 115 -3 -41 -12 128 61 31 -90 45 243 39 142
6321 142 -54 133 -208 -85 42 -4 -55 124 -119 -190 -208 29 5 -109 -127 -86 118 -64 83 -178 226 -307
6343 -307 131 112 53 54 -162 302 4 -253 -44 -40 179 270 73 -156 56 -21 -224 72 13 72 -23 -114 -70 -141 379
6368 379 8 -223 140 -51 -24 137 -8 103 -231 196 7 -245 -60 106 281 -54 -252 -44 161 -45
6388 -45 3 -217 76 -243 114 -135 -136 -77 264 -33 -51 2 -164 -100 -17 39 162 -159 -160 260 57 92 -39 119
6412 119 22 123 285 62 -292 -8 160 167 124 182 -59 6 65 -82 -6 -75 -70 66 86 -30 -99 274 -63 -73 -43
6437d3M7q7K2L07k94mR2l4J12j50k2k4j11J45J30j86J37m0j7j79Q9K27j95J9J11
6462E2l0J06j1j60Qr5K21n7M09l41k63K37J59j65J03J3k87l3L32j13J08j84J52
6485A61k32M72l69p1J8L0J33q8J4j7j36r3L95k24J3NKk2K0K07o0k87L78l21J04
6510C2Q1j49Q1o2J12k6j20j24O2N5K5J87j78j23K17k22K27k8j93J70J24k23Q9
6533A4K22j35j52J31J74j03j27J23O2k75J35r0K59l77j21J97l8K35n8r2rN7mJ18
6557A46j03j26J92L4k12R1K02l61J42N1o2j10j27L94M4j34lk05J9N4K76k82n1
6580a31J34j75J57K39P2l54K53k27k4qJ40J64k30k62M86k74P7k25m2R5K14K14
6602B93lk51J19j31q7M3RL1k09N26l17qJ10j34p9M1J53o6N1p7l0K6j9M8J69k15
$$ plain form
6437 -43 4 -83 -61 246 -48 -52 40 6 118 -32 -54 -78 -189 -44 86 -100 37 -3 -20 -199 -110 117 -78 -59 52
6462 52 22 128 117 -43 -35 -130 91 34 443 102 -161 76 235 70 173 186 -101 -134 198 85 193 9 161
6485 161 -71 401 32 -39 -21 9 142 54 68 51 -85 -178 217 -7 6 11 13 -9 11 218 158 -129 249 -72 32
6510 32 113 -36 45 -17 95 69 -51 -175 -113 -58 -33 154 -24 -147 70 -152 75 47 -146 24 148 -75 14
6533 14 236 101 -51 80 254 151 24 147 209 -66 69 -21 238 -139 -260 -63 -101 134 76 -16 -25 32 28 146
6557 146 43 -83 109 143 -69 22 224 -137 5 56 -6 -116 -243 151 195 61 58 -147 -128 -74 202 -80 -131
6580 -131 3 -172 -15 224 296 -58 195 -32 -56 -64 76 240 10 -252 234 -40 37 -188 -230 -135 79 293
6602 293 290 39 158 27 -60 -17 -8 23 -186 340 23 15 125 -9 -88 -47 106 40 91 14 -16 10 -9 39 208 -7
6628gj90L85j78k01M8K36n0p2J13J9k67K98q2k09K85m1m4O0j87R8j30K70j81j28
6652a55K69j44J47k2j81J75J03k76L15m83K87K3J87k9j32J03j89Q7k41J03J59
6673A06r3j03PJ31k14K29l10K90J22j96n0J72j14n0j40N54k69o6J21j80K84k69
6695c8P8j13Q0n2J5p6J42k33K20k02K62l10P6o4L82p0o0r4K2Q5o7k1O0J25k50
6720a03N0K22k47J03M9RJ29l09M93l71J13J10p1n9jk29J3n8l4J28p1J63m1J52
6744A40Qj03pj82K02J04m5j06Q6j00N2J8j39J72J1m4qL1q9n9k45M91m9k74M9j43
6770b29K15J03j10l5L8K30l58M0J21K71l30K6MJ23k29L32q1k08Q8Pp1P8j1m0J5
6795a1L5K6o4L6M9P7n41L95NJ11L4j81P4LL6q7JN6K11k32j55L3j20J60J59r7K62
$$ plain form
6628 -7 -197 188 10 -191 -143 93 43 -29 84 103 -164 134 52 -157 128 87 43 103 -84 14 -116 154 -27 -155
6652 -155 114 -30 117 95 -86 89 192 -84 231 -252 35 58 245 216 84 187 -2 85 -156 -53 106
6673 106 13 -90 -83 48 -166 63 -247 43 165 -31 -81 91 -23 -73 -213 341 72 6 127 -53 231 -38
6695 -38 40 -73 7 -45 -30 -106 36 -197 23 -179 83 -227 -151 -215 167 97 37 -57 -35 50 -17 -38 22 147 -103
6720 -103 -53 169 -78 25 74 83 212 -97 396 25 138 248 177 118 117 -112 -99 -157 -191 -63 -134 29 -12 140
6744 140 148 45 38 -144 58 162 117 11 97 -3 49 67 -72 100 111 67 59 90 1 -58 -303 188 139 -135 -86 -229
6770 -229 -14 89 -21 -56 -18 212 -146 -106 15 286 -44 -18 -14 109 -120 212 131 -77 11 18 -53 25 14 -26 -11
6795 -11 24 50 -14 22 71 148 -393 2 7 118 152 -29 45 48 84 -3 -2 54 265 33 -122 -89 -209 -49 110 13 275
6822B75j96N3m9%k42K68j15J01l94M00K3m6Q4k00j03J96j9l9R3M8j61J68j80j72
6846b07L03j02L7J96k18M2L60n70O5L80l26K16l75K27J2j79J92L6k15J50M5JJ23
6869A93k6j79J75qk05Q5K11m03L51J12m44K01r2j75L71k49J57k62J23J25j25Q1
6891A7P3j20qj4j13J31q3o6K81j04Q1Q3j37K83j86j44nR3J5J15k30J12P2M5m60
6916b69L26j67J7J22j60R1L64l54J2K26k21L1p2J90k60P2O7r4qk77R8K43J31n6
6940E2j07k31M63l50J66j8J77j63j3O5jL3L2j84r2K33p6K61j66k65J88J63j14
6963E3j89L42j74q8J86p3l00K18K17j86KJ33j65k18L08j12j26j4J64K73k35L10
6985C26m66q2L1M95j93p2N6K1j27k72J42N7K46k83P5Mj5m4K27l78K85j38k3J04
$$ plain form
6822 275 79 132 83 83 -159 109 -6 95 -299 101 124 78 162 -38 -141 55 36 -3 90 138 -23 145 -35 -207
6846 -207 96 -6 31 227 9 51 411 -159 -94 286 -40 176 -199 28 40 -139 53 89 -126 24 69 70 193
6869 193 167 -12 163 155 -50 35 246 -157 194 306 -138 63 -29 -204 167 -82 75 -187 -64 61 -64 17
6891 17 90 -30 -38 -52 -165 -34 -117 -183 98 -6 75 158 21 304 118 -26 -31 62 77 192 -38 74 146 191 -269
6916 -269 57 -110 -93 29 -131 -40 324 -30 -18 208 -13 18 -54 136 -124 -52 15 -79 -87 -364 -266 -23 108 52
6940 52 -55 -286 177 -173 -7 -25 152 -11 -24 41 40 73 105 -79 -171 62 -14 247 81 -184 4 167 53
6963 53 -136 206 32 -56 130 57 -243 -25 192 6 8 141 -24 -242 66 -46 -172 -186 -22 251 16 326
6985 326 -140 -222 -191 304 111 39 95 116 -11 -283 -141 -84 162 -121 -46 -42 -57 -101 126 -252 33 -105 -128 -24
7009b4J15j56l7J68n5R0o1n8L3K2r6K38j99n0o6J74n8m1P5K35k67j63L86l88L74
7034A91k50P7J05M3j58lk83L82l08K03J93j85j98J65j1M4j81K31k56O8J3J46J53
7057A81l89J08P4K2n2L04k92P1J13j92n6K5M9J02Q5k84K86k54J28J24k70R3J32
7080A08j87j13J67q4m8J04r8J16J16l87J69J10J41M0j04l8o4K57m8j51lm4Q9k05
7104a57L0K16jk92J74M6j47K36j12r9K04k53J4L14j56m2l5Q4j52K84k80k6J84
7127C4J96k85J30j53L0J53j81K03j82K39p6k06R3o7lp0J25k2N1p2P3j56K22l1
7151D5p4q7Q4J40qM3l45rJ92J28j39R1J6j16J28Jj84N1K77j28l27J63j63J64O7
7176A0K63l54P8R0k42J96J03k62K58K8jl24R4k25K32J41J8j35Q4J71k87J66j09
$$ plain form
7009 -24 91 -65 -102 66 11 101 40 -18 15 37 -59 179 -20 -70 -136 38 -20 -61 14 249 -18 -181 205 -183 191
7034 191 -59 18 123 166 8 5 -278 104 -204 -1 192 7 -191 -26 -37 7 -174 57 -199 -131 -118 28 181
7057 181 -208 -100 -26 -4 -56 248 -44 27 140 -52 -108 -83 -34 68 153 -131 155 -99 29 153 -117 -24 108
7080 108 -79 -192 -25 -109 -157 -53 -151 -35 81 -306 -137 -27 114 154 50 12 -52 205 157 6 3 -41 48 -157
7104 -157 -127 89 88 -204 -30 16 -131 105 -7 -106 98 -155 -141 173 17 -25 -60 24 -128 156 -124 -150 34
7127 34 230 -55 75 -78 -48 105 -76 127 -55 184 108 -98 -5 -72 -75 -145 -20 -42 9 -63 10 -146 76 45
7151 45 -29 -116 -32 108 100 143 -202 -211 -19 109 -30 61 77 -39 89 90 -94 -43 234 106 -221 -58 -221 -57 10
7176 10 273 -81 -3 87 -155 41 144 -118 140 168 167 -157 -63 -288 -56 85 103 -32 52 223 -64 102 -7
7199gJ07j38K14o1j09l2R2l3L1j73mK51j93n5PN1J95j24R3j68O2K10l24K23J73
7224B88k25j12J73l9k51K13j08J92M8j68j69J95l7l7J86k70J82J7j92k00M10j46
7246e0N6L3R9m17K04l4M06l30K8k92M23k22P4n6K53j39m6L6k31M0K17k21L33k98
7270a34l0K37o4K57l35J11R9j59j22J43K06q3k25K04%kJ25k88R4j9N9K49l42j22
7294a41K12r8MJ20k70J74r9J07J80l60K28P7n2n8n5o7r2L92o03K55L24j34J55
7317A99k25M0K9K6l9R3j29J51j48J63kp2r1o0K6K5L3k03L97m11q3J46J78m3n4
7342e4J23R7O3j29l29J40K66k02K74l86K71k49R9m1J0L26j61l0k59r1K65O0j17
7365e4m1P8N4J33k95K34l13K64Qj3k78L50n4j74K9K03j55q7Qk5J72r7L0l4o4M1
$$ plain form
7199 -7 100 -38 176 115 6 -26 66 33 64 -109 -113 138 -55 -110 -103 -52 143 19 112 -56 6 216 -108 115 288
7224 288 63 -49 124 85 -166 47 -61 131 179 11 -158 37 0 -37 149 -121 61 78 -114 -314 96 -50
7246 -50 6 39 138 -279 -75 -109 297 -33 -5 -297 126 -96 -22 -78 175 36 -10 26 -205 -165 52 -169 164 -134
7270 -134 -164 73 9 266 -69 42 141 -18 -140 3 209 126 -99 105 105 103 228 -60 34 15 74 323 -19 -141
7294 -141 71 -27 -23 97 -173 1 -98 9 189 -171 57 134 82 24 -31 -98 -190 202 -401 -146 178 44 199
7317 199 -26 14 43 69 30 123 -6 145 -3 160 158 86 -5 -65 -39 -14 19 -184 213 -198 -281 -135 43 0 -54
7342 -54 69 166 229 100 -229 -89 177 -25 249 -137 134 -115 -16 -57 -47 279 118 88 -171 -262 3 63 -54
7365 -54 -95 -17 37 170 -125 109 -204 60 68 55 -223 127 73 -101 -72 131 -24 -111 -103 -128 44 -53 -23 -57 -121 -80
7391h0P7j81J16J74l49K58J43k49J54j32K64k08j04R0K39k47K45j42Qk24l8K27
7413D1K1K3N9j73P8K79k84k41K68l19J51Q2P8J24k18o2p7L5K20M0Q2j69k58L41
7437A21l24L12k83J70R2n5o5m4N6K18o4Q1M3k81P3K28j31k69L86l7l41J99R8l61
7461a78J85j35J14j5M7O0p8j94L58O0m91K43Nk5J42o2rR5l5n0J58j68lj54j48
7486b78L10J03l85J49J37J98k38o9K55K9n0l38O0J44k6J43k11K40Q3l67L77l39
7508g3J81J89m55P8j65P1J15K6J33j24J14K04k69J58k05m8j09K79L5m8n9M4l6
7531C6Kk6J92k30L8m4J73l2k55M10k12k04J01O4k4M25j74r6j93J69l6j5j04L9
7555Dk54K93L1j0j90M9R7o9L3k03M87m7N7j76Jr6m6J88k67K03o9J16j20j81j05
$$ plain form
7391 -80 -3 -184 -68 106 -243 15 158 -91 63 -69 195 -13 -117 -27 212 -35 210 68 76 -148 -186 41
7413 41 62 85 144 -29 49 328 44 -197 71 -248 -97 -15 63 187 -31 -93 -170 -135 85 125 207 38 -220 121
7437 121 -203 109 -174 -4 88 33 -32 -76 -20 198 134 215 258 -23 50 278 147 -122 264 227 -114 85 183 -178
7461 -178 7 -128 -14 -29 18 78 0 -194 164 224 -267 -24 -19 -44 98 36 27 122 87 37 195 27 24 -130 -278
7486 -278 32 135 -250 -101 36 234 -4 -73 182 211 161 -177 -117 27 1 144 -67 173 256 -111 266 -73
7508 -73 108 297 -158 -80 -245 -174 -59 -33 100 -24 90 294 25 183 -22 -70 -179 100 135 87 28 72 36
7531 36 38 12 204 -26 12 -32 141 109 -146 264 52 -152 -51 13 -11 414 240 144 -49 120 84 69 -35 4
7555 4 -250 43 74 64 -126 -77 20 -49 -16 -219 268 221 278 102 103 7 -39 149 -118 85 16 132 12 -169 -274
7580b74J38J87K82m5l17N1J3j77J40k44K99P0k30J05K51j74q6p4Q2J95k47m6L5
7603f6J22M3L5j24M5K7j58j3P5o1P4L5J3o0N8O4l46L63l90K46J36j73R7J10j78
7628b6j60J29q3J86j65K66j6k65m1J08M02l76n1J31P7k37j12K91m9M3n9j48L8
7651a17O5MJ38q2J28m22K53mJ51r8j0k16K0K40m2j7K6j41J45o7K8O0k15K35j69
7676a07N3P0N6k99p5K15n8K68j22K0j26K24j22o5L01m66K19N5J52k70j13l7L03
7699G6j96J83K02m23K17p5O6j8l7J17L8k48L2J54j60R3j62L23J13k25k27PP0J7
7723f3J79j98J17rK78m71J2J61J88k73K6J49Pj90J26n7l5o2L35k18K14K9m6j85
7747A4poQ3pl4j16L3N0l8K15k73j1k7J6L26j37kk67J50R3j90n1K30j82K8L4J06
$$ plain form
7580 -274 -136 51 333 288 -29 22 35 -142 -2 -246 53 123 -107 -2 249 75 -11 -85 -3 192 -55 -101 -66
7603 -66 56 99 134 10 55 82 -76 -89 -14 -75 -1 34 47 -13 45 109 -237 126 -264 -18 118 -55 42 152 -26
7628 -26 -186 -57 -140 46 -119 147 131 -134 -175 -67 335 -41 -92 39 116 -121 -233 58 9 52 -7 -155 -117
7651 -117 -52 -48 90 8 136 -286 -33 -37 114 16 6 -210 -190 50 8 -9 17 -124 21 -46 -18 42 -173 62 -107
7676 -107 -54 16 72 -227 -302 -87 -145 123 1 21 -105 119 -3 -68 233 -233 -14 41 193 -77 -190 -227 76
7699 76 -120 63 265 -158 59 -16 50 32 -5 112 150 -98 -66 88 -72 21 -141 182 295 70 -157 -150 -80 -63
7723 -63 116 -82 35 26 304 -167 -155 6 194 -79 -53 96 103 -87 39 -18 -53 -115 220 2 216 245 199 14
7747 14 7 1 84 77 43 -73 -40 10 -28 187 -86 -97 -124 -108 218 81 79 -188 -38 55 -135 -186 44 -138 -110 -76 30
7774C0j36j0l7jR0k0rJ43Mj8m1L7m8RJ9J5R3j45k5nRJ01k7L4j92r0L39p7L8N1
7804A31j52J10m6j00K9J00m07M16rj47K2J46j81J48K3K9J22j30j94O8J50j20K1
7827B9l6j42L52p7M9k33J11k25K19r5J7l65L38J94k03p1J01K00l84L22j49P6m6
7850a8K0l4k2J76m6o8J21k57N62m27R3N8j39l0Q7n8J11k90L60l07m6jk0O4L4R
7876f8M4N8j33L05k05r9J67j56p9J17J44k66J23O0L5q1L7l1j6K41r5j92K43j74
7900b1N9M2j44J86k39J98j61o0J00lq5j32J71J94j4j7km3j16j5r3K61L5j57k7
7925h3L0r6J15K38l57J95j06k03L66j94M6o1J35J01m32M88j49o7k9J03N1j10N9
7948D0r7M3K59l37M0j81LJ32J20o9J52r9k21J13K2j8jP8r3J01K10k13J77%j62
$$ plain form
7774 30 -106 -116 -153 -154 -64 -84 -93 50 54 36 -5 32 -16 -7 12 27 120 -25 -50 -55 -46 55 28 62 -130 -220 119 42 80 131
7804 131 -21 89 43 -57 -28 72 -335 81 72 -75 -53 93 -88 60 83 112 234 104 -90 -22 128 8 29
7827 29 -7 -149 203 126 175 -58 53 -172 47 -48 -31 -396 -58 136 -67 -138 -37 163 -221 101 -48 28 -18
7850 -18 2 -32 -54 122 76 8 129 -128 434 7 100 158 19 -11 76 18 129 -161 199 -108 -154 -155 -175 -111 -77 -68
7876 -68 -24 34 -99 206 1 -98 69 -87 -166 -49 95 -171 -48 12 47 -34 3 -28 -44 197 102 -90 153 -21
7900 -21 38 80 -64 122 -117 81 -80 -140 -40 -43 -128 -260 -89 105 91 74 72 29 -87 -102 -195 66 101 -56 -83
7925 -83 -53 -149 -34 204 -153 42 -64 -267 99 -95 -49 -110 25 126 -306 182 33 -34 -63 40 91 -19 40
7948 40 -57 -14 245 -92 -52 -233 -230 -98 22 -47 105 6 -215 -102 -80 -98 -99 -21 -114 -13 197 -16 161 161 -1
7973aP6L0N9J51k37lj80K69J47k34j80K3J80J26l50K16j43O5L46l71O9J4j75K57
7997A54L0k23j80J47K15j21j52N0K9L40l37J35J14j62l7J12J03j37L9j69K9n4
8019g5J8K29l55nJ08K96o6p3Q9j10p8O1J25k01Q0j88n6L87j57J27j05j39K30l15
8043a73M27k14Kj36J80j12J53j26k09J83L4j22O8N1j11K28j6p5n4K3j92M45m6
8066B08j07j2j94J90l5j23L39k37L3j24P1rJ47J8j45N3K66k54m8n6j8J23j01j38
8090a53K56k83M29k1l56J4P7k71L92j89K19j46Q7P9l9j45M4JP6m4k18J68J24n6
8114D5l0M4j82K97k81qQ3K9J82j36j19J97j62j23j61K87n9j65J29J67n5J19k7
8137G1j76n3K53p9L18k86q7J51r5j96L38j53J90m47J82M0j18K38n0J14j77rR7
$$ plain form
7973 -1 75 105 164 315 78 75 -105 164 311 77 -103 -80 100 226 -124 92 -51 14 360 -11 58 72 -103 154
7997 154 184 -39 -219 -72 143 22 -130 -80 -51 289 -48 87 201 39 2 114 217 80 119 -50 -21 -75
8019 -75 -57 172 -183 -188 -80 216 150 77 166 56 -22 39 164 -37 43 -145 -201 186 29 156 51 -88 142 -173
8043 -173 254 40 42 -94 86 -26 127 1 -208 -25 9 -113 -45 6 -105 123 107 32 -22 1 -191 254 208
8066 208 101 89 -105 85 50 -73 266 29 62 -62 9 0 147 165 20 73 339 85 37 -19 -37 86 -15 -153
8090 -153 103 -180 249 228 -128 -114 -37 -308 84 -105 114 -32 55 134 95 -50 -6 -5 71 27 -191 -23 101 45
8114 45 15 59 -123 174 -107 -115 -32 -3 179 43 -76 121 -41 -164 -325 -38 -97 -262 -133 34 -21 98 71
8137 71 -105 -158 95 16 334 48 -39 112 17 -179 159 6 196 -251 -69 -29 -147 91 41 155 -22 -31 66
8160F6K0o9l3J60k01J32j11q3J42J02J80k62r9j5J38K20j74p6K1kj27J29L7R2
8184A87k73J81j46R8j16J41J62
$$ plain form
8160 66 86 17 -16 144 -57 75 -36 -119 23 125 305 43 -56 -71 67 287 113 37 58 56 -71 58 95 187
8184 187 -86 95 -51 47 -69 72 234
8191B34
$$ Imaginary data points
##PAGE= N=2
##DATA TABLE= (X++(I..I)), XYDATA
0@%%%%%%%%%%%%%%%%%pJ5j6J6j6J6k0K8l2L2l9M7n2O0o9P7q7R9j11J23j36J54
39H2j73J92k14K36k60K90l22L53l85M25m71N19n71O29o93P67q51R46j056J185
59F28j337J518j747K038k420K950l731M993p359J3201n1295o6561J50015j4096
73B6797q6893P1995K6049p7146K8714K1388m8674K9195K8229m7480L2617L6345
85D1136o6485p38N6322m5597j8031P0311p578m3757K5279n062l1166K7926K0438
98B2998j3412J752j1503j292L0784k8195m0121N0458K1024m9043J8028K9601m7880
111a6801n703L4072k3780J839L8520k8702j9390L0601k4446j8068N1966r958m5348
124c5198M1291J7550m8035J7942K2969m4922J3456N0663l0798k3147L0227j1991
$$ plain form
0 0 0 0 0 0 0 0 0 0 0 0 0 0 0 0 0 0 0 -7 8 -8 8 -8 8 -12 16 -16 16 -23 24 -28 32 -37 40 -47 52 -59 64 -72 82
39 82 -91 101 -113 123 -137 153 -169 184 -201 224 -247 272 -299 330 -363 404 -447 499 -557 628
59 628 -709 809 -938 1100 -1320 1630 -2101 2892 -4467 8734 -42561 -109122 40893 26797
73 26797 -60096 11899 37948 -39198 -10484 10904 -37770 -8575 19654 -27826 4791 41136
85 41136 -25349 -26087 30235 -15362 -33393 36918 29340 -14417 10862 5800 -25366 2560 22998
98 22998 9586 11338 -165 -1457 29327 1132 -38989 11469 32493 -16550 1478 31079 -16801
111 -16801 -22504 11568 -12212 -10373 28147 -555 -19945 10656 -13790 -31858 20108 10150 -35198
124 -35198 6093 23643 -24392 -6450 16519 -28403 -14947 35716 4918 -18229 11998 7
136Gj5510K6665q037j2747L2040j0595l4861K7188J4591l2416R730J9941k3147
149g151L132K3475j9271j3802J4421l221J536J7406j5021j5109J9592J095j5977
162h895J0610M989j2703Q754P613j5772l82J2123o696p074N604J951L266l40j2729
177i681j511J1890k063m848N265l571n916J0423M194j0484j285P297K634J633
191C977q23l174M661M106p464o53R805m34n373M416o65r228N320Q439j1520q522
207g132J0336L528r059j570j272n500N202M881p480j330N960m582j129N805n450
222h792j529J4135k135j1861R646P982r554K440O472n749M268R415r702m940P777
237G873l449n00Q111r448o399J3871l565j4930Q315L211j0929P430L920j5164
$$ plain form
136 7 -15503 11162 3125 -9622 22418 11823 -23038 4150 18741 -13675 -3945 15996 -7151
149 -7151 -4019 19456 185 -13617 804 -2417 -881 16525 1504 -13605 5987 7082 -8895
162 -8895 1715 6704 -5999 2755 10368 -5404 -5786 6337 -359 -7433 -1829 122 3388 3048 -9681
177 -9681 -11192 698 -1365 -6213 -948 -4519 -10435 -12 4182 -6302 -7587 -290 2344 3977
191 3977 3154 -20 4641 8747 1283 630 10435 10001 4628 9044 8379 -849 4471 12910 1390 -7132
207 -7132 3204 6732 -2327 -3897 -5169 -10669 -5467 -586 -8066 -9396 -3436 -8018 -9147 -3342 -8792
222 -8792 -10321 3814 1679 -10182 -536 7446 -2108 332 6804 1055 5323 14738 5036 96 7873
237 7873 4424 3924 12035 2587 -3812 10059 6494 -8436 -121 3090 -7839 -409 3511 -11653
251a1653M812J1419j2881k059J2632o738j034J2508j0471q379J7581j60j2867
264g290J0748K490j0850J0387M167j6535N884J1951j1966r80Q728j0807m53J2141
278G615j0954o466J4386m625p956J1715m623j0350J5792K287j6684R010R080j2478
292d251N798Q019j4732N130J5747j4745o619J6424o450q452J3065n482j1626J4175
306F001M90j6512Q242O197j3578N186Q592j4230o72J2844p860l764R606n344j893
321f695J2345o205r653J3480L333r837N808L224p162P855K429j3049N896J1028
335A2797j0809k737J0551q186n322J0511n072q011J0100j544q888Q342K48j3543
349a1563Q096R476j2674j073J0874n683l116P431o245l338J3676j719j1144P951
$$ plain form
251 -11653 -6841 4578 -8303 -10362 2270 -4468 -5502 7006 -3465 -11844 5737 5577 -7290
264 -7290 3458 5948 -4902 5485 9652 -6883 -999 10952 -1014 -1994 6734 -4073 -4526 7615
278 7615 -3339 -9805 4581 -44 -8000 3715 -908 -11258 4534 6821 -9863 -853 8227 -4251
292 -4251 1547 9566 -5166 -36 15711 966 -5653 10771 4321 -4131 8934 3452 -8174 6001
306 6001 6491 -10021 -1779 4418 -9160 -3974 4618 -9612 -10284 2560 -5300 -9064 542 -4802 -6695
321 -6695 5650 -555 -10208 3272 6605 -3232 2576 5800 -1362 6493 8922 -4127 1769 12797
335 12797 1988 -749 9802 1616 -3706 6805 1733 -6278 3822 2278 -6610 1732 1980 -11563
349 -11563 -3467 6009 -6665 -7738 3136 -2547 -5663 1768 -4477 -7815 5861 4142 -7002 949
363I49M885q515J889L634n538N329M506r456P08Q208q216k923J0655l441p251
378d577Q015R12p800L267k11l946Q731J229j1814N622Q861j1807j659J0145o253
393a285j363J0914p836q847J2541r03j2233R565M789j0318N450M488j2800L688
407d150R025j1068J922J3801j1880o598J6317m925j3561J3157M691j0667O828
420B892K673j1752P466O041j3934M419J2915j1120k054J0643j0573n339J4242
433F519m481r339J2435n81j1674Q158J524j0943Q396N475j0442N985N539j3568
447f997M208J0516j3471J60J6446r058q562J2384n320q479J3040k936j0483J3738
461E186O48j5204J0374M432j6959R680J3134j7441N22J6977j3529p118J6555o514
$$ plain form
363 949 5834 -2681 -792 2842 -2696 2633 7139 -2317 -1609 6599 -1617 -4540 6115 2674 -4577
378 -4577 3438 4350 -3450 -183 -394 -4340 4391 5620 -6194 -572 8289 -3518 -5177 4968 -1285
393 -1285 -2648 8266 430 -8417 4124 3221 -9012 553 5342 -4976 474 4962 -7838 -4150
407 -4150 4875 -6193 -4271 9530 -2350 -8948 7369 2444 -11117 2040 6731 -3936 2892
420 2892 5565 -6187 1279 7320 -6614 -2195 10720 -400 -2454 8189 -2384 -7723 6519
433 6519 2038 -7301 5134 4553 -7121 1037 2561 -8382 14 5489 -4953 1032 6571 -6997
447 -6997 -2789 7727 -5744 -5584 10862 1804 -6758 5626 306 -8173 4867 1931 -8552 5186
461 5186 5834 -9370 1004 5436 -11523 -1843 11291 -6150 -5628 11349 -2180 -9298 7257 743
475G43q077J6196l381j2648J3025k61j4258J1633M899j5033R519J0004j8195M83
489e351J3577j2236l491J5544p223q330J1798m062r581R425j010o462J1295m77
503C416j2501J0401M706j5575N610J2367j0192M4J0495r103l614R560n610k633
517b629J0535m498n514R441n108r825J0123L83r678R987L539j3300L737P082j1183
532f908O11J0512n526o72O349q676j683J0285o523m788J4067j272j0637Q284J701
547E124j1206N692P062q373K754O950r349k466P427n726k947Q819j453n428M502
562A382j519o242M650K163m740M058M676n283j636K839j760K92K731J7P99Q96
578C323k776r55P77m63Q87J606n30j35J92l400j167L002j093j176L116J65l345
$$ plain form
475 743 -7334 8862 5481 -7167 5858 5597 -8661 2972 7871 -7162 2357 12361 -5834 -5351
489 -5351 8226 -4010 -7501 8043 820 -7510 4288 226 -9355 70 -940 -7402 3893 3416
503 3416 -9085 1316 6022 -9553 -3943 8424 -1768 -1724 8771 -332 -3946 5614 4 -2629
517 -2629 7906 3408 -2106 7335 2227 -7598 2525 2908 -6770 3217 6756 -6544 -2807 4275 -6908
532 -6908 -6297 4215 -1311 -1983 4366 -4310 -5993 4292 -2231 -7019 7048 5776 -4861 3423 5124
547 5124 -6082 -390 6672 -1701 1053 8003 -1346 -3812 3615 -2111 -5058 3761 2308 -3120 1382
562 1382 -137 -6379 -1729 434 -4306 -248 4428 -855 -2491 348 -1412 -1120 1611 1628 2427 3323
578 3323 547 -408 369 -94 793 2399 1869 1734 1926 -1474 -2641 361 -732 -1908 1208 1373 -1972
595a972r6J91q24R60J801j58M42L41q10j293K41J467R40k65J252O32k491j27J276
614A507k009K1L566j711k186K560j177m464L105J465l314K523K651m662l02L397
630I70l861j67N353k117j885M404j953l345M162p02k713M703L52m480L749N65
646C035n835L231K577n988L321M477p388m73O585o303k506P798k594m173P298
661C062k652o712P516P95p704O700N209r303K636N963q278Q1Q046n530j619Q056
677F266n002n342P251k113n986P110P30o172M636P08p919N266L167p716M086O201
693E171q051k57P101p172n41Q824m885l644R243l987p141Q394l37p434P756K140
709E180r192M363M124r676K877P635q166j83Q890p362m663Q453k939m838Q254
$$ plain form
595 -1972 -2068 -1877 -2701 -1741 60 -98 344 685 -125 -1418 -1177 290 1230 965 2217 2849 358 231 1507
614 1507 -502 -481 3085 1374 -812 1748 571 -3893 -788 677 -2637 -114 2537 -2125 -2427 970
630 970 -2891 -3058 2295 178 -1707 2697 744 -2601 1561 859 -1854 2849 3201 -1279 2470 3035
646 3035 -2800 431 3008 -2980 341 4818 -2570 -3043 3542 -2761 -5267 2531 -63 -4236 3062
661 3062 410 -6302 1214 2009 -5695 1005 6214 -3089 -453 5510 -2768 -2687 5359 -171 -1790 6266
677 6266 1264 -4078 3173 1060 -4926 2184 2914 -3258 1378 2086 -5833 -567 2600 -5116 -1030 5171
693 5171 -2880 -3137 3964 -3208 -3749 5075 190 -3454 5789 1802 -5339 3055 2718 -4716 3040 5180
709 5180 -4012 351 4475 -5201 -2324 5311 -2855 -3038 5852 -1510 -6173 2280 -659 -5497 2757
724B757j032o087O526R8p334N762L370o965M156M880q591J182O683o837o98P646
740E516m889k897O729m187n568P632q21o455O555J062q263M625K848p594L578
755b129O238p076J03O883o088k282P464k388l690O736j120n105N078l07n843O163
771B637K709p343K108M303o222O0M574m288j88N527m192l511N358j922m383N455
787F82P76m478L542J397n271J897L293m070J792N194m824k497M831j568k922L535
803A309J33j707K843j657m047L344J681m560K111L401l548l89J552k680L19L297
819A402k210k51M021k423l517M055K95l513L196J892l243K222P65n525J686N055
835C907m150j898N702j892m230K782m90k834M207L62n024L620K318n786N22M676
$$ plain form
724 2757 1725 -4362 2164 2262 -5072 690 4060 -2905 1251 6131 -2460 -1278 5405 -1432 -2130 5516
740 5516 627 -2270 4459 272 -5296 2336 1515 -4940 1615 2677 -5586 -961 1887 -5707 -2129
755 -2129 4109 -2967 -2864 4019 -2069 -4351 3113 725 -2965 3771 2651 -2454 2624 2317 -3526 2637
771 2637 5346 -1997 111 4414 -1808 -1748 2826 -1462 -1650 3877 -315 -3826 1532 -390 -4773 682
787 682 1458 -3020 522 1919 -3352 -1455 1838 -2232 -440 4754 -70 -2567 2264 696 -2226 1309
803 1309 1442 -265 2578 921 -3126 218 1899 -2661 -550 2851 -697 -1086 466 -2214 -1895 1402
819 1402 -808 -1059 2962 539 -2978 1077 1372 -2141 1055 2947 -296 1926 2691 -2834 -1148 3907
835 3907 -243 -2141 3561 1669 -2561 221 -269 -3103 1104 1466 -3558 62 2380 -3406 -2884 1792
851A792l046j197M476j568k178K760j666j799M565l47l539L432J529m138O74J653
867A403k626K065K054m147Q65L611m288j635M074j064j893L610j569k889L600
882A171j013m041M605J955n242K101L825n097l58M012k749r29M312k641j961M545
898B495k122m460M330J726l965K590J190l698J296K006l733J276L537k736o30
913h98L419k662j482L380j596j109L944j239k845L206n84m030K657K315l189J160
929D47J510l600O39K219l988N84M511k936j963L732j471l251L498M59k993L142
945E39J323l073R83J361k690Q74L169j975m38K723k023k034K800j029j740K929
961A699O0k497J054O36k443R55R14j773J340J327k403l18J463j142j80J727K28
$$ plain form
851 1792 -1254 -2451 2025 457 -1721 1039 -627 -2426 2139 1792 -1747 1685 3214 -924 -250 1403
867 1403 -1223 842 2896 -1251 -386 3225 -1063 -2698 1376 312 -1581 2029 460 -2429 1171
882 1171 158 -3883 722 2677 -2565 -464 3361 -1736 -2094 1918 -831 -1760 2552 -89 -2050 2495
898 2495 373 -4087 243 1969 -1996 594 1784 -1914 -618 1388 -2345 -1069 2468 -268 -898
913 -898 2521 -141 -1623 1757 161 -948 2996 1757 -1088 2118 1534 -2496 161 2476 -713 447
929 447 1957 -1643 -1004 1215 -2773 -2189 2322 -614 -2577 1155 -316 -3567 -69 390 -2603 539
945 539 1862 -1211 -228 1133 -1557 -683 2486 511 73 2796 773 -1261 1539 510 -1230 1699
961 1699 1759 -738 316 952 -1491 -536 378 -1395 -55 1272 -1131 -1449 14 -1128 -1308 419 647
978F47j206J595l83j439L56P99m72R02N88j304J88L49j184k27J192j25k82N30
996E24n70j448K49Q68n68m3J148j17j19ql36o98J238N19o4P10P4j019M96J58r09
1017H5M29J584r47j332J205q50j101R46Rj265J177Q58k237M13L34j998J320J756
1035C86j958kK567k034j482L139o31j840L349L07k456K219M98l062J779J524k759
1052d56J692K356l585j207L345k083j291L243j810k285L007p27l377L123P13l333
1068b675K176J795l527J738J492l549J398L485l027n17M083k825j842L616j281
1083E40j888L673j240k810M291p39m758L263J814m555K192K749m378M47L361m085
1099b123l2M939l623j994N015j619l569M500J6m165L931J288m546L107K099n486
$$ plain form
978 647 -559 1036 653 -786 -430 369 -103 799 1387 83 271 620 -564 -791 401 276 -6 524
996 524 -46 -1494 -1245 -377 -945 -988 160 43 -76 -84 -420 -1118 120 639 575 1285 1359 340 836 994 85
1017 85 514 2098 1151 -181 1024 174 -927 19 28 -1237 -60 798 -1439 -1026 -692 -2690 -1370 386
1035 386 -1572 -1574 993 -1041 -2523 616 -15 -1855 1494 1801 -655 1564 2062 -1000 779 2303 -456
1052 -456 1236 3592 7 -1200 2145 62 -1229 2014 204 -2081 926 199 -3178 -55 658 -2675
1068 -2675 -499 1296 -2231 -493 999 -2550 -1152 2333 -694 -1211 2872 47 -1795 1821 540
1083 540 -1348 2325 1085 -1725 2566 1827 -2931 332 2146 -2409 -217 2532 -1846 -1399 1962 -2123
1099 -2123 -2155 2784 -839 -2833 2182 563 -3006 1494 1510 -2655 1276 2564 -1982 1125 3224 -2262
1115b262J193M714m171o64L713l173r38L569k908j771M478j449l570M370J29m047
1131b787K265R68l058K777J724m241J986K970m438L3M913l272j119L820j988j381
1147h28L593k333k886N073q89m278L720J420m903J839K167l604J110L353l739
1162a185r63M160k859j921L994r11k262L156o84k471K917m07l336L630J699m033
1178a476R24K748k963j99K340j540k78K220k179j154L107j404k288L181M2k623
1194a542K328L31k771J416J824k730Q84K156k001j003K120j055o68J733q10q35
1210f23J950j217j964K461K68k431J246J271j697J32J002j538L10J531j276n0
1226f25J341p38p77J520n81l91J225k24j108R50J34j565J161J137j391m51J189
$$ plain form
1115 -2262 -1069 3645 -526 -1190 2523 -650 -1588 1981 -927 -2698 1780 331 -3239 1131 1260 -2787
1131 -2787 -522 446 -2612 165 1889 -2352 -366 2604 -1834 -1801 3112 -160 -1279 2541 553 -828
1147 -828 2765 432 -2454 2619 1730 -2548 1172 2592 -2311 -472 1695 -1909 -799 2554 -1185
1162 -1185 -2148 2012 -847 -2768 1226 315 -1947 1209 525 -1946 971 564 -2772 858 2557 -1476
1178 -1476 -552 2196 -767 -966 1374 -166 -444 1776 -403 -1557 1550 146 -2142 1039 1081 -1542
1194 -1542 786 1117 -1654 -238 1586 -1144 -260 1896 -105 -1108 1012 -43 -711 1022 212 -623
1210 -623 1327 110 -1854 607 875 -1556 -310 961 -736 -604 398 -1140 -830 701 -575 -625
1226 -625 716 -22 -799 721 140 -251 974 750 -358 592 726 -839 322 1459 68 -383 806
1243H06p16m47M89n10k9Q80l24j191R74j22r65O56J048r16P6R50q47r36J335K01
1263D12n37O85L9j037P03L18r92L64Q96r63L39R30j452p59J105P9r87J443J2j377
1283g79K67O72j285N23J127p26L3J024j005l66J189o48p99J678N51j800N05N45
1301G06j012K06Q85j156O98L31j021n2M70j225K32J471r40o69J344p74j091J362
1319b35l4o45J706kj916J296M85j518R53J043j363O50J660j901q67K201j372r00
1337g59K301n43k082J527J44k110J029J244j669L59J309j561n05J886j157p91
1353a378J684m74o33J897p82j485J400Q24j302P70O69j350O31K88j336N78J046
1370A047j401K52J358j384p60J279p43j033J719K63j608J092J26j544R15J422
$$ plain form
1243 806 90 -357 132 -378 -407 473 149 -1042 -68 -190 -1155 -499 549 -367 -291 659 -188 -1124 211 412
1263 412 -125 560 599 -438 265 583 -409 -45 851 -112 227 1157 -295 -1054 51 130 -857 586 598 -779
1283 -779 -512 160 -1125 -602 525 -201 -168 856 -149 -515 674 26 -773 905 1456 -344 161 706
1301 706 -306 -100 785 -371 327 658 -363 -415 55 -1170 -938 533 -407 -1076 268 -506 -1597 -235
1319 -235 -269 -914 792 790 -1126 170 655 -863 90 1133 -230 420 2080 179 -688 1513 141 -759
1337 -759 1542 999 -1083 444 588 -1522 -493 751 -918 -559 750 -811 -1316 570 -587 -1378
1353 -1378 306 -168 -801 1096 314 -1171 229 1053 -249 521 1190 -160 471 759 -577 1 1047
1370 1047 -354 -102 1256 -128 -888 391 -352 -1385 334 597 -1011 81 207 -1337 -422 1000
1386A000j482M63J201j258l18J632j317p67J956k56r65Q45K70j478N21L92r77
1403e38O36P79j102l34P67r75p8R51p20j08J220n98o06R05j95j139J266J002j287
1422a54L74O27j056J9J091p53r0J432r85j259J578j53j408O28P95j270R06M05
1440G27j660k12J554j177k06J621n38r72R75k49j119J276L08q80J271M01j856
1457g36N73R99j445L50J489q88k39P40j270m98J668l84j248J516j71j568J156
1474D4K48j721J408P91j597Q47J086j710k69J823j153o22K129q48j060J549n49
1491C96j337J867N1k371J964Q02k354O16J061j624l6K120j819j22J669j227r44
1508a288J564r3j560K353q4k310J769P10k197J075J167j844N96J991k226l94K067
$$ plain form
1386 1000 -482 -19 1182 -76 -394 1238 -79 -846 1110 854 -111 734 1004 -474 47 439 -538
1403 -538 98 877 -225 -559 208 -767 -845 106 -614 -722 498 -100 -706 199 4 -1135 131 1133 -154
1422 -154 220 847 -209 -190 901 148 58 1490 505 -754 824 671 -737 -109 686 -584 322 727
1440 727 -933 -1145 409 -768 -974 647 109 -863 112 -137 -1256 20 328 -552 719 1120 -736
1457 -736 -163 836 -609 -259 1230 342 103 843 -427 -925 743 359 -889 627 456 -1112 44
1474 44 292 -1429 -21 770 -827 20 1106 -604 -873 950 -203 -825 1304 456 -604 945 396
1491 396 -941 926 977 -1394 570 1372 -982 -366 695 -929 -965 1155 -664 -786 883 -344 -1288
1508 -1288 276 183 -1377 976 892 -1418 351 1061 -1136 -61 1106 -738 -142 1849 -377 -771 1296
1525A296j305p33J798q23j420K018m56k102J844N74k274J631Q59k038N59J406
1541H34j633J41J510j239J64J548j783m59K306r42j582K324l29j739J577J4j785
1558a073J115J095k317R50J318k016K72J335j469m67K201j250o58J726q46j314
1574a398J937j83j449J565P47j819Q13Q45j732O30J083j538K10J593j514n81J453
1591F62q80q66J848k10j552J050J71j513J379L72j534P60R76j012J1P62p25K25
1609g6J052j035l62J463o81r02J080j72n46O49qr31N65P6p34O70J41q97O61L08
1629C21n78k56O22m08k23Q22k97o95R61J90q70M13L13k35K76R1o75O21K34o10
1649A7k83Q70n03k36K14J16m46o4O55n25J35J62m16j6L22j04l80J81N16m32j46
$$ plain form
1525 1296 -9 -742 1056 233 -1187 831 375 -1727 117 691 -1583 48 907 -1131 -572 834
1541 834 -799 -658 852 -387 -223 1325 -458 -917 1389 447 -1135 1189 860 -879 698 712 -1073
1558 -1073 42 1137 -1180 -230 1088 -928 -656 679 -790 -1257 944 -306 -964 762 -84 -1398
1574 -1398 539 356 -1093 472 1219 -600 213 1058 -674 -44 1039 -499 -289 1304 -210 -791 662
1591 662 -218 -1084 764 554 -998 52 223 -1290 89 461 -1073 -313 663 -349 -338 424 -301 -76
1609 -76 976 -59 -421 1042 361 -541 539 367 -179 470 462 -469 96 172 -562 108 249 -648 13 321
1629 321 -257 -513 109 -299 -522 300 3 -692 269 459 -411 2 315 80 356 447 -228 393 627 17
1649 17 -266 604 101 -135 79 195 -251 -315 340 -185 -50 112 -304 -320 2 -102 -482 -301 215 -217 -363
1670c63M34J36j68K04j61J3M77k82p13M86L60m16M8N89p33k12O87r12J0O19l50
1691b47k03P72n69n48Q15K1p37O87k6m02O29L25q80M31O49q25R8N67m80k82P67
1712E62o04p5R87o03o89P73j34q21O53M33j309O54L57p35J74N51j088N94P48p56
1732c28k31J506j088l71J364l96j096J487J04j424O61M05j123L54J021j519N39
1749a35J035j299m72J302n16q67J572n61j229J384Q4j500J386L68j426J009M81
1766F16j212O79Q77j441K1J265j078p7J433r76q59J358l40j273J349K70j726J240
1784A26J84j492R80O58j341M56J013j268J73R95p52j77J008k14q75J262l83r60
1802f07J292L5j147P00P97j623M42P41r81n7J219j379k21J525q31r51J386k68
$$ plain form
1670 -363 71 207 39 243 82 95 572 290 -423 63 423 7 55 644 -89 -301 386 -526 -516 103 -247
1691 -247 -450 322 -247 -795 20 41 -696 -9 -35 -437 192 517 -363 68 717 -108 -10 557 77 -205 562
1712 562 -42 -117 870 267 -422 351 217 -604 49 482 -827 -173 184 -551 -377 174 -914 -320 428 -328
1732 -328 -559 947 -141 -512 852 456 -640 847 951 -473 188 593 -530 -176 845 -674 -135
1749 -135 900 -399 -871 431 -85 -952 620 59 -1170 214 298 -1202 184 552 -874 135 616
1766 616 -596 83 960 -481 -460 805 -273 -350 1083 107 -752 606 266 -1007 342 612 -1114 126
1784 126 310 -1182 -202 456 -885 -429 584 -684 -511 484 -268 -445 563 349 -526 736 353 -607
1802 -607 685 720 -427 273 1070 -553 -111 630 -351 -408 811 -568 -789 736 -95 -1046 340 72
1820G2q92R84K16j059O34M30j181O42M55o80M20P87r40k14R66o27k74J096o46
1839A89o75R14J40j278O53L47p42J66N40o20K29M25q00n4R91o00m84J177m84m25
1859c91Q12l06o01N43L93p38Q33J93r57m0Q65o99r1P31l95m13P06p24q90J339
1879A70O9r71Q25K60p99Q3M98n47l4R69m80j22Q27p39p30R50K7m40N18K38q15
1900b43M66j64m74N32P10j053l09J053p31l06O69n08J2Q50k17j067J052l50r17
1919i95R44O67n80R8M64m79j19K13q31N81J109o06r49J030n20n91O48J10p01O47
1939A40J67j112P49L20j154M32P91m64j59O02p36j40P78m82r4J163l46q62Q10
1958D03J48j055P16M49r16M38K12q17J75P78q75l30J204j74p52O51l10r04Q80
$$ plain form
1820 72 -820 164 380 -679 -45 385 -796 -154 301 -379 41 828 -112 -326 640 13 -261 835 189
1839 189 -486 428 568 -710 -57 290 -452 -286 254 -366 -137 288 -512 -566 425 -175 -659 518 34 -391
1859 -391 421 115 -486 57 450 -288 545 738 -219 -259 606 -93 -184 547 152 -261 445 -279 -1169 170
1879 170 239 -732 93 353 -446 -363 135 -412 -446 523 43 -79 748 9 -721 229 256 -184 334 572 -243
1900 -243 223 59 -415 117 827 -226 -535 518 -213 -519 150 -358 -346 504 287 -780 272 -78 -995
1919 -995 -51 616 36 134 598 119 0 213 -618 -37 1072 466 -483 547 27 -564 84 194 -507 140
1939 140 307 -805 -56 264 -890 -458 333 -131 -290 312 -424 -564 214 -268 -362 801 455 -407 403
1958 403 551 -504 212 661 -255 183 395 -422 -247 531 -344 -674 530 356 -396 255 -55 -959 -79
1977g9L38r81P87N19j020N06L84q38J76Q73p45N9M24l68k55O33k47m73O57J32
1997D82p20J19R2l07N9M24o95K03M47o25l9N92l92j33M25j7k46M81M6j88L60p7
2019B91l66M90P8p89N10K09m91K97j11j87m3M43j46m53L17j41l63N35j85k56j7
2040c78N38m96J78O7L1o9N1k30L69K96k56j65N01l31j49L14kl24o5M08l25MJ33
2063A00o1k23J04j82L2M13k44k85N4K59j97J6M05l37j40N76q9o45N08J68k99L36
2085B69o7k06J34J81l25K28K57p13K58J14k36j09M58k11m79L26r0j16O9J04k93
2106d47M48M91r62K39N26l23K2L29m89j07J027o72l0L09M8m64K49M12j275P38
2126F9K31o79L65M98q74J50Q44j138J83P56n49n89Q02j26m58R88l49m04M08J29
$$ plain form
1977 -79 259 -722 65 584 -436 70 454 -384 -208 665 -80 -21 403 35 -220 413 166 -307 350 482
1997 482 -238 -119 -27 -334 -275 149 -546 -343 104 -521 -560 32 -360 -493 -68 -85 -331 150 196 8 368 291
2019 291 -75 415 493 -296 214 423 -68 229 118 -69 -112 331 185 -268 49 -92 -455 80 -105 -361 -378
2040 -378 160 -336 -158 -91 -60 -129 -78 -308 61 357 101 -64 437 106 -43 271 269 -55 -120 288 -37 -33 100
2063 100 39 -184 -80 -262 -230 183 -61 -346 -292 -33 -230 -214 191 -146 -286 290 201 -444 64 232 -67 269
2085 269 202 -4 130 311 -14 214 471 -242 16 130 -106 -215 243 32 -447 -121 -211 -327 -258 -154 -447
2106 -447 1 492 -470 -231 295 -28 -6 323 -166 -273 754 82 52 361 409 -55 194 606 -669 69
2126 69 300 -379 -14 484 -390 -240 604 -534 -351 405 -144 -733 69 -57 -515 473 124 -280 128 257
2146B57n53N92L44q35J85N02r27N5R49o15l06P28o10k35N94m8p55P02K27p47O74
2167A78J99j033N24O02j008J66R83o87j45P17n26l68J181o06o70R93m03o51Q00
2186B46J68j106P83K93q04N88Q0o40Q7R45r00l34J057j49q09P58j54p74J009k9
2206C15p26P60J89r29M17N61q93L00N39n81lM87m28j95O64p73j74P29j00o52M16
2227g7K35p05N63J08o86N76K89n64K86M54m87k63N31m75J40L91r5o09Q75m81k12
2248b06N04O8n76O3K33o13J31M63m55J57O29o38k59J024n73k29N83j94l4K14L4
2269C26l21J50J64m37N2N59m97j73L85l25N3N05n79j44M74j15m46O41l00k75J53
2290a50J76l06K14L20q95L84N25l35O9J70J56m49K88q2j12L62j23j32Q6L03m74
$$ plain form
2146 257 -296 296 640 -195 -10 492 -435 -380 569 -46 -352 376 -234 -469 125 77 -678 24 251 -496 178
2167 178 377 -656 -132 470 -538 -372 611 -76 -221 496 -30 -398 783 177 -493 500 97 -554 246
2186 246 414 -692 91 384 -420 168 248 -392 -305 640 -260 -594 463 314 -495 263 109 -665 344 315
2206 315 -411 349 538 -391 26 587 -306 -6 533 -48 -51 436 8 -187 477 -296 -470 259 159 -493 -77
2227 -77 158 -547 16 124 -562 14 303 -261 25 479 -8 -271 260 -215 -75 316 221 -388 487 6 -206
2248 -206 298 366 -210 -147 86 -527 -396 67 -388 -231 398 -240 -499 525 -48 -277 306 112 78 292 326
2269 326 5 155 319 -118 -66 493 -4 -177 208 -117 -64 441 -138 -282 192 77 -369 272 -28 -303 -150
2290 -150 26 -280 -66 254 -641 -257 268 -67 2 172 328 -121 167 85 -27 335 212 80 166 469 -5
2311eo2J59k82K27J94k21l96P1P8j51L21L28l77j0r1j00L22j08j5J05L19j53j63
2334a0K12ml36M67k54J7R1j67J2o7j9Np0L00l73M7K85l22k61N49k62k24M02M2
2358F0m54N13j20q2J56L9l00J74N64m72nK76k77k46L18r8j26K56j78m06L86J80
2380A58l96L10j9l77j1L55k58NL39m61K27L41m02j63N74l4k74J40J52n2l7m0k43
2403a66K58K82l98J04J63r6k72K60k36j18K57K1m60L86J20l91L14j18n5J00K21
2424A76k94R5M48n83J26J41K47k19J25K11o29K29J20j97k5J54j49j03J76k32J45
2445c8J16j92l33M06r5l2L63k59j00L00N2l71K63J62n71M58J09p0J34j23q7m36
2467c44N97O6n08P1R3j05J48j22k75l9O06l51j7J73k8o0J34j38j12L44j93L8J27
$$ plain form
2311 -5 -67 92 -190 37 231 10 -386 -315 -237 -388 -67 261 -116 -126 -217 -317 5 -103 -118 -13 306 153 -10
2334 -10 202 198 -138 329 75 92 183 16 28 -39 -58 -53 -123 177 -196 -149 136 -186 -447 102 -160 -384 18 60
2358 60 -394 119 -1 -83 73 112 -188 -14 550 78 73 349 72 -174 144 46 -80 176 -2 -408 -22 158
2380 158 -238 72 53 -324 -335 20 -238 -233 106 -355 -128 213 -189 -352 222 188 -86 54 206 154 117 77 -166
2403 -166 92 374 -24 80 243 147 -125 135 -101 -219 38 59 -401 -15 105 -286 28 -90 -145 -45 176
2424 176 -118 -23 425 -158 -32 109 356 137 262 473 -156 73 193 -4 -29 125 -24 -127 49 -183 -38
2445 -38 78 -114 -447 -41 -136 -168 195 -64 -164 136 188 -183 80 242 -329 129 238 168 302 179 92 -344
2467 -344 253 319 -189 -118 -25 -130 18 -104 -379 -418 188 -163 -180 -7 -35 -95 39 -99 -211 133 -60 -22 105
2490A05L53m73J18K9j71J13L4j49J67P5l00J02J29J1l88N53o8l84R7J35l74J59
2512a27Q6j59L01l7N5l49L19k54p5L15Q4k45K26k6n09M68m3j46P6L28n94L68K44
2535C06m64R0K18l11o4L53o5o17P09j03m38N39Q7m72K75K00m89M2N08j91j72M50
2557C91l43j32L73l56k8L89k62l87L68J9l38M50J74n75L05K64o92k1N63m07J65
2578h0K07j73j81N62l36j19L47p2m92R76m39o02M81L2n01M97o1l71L21K26n14
2599b92k9P03m76k9L15k64j57M97o7n53L17L01l42L52M4m53l0L55j25n8L08k98
2621A9j04J53j55L7M9k14rK99n28R0L62M6l01J38K58n51M49J10k55l7M41m64Q7
2644h0M50k84j39L12j43L7J14r3l73L9K99k88J16M75o21K30J08r5j58K4r1P5K46
$$ plain form
2490 105 458 -15 103 132 -39 74 108 -41 126 201 -99 3 132 143 -245 308 240 -144 -47 88 -286 -127
2512 -127 -41 -200 101 64 119 -230 89 -165 -240 75 159 -86 140 114 -395 73 30 -116 -40 288 -306 62 306
2535 306 -158 -68 150 -161 -225 128 63 -554 155 52 -386 153 240 -232 43 243 -246 -204 304 113 -59 391
2557 391 48 -84 289 -67 -95 294 32 -355 13 32 -306 144 318 -257 48 312 -380 -401 162 -245 -80
2578 -80 127 -46 -227 335 -1 -120 227 155 -337 639 200 -402 79 111 -390 107 46 -325 -4 222 -292
2599 -292 -321 382 -94 -123 192 -72 -229 268 201 -352 -35 266 -76 276 320 -133 -163 192 67 9 317 19
2621 19 -85 68 -87 -50 -1 -215 -224 75 -453 -363 -1 45 -256 -118 140 -411 38 148 -107 -144 297 -167 -80
2644 -80 370 86 -53 259 116 153 267 174 -199 -160 139 -149 -33 442 -179 51 159 64 -94 -70 -161 -86 160
2667A60k87o8MJ28k30J69N8K9j07M76j41j77K58j01k13L01k55k1R7mrK30m04K02
2691I5k20j25l2M23J90o45R0o8J96rJ66o7l07M46l00R7K86O0j68J18q1o8J57j43
2715I1j95l8L77j85k35L81j49k06J63N8j64Q7r2K05l26J04RO4K81j19l06Q3L80
2738B68k61J15r0L2q3L07k70mn4M4J22L4k4k71L2L44n31K09N4o0j2J58k70m7L38
2763H0k38O6J14n4J59J7q1m50M99k27l6K38K39l77J94K12n19K66M0j30k5K13l62
2786a62PL02k13j03L01P0k63K97k10k88N17J42o61K22K09l69l1M13l15K62M7r5
2808G9j89Q9Or4J86k92N1L75r3m26M27Lm00M46j10j20n4L46j57m09L93N1k48K55
2832A15k0j0j46j79J03K73k90L02Nn9j74o4L14j92l05M72j99j3Q2m4k30L00j25
$$ plain form
2667 160 -127 -195 -191 -63 -293 -124 -66 -37 -144 332 191 14 272 171 -42 259 4 -17 80 76 67 297 -107 95
2691 95 -125 -250 -282 141 331 -314 -224 -292 -96 -105 61 -6 -313 133 -167 -70 216 276 108 226 145 77 234 91
2715 91 -104 -142 235 50 -185 196 47 -159 4 62 -102 -15 -107 98 -228 -124 -115 -51 230 111 -195 -112 268
2738 268 7 122 32 64 -19 288 18 14 -40 4 126 160 136 -135 -103 241 -290 -81 -27 -87 -99 59 -211 -258 80
2763 80 -158 -92 22 -32 127 144 63 -387 112 -115 -151 87 326 -51 143 355 -164 102 142 12 -13 200 -162
2786 -162 -155 147 -66 -169 132 202 -61 236 26 -262 255 397 -264 -42 167 -202 -233 180 -135 127 174 79
2808 79 -110 -21 -15 -109 77 -215 -164 211 118 -308 119 122 -278 168 58 -62 -116 230 73 -336 57 108 -140 115
2832 115 95 85 -61 -240 -137 136 -154 148 153 94 -80 -144 170 -22 -327 145 -54 -67 15 -29 -259 41 -84
2855h4p7K83l15p2L83N0l71L27O3m74Q8L85j50p9L21k86k87K31K09l27L86M3o19
2878c72K49N69o79K34K35q05M41Rj78K73J00J01j88mj1j1Q6j91M7J46R2j00l7
2901FM29n99k2M40l25O2P0J06k59O5j16R1M9r3m0J74J06p5K9R6k98J56j8j88k00
2926c54L36k25L7J65L61r8l4j61k67K61N0l7j84M33m99J10J8J60j15K76k97m3
2948a07R3j00j47K21J14m38L85j73J09J16j14J3J92j07R4j84L48j28l44L11k34
2969h0j56K66mk26K34K16m41J57N5j58r9N54n99J94Q6k61L38K47j72k10L57o08
2991c10J86J79J11m60R5J42r1J80L09m40K15l7m8k42M02k53j22K23j65k25M99
3012A48K74n45j11J48j51J07L10k23J76J7l11qL00k87R9K93l34j54N59qm20K28
$$ plain form
2855 -84 -161 122 -193 -265 118 168 -203 124 187 -287 -199 186 36 -43 278 -8 -295 -64 145 -182 204 247 -372
2878 -372 -123 446 -233 1 236 -569 -128 -119 -297 -24 76 177 -11 -15 -26 -37 49 -142 -95 51 143 43 6
2901 6 435 -164 -186 254 -71 -9 61 167 -92 -27 -143 -52 -3 -96 -136 38 144 69 98 194 -104 52 34 -154 -354
2926 -354 -18 -243 -206 -41 320 222 188 27 -240 21 71 34 -150 283 -216 -106 -88 72 -43 233 -64 -107
2948 -107 -14 -114 -261 -40 74 -364 21 -152 -43 73 -41 -28 164 57 151 -33 315 187 -157 154 -80
2969 -80 -236 30 26 -200 34 250 -191 -34 21 -137 -236 318 -281 -87 -1 -262 76 323 151 -59 298 -310
2991 -310 -124 55 166 -294 -199 -57 -148 32 341 -99 116 79 31 -211 191 -62 -184 39 -126 -351 148
3012 148 422 -123 -234 -86 -237 -130 180 -43 133 150 -161 -169 131 -156 -57 236 -98 -252 307 299 -121 107
3034A07J62l35N9K64k66j97L67l06K86r5j75M4J58Q8k56L14j65mK20j99m5J09
3056A35k25k3K34m1kq7n0K4j98K60l9m0L4P6j41q3N1K2k06M63n43L79K65p7j70
3081A8O0l8j8p2K06j06P3l8j13J85p1mJ71n0l29K85j67K55l64O9pJ9Kn1j7lJ26
3108B1Qo2m5P2L7J53k15K60k76J6NJ69j81Q3M09k78o0J28l20m7R6p2J99k1k0j24
3134f5J54l61M14k28j88L12j36l8K37j23j84K69j84L8L7J39j92O5K50l24L16j62
3156D6J67l31J89j79N6o5K28k7j53j43J20J62r9j63K17N2q2j98K18L7pJ3n7M4
3180D5Nr1K59k35pM74j26l53K44rj19r8Q6N3m40O69k72m75L91J10j45L2J90n00
3204c12J42N2r2R5K94k20P7R0j52O1K23j13j41K41q4k54N6M1l1J22J14l60j27
$$ plain form
3034 107 269 -66 -7 257 -9 -206 161 -145 141 46 -129 -85 73 161 -95 219 54 50 270 71 26 135
3056 135 -90 -113 121 80 78 -9 -59 -35 -233 27 -12 -52 -18 58 -83 -166 -115 -93 -299 164 -379 0 265 188 18
3081 18 78 40 22 -50 156 50 123 85 -28 157 86 82 253 203 -126 159 -8 247 -117 -48 -55 -36 -34 -85 -102 -105 21
3108 21 29 -33 -78 -6 31 184 -31 229 -47 -31 -26 143 -38 45 454 176 116 244 -76 -123 -27 -99 100 79 59 -65
3134 -65 89 -272 142 -86 -274 38 -98 -136 101 -22 -206 63 -121 -83 -46 93 -99 -34 216 -108 208 46
3156 46 213 -118 71 -108 -52 -117 111 84 -69 -212 -92 70 -29 -192 25 77 -5 -203 15 52 45 58 1 45
3180 45 50 -41 218 -17 -24 450 324 -29 215 206 87 -11 75 128 -312 357 85 -390 1 111 -34 -2 188 -312
3204 -312 -170 -118 -210 -115 179 -41 36 126 -26 35 258 145 4 245 161 -93 -37 4 -27 95 209 -151 -278
3227b78Q4J82q2J49k64K0J84k9J34K2r1k42L38l19J43K37j64K44j33Kj23L3J1
3250E8k43R4L57O9p92N95L2l15K41k3l09J47J18j24J60J31j85O1n8j89l1J51q6
3273a41J14K18q3K1J30m75oK23j2p0K2M5j25K06j30o7N6K70q8j89L75m57M2N5
3297f6K8m3K05J04k33m1L27l01r3K95j96j94K09k73L25Qk12j6K71J42m54J67R2
3320E1k64K73n1n5j54L40j19j04M02l99L11J15j37k86K62r2K7J45n4L9k3m9j24
3343E4j17R5Pp9J29k27q6K02j33q7L95l3k64L62j75k59J01K50l12L06jk74J74
3366B8j2qj11J91n9P1M5k85n2P8N8Q4Mn3L69k03m52K53l3K28k77N9Q9j09l6J66
3392C3O8k44n8L37j31L32l03OJ52j48O0J13j55j1P8J94l99L8K78l01o4J75p0M3
$$ plain form
3227 -278 -194 -12 -94 55 -209 -189 -5 -34 100 122 31 -211 127 -192 -49 188 24 268 135 137 14 47 58
3250 58 -185 -91 266 335 -457 138 170 -145 96 73 -236 -89 29 -95 65 196 11 72 14 -175 -206 -55 -141
3273 -141 -27 191 108 129 259 -216 -222 1 -11 -81 -59 -14 -139 67 -63 -130 -74 196 108 -81 294 -163 -121 -66
3297 -66 -38 -81 124 228 -5 -46 281 -20 -113 182 -14 -208 1 -272 53 61 -151 -167 104 246 -208 -41 51
3320 51 -213 60 9 -46 -200 140 21 -83 319 -80 231 346 209 -77 185 93 120 265 211 250 227 178 54
3343 54 -63 32 39 -40 89 -138 -224 -22 -155 -242 153 120 -144 218 43 -216 -115 135 -177 129 128 -146 28
3366 28 16 8 -103 88 29 100 145 -140 -192 -114 -56 28 32 -21 348 145 -307 -54 -87 141 -136 -77 12 -97 -133 33
3392 33 101 -143 -201 136 5 337 34 40 192 44 104 217 62 51 129 323 -76 -38 240 -61 -125 50 -20 23
3416B3K67j31k64j29K48j07r6K58j16O4M6L4j10J86O8j96J29n3j60L1K52j98m
$$ plain form
3416 23 290 159 -105 -234 14 -93 -189 69 -47 17 63 97 -13 173 241 45 174 121 -39 -8 244 46 42
$$ [...]
8191G2
##END NTUPLES=NMR FID
##END=
