##TITLE=1H_SL35(AcOOH)
 CDCl3
 8 sc, 
 17.11.2021
##JCAMPDX= 6.0         $$ Bruker NMR JCAMP-DX V2.0
##DATA TYPE= NMR FID
##DATA CLASS= NTUPLES
##ORIGIN= UXNMR, Bruker Analytische Messtechnik GmbH
##OWNER= root
$$ XWIN-NMR		Version 3.5
$$ Wed Nov 17 11:49:41 2021 Russian Standard Time (UT+4h)  she@DPX200
##.OBSERVE FREQUENCY= 200.131346
##.OBSERVE NUCLEUS= ^1H
##.DELAY= (6, 6)
##.ACQUISITION MODE= SIMULTANEOUS
##.ACQUISITION SCHEME= undefined
##.AVERAGES= 8
##.DIGITISER RES= 18
##SPECTROMETER/DATA SYSTEM= spect
##.PULSE SEQUENCE= zg30
##.SOLVENT NAME= Acetone
##.SHIFT REFERENCE= (INTERNAL, Acetone, 0, 15.7039)
##AUDIT TRAIL= $$ (NUMBER, WHEN, WHO, WHERE, WHAT)
$$ ##TITLE= Audit trail, XWIN-NMR		Version 3.5
$$ ##JCAMPDX= 5.01
$$ ##ORIGIN= Bruker BioSpin GmbH
$$ ##OWNER= she
$$ F:/spectra/data/she/nmr/H-F/1/audita.txt
$$ ##AUDIT TRAIL=  $$ (NUMBER, WHEN, WHO, WHERE, WHAT)
(   1,<2021-11-17 11:48:36.89 +0400>,<she>,<DPX200>,
      <created by zg, POWCHK disabled, PULCHK disabled
       configuration hash MD5:
       00 E9 B6 7A A2 85 ED C7 34 08 36 98 17 FE 4E 26
       data hash MD5: 16K
       C8 1E D7 23 06 2E 67 A2 93 AB 29 97 0F A7 01 2D>)
$$ ##END=
$$ 
$$ hash MD5
$$ A3 3B 37 3D 3E 46 BC 2C 76 FB 10 A2 EF F7 CF 3F
##$RELAX= 
##$RELAX= 
##$RELAX= 
##$RELAX= 
##$RELAX= 
##$RELAX= 
$$ Bruker specific parameters
$$ --------------------------
##$DU= <F:/spectra>
##$EXPNO= 1
##$NAME= <H-F>
##$PROCNO= 1
##$TYPE= <nmr>
##$USER= <she>
##$AMP= (0..31)
100 100 100 100 100 100 100 100 100 100 100 100 100 100 100 100 100 100 
100 100 100 100 100 100 100 100 100 100 100 100 100 100 
##$AQSEQ= 0
##$AQ_mod= 1
##$AUNM= <au_zg>
##$AUTOPOS= <>
##$BF1= 200.13
##$BF2= 200.13
##$BF3= 200.13
##$BF4= 200.13
##$BF5= 200.13
##$BF6= 200.13
##$BF7= 200.13
##$BF8= 200.13
##$BYTORDA= 1
##$CFDGTYP= 0
##$CFRGTYP= 5
##$CHEMSTR= <none>
##$CNST= (0..31)
1 1 145 1 1 1 1 1 1 1 1 1 1 1 1 1 1 1 1 1 1 1 1 1 1 1 1 1 1 1 1 1 
##$CPDPRG= <>
##$CPDPRG1= <>
##$CPDPRG2= <>
##$CPDPRG3= <>
##$CPDPRG4= <mlev>
##$CPDPRG5= <mlev>
##$CPDPRG6= <mlev>
##$CPDPRG7= <mlev>
##$CPDPRG8= <mlev>
##$CPDPRGB= <>
##$CPDPRGT= <>
##$D= (0..31)
0 1.2 0 0 0 0 0 0 0 0.06 0 0.03 0 0 0 0 0.0002 0 0 0 0 0 0 0 0 0 0 0 0 
0 0 0 
##$DATE= 1637135316
##$DBL= (0..7)
120 120 120 120 120 120 120 120 
##$DBP= (0..7)
150 150 150 150 150 150 150 150 
##$DBP07= 0
##$DBPNAM0= <>
##$DBPNAM1= <>
##$DBPNAM2= <>
##$DBPNAM3= <>
##$DBPNAM4= <>
##$DBPNAM5= <>
##$DBPNAM6= <>
##$DBPNAM7= <>
##$DBPOAL= (0..7)
0.5 0.5 0.5 0.5 0.5 0.5 0.5 0.5 
##$DBPOFFS= (0..7)
0 0 0 0 0 0 0 0 
##$DE= 6
##$DECBNUC= <off>
##$DECIM= 32
##$DECNUC= <off>
##$DECSTAT= 4
##$DIGMOD= 1
##$DIGTYP= 9
##$DL= (0..7)
0 120 120 120 120 120 120 120 
##$DP= (0..7)
150 150 150 150 150 150 150 150 
##$DP07= 0
##$DPNAME0= <>
##$DPNAME1= <>
##$DPNAME2= <>
##$DPNAME3= <>
##$DPNAME4= <>
##$DPNAME5= <>
##$DPNAME6= <>
##$DPNAME7= <>
##$DPOAL= (0..7)
0.5 0.5 0.5 0.5 0.5 0.5 0.5 0.5 
##$DPOFFS= (0..7)
0 0 0 0 0 0 0 0 
##$DQDMODE= 0
##$DR= 18
##$DS= 0
##$DSLIST= <SSSSSSSSSSSSSSS>
$$ [...]
##$SUBNAM2= <"">
##$SUBNAM3= <"">
##$SUBNAM4= <"">
##$SUBNAM5= <"">
##$SUBNAM6= <"">
##$SUBNAM7= <"">
##$SUBNAM8= <"">
##$SUBNAM9= <"">
##$SW= 18.0517287032376
##$SWIBOX= (0..15)
0 0 2 0 0 0 0 0 0 0 0 0 0 0 0 0 
##$SW_h= 3612.71676300578
##$TD= 16384
##$TD0= 1
##$TE= 0
##$TE2= 300
##$TE3= 300
##$TEG= 300
##$TL= (0..7)
0 120 120 120 120 120 120 120 
##$TP= (0..7)
150 150 150 150 150 150 150 150 
##$TP07= 0
##$TPNAME0= <>
##$TPNAME1= <>
##$TPNAME2= <>
##$TPNAME3= <>
##$TPNAME4= <>
##$TPNAME5= <>
##$TPNAME6= <>
##$TPNAME7= <>
##$TPOAL= (0..7)
0.5 0.5 0.5 0.5 0.5 0.5 0.5 0.5 
##$TPOFFS= (0..7)
0 0 0 0 0 0 0 0 
##$TUNHIN= 0
##$TUNHOUT= 0
##$TUNXOUT= 0
##$USERA1= <user>
##$USERA2= <user>
##$USERA3= <user>
##$USERA4= <user>
##$USERA5= <user>
##$V9= 5
##$VALIST= <valist>
##$VCLIST= <CCCCCCCCCCCCCCC>
##$VD= 0
##$VDLIST= <DDDDDDDDDDDDDDD>
##$VPLIST= <PPPPPPPPPPPPPPP>
##$VTLIST= <TTTTTTTTTTTTTTT>
##$WBST= 1024
##$WBSW= 4
##$XGAIN= (0..3)
0 0 0 0 
##$XL= 0
##$YL= 0
##$YMAX_a= 105196
##$YMIN_a= -171379
##$ZGOPTNS= <>
##$ZL1= 120
##$ZL2= 120
##$ZL3= 120
##$ZL4= 120
##$ABSF1= 10
##$ABSF2= 0
##$ABSG= 5
##$ABSL= 3
##$ALPHA= 0
##$AQORDER= 0
##$ASSFAC= 0
##$ASSFACI= 0
##$ASSFACX= 0
##$ASSWID= 0
##$AUNMP= <proc_1d>
##$AZFE= 0.1
##$AZFW= 0.1
##$BCFW= 1
##$BC_mod= 2
##$BYTORDP= 1
##$COROFFS= 0
##$CY= 11.3945322036743
##$DATMOD= 1
##$DC= 2
##$DFILT= <>
##$DTYPP= 0
##$F1P= 2.36226072786647
##$F2P= -0.459571619588291
##$FCOR= 0.5
##$FTSIZE= 0
##$FT_mod= 4
##$GAMMA= 1
##$GB= 0.15
##$INTBC= 1
##$INTSCL= 1
##$ISEN= 128
##$LB= 0.24
##$LEV0= 0
##$LPBIN= 0
##$MAXI= 10000
##$MC2= 0
##$MEAN= 0
##$ME_mod= 0
##$MI= 1.114404
##$NCOEF= 0
##$NC_proc= 0
##$NLEV= 6
##$NOISF1= 3.799351
##$NOISF2= 2.8
##$NSP= 1
##$NTH_PI= 0
##$NZP= 0
##$OFFSET= 15.70392
##$PC= 1
##$PHC0= -15511.39
##$PHC1= 11.40081
##$PH_mod= 1
##$PKNL= yes
##$PPARMOD= 0
##$PSCAL= 0
##$PSIGN= 0
##$REVERSE= no
##$SF= 200.130013532006
##$SI= 16384
##$SIGF1= 3
##$SIGF2= 2
##$SINO= 400
##$SIOLD= 16384
##$SREGLST= <1H.CDCl3>
##$SSB= 0
##$STSI= 0
##$STSR= 0
##$SW_p= 3612.71676300578
##$SYMM= 0
##$S_DEV= 0
##$TDeff= 0
##$TDoff= 0
##$TI= <>
##$TILT= no
##$TM1= 0
##$TM2= 0
##$TOPLEV= 0
##$USERP1= <user>
##$USERP2= <user>
##$USERP3= <user>
##$USERP4= <user>
##$USERP5= <user>
##$WDW= 1
##$XDIM= 8192
##$YMAX_p= 0
##$YMIN_p= 0
$$ End of Bruker specific parameters
$$ ---------------------------------
##NTUPLES= NMR FID
##VAR_NAME=  TIME,          FID/REAL,        FID/IMAG
##SYMBOL=    X,             R,               I
##VAR_TYPE=  INDEPENDENT,   DEPENDENT,       DEPENDENT
##VAR_FORM=  AFFN,          ASDF,            ASDF
##VAR_DIM=   8192,          8192,            8192
##UNITS=     SECONDS,       ARBITRARY UNITS, ARBITRARY UNITS
##FACTOR=    0.0002768,     1,               1
##FIRST=     0,             0,               0
##LAST=      2.2672688,     0,               0
##MIN=       0,             -171379,         0
##MAX=       2.2672688,     105196,          0
$$ Real data points
##PAGE= N=1
##DATA TABLE= (X++(R..R)), XYDATA
$$ [...]
1796F17L94j604P53O23j412Q8J122j023l01J400r53r87J419q1j299J523J06j505
1814a120J107P24j298M28J027j215J15J423r47l76J040p52m56R03n31o74J303
1831G01m85q00P30J9q56P22L41q93M78M51j103J28J080r34j12J330o20n41Q00
1850D36n44n19J135Pj134J157L68j456O73J28m41n4P69p26O5P33j085j34J338
1869G16m91p26J035k41j000M88L11p57N73Q39j360M22Q01n33p62J199n29m69J200
1888G16n21m64O54j93q03Q52L40n69LQ21r62p5M90o59J20N83l04o41R79n03o64
1909h00R08km84N21L14r14O76O6r75O85J227j287J07J164r46n79P57l65k47Q89
1929G15n48p60Q03L59j488N77N36p69J61O71r30k40J205o63j67J159m39p91J081
$$ y = [617, 1011, -593, 160, 783, -629, -541, 581, -442, -743, 657, -296, -1283, 136, 55, -1244, 279, 385, -1120, -13, 711, -587, -159, 868, -347, -232, 1191, 244, -132, 908, 156, -300, 603, 72, -602, 701, 216, -584, 146, 165, -691, 31, 372, -521, -43, 408, -695, -567, 513, -421, -533, 797, 177, -364, 436, -108, -627, 508, 515, -619, 538, 906, -550, 123, 251, -190, -244, 525, -201, -136, 597, -488, -622, 716, 225, -501, 534, 293, -707, -219, 92, -665, -92, 747, -613, -191, 610, 77, -685, 514, -15, -484, 716, 195, -269, 385, 192, -611, 241, 581, 12, 15, 836, -126, -201, 289, -370, -250, 333, 29, -612, 367, -136, -800, 108, 106, -378, 143, 457, -457, 219, 285, -690, -5, 1222, -65, 42, 1206, 260, -319, 438, 73, -174, 715, 167, -593, 210, 569, -919, -342, 194, -575, -414, 257, -673, -913, 292, -371, -538, 621, 182, -609, 472]
1948D72M6j086P38K57q43R84K32j064L74R27j305j33J227r33l98P98o88m15J215
1967D05q13q05J653k65r20Q69L04q85K83P20o96K52O14q44J42Q86r99m38J559
1986A022n48q76P36k56o48R63j91j065R62J95r02K08N50o30j3P04m37r6J078r02
2006a46k64J175l95j060J639k25q75N09L96j089M87L99q17K81O74j336M34P97
2024E84p53k57Q10l21p01J000j85r34R46o8o02O24J46m57K15M19p87R9Q94p93
2044a21j25P02n24j90P06j71q38P76k44k21L14Kn95O15Kl78J3N25m71J10M22n54
2066b45N1M30j90m76M94j25k69N62J0o69K85M37k32J00j01k78L35k0m5nR7j14
2088C2k19K98j07j43j6J13o6p5R3J05R0j88j87L09L22l46m04N06K2k50J75K97
$$ y = [472, 518, -568, 170, 427, -416, 568, 800, -264, 110, 1037, -268, -401, 826, -107, -505, 293, -395, -810, 405, -408, -1213, 440, 175, -745, 124, 428, -457, -174, 546, -150, 102, 716, -128, 14, 900, -99, -537, 1022, 474, -402, 334, 78, -570, 393, 202, -863, 99, 294, -608, -400, 150, -480, -493, 211, -226, -322, 756, -146, -410, 765, 370, -690, 949, 724, -151, 358, 754, -335, 152, 551, -266, 15, 689, -647, -213, 584, -169, -426, 384, 63, -638, 362, 177, -757, 189, 121, -481, 143, 289, -168, 47, 466, -321, -222, 672, -121, -246, 456, -68, -258, 448, 277, -561, 215, -29, -250, 64, 66, -529, 86, 88, -290, -277, 248, -223, -113, 309, -245, -194, 236, 46, -430, 64, -61, -330, 232, 242, -427, -142, 295, 63, 163, 62, -216, 119, 99, 54, 49, 146, 32, -187, 111, 4, -139, -155, -42, -108, -183, -90, 15, 105, -83, -270, 39, 361, 15, -389, 117, 139, -111, 64, 361]
2110C61j22p2J76m3l77K91r0j50J2j69J00K85k52l60K32K81l63o2J18r3P6M09
2132A88j70j71N23J4m80L52Oj43L97J65o48Q6N05o15M4L89p92j54Q58l77n61N94
2154A0j79n05N66K6n60O04L12q74M13M34n46M20M66o92n3O05l02q1N65n54m84
2175d09Q37j32n98N23J02p82N21q1o11N30K55j161P82N24o31k95R40m67k02N44
2195A89k79k69O65O1o97O24P3k95K65K32p56L10M24r76J97Q78j140K3J079p71
2215a63k64M94k10k31N88k99p05J025J93j042M49M07q64N25N87p82N31N25j056
2234b92J36Q97n48m15R78o64o43Q81K23j068Q01j6o81M61N19q49N4N99p19j75
2254e21R15o45k18P91o52k18P96j52l77N77O2n99O08m8o50N26J37n52L09N76p22
$$ y = [361, 239, 167, 343, 300, -77, 214, 124, -26, -14, -183, -83, 202, -50, -410, -178, 103, -260, -322, -204, -297, -221, 188, 18, -153, 370, 384, -96, 256, 262, 119, 516, 681, 33, 119, 624, 9, 53, 442, -350, -504, 354, -23, -584, 10, -169, -674, -108, -82, -642, -38, 274, -600, -187, 247, -299, 121, 587, -105, -158, 447, 145, 64, 629, 75, -409, 428, 296, -302, 221, 323, -459, 62, -19, -630, -100, 155, -1006, -224, 300, -331, -626, 314, -153, -355, 189, -90, -359, 306, 367, -330, 294, 367, 72, 337, 569, -187, 123, 547, -429, -232, 646, -494, -471, 608, -163, -427, 67, -143, -374, 214, -85, -790, 235, 428, -614, -165, 242, -622, -97, 490, -292, 239, 764, -292, -156, 741, 193, -222, 756, 92, -551, 330, 553, -515, 286, 270, -411, 50, 569, -280, -226, 373, -346, -521, 394, -251, -469, 322, -330, -548, 248, 96, -281, 296, 358, -241, 367, 319, -331, 195, 332, -220, 89, 665, -57]
2275e7j87N42n40j49O60k40n10J043o60m30K46L78o15M07L37p09L32M14n08N5
2295a91N43l90k8M97l82n9K57k06k01K57J99n31Q1M43p38L31L13l57o6N3k2j88
2317c85M64m41N9M71j83j86N52n18K14R0P8m33M58J23k03P7K13n66J03K26l83
2338a70J05L70k42o11N50r0k80R0M68o75L90J13j71j04Q44k13l44K66j29p4K68
2359C61J69q58N25K63o25J15Q0p0k45M63n35K36J42j55j55L32k14k74M59L48o01
2380b39M18J50l73J04K21l04KL39l5k96M96p43O1N32l81j56K88R7l62K45j20j67
2402b23L42l1o21K97N15m33M9L04l54k44O53k55k51O68j80l36K99J07l76J19M10
2423D59n66M0J76j15P1J49l2j97M46m68p3J6m9J11P2R6l54K99j53l42M66J90k47
$$ y = [-57, -244, 298, -242, -391, 269, 29, -481, 562, -98, -528, -282, 96, -519, -112, 225, -484, -152, 262, -246, -191, 352, -38, -66, 431, 49, -10, 247, 41, -160, 97, 296, -235, -154, 289, -449, -118, 195, -162, -228, -175, -197, -385, 79, -362, -303, 168, -15, -201, 351, -167, 47, 137, 215, -218, 240, 363, 160, 237, 450, -116, -13, 213, -170, -65, 305, 63, -548, 2, -88, -368, -278, 190, -485, -95, 18, -153, -257, 587, 374, 30, 296, 167, 93, 361, 530, -328, 197, 460, -165, -50, 30, -40, -285, 178, -357, -121, 21, -134, -289, 43, -171, -445, 14, 362, -239, 179, 329, -44, 60, 281, -23, -21, 318, 283, -13, 483, -260, -199, 333, -48, -204, 84, 181, -181, 64, -56, -223, 119, 88, -533, -236, 279, -154, -105, 199, -155, -399, 254, -1, -252, 416, 236, -100, 199, 306, -70, 49, 459, -107, -67, 109, -6, 65, 214, 182, -15, 431, -37, -110, -94, -143, -32, 40, 136, -218, 81, -72, -414, 52, 242, -5]
2446eK48J3n79K31K62j68K17K4k96l7L75k29k62M96r9j72J97N9m39L26J65l51
2468b4l40L36M3o7J24j15p8K92k21m2J95J21m13L01M8l48M21j5l05j11L68j34
2490C6j14M20l70k85K19q9n9J4J82m48K85J03q8L5P9k37N1N9M34k83j8K60l44
2513a58N30j03k70J92J36j85J09J26l09N6l1q8l6R0j01k78L26j26k76K85jj90
2535c02K50J10k28j89L58j78J91J52l61J45N2J32q6K52k04J05J80N7n17J52j78
2556a07L8J40lk40J09M6l11l0L48k80m4N36k49l86M36K71m14L0M76k26M8O7l08
2579e3L32j04j68L3J25k52O6L12l51j22K14J77o09L86J36n40K59J00k39J34M52
2600B88l75k3M28n70O1L44k03j40M08j44l18M34k49j51L69m3o23P04m3o01M34
$$ y = [-5, 243, 256, -323, -92, 170, 2, 219, 243, -53, -90, 285, 56, -206, 290, 191, 19, 216, 275, -164, 162, 327, -24, -364, -28, 15, -52, 72, -43, -121, 171, -50, -92, 103, 224, -189, 112, 160, -188, 233, 218, -87, -198, 170, 36, -78, 342, -28, -313, -94, -183, -242, -228, -46, -494, -209, -106, -194, -159, -80, -317, -266, -207, 227, -56, -74, 186, -158, 372, 269, -1, 191, 327, 142, 251, 377, 68, 124, 93, 5, -31, 59, -42, -320, 6, -120, -396, -111, -112, -302, -52, 58, -170, -359, -1, -179, 12, 164, -197, -52, 0, 132, 46, 298, 94, 199, 379, 436, -81, 71, -107, -69, 71, 68, -172, -63, -17, -328, -358, -10, -290, -334, 202, -47, -433, 3, 274, -140, -110, 366, 140, 188, 255, -53, 279, 175, 7, 40, 165, -87, -21, 291, -60, -182, 32, 209, -400, -14, 122, -418, -159, -59, -298, -164, 288, -87, -110, 318, -252, -191, 153, -50, -190, 218, 74, -244, 190, -59, -210, 159, 116, -507, 197, 154, -447, -13]
2621a3O12q40J17M91l13j27M22j49q06Q94l22l48K68K09l21L03K02n96K86J42
2641A11l00L26O8j20k16M29k54O0K51j1n88L92p3k48R1J66n20O85l36l39K19L77
2663A70l05k35N46o05J99O35m16j66N20l41l84N37L8k37QN10q59L12L15l90l1
2684a79M76l37m72P13l55O9J83k94l3K85l43j08M80J26k16j15M25n40M8L67K4
2705B04o2K69m10j70L30l03J61J81k23j21L27k06l42K75J03m30K03K60m04L04
2725e4J14l46J71M00l32r5K80m8o5J72P3k39K35r6l05R1J17m1J35k92J01q0N1
2748e3j00j27K55l1l20K36O5J0J03j19KJ11j1n6K06n9J93l11n8L12l46K48n8j93
2772a01K09j19J8J28k57J05p4K15j84n7K4k48L10k9J4j12Q1jj17L9M3K75q6J76
$$ y = [-13, 599, -241, -124, 367, 54, -73, 349, 200, -606, 288, -34, -382, -114, 95, -226, 77, 279, -317, -31, 111, -189, 137, 205, 85, -131, 298, 44, 104, 355, 344, -244, 148, 75, -173, -82, 84, -436, 249, -87, -426, -207, 170, -135, -370, 176, -429, -230, 405, -11, -177, 343, 2, -382, 155, 193, -44, -36, 474, -385, -73, 242, -148, -179, 297, -40, -512, 201, -154, -85, 98, -196, -229, 56, -287, -395, 85, 211, -5, -120, 305, -235, -187, 180, 204, 142, 411, 1, -169, 161, -142, 19, 200, -23, -144, 183, -23, -365, -90, 13, -417, -214, 46, -358, -54, 60, -286, -115, 285, -47, -142, 138, 90, 25, 197, 270, 31, 266, 170, -135, -44, 73, 32, 167, -125, -24, -104, -53, -153, -280, -25, -56, -376, -140, -75, -65, 38, -81, -79, 32, 21, -35, 171, 112, 305, -6, -64, 248, -98, 150, 92, -101, 108, -11, 7, 135, -122, -17, -91, 124, -60, -117, -93, -341, -31, -60, -46, -158, -77, -78, -195, -156, -113, 162, 76, 252]
2796B52k72k02L93l0r4k4j40K11L4Pl01K27j49j75M64m16J8N0K42j64j29R3j59
2819b64J22J94L2k78O08k95j12J0M7j12J17p6JJ77K67m40j2J0J94j20K27k46k54
2842b03L64j04l74M25j82o8j45J36j60J80J05m98P30k02k11K16J71l86pL11L7
2863A35k36J95R3l85M57%l67Q5J61l07R9K23n10PL17j99j04L04n9n8K59j66j19
2886a75J97l5k53L91J60l88M09l23Q0N1K22k07k1L26l65k77K70K4k48J33O0j37
2908a06J08q4j9nJ34j33pJ65j59J3j5j72K74P8J46j6J09j97J48M2r3l32l0J13
2932c8o0J51l5p1j10J42l29j7M18L6k81K05j29J05P1O2k3o4j48J22J98Nn0R9n0
2957B09l2l13J00p1Q4K70l97J56r8K15l11K94Q6k36j7M2j01J13J61m59M5L11N0
$$ y = [252, -20, -222, 171, 141, 47, 23, -117, 94, 128, 135, -166, 61, -88, -263, 201, -215, -197, -147, 95, -69, -198, -105, -264, -142, 52, 84, -194, 414, 119, 7, 17, 64, -48, 69, -7, -6, 171, 438, -2, -14, -4, 190, 70, 297, 51, -203, 161, 57, -317, 108, -74, -142, -287, -151, -311, -131, -26, -524, 206, 4, -207, 9, 180, -206, -213, 98, 135, -101, 94, 187, -198, 259, 259, -108, -23, 138, -169, -70, 153, -357, -350, -33, -232, -336, -32, -91, -149, 110, -56, -175, 22, -13, -266, 125, 285, -103, 306, -17, 63, 114, 336, 129, 108, 434, 69, -208, 62, 86, -162, -29, 31, -106, 2, -82, -101, -106, 28, -105, -112, 53, -106, -93, -108, -280, -6, 72, 218, 202, 311, 114, 262, 304, 211, -121, -151, -38, -98, 53, 18, -53, -163, -21, -350, -367, 51, 87, -194, 11, -118, -13, 58, 120, 97, 33, -115, 7, 205, 210, 160, 259, 209, 177, -136, -36, -107, -23, 247, -150, 6, -92, 123, -188, 106, 192, -44, -61, -19, -120, -7, 154, -305, -260, 51, 101]
2980A01j51O4J00j57m7J22l3J5L56o42K72K13j33l09K41P3j59J11L3nJ91k94O0
3003B2M9j89r2L6L03m51K39K63l23J01J73k91J17J69j81J46j22J4j37J59K10k66
3025e1K68j50l44J34L56m77L93J70o47L15Q9l13R7K59j97L8J02J7k55K19L7l28
3047b68M85J8l71M1L59k36J3J34j55O8K45k85j92K72k65P9K59Pn46K39K54k48
3069i3k58N03k40J39P5m38K47L21j61k55L25K2j31N6j73J4K04J83k96K51l15L7
3091A7o1L7p0j66L27l34Qj10N17j45J48q0l52L16k7j45K56Q2n12L08j29K4J36
3114D5K60j44r2J50l08M4J5J01l18O5L66n37K26J8q5J94lJ42l80L55l35L43m9
3137G3k75L0L43J0k54L80n9l35K39l86K66mK73l97J43N6j90K31n4k11M1J70k35
$$ y = [101, -50, 14, 114, -43, -90, 32, -1, 14, 370, -272, 0, 213, 80, -229, 12, 85, -74, 37, 70, 65, 256, -38, 22, 71, -118, -210, -174, 129, -322, -83, 180, -143, -42, 131, -160, -43, 126, -55, 91, -31, -17, -154, 5, 215, -51, 217, 67, -277, -143, 213, -264, 129, 299, -348, -33, 56, -257, -160, 99, -98, -60, 42, 59, -196, 23, 60, -268, 217, 235, -136, -95, 264, 28, 41, 175, 20, 88, 333, 48, -144, 128, -137, -58, 201, 208, -338, -99, 155, -93, -351, 152, -88, 51, 126, -312, -65, 256, 95, -160, 165, 187, 56, 112, -61, -47, 157, 340, 44, 295, -20, 17, -44, -7, -77, -243, 84, -250, -242, -352, 165, 20, 168, 88, -264, 52, 25, -120, 136, 218, -294, 14, -115, -91, 45, 305, 161, 69, 219, -89, -45, -30, 71, -247, -182, 184, -353, -127, -109, -194, 0, -3, 139, -241, 114, -221, 122, 73, -202, -172, 171, 181, -73, 307, 248, -87, 152, -234, 32, 28, 301, -96, 47, 103, -87, 144, 90, -121, -80, 90, -145]
3160a45J28O1k15K27L5Rk18M9RK26j56j7k27M49k80J04J51l48L46j75M6J62j19
3183A02k67K93j05j10j07J69J56n0o9j89K56j69J41n5j2K7M5J07j05J34j46j14
3205f8j07L30K41j80l9k55J10m2P4j44K71J8k2l27J03n4oN3L1j49J69N3j30K19
3229A49k48q9L28o6k14J44J60j04P1N3lj70K29j32r5Q3n6k19K88p5r5k5m1L7J2
3254g8q7P8K32j15j58J3j21J38j9L08l74K8N37k58j38L80l50QK27r6l26L64n6
3277A37l57R3J37j17K85k00k14J85J17l09J23k7J64k96K48O2j94K96j2k02K61
3298A80K91o29K14qN8J1R9j19k45L11k43Q6J91l80n3J82J65p8M9j79M9k5J10k28
3322a91K3M02k99K5K68k87J60K04j47j14M7J13k53J46n3k14K89J9j78K58l4l07
$$ y = [-145, -17, 44, -171, 56, 91, 100, -118, -69, -60, 166, 10, -7, -234, 215, -65, 39, 190, -158, 188, 13, 59, 221, 102, -165, 128, 23, -87, -194, -25, 131, 81, 12, -177, 79, -90, 51, -4, -16, 11, 56, 163, 58, 192, 46, -68, -175, 155, 396, 216, 177, -78, 32, -10, 64, -80, 191, 209, 187, -140, -37, -91, -97, -44, -13, -162, 7, 60, -70, 149, -99, -188, 140, 74, -140, 4, 164, 60, 131, 184, 181, 11, 240, 108, 13, 96, 40, -179, 109, 34, -61, -86, -127, -90, -78, -165, -87, 145, 30, -128, -115, -236, -98, -117, 191, -183, -155, 382, 124, -14, 366, 16, 24, 251, 155, -171, 193, 137, -220, -127, 10, -107, 178, -22, -236, -51, 66, -243, -120, -147, 17, -279, -31, 31, -163, 133, 121, -81, 180, 471, -158, 56, 48, 106, 117, 216, 97, -148, 163, -80, 6, 197, -183, -236, -54, 111, 33, 82, -97, -48, -73, 37, -191, -168, 234, -65, -40, 228, -59, 101, 305, 158, 44, 91, 204, -49, 97, 44, -170, 119, 138, -40, 218, 184, -123]
3344a23p8L3o5K1M03l25j70L19j49r4L24J75m04L02j46p4M24n0m07L05k7j60R1
3367A25m1j78r5K15q0J08O5j14kQ6j74p5lJJ52J03j35J07J59k20k86K69J06k75
3391a82j10L11mj9n5K85k18j04L15k11O4M6k05k38M34p9n6K9j24k5Q8j14j11L02
3415A9l9J2k34L21q8k54J59l1J58k4j30k58O90j01l8K2l46J13J68j3k64J22J59
3438A23l90L86P4o89K96K01p3j79J84j68KL07q7p7K04j68K54k50k76L65o7J34
3460A06j06j77N03k39O7J59n2l82J59j77j13J18L0qJ52j3k07p2K36l47L12K44
3482A93M2j14l63M71l58J60j68K40Or5o%P8j54Q3K23k66j22R9j74K15j77K11J66
3506A90m09P5J50J31k36po5K93k17J71j12L1mr5Jr6K61j57J83Q4j85j43K18o0
$$ y = [-123, -201, -168, -233, -212, 191, -134, -304, 15, -134, -228, 96, 271, -133, 169, 23, -51, 373, 323, -84, 221, 194, 34, 125, 84, -94, -189, 26, -54, 54, 119, 5, 3, 89, -85, -160, -163, -162, -10, 93, -42, 65, 224, 4, -282, -13, 93, -182, -292, 19, 15, -4, -59, 226, 8, -96, 219, 8, 72, 118, -87, -325, 109, 30, -26, 3, -121, -146, -58, -172, -283, 19, -20, -8, -242, 79, -9, -263, -104, -135, 23, -1, -131, -389, 301, 200, 162, 184, -162, -49, 119, 106, -158, -36, 123, -267, 119, 193, -496, -200, 1, -72, -251, -67, -235, -233, 74, -13, -90, 114, -54, 200, -50, -326, 39, -28, 106, 0, -177, 326, 87, 154, 313, 261, -121, 38, -139, -252, -134, -104, -112, 40, 27, -180, -252, -16, -363, -51, 193, 235, 121, -242, 229, -129, 31, -137, 103, 109, 14, 8, 8, 86, -68, 15, 238, -28, -150, -51, -225, -10, -187, 24, 190, -219, -144, 6, 137, -99, -106, -171, 122, -95, 76, -36, -5, -9, -104, -103, -199, 62, -95, 88, 172, -13, -156, 62, 2]
3530Bk98L72j01k83K56n1P9j43K57k75j25P71o33L76o1l51K32K29k44K5K84r6
3552B22k79J95j79P4j26K27j45q6R1k53J86J43k33K84j75k37R3L33j36n3q5Q1
3574e8q8R3J06j0M8j13j32L39j70j35K04k9J10k99L58l04J69j9j51J8M7o3j7j65
3598b61J75J21o7R5k59J18M9J08J59n16K91j89N12j82k89K69K88l80o8K09k41
3619e8J67J09k23O6J15o5j54J04k63p6L34j81J05k01K86r0j04m1%J58J55K3l65
3642a99J27J00l3O5K16k15M3J24k46K6K35j18n9j18Rq1M1O1o3r1k2J25J36o3l55
3667c55M61r6r2L08j04j5j04K48n7j70N1l3o0P6r8K07K20j75k91J14k04K36j4
3690E3p5k3l5j4l00L79k2j41J22J37n3PK53j43j27J2M0l6J2J32k19J20J23k36
$$ y = [2, -296, 76, -25, -308, -52, -103, -24, -167, 90, -185, -310, 461, -172, 204, 143, -208, 24, 253, 9, 34, 318, 222, -57, 138, -41, 33, -93, 134, -11, -97, -6, -259, -73, 70, -163, 121, -54, -291, -198, 135, -1, -54, -139, -58, -146, -53, 53, 43, 91, -22, -154, 185, 15, -120, 84, 55, 165, -134, 224, -80, 89, 70, -81, -63, -16, -79, -96, -261, -86, 35, -32, 63, -196, -78, -29, 79, 238, -278, 13, -176, 336, 154, -135, 134, 422, 42, -26, 183, -58, 109, 218, -5, 61, 176, 111, -43, 61, -202, -278, 56, -125, -20, -221, 65, -25, -129, -170, -170, -12, 143, 166, -199, -72, 28, -5, 60, 276, 61, 104, 228, -18, 8, 243, 125, 66, -52, -43, -124, -83, -22, -85, -176, -198, -73, 63, 0, -355, 106, 10, -82, 226, 122, 107, 3, 251, 194, 24, 75, 42, -18, 58, -40, 167, 387, 212, -79, 35, -169, 67, 53, -22, -45, -80, -94, -394, -15, -37, -178, -56, 81, 28, 35, 288, 145, 18, 30, 70, 34, 46, 178, -41, 79, 202, -34]
3714c4q4M52k73j00J39l35K36j14q9M0j29J08N8K54r9j08J42N4j54P5k29j7K83
3737G6j52k1J7L92m03K21K20j13j80K0J38l88K41K62n27J61L45o05J54M46n79
3758b75J30M75k64mk87K08p0R1j49L9P8k2P1k07J57k3N5J90l70K36m8j44L79j08
3782A38n0j35Q5n9j22J35J17r3j33o3L08j01k32K90k57J30p3M9O7R1P9j39Q4k07
3806i1J48J36j9K4j10j68K60j95N9l4k1J51o3Nj15m76L30J2j88J99J16K30m33
3829b43L00j09j4r6L33k16J6L67l21k33QK88J29j65j98J22k8nJ35l4k30K94j04
3852dk00K95k95o1J65L29k08r3J33j91J70r9J02k01R8l2K96j43L18m82J92n6p4
3875d1OL29k23k48K02R1k26L7O9j15o0J98J0j03N5qK17j55p5J10k7J07j27K67
$$ y = [-34, -118, 334, 61, -39, 100, -235, 1, -113, -202, -162, -291, -183, -125, 129, 30, -78, 64, 118, -36, 39, -190, -207, 76, -76, -97, -80, 312, -91, 130, 350, 237, 57, 77, 215, -173, 68, 330, -197, -36, 309, -296, -142, 304, -275, -145, 330, 66, 62, -225, -17, -87, 4, -145, -106, -28, -50, 21, -186, -29, -52, 3, 193, -177, 59, 11, -133, 246, 138, 88, -47, 38, -21, -143, -8, 109, 16, -117, -180, 128, 27, -205, 85, -172, -42, -115, -66, 1, 92, 171, 32, 116, -91, 57, 193, 174, 198, 88, -80, 180, -15, 44, 10, -11, 140, 77, 82, -33, -509, -179, -167, -355, -156, -40, 190, -243, 57, -52, -66, -162, 171, -45, -29, 338, 17, -216, -208, 80, 209, 44, -154, -32, -60, -65, 70, 36, -194, 100, -4, -204, 91, -204, -265, -100, 229, 21, -72, 61, -130, 40, -59, 43, -158, -60, -92, 204, 61, 379, -103, 89, 33, -41, -35, 294, 71, -177, 25, 116, -110, -73, -4, -119, -179, 19, 29, -74, -19, -27, 190, 35, -40, 70, 43, 150, 23, 290]
3899B90q0l13L07K9n04L84k46r5L56J35k28k39O3J18j22J88m9n0P8j99M2O6j56
3922b25M6K26j01l7J85J49m37Q9M05l02J09j68K97k70p5J1J16K9N9n0r9J03j24
3945f4Q9K0o1l5R4j09R6R8k19J51q8k01j05L07K3p2L34k29m5J38m2j46j15J73
3969hJ66k24O9l1n7M34m82K47p0j27J1Q3O1k39p7J94k97L66Q3j32R7K14r0j78
3993A3r8N9J01j11L19l22J7j10R8Q2j12J47j02L5k70K40J39r2j87J18k1j74J55
4016g6J01j42J34P0q0k3K65l34K60n9j09K66l46J99k18K42l8j6M5l57J13j0K00
4039H7k50N9K51m10J46J90j00K2K84j25k68M42m74P1K31nj66j25K12j42J67kk14
4062a19Q7J37l3L47k56k49J1Q6j42l2M62k82K1N6m9k41J80K0J35MM2o4k02J68
$$ y = [290, 210, -103, 204, 233, -271, 113, -133, -228, 128, 263, 35, -204, -141, -23, -145, 43, -6, -56, 22, -177, -135, -69, -225, -179, 47, -54, -91, 94, 243, -194, -105, 300, -2, 107, -61, 236, -34, -109, -98, 18, 47, 106, 56, -43, 60, -64, 25, 45, -16, -51, 43, -66, 30, 128, -91, 60, -28, -229, -334, -27, -4, -76, 258, 29, -16, 122, 80, -66, -181, -8, 158, -66, 3, -28, -85, 349, -133, 114, 44, -83, -72, 11, 72, -167, -244, -50, -347, 19, 102, -30, 67, 281, 191, 13, -85, -26, 75, -36, 283, -39, -22, -132, -34, 48, -64, 83, -19, 16, -254, -14, 125, 33, -154, -36, -57, -231, -76, 25, -117, 17, 87, 7, -16, 249, -85, 175, 116, 7, 273, -73, 126, -92, 150, 112, 96, 141, -216, -103, -113, 87, -163, -104, 147, -263, -117, 73, -27, -5, 279, 154, -114, 328, -146, -75, 156, 151, -15, -140, 72, -70, 97, 95, -119, -32, 105, 72, 419, 163, -86, -75, 11, -131, -163, 299, 17, 38, 94, 45, -196, -16, 4, 139, 143, 185, 121, -81, 87]
4086H7K00o5l2k59J05J92j37j19J85K00m58K9r2J09J44o2k62K61j17J94q0m1N8
4109D0k99L58L7j4Mk65K26j96K03K7j14R6l75L48k3k14L77l50k1M43m3k18N1j99
4133a21R8m2K02l28L9L24j40L1l33J09K91j27R9J33k18K6j26K10j17J38l61K92
4155G9r1N2K74j71k39J10j42L56o00M68j26o6l1m9J10J15J03j88J58j47J88k20
4177e7O3q8M67k94k85L15J1m0j4j51L7o0J12J01r3O0k84N0j3M11o4k32P2J25O8
4202B17k8k68J23J08k50L44k10nm5J03k99M00M0k53n3K19q8M9k10P1J43l36K68
4225D0j90j7J70pp3J04k30Q1R7j31M6L10j04j79J40M6k35Q3L87k62j96J07L5J12
4249A34oJ51j98j47L3k43L56j15j71J39j41n9K97m8J10m4k20L96j19Q5j68J36
$$ y = [87, 287, 222, 190, -69, 36, 228, 91, -28, 157, 357, -101, -72, -164, -55, 89, 27, -235, 26, -91, 103, 23, -18, 40, -259, 99, 136, 122, 126, -139, 87, -109, 94, 121, 7, 103, -272, 76, 53, -161, 216, -134, -155, 288, 245, 27, 78, -121, -23, -65, 137, -191, -152, 172, 32, 63, -270, -161, 130, 3, 102, 235, 17, 43, -83, 127, 10, 148, -213, 79, -12, 40, 314, 143, -96, 14, -128, 228, -372, 96, -30, -96, -127, -176, -66, 49, 152, -36, 122, -25, 163, -57, 6, -82, 385, 91, -194, 121, 132, 92, 78, -73, -36, -96, 16, 117, 24, 84, -200, -150, -163, 248, 184, -48, 24, 149, 217, 189, -79, 44, 152, -98, 246, 36, 31, -14, 89, -210, 190, 230, -23, -76, 143, 55, 104, -106, -35, 108, -228, 40, -150, -167, 3, -4, -77, 27, -203, -122, -25, -156, -110, 200, 96, -83, 57, 103, -132, -49, 338, 76, -120, -13, 22, 134, 128, 279, 81, -66, -33, -276, 80, -35, -206, -67, -208, -267, 30, -18, 92, 48, -172, 224, 105, 190, 22, 158]
4271A58j72K09j30k58J34J43k72L69m7k79j09K11K1N1o4l1O8j61K25L2n4j64J69
4294D9J30k41L6O0k82J97J16k9Q7o4J08k70L71k30Q7M2k16P7k4L5O1m92M01PJ2
4319B8J07l72K48q8j63P2l7L21J5j00j24O7J66j81r9K01j2k01M46k55j08r5N64
4342D00o20J59J07kR6q9j3J50j7j02j25J1L26m67J33O4j02J78m3q6n1J08p6m6
4366a07J86J2k28P1L76l80K76j16j10j74J83m7K69o3q6k8j32M2J58j77m5M1on3
4390a38K42j01l7J79Rj07J14k01K84k17k58K85o1K33l90J50j19L38j78j40J55
4411D2J08k16J68k67J0Q9J36j47J61r4J2K3J07q4l42N38o1l87K63K23l88J60k8
4434B6R7k18L8JR0L6j30J32j39m5J60ml8O2m3J8k08K43p7j32l2L9J15J73j28J48
$$ y = [158, -14, 195, 65, -193, -59, 84, -188, 181, 134, -145, -254, -43, -22, 29, -35, -66, 2, -159, 66, 98, 44, -120, 49, 179, -62, -26, 34, -248, -51, 65, 36, 123, 59, 167, -103, 268, 38, 125, 167, -49, 28, 4, 39, 100, -392, 9, 16, 28, 135, -237, 11, -77, -240, -168, -205, 116, 131, 31, -93, -26, 140, -41, -140, 61, 49, -152, 294, 39, -69, -164, 400, -220, -61, 46, 44, 140, 51, 38, 188, 171, 69, -56, -45, 281, -186, -53, 11, -91, 87, 44, -42, -93, 15, -61, -107, 79, 91, -137, -66, 310, -70, 206, 90, -20, -194, -11, -58, 211, 148, 62, 34, -98, -56, 102, -75, -120, -79, -85, -138, 104, 3, -34, 145, 154, 47, 161, -40, 244, 27, -231, 54, -7, 226, -164, -14, -133, 205, 27, -113, 42, 150, -66, 102, -165, -155, -66, 70, -77, 84, -10, 2, 25, 132, 48, -294, 244, 183, -204, 59, 282, -106, 54, 26, 123, -95, -57, -56, 34, 70, -60, 72, -67, -112, 48, 44, 6, 68, 25, 43, -165, 78, 1, -131, -163, -124, -9, 164, 36, 184]
4460A84q5p2p4l6K89M6k84J34l8j88K03n1J20m40K37j1j81L18q6K78k71j96L42
4483A38j5R3j78k05J56j75L02m5j3Jj16M1l8K41j4m00K97L5j60K00k25j5L49j8
4507B36j61m3j6P9r8j16J11L33j95q1k73K48j21j34K57j73K69j48K8J27r4p5R
4530c1M1j41k06M74k41J84r5m9n2J35j1j15K71k90K74j53j40K41p9n1Q9k82J31
4553i6L61m23K55j37m0K06l1j01R7N7j15Pj70N7n7Q1K37k61J55N7j42m2lPj26
4578a67L05k75J03K01k57J81o0N9lk30L31j9j66M2j49j16J80K83j55J71m52J35
4600e8J69m48M70j36rk02K16q4M9J5j92M35l02J32j63K77j6m49M90j69n3J0J00
4623H2l09J2J4J85q0J51L7k77L32j08j19K22k8l09N3p1J98j96J47l2J50j82M38
$$ y = [184, 99, 27, -47, -83, 206, 252, -32, 102, 64, -124, 79, 28, 148, -292, -55, -66, -247, 71, -15, 263, -8, -204, 138, 123, 216, 38, -167, -11, -186, 116, 71, 58, 59, -57, -16, -54, 187, 173, -227, 70, 105, -55, 145, -80, -95, 254, 236, 75, 32, 16, 95, -3, -119, -8, 325, 130, 49, -224, 24, -97, -231, 26, -147, 122, -26, 2, 129, 35, -40, -31, 10, -131, -337, 137, -104, 80, -15, -64, -116, 19, 8, -107, 164, -126, 148, -5, -145, 96, 17, -34, 55, -227, -96, 265, -158, 97, -40, -80, 126, 95, -6, 91, 148, 33, 40, -130, -73, -130, -49, 188, -73, 82, 139, -3, -45, -48, -41, -167, 138, -137, -34, 167, -90, 91, 31, 90, 87, -143, 188, 169, 3, 45, -104, -220, -40, 243, 88, 259, -193, -58, 111, -337, 133, -3, -12, -214, 2, -82, -33, -18, -210, 225, -77, 55, -108, 169, 153, -296, 194, 25, -28, -18, 82, -227, -215, -201, -16, -96, 55, 92, -185, 147, 39, -80, 142, 114, -195, -142, -213, -15, -211, -64, -96, 54, -128, 310]
4646C10j95J6o9r4oR0J21j73n2P3N0j58J62J5m8k93K62k57K85j37M1m3M9Oj13
4671a58J8J71j35M79j24l41m2k0M35n77J15L03l46J72J48l8J36l12o3M26l95M7
4693a01l1l5J32L5N9j96O8P5O9l3L4k55J61K54l11N7O0J26q0j78nK75j70J4M2
4718F6J50k21O7r2J38k38J06J70j03j09O1%l7J69k68M0J22Q1j6K2j94J30n3lL1
4743A9l0j8K57l99L13j52P5L4P3M0j73j50N2J24j09J24l4r0j7K29r9N1l3k09j32
4768b54L37J3j24P2j34L47l19L7j8J7M0j4R2k5j19r1J53n0OO0jJ1J12j91m6K6
4794f3J37N4J7r5j47K39j86j50K47rL9lJ13Q1k12K0J04p3k02M6j15J45N3k4L7
4819E3K8j86J67kk52P6k59K00J01j8j9Q0L89l41l3j02j8N7K21j07j03n6K84j39
$$ y = [310, 115, 131, 62, -32, -38, 52, 173, 0, -52, 21, 71, -87, 75, 90, 42, -251, 11, -246, 39, -98, -57, -100, -51, -45, -158, -140, 31, -104, 375, 251, -90, -132, -152, 283, -294, -179, 124, -222, -50, 98, 60, 196, -116, -179, 247, -148, -101, -132, -167, -35, 0, 59, -137, -69, 6, 75, 42, 76, -179, -18, 236, -75, -18, 42, 168, 88, -90, -95, 180, 10, 24, 66, 216, -5, 62, -30, 108, -130, -24, 146, 43, -66, -5, -5, -42, 127, -141, -101, 21, 102, 86, 108, -86, 44, -9, -12, 19, -11, -29, 228, -171, 142, -10, 65, 99, 172, 212, 39, -111, -59, 65, -44, 80, 46, -44, -61, 168, 69, 120, 87, -122, -254, 83, 96, -28, 44, -90, 257, -62, -25, -43, -26, 14, 0, 92, 67, -52, -143, 10, -40, -34, 26, 25, 36, 148, -43, -89, -63, 74, 128, 145, 50, -97, 142, -44, -194, 53, 44, 83, 80, 193, 274, 62, 82, 186, 113, -89, -43, -158, -13, 40, 16, 53, 81, -105, 62, 60, -192, -116, -375, -175, -74, -92, -111, -31, 358, 17, -16, -118, -136, -79, 142, 35, -68, -124, 160, 21]
4843B1R0p5o4m6K1J05j5Jk0k00j3L13r0J2j28O2O5O4J0j40J30j18p1J06O6J48
4869B34j73nk25J10n0Q1m1OL46l34K9lM4J20j77J98k28J0QJ81Oj75j6j19K06o8
4895c5J88l42m1L05j70J49j20j30L91m70K23J1N7n1j7Q5j01K42l13n1J72M1r9
4918g6j26J97p7J19R4k77J88q6j0O7r5K47j51o6K87l08J39j36L5Oj72J25J69j17
4942b4N7r9J97j09m1k14J41J17q2J42P2j60L8j60l0O2K99k03Q7j20J07j91j40
4965b54J09L41j62n4k9J70k33p8J32O5j09K4R3k7L27l21k26J67r9k6K05j14L2
4988f7J54k59Q3M40k87J24J09l83J91pJ3k51R2N2q2J25k2j04Q0l0oP6k21K20j83
5013a43o5J22Q3k41K87p4k91K44j91L48j57J76n1O5j88K88k4j29L17l06j11K27
$$ y = [21, 111, 36, -28, -74, -53, 52, 37, 38, 18, -182, -195, 118, 28, 40, -88, -26, 39, 103, 113, -27, 103, -15, -86, 20, 86, 234, 61, 56, -169, -59, -109, -28, -69, -63, 283, -51, -22, -25, 19, 139, -38, 160, -68, -58, -50, 131, 137, -38, -54, -173, 33, -35, 153, -189, -230, 75, -95, 54, -66, -196, 195, -275, -52, -41, 16, -35, -52, 33, -68, 174, -139, -190, -18, 23, -76, -202, -5, -82, 37, 131, -146, 42, -44, -54, 13, -82, 165, 14, -52, 235, -73, 66, -70, -35, -29, -201, -76, 93, -24, 33, -66, 131, 22, -19, -233, -92, 25, -57, 85, 157, -3, 35, -125, -155, -93, 206, 3, 90, -30, 77, -114, -254, -145, 196, 34, -20, -49, 121, -112, -190, -58, 7, -102, -78, 15, -12, 315, -6, -232, -65, -164, -190, 15, -99, -67, 87, -172, -89, 351, 64, 188, 297, -86, 105, 98, 111, -140, -48, 4, -78, 47, 25, -79, 1, -29, -35, 41, -180, 40, -143, -208, -86, -3, -244, 43, -31, -322, -78, -269, 79, -78, 98, 47, 112, -76, 212, 188, 59, 376, 70, -41, 186]
5035A86k34OJ65J0k15P2J5m57M20Pl6K30m4r7j25N9L5Kr8J68Kj48K07k78J54r2
5061h6J9o9j74M33K41n47o1K9L18o9J19J6q9j34l3J53K5l76M16k00K46j24j30
5084g7K8lr6K55j14N0J80j65L2k94K04p1o4K02j24k16J20J59n3m9J45j44J42l32
5108b85L76j44PN8L31m71K18M3k26Q5k08M09k24J83n6J6JJ11k4m15K96N1k33N5
5132d6R5R8j85q5J89P3k62k0L01k54K87k48J24m2L1J09k16J49k15N4L47l40Qo5
5156a13j1Q8J27n1J75j28l5J37m88J50n1R0j31K42j66J01LJ76k37L1j1J73Nk6
5180E0l1j99J52M1L0j28J57l98L25Q8l51M03j01k16O0O3m4K29ok46J64K9P7j33
5204A5K9j5K6j78R2Q3l54m7N99m20L20r7j16KJ32J26j22k44L45j65J56m8m77M42
$$ y = [186, -48, -42, 123, 133, -82, -10, 5, -452, -32, -25, -61, 169, 125, 28, -97, -38, -3, -1, -99, 69, 71, -77, 130, -148, 6, -86, -67, -136, -310, 123, 364, -183, -244, -215, 103, 34, 153, 169, 80, -54, -87, 66, 91, -285, 131, -69, 177, 53, -77, -49, -52, -148, 107, -7, 43, 223, 58, 90, -204, 0, -71, -135, 67, -57, -273, -153, 6, -47, -96, 49, -95, 47, -285, 91, -53, -46, 12, 343, -128, 90, 133, -93, -8, -216, 193, -31, 152, 96, 112, 113, 224, 200, -215, 81, 132, -101, -46, 49, 147, -38, -123, 66, 139, -123, -143, 158, -96, 191, -57, 67, 25, 56, 165, -51, 98, -117, -63, 284, -56, -48, -113, -124, -36, 91, 40, 215, 87, 52, 189, -299, -149, -200, -110, -241, 1, -165, -64, -61, 115, -122, -91, -102, 71, 76, 50, 19, -180, -28, 13, 43, -85, 72, -326, -1, 87, -264, 139, 38, -178, -118, -55, -99, 130, 124, -122, 42, 71, 148, 15, 44, 29, 55, -123, -31, 52, -302, -349, 250, -170, 150, 53, -63, -61, 71, 197, 75, -169, 176, 11, 167, 119, -358, 84]
5228H4j80J6oJ34k7O5l63K55Q8j89Q6J98k91j1J20j74K06p9L16j50j55K04j4k19
5252h6J24J37m6K24j51k00l9m3m7J42q5J61mn2L9j15j30QL3J01j14J44J08J2j16
5277Ep7J25M2j88J71k50J50J10o5j66J83K8j93L45k13J12k3m8l54L96l54M44l20
5300a40k5K8m0R5nJ99q5j94K08L5J47j50j0J7l67L52m2j45K13j52r4K18L2L9j23
5325A1K1K39k42j66r4L07J34j97J34k61M7q0K20P8k85J43r1K26rj90K08m1j70
5348e8m0L3Rk00J30J56j44P7k17K34k94J19K65j99J61r0n0J82q0l5J19j60K27
5371A45m7l85K81J03j89Q7J82j53J57k12j45M04j54n1K37k40l7L7k2Q4p6l06M18
5394A18q2k11K00J97r6k76L6J60k17J66J31j29j61P2K36l00K51q7k5k10K67p6
$$ y = [84, -96, -80, -86, 48, 21, 86, -277, -22, 66, -123, -37, 161, -130, -141, -21, -195, 11, -68, 248, 98, -57, 147, 133, -86, 38, 175, 129, 353, 202, 2, -37, -80, -127, 15, -70, 91, 87, 35, 74, -41, -171, -163, -130, -29, -143, 1, 109, 121, 5, -72, 53, 95, -93, 78, -172, -22, 88, 23, -143, 40, 68, -125, 220, 7, 119, 96, 48, -306, 90, -264, 180, -140, -165, -137, -177, -82, -87, 112, 27, -167, 41, 76, 223, 73, 63, 80, -287, 65, 23, -122, 91, -61, -155, 63, 95, 134, 11, 32, 271, 29, -137, -231, 76, 210, 13, 147, -114, -67, -147, 73, 151, -134, 9, -82, 144, 135, -55, 153, 112, -58, -98, -65, -56, -256, -126, 30, -114, -37, -254, -20, -314, -195, 70, -129, 32, -58, -108, 74, -6, -41, 78, -82, 145, 98, -287, -6, 97, -92, -5, 177, 24, 181, -31, -176, 228, 74, 23, 260, 20, -17, 20, -2, 82, 6, -300, 118, 36, -175, 25, 222, 126, -150, -114, 46, -171, -5, 126, -3, -164, -92, 144, -156, 95, 8, -17, -227, 40, -36]
5416c6Ll6O5j1J21j98J12J1K2n6n6K50l19J02J90P4l68J89m4p8K9J40l42r0N92
5441B66k54n1J09K8l28L37j56J86j01J0k7j80J8M37n81N26m00j77M08k50J28m2
5463i4K32p2j48j00K73l9k07L00k04J23J9j72O4J11j22L10k75J88j07j24j4K73
5485B15k47j96K56p5J20J71l52n7K73N2K6j87N8P4J9j20R9j99K70l32j14K87J05
5508A46k51pJ63L38k95l96K68R8k29N2J00o9Q4j30j23K86j10J48J37p7l06N1L99
5531B77m00K77k39J19j86J12Q6m5kJ21k03J16K40o5l83L21q5j9J3k95M21l4k69
5554a22M58l87J09k08K62j49M0J27j32m2OK36k97L59l25K09l29J8J93q9oP5j20
5577a14j80L72o1L3j17j06J78J23k87L11r8J07k67M7J13j16K58m77K52K9j32Q8
$$ y = [-36, -33, -69, -4, -15, 106, -92, 20, 31, 53, -3, -59, 191, -128, -26, 164, 238, -130, 59, 15, -63, -34, 106, -236, -326, 266, 12, -39, 70, 98, -230, 107, -49, 137, 36, 46, 19, -161, -143, 294, -287, 239, -161, -338, 70, -180, -52, -94, 138, 66, -82, -182, 91, 52, -155, 145, -59, 64, 83, -89, -25, 86, -36, 274, -1, 187, 80, -44, -58, 215, -32, -228, 28, -47, 73, 244, -108, -165, 108, 160, 186, -1, 57, 131, 150, 30, 129, -70, 200, -132, -246, 41, 146, -105, -112, 51, 389, 94, -302, -34, 64, -165, -113, -13, -82, 2, -128, -251, 35, -75, 73, 210, 133, -173, -122, 277, -123, 154, -85, 34, -152, -40, 46, 1, -1, 120, -83, 33, 273, 208, -175, 146, 61, 42, 55, -240, 181, 147, -122, 336, -51, 58, -150, 112, -37, 3, 130, -2, -44, -38, 198, -99, 260, -65, 144, -185, -167, 26, -63, -69, 6, -114, -294, 78, 17, 50, -67, -173, 5, 128, -159, 152, 54, 161, -106, -59, 54, -62, 196, -281, -29, 0, -132, -44]
5599d4j52K06Q5k22j1L06j61k2J18k29K3L88l60L5J02k05L2J56k4l2Q7j32M1K5
5623A0m5q5L33j45K0j30J53p8M2J77k86M5N4j48K9j8m8J63j67K41j13J28j03J3
5647D2o6j4o7K42j78k06mL15j73K12j2q3P5r8J7kK39k67K01%o9J75k36Q3j47J15
5673I4j04k81L73po5n4J80k71O4J51J41p5k75Q1L5J27j63k0MK4K08j06j61J37
5697C7j10J25M3l49l7J92j34M67j30l01L51o9l7j23Q3n8J93k09q5M25j93j51M
5720f6k15K68Q5j64M9j08J4p0Q5Q7N3m1j55J27m4Q8K2k29K52k7N8j77J7r0J81
5745@K34J0j15K55m09N0j70J54J36l40L00m4j14m1r0J44j47K43K34n19K89j18
5767e8k6n5K17k28J41J9r5K10l95N59l51J9O2j10L9r0K94l22m5K2Q5J84j40J9
$$ y = [-44, -196, 10, 95, -127, -138, 168, 7, -15, 103, -126, -103, 285, -75, -40, 62, -143, -111, 45, 21, -11, 76, -56, -15, 10, -35, -120, 213, 68, 88, -42, 111, 33, 75, 252, -34, 11, 65, -83, -54, -72, -120, 43, -124, 117, 4, 132, 29, 42, -24, -38, -105, 137, -41, -247, -251, 64, -109, 103, 91, 8, 83, -15, 2, 0, 239, -28, 173, 173, 104, 279, 43, 126, -21, 94, -10, -291, 82, 75, 10, -44, 136, -135, -71, 80, 221, 146, -129, -48, -13, 114, -49, -69, -65, -41, 167, 61, -100, 37, -73, 52, 95, -254, -291, -99, -233, 234, 104, -197, 154, 85, 48, -75, 8, -50, 143, -66, -151, 274, 81, -70, -66, -281, -13, 72, -92, -43, -151, -137, -207, -122, -35, 18, -23, -178, -51, -95, -7, 15, -214, 38, 11, 69, -108, -91, -181, 0, 234, 244, 129, 384, -25, 25, -145, 9, 145, -195, 105, 61, -53, -94, -184, -40, -187, 56, 290, -229, 60, -58, -84, -139, 78, -150, -9, 10, -85, 125, -270, 289, -62, -43, 19, -91, -52, -142, 152, -170, -215, -193, -108, 76, -64, -45]
5791d5P1K01n1p8l14R5J15K19k21l6l3J73k59J61J56k2M7r2r8j42J75n0o4K34
5815A42j02J3Lj58K13J30l11J41j10j45K18n6J06k07K14q1k3K55j78L8n7j29K5
5838e9K2ko0L15p9j04j31j60L55r0K12k16p0J35j48J26K3j43P0K0O2r3l5L6J39
5863A25j51r1K8J87K9p0o4k77L75j09RL9J05j41j97J49r8K44n5rJ23o5n6J56k97
5888a11K34J03l08K25j78K06m3k41J21J1k28J98j31K15o6J19k69K90o5M5n8l5
5910C4k5P0j25k4k0M3K49L8m70M11j00l1M7j47r6L98k93P2o0J20m5j32Q0P8K36
5935C08k23L8k93PP9K45k51J18J34n1j54J72o9k09K16k4Jj5K8j78J14R7k17J19
5959hN6j71L96j05n17J57M51j32L7n0P4k50j70L22j5m7j60K7J33j3j06R1P8pn1
$$ y = [-45, 26, 227, 176, 98, -216, -121, -6, 213, -8, -44, -77, 96, -163, -2, 154, 132, 179, 87, -11, -153, 22, -28, -92, 142, 40, 53, 56, -102, 111, 241, -70, 71, -39, -184, 34, -22, 84, -123, 91, 10, -13, 242, 64, 102, 45, -84, -59, -37, -39, -99, 216, 137, 33, -98, -258, 97, 7, 219, 3, -67, 68, -80, 46, 69, -74, -4, 16, 78, -15, -50, -14, 125, -26, -117, -89, 98, 127, 57, -7, -284, 91, -18, -9, 30, 135, -6, -203, -54, -152, 92, 37, 28, 151, 86, 30, 186, -111, 123, 226, -82, 143, -35, 171, 128, -113, 8, 19, -209, -11, -142, 73, 7, 126, -143, 147, 82, 127, 69, 34, 9, 79, -46, -70, -90, -47, 202, 240, -230, 181, 81, 50, 97, -50, -146, 252, -41, 31, -29, 91, 46, -86, -6, 72, 308, 85, 123, -170, -163, -84, 161, -90, 28, 162, 111, -43, 129, 60, -149, 67, 43, 44, 29, 57, -121, -7, 90, -127, -8, 48, -123, 273, 168, -349, -192, 259, 127, 164, 114, 188, -62, -232, 90, 75, 28, -132, -105, 28, 15, -91, 0, 78, 71, 20]
5984B0L9m5Q6l3K25j57k75M81m39J29N9J50j13j45q7M8J27k09M06j69J15J3m68
6007b42Q2Q5l7R4l6l02L18J01J10j43r8J32J8K4j9p2Q0m7K17j44r0K9k0K91k84
6032D7J15j85J04j21Q1P8k9r3o6m3P5J59k08J89j97o2L16l90L57n8L12l43k32
6055a94J21J24l5K37l78K87l82L21nj29J00j71J92j0j12J55J05j17k26J99l50
6076b68K90k14J60J3j25P7N2L5N1J70k42K43l45K58l78J64j99K67K10k64K14j38
6098C1j07J38m01K97O8Nl2M7K0l6J91l74L1J20K54k68m5q7J98k4J8k42M66o9l09
6123a10Q2j45K23K22j53q5j26j7J0N6j0Q2n3o0J72k07j71K61q3L3J46P0j94n3
6147a10J41J31j72Q3k39J05M4J11P9l32K55n7o6m5P7l7L3j06R6J7P2O3j25j02
$$ y = [20, 59, 14, 100, 67, 292, 135, -140, 341, -98, 31, 90, 240, 127, -18, -105, -57, 70, -139, 267, 98, 213, 226, -242, -160, -75, -112, -18, -54, -356, -38, 63, 173, 30, -68, 64, 82, 106, 87, 15, 95, 48, 265, 121, 31, 60, 40, 331, 47, 162, -23, 81, -40, 41, 119, 90, -3, -69, -112, -37, 122, -86, 103, -94, -156, 160, -230, 127, 69, 381, 38, -194, -73, 51, 16, 253, -125, 162, -220, 101, 96, -33, 67, -104, 88, 78, -34, 121, 226, 109, -117, 82, -268, 22, -192, -32, -19, -144, -67, -15, 20, 71, 241, -1, 242, -103, 155, -223, -59, -258, 9, 219, -45, 169, 31, -76, 62, -339, -42, 26, 31, -1, 46, 66, 30, 221, -153, -122, -2, 252, -16, -61, -148, 50, 26, 44, -198, 268, 199, -110, -28, -173, 50, 272, 119, 34, -92, -109, -99, -43, -53, 29, -24, -84, 88, -119, -290, -29, -112, -79, 67, 137, -57, -110, 31, 162, -10, 73, -166, -61, -17, 94, 173, -159, 96, 39, -27, -72, 5, -32, 1, -105, -9, 8, 80, 143, 18, -84]
6171h4J71M1r6j24J69K9k22o1O2L23j91r7j50J92J61k14R3J55l37K79j96oK97
6194A94j57j26P0l9J46j28k9J06p3J20J12j03k60J08J15j63j21J23M3J49j3o8
6216FJ05j77j18K94k67J08J9O0m7M5J1N7O5oj55MM2l26J58J52r8P9J34l68L8K35
6242E0l0k3p9J17Q8j7J71l32n2K22J2k14O0j16L82j10r7k14J19J30j5J26j50L1
6266E9k7l6o6K20mr6N1k03J66j39J30K6J15j78O1n3J9K99k00k4q8K2j10QK13l83
6292b18M32l25J54J49k03Pj23L07j25k23P5J10J48l38Q6L14n0j51J25r9R1J6k25
6315f6J37j41L9K31k00p0K05k52K89j00l57J65J62n3j74J25Q4Oj46L47qj83j44
6338a04l9K17oo4K00l10M6K79l16K15p8N1j54K3J8q6M06l80J45j07J11j36k4j83
$$ y = [-84, 87, 128, 32, -92, 77, 106, -116, -177, -115, 208, 17, -80, -230, -38, 123, -91, 2, 157, -180, 99, -97, -103, 194, 37, -89, -19, -58, 88, -40, -69, 37, -36, 84, 196, 93, -167, -59, 56, -107, -228, -105, -62, 87, 74, 6, 111, -66, -184, 110, -157, -49, -30, 30, -17, 28, 39, 96, 161, 155, 0, 4, 46, -280, -122, 30, -68, 11, 145, -223, -185, 50, 20, -3, -82, 35, 123, 106, 277, -55, -107, 115, 127, -87, -27, -143, 239, 129, 32, -182, -63, 67, 52, 178, 28, 59, 32, -4, -70, 150, 146, 50, 101, -102, 64, -75, 55, 81, 196, 18, 79, 26, 45, 344, 144, 120, 32, 54, -56, -48, 165, -218, 214, -111, 43, 192, -11, -4, -127, 180, 55, -168, -93, 17, 165, -173, -87, 227, 177, 26, 151, 52, 143, 159, -66, 71, -70, -31, 200, 0, -70, 135, -117, 172, 72, -285, -120, 42, -11, -185, -60, 24, 30, -116, 231, 223, 40, -104, -143, 74, 68, 4, 204, -106, -60, 219, -97, 118, 40, 91, -63, -40, -22, -108, 298, -82, 63, -44, 67, -69, -93, -276]
6362b76L93j99L6l5j11M20k37ko2P4j32N0J50p6j13M6P1N2m9N0J39l44L09r2K13
6387B75j28k06P6M0K6l8J39j97J28m7m7Nk82L35k39o9K75j5k2L22k57K05l14Q4
6411D9rp8q2o9K24k6J3j26K40r8n5Q4Q8k93l5p4J73J34j64K97l14L71k98O4J07
6436A23j92m2R5NQ3J7L8j33J81l60K56K4P1q3k43K33l68M48l8q6r5q9J84J41j94
6461b4k37m0K62J02L5l3p6q6K33j16L22l01O5P0J08l21l7o8K01j34J67l0j46J50
6485F6m1M6j38k4K5M4l46L26j18L70j54m2K0o3r6q3J06J10m9J80l9j4q5J40K4
6510A65K47n75K68j23j25jK6m8O9k4K28m3j4n9l1L0l1K12m2k31J36r3j47K86J30
6535B10k2l09J2L9J19j29q7K67j34J00K3o9p2R5QP4p9K8L4k99q8K69j38K20p0
$$ y = [-276, 117, -82, -46, -81, -192, 228, -9, -11, -73, 1, -131, -81, 69, -7, -120, -74, -3, 49, 0, 50, 189, -155, 154, 62, 275, 147, -59, 17, 57, 83, 45, 184, -13, 115, 68, 21, 26, -256, 79, -160, -229, 46, 31, 9, 331, 74, 279, -35, 49, 40, -38, -120, -189, 35, 9, 22, -104, 136, 38, -17, 67, 155, -138, -173, -247, -74, 60, -104, 193, -121, 250, -48, 16, 123, -69, -111, -16, -11, 72, 89, 127, -6, 175, -185, 71, 95, 166, 83, -160, 73, -295, 153, 115, 29, -66, -155, 29, 170, -24, -261, -301, -39, 63, 98, 65, -11, -97, 136, 20, 342, 41, 106, 176, 284, -37, -74, -142, 59, -75, 92, 62, -84, 66, 25, 71, -67, -91, -66, -22, -368, -42, -160, 210, 56, 14, 34, -29, -125, -208, -102, 8, -41, 139, 100, 86, 1, 141, 165, 412, -163, 105, -18, -143, -144, -118, -166, -97, -121, 107, 64, 50, -9, -40, -10, -41, 171, 129, -102, 34, -59, -206, 80, 210, 188, -121, -109, -70, 49, -80, -167, 100, -34, 66, 89, 20, -52, 43, 51, 125, 46, 74, 108, -191, -279, -10, -148, 72, 2]
6560B%j97jL52o6j85R3j71K44j63J80j89J04j7q4K30k76J55K1P7J6k33L7n7m5
6585a73K10J88m00J19pK17j30K1r3P9O2Jn1j44J17j92R7l8P8j00k2j59J73Qr7
6610b36K27J70l10R5J34j44K50k63m3o4K67q8L2p2L4J46q5m9J42P5j06j7n6q1
6634d2J87j5Qp9O6j86K34m00pK44r5p4L15k59J35J15k0n8J51k42l9K3o5O7K13
6659A77j66j60m1L67j33Rk76K28P5k6k12j06L31k63K14K18l35J18M8j72J7K24
6681A36j09L4m1oM8J70m11J85P5O6j53J69k51K64j93K8j92pJ67l9r3J51K6j21
6705i7K76j91K3j71J9J01J64l30L26j32J93j74p2L25k77j18K55j33R0R2q2N4j19
6728B2J38J25j59j04Oj05K86k58l7OK01l49J88J71O1q6j34j78L46k30J97j76J14
$$ y = [2, 2, -195, -196, 156, 90, -95, -2, -173, 71, -92, 88, -101, 3, -14, -98, 132, -144, 11, 32, 109, 125, -108, -71, -128, -173, 37, 225, -175, -56, -63, 154, 24, 45, -48, 31, 93, 94, 43, -101, 16, -176, -79, -117, -39, -139, -161, -320, -147, -139, -236, -9, 161, -149, -54, 80, -64, 186, -77, -120, -184, 83, -5, 27, -45, -11, 135, 50, 1, 143, 218, 112, 95, 39, -42, 145, 130, 138, 59, 125, -61, 173, -227, -234, 10, -85, -159, 156, -103, 32, 147, 127, 69, 220, -22, -61, -38, -103, -36, 177, 11, -149, -190, 177, 44, 53, -223, 5, 80, 54, -158, -264, 67, -196, 18, 236, -99, 19, 67, -105, -88, 136, 27, 61, 20, 14, 62, 232, -179, 6, 81, 147, -6, 163, -88, 176, -17, 11, -181, -188, -21, -60, -153, -2, 24, -97, 179, -12, 11, -160, -141, -40, 124, -206, 120, -12, 181, 7, -65, 260, -17, -135, 120, -13, 77, 169, 87, 141, 22, 160, 285, 126, 22, 28, -77, 209, -49, -86, -80, 121, -228, -40, 131, 192, 106, -28, -206, 140, -90, 107, -69, 45]
6751D5j53J36m7K09l08l4K38j21K38j43J48j83J12j81J10j22L4L6k57K13j78J46
6773f2JKK07k35K08k66PO9J65k8K0p4K03k43JJ11j72J27K8mo3O8k02L39k70nL1
6800c7l5qNR3n5p8j29J68JJ59j09J19J59j48r3J68l81J33J49p0j50K36j67J09
6824C9m8J4Q0J23j81q1L26l98mL1J61r8J2k96P8K17m6j66K78R3P6l33J1K14k59
6849a57n4L3M21j61j59L9K07j12q2R0j63M5K32k6K1j23k0m3R0j03r6M9P0j83L34
6874A49j51J41j95J1j75K43j61J93j74P5J09l2J8j04J58r8j20K1K17q6k05k7J99
6897FK3n5K1jrOm0J15k11j38L65l63L94l05P4K08m0M3k45K22p8P8j58K19o3j3
6923E5J02k28j32Q8j03L34l6J26l2j83J4J7R0M1k73J49PN3j4l70K97J01k21J81
$$ y = [45, -108, 28, -19, 190, -118, -152, 86, -35, 203, 60, 208, 25, 137, -44, 66, -56, -22, 14, -243, -30, -208, -62, -61, -59, 148, -87, 121, -145, -138, -69, 96, 68, 88, 14, 217, -26, -25, 86, -86, 41, 69, 65, 2, 70, -132, 207, -63, -68, -37, -72, -80, -75, 18, -37, -115, -244, -76, -75, 84, -25, 94, 253, 105, 12, 180, -201, -68, 81, 11, -139, 97, -70, 39, -9, 5, 85, 208, 27, -54, 272, -126, -130, -99, 62, -36, -24, -320, -242, -25, -71, -237, 41, 134, 210, -123, -112, 102, -157, -211, -178, 243, 82, -77, -38, 169, 57, -25, 65, -98, -53, 179, 153, 174, 51, 31, -12, 78, -25, -121, -72, -2, -185, 149, -2, 139, -56, -45, -220, 23, -138, 55, -119, -44, 65, 33, 51, -53, 105, 7, -113, -92, 125, 39, -166, -193, 6, 29, -26, -5, -6, -15, -9, -49, 66, -145, -283, 82, -281, 113, -192, -118, 90, 50, 93, -152, 70, -8, 70, -88, 131, 68, 55, 157, -71, -203, -115, -218, 116, 80, 206, 174, -9, 5, 22, 112, 153, -120, 29, 36, 89, 75, -295, 2, 103, -118, 63]
6947F3k2J12l64K71j65K41p8Q2l27J28J97j32J3R2o3L1j90qm3R0O1o5K01j76K0
6972c1R0j78j31K35r4J47rO1j60J67l06J65J67j02j49Q8K15k26N7K33k43n0p1
6995a25K3j93M31L1l93M07l25J84j86K95n5k23K76M0O5k95m6P5L1J13j09K16k23
7018A4k82K10K17k35J73K5p8j80J97j37J14L6k87l1N06k73K14r1l8p2J11k11K91
7041A93k41N4J92j10L4l2j41r0q6J79j69L59l2j67J44j71K79o7J00l15j02J69
7063b0P3n6r6K35j03L8J15m83K64L6J07q0p8o0M1njJ03j21J57k92M25l11K9K16
7088A33j09K8j55L27j93j07j33J01M3Q4n6l6K62mj04j11r4M5M8o9J04K34j77j42
7112h1M01l59K4J59K17m2m25L90k78Q4j01Q4J11l7o5J22k47j10JJ33r8J75N0r5
$$ y = [63, 41, 153, -211, 60, -105, 136, 58, 140, -187, -59, 138, 6, 19, 111, 48, 79, -111, -119, -162, -72, -11, -76, 125, -51, -31, 59, -119, -250, -15, -109, 38, 29, 90, -70, 97, -209, -44, 123, 21, -128, -40, 175, -51, 6, 239, -4, -54, -125, -102, -295, 136, 167, -226, 181, -144, 40, -146, 149, 94, -129, 147, 187, 252, -43, -89, -14, 17, 130, 21, 237, 14, -268, -58, 159, -76, 97, 122, 44, -136, 61, -76, 38, 74, -213, -244, 262, -11, 203, 112, 74, 2, 113, -98, 193, -48, 6, 198, 88, 122, 90, -51, -141, -227, -48, -217, 142, 110, -57, 87, -84, 195, 128, 228, -87, -189, -20, 53, -3, -99, 136, 33, 71, 186, -297, -33, 3, 110, 30, -48, -108, -67, -72, -73, 30, -91, 66, -226, 199, -112, -83, 133, 24, 52, -103, 224, 31, -76, -209, -108, -65, 19, -37, -73, 189, 185, 81, -30, -124, -79, -31, -100, 4, 238, 61, -81, 320, -39, -15, 144, 361, 319, -106, 284, 6, 90, -11, 73, 184, 147, 82, 204, -43, -153, -152, -19, -117, 58, 108, 13]
7136A3j79J95R8j79J61q8J56M1k80K23k3K11n26K60p8O8j52o5O2J60l0j97L97
7159B48l13O0k09K06J18o4j32j5L34l03J75j24r4J60n5K8J15j00r1M3k84K81l8
7182e4Q9p8J15O9qk08J02J03n3Q7j71k73M54j24J03R1K3k38J30j55j0K5j1n1m1
7207h4K0j54L16k45k4K56k29K30j46P1J9q7K07J68k80l3o6j13J85J67J14m6j18
7230A28l24J77Rk52K32j86J78J34r6k61L70j53L26k68r0k8O1P9j11J18M0r2L8
7253B9N2l15L95k68l3J63k26K38l66K08K2K4M9J45j32r0J34L01k20k36K13k57
7275a70K67j32O5Q6k11J21L7j10J84k02J79J02l3j78K06j66P4l74K05J35N1J6
7297A52j79p5J92p4N3j8j40J35l5j72N9K16O1j04j35K09J1j7r0kk4O2J21P8m01
$$ y = [13, -166, 29, 127, -52, 109, 21, 177, 218, -62, 161, 138, 349, -177, 83, 5, 73, -79, -144, -82, 78, 48, -149, 248, -65, -5, -214, -8, 110, 46, -86, -101, 233, -70, 105, -19, -113, 47, -8, 20, 135, 35, -56, -13, -297, -16, -54, 35, -43, 72, 141, 133, -75, 27, 130, 77, 164, -7, -280, 174, 50, 153, 244, 267, 29, 159, 4, -6, 19, 8, -43, -84, -64, -218, 98, -147, -171, 85, -144, 86, -60, 11, 30, -57, 150, 318, 38, 5, -61, -174, 11, 178, 292, 246, 128, -196, -19, -10, -262, -30, -216, -38, 96, 0, -261, 109, -44, 282, 14, -76, -104, -43, 36, -75, 43, 83, -9, 29, 81, -234, 161, -107, -140, 23, -203, 35, -331, -123, -101, -77, -28, 117, -15, -105, 29, 330, 110, -126, 87, -170, 97, -35, 30, 116, -95, 26, 63, -47, 137, -65, 114, 216, 183, 5, 211, 45, 119, -255, -50, 85, 136, 152, -27, -102, 90, 16, 69, 51, -89, 46, 11, -161, -102, 114, 175, 71, -64, 145, 156, 139, 49, 47, 23, 85, 206, 284, -117]
7322a17K99L4k08k30N04k87L0j97K78M1Q2k92m7j9K76j51j17J72q2K12j96q3J72
7345G4k67MK71l91J56NN6J28P7k05QL2K18l79L01j24M3j7k77J27J09N8k05L98
7369B00l13m8m9L5L71q0k19l1O8j04J14J05o5K4Q2K80m61K80l10j18K12K40m00
7392a87P2L1j71K23q2K68L0k75O6P5j83J83j56L82l52J35pO5M0Lpj45lj04l4J82
7418D9n7J05j07o4J0O3j35oK88j23k31M12n09J63R0L34k49l4K57k12r0p1J44L98
7442D25l18j54k4MJ17r3Q8o6m8K38j06j58J28K92l10K1m6j88K32L4r9p5K61j97
7466d2J58m3k1Oq3n4N7Q0n7J33k16O3K6J82n5k8q7p3P4j70N4m3J96M0n1j15R6
7493B7J55o9j43j6K89k58r3O7k3J19J8K9Q4p7j48J01r7q2R1p6L97k60J56p2k54
$$ y = [-117, 182, 216, 8, -222, 282, -5, 25, -172, 106, 147, 229, -63, -110, -129, 147, -4, -121, 51, -31, 181, -15, -98, 74, -193, -189, 82, -309, -153, -148, -92, 36, 113, -92, -84, -52, 166, -213, 88, -36, 7, -10, -287, -160, -51, 7, -198, 200, -113, -161, -210, -175, 196, 116, -103, -134, -66, -170, -56, 49, -16, 8, 90, 370, -91, 189, -121, -239, -27, 213, -187, -115, -84, -255, -32, -114, 154, 184, -91, -25, 50, -133, 50, -106, 276, -76, 59, 52, 117, 157, 160, 153, 8, 5, -99, -133, 49, -8, 97, -10, -74, -64, -1, -136, -142, 146, 23, -208, 204, -305, -142, -52, 282, 33, -1, 256, 44, -46, -117, 27, 425, 107, -47, -71, -67, 50, -43, 45, -21, -69, 169, 63, -95, 33, 325, 15, 36, -10, -198, 34, 68, -31, -106, 155, -42, 116, 73, 52, 58, -25, -79, -22, 58, 1, 134, -82, -19, 7, 189, 134, 106, 19, -54, 20, -150, -96, -139, 57, 97, 46, -69, 27, 182, 113, -30, -46, 243, -15, -108, -41, -64, 55, 73, 102, 186, 109, -39, 62, -35, -117, -26, -102, 295, 35, 191, 119, -135]
7518a35NJ86j14k9K69k03N7j06n4K65K60j75j14p4k03J86J30j26K70m16L7R9J76
7541A91k58J58R9k28J09k35J09N5J41k1j06j45J31J0j43l0K68l0P3j26j21j4J36
7564B3L2p7K03J2j91L4J24j57J17J19k32n5O5mj55J8J08j72J59m7Qj26M15n61
7588c40N25R5j05j84J58l19M80j51j6l04R6j09L34j68k0J29j59J6k69J36L81j38
7610F8r6o4l3K13q2O9j50N1k6j8ro5l8J03m1J71p3J42n9j0J87l03l6K24j33k01
7636b09K79l7N0j01J6K33k44J19J2m0n6K2j11j39M18j76Lo3j71L67j83r4Q1j83
7660b07J94J34j40L1j0J0K26k90J47k54K93k95L52k1k96P9N6l36L55N3j64j09
7682a92J41J51K21m29L68l17J13O1j13J56J2j67p9J63r2j26r5K86l07K28M4J74
$$ y = [-135, -130, 56, -58, -87, 182, -21, 36, -70, -124, 141, 401, 226, 112, 38, -165, 21, 151, 25, 295, -121, -84, 15, 191, -67, 91, 190, -38, 71, -164, -55, 0, 141, 120, 14, -131, 0, 10, -133, -163, 105, 75, 148, 22, -99, -113, 23, 55, -22, 181, 193, 2, 36, 160, 3, 120, 239, 7, -48, 17, 13, -142, -124, -16, -188, -29, -76, -68, -194, 221, -340, 185, 280, 175, -9, 149, -170, 310, 159, 143, -161, -65, -174, 160, -8, -28, 101, -58, -42, -311, -175, 206, 68, -28, -92, -125, 88, 6, 75, -75, -24, -50, -68, -77, -142, -180, -77, -118, 53, -20, 122, 63, 53, 240, -63, -99, 125, -8, -209, 70, 33, 83, -18, -2, 231, -13, 106, 118, 78, 22, 44, -67, -206, 212, 36, 39, -24, -195, 172, -11, -105, -24, -207, -13, 121, -19, 12, 2, 12, 238, -52, 95, -159, 134, -161, 191, 170, -126, -47, 9, -327, 28, 81, -83, -192, -51, 100, 321, -108, 260, -57, 56, 117, 4, 160, 172, 5, -74, 89, -3, -129, -224, 62, -245, -17, 27, 201]
7704B01j38J27l52L84k66Kj00L79l12r4K11kk47K81p0mO9LL9o6J9P4j91L2J55
7729A34l94L06j27J93k11K98k29M8j88L90k64k3J7J58j56K8P5j59J94q2j15P6
7751c1r7N7J77o5q4J70%L9Q4k60K00k92K18q2J0J5j86Q6L0l85L82Qj43o6L54j59
7777b0J64l28K16k11K12k97K89J16j03K32m09J68j56R7K10k19N7J6K0J45L8j49
7799H8k1n7Q4j30p7L82l90J31QK63l17J02j14p5J38N0o2K8j24L67m16K55M4k35
7823g8n9L06k51K63j97j16L3l1J62J25N9l93N6Kp0K41J99l19p6m9L2R7J95l0j00
7848AO6l08J40J4J75j35n7Q8j46L4J80j90J21o4j1M8k8J21n3l46J84L27o1K8j38
7873a0k13L58k66j0J86j95R7O0J48L1l20K38q6N3o4mL95j73n8l40J68O3l6k16
$$ y = [201, 63, 190, -162, 222, -44, -42, -142, 237, -75, -169, 42, 40, -207, 74, 4, 0, 69, 72, 111, 45, 64, 138, -53, -21, 134, -260, 46, -81, 112, -99, 199, -30, 18, -170, 220, -44, -67, -50, 108, -48, -20, 55, -104, 90, 8, -107, -31, -128, -71, 106, 41, -43, 127, 127, 166, 250, -10, 190, -102, 116, 34, 44, 59, -127, -41, -11, -396, -14, -6, -149, -215, 139, -20, 144, -184, 32, -179, 33, -264, 25, 141, 38, 270, -139, 29, -127, -30, 180, -39, 18, 34, 54, 199, 237, 88, 67, 10, 94, -36, -113, 269, -121, 10, 18, 281, -36, 66, -48, -123, 15, 65, 3, 31, -93, 274, -142, 113, 157, -78, -137, 169, -82, 181, -16, -132, -99, -130, 32, 157, 216, -177, -121, -119, -189, 52, 251, -68, -144, -193, -161, -64, 131, 101, 1, 67, -241, -101, -87, 88, -47, -104, -16, -162, -128, 52, -138, -17, -81, -92, -44, -72, 49, -4, -350, -166, 161, 100, 128, -10, -223, 135, -131, -141, 45, -150, -53, 7, 155, 186, -134, 104, 18, 71, 7, 3, 398, 225, 167, -173, -5, 58, 22, -194]
7897a94L95m56K30N9q9J69j73o1J69m9O9j43J98p4j42J8J45j45RJ10L3n5j17j35
7921b29q7L19J69k32K19j12Pj08k5J13j21J80K6l13K36J51j46K4%k25J8J29J47
7944A40k48J48j9Q1o3k06O3Q4j32K10j05K13k11L20l72j82M26j74j03L09k48j42
7966b11J88J1m6j51J42l2Q3Q5p8J75j57Rj58J66J48j97PJ7j23M3J37K27j50j23
7990A2j01J05J64m8n14L37o9K40p9L0j00m3J75k38J50j9R8j70J13j14K50j75J18
8013A22Kl29J71P7L4K00l49J09k11K01M0j71R0J38P4k59l1J6K54l06L56l57k5
8036a54N0j98L03J61j75J11l2K8J2J3L4j4j35j04M4P8J09J23k05p8O6n1j3r2j7
8061a36K44O7k12lJ23k1K3J75k66m25N16J83j63%r7J24n2k31J94k08J99r5L07
$$ y = [-194, 201, -255, -25, 34, -55, 114, -59, -120, 49, 0, 69, -74, 124, 50, -92, -74, 71, -74, -65, 45, 78, 23, -94, -229, -316, 3, 172, -60, 159, 47, 54, -54, -79, 34, -87, 93, 119, -194, 42, 193, 47, 71, 71, -154, -136, -7, 140, -108, 40, 21, 102, 39, -167, -104, -20, -152, 58, -47, 166, -45, 275, -97, -279, 147, -27, -130, 179, -69, -211, -23, -12, -58, -209, -67, -99, -16, 69, -9, 166, 9, 18, -140, 26, 174, -23, -16, 1, -122, -79, 58, 285, 135, 12, -89, 16, 180, 132, -382, -45, -114, 126, 47, 77, -23, -66, 109, -129, 21, 2, 100, -70, 43, -71, 179, 4, 122, 124, -205, -34, 43, 77, 277, -72, 37, -174, 27, 67, -104, -14, 124, 198, -61, -92, -76, 178, -128, 228, -129, -154, -104, -302, 1, 162, -13, 98, 66, 94, 106, 119, 153, 139, 4, -100, -56, 22, 131, 254, 49, -29, 37, -14, -27, -119, -136, 108, 175, -37, -40, 83, 62, 85, 260, -6, -431, 85, 268, 105, 105, 8, 132, 80, -151, 43, -165, 34, -61, 246]
8084B46j68l36K70J6j74K44k55J40K04j53j75M68k13j84J95j77R0q4r2J92L8k5
8106F7j5j43K00j51J32m3k19J10O5l13J48J14J26l50J82k3J06j50j26M04l22K70
8128F9k1j5K27k53L4R9k9k26J90M3J2n5oj6p2k50J41o2J4P8Q3j17J09L7p7K65
8154B02j85l3M0j21j8N3J45L9rj20n1P1k1n1qL44p3j16j4j02M0l1L45k92K12k81
8180c5k0L7J86k16K08q5j76NK70J12j44
$$ y = [246, 78, -258, 12, 28, -146, 98, -157, -17, 187, 34, -141, 327, 114, -70, 125, -52, 38, -46, -138, 54, 92, 67, 52, -91, 109, -42, 90, 47, -172, -62, 3, -310, -162, -48, 78, -272, -90, -113, -7, -157, -283, 121, -201, 69, 48, 33, 260, 7, 41, 140, 111, -115, 75, 118, 130, 75, 69, 53, -19, -269, -128, -190, -176, -98, -15, -132, -23, 14, -63, 202, 17, -16, 24, -97, -115, -62, 83, 122, 113, -7, -58, 13, -8, -59, -67, 277, 204, 88, 74, -28, 12, -19, 326, 34, 246, -35, -55, -18, 168, -48, 160, 75, -101, -96, 174, 286, 142]
8191A42
$$ Imaginary data points
##PAGE= N=2
##DATA TABLE= (X++(I..I)), XYDATA
0@%%%%%%%%%%%%%%%nJ3j6J6j6J6k4L2l2L8m6N1n9O9p7Q8j02J16j31J47j64J84
37I8k07K31k56K83l16L52l88M28m74N23n74O32o97P68q48R35j030J138j263J404
57G39j568J759j984K259k599L031l603M399n577P491j1089J9990p8052j06575
71a71379K40026j5053j50459J09772O0455j29380L0607O1302p2860R986N8420
82C1437m9332J4007M7785o4060j4636O6272l9560l2493O9416L387m8752K2153
94E624L525l1191K0387K2764j1476k36q855J611K4822k5484l2283M2319J3724
107B5251l7431K1958J6546m5502L794K6870k8452Q851L5305l2437j4101K9179
119I831k7215j0229M8423j8160l5059M4636K680m2892L1260J2440m8948K8304
$$ y = [0, 0, 0, 0, 0, 0, 0, 0, 0, 0, 0, 0, 0, 0, 0, 0, -5, 8, -8, 8, -8, 8, -16, 16, -16, 22, -24, 27, -32, 37, -40, 48, -54, 62, -69, 78, -86, 98, -109, 122, -134, 149, -167, 185, -203, 225, -249, 274, -300, 332, -365, 403, -445, 490, -540, 598, -665, 739, -829, 930, -1054, 1205, -1394, 1637, -1966, 2433, -3144, 4347, -6742, 13248, -64804, -171379, 68647, 53594, -96865, 12907, 73362, -56018, -25411, 35891, -36969, -26983, 31437, -17895, -3888, 43897, -20163, -34799, 31473, -8087, -40580, 28836, 32223, -16529, 5624, 9149, -22042, -1655, 21109, 9633, 9397, 542, 2153, 26975, 1491, -30792, 11527, 25251, -12180, 9778, 26324, -19178, -15384, 11486, -16966, -8115, 27190, -5247, -19348, 9831, -17384, -27613, 20810, 2650, -32409, 12227, 14907, -27985, 3275, 15715, -33233, -4929]
131d929M6278m4103j4749L6880j9676j4490K9418j2433j0502L2828j8503l2638
143b6619L5272R624l6260J5591J9482k8220N796K5863k1195j4316J6171k218J860
156H31J4224j5552j1668J8313q29j3010J1311J408j1101R430M210j3948K097Q002
170C718n957k387K444o45O884j519j4733K338J2337m340k503O714o443l287J2300
185D921l76j0550K511M701J00M763j461o852O295N061j0944k64J2732k422p403
200H12O920p41j1350P290R699j3308p032J3043J067j0002J049j415p193O861N683
215A383r407k37O965o672j499P612p188j580J6140l519j3221J1219Q046j1367
229c325L309P708o549M488R824r924n194Q739k593o99N818q958m735J1561n063
$$ y = [-4929, 41349, -2754, -17503, 19377, -299, -14789, 14629, 2196, -8306, 24522, 6019, -26619, 8653, 18277, -17983, -2392, 17090, -11130, -5334, 20529, -666, -14982, 1189, -1029, 831, 15055, -497, -12165, 6148, 5319, -7691, 3620, 5028, -6073, 3357, 7567, -6381, -4284, 3718, -2239, -4626, -2182, -2827, 4057, 2538, -12195, -9857, 2480, -1860, -4363, 2351, -4092, -7379, 4921, 4545, -6005, -3494, 1207, 1307, 6070, 4609, -2243, 4052, 9113, -1831, -2095, 10637, 8215, 812, 7732, 6991, -4359, 2931, 12630, -678, -7710, 5333, 6400, -3602, -2553, -3968, -11161, -4300, 1383, -8024, -8261, -1296, -7968, -9467, -1855, -9043, -10623, 5517, 1998, -11223, -4, 8042, -3325, -16, 7692, 1143, 5631, 15455, 5531, 337, 9076, 6483, 5784, 11602, 2644, -2091, 9470, 4407]
244D407j2079O916J415q200N949J136j1736O214O524j0984J489P980o056M310
258b715P469j2508n12J5886n347o751J1788m294o345J3916k818j5068J1221P000
272A0922j3212M670M616j3839N281J0455j5291j762J4061r133m685J2583q431
285c765o627J7188k706j4721J2930N340j2303Q235M645j4204Q875J1012j6692
298b793j552J4503r214m439J1437q864o184J4089n647j2221J1990Q70j2774R716
312a083M770j4336L709J0378q818k25P577o646K090R695r957l875J3709k450p241
327b703P800m74m891P831l401r535J0775M376j2377M339O964j1636Q93R818r679
342a900l775J1379n518o312R525n120j0000J2245L604j3125M522P718q318N15
$$ y = [4407, -7672, -756, 659, -7541, -1592, -456, -12192, -5978, 546, -10438, -8949, -969, -7025, -2715, 4754, -7754, -8266, 7620, 2273, -4478, 7310, 3016, -3329, 10587, 7769, -7299, 3922, 10922, -2290, 2380, 6996, -6843, -1562, 8893, -6398, -8160, 5901, -3232, -7917, 4666, -3765, -10392, 6796, 4090, -10631, 2299, 7639, -4664, 3571, 8216, -5988, 2887, 13899, -2793, -4345, 10158, 944, -3495, 7942, -922, -7106, 6983, 1336, -10885, 1105, 1975, -10799, -1083, 3687, -10649, -6940, 3438, -5380, -5605, 1972, -4674, -2584, 7111, -2846, -6721, 6988, 4538, -2703, 5097, 4623, -268, 7563, 4162, -5373, 5402, 9778, -2599, 1740, 8704, -2932, -2039, 7779, -1900, -5675, 5704, 186, -6126, 3399, -1721, -11721, 524, 4128, -8997, -4475, 3243, -5075, -4560]
356d560O211p446J054J1109n769o032R069K6o711M409O43k483O698j031p878N791
372C100L071j0080L390Q544p775l286P894l132n464L458l211M02Q777n838q058
387h208J0422J950j2091N033P393q259L446P558j1400j315J2166p472o503J2670
401E390j373r621R287l34j1968Q157M522j1244P283Q747j4816M45J4200j1323
415b648o867J5810j163r414Q977j029q978R495Q53j1350Q817P252j2169K174O877
430F637j1821n5J1793p584m247J0119n354n985P560l811n244J0383q57o830Q899
445C603j465j0444R922L670j2946Q978J0104j3667n68J0148j0311q43J1641r176
459a354l623J4835q349j0894J4451l625j3583J5768M155j7476R130R661j7335
$$ y = [-4560, 1651, -5795, -4741, 6368, 599, -5433, 3636, 3662, -3049, 1360, 2003, -480, 6218, 5187, -2691, 3100, 6171, -3909, -519, 8025, 250, -3036, 4858, 1726, -3738, -280, -3491, -3089, 5688, -150, -8208, 2214, 4164, -7927, -2894, 4499, -3760, -314, 7244, -4156, -5471, 6695, -777, -7280, 5390, 4017, -5604, 3683, 3349, -8619, -462, 4060, -7184, 99, 8846, -5970, -5525, 8675, -2648, -9515, 6295, 5132, -4282, 4695, 3666, -5312, 4183, 5036, -6314, 2503, 9755, -2414, -240, 6637, -5184, -5239, 6554, -1030, -5277, 4842, -512, -6497, 1063, -2748, -7992, 2391, 1534, -5296, 3603, 2138, -8306, 1616, 5286, -7660, 1318, 11422, -2245, -2813, 7335, -2976, -3819, 7822, -1354, -4977, 9858, 1509, -9385, 5066, 1441, -12142, 3626, 7781, -9695, -565, 9096, -8239]
472h239J776J4428j1707r7J4543j0358o038J3592p113q216J4839l049j0156J3327
486G532k27j7033Q763O837j4028N581J0368j1733r56R189r349k622R823n289m68
501c612J0552r061n250J4265o112j1409J4829M186j2282P411M550j2318M035O739
515F523j0059M916Q166j1659P30R636j2424l887J4433o686p003J4359l984j3263
529a0202J0883J958j2781Q603Q351j0268K265N224j0364K799R007r806P81J3450
543I900q441p602J1264l364r021J0307L114q740N657K908r853K456N196o964K074
558a109O764n736k418M772m364k744N278j141j835N251j105n136J603J175j620
573b365K679R85r92K967j502l984K682Q20k301L456J985l885J456L84n305J639
$$ y = [-8239, -6463, 7965, -3742, -3839, 10704, 346, -5692, 7900, 787, -7429, 7410, 4361, -5795, 7532, 7305, -9728, -965, 5872, -8156, -2575, 7793, -3940, -4896, 4293, -5056, -7678, 2145, -3144, -3612, 6940, -2121, -7371, 6894, 782, -10627, 4202, 8388, -3894, 3517, 8067, -4251, -216, 6523, -3536, 1380, 9546, -2113, -1383, 8253, -4171, -8058, 6375, -311, -7314, 7045, 3061, -10202, 681, 2639, -10142, -1539, 6812, -3456, -1191, 4033, -6331, -3532, 5475, -4331, -3550, 9900, 1459, -6143, 5121, 1757, -7264, 3043, 6157, -2583, 3074, 5982, -3871, -1415, 3781, -3183, -1109, 5655, -81, -2499, 2273, -2091, -4835, 443, -698, -2533, 2718, 1613, -3523, -1920, -745, -2365, 314, 1299, 307, 3274, 1772, -2212, 470, 1290, -1011, 2445, 4430, 545, 2001, 2385, -2920, -1281]
589a281M396m458o32N940l724n398M208n7l217L042K203l422J517K560m336l92
605c051M558r55j329L628N22l603Q30K247l032q98M288k3l211J174N55l635k82
622b217K666j653m50K995j968l239K879N4l139K770L129k622P90K032l018m15
638a406L068q22L37K824k505j004K415k549k260L983j258k418M031j284n093L563
654c78R59n340L083L490m791J734M010o205k24O922m534j570Q216l161n702O861
670C370m80o584N753L029o568L373L059q015J680N074o392J32O676n020k207N159
686B039m470k604P106k507m053P336r82o805N734J383o445N268L441p006K862
701B97M514p881J072P044n972j055P572m915m434P344l452n068Q152p40p201O605
$$ y = [-1281, 3115, -1343, -1975, 3965, 241, -5157, -949, -1006, -4223, -1181, 1022, -2400, -883, 1677, -2659, -3051, 1507, 552, -777, 2851, 3373, -230, 600, 2847, -185, -1083, 3205, 3182, -29, 1145, 1700, -1935, -2217, 449, -1204, -1654, 1341, -627, -3866, -987, -933, -4072, -1302, 1827, -795, -5, 2027, -991, -1406, 1662, 840, 1177, 4001, 1496, 492, 2907, 358, -1902, 2081, 823, -1595, 2436, 1152, -3941, -378, 581, -4759, -1676, 1814, -2977, -1243, 2767, -3438, -3662, 3260, -1274, -2844, 5372, 2211, -3491, 3370, 2890, -3694, 2059, 5088, -1480, 1893, 4952, -3063, -1383, 3691, -2701, -2569, 4107, -913, -3120, 2039, -2431, -5035, 2071, -436, -4489, 2847, 1865, -4940, 794, 2177, -4268, 1000, 4441, -2565, 297, 4811, -3070, -1998, 5046, -926, -1981, 5591, 676, -3758, 3586, 134, -4934, 3218, 2478, -4723, 1882]
717A882J441q874L814N390o722J999N276o931N14N981o066j003P654m321l345
732c311P672l342o261Q225J2p031N927J904p449M151L322q201L337O234p752j2
748b575P081o369k861P856l366m620P522j292o344O198M41o788N369M230o882
763b400J862M645n775L32N284m495m69O295m200l468N943k291m231N367o01m295
779b497L945l6n813L045K672n719K421M425n288n78M754l681j345N870k092k817
795b734O159j270n486M773K055m958K613L045l802P69K127n066J040M670m506
810e71j965N783k327m412L086n0k476K907N08k854L333k7m885K860L578l815K54
827a073M166k250j402K732l071j362N830k264m352M722J593n909J359K310l581
$$ y = [1882, 3323, -5551, -1737, 3653, -3069, -1070, 4206, -2725, -2211, 3770, -2296, -3299, 4355, 34, -3311, 4361, 1019, -5242, 2983, 2995, -4036, 1891, 3795, -3654, 497, 3819, -4382, -1045, 5189, -2563, -2575, 4506, -1863, -4724, 3132, -234, -4854, 2668, 1376, -4968, 1230, 1671, -5117, 252, 4482, -2400, -538, 4107, -1668, -1336, 3948, -547, -1016, 5279, 1079, -2389, 3554, 1263, -2968, 2399, 1798, -2497, 1448, 1412, -4401, -1356, 1316, -4403, -1982, 2443, -2845, -3423, 1331, -2350, -3695, 2175, 83, -2734, 3425, 2155, -3331, 1442, 3497, -1461, 1152, 4197, 395, 1164, 3291, -1775, -735, 3935, -571, -2536, 3247, 920, -3492, -406, -456, -2932, -25, 483, -2371, 962, 935, -3950, -1090, 2488, -1327, -1073, 3093, 843, -559, 2173, -898, -2260, 3570, 1306, -3046, 1676, 3269, -2640, -1281, 1029, -2552]
842b552J839K844m524N79M272m052k211N785q33m034M601J099m347J904J236k820
858a214K450J982l956J366L073m099j596L798j766j137L041k192k324L840j204
873F2m347M149J476l946K664J867m535J736K406m283J913M468m551j251N952k869
889I11m277M761M79l447L100N47m142L574M55n447K595M462m126q78L999k905
905c39j633L108j968q45M116j657k414L483j211l552L389M99k875L065J053m433
921b214J873J935m340J389M147l499q31L775l108j760M244k229k251N257l41m772
937b725L496J247n352K665L291m253J278L868l835j398L679k732q27M562j490
952A474k858L357k57l604K358J269k941K369J240l708N88J621k475qK198j743
$$ y = [-2552, -713, 2131, -2393, -1814, 2458, -1594, -3805, 1980, 1147, -2887, 1714, 2813, -1534, 370, 1606, -1214, 1236, 3218, -738, 628, 3701, -398, -1994, 1804, 38, -1099, 1942, -250, -2574, 1266, 62, -4285, -136, 1340, -2606, 58, 1925, -2610, -874, 1532, -2751, -838, 3630, -921, -2172, 3780, 911, -3366, 1395, 1874, -1573, 1527, 2074, -2068, 1506, 1961, -3486, -891, 3571, -555, -1433, 2566, -339, -1972, 1136, -832, -1677, 2439, 782, -1632, 1851, 640, -2912, 477, 976, -1899, 1166, 2219, -2214, -341, 1594, -2746, -1357, 2790, -709, -1540, 2235, -873, -2633, 1611, -618, -2869, 2388, 2047, -2725, 771, 2018, -3334, -669, 2622, -1631, -353, 3515, -320, -1718, 1961, -771, -1598, 2964, 1474, -1384, 1973, 1716, -1888, 470, 1739, -1202, 1167, 2407, -1301, -713, 908, -1567, -1575, 623, -1120]
968a120j01K428k762j267K511r00j178K911j46j784J632J98j866J812P08j289
984b13K032R47k385L07J387k128m3K283p93j195J330j082j887J114K72j619J325
1001c48M49j473N90k1j364K43J579L49l84R36l31j061P90L24l27P72J691j094
1019A320q85L09J3p61N1M29n97K21L05q10o94J05p35N66J340o84o75J326n71j411
1039a838J600J429j596Q95J856k071j20J412j145O9J494r60k60J658k330k181
1055b088K594J46k186J682L79k514J095N80k527J321K025k526O92K723k418n49
1071a571K220j564m19L405j314j448L282j791k737L428N63k840K443N62l255K521
1087A485R80m752J353L781l883j29L806k987k220L658j803k063M275r85l716M050
$$ y = [-1120, -1221, 1207, -1555, -2822, -311, -1211, -2389, 522, 376, -1408, 224, 422, -1444, 368, 1076, -213, 1819, 2766, 381, 688, 2075, -53, -96, 2187, 1394, 199, 1529, 447, -1440, -326, -54, -1673, -348, 101, -1372, -782, -803, -2167, -1924, -345, 4, -380, 556, 225, -836, -46, 278, -49, 723, 2414, 1320, 435, 744, 757, -4, 47, 476, -121, 100, 405, -405, -1099, -994, -1729, -1163, 177, -507, -1182, 144, -427, -1838, -238, 1191, -405, 490, 2346, 275, 155, 1567, 422, 491, 1985, 1025, 765, 2423, 93, -2088, 506, 652, -1534, 148, 527, -1987, -892, -312, -2839, -1518, 507, -2019, -1327, 1396, -1022, -1571, 649, -915, -1334, 2071, 757, -691, 2591, 800, -1937, 1491, 2054, -786, 1657, 2219, -1036, 1485, 2465, -2287, -934, 2847, -1036, -1165, 2641, -346, -2566, 1092, -711, -2774, 1501, 516, -3200, 850]
1103H50J25m634L188K541m885J580L667l569K56L366l818n63N037k239k952M430
1119B380q72l515L137J45l083L391M48m396L072J824m662R22L202l367N11K949
1135B086l687J28L337l669p35N405k044l738M393K73l863L149L48l791L947J194
1151B733n638K956L425n741N9N393l743j810M657k973k459M518j224l532M532
1166A153o7l886L203J390m226K599K029l812J853L466m738k52M266k735j722L541
1182B062r24k009K583j748k152L785r90l722L854P84m725J959K816l625N66L255
1198A769k771j71L180k661j248L732j013k066K817n76k233K946p41k675K786N08
1214A583l287J302K086k899j5K460j881k80J879j731m48K509j556j179L303j091
$$ y = [850, 975, -3659, -471, 2070, -2815, -1235, 2432, -1137, -881, 2485, -1333, -1896, 3141, 902, -2050, 2380, 1508, -2007, 1130, 1275, -1808, 1583, 2031, -2365, 707, 2531, -2131, -1209, 1993, -1374, -863, 2086, -1601, -1473, 1864, -1805, -2540, 2865, 821, -2917, 1476, 1749, -2114, 1035, 1383, -2408, 1539, 2733, -2905, 51, 3476, -2265, -2206, 3187, -556, -2366, 2291, -682, -3141, 1377, 153, -3379, 1153, 1086, -2800, 403, 1793, -2433, 166, 2195, -1617, 236, 3702, -1036, -1288, 2978, 243, -1479, 2062, 1138, -871, 1712, -36, -2188, 1597, 607, -3115, 739, 1523, -3202, -1243, 1573, -2052, -1486, 1769, -1002, -1173, 2007, -654, -1902, 1830, 817, -1249, 1568, 992, -1241, 1705, 964, -1711, 1075, 1583, -1704, -402, 1684, -1215, -1230, 1230, -651, -931, 948, -783, -1231, 1278, -278, -1457, 1846, 755]
1230G55j967K617j03k626J842J167k724J394J510k880j27K368j604j083K373j062
1246a50j287J886p26j680J818K60j369J072J491k207L67J730j571n90K267k78
1262A033j013R75n11p90J083n9r59R66M82j703O17N64j403p92J857k49r15P56
1280f1j47j012O70J57k61M87N55o69K21O8p01L85O49m83j96J298k54j013L41k6
1300Hq7R71j21o77L08j4r58Q52K3j034P67Q36j300k04J369j175n71J239l37n95
1320g00J586j020j665J633Q38j712J075J180k053N47J952j933o85K474j332j212
1336a027K620m62k289J643M19k218Q54J619j760PJ214j631p03K185r39r80J889
1353D41l92j083J569l33j601J695R22j065O74L67j227O60M06j356J029Q35j382
$$ y = [755, -1212, 1405, 1302, -1324, 518, 1685, -1039, 355, 1865, -1015, -1142, 1226, -378, -1461, 912, -150, -1437, 449, -277, -1957, -139, 121, -1248, -176, 1315, -892, -525, 1205, -366, -956, 1311, 1033, 20, 995, 484, -306, 777, 718, -241, 725, 1207, -496, 121, 685, -718, -1510, 347, 98, -817, -61, -208, -1220, -550, -393, -654, -167, 388, -281, -60, 8, -693, -308, 341, -142, -338, 960, 706, -307, 34, 8, -79, 892, 771, 94, 402, 388, -570, 282, 305, -729, 38, 874, -426, -630, 739, -436, -1007, 232, -105, -700, 886, -134, -1799, -166, 672, -1040, 35, 1215, -838, -291, 1661, -272, -957, 1517, 185, -1027, 1593, 1131, -1158, 485, 904, -1314, -460, 1159, -601, -594, 620, -1011, -1714, 471, -468, -1448, 441, 49, -1034, 535, 202, -1399, 296, 1218, 153, 827, 1194, -33, 627, 1033, -323, 706, 1541, 159]
1370A59R3R91j870j30J272j449m01J853n13j784J215pj330J395J284j964J024
1387a62J298k027N10J551j474k16K786j189j294J659p9k119J123N47j318R33N45
1404A074j718J34O70j670Q50J117j055p63J783q45q56J241j81m65J295J43j073
1421c19O40K98j050N77Q29p64K42J127j872k54J251n84j135J287L04j136K68Q3
1439b08r81O03P74o82L33J033j402q9J043o88k08R34Km52Q58o19p19Q59L12j072
1459c69N23J135j292k89P64j065J65J377j103l88J336p87j332J688m34j219J390
1476A00Q41j938Q30P91j754M69J681j289m78K146j279j105J599m33j235J914j33
1493G27j685J551R18k402K97J687j660j28J873j241r20J769j336q83K225o29j297
$$ y = [159, 252, 1243, -627, -757, 515, -934, -1335, 518, 5, -1779, -564, -571, -1901, -506, 778, -1186, -162, 1136, -891, -381, 1170, -304, -520, 2266, 1077, -217, 1442, 1363, -756, 367, 914, -404, 529, 1074, -644, -510, 160, -1510, -660, 457, -598, -1361, 422, -423, -1279, -38, -219, -684, 611, 754, -319, 321, 619, -431, 146, 975, 211, 453, 1580, -292, -546, 705, 121, -1014, 273, 577, -559, -291, -208, -1189, -586, 188, -494, -161, 872, -530, -619, 424, -264, -472, 462, 464, 12, 870, 251, -468, 391, 703, -369, 154, 1289, -3, -292, 472, -593, -428, 949, -154, -542, 794, 7, -1325, 363, -71, -1290, 100, 941, -997, -167, 624, -1130, -661, 1020, -269, -747, 1399, 120, -985, 614, 181, -1054, 860, 727, -958, 593, 1511, -891, -594, 1093, -567, -695, 1178, -63, -983, 786, -550, -1433, 792, 163, -1134]
1510a134J908l10j859J362N31j632J386R39k004Q52J422j905k66K040j264m28
1526c62J964j592p90K241j414j587K472l38k142J890M34k220R42J395k433J159
1542c81J688j938j59K183k163m73L260j587j656K727n00k018K127j15k156K002
1558H41O03k286J081J020k950J175J556k459k5K409j603q78K393j428q99K578
1574A128p50k007K392O11k532J333J177k239J174J373k259P07J548k114k19J969
1590A292j795r44K664j135j520J629k16j536J524K72j936J868P34k060O78J475
1606I94j591N35J518j626p5J903j349j191K033k12j593J456J9j802J301M8j362
1623i94J170L10j863R79J344j973J62J543j115m88J381l08j037J665p30j024J528
$$ y = [-1134, 774, 464, -1395, -33, 498, -1134, 252, 1191, -813, 39, 1461, -444, -710, 1330, 66, -362, 1602, 10, -780, 1461, 47, -1540, 932, 594, -1548, 342, 776, -1444, -502, 893, -1540, -381, 1307, -631, -790, 1393, -770, -1243, 2017, 430, -1226, 1501, 1001, -1017, 1110, 995, -1161, 841, 1444, -842, 239, 1259, -1691, -516, 1040, -1419, -1444, 965, -638, -1516, 877, -551, -1450, 1128, 378, -1629, 763, 1374, -1158, 175, 1352, -887, 287, 1660, -599, 108, 1656, -458, -677, 1292, -503, -1447, 1217, 82, -1438, 191, -25, -1561, -37, 235, -1701, 167, 901, -1159, -481, 994, -597, -62, 1456, -170, -245, 1658, 309, -882, 1151, 939, -654, 802, 821, -981, 320, 368, -994, 176, 486, -1377, -398, 946, -1027, -865, 678, -437, -925, 456, 148, -889, 776, 46, -978, 550]
1640E50L39j489J156J98r46Q32J49j336P20Q58j600K40J263j089n63J131l85n08
1658d80L18J88p59P82J62j035P59O08j028l3R13l00p1O00o30j79N42k00k92M11
1678B76P0n25L47l0N7m26K92r0Q7q4m8k7M8l4l47O02k81j54P5J70j57j45M55n40
1702d09K6N81J15l22J18R4k11K95J01k68M96k7m97o0O16p84j63O62m14k58M99
1723A90j50n87J64K63n13P48J25j132Q75K14p24R1J077p07l43J429o32o08O33
1742D13N07j344Q57M28j134N86K80j325J52J367j416j05J062o09o81J227n46q22
1760a103J048N5l73N49j14n94O00N35r89Q49M19j042O93M24j264J84J133r54m62
1779d06J117o83p17Q80p01p36J688k83j195J042K33j365Q69M39q77O29R91j124
$$ y = [550, 889, -600, 556, 754, -192, 640, 789, -547, 173, 1031, -569, -329, 934, -155, -718, 413, 28, -480, -162, 26, -733, 49, 211, -824, -65, 543, -485, -518, 395, 95, 24, 624, -6, -185, 357, 157, -135, 276, 346, -179, 168, 138, 195, -231, 61, -29, 58, -26, -74, -101, -53, -87, -434, 168, -113, -267, -192, -22, -179, -324, 131, -409, -383, 198, 313, -9, 109, 203, -8, 287, 388, 120, 616, 589, 92, 32, 648, -136, -299, 363, -51, -309, 190, 40, -547, -383, -120, -633, 115, 240, -892, -17, 197, -527, -436, 641, -66, -409, 1020, 388, -220, 413, 920, -424, 433, 861, -273, 313, 593, -732, -580, 787, -629, -734, 328, -281, -962, 265, -281, -1103, -55, 0, -373, 176, 62, -532, 68, 603, -386, 463, 882, -160, 533, 957, -307, -123, 1010, 56, -406, 711, 28, -689, 191, -510, -1246, 442, 159, -1036, 6, 239, -1126, -257, 182, -695, -66, 925, -199]
1797a99K52P81r81j21J478p22j091J662l31j378J038J40j141P74O18j383M31P47
1815E74j560L24J308j067k68J723j036j001J115J8r11J063J83q29P43M44j467
1832f44O90R36j319L66P54q50k01Q95r11k63Q11l73n14J017k73p89M73L05q66
1851g56J056P4j051N33M91q84j9J378r87k50J065k34p37P37m18o37J299j68r35
1870d43O38M71j265K19P57q15J97J020r75j90P64p82l86J100j2j058R01K02q75
1889e32M85K66r47P64O76j072N8R81l81j054R19J11p4P46q97o19Q99r8q53P37
1909A15K71q04J06P01j163K62O06p18J67J006m52q92J254k37q20P34K72p04Q03
1928E07J68j160O27O36q97j57J214o19n89M89n95J03O22l24q00J187j90j256J002
$$ y = [-199, 53, 834, -147, -268, 1210, 488, -603, 1059, 728, -650, 388, 528, -613, 161, 779, -604, -173, 574, -986, -662, 646, -421, -689, 1034, -2, -1003, 112, 130, -781, 282, 465, -364, 379, 823, -644, 46, 982, -337, 29, 783, -67, -268, 627, -284, -547, 264, -109, -623, 394, 121, -668, -195, 110, -756, 300, 374, -677, -144, 347, -537, -556, 822, -165, -415, 650, 416, -321, 416, -2, -639, 660, 492, -443, 195, 666, -599, -380, 377, -438, -241, 779, -196, -386, 378, -404, -790, 310, 298, -760, 141, 343, -532, -47, 219, -728, 36, 712, -360, -302, 679, 298, -756, 163, 274, 200, 946, 49, -570, 329, 231, -622, 115, 386, -418, -312, 389, -774, -512, 94, -624, -457, 549, 97, -795, 459, 222, -598, 136, 408, -296, 507, 675, -485, 142, 778, -119, -276, 938, 319, -270, 219, -376, -273, 349, 25, -775, 412, 222, -1034, -32]
1947c2M04j137N62R00p84M9Q79j101M12P15o94o30J293l57o45M18r3m85N47m2
1967A79o75N84L99j269K13P52q07j66Q92m48l90J061n89j56O76m91r4J058m05
1986C24p79Q26L35p59L03K55q29K89Q51j023j04Q77q38k00Q82p55j79J014n24
2005c4o71J027n3r79J036N21j757R16N07r66M48L91n18K28O42q33m14J147l74
2024B64n67O96n0r09R45k6j128P70L57p90J04P40p74R6O01p12n7Q18m48l42Q95
2045D83m00r5M27k68o28N30O67q77K20M61l58k9K32k31j63M54l94j86J47o2m13
2066d83Q39l74m36L66J26n81L83j0l42L23J01L4j36K37L1l3L65l78J3K65L6l51
2088eK71L7j38RJ2n7m3O8j57RJ11m19K54k03O5k61K97J53m85J4M21l09L56k3o3
$$ y = [-32, 372, -765, -203, 697, -87, -38, 841, -260, 152, 867, 173, -457, 836, 479, -166, 252, 159, -326, 221, 179, -496, 88, 487, -782, -569, 183, -624, -790, 102, -346, -736, 325, -264, -420, 256, -235, -329, 729, 324, -455, 371, 706, -53, 250, 505, -324, -35, 816, -207, -311, 566, -272, -472, 410, -345, -524, 490, -34, -705, 322, 269, -710, 326, 847, -910, 6, 513, -453, -5, 386, -132, 96, 738, -95, -509, 638, 264, -303, 393, 343, -566, 379, 353, -775, -5, 352, -438, -334, 406, -368, -272, 329, -383, -440, 378, -70, -412, 483, 83, -12, 415, 147, -481, 49, 716, -161, 59, 520, 162, 133, 365, 134, -29, 425, 31, -155, -8, -70, -483, 356, -18, -454, -88, 38, -543, -160, -170, -512, -189, -88, -54, -190, 47, 78, 45, 410, 32, 45, 310, 346, -5, 266, 303, 165, 174, 186, 129, 86, 154, -3, 6, 117, -302, -48, -251, -186, -447, -150, 3, -482, -468, -47, -356, 0, -23, -86]
2113h6p6K72K82k58J94J56k15j98K3J53k16K49l43P6L72l26m34M44p0m91L86J78
2135G2m31M23J21p19N18J50m57M2O09l09j42P45l29m87P63Q4j127N51K57q87Q21
2156B68k1n53L7L51o88J60Q54q87J38N92m92k61M79K20n90O83m9n80Q93k9j077
2177e52O66M61o51R5N98o89j26N86n67l06J267q92m13N13M3q50R14j61n57P19
2197I8J70r08L28R65j016L97M24m89k1N07q04l7J035q37j04Q46p0j144P98K88
2217D26q88O56L2q62R06K80j221J66R10o53k30J081n35l00N83n13j63M71j85l50
2237c89R13p7q88L26O70r60K39O05r41M85M49n74l9M06j27n18P52l21m23O40l76
2258a48m59Q69J63j023N57M82r43L87L50o73N8Q42p51J53Q69p53m04J093k65q44
$$ y = [-86, -162, 110, 392, 134, 328, 484, 269, 71, 94, 247, 31, 280, -63, 13, 385, 59, -375, 69, -1, -492, -106, 72, -359, 64, 185, -534, -16, 134, -323, -281, 328, 19, -123, 622, 293, -194, 569, 653, -474, 77, 334, -553, 268, 247, -306, -269, 82, -606, -446, 408, -479, -341, 251, -241, -502, -23, 197, -393, 290, 241, -339, 554, 525, -552, 114, 575, -76, 19, 617, -72, -198, 388, -179, -485, 782, -110, -523, -10, 33, -817, 97, -64, -621, 98, 268, -640, -312, 653, -363, 34, 458, -31, -52, 455, -349, -386, 649, -188, -292, 554, 484, -660, 138, 426, -462, 194, 226, -636, 270, 550, -671, -505, 405, -248, -478, 603, 68, -232, 351, -162, -325, 146, -39, -389, 524, 447, -441, -115, 555, -405, -166, 439, -502, -17, 432, -142, -181, 225, 98, -420, 332, 11, -412, 228, -148, -607, 262, 425, -598, -41, 441, -502, -115, 235, -438, -380, 462, -289, -136, 733, -20, -424, 669, 404, -440]
2278d40Q53l16k76M8K55n58L51M37o95J58L50m87p2L59q1l30Q51k40m39O88m02
2299A4n49Q30K4n39M63K46m46%L00n98L04L75o26k35Q83l51k60K25R6l53J65j57
2321a89k47L56J05m00J85J32l53M84M06p06m1M16k2OK86k44j98L07pm39L37j30
2343D4k48M94l42l10O3M33k57l74N46j73k02M26l3m03K27K60l30M17R2n20L69
2364A79L10j91j3J56l29l03N29j82l26J63L08m29J73M1n96L49L09o52M19J39n41
2385d87M78M26l98m01J25J01M6N17j66n00M18l2k80J64K00k95j3N83n69j8M11
2406C10l66j01M02k1n57O92k51l13K17J75n81K33K53l58J44L49n55J80L94k47
2426aq9K73L9k97N71l78n81N88p7j83K70J82l08J25R8k49k4K50k14k26L48n11
$$ y = [-440, 413, 97, -179, -131, 124, -434, -83, 354, -341, -183, 167, -320, -392, -33, -114, -444, 407, 167, -272, 416, 14, -535, 295, 319, -220, 243, 489, 43, 43, 343, -255, 49, 424, -202, -437, 446, 95, -165, 60, 156, -197, -32, -189, -436, -80, 25, -375, -190, -58, -411, 73, 479, -227, -268, 148, 126, 132, 418, 174, -24, 283, 276, -163, 174, 44, -204, 290, -52, -362, -299, 134, -123, -497, 49, -124, -326, 100, 67, -336, -109, 151, -179, 238, 330, -190, 179, 489, 298, 285, 441, 112, -191, 338, 156, -170, -7, 301, -128, 45, 86, -510, -161, 148, -504, -85, 54, -487, -9, 417, 19, -382, -257, -156, -110, 407, 241, -259, 159, 127, -153, 11, 211, -84, -97, 486, -83, -101, 310, -56, -157, 245, 224, -333, 359, 108, -205, 12, 187, -394, -161, 92, -266, -122, 227, -328, -148, 246, -1, -90, 183, 222, -75, 496, 118, -463, 125, 48, -135, 135, 317, 9, 134, 232, -17, -41, 209, -5, -231, 117, -394]
2448c94rK82R7k84L55m0j33J12j22j83L66l6m42M40K13l34J00K23k45j33O39n2
2470D20l16L19m40j56K02P1k02J59J22l88j07N17n72J35M49l11o4L37j08j86J77
2491E8J16q6N2L12m49K77K36m20L12j03m30K32K12m42j78K38r4O6J40j6k38L41
2513A36j50j53k30K67k0k5K97j33j07J7j02K66L25k33J18R6k36k6j25J11q3mr6
2536i0j7MK02m01r0O80j32m65N44j16k90lM07m23L01n2j71J28J30j56k1O3K8j18
2560e8J42j22l77N96j60l78L28P5k98N8M26m52pL44j11k73N73j57J40R7m07j10
2582a31N14k85j58N9M80o00L80J83n05j12J75j92J66J28l76L42N0m02q9M58l04
2603b19l98Q30P2l92K99n4o75P00J02n34L16J09k52rL97k90k69O50k31l83P56
$$ y = [-394, -403, -121, -24, -308, 47, 7, -126, -14, -136, -319, 47, 11, -431, 9, 222, -112, -12, 211, -34, -167, 472, 420, 104, 423, -17, -173, 29, 100, -102, 57, 179, -209, -316, 201, -371, -236, 213, -98, -162, 175, 67, -119, 58, 174, 88, 140, 452, 3, 280, 516, 96, 408, 305, -125, 107, 319, -123, -301, -63, -157, -91, 49, 33, -205, 136, -14, -167, -397, -130, -150, -175, 122, -11, -118, -101, -203, 63, 388, 155, 273, 369, 133, 107, -18, 93, 10, 6, -90, -107, -103, 99, -302, -392, 288, 156, -309, 235, 119, -171, -174, 233, -190, 111, 59, -112, 16, 146, -10, -31, 32, 60, -58, 84, -38, -415, 181, 21, -357, -29, 46, -252, -194, 232, -220, -227, 117, 6, -267, 306, 149, 289, 386, -21, -131, 383, 98, -60, -1, 479, -121, 259, 442, -63, -175, 0, -192, -26, 102, -274, 68, 118, -284, -373, 85, -219, -617, 213, 285, -107, 192, 138, -537, 163, 265, -269, 47, 156, -96, -105, 292, 2, -267, 383, 152, -231, 525]
2624E25o19k61M25J40o16M82L42q37L31L19o98K93N15n13k20O21k88L8K42m97
2644b76J22K76L2o24O24o2m67P19%l96L50o5j36k7M48o35j84K84j06R5m6J84m50
2667c40L24j02l46M07Q4j23l2M11n65Q2O16m29LN93m90kL70m67m7K71lk57R8P3
2691A29l82L84j13k77L40J04n21k1L83j36J41J00k93LL44j58j6Q9p0j58M26Ol97
2714i3L08r8r0j15M62n29L92J67m66oJ50m9l71K88j90L0K96l23J7j6Q6q7J85J53
2738A01j21J06m1j01M13l66L20m0P9m17L57j54k5j30j24J01j07P5J38l39J47K27
2760I9j50l4J54l9l7P1o2o1r0L76l66L61qj13l4J41n7j36J31Jj29K05o5l20L02
2785A40p7JKJ16l79Q5J06Q1j91J05p8N8k89N09l66L14j84k36O63k60m00K80K50
$$ y = [525, -94, -355, 70, 210, -406, 76, 418, -419, -88, 231, -467, -174, 341, -172, -392, 229, -59, -21, 221, -276, -154, 122, 154, -470, 154, 92, -375, 344, 344, -52, 298, 233, 97, 70, 518, -117, -301, -17, -123, -28, -74, 110, -340, -16, -118, -464, -57, 27, -96, -128, 283, -282, -200, 416, -13, -10, 583, 93, 91, 461, -6, -53, 218, 215, -42, 56, 129, -253, 131, 18, -259, 81, 185, -336, -357, 26, -110, 31, 131, -162, -159, 185, 27, 11, 100, 30, -128, 298, 304, -93, 215, 117, 27, -88, 374, -155, 237, 404, -62, -68, 82, 33, -338, -50, -240, -210, 86, -237, -220, -236, -150, -237, -52, 101, -20, 86, 45, -56, 357, -9, 311, 271, 350, -67, 290, 136, 111, -19, -143, -42, -149, -74, 64, -275, -128, 99, -51, -85, 69, 30, -7, 64, 2, -59, -149, 227, -139, 222, 214, 101, 67, 208, 151, 15, 146, 147, 18, 223, 158, -162, 140, 63, 64, 66, 182, -197, -112, -6, 75, -116, -11, -89, -31, -320, 189, -177, 137, -47, -283, 380, 120, -280, 0, 250]
2808B50k04n3J46j66K83j72j30j33M36j96j45K87k88O8K5j51K8K07o0j60P2K13
2830A57l47K3M50j51k44L46j50k49L11P1l07J69K24l09J0K59j58k6J8j67K54j22
2852F2K2j59j24J19k18N58o0o87L77M23m96K08O0j2n0R2n2R7K14l59l5J18j41
2875d3L4J96n6k7K31k79k47K52l11Q5M6L67m99J40M01n97J06K55l68K55K76k37
2897b0k0L34m03J4K64O4l35M10j27k96QN04n24J4L39l19P2J20k94q9M58r8n8K3
2921D1k87n8K42M1k71L31RjL5R5P3k30Q0R0k02Q1J5j58M8J7k72L52m1j52J87l5
2947C0k68J65K89k94k34M12n7M3J43j27k43M35O7l34k1M23m15j19O26m11j49o7
2969a06J53j63J86j80j09J80o1j6J86M7j80l1Q6j97K31K19m98K17K70j09j25J81
$$ y = [250, 46, -7, 139, -27, 256, 84, -46, -179, 257, 61, -84, 203, -85, -17, 8, -143, -115, 92, 32, -128, -56, 157, -190, -167, 283, 132, -112, 234, 84, -165, 146, 217, -90, 79, 303, -6, 4, 263, 105, 79, 97, -70, 184, 62, 84, -75, -199, -80, -298, 260, 200, -487, -110, 313, -183, 25, 85, 73, 23, 115, 63, 160, 374, 15, -20, 98, -43, -9, 187, 131, 104, 335, 56, -191, 61, -250, -165, -119, 248, -251, -111, 290, -307, -201, 54, -314, -59, 217, -20, -40, 294, -109, -95, 169, 233, -102, 308, 181, -115, -107, 397, -127, -113, 226, -93, -21, 99, -195, -284, 174, 76, 18, 41, -246, -304, -62, -21, -292, 39, 48, 47, 82, 177, 250, 20, 100, 190, -12, 69, 84, -74, -26, -9, -281, 71, 30, -122, 65, 30, -238, -73, 216, -78, -312, 100, 43, 86, 229, 102, -141, 294, 361, 27, 6, 429, 14, -105, 521, 110, -39, -106, 47, -116, 70, -110, -219, -39, -100, -116, 70, 117, -63, -94, -8, -205, 26, 245, -253, -36, 234, 125, 0, 181]
2991A81k18K4K33j10k15O6L44m78J60K03l84J20J18j50R8K67J1l94L43n07J53
3012a35L40p5l74J27j01L7K08K28n22N00q1k13j01L02j72K14M5k96j41L33m6O0
3034A37O5q7k54M49j84m96M02K48l37R1L6l0j40k2j93J57K56l68K17K85m04R8
3056g4J71k30J89L0K48l57K94q0k40J84M6k43j78N43m62j6K36p2j9Q4r9l66L69
3079d2o3j34l5N62m44N5N42n71K17J60k82J47O2j39j61J92m0j24K03P8k32R4k51
3102b06m1J27m6k81L21J82l71J90L23k67j57P1K63q9L7r2J61l7J45j11OK4k58
3125a06K96j12M3J3o9k83K74j10R6q9J52l01J18j50K56k05L17j50J00J39k85%
3147e6J85j69K32k88K32j41r2L00l80O2QJ20j9J03l2p2k4j79LJ25J6m4M5q7q5
$$ y = [181, -37, -13, 220, 110, -105, -39, 305, -173, -13, 190, -194, -74, 44, -106, -8, 259, 270, -124, 219, -288, -135, 205, 130, -244, -117, -218, -181, 27, 255, -267, 233, 152, -61, -162, 140, -32, 182, 227, -69, -210, 123, 77, 137, 202, 115, -139, 310, 126, -370, 32, 280, -57, 34, 70, 40, -100, -122, -315, -158, 98, -270, -53, 232, -172, -74, 97, -133, 56, 86, 334, -23, 271, 191, -49, 135, 181, -62, -240, 303, -159, -175, 61, -11, -30, 54, -45, -411, -42, -105, -239, -274, 288, -156, -101, 441, -130, 87, 247, -35, 112, 174, 35, -126, 66, 26, -98, 105, 183, -49, 45, -206, -247, -120, -166, -447, -126, 56, -315, -125, 198, -69, -226, -155, 108, 19, 56, -36, 125, 88, 233, 122, 128, 152, -106, 190, 78, 121, 134, 65, -218, 56, -54, 42, -47, 105, -196, -78, -228, 28, -177, 140, -10, 90, 229, -56, -56, 129, -40, 192, -96, 136, -5, -97, 203, -177, -115, -107, 13, -6, 97, 65, -7, -31, -210, -207, -82, -66, -110, -65, -152, -237]
3172b37L23k8N6l06M60j69N0k62j23K93p3K7j20L01l3j65L4K12k87N9J71k36o5
3195a18Q3J5j25PjL4J09j19k71M01p1K23j73r7K35q7J71k44j3M8p3PJ78nl4j37
3221e7J56rk8Q1m9n0j79P1j21J80J02j16j5Lj81J02K70m1l33J25J14o5k1M4N8
3246D1K19k86R8j57K63R0k66L34k83K3K11l27q6L45o44Q3M24o7l11K20k20j53
3268d49L43J49m30K83K71k94K8N05l32J15p1M0k34L33k58J82qj86J4r6J02q1K5
3291d9N3j30K70J77l72r9l5J0j7J30o5KJ37r0kJ7R2j81r5L70k18r5M72m04K83
3316A61N1k44K35m0l37j10K10J30j38lR2QP3%k99M92j5m71K98j67P8O7j66K9j15
3341a81K91k8L9j42j62q1O44n83J38K57J0j38q7n1k45L5L84m76M70j96J32k55
$$ y = [-237, 86, 58, 114, -192, 268, 99, 149, -113, -236, 57, -16, 11, -109, 192, 159, -6, 28, 240, -47, 12, 183, -53, -118, -35, -20, -145, -138, -139, -105, 4, -115, -386, 15, -56, 167, -6, -103, 132, 45, 216, -28, -41, 7, -66, -59, 119, 114, 80, -57, 99, 90, 62, 143, 94, 44, -135, -64, -185, -5, 97, -19, -34, -31, -212, -110, 160, 119, -214, -89, 25, -40, -61, -17, 41, 260, -26, 72, -85, 178, 268, 2, 336, 53, 76, 287, -40, -126, 219, -425, -342, 82, 15, -296, -76, -296, -449, -106, 43, -387, -104, 167, -127, -99, 406, 74, 189, 118, 158, -76, 257, -1, 181, 173, -13, 1, -95, 7, -74, -49, 4, -126, 144, 321, -51, -150, -185, -175, -192, -62, -127, -125, 12, -78, -80, -63, 29, -152, -247, 123, -95, -190, 282, -122, 161, 212, -32, 203, 163, -174, -284, -74, 56, -82, -85, 7, 15, 88, 88, -211, 281, 266, -205, 93, -74, 4, 71, -95, -66, -181, 110, 82, 121, -21, -183, -264, 380, -203, -65, 192, 202, 64, -23, -74, -319, -284, 100, -376, 94, -102, 30, -225]
3363b25L26k22lL15k27R3j25P1N3L12m22L7QJ94j79O4rj06nKj21J27L5m8o3K55
3389A37m98M54j49k8j18k2L74k76k10L62j19K32j12L2j63J47J16l71M01l29Q1
3410e9K87kn42M13J9k43KJ20j13j16J37m8J59q1L5Lj24m6K67j5n5j8L4P6j50n0
3436a10K95n3j0r4P3l18L49p2j33J02r2J03n4o5j55K64p8Q6m19L79k83J82K20
3459A17k12O8L34n20K53J43O3j14L48k67j79j13J60k21J18K9p9K80j89L7j33K05
3481A28m60J77J23l9j07K6J47k0nR6L7j75K61j68K61j61p6K62l36R3k94K60o0
3504c0k3L9O3l19J61n3j5J62K5j42P3K7m7n5j22K39r6L13k76K92j19j28k44N92
3528C17l23K0oN7l05M02l4k44K32J17l44M3J00j57j77L8K68l21M05l12J06J10
$$ y = [-225, 101, -121, -124, 191, -36, 57, -68, 3, 56, 368, -54, -17, -9, 185, 6, 70, 61, -45, -50, -48, -169, -42, -7, -55, -118, 137, -361, 93, -56, -84, -202, -224, 150, -126, -336, 26, -93, 139, 27, 59, -104, 43, 159, -212, 189, -140, -59, 228, 226, -316, 97, 116, -127, -125, -5, -118, -234, -97, -145, 14, -67, -32, -29, -153, -199, 68, 53, -2, -20, 14, 90, -60, -110, 185, 132, 122, 28, 101, -217, 132, 60, -73, 29, -63, 40, -14, -79, -234, 30, -48, 38, -381, -2, -285, -103, 117, -95, -27, 307, -213, 40, 183, 246, 132, 480, 213, 34, -79, 81, -140, -22, 7, -72, 208, 19, 56, -77, 128, -332, -155, -32, -71, -178, -152, -5, -25, -30, 66, 103, -72, 189, 21, 282, 121, 45, 307, -29, 64, -230, 30, -30, -53, -14, 49, -270, -109, -162, -177, -15, 10, -132, -59, -32, -79, -134, -256, -17, -113, 200, -76, 216, 97, -31, -275, 317, -6, 14, 8, 65, -240, 162, 128, -116, 116, 233, -111, -68, 32, -125, -302, -264, 4, -317, 88, -224, -118, -8]
3550hqk2J33j45n3K31K4j65J62j04o6mO2j56J37M7J06k73L32j19j71K8j04nL67
3575B26l3j79j28K70j60p9J35k12K87j61k15K51n7J4K8k3Qk7r7R0p0K25K91m26
3599d2J09Qq7j10J39Rj8j16J48r7L4J12m2nK17m55J0MP2q8P3M32l93j13J57N6
3625A4O5l6J24j55L23l34j89K77%r9j07K89j71K04j92j83L81l43l6J93j10P5k7
3648c7P7j56m0n6L7L76p1j99J18J46k0k1j95K29k17J00J15k69J06J73k32mRk5
3672e6J54j89j1j9J52j53K3N1q2J73k1Q3l9k7K41m1l09K96l02K3K02m9j49J89
3696A40j91k19L51j16P1O3jm52L34J79m17J33L61k33O0J29k46m7J97P8k60M62
3718C76j72j65k6K5o1%J97k84j75K81J60k70L98m91K57J31j12j09K45j38j29P7
$$ y = [-8, -16, -38, 95, -50, -103, 128, 152, -13, 149, 45, -21, -25, 37, -119, 18, 65, 171, -102, 230, 111, -60, -32, -136, -141, 226, 193, 14, -114, 156, -4, -83, 52, -160, 127, -34, -249, 2, -55, -41, -13, -36, -28, -55, -152, -62, -132, 93, 384, -42, 67, 75, -12, -122, 17, 26, 8, -108, 40, -57, -23, 89, 47, 42, 259, -196, -186, -182, -110, -198, -125, 307, -86, -199, -42, 14, 79, 43, 167, 12, 335, 1, -188, 89, 89, -10, -117, 172, 1, 205, 13, -170, 211, -132, -168, 25, -85, -10, -37, 40, -116, -156, -212, -175, 201, 130, -69, 49, 195, 175, 154, -41, 188, -29, 71, 186, -83, 23, 196, -36, -40, -31, -56, 98, -91, -102, -121, 31, -122, -99, -48, -130, 43, 22, 105, 66, 39, 280, 239, -70, 226, -76, -53, 149, 100, -49, 140, -51, -270, 81, -35, 36, 99, 98, -354, -20, 159, -258, -125, 236, 3, 63, 192, -54, -101, 96, 174, -86, 376, 204, 39, 13, 38, -23, -23, 174, -110, -285, -4, 156, -114, 284, -207, 50, 181, 69, -40, 205, 67, -62, 15]
3740A5n4k26N20j24j66K30k28q0L43L2k68J93j99r4j06K00J8k88M68j38K0N9j19
3763Hm2RJ46j63k5L75n72J67j65L18jm35L91lJ2J42J3j2R2l17L54j78j85K62j90
3788AJ15j32J51j63J40k8l60J45K20Q3j53k71Q1L7J42R9k49Q3J98k07J87l1n5
3811C3J08K6j98L8L9K35q9p6p3o5l0j4N0l9K6J05j10j14J7N9j81K26j71M00l43
3836a41K07m35N05j41m3j11J92J40J3k30M17q1l08K15K2r8k12P8j28J53K82j28
3858A68j40j10j58J11k15L28R5O6P6k06p9j99N67m37L17j56k39M52m25J25J42
3879H3R4k39J60J90l53L3p2O6P1Q6j3k49L5J32k11j0j03J49l7K38J22k20L08q6
3903A74k83K46NJ59j53p7JO2k51J8Q1K53k35p0j50J12J48l5J44k10J37r5j44M12
$$ y = [15, -39, -265, 255, 131, -35, 195, -33, -113, 230, 262, -6, 187, -12, -106, -212, -12, 6, -282, 186, 48, 68, 127, 8, -34, -25, 121, -42, -67, 308, -264, -97, -262, 56, 55, -380, 11, 8, 20, 162, 175, 163, 255, -62, 292, 114, -71, 191, 1, 116, -16, 135, -28, 112, 84, -276, -131, 89, 172, 19, -252, -171, -134, 8, 107, -142, -59, 139, -68, 119, 88, 33, 141, 167, -31, 7, 46, 281, 192, 116, 43, -22, -52, -66, -16, -55, -29, 76, -34, -148, -131, -72, -253, -27, -198, 202, -141, 66, -369, 136, -5, -48, -159, 33, 173, 186, -44, 373, 292, -16, 199, 221, 123, -89, -11, -139, 14, 296, 168, 28, -82, -240, -129, -344, -16, 79, 145, 221, 15, -64, -263, 304, -133, 184, 28, -211, 241, -184, -59, 83, 177, -62, 98, 288, -65, -32, -104, -38, 33, 119, 106, -143, -108, 24, -187, -197, -300, -151, -188, 50, 172, -48, 260, 174, -109, 137, 142, 301, 148, 71, 72, 134, -117, -99, -18, 235, 0, -70, -220, -108, 40, 5, 149, -61, 76, -19, -163, 249]
3927B49k61J24l05J6J29k0p5l04M95Q9k13L63j25l91L31j8k40J92J9k77K42j97
3949a77L05q3l1J57l89L11r1j02J77j64r8J62p0j1j9j32M38j43q0j11J86J16j94
3972d3J99n0m0R0j33P5k10K8J57j75n1J39j96J79M2k37J98R9J59j80j01k5J67
3995I1K7k14p9K04Q0j98J0J79k07n8K11j07P6Q1L7j84j66J73j61K22Q1Pj49J00
4019E6M3j41r4P6J59k88l9J70K83j05r4M1QJ1r5k2r1J70K8k07L57p4k24R3K9O1
4045A11k89N25n58O0Q2K13l58K58l2q4M8J26j38J61L7j32K1J39J24k80L0K1p9
4068FJ28j21J57m9L2l21p5J52rJ64R1k52n4J36n7k7Q8J10p7j16j4K0J24j31M3
4093e2q4K13j09r1K05J04j05J2q7J34q5k21M89l01P3j37nO8oo0j52J13q1K36m3
$$ y = [249, -12, 112, -193, -177, -48, -68, -143, -447, 48, 137, -76, 287, 162, -229, 102, 84, -156, 36, 55, -222, 20, -177, 128, 45, 14, 171, -218, 93, 2, -100, 77, -87, -185, -23, -93, -104, -123, -255, 183, 40, -40, -151, 35, 151, -43, 156, 106, 66, 156, 23, 98, -112, -84, 73, -102, -153, -14, -210, -31, 11, -226, -28, 71, 230, 50, -51, -76, 91, 118, -96, -175, 29, 109, -89, -79, 100, -107, -165, 46, -61, 15, 96, 133, -51, -217, -44, -205, 17, 98, 105, -44, 56, 99, -42, -136, -60, 99, -189, -228, -58, 225, 120, 26, 67, 75, 86, -9, -31, -122, 48, 76, -131, 226, 152, -72, 21, 50, 111, -178, 347, -211, -151, -69, 144, -214, 44, 12, -72, -24, 102, -36, 125, 162, 30, 51, 190, 314, 34, 64, 85, 6, 134, 13, 170, 121, 153, -168, -243, -91, -100, 64, 155, -97, -151, -15, -72, -99, -11, 99, 22, -94, -108, -88, 36, -95, -52, -136, 77, -32, -123, 82, 186, 81, 93, 6, 140, 55, -166, 323, 22, 95, -42, -47, 21, 15, -45, -197, -84, -165, 71, 28]
4118B8R6j37N6j97L4J29j35M0J50R6o3Ml20M67k26L9o4j33M4K77j31j53R7j23
4142a25N9J83l86J30K07P4l5k32K96k76j2Q1K32l65K53J03k00l8P9j75K84nm00
4165b68L83l53M30l5k5j39n7J66j39k39L23l07L95l91K8k2K67L8j24N2M4p4J88
4188A41o0j59K00J11k65K4K69p0k18K36k05r0l4O0Q3j0Q8k47J13L4Pk28L81j49
4212A2N2k3o9KJ2j26L23j6l0j30R0k55K25JJ27j82M4j24J76l03N3K35j99M0p1
4237a36J98l7r3P3O1j68L03l50K03n6j5J38p8Q5k80J89J60j89K13R0k87k17J09
4260h4K53l36J47N9j77L3k61K32J35j19L09N8k78Q0k47O12n33Q5k3j02J53J99
4282A95r6J80m26J79m5q2L2j2L2pL6J10j23K1r7J99m29K73J84r6j15Q6N5J20l72
$$ y = [28, 124, -13, 43, -154, -120, 9, -126, -86, 64, 160, 97, 101, -219, 248, 22, 61, -3, -136, -92, 185, 54, -99, -2, -125, -66, 117, -269, -139, 68, 142, 107, -125, 171, -105, -117, -36, 196, -169, 84, 187, -13, -51, 28, -147, 137, 132, -268, 115, -238, 192, 157, 132, -7, -64, 102, -37, -276, 47, -260, 135, -256, -228, -250, 17, 55, -69, -17, 27, -47, 141, 81, -78, 122, 233, -32, -8, 261, 191, -27, 209, 4, -86, -120, -60, 23, 13, 101, -146, -33, 1, 8, -220, 161, 12, 64, 41, -28, -26, -14, -140, 183, 167, 137, 7, 97, -158, 67, 68, 195, 13, 57, -67, 109, -194, -141, 94, -105, -65, -136, 62, 25, -68, 5, 66, -102, 201, -149, 54, -2, -17, 121, 43, 128, -152, 37, 197, 8, 221, 311, 24, -193, -84, 169, -167, -20, 39, -138, -105, -366, -134, 1, -118, 191, 249, -29, 51, -196, 416, -117, -32, -55, -157, -4, 195, 99, 279, -147, 32, -13, -95, -63, -75, -43, -50, -14, 96, -27, -6, -103, 96, -333, -60, 124, 28, -87, -1, 54, 174, -198]
4307a98J37L10j14j82K08j95O2M4j41K88l60J22o2K6J17j2m0L10l04k8k45P4J08
4330g5p7M06j13m1j98k0K14p9N1j62k29K95J05K2j57O9J34K7l35K15J12j24N6
4353I6q8N4j11Q4j06Q4Rjk1J2l1Qj3K99n28M13k12k06K18K58j61p1j30K83Lo7
4379G5J70k11PR5l19M76n05L03M8J5l1j86J59M1j11k8k5j23l8J76j07J8j25J87
4403c9K1J68n4j18mK52j00p6m0K22k29L9k63M01l6j97L69m18k4L2o0P0J29nL7
4428G7o3J03m21K54p7L10k13j16L87q1J48j83j67J61N5Pl4l1Jr3J60l09q1L38
4452A32l11J13o9J66k03K63j8j86Q5j22L14q2j08j49L54j78L5MK39k50J06q0k25
4475a70K28M3q7m6K38l61oJ13J43j05j07K40k38J69R7l17r9J75J04l3n0L06k11
$$ y = [-198, -61, 249, 135, -47, 161, -34, 28, 72, -69, 219, -141, -19, -81, -55, 62, 50, 10, 320, 16, -12, -257, -183, -75, -152, 254, 141, 100, -98, -118, 96, 17, 68, -94, -323, -28, 77, 99, -58, 11, 145, 172, -163, 52, 164, 40, 96, 8, 62, -49, 35, -71, 13, 22, 21, 0, 12, -19, -11, -24, 275, -253, 160, -52, -258, -40, 218, 57, -14, -144, 139, 142, 75, 245, 34, 41, 136, -183, 293, -212, 91, 139, 154, 123, -63, 96, 137, 26, -2, -27, -150, -188, -12, -119, -101, -226, -39, -18, 150, 96, -22, -26, 226, 126, 50, 10, 232, 3, 42, -221, 180, 144, -53, 316, -102, -126, -94, -154, -84, 45, 40, 77, 14, 117, -304, -50, -127, 183, -30, -146, 241, 160, 308, 125, -42, 119, 174, 181, 147, 116, 117, 24, 184, -125, -206, 132, -179, -66, -135, 31, -172, 91, 73, -113, -28, -150, 164, 82, -26, -175, 179, 1, 36, 40, 279, 29, 135, 55, -170, 58, 101, 14, -32, 206, -155, -161, -48, 95, -10, -117, 123, -115, 54, 151, -166, -265, -90, 14, -19, -69, 237, 26]
4498B6j29K94j65j37K20k09J0J81k61l6J71M4qJ22k74k3J54l5K5M6q1k23K08K70
4522A90j08r5N1L2k47r5Q3J40r0pQ3J66o5j47K37m06K52M8j6R5j16Q4j10Q0j79
4547a40J92l4j02JPK71k09k25K26r0kJ07j09J08n4Q2J6j72J73j30Q1l2l1J10K52
4572B96m94L5K28K42l26J39j48K18l07M1J87j01n1k34J22l9K41J62o0k95K31O8
4594A55j61k4L5l1j7K61k00Q6K49q4k94K17j64j21R0pj98J42P6j61j21K04k3j6
4618a07k8l7K31j0k63K04Q2O8j55N0j67J37k34K27N0P9Kk80L47l42M7r2J23k20
4642b88K00K14Qk58J91J40k69K89j42j48K27q7N0j20j24K07Q9n0k79L13p8J90
4664B75m21RK16L0j47K49j73q3q2K74k6j74k49L20L8j12O7O4j98J94J78l78J45
$$ y = [26, -103, 191, 26, -111, 109, -100, -90, 91, -170, -206, -35, 9, 1, 123, -151, -174, -20, -55, -30, 16, -65, -288, -80, 190, 82, -13, 38, 70, -177, -272, -189, -49, -139, -146, -63, 103, 38, -109, 128, -278, -26, 22, 6, 101, -15, 69, -41, 39, -140, 52, 18, -84, -83, -76, 195, -14, -239, -13, -103, -105, 2, -107, 1, -53, 29, 45, -127, 46, -84, -3, -35, -66, 44, 296, -198, -163, 65, 307, -19, 120, -28, 190, -117, -76, 111, 10, -41, -275, -153, -192, 49, 211, 151, -144, 87, 155, -6, -30, 5, -26, -43, 218, 18, 104, 353, 269, -25, 192, 28, -93, -3, -10, -208, -66, 10, -151, -272, -68, -91, -107, -135, -172, 59, 49, -214, -10, 72, 140, -15, 35, -132, 5, -229, -2, 48, 127, 129, -151, 196, -146, -99, -191, -68, -288, -88, 126, 134, -124, 67, 207, -62, 227, 85, -63, 164, 77, 127, 7, -117, 90, 179, 129, -150, 163, 85, 275, -146, -137, 79, 109, -38, 211, 38, -45, -127, 147, 121, -53, -302, 18, 56, -56, 11, 75, -123, 71, 249, -129, 16]
4687A6j05J46j19L0j19J74m0J71j37M4k71J36O0K24j12o6m9j63L39k84J22j41
4709a44MJ24K6j20K45m7k64O8M35P7n00J86k05J45j14J48P4j50Q2r5J02j12J7
4732a8j26K89k69J86p0J25M4q4l31J39k6K63ql2k30J3j19K51J59n8J86k14j63
4755i3n5K25r0L07l70K43j39J94l24Q3J27j53N2MJ3%J78k73J12j24N0J11l36M26
4779A68k27J88R7k87J5J51j45P5J3m6J40J3j77N9j78O7j11L77l30J01J29j48j36
4802a92L9R6jK71k25J9J00N5j92K3k64M69k58O0j76J25J57l64J94L90l29Jj46
4825a48L27m4r0rl01K53N8l27J16L06P9j89o8j27J16J69j57j03J56L7o2L3J1k09
4849a73J26L40j36j47N1j3k21J54J06m1j21K1J19k5j04k38M51j56p7J59J23j04
$$ y = [16, -89, 57, -62, -32, -151, 23, -17, 154, 17, 61, -210, -74, -14, 210, 98, 32, -17, -180, 159, -125, -3, -144, -140, -16, 10, -110, 135, 88, -176, -108, 327, 404, -96, 90, -115, 30, -84, 64, 138, -12, 70, -25, 77, -35, -18, -144, 145, -124, 62, -8, 117, 161, 77, -254, -115, -141, 122, 114, 82, -148, -135, -254, -3, 156, 98, 284, 70, -93, -148, 77, -13, 294, -76, 167, 28, 222, -102, -19, 108, -45, 7, 11, 24, 24, 202, -71, 41, -83, -33, 78, -258, 168, -59, 129, 226, -61, -46, 105, -40, 35, 48, 2, 142, 155, -22, 37, -141, -74, -185, 192, -138, -37, 92, -56, -192, -153, -57, -58, 213, -12, 7, 107, 162, -30, -7, -271, 198, -60, 0, -176, -51, 106, -258, -64, 326, -3, -2, -148, 179, 135, 45, 36, -265, -12, 46, -281, -165, 141, 220, 31, -37, -164, -48, 121, -36, -139, 17, 54, -8, 25, 36, -173, -47, 293, 157, 10, 61, 48, -173, -19, 87, 46, -75, -54, 65, 40, -64, -302, 149, -7, -84, 75, 198, 94]
4871I4JK33l37K82k19P7L5l04K7J90M6l74K84k3k87J68k3M22k77o0r7L40l68J66
4895dj10j0L56k13J51j66k01J75J01q5R3k28j51P7L11j32l8J14j9J46k71K40l78
4918b42J35J18NM5l53J46J69J12k94L21l05Rk1J60J44j46j6j49K43k02K38j77
4940f0M20k15k4k93M71k44j97qJ41j88K92j68P9J13j93K19n5O9k49K69k43J73
4962A09l22Q4J89n6omO7j74O4m6M0l32K95K04K25k30m3J33o5r5O3k62O7k7K08
4987H6k00J92j27R1k16L62j86P2l26K33Q4j62M9Q9J39J6k20n7J05k12J69o0J40
5010F1k06M5LJ76l7o0k05L34j46P8j20K64m17J92K18j26l80K03J37j2l1P0j0J15
5034A46k69R5j2r3J44R3j99N2J18j72L0k00L04N7r8Lo0J54j81K21P8m63K39k40
$$ y = [94, 95, 328, -9, 273, 54, 131, 166, -138, -111, 79, 125, -249, 35, 12, -275, -107, -130, 292, 15, -45, -142, 198, -170, -4, -114, -124, 232, 19, 170, 4, -197, -22, 79, -6, 87, -141, -292, -215, 96, -36, -74, 40, 21, 167, -104, 136, -242, -107, 11, 16, 61, -292, -146, 23, 135, -159, 162, -143, -134, -155, 5, 149, 3, -13, -162, 81, -121, 117, -60, 360, 145, 121, -172, 299, 55, -142, -150, -9, -197, 95, -73, 6, 119, -74, 145, 90, 159, -90, 179, -64, 109, -213, -129, 60, 4, -2, -6, 61, -113, -49, -95, -55, -387, -92, 112, 337, 107, 64, 197, 132, 37, 100, -162, -95, -122, 86, -114, 78, -49, 42, -174, 188, 2, 74, -252, -19, 65, -97, -48, 41, 180, 196, -24, -81, 24, -188, -19, -79, 61, -145, -100, -97, 79, 42, -18, -223, 111, -35, 43, -77, 187, -230, -38, 180, 54, -326, -123, 14, 2, -29, 41, 31, 146, -123, -28, -40, -133, 11, 104, -95, -43, 75, -97, -67, -267, 37, 94, -4, -1, -61, 93, -88, 133, 211, -252, -13, -253]
5058b53J75J10%J78j73M0m4j52O3J89N5l70K91j24m7J4j56P5j35L75n6Q9l26K16
5082C4K8J29n53L73j23M5J12M9J57l54Q5Rm0K20j05j75R7M3J20l33L43p8j42j6
5106g5m3J96m9J48l25J03J61N9k59R7k78K01j39K46k53K46j53K48n1l38K66l7
5128b9r4J05P1k7j9j69J1L23k94K31n7o9N6j44K2J48k31J74j01O1J20k86K29R4
5152A25k6l50R7J72L7Pm9K06l17r9M17k29o1K6K6j25J79j9j28J21MN6J93l39j57
5177b33J83j6R1j91N0K8lJ49P4k93K30N1k8q3J36J0j08K49j37N1l00J25J48k94
5201a11J83K50k19k3j56NO5j23R4K42k51J37m1k43M17n2j43k84M25k92J11R9j7
5224G3O2N5l67J53L8q8J88N8m87M44j93J27j5Q9j29r3K36mj11%j04J20J72m19
$$ y = [-253, -78, 32, 32, 210, 37, 77, 33, -119, -56, 133, 188, -182, 109, -15, -62, -48, -204, -129, -264, 111, 55, 144, -182, 34, 62, 191, -362, 11, -112, -67, 45, 94, 251, -103, -18, -9, -49, 171, 66, -109, -12, 31, 151, -182, 161, 83, -59, -75, -118, 78, 29, 177, -148, -45, 116, 175, -84, 13, -265, -64, -203, 43, -210, 36, -117, 131, 80, -258, 8, -29, -123, -18, 53, 26, 7, -162, -151, 172, -122, 109, 52, -17, 39, -105, -83, 65, -166, 8, -93, -32, 88, -198, 31, 125, 99, -251, -154, 18, 55, 62, 13, 219, -98, -197, 220, -9, -70, -44, -18, -143, 36, 17, -111, 10, 14, 70, 263, -76, -233, -50, -66, 25, -166, -116, -88, -91, 58, 132, -161, 69, 120, 92, 9, 145, 155, 47, 296, 159, 210, -90, 35, 183, -111, 72, 322, 103, 80, -76, -71, -6, -129, -35, 207, -44, 93, 52, -191, 226, 174, 31, -253, 172, -120, -9, 90, 73, 135, 190, -177, -24, 14, -74, 114, 172, -315, 129, -64, 63, 48, 137, 8, -85, 151, 147, 36, 36, -68, 52, 224, -195]
5248a95p2M40k19n4O2M9r4j25K91j32j0P4J6KK7O8m4k47L09r3K3j4K35j29r3j74
5274i9K40j40K22j30J27l71J38j61J51R4k25J80j73L70j68ql4k08K23j59L0J52
5296E1j72K02p3P3j16j8O0j77J15J19j29J20N4l68K04L7Q1K9k4jj31k9J3j8K22
5321A24J82l11J23j12m3J13qj59O2p5J50r7j91M34j85j04M2p6J14r3J04lk03J41
5345g1K09j08J6j68K51j37r3L13j83L50k83M0N6m07K50j50J33n5q0L6J98r5J17
5368A39l7N4J0kk79J52o7llN4K11l00j01L05j65R1lj08M9k72K83j11J15j02J10
5393B0Q2J25k30m8K57k90J71m46J68M9L47m3j21n8j03J02R7l4R6r6J0n3n8j51
5417b07K32M3k80J68R1J09k37J71J8k92R3J75k55J77J85k10n7j69M0L86k92R0
$$ y = [-195, -267, 173, -46, -100, -38, 11, -83, -208, 83, -49, -59, 15, 31, 33, 60, 128, 84, -163, 146, 53, 76, 62, 297, 168, 75, -99, 141, 1, 223, 93, 220, -151, -13, -174, -23, 71, -154, 26, -147, 223, 55, 47, 13, -195, 28, -131, -101, 51, -121, 81, 8, 81, -35, -53, 7, -170, -55, 64, -65, 55, 109, -259, -55, -18, 63, 92, 68, 67, -64, -93, -80, -98, 124, 306, -5, 118, 6, -37, 76, 68, -91, -29, -104, 46, -51, -242, 192, 7, -97, -55, -131, -17, -110, -6, -9, -212, -71, 138, 30, 46, -122, 129, -8, -101, 212, 29, 379, 96, 136, 192, -215, 35, -115, 18, -37, -117, -81, 117, 22, 139, 102, 156, 166, 164, -115, 37, -30, -33, -36, 18, 229, -71, -172, 133, -32, 59, 56, -52, -3, -275, 8, -103, 12, -90, 20, 102, 227, -3, -51, 206, -84, 87, -359, -191, -142, 205, 162, 41, -17, -120, -18, 79, 45, 141, 45, 55, 2, -56, -207, 25, 68, -212, -44, 47, 156, -81, 90, 108, -184, -91, 84, -171, 6, 191, -19, -76, -245, -205, 181, -111, -21]
5439b1J26k97L5P8J44j41j68J77J01K06j79J84k13J65l14J52j05J86r0l9K0j76
5461a69m1J30J59l17L27q1j2l5j39J09P5j45L33j10q8K84n21L02n1O3k64K16k3
5484BK1j8K00L8j03m22M82k28k23M60j73n1J55j80J04o3J48k7k51J46N9j9M8k53
5508a48P0L58r5k9j63LKn0k6Q8J64J18k32kk0J25j52R2j90J9J72j55J1l5K37j36
5534B6r3M7o3q0K67k31o8K80R0k31O1ml3J54k89K26j85J78J35j20k17J33Q7K4
5558I4r2k23K22n4q0J59%j6R4j68J84o1p8J48j03k61K03J52J46j08k20K39K5j64
5582C8j47J33O5k19J31O3r1Q8K19k66J03l7k45K20j93J63J45k89R6j65J30K6L4
5605Bk9K36j27j4j98J14L11l56k4L11l09j04J28K2r0q8K54J45l26J44P4J09Pq4
$$ y = [-21, 105, -192, -157, -79, 65, -76, -244, -67, 34, 240, 61, 245, 32, 197, -117, 35, -70, 116, 26, -13, 7, -169, -210, -80, 79, -238, 89, 8, -4, -39, -178, -69, 6, -139, 194, 84, -4, 280, -241, 61, 10, 73, -191, 25, 2, 23, 5, 205, 243, 140, -282, 200, -28, -251, 209, 36, -15, 140, -40, 64, 1, 149, 122, -129, 17, 76, 57, 105, -148, -78, 280, 185, 156, -7, -4, -2, -52, -78, 10, 174, 292, 60, 58, 38, 163, 11, 103, -87, -68, 104, -51, -40, -75, 162, 26, -67, -20, -83, -163, 104, -127, -195, 85, 175, -56, 5, 1, -32, 122, -167, 59, -126, 52, 187, 67, -150, -17, 70, 94, 2, -221, 1, -53, -133, 26, 26, 10, 104, -64, 120, 59, -19, 129, 26, -235, -32, 120, 266, 158, -62, 177, 202, 38, -109, 24, 89, -130, 1, 64, -27, 61, 280, 14, 117, 80, -165, 55, -138, 25, 170, -119, -23, -188, -58, -32, 2, -27, 209, 82, 68, -130, -16, 295, -61, -85, 226, -83, -187, -59, -37, -127, -215, 39, 184, -142, 2, 76, 185, 192, 108]
5629A08p7j53lL18l44J82K5j05J60L2j57p7J93p4K08k10o1j26J30J70q5mk73M36
5653B13n23M56j09Qk16J06L75m08J92R1k82k31N11k74J19K6P1j85q8K50j70j83
5675b51L88k46Q8l8K15k32JJ00j80K20r4k00M17L3k48J02j45j4k02L43J13l01
5697a31J54P2m7J6J1o2j34J43R7l7k30k5M45l57J56l50M38r9m3q8l0j02OkJ72
5722b7J05j13L8J70K0l64L08L1j89K40j84M1M0l5L6j55k2J23J51k54J3K06j40
5745C9p9N1O4j1l53M05k52K89k30p1J48M89m44%Lk7j11J47j65J17o9J00j37k10
5769c07K51J41j24Pm3J69J70j87PJ42k56J75%l9J30l43J08R6j55J93m4k0j3j77
5793a19L15k02j79L15k7k47k2J39J71k16k2o2Q4J88k46K03l6r1O9O2j10J19N8
$$ y = [108, 31, -122, -125, 193, -151, 31, 56, -49, 111, 143, -14, -91, 102, 28, 236, 26, -35, -161, -31, 139, 54, 50, -223, 213, -310, 146, 37, 45, -171, -65, 310, -98, 94, 185, -97, -328, 183, -91, 28, 54, 125, -60, -148, 102, -68, -251, 137, -109, -21, -59, 156, -76, -75, 25, -155, 65, -29, -229, 188, 221, -27, 75, -70, -84, -286, 57, 170, -131, 23, 95, 48, 64, 75, 13, -121, 22, 119, 82, -148, -173, 272, -85, 71, -279, 159, 60, 17, -71, -101, -203, -197, -199, -27, 78, -35, 3, 173, 193, -171, 137, 168, -21, 219, 35, 76, 116, 81, 117, -38, -60, 63, 214, -40, -27, 179, 39, -40, 11, 75, 64, -289, 116, -136, 153, -77, -148, 0, 489, 45, 45, 48, 21, -90, 57, -108, 9, -60, 40, -97, -307, -56, 85, -39, -32, -75, 94, 264, 77, 84, 226, -30, 145, 145, 106, 236, -107, 1, 97, -58, 135, 91, 71, 58, -119, 196, -6, -185, 130, 103, -144, -166, -27, 144, -72, -94, -156, -72, 116, -130, 73, 37, -54, 15, 77, -33, 86, 144]
5816A44j55K89m98J54P4p5J52j21J38rk31J11p9M6J72j90L9j14j49N00j40k5j04
$$ y = [144, -11, 278, -220, -66, 8, -67, 85, -36, 102, 93, -138, -27, -106, -60, 112, -78, -39, -153, -302, 198, 58, 33, -71]
$$ [...]
8191a97
##END NTUPLES=NMR FID
##END=
