##TITLE=1H_SL34-mCPBA-f8(SL-x)
 CDCl3
 8 sc, 
 20.1.2022
##JCAMPDX= 6.0         $$ Bruker NMR JCAMP-DX V2.0
##DATA TYPE= NMR FID
##DATA CLASS= NTUPLES
##ORIGIN= UXNMR, Bruker Analytische Messtechnik GmbH
##OWNER= root
$$ XWIN-NMR		Version 3.5
$$ Thu Jan 20 12:14:03 2022 Russian Standard Time (UT+4h)  she@DPX200
##.OBSERVE FREQUENCY= 200.131346
##.OBSERVE NUCLEUS= ^1H
##.DELAY= (6, 6)
##.ACQUISITION MODE= SIMULTANEOUS
##.ACQUISITION SCHEME= undefined
##.AVERAGES= 8
##.DIGITISER RES= 18
##SPECTROMETER/DATA SYSTEM= spect
##.PULSE SEQUENCE= zg30
##.SOLVENT NAME= CDCl3
##.SHIFT REFERENCE= (INTERNAL, CDCl3, 0, 15.7039)
##AUDIT TRAIL= $$ (NUMBER, WHEN, WHO, WHERE, WHAT)
$$ ##TITLE= Audit trail, XWIN-NMR		Version 3.5
$$ ##JCAMPDX= 5.01
$$ ##ORIGIN= Bruker BioSpin GmbH
$$ ##OWNER= she
$$ F:/spectra/data/she/nmr/H-F/1/audita.txt
$$ ##AUDIT TRAIL=  $$ (NUMBER, WHEN, WHO, WHERE, WHAT)
(   1,<2022-01-20 12:12:56.04 +0400>,<she>,<DPX200>,
      <created by zg, POWCHK disabled, PULCHK disabled
       configuration hash MD5:
       00 E9 B6 7A A2 85 ED C7 34 08 36 98 17 FE 4E 26
       data hash MD5: 16K
       A3 C4 DB 0B 6B E6 2C 1D 28 3F E8 83 88 A9 8C 10>)
$$ ##END=
$$ 
$$ hash MD5
$$ 81 C2 32 7E 94 D9 D9 98 ED 73 2C E4 2C D9 2B 70
##$RELAX= 
##$RELAX= 
##$RELAX= 
##$RELAX= 
##$RELAX= 
##$RELAX= 
$$ Bruker specific parameters
$$ --------------------------
##$DU= <F:/spectra>
##$EXPNO= 1
##$NAME= <H-F>
##$PROCNO= 1
##$TYPE= <nmr>
##$USER= <she>
##$AMP= (0..31)
100 100 100 100 100 100 100 100 100 100 100 100 100 100 100 100 100 100 
100 100 100 100 100 100 100 100 100 100 100 100 100 100 
##$AQSEQ= 0
##$AQ_mod= 1
##$AUNM= <au_zg>
##$AUTOPOS= <>
##$BF1= 200.13
##$BF2= 200.13
##$BF3= 200.13
##$BF4= 200.13
##$BF5= 200.13
##$BF6= 200.13
##$BF7= 200.13
##$BF8= 200.13
##$BYTORDA= 1
##$CFDGTYP= 0
##$CFRGTYP= 5
##$CHEMSTR= <none>
##$CNST= (0..31)
1 1 145 1 1 1 1 1 1 1 1 1 1 1 1 1 1 1 1 1 1 1 1 1 1 1 1 1 1 1 1 1 
##$CPDPRG= <>
##$CPDPRG1= <>
##$CPDPRG2= <>
##$CPDPRG3= <>
##$CPDPRG4= <mlev>
##$CPDPRG5= <mlev>
##$CPDPRG6= <mlev>
##$CPDPRG7= <mlev>
##$CPDPRG8= <mlev>
##$CPDPRGB= <>
##$CPDPRGT= <>
##$D= (0..31)
0 1.2 0 0 0 0 0 0 0 0.06 0 0.03 0 0 0 0 0.0002 0 0 0 0 0 0 0 0 0 0 0 0 
0 0 0 
##$DATE= 1642666375
##$DBL= (0..7)
120 120 120 120 120 120 120 120 
##$DBP= (0..7)
150 150 150 150 150 150 150 150 
##$DBP07= 0
##$DBPNAM0= <>
##$DBPNAM1= <>
##$DBPNAM2= <>
##$DBPNAM3= <>
##$DBPNAM4= <>
##$DBPNAM5= <>
##$DBPNAM6= <>
##$DBPNAM7= <>
##$DBPOAL= (0..7)
0.5 0.5 0.5 0.5 0.5 0.5 0.5 0.5 
##$DBPOFFS= (0..7)
0 0 0 0 0 0 0 0 
##$DE= 6
##$DECBNUC= <off>
##$DECIM= 32
##$DECNUC= <off>
##$DECSTAT= 4
##$DIGMOD= 1
##$DIGTYP= 9
##$DL= (0..7)
0 120 120 120 120 120 120 120 
##$DP= (0..7)
150 150 150 150 150 150 150 150 
##$DP07= 0
##$DPNAME0= <>
##$DPNAME1= <>
##$DPNAME2= <>
##$DPNAME3= <>
##$DPNAME4= <>
##$DPNAME5= <>
##$DPNAME6= <>
##$DPNAME7= <>
##$DPOAL= (0..7)
0.5 0.5 0.5 0.5 0.5 0.5 0.5 0.5 
##$DPOFFS= (0..7)
0 0 0 0 0 0 0 0 
##$DQDMODE= 0
##$DR= 18
##$DS= 0
$$ [...]
##$SUBNAM2= <"">
##$SUBNAM3= <"">
##$SUBNAM4= <"">
##$SUBNAM5= <"">
##$SUBNAM6= <"">
##$SUBNAM7= <"">
##$SUBNAM8= <"">
##$SUBNAM9= <"">
##$SW= 18.0517287032376
##$SWIBOX= (0..15)
0 0 2 0 0 0 0 0 0 0 0 0 0 0 0 0 
##$SW_h= 3612.71676300578
##$TD= 16384
##$TD0= 1
##$TE= 0
##$TE2= 300
##$TE3= 300
##$TEG= 300
##$TL= (0..7)
0 120 120 120 120 120 120 120 
##$TP= (0..7)
150 150 150 150 150 150 150 150 
##$TP07= 0
##$TPNAME0= <>
##$TPNAME1= <>
##$TPNAME2= <>
##$TPNAME3= <>
##$TPNAME4= <>
##$TPNAME5= <>
##$TPNAME6= <>
##$TPNAME7= <>
##$TPOAL= (0..7)
0.5 0.5 0.5 0.5 0.5 0.5 0.5 0.5 
##$TPOFFS= (0..7)
0 0 0 0 0 0 0 0 
##$TUNHIN= 0
##$TUNHOUT= 0
##$TUNXOUT= 0
##$USERA1= <user>
##$USERA2= <user>
##$USERA3= <user>
##$USERA4= <user>
##$USERA5= <user>
##$V9= 5
##$VALIST= <valist>
##$VCLIST= <CCCCCCCCCCCCCCC>
##$VD= 0
##$VDLIST= <DDDDDDDDDDDDDDD>
##$VPLIST= <PPPPPPPPPPPPPPP>
##$VTLIST= <TTTTTTTTTTTTTTT>
##$WBST= 1024
##$WBSW= 4
##$XGAIN= (0..3)
0 0 0 0 
##$XL= 0
##$YL= 0
##$YMAX_a= 108327
##$YMIN_a= -198096
##$ZGOPTNS= <>
##$ZL1= 120
##$ZL2= 120
##$ZL3= 120
##$ZL4= 120
##$ABSF1= 10
##$ABSF2= 0
##$ABSG= 5
##$ABSL= 3
##$ALPHA= 0
##$AQORDER= 0
##$ASSFAC= 0
##$ASSFACI= 0
##$ASSFACX= 0
##$ASSWID= 0
##$AUNMP= <proc_1d>
##$AZFE= 0.1
##$AZFW= 0.1
##$BCFW= 1
##$BC_mod= 2
##$BYTORDP= 1
##$COROFFS= 0
##$CY= 11.3945322036743
##$DATMOD= 1
##$DC= 2
##$DFILT= <>
##$DTYPP= 0
##$F1P= 2.36226072786647
##$F2P= -0.459571619588291
##$FCOR= 0.5
##$FTSIZE= 0
##$FT_mod= 4
##$GAMMA= 1
##$GB= 0.15
##$INTBC= 1
##$INTSCL= 1
##$ISEN= 128
##$LB= 0.24
##$LEV0= 0
##$LPBIN= 0
##$MAXI= 10000
##$MC2= 0
##$MEAN= 0
##$ME_mod= 0
##$MI= 1.114404
##$NCOEF= 0
##$NC_proc= 0
##$NLEV= 6
##$NOISF1= 3.799351
##$NOISF2= 2.8
##$NSP= 1
##$NTH_PI= 0
##$NZP= 0
##$OFFSET= 15.70392
##$PC= 1
##$PHC0= -15874.84
##$PHC1= 17.60078
##$PH_mod= 1
##$PKNL= yes
##$PPARMOD= 0
##$PSCAL= 0
##$PSIGN= 0
##$REVERSE= no
##$SF= 200.130013532006
##$SI= 16384
##$SIGF1= 3
##$SIGF2= 2
##$SINO= 400
##$SIOLD= 16384
##$SREGLST= <1H.CDCl3>
##$SSB= 0
##$STSI= 0
##$STSR= 0
##$SW_p= 3612.71676300578
##$SYMM= 0
##$S_DEV= 0
##$TDeff= 0
##$TDoff= 0
##$TI= <>
##$TILT= no
##$TM1= 0
##$TM2= 0
##$TOPLEV= 0
##$USERP1= <user>
##$USERP2= <user>
##$USERP3= <user>
##$USERP4= <user>
##$USERP5= <user>
##$WDW= 1
##$XDIM= 8192
##$YMAX_p= 0
##$YMIN_p= 0
$$ End of Bruker specific parameters
$$ ---------------------------------
##NTUPLES= NMR FID
##VAR_NAME=  TIME,          FID/REAL,        FID/IMAG
##SYMBOL=    X,             R,               I
##VAR_TYPE=  INDEPENDENT,   DEPENDENT,       DEPENDENT
##VAR_FORM=  AFFN,          ASDF,            ASDF
##VAR_DIM=   8192,          8192,            8192
##UNITS=     SECONDS,       ARBITRARY UNITS, ARBITRARY UNITS
##FACTOR=    0.0002768,     1,               1
##FIRST=     0,             0,               0
##LAST=      2.2672688,     0,               0
##MIN=       0,             -198096,         0
##MAX=       2.2672688,     108327,          0
$$ Real data points
##PAGE= N=1
##DATA TABLE= (X++(R..R)), XYDATA
$$ [...]
1850a94k1L97o01M78O12j104J68J003o11p10O87M68q71P3N85k33k33L69k22l1
1870IJ77n96k74R21m03l20M96K40q09p1N52o6k41L43J19o0L96j017L28P11K4p69
1892c10J167M72j431N86L36r86l81N18Q7m2K54r06j44J096r89m56J114j23r04
1911a042R49L64p53O3O93l74N32J88k66K81J93o42J13O92p79l56P74l54o67K01
1931a90Q0n09O8N98j086M68L92n92j16J018o57m61J498m5o55N36N39q17L54N48
1951I71j073Q35M37q27j23O97m48q98O08m79o83P99l22n14J77K66n63L68Q31n72
1971e13K33O08l22j75O08n4R4P16n67j91P77o64o47L67K90o16p4L48o21l0J49
1992b84n87L85O40q25l64J474l65n50Q95J87j061J54O97l99P20p7j82j41M03j030
$$ y = [-194, -215, 182, -419, 59, 671, -433, -265, 738, 127, -583, 104, 572, -299, -226, 359, 126, -107, 262, 40, 9, 186, -410, -684, 237, -166, -486, 10, 250, -559, -630, -78, -144, -385, -42, 77, 17, 413, -604, -276, 435, 459, -310, 857, 1329, -102, 484, 820, -166, -547, -29, 58, 16, 270, -636, -780, 316, -673, -1129, -15, -138, -1042, -93, 271, -482, -419, 274, -100, 432, 620, 354, 635, 828, 186, 299, 991, 212, -144, 630, 276, -391, -190, -110, -619, -551, 47, -1039, -571, -179, -771, -887, 131, -526, -987, 511, 466, -189, 347, 886, 69, 423, 971, -102, 733, 1170, 343, 220, 917, 469, -429, 179, -300, -983, -184, -506, -1020, -843, -577, -1140, -772, 59, -513, -280, 328, 6, -169, 439, 385, 479, 1195, 628, 437, 1214, 550, -97, 270, 560, -56, -130, 218, -403, -433, -284, -871, -486, 154, -671, -1035, 439, 74, -476, 419, 606, -455, -301, 396, -3, 717, 640, 458, 317, 720, -310]
2012c10P8J217o14j148R12K25j245l3J077k69j16K94k56l7K50k90M57K37j96j087
2032h54R66N88j008%R74m49l44K20J06k11j74O8j88M41n99l08J227j18p10M95
2052A22N24o59l22N30j57L06j53j60k4N1l31j24O74k79m46M13j0l12QJ8L01Q6
2074E6p0j30M47J80k33j29P76n31m31P85Jr17M45J29q64P42j29p48K15K69m00
2095e37j90P83k12o02L11J36k16M92O34q35O34J84n37j66J021L7n97M28Q2r35
2115h5J20L42n97J8K83m80k83L44m59p3Q80k35k22j10M66j85l3M82Q6O6j19J30
2137C36J85J23l20L91J44m80k80J81P3k10m38J56k60R4m49N5O80m89j53L47J46
2158a68m99p4R86J08k03K45j75L11N2o0mM09k29q48N72K13r57k21J013o79m40
$$ y = [-310, -232, 985, 371, -777, 135, 360, -885, -918, 159, -110, -226, 68, -188, -225, 25, -265, 192, 429, 233, -854, 112, 700, -308, -308, 666, 217, -127, 93, 199, -12, -186, -118, -306, 135, -464, -772, 455, 337, -373, 122, 646, -13, -335, 195, 38, 344, 191, 31, 7, 58, -273, -397, 277, -2, -448, -35, -45, -357, -349, -331, -30, 56, -14, -144, 303, 483, 250, 121, 897, 366, -65, 720, 721, -196, 249, 378, -486, 256, 127, -621, -406, -137, -537, -727, 56, -156, -758, -447, -311, -527, -35, 599, -236, 398, 582, 45, -121, 900, 937, 340, 768, 850, -85, 35, 377, -220, -202, 81, -399, -682, -338, -797, -870, 10, -225, -447, -557, -91, -276, -309, 173, 259, 325, 206, 336, 521, 644, 324, 715, 859, 379, 99, 280, 353, 143, -295, -139, -399, -305, -754, -699, -19, -508, -661, -314, -168, -667, -741, 245, 353, 150, 395, 220, 531, 583, 523, 519, 928, 699, -149, 423, 636, -321, -542, 471, -208, -648]
2179f48K80K75n92K76K19p0J29on87P16N92n11l12P70l3o02P35j2o45J11K52l45
2201hnJ25q3J23M5p40K57M46l29j53N13k18k12K35j18J8J70M5n1L71q8o23N03
2224B23K09p69L64L18n96J90L07l64k84O59l84K4K98K07o05L57J95o42L06L22
2244C35k84k29O25m63l77N79j13o33N71J96o78L15K58q48O86K78n37M3O94o76
2264b58J50O75k78n65P16K94o20M58k19l23J94P1n31J11M03q98J8Q04p30j44N66
2285a06q7l22K54K51j83L7K41l14O28Km67N55L66m59l04L12L69q72N3n2J19p0
2307d9j40j15J98j74o40P10J65p61K51P93m09n72M39L22n8K59J29k23N12K4l42
2328C19L48M02p67k11P40p27n93N97no62K37M5l1K5O5n22N10K13l71L8M29k85
$$ y = [-648, -368, -93, -685, -409, -190, -260, -131, -137, -724, -8, 584, 73, -239, 531, 498, -104, 631, 619, -26, 85, 337, -8, -13, 112, 29, 152, 197, -543, -286, 160, -169, -322, 191, -27, -239, -4, -122, -104, 66, 111, 60, 431, 343, -280, 223, 432, -337, 27, 345, -251, -61, 246, -118, -402, 257, -127, -103, 195, 402, -203, 154, 349, -293, 13, 335, 51, -178, 447, -16, -393, 186, 73, -560, 11, 207, -471, -156, 102, -746, -60, 218, -319, -276, 418, -258, -108, 567, 289, -276, 440, 734, 114, 572, 353, 30, 224, 295, -236, -125, 278, -620, -602, 202, -528, -672, -106, -193, -515, -261, -10, -193, -156, 85, -229, 399, 401, -66, 489, 855, 396, 92, 404, 773, -99, -46, -98, 21, -49, -189, -304, -106, -280, -920, -210, -45, -806, -555, 238, -171, -743, -304, 18, -40, 219, 348, 125, 637, 661, 319, 667, 1069, 302, 91, 831, 104, -489, 108, 103, -559, -322, -277, -308, -283, -218, -740, -230, -17, -388, -350, 79, -206]
2350b06ON28J54l84M58p9J38j80P0k36j8q0n20K44J71j88j08J02q8k35K24P7k45
2373c95j06J80J81K05k67J68J04K79j7j59L55j47p1J26k00m69L91p6k57o1K50
2394A4l11NL25k77O7L47l48K50J47m80j17L29K64o17O07K95m07l37O15k07k08
2415d4K4M5N5j26j47k74O48j02l44J81L01m21q0O55n6m00N7J97j41O4l3k20N15
2438C54m29m40L68M73p96J48L76j83l81J27M8J54J53l7L05J38r7l72M68L38o36
2459G9J84K58j60k12j64K40l99o0l20L55J4j67k65O62j68q11M95N10o13Q3O36
2480A77j8J4L19l75K10M26k07m79O38k58p02P10On89K15J40m85l3J87m48L0J04
2502d18l80J62N97J64l84L46K3l66M03L67k94L90J85l82m1J90k14m58M64k57j61
$$ y = [-206, -200, 328, 482, 98, 556, 477, 615, 435, 505, 269, 251, 171, -349, -105, 66, -122, -230, -128, -216, -451, -227, -150, -395, -501, -321, -140, 65, -202, -34, 70, 349, 332, 173, 528, 381, 310, 436, 236, -233, 158, 82, -175, -236, 14, -297, -292, 33, -244, -177, 170, -178, 72, 219, -261, -378, -49, 215, -402, 205, 500, 93, -244, 371, 164, -44, -20, 25, 80, -46, -193, -467, 181, 79, -265, -84, 217, -204, -284, 371, 315, -85, -28, 169, 28, 92, 59, -161, 354, -75, -515, -147, 326, -470, -322, 54, -129, -510, -383, -335, -181, -28, -65, 240, 378, 281, -91, 377, 715, 79, 263, 521, 361, 149, -15, 225, -174, -234, -554, -199, -185, -352, -617, 45, -123, -934, -439, 71, -542, -459, 177, 159, 173, 492, 117, 327, 753, 546, 67, 705, 447, -255, 455, 461, -128, 87, 227, -258, -291, -104, -552, -522, -418, -798, -636, -39, 125, -259, 87, 110, -256, 147, 514, 220, 610, 795, 413, 372, 562, 348, -110, 354, 97, -64]
2523f4J41l07k1J40l65k7Q2J11k89J59J26o2J76j29L34J71k05L81O1L7k14p0M98
2546F64j15p17L31K18o11r9P37q33J04J20k05J86J16l65l36P35K47q59Q04K90
2566D12n96M0M56j38j99J34L25j71O2J5j54K05j16l94K42L19j026Q4O25K0p13
2587e68N35j04j04K47j85J57K01j50j44L07k7k83J33J33p7m45K43K03K7J37j87
2608D9L07j70j48j23L03j65m7J84n5p4j0k36K33J95N8j44o1J00m73L9L39j71l43
2631d13K31J24n94N83p9J52q1J24j30j19K25n3J66K68j93j42q7N61l25P5rk68
2653A6j98J27k63j74M83k17l52M29Jk18JN24p06L01J89N7J41NR6J63J55k28j59
2676A73L46o8m47K35K3mk14l30L22p0l03j35K0K35k55j35M24O6l1J01J53k6K32
$$ y = [-64, 77, -230, -251, -111, -476, -503, -421, -310, -599, -440, -314, -376, -200, -329, 5, 176, -29, 352, 413, 450, 236, 166, 664, 549, -168, 163, 381, -230, -329, 408, -425, -321, -201, -406, -220, -104, -469, -805, -70, 177, -682, 122, 412, -184, -144, 312, 174, -25, 109, 434, 263, 325, 340, 186, 391, 275, -119, 123, 442, -584, -500, 125, 145, -568, -33, -137, -241, 6, -179, -22, 179, 29, -115, 192, 165, -118, 15, 148, 71, -374, -131, 72, 99, 236, 49, 356, 186, 38, -85, 218, 53, 6, 190, 135, 61, 51, -185, 48, 243, 301, 157, 96, 196, -277, -238, 101, -70, -413, -182, -58, -652, -69, -148, 4, -77, 47, -83, -202, 23, -30, 136, 404, 211, 69, -18, 543, 218, 293, 284, 16, -182, -55, -318, -492, -9, -226, -578, -149, -148, -366, -365, 159, -547, -246, -57, 0, 141, 146, 242, 405, 560, 332, 173, 519, 451, 4, 239, 262, 258, 44, -286, 36, -34, -337, -472, -452, -217, -472, -607, -183, -117, -148, -47, 106, 80, 312]
2699C12m1k0K81r3k9J39Ll89OK55j15m02j95J10R4K9m70k6K50j9k14L00J18k98
2723d14k55N09L83o46M44M18k90J74M3j01k4M47m35L12j31n67L6L36k20m95L77
2744i9P2m22k15O16k43J46k29o1L02M79p75M91K60l41j64L78j11O4JJ88k08r1
2766C8j95R3jJ35j85n8J62l92J87J83j46J40n1J32k5m8K25n6R3k39k85M58l5l21
2790a91L38J24k55o5n9J30p4K63l13jR5J41q2J16k35JJ37k23L66l80L24j03j52
2813i8K75k59j18M8M6k06K8K05j1J11R4k28Lr4P7j28O64j73n47P16j62m17K02
2836B8K12J92l08l33K27J51J03n09JK79m26k07L37r9j20J07NK70n2J50K9J68K43
2859D48l89J91Q7m13J71M29j28n33J99J57k35j98K45j80J09l15kR0K80o49o7P88
$$ y = [312, 271, 251, 532, 439, 410, 549, 552, 163, 169, 424, 309, -93, -288, -178, -84, -55, -525, -551, -301, -320, -534, -234, -116, -414, -669, -160, 223, -423, 21, 439, 149, 323, 366, 265, 241, 688, 253, 565, 434, -133, -97, 239, 19, -476, -99, -27, -449, -664, -48, -291, -145, -374, -435, -133, 346, -429, 62, 322, -19, -183, 195, 84, 148, 149, 337, 129, 38, -157, -64, -65, 70, -115, -173, -11, -403, -216, -33, -179, -39, -90, 42, 17, -31, 194, 138, 231, -8, -293, 165, 130, -191, 147, 271, 16, -49, -108, 22, -52, 211, -102, -103, -8, 133, 51, 167, -68, -67, 70, -153, 213, -167, 157, 54, -98, 177, -82, -200, -152, -106, -312, -284, -79, -90, 21, 115, -113, -110, -204, -127, -255, 409, 236, -311, 405, 243, -174, 28, 240, 432, 124, -209, 18, 169, 272, -237, -236, 43, -383, -590, -253, -352, -472, -365, -360, -90, -142, 8, 37, 205, 448, 59, 250, 337, -76, 95, 524, 396, -137, 62, 219, -16, -214, 31, -149, -40, -355, -357, -267, 13, -636, -703, 85]
2881H5k51j96L51l1L10k41K38o0J39j5k6J8j19k04j3K41O5m34J88O4l50Q0k30
2904c91K04l54K25P4K5K9J02j32J44L21m12K51J71P6j00O4j23kJ07M3L5j65M0
2927B32j54J84m08j7kJ5j49J68j04k00Q6n9K16J20K89k15k0J44J08j25J09p1L2
2950A79J65l02j11J66M13n59%K24l28r8J09l7P6L0j39l2J91j2j65J37J9j97K47
2973b4M27n42j61M84J6m67M36M9j70k31J74N0Pq3j68r7M58k03j66L81j2j85K96
2996B69rj79P1q2P6p8k53L01P7m91r8J62L06l13R0j93L14nj6m1j24J85j29K97
3020A37M21j88k53O6M74o86L55k27l9k11K79l7l01K19n8n47M60L68n99K35O3l58
3042d27J40L14k07K12j05J19K4L28k35j6L11n4l29J88j25L1k77K40k13j37n6J56
$$ y = [85, -166, -362, -11, -42, 268, 27, 265, 205, 344, 329, 303, 321, 202, -2, -15, 226, 291, -143, 45, 109, -241, -161, -391, -187, -541, -316, -242, -217, -188, -86, -218, -74, 247, -165, 86, 257, 333, 233, 297, 174, 172, 279, 322, 357, 192, 232, 78, 262, -146, -163, -165, -150, -299, -131, -235, -435, -349, -408, -192, -72, 217, 2, -18, 126, 234, 109, 218, 147, 179, 344, 42, -69, 97, 510, -49, -49, 175, -153, -251, -142, -179, -103, -73, -212, -244, -53, -65, -230, -93, -74, -271, -24, 403, -139, -300, 184, 200, -267, 169, 218, 48, -183, -9, 41, 48, -35, -203, -300, 158, -45, -211, 170, 158, -27, 269, 260, 81, 152, 70, 146, 68, -185, 116, 193, -298, -396, -234, 72, -241, -151, -344, -30, -35, -51, -92, -216, -31, -160, 137, 558, 370, 117, 183, 657, -29, 326, 99, 60, -151, 128, 91, -210, 9, -49, -596, -136, 232, -367, -132, -69, -427, -287, 27, -180, 32, -73, 46, 70, 398, 163, 147, 458, 404, 75, 263, 138, 169, -108, 132, -81, -218, -274, -118]
3064a18l13R7K75k46K68j08N3k67L54pK12P2l4q3N4k6R8J34n7L7l68K74j79j50
3088b8Oj67Nj91j1K40m1L7k3K51k43k85K00R8J95J68Q9j80J51N3k84J67J29m80
3112a44M34J76p80j49O09j68n11M25R9l48j3K16k4j0K6j21J14M24j96k80K73J88
3134B40j28p5N21m27L7j45J44n7p1K5k50Q8k10Q0K98k89K0mj12O2q5J2M19j94
3158a01J10L8J09j34r5P5K67j59p1j33j1J9m0J97j38L47m12n7K70j60l63M57L30
3181C45l29j91L6J95J0P3j54J50m9l35R3K27J67l75j38K71l00j16L58J81n55J24
3203c12J16j83M89J35l29N1L37k93R7L1K5J8j28R1o3r4k46J86l76K44Kr7J96k49
3227c52J93J81k41o4NK53M7K80J6k06k2K08M6L3J9l34J12r4L5j98M5n3j29K52
$$ y = [-118, -431, -334, -59, -305, -37, -145, -92, -359, -5, -12, 200, 272, 238, 155, 209, 183, 281, 415, 358, 395, 27, 301, 122, -28, -22, -189, -184, -375, -386, -146, -187, -150, -173, 78, -165, -450, -250, -152, 43, 211, 300, 120, 271, 324, 40, 207, 336, -144, 290, 466, -314, -463, 146, -22, -533, -108, -9, -357, -370, -154, -178, -188, -162, -283, -169, 255, 59, -221, 52, 240, 112, 37, 558, 131, 168, 23, 167, 110, 39, 64, -186, -98, -308, -228, 70, -219, -199, -203, -315, -253, -338, -326, 93, -101, 9, 47, 156, 22, -73, 2, 269, 110, 39, -94, -105, -86, -126, 71, -67, 280, -132, -189, 81, -79, -442, 15, 345, 16, -175, -139, 56, 66, 139, -15, 135, 86, -249, -156, 71, 238, -137, -275, -4, -304, -420, -62, 119, -436, -312, -196, -379, 110, 245, -84, -33, 304, 11, 108, 139, 164, 182, 54, 145, 82, -12, -258, -72, -448, -204, -202, -299, -103, -352, -159, 22, -219, -283, -278, -25, 22, 302, 318, 112, 90, 298, 344, 377, 396, 62, 174, 80, 115, -83, -38, -91, -220, 32]
3251C2j48oJ26l38j98L21p5Q2P7J04p2J81k0qK17m9M1K32L8k20m43K20L05n78
3275a79J51q1J74l25Q1Q4k73J76l6j36K64j88k14M44M3m09J31M35j76j13O98k62
3297B89q7j61Q6J85m69N1L8J72k23ll8L06m57N3O4j32K54j62Q0M1j15M4NK99J67
3322B87k88K75K20m71K69j5m64K67k1J57o2mk93J16J2k32j06M45j2k91Q5j62J32
3345a56k35M72k15L70j61j46M6J75M3j84N5J09k66J12j25J21q6K72j95j76K35
3366F5jj00%LQ3m4J18l9N5j53p6M28l19p6J36p5k22nL36j03j25J5Q1M7j73K23
3392G9k30P2J00n0L97j38k29K21r8j07P6p1J13M5j34j14l2R3j45l23J59J89m00
3415e27K23L80j82q4J69j01R4R6k17K77L81k19j55L67l51j56K76J0l51J54k36
$$ y = [32, -116, -122, 4, -334, -532, -211, -286, -204, -127, -23, -95, 86, 66, 58, 275, 226, 267, 499, 537, 317, -126, 94, 399, -179, -28, -109, 65, -260, -179, -95, -368, -192, -228, -364, -100, -288, -502, -58, -15, -424, -293, 142, -34, -147, 551, 289, 202, 41, 127, 312, -157, -106, -68, 104, -119, -122, -160, 146, -311, -258, -194, -326, -72, -234, -154, -113, -228, -184, -179, 120, 287, -1, 274, 494, 23, 292, 277, -187, 80, 59, 216, 154, 150, -143, -27, -15, -247, -353, 92, 80, -211, -126, -288, -156, -391, 81, -134, 236, 75, -71, -25, 150, 193, 9, 64, 173, -93, 19, -106, 15, -71, 201, 6, -170, 65, 64, -36, -36, -33, 50, 6, 124, 85, 140, -13, -89, 339, 20, -56, 80, 5, -217, -222, 114, 11, -114, -99, -18, 29, -144, 79, -151, -79, 21, -29, 368, 230, 1, 222, 124, 17, 93, 22, 135, 180, 46, -68, -100, -7, -152, -475, -316, -127, -527, -304, 76, -106, -190, -21, -122, -28, 68, -149, 128, 509, 290, 135, 502, 151, -5, 271, 281, -70, 84, -152]
3436a52lK3qJ9k18K2k79K9M51K8n06N09J74j20k72L75Q0r0L54L5j25Pj39Q4r2
3461A86j34mJ9q6n4m4o4j81J53lr3J2n8j37K53M09j79Q9M6r5l27L51K05q1J82
3486C65j80K77k35k06j42L86R9m39o4L46l99K80m23J00k4R5K40k2j78K55j0j88
3508f7J07J04k58K84j48P5J85k78K74l26J15o4N2R2o9k28M03m70M80k23q0oj96
3531b42k5J67Q6K9j66K84K11n02j26K84J29k13L20j95R9k99J1L60k63q9k6K3L08
3554A65l56J16K73j90O7O4j33j36j48J02L74l8k18k5K16q9n52N08K61m85J53J06
3576C5Q6k92J35k2J65J63K1l30M98k27J33j43r8l04K28P4J46j79k5l4j04k87M31
3599G0k12J11j55l67M37P3j66r1M01J7j68L92Pj91l7M4K57j90j94J61j2K8Pl37
$$ y = [-152, -155, -132, -140, -121, -339, -317, -596, -567, -116, -88, -594, -85, 89, -31, -303, 72, 152, 62, 416, 451, 326, 333, 194, 278, 186, 52, 48, 67, -19, -73, -117, -181, -362, -209, -212, -305, -293, -351, -488, -235, 174, -5, 84, 130, 35, -292, 59, 264, 183, 365, 185, 462, 227, 21, -121, 265, 364, -75, -139, 207, -192, 88, -335, -235, -259, -164, 76, 54, -124, 131, 121, -67, 40, 144, -114, 170, 22, 97, 282, 4, 278, -48, 67, 3, 55, 147, 78, -150, 253, -217, 263, 40, -40, -46, -242, -267, -100, -14, 15, -151, 133, 344, -158, -284, 0, 129, -84, 236, 41, 140, -159, -148, 212, -51, -140, -166, -143, 165, -191, -75, 198, 8, 75, 139, 6, -130, -278, -176, 198, 160, -58, -83, 133, 44, -508, 0, 261, -224, -71, 35, 121, -171, -36, -58, 107, 270, 291, -39, 459, 232, 365, 222, 124, -180, 48, 122, 268, 89, 64, 30, -74, -361, 70, -142, -31, -186, -553, -116, -43, -209, -300, 101, 118, -50, 342, 349, 158, 121, 165, 422, 232, 38, 199, 187, 215, 222, -115]
3623a15m0J86k28n5l2K20l29K55k1r8J39j39K77k38K38Q6J4n2J63Q4o5J06j65
3646A91K18q2J03k41k12O4J37k56j01r1P0j38K05j60J39j28o0K40JK14l91L33
3668E5L98l44J12k83K20P2O0r1J57l32Q4l46J59J95k70J53j19P7l09j90L57J87
3690Bj8P3j91M79l40J2L49k30j97K60J60k33j88n8J78K27j42o1J08l9k97R0K08
3713A52j86j91K75J45j92j18jL97k59k49K86J37j80QN8j37J07j87J51J57k27J60
3735A06k28J20j65K23k49M13p9j2r4J42k82j78K97mO6n1J46l12k2K45k30J15k36
3758b69M19ok71n7J4J66l44L90K52j68j68J33K6j52J22J44l49R4K56K94m65J60
3780B21J3k20K2j62n1K77j32j13k2J77l22J30J6R3J82l14L37m17L56j91K81L29
$$ y = [-115, -155, 31, -197, -252, -284, -64, -393, -138, -159, -257, -118, -257, 20, -218, 20, 106, 120, 68, 231, 315, 250, 356, 191, 409, 327, 430, 189, -23, 41, 178, -78, -179, -270, -200, -338, -133, -293, -154, -282, -342, -102, -101, 113, -278, 55, 453, 109, 221, -62, 158, 230, 290, 199, 356, 24, 108, -238, -79, 116, -154, -1, -120, -43, -352, -542, -185, 2, -16, 57, -134, 345, 5, 17, 366, 136, -61, 199, 359, 126, -62, -120, 58, 285, 143, 82, 190, 151, -146, -56, 152, -34, -225, 50, 195, 3, -115, -116, 281, 22, -227, 59, 196, 16, 24, 82, -55, 52, -135, 16, 173, -54, 106, -122, -2, -167, 56, -193, 220, 141, 129, 35, 177, -105, -283, 14, 10, 76, 25, 171, -141, -163, 82, -148, -33, -269, 150, 144, -127, -184, -170, -4, -348, 42, 294, 126, -42, 91, 117, -35, 87, 231, -118, -24, 232, 526, 61, 221, 234, 14, 36, -126, -177, 100, -32, -145, -167, 10, -312, -182, -166, -73, 109, -205, 132, -285, 71, -120, 161, 490]
3802D90k66k37J15J32j21J31J59m00Lj44j40L20l63K61m4N9k58M8K36o2j43j73
3824c97L11J4K6O0k1K61k04J6J03Ol2P2j9J13j77j16K08k22j13J50j38J85n32
3847d46O3J8L97j63N0j54N2l7L6M06J7k00J26j69L40p1k86K79j31k18n3R0L25
3870B71m00J8j36J98n5j19K66l27j21K44P2O4l0K31J33j63k49J34J44q5j12J44
3892A22J97m06J58K53k42j9K17l09j21K58j31P0Ko1m8qn2r0K77k86J18O5M7l2
3916b1J88j57O9l97L13k40K43j45J46n0K17l7l76J10K13k66J44K55j59OL5M4N
3939A40J0j79R8jn7p4R2j30jj18J65j56K7J89j86K08j05j33N2N1K28j52K67k18
3963A7N8K45j19j78K31j1Km74K61j10q2j79K69k4j72N3k8K19r0J7r6K32J00k41
$$ y = [490, 224, -13, 102, 234, 113, 244, 403, 3, 6, -138, -278, 42, -321, -60, -104, -45, -303, -255, -19, -81, -224, -397, -86, -72, -46, 14, -7, 254, 50, 66, 169, 175, 143, 215, 196, 309, 132, 16, 224, 2, -111, 39, -99, 86, -446, -383, -365, 32, -131, -81, -235, -183, -220, -184, 222, 239, 39, 165, -4, 336, 265, -21, 258, 127, -91, -144, -54, 271, -129, -111, -247, -49, -104, -223, 43, -284, -405, -161, -89, -25, -55, 176, 309, 146, -103, 31, 175, 90, -22, 122, 319, -87, 71, 324, 82, 63, 280, -29, -150, 108, -23, 47, 49, -12, -60, -68, -120, -210, 67, -219, -101, -36, 11, -21, 167, 10, 79, -318, -5, -245, -2, -147, -1, -51, 166, 129, -247, -137, 76, -190, -46, 209, 50, 56, 91, 135, 140, 150, -29, 69, 68, 11, -63, 29, -101, -102, -220, -55, -211, -184, 5, -181, 27, -78, -211, -159, -108, 120, -32, 235, 17, 75, 320, 201, 23, 254, 243, 245, -229, 32, -78, -160, -339, -70, -94, -266, -213, -241, -22, -112, -95, -191, 41, 141, -100]
3987a00R9Q4J20J12k06k8K21K5NOj79k87K29k20J15m0j97j8j01k5L6K89Q3m57
4011d34M49j30J08k7J70J06l6j30P3o1J91k38K6J2l28M07N8k77J84k19j14J34
4033g6k08L17l10n2K33qJ9M2k6j53K38J27O8p6P9j23K57l0N0l60K17k23j98J99
4057Co8J14k31J40n3p0%J53l01L76k81J85j54L51l05L38m7k12j12J75J36Jk94
4080a56L48j20J19k77N0N1p8pjO7R0l28L01Lpk82J01O4p0L04o8j15l30L9M94l45
4106a53L6J40K7j48o2J30j54L79m68K63K6J16k82L47j68q1j45L42L5j42r8R8j31
4129i3K14j04k69K05k98K71j27R8om6L39j09j13j84M1J06q7j28K29J79J73k54
4151C7J20J95m89J60j9R3k9r7J81k93P6L3j52L1kl8J8jn9j0J35o3J3Q2p4K07k4
$$ y = [-100, -1, 83, 203, 315, 109, 81, 302, 327, 332, 338, 159, -128, 101, -119, -4, -44, -241, -259, -360, -385, -349, -60, 23, -434, 15, -115, -7, -34, 136, 242, 206, 76, 149, 88, 279, 41, 67, 79, -249, 158, 216, -61, 123, -96, -210, -76, -284, 33, -277, -329, -96, -104, -85, -43, -69, -222, 16, 143, 211, 135, 214, 91, 348, 318, 368, 8, 225, 2, -196, 3, -65, 49, -182, -42, -95, -165, -165, -12, -313, 63, -218, -33, -187, 164, -141, 197, 150, -62, -174, 1, 137, 138, -156, 192, 72, 191, -86, -36, 15, -63, -70, -71, -4, 86, -242, 59, 62, 55, -227, -126, -62, -132, 172, 104, -11, -341, -302, 192, -153, -117, 23, 50, -98, -160, -30, -184, 195, -273, -10, 16, 132, -150, 197, 29, -52, -197, 145, 180, 38, -60, 38, -93, 121, 17, -252, -47, -345, -74, -201, -103, -109, -155, 184, 75, -38, -222, -181, -75, -162, -290, -61, 118, 291, 37, 157, 352, -137, 23, 4, 97, 68, -29, 152, -141, -65, -32, -184, -153, -155, -193, -175, -176, -235, -245, -110, -173, -160, -78, -152, 55, 31]
4178C1K8k4J38m7J55J4j62n0j39K52n0j55o0r4M4l08K17o3J31J9j13K62k45J02
4202a17L08j10k38M05k12J00j00J70J0j74O6r1Q9m2l6J50k09p5J07j08j74J86
4224i5j07J61j52M6l60N94k61J13L31p3p2j05J50N6O6p5P1k48N4j09K00l33J11
4247c7j45K56Nk78M1K00k30P3L9Q2J46l20J26Q2P3ql03L32J6J33J8j81J6r0L3
4272G9j09m0j68l8K51o9j2j09J7J08p2Q1Rj0J32L8Om0K79m05L44m3l36PK96j25
4298G1j37mj62J22K7K05j62j36NJ02K39k42J02L3R6p3nM9nj06J01j90J48j7K6
4323H7k25j6Q7OL2k91K98j62J04J32j69J46j55Q0L17k80p9JL42l39K17k3j69L2
4347b7j18J19N3N7l40K27j28j1K17j16k22J30K81j08M1k24L32n9m4J06N0J06n89
$$ y = [31, 59, 35, 173, 126, 281, 295, 133, 83, -56, 196, 146, -9, -69, -163, -119, -427, -210, -273, -142, -123, -236, 26, -219, -117, 191, 81, -157, 248, 36, 136, 36, 206, 216, 42, 108, 17, 106, 64, 28, 178, -31, -106, 1, -107, -281, -95, -202, -41, -193, -147, -507, 87, -174, -61, 270, 197, 125, 20, 170, 226, 292, 217, 288, 40, 94, -15, 185, -148, -37, -182, 74, 79, -199, -158, 42, -188, -115, -76, 6, 152, -168, -42, 40, 113, 105, -198, 134, 150, 283, 301, 120, 136, 46, 79, -30, -70, -238, -276, -25, -94, -106, -215, -198, -90, -162, -81, -72, -82, 50, 88, 94, 54, 333, -72, 272, 229, -107, -100, 196, 71, -66, -70, -232, -110, -83, 122, -40, -176, -171, -69, 170, -72, 30, 63, 159, 86, 81, 130, 125, 19, 120, -70, 78, 61, 87, -138, -154, -67, -61, -29, -320, -22, -184, -80, 52, -117, 29, -126, -46, 271, -9, -88, -87, 255, -84, 133, 110, -59, -27, -145, -26, 27, 84, -256, -29, -157, -168, 49, -67, -289, -159, 122, 14, 55, -169, 163, 104, 60, 166, 216, 322, -267]
4370b67L42m9J39Q7k45K0j38R1j8P2j59k45n8K76K8q1Q7o9p5J55R3j49M83j16
4394B04M6J31j22lj79ON7P7k05N5qJ34k06n0K2q5o2k23K85l89M80J05n2J4k82
4419b50J72J47j2n9m9j8L76j87M8j9k13R3O0J38j09Nl02K2L8j90J93k0J11p9N7
4444d7J69k52l5o3J36J26K42k64K17l68K27JR1q8k6m3k55L69j42M6o6LJ40j92
4468g4l6Q3n2J8N6j69J25jj12m7L12k68L99j93o8J81k18q7J31L9o2K2j04K34p8
4493C1q1N6K17j86p0RK55m1j38L2k38Q5J36n9n7J20J85l72r0j65L10J48j77m6
4517a36J60J14k24K56J0j91n8J0K73l40J88Q0k16L0J84k20L3L3L7K8N2l22J21
4540i8J97j67k09J90J84p8l08oL79Mj32K32J28j94m6K8J02o9k12J75l0O2k59J80
$$ y = [-267, 75, 26, 165, 252, 7, 27, -111, -20, -38, 34, -125, -370, -428, -152, -124, -205, -118, -187, -262, -107, -14, -163, 320, 204, 250, 381, 259, 256, 77, 83, 140, 217, 12, 67, 59, 193, -13, -63, -41, -126, -188, -411, -126, -515, -35, 70, 18, 32, -250, -78, 69, 57, -2, -51, -69, 307, 120, 168, 149, -64, 29, 89, 227, 118, 123, -179, -157, -119, -309, -116, -136, -25, -104, -47, 122, -130, -165, -228, -92, 34, 276, 12, 229, -139, 88, 89, 180, 92, 66, 23, -232, 137, -5, 41, -25, -22, 118, -74, -110, -27, -79, -61, -5, -174, -49, -50, -162, -209, 103, -165, 234, 41, -27, 154, -64, -151, -20, 19, -43, -21, -125, 109, 31, -50, 6, 223, 37, -33, -24, 231, 190, 52, 84, -154, -69, 67, 8, -49, 71, 256, -116, -206, -371, -61, 87, -90, -136, 24, 138, -86, 170, 180, -11, -69, -59, 214, -126, 62, 142, -74, -44, 140, -80, -47, -14, 23, 51, 103, -219, -98, 99, -68, -277, -87, 97, 19, -289, -295, 84, 88, -44, 188, 316, 122, 76, 104, 206, 137, -75, 100, 70, 132, -127, 53]
4564E3P6jl68L48k16j80P7J78%j59J31J78k21j00R1K08k24J64N5J6J95n79N17
4587B39q8k08M00l64j14K59k81K3J26l2KoO3q6q6K00r0rK5J26r6j28m7L66N0q4
4613A60r4OQ2J11l4m2jj56o1M4o0n0k4j31k11K68j3J34q1j1K10j07k2n0K40q4
4639B3j18J73J15k36L14l11M09j16m61K69j38O4j80J28k1k41J28M09k58K10j1
4660A51j40l0j49J00J43n0j5p8N4k9K0M8J66k81M3O5K2N0j20K10k87N7j51J90
4684a1j9J32l03N2M61l47J41L6O1j29j85j41K75j31k0J71m1l5j17L9K80l18O3
4707h6K92j32k12M3N7PJ54j04J62o5j26J70J34l25L5J5l4J93l55J22J6K2p2q2
4731a71M2J53Mj30O6Q1K6r7K26o7J33j84k7MK84j42k58K19p7l8j02o3N3Q2k05
$$ y = [53, 129, 128, -240, 108, -108, -288, -211, -33, -33, -192, -61, 117, -104, -204, -113, 95, -129, 35, 90, 106, 301, -278, 239, 151, -57, 343, -21, -135, 124, -157, -134, -8, -40, -38, -44, 19, -67, -153, 47, -43, -52, -27, 99, 3, -125, -172, 194, 244, 160, 66, 72, 154, 265, 231, 189, 188, 32, -29, 15, -45, -95, -119, -250, -461, -193, -206, -72, -153, -164, 46, -61, -83, -133, 107, 23, -95, 78, 193, -43, 271, -40, 369, 253, -208, 61, -77, -13, -193, -65, -86, -327, -199, 210, -48, 162, 151, 11, -19, -168, -68, 75, 25, 10, -68, -14, -43, -23, 25, 191, -90, -47, 18, 40, 90, -30, 180, -107, -50, -201, -11, -30, 102, -201, -149, 312, -35, 106, 142, 203, 74, -111, -252, 23, -108, -128, 43, 2, -33, -150, -111, 169, -149, -86, 206, 74, -138, -95, -38, -31, 123, 19, 181, 116, -10, 160, 294, -31, 4, 19, -15, 178, -177, -55, -39, -17, -89, -171, -129, 24, 28, -102, -36, 45, 71, -26, 200, 133, 266, 82, 55, 59, 343, 201, -57, 162, 85, 47, -55, -118, -65, 17, -188]
4756a88J74j4l9j28J99j1J0k21Q5o1L69j89O8Q8K37k15j80K14o6K3J3l8r1k13
4780a74M11k47N3l36K97p0j47j14K29n7p0M04l01L71k1Jj37J0N9O1Q6J24m95L3
4804c0J09j64r9K65J95m01Q3J02k42J41j39PK51l03N5K38k95o2K05K7M7M1k85
4827b54J92J37J97l64J40K56k36lk15K83r5j47J31j87K55j25k55J88K46j96J10
4848E8K94l10n5J70j17r6J9k3K00n9k42J49K7R0Kk22mJ22l35J69M94k99J64k97
4872a01J79%j81O5M0J56j30Q6m7N5l3k4j43R3m4pJ15J63m13l0j7J69K72m35M0
4897a72lK40m8j75J67R%L0qK04j14N4R9l75J33J11k91K80l14O6K5M8j67K78j00
4922b3r8J09O4j4r7J17R1p0j3k5J24k3k92O9M23j05J11l88K49j38j6j1k68L28
$$ y = [-188, -14, -28, -67, -195, 4, -7, 3, -218, -133, -194, 175, -14, 54, 142, 379, 164, -16, 198, 132, 155, 168, 130, 39, -174, 237, -10, 43, -293, 4, -66, -213, -327, -98, -155, -225, 179, -122, 249, 228, 229, 92, 102, 161, 222, 308, 432, -63, -30, 79, -85, -184, 81, 276, -125, -42, 60, -182, -41, -180, -173, 78, -225, -170, 68, -227, -289, -84, -57, -10, 31, -254, -62, 75, 272, -92, 48, 304, 68, 65, -150, 133, 38, -109, 22, -165, 90, -35, -290, -102, 144, -52, 58, 352, 42, -13, 157, 40, -56, -37, -60, 140, 81, -161, -12, 15, 105, 107, -115, -119, 3, -332, -163, 331, 32, 196, -101, 78, 78, -103, -38, 2, 158, 28, 114, 67, 122, 89, 65, -78, 15, -29, -36, 79, 242, -171, -201, -218, -49, 223, -212, -172, -175, 65, 17, -158, 9, 18, 18, 48, 40, 244, 130, 184, 283, -92, 41, 152, -139, 141, -173, -107, -82, -34, -201, 77, -23, -121, -12, 52, 38, -59, 58, 149, 79, 66, 41, 165, 142, -150, -81, 342, 237, 348, -40, 209, 71, 55, 44, -224, 104]
4946A04l61J10k2r5J00%OK40k31P9N2k8p6J98M3j59M1k6rL95k71rk3M7l41J00
4972a36K20j42k55K3M09r6n6Q7k9O4j20j84L14j31M1J9lM8qk7k73M64o4l79K30
4997A6k73L53j81J62k93N7L52k9k15j56J6P7R2n2K87m13M66m50L16j85J61J86
5019B94k20L4o8P8j80P9O6k44Q6n4J31ok06P2J84J08k43K66m46K36j67K10l9k67
5043b96N06j48k66J95q8J12j4j62L20l43K92J04n39N14k39L8j41K27K5k86K51
5064F2J50l17K07j7j17L35n07L75j99l6p5pJ79j25K32k78K83j63k00J8K07k08
5086b01L7j13K67j4o8L82o2K9q5j14l9r7J78J3K6m13J21M42l44k9L5K0j1n7o3
5111a60K43p3N4j06j22L55M2n67O24n22K97j07J89j4j04j07J94p4j42L35k96M2
$$ y = [104, -257, -147, -169, -264, -164, -164, -158, 82, -149, -70, -18, -46, -122, 76, 119, -40, 1, -25, -34, 361, 90, 81, 58, 105, -236, -136, 84, -58, -313, -290, 119, 23, -33, 54, 25, 89, -31, -215, 99, -32, 9, 28, 25, 73, 65, 38, -235, 229, 165, -214, 16, -257, 96, -85, 77, -216, -159, 193, 164, -51, -207, -191, -114, -22, -74, 213, -200, 266, -184, 132, -53, 108, 294, 74, 108, 40, 118, -62, 17, 83, -161, -75, -129, 2, -4, -210, -138, 46, 154, -89, 177, -269, -33, -200, 10, -29, -296, 210, 62, -204, -9, -97, 15, 1, -161, 159, -184, 108, 212, -327, 187, -52, -14, -155, 72, 97, -189, 62, 212, -105, 102, 85, -32, 303, -204, 171, -28, -64, -139, -146, 33, -92, 140, -138, 145, -18, -218, -200, 7, -201, -164, -277, -10, -24, -92, 290, 228, 257, 172, 58, 19, -78, 100, 113, 139, -274, -153, 289, -55, -84, -49, -29, -40, -97, -160, 83, 10, 64, -42, -164, 191, 233, -334, 290, -232, 65, -42, 147, 133, 29, -78, 116, 42, -100, 235, -61, -19]
5133a9J4j65K4QJ57j21j03j1J65O6j50K90m64M65j22n4q5M0K42p7M2m45K73O1
5157C1l2j11lR4r6M1J17k67o5J93rK83j92N1l5r9J18L7j10N4n6K04K0m60M45j43
5183A0m6K16j54J31O8k55m3j50R8j00L89k83m1r3K43q6J00l4j13K82j46K19k42
5206c0q8J19m1K6Pj33J25K9j92Q5Pk00L1M02l8j77k65L93j50J60K18m51L39J06
5230B82m41O1lJ53m2n5k7l8J30k86L2K91l09J81J45J58l28J1J34p3J78K94n01
5253e3j83K52j9L68k54j42j15M37k44k10j47L24k34R2L09j46k2j14J59j09m3J91
5275I7Nn3R8k3N8M4J2k59J62k53J08q0J14k32QJ42n4K08l08K87k61J89Q9j45p4
5300a21N2J5%L56k69k8M3N2j70L10l05K23j28L1jO6j19J74l27j0j%J27mJ97j93
$$ y = [-19, -5, -170, -146, -138, 19, -102, -205, -216, -51, 15, -135, 155, -309, 156, 34, -20, -105, -65, 177, 100, 142, -303, -30, 31, -1, -112, -115, -21, -117, -76, 41, -226, -291, -98, -107, 176, -16, 35, 0, -99, 19, 56, -54, 0, -56, 148, 168, -292, 153, 10, -36, 180, 26, 157, 225, -30, -73, -223, -125, -225, 164, -119, -160, -253, -10, -96, 4, -30, -143, 139, -7, 212, -30, -118, 1, -40, -14, -7, -140, -15, 14, -178, -93, -86, -286, -255, 147, 109, -68, -333, 60, -90, 70, 288, -163, 176, 282, -159, -98, -101, 52, 10, -45, -72, -110, 20, -266, -234, 57, -252, -71, 74, 232, -96, -85, 49, -24, 154, 448, -53, -236, 16, -3, 365, 111, -31, -146, 291, 47, -163, -310, 14, -220, -128, 181, 35, 13, -101, 58, -51, -94, 97, 102, 49, 147, 124, 182, 226, 238, -21, 141, -112, -4, -84, 30, -202, -194, -52, -106, 102, -206, 81, -180, 9, 98, -47, -121, -69, -54, -54, 302, 33, 5, 48, 100, -70, 240, -65, 158, 30, 61, 60, 126, 7, 181, -146, -156, -157, -157, -30, -34, 163, -30]
5326c0L3N7j14J57k72kJ63J24j9l31L56r4L0R1l0j21r1J10J12o7k57K03k34K90
5350F4k95R2%O6Q4R4j02k3j56L11Jj42J33k87L87j59J12m1j09K99j24k50N6K05
5374B16n8j43O6l22K00N5ql07J97J36J80k22j48J58M7j97q7L5K00J55j10K8l5
5397C6K27m43J25K59m73L64j49K37k63J49N1j75n2R6O0R1n58N63l7j37l21M93
5419A43K20l13K76l48j02K94j72j05k5L15ok99K1J38J17K6n9l44j31M31k36J13
5441d6j17L11k3j42O8o6rJ31Jj23J7j06J74l0jQ4P3r5l6J81k00k22L31J47m04
5466a02Q0n7M4P6P8r3j46K86k1n1N5M6k39o4J97P6l56m9O2K31j20J1p1o1M0J66
5492A8K1J25j90J56k5K5Q1l2k10j2L39k20j37rJ28k78K00K00j46l15L50k41j78
$$ y = [-30, 3, 60, -54, 103, -169, -171, -8, 116, 97, -234, 122, 28, 58, 149, 119, -2, -93, 17, 129, 62, -195, 8, -226, 64, -231, -139, -139, -73, 11, 105, 3, -20, -176, 135, 136, -6, 127, -160, 227, 68, 180, 139, 30, 329, 205, -45, 11, 216, 158, 15, 81, -241, -41, 14, 6, -301, -104, 32, 212, -10, -158, 0, 47, -150, -237, -202, -2, 153, 43, 71, 36, 263, -180, -55, 204, -269, 95, -54, 183, -80, 69, 120, -55, -107, -11, 49, 140, -418, 145, 108, -29, -350, 143, 363, 50, 326, -22, -124, 170, -2, -107, -132, 183, 177, -122, -101, 37, 154, 180, 121, -223, -354, 77, -159, -46, -163, 148, 125, -17, 51, -15, -24, 107, 108, -15, 2, -104, 70, 40, 39, 123, 196, 101, 65, 246, 46, -176, 155, 302, -102, -22, -79, -35, 41, 119, 26, -120, 166, 145, 94, 149, 195, -44, -108, 89, 165, -191, -240, -178, 53, -67, -56, -127, -188, -148, 18, 39, 164, -26, 130, 105, 130, 211, 179, -31, -43, 296, 76, -61, -70, 58, -220, -20, 180, 34, -281, 69, -172, -350]
5515c50J39L00j34P7L4J88o4o1k26K48l9J75j51J15J36m00j09p6J51j64L68j08
5537D9q1o0M0k5j57o1P5J61KJ77j24lj7o6K66k67J36k68M38m7j95Q1k39K26J52
5562A93l33K9J77Rj3l22K00j61K15j98mP1j18P5L51j74k1K06j38m6L19k57j0k69
5586b19L38M0k6k46r0J37L29j53q9J65l2j29l4J48p5L4M1k13K45k08K85k27k9
5609hj22Q9Q7q8k10J19Q0j21J66j3K63r7l8q9p9k7J87M8Q0m05J95J32j04J90j17
5634A18O4p8j63K41l24J30j59n6K34j98J36N7Q9q3rk09L12k18J21N8o2L5j37K13
5658A12n0o0l8Q3k02K43j79Q6k19O8K85n5j06m8q8J96N1o4O9p4J05k30K94K8j46
5683F1n0J8J74k63K22m0j40J81l64J82j79kMP0j2Q6m2K67k19j58J78L44n00J23
$$ y = [-350, -211, 89, -45, 32, 66, 254, 190, 129, -97, 151, 112, 287, 136, 251, 387, -13, -122, -198, -47, -211, 157, 49, -32, -92, -52, -77, -234, -295, -220, -59, -57, 120, -4, -7, -24, -90, 176, -91, 45, -223, 215, 168, -27, 54, -185, 41, 193, -140, -111, 66, 75, 62, -260, -60, -221, -6, -204, -208, -137, -255, -180, 171, -3, -24, 182, 44, -2, 317, 60, 50, -219, 119, 159, 133, -113, -203, -66, 263, 110, 21, 186, 154, 25, -9, 139, 64, 98, 139, -74, 171, -37, 248, 21, -8, -130, -41, 46, -42, -252, -133, -53, -174, -8, -21, 242, 145, 107, 18, -61, -88, 99, 147, 227, -178, 17, 149, 45, 235, 118, 182, 104, -59, 182, -142, -12, -171, -227, 7, -191, -55, 2, 91, 8, -1, -210, 102, -116, 5, 63, 1, 36, -101, 112, 62, 2, -36, 47, -155, 88, -91, -5, -224, -156, 129, 74, -32, -80, -168, 28, 79, 15, 84, 10, 115, -115, 179, 207, 61, 11, 29, 203, -60, 162, 122, -18, 163, -201, -19, -198, -200, -196, -126, -138, -52, -94, 173, -46, -204, -26, 318, -182, -59]
5707e9K48j60K7r7Q6j12J89k40J66K8J66l10K79l32J89K30n40L46k7J3j82J07
5729A5l02Rj7K25K48j60k53M08m40M72kr1J04j69k02p9L98k22NJ79J5k20K3R2
5753C6j56j29j38J39Q4j6K28j68L04p0M9k93K73O3k47J40l65J71pK89P0j82l77
5776c02J31J53J36k13j09K33J79m47K60P0l71L98N3k17l2J60j44O1l86M74J68
5797B55l15Q0J85j41j77j07N1K76k25L15k86L46l59O1p9R0n3j28R2J45l9k18L26
5820I5Mj82K15k57J11j0J32pk57O9l7K09q7o2L0M5Pj57K27k45j1K01j22N9M7o7
5846e0L47k70o9pP5MQ8l81K2L4K06l3J92l37KL66o1k38j04J01lJ22M5L5k6j09
5872d9J25J47l38M1L78J53k95k24K27k47J94j19j09J76k21n6J02L4N1J3Jq6l4
$$ y = [-59, 189, 29, 56, -41, 45, -67, 122, -118, 48, 76, 242, -68, 211, -121, 68, 298, -242, 104, 77, 90, -92, 15, -287, -278, -295, -70, 178, 18, -235, 173, -267, 205, 203, 112, 216, 47, -155, -234, 164, -58, -53, 126, 141, -79, -56, 36, -120, -249, -387, -248, -164, -180, 48, -120, 184, 114, 163, -130, 143, 206, -41, 99, -266, -95, -102, 187, 257, 75, -302, -171, -18, 118, -95, -204, 29, 208, -239, 21, 91, -280, 118, 171, -46, -78, 82, -62, -1, -387, 87, 255, -60, 20, 205, 64, -113, -220, -169, 107, -118, 197, -89, 257, -102, -41, -120, -30, -83, -211, -119, 26, -13, -231, 95, 99, -83, 132, -125, -14, -24, 108, 101, -156, -87, -124, 85, -2, -64, -34, 11, 18, -139, 88, -157, -168, 33, -89, -30, 17, -50, 297, 27, -42, -49, 26, 30, 118, -263, -241, -207, -1, -34, 158, -179, -177, 189, 128, -110, -214, -113, -116, 6, 51, 86, 60, -49, 76, 223, -115, -74, 304, 457, 162, -62, 165, -82, 112, -7, -116, 60, -161, -217, -115, -81, -30, -17, -16, -102, -136]
5895a36J66M2l84M99k36J4N0R1K7K7o4k7K8j63J2j06J6L40l70O2P9M5R0k46N4
5920i0P9K1m5J78j89N9m4OJ79j89j43K34O8L9k23M52m09O8k3K0R4l6j52j74p0
5945b90K44Q8j93R0j84o0K57K6q2J1OK45o4J6J43j02j57n8J76k38J80L7L8k9k43
5970a43O0K4m2J27j78L36k13k6n5lK87jj31O5j5J57l97J24J97o4K7Rj09j5o9J35
5996H7M8k19K14q0j55J15Pm9j5J89j46o8k20M62nk81K62j88N7R4k02M5J65nj48
6021c6N3l46L92N3n7j69j49J68o4J94L10m72l7K46j52l2R7q2K3L3LK9j9p3k08
6046b95M99j51j53L50m4l48J72n5P1k09J44K20k81J72J07r9k03R1l5J07l5l1K49
6069B43m98K90Q4k31nk38L57Jj71l9K05J2q4j2n7J37K4J06q2K70o7k05j84K72
$$ y = [-136, 30, 72, -312, 187, -49, -35, 15, 106, 133, 160, 96, 69, 97, -66, -54, -160, -144, 196, -174, -112, -33, 12, 102, -144, -90, -11, 10, -35, 143, -46, 13, -31, -25, 154, -35, -178, 56, 124, 163, -60, 392, -17, 51, 28, 48, 142, 106, -46, -220, -290, -46, 42, -151, -61, -245, -305, -48, -22, -104, -93, -87, 158, 94, 110, 253, 151, -6, -64, 112, -126, 54, 91, 129, 100, -143, -83, -59, -101, 26, -152, 184, -29, -55, -110, -113, 174, 173, 42, 107, 92, 249, -148, -24, 173, 109, 136, 145, 36, 21, -48, 87, 135, -84, 130, 50, -105, 10, 17, -32, -47, 142, -4, -72, -292, 170, 165, -116, 146, -42, 15, 109, -93, -48, 117, 112, -36, 17, -329, 63, 116, 59, -110, -259, -91, -155, 39, 349, -123, -160, 86, -66, -98, -1, -83, -60, -27, -24, 5, -14, -87, -295, 204, 53, -100, 250, 206, -142, 30, -25, 46, -163, -19, 201, -80, 92, 199, 100, -103, -12, -47, 60, 25, -6, 243, -255, 35, 119, -112, -117, -355, 2, 3, -168, -207, -2, 10, -74, -86, -143, -6, 18, 124, 42, 312, 245, 40, -144, 128]
6093A28j67K56j86J09r6j14J68%k16R6q9l6j46J8M03k30j6j03M36j72P2J32k5
6116B22l10J63Q2J01n9j12j2r1M5K10j18j29j71RK33J05l8j72r1J52N4p4j07j09
6140b17J88q5J35k0J08j72N2%j08J54m1N7K77j94k85q2L93l40J25j10K68L0l10
6163a77J30N9M4j14L0m0N7Mk24M4l0J02M1L03k73mJ56j55L3J1o5K06o6k08K0K13
6189I7j33nJ66k26j36L22N5j45j00J08K48k36l4l6n1K31k37q1L15k73j27K09m2
6212a11r4J64o8K15j62j1J2r0K32k3J80j79j7K4p6K12k45q4Q6p0Mq6M4J42p0m5
6238a16J9J36Jj71K42o9R2m30L14j00k13J46J78j72K39J5j68L15j88Q0k45J19
6260B4Kj21K19j56K39k73jJ97j61k13K09oj24J99o9J04J12j56R6nL9j75n3J51
$$ y = [128, -39, 217, 31, 140, 44, -70, 98, 98, -118, -22, -111, -147, -293, -275, 128, -102, -118, -221, 215, 43, 115, 247, 222, -88, 75, 157, 258, 199, 87, 75, -16, 29, 239, 121, -8, -179, -170, 63, 168, 130, -42, -133, 19, 73, -1, -108, -217, -29, -114, 21, 1, 109, -63, -11, -11, -119, 35, -6, 51, 328, 134, -151, -233, 160, -180, -55, -165, 103, 133, -177, -47, 12, 56, -58, -28, -68, -11, -7, -231, -187, -217, -115, -74, 229, -44, -48, 108, -47, -14, -3, -68, 138, 72, -136, -116, 97, -36, -41, 125, -101, -237, 85, 140, -5, -105, 3, 251, 15, -19, -55, -106, 125, -112, -193, 122, -151, -278, -69, -111, -205, -41, -109, 106, -56, -67, -55, -145, 87, 64, 244, 65, 48, 72, -4, 208, -37, -121, -35, -105, -101, -187, -143, -1, -71, -116, -97, 39, 40, -131, 111, 42, 134, -296, 18, -82, -295, -149, 29, -143, 96, 111, -57, 258, 70, 150, -95, 24, 26, -95, 124, -32, 207, -66, -67, 130, -31, -244, -35, -41, -165, 34, -35, 69, 181, 25, 121, 116, 155, -20, -73, 78]
6284G8j81R4N9j09K0P6o8J64j04k01J88Q0j60L8J31k84K10M2K5j52J62J15j83
6307D0j38K56k9j16j35N47n50n6j55K32K09k66Q4N8j52J34J55q5j79L23rj77J15
6330A06p0p9R2pk08L57k70k1O8O6j33O4K86j51P5j5l64J69R4J55m17J34j08N5
6354a22L7M2J68r6Kn7j17K10j15K47o8J75l72K80k19j09M5J78q0Jj18L0L4j54
6378a78K50k88N19k22o3n1R7j41j08O6k4mL85M1o21J80o1L57j65K11j36k2k73
6401b51M30j13q3Kl00J68KM7P5n1l9K04p3k66L78j15K74l40J93k94M58l77m0j09
6425b20L32j17Q7K18m83J51l2K34k66p1J44o0J0K89k17J25J14l18K49J1q3l1N8
6448A24K0m38J12K93R5l58j41J98K38j74J60j88J85m6m9jr5R9k70K31J56j37J64
$$ y = [78, -103, -9, 50, -59, -39, 37, -31, 133, 29, -172, 16, 96, -64, -26, 105, -179, 31, 73, 98, -54, 108, 223, 40, -98, 158, 129, 13, -122, 425, -125, -181, -336, -104, 105, -161, -77, -19, -171, -37, 118, 33, -146, 177, 168, -9, 106, 36, -43, 49, 42, -166, 191, -79, -100, -32, 34, -99, -35, 251, 100, 175, 160, -204, -35, 59, 214, -203, -69, -177, -122, -85, -43, 125, 29, 31, -26, -143, 67, -48, 199, 131, 306, -66, 214, -5, -114, -69, 109, 29, 30, -88, -58, -24, -178, 72, -216, 303, 81, 18, -33, 64, -77, -185, -119, -143, -147, 238, 279, -342, -162, -223, 134, -31, 180, 44, 22, -251, 179, 66, -17, -15, -315, -147, -145, -98, -23, -74, -113, 91, 18, -248, 130, 15, 289, -51, 142, -152, 306, -71, -111, -220, 112, -5, 82, 300, -183, -32, -64, 170, -96, -167, -23, -83, -73, 216, -1, 124, 238, -80, 169, 180, 97, 66, 124, 144, -294, -182, 111, 206, -152, -293, -95, 143, -31, 129, -59, 126, 80, 31, 30, -65, 34, -236, -5, 151, 14, 178]
6471A78l83J15p1K16L03k51L8k84K33k69J19k1J52L2j79Kl2m7J91J76l05M9p3
6494a11K94J53k80J00r7j13K58k63L6k6P0J49k80J38J25j6r5N4j71l25L13l9L16
6517A90j16j99J11rrP2J41m8l66K73oJ30j19m7n3J39j55J62J93j74l33K23k23
6540b23M12k53j02J49l2k2K0k33J88Q7o9M9J30lMPl90K82J8k8p1J64k7K56n35
6565b22K61p1O3J77m40L69l43Q1Q1m4J56o5j58J19j06J65k30K02j40J28k00O6
6587a51K94l71L56m0J54k02p1p8k25M85J1l17K01k4P2m7k23J32J53N9k00j38n3
6610b23m7J91J25l36O9J81o5n9J10O4J61j74L4K9Q5j28%j32J29J2J35j5p9n0Q8
6635A05j0k17l1J16Ol0N8J43k37J23K05j72N8J2k24L50l90K54q0qj39K21l27J26
$$ y = [178, -205, -90, -161, 55, 358, 107, 145, -139, 94, -175, -56, -77, 75, 107, -72, -70, -102, -149, 42, 218, -87, -38, -111, 183, 336, 56, 156, 59, -54, 204, -59, -23, -49, 21, 170, -110, 28, 153, 137, 42, 96, -75, -400, -87, -126, 190, 74, -125, -14, -23, -32, 40, 181, 133, -233, 40, 34, 164, 45, -2, -55, 84, -71, 91, 284, 110, -223, 0, -223, 189, -64, -166, -17, -49, -71, -51, -284, -96, -9, -78, -29, 101, 98, 102, 109, -281, 1, 19, -9, -80, 84, 57, 313, -222, 39, -32, 31, 208, -232, 137, -206, -125, -44, -88, 68, 3, -155, -36, -142, 23, -207, -5, -145, -17, -217, -151, 143, -228, 128, 88, 242, 40, -31, -109, -334, 151, 162, -155, 46, 22, 94, 47, -176, -44, 109, 168, -32, -170, -223, -270, -79, 46, -290, -221, -40, -105, -164, -54, 10, 171, -3, 31, 60, 145, 17, 17, -115, 14, 26, 161, 146, 67, 17, 105, 95, -122, -153, -37, -31, -61, -3, 140, -97, 26, 231, 59, 117, 129, -95, 255, -135, 119, 39, 31, -108, 113, -214, -88]
6659h8J21J06J30l71J35qJ35l62K99m1L5k06o7K95q7p9p1K56k20R8J33j39L23
6682C27n17M24r3k21K11j45L68n6m40j3K43j82J14j85K16oJ0l28K52N8k58K28
6704GM6j18K20l70K87k88M11lj52k71K11pj5J96j74J88j84J11k77L75n78L15J60
6727I0p1K1j65J91k98J65Q6J14r7l4P5p9j84J92m5ok11M98j69l01L12k11J46o8
6751d9j00J7K18m13K83J92j3k81J97P0l62J75j80O5J05J64nj1K2j22l3j3J43j11
6775d2J09k3j79K11j95K98n29J01K13RK52k52l6L30k28j08l2J59l07K85k94L8
6797b20L18k82J38q1J06j5j71J07N8N3J0j42P3j79J79J51j5j73J7L16k49pL20
6820C12l02QO7K3j52L0j90P3J78j24R5l18M10l64J90J43P0K43m92P3J24p1l85
$$ y = [-88, 33, 139, 269, -102, 33, 25, 160, -202, 97, 56, 91, -115, -182, 113, 26, -53, -124, 132, -88, 10, 143, 4, 327, -190, 234, 141, -80, 131, -14, 354, 298, -142, -155, 88, -94, 20, -165, 51, 45, 55, -273, -21, 37, -221, 7, 53, -65, 155, -215, 72, -216, 195, 192, 40, -231, -20, -27, -42, 154, -20, 168, -16, 95, -182, 193, -385, -70, 90, 19, 40, -125, 66, -232, -67, 19, 133, 36, 2, 77, -2, -186, 6, -39, -45, -256, 242, 73, -228, 84, -127, 19, -49, -149, -132, 86, -327, -44, 148, 135, -146, 51, 121, -241, -66, -246, -181, -76, 88, 83, 72, 94, -28, -61, -74, 69, -42, 67, 44, -135, 76, -119, 179, -350, -249, -36, -27, 225, -27, -63, 267, 39, -69, -101, 58, -249, 36, -258, -220, 98, -184, -46, -127, -21, -36, -207, -100, -42, 11, 21, -121, -48, -227, -48, 103, 88, -85, -68, 248, -1, -8, 312, 10, 18, 85, 108, -44, -14, -204, -131, 47, -77, 18, -300, 110, -254, -64, 79, 149, 392, -100, -27, 97, 26, -359]
6843c59K54P6J82k13L2J61k34J29Q9J10o57M82m0l4k6k01L64m43M81k33J22l2
6865A0k43J9K31j40K94j63J41l01L68m64K52J12j42J30j08q0J4j9R1M1%p9M5j79
6889a70R5M13j94l5k12K89j99n5n9oJ36J64o3j22l49M95k00J66j1j36n0M5K60
6912B02j54n7o9R2k54K27j21J84l0N7j55N0L2M7j66p6L18j18j52J22MR3ok02L40
6937B08k9k79N6j41K22pJ22q9o5j21l8n3l1J76j03L76m50K36L14k21o2k61J00
6960a40K93l71J9L36k07j03J15j10m2l2J95o2J96Rl70J84j6K10p3J29j73O3n2
6983bj13j5k0q2J31k8K52l38K17Q3j96M6o4J92r2p0J63Q8j56K96m65K79j48K55
7007B13k94j3L27j84j70K89j94J39L1j17M3J20l13J90k0L2J5k50k6J13Oj0K3r
$$ y = [-359, -105, -29, 153, -60, -28, 133, -101, 28, 117, 227, -430, 52, 12, -22, -48, -249, 115, -328, 153, -80, 42, 10, -233, -214, 17, -123, 171, 8, 149, -152, 216, -248, 4, 116, -26, 104, -4, -84, -70, -89, 2, 43, 43, -36, 9, -170, -75, 338, 144, 109, -103, 186, -13, -68, -127, -133, 3, 167, 104, -18, -367, 128, -72, 94, 83, -53, -103, -58, 202, 48, -9, -78, 14, -240, -13, -134, 50, 20, 77, -78, -28, 4, 51, -115, -191, 127, 9, -143, -21, -17, 76, 70, -132, 208, 179, -100, -44, -185, 37, 30, 152, 63, -2, -123, -161, -214, -245, -69, -172, 204, -246, -10, 304, 83, 21, -240, -140, 153, -218, -199, 137, -70, -173, -58, -168, -210, -242, -47, -109, 87, 96, -274, -90, -106, 104, 31, 160, -13, 50, -2, -115, -130, -150, -232, -101, -129, 123, -215, 2, 85, -111, -65, -129, 63, -29, -99, 64, 152, -4, 292, -173, 106, -42, 213, -81, -94, 233, 49, -121, 168, -26, 113, 144, 27, 70, 190, -123, 67, 47, 79, 94, -156, -182, -69, -63, -73, -50, -59]
7031e9r7K10K03M8l55k50M65p5q3R0m8Q3k94K18j73N2J1K77j81j57L12k20M2k48
7055b29L14K5k19K45k1l49p2j34N09K29k76P0j35J28r6j86L53l52L56k50N8l66
7077c98L08M1J39l7O0M9j48R0j56P4r1n1J41lk56M11j63L6K02p8k45N3R2j71l7
7102a38L76m06L16j72J28n5K6k39R3J82k33L85k02j36rK40L8k13L25l77R0r1l6
7125a08R9j85k5M09k24J35l52M13n8o9J87k23N2K56k81lj41J25M1K17k77J34k76
7148a54N0k9K13o9k01N8n0M30l55J4K07J41k16Qo5lK51l07mO5m1n8J20k45L61
7173A21j01k1o0k9K67l08K3O2r3M7J39L6j68J23K15m06k04M05K12k71J1p3M1M8
7197A6j8qL63l11K6l64M08J91n03J36J42r5J16r3l5Q9J14j49Jo5N1kj92M0K1P4
$$ y = [-59, -156, 54, 257, 305, -50, -300, 165, 90, 7, 97, 49, 132, -162, 56, -117, -65, -54, 223, 42, -115, 197, -23, 19, -229, 85, 110, -109, 136, 115, -234, -306, -440, 69, 298, 22, 92, -43, 85, -11, -197, 156, -196, 160, -90, -32, -398, -90, -49, 90, 53, 113, 162, 14, 104, -52, 22, -69, -120, 21, 18, -238, 173, 10, 46, 248, 170, -75, -22, 70, -101, -138, 238, -168, 148, -24, 104, 49, 75, -164, -71, 111, -122, 263, 61, -75, -84, 156, 194, -19, 306, -71, 19, -72, -108, -9, -194, -219, 190, -34, 101, -251, 162, 104, 35, 222, -1, 51, 307, 26, 23, -118, 7, 48, 265, -12, 122, -154, -104, -133, 80, 11, -190, -132, -182, 248, -107, -93, 114, 255, 39, 47, -18, -21, 230, -77, -81, -16, -57, -115, 5, -240, 121, 20, -1, -61, -90, 177, -131, -108, -46, -139, -92, 47, 83, -85, 38, 253, -153, -357, 48, 260, -11, 0, -73, -32, 16, -2, -10, 353, 42, 68, -296, 112, 303, -200, -64, 78, -17, 99, 6, -29, 60, 174, 25, 26, -39, 12, 10, -182, -142, -121, -47]
7223d7M7J28o7r2L11m25J99J03j52%k57K47k1n9J10O6j21Q4J38j28k09J99J56
7246B10k69PJ28K5L3O3j56K15j75m6j73K78k28N4Q5m4n5J32k4j08J49j2m09L22
7270Bj13L30k29J74j10j59J39j15R3m0K62k42L0j14P7L9j19r5J83j32p2J84j23
7293a50R8J62J83l20j17J33O4j29j26R1J24J62l17J5K33j89J5K76j74K36j28j61
7315a9j73J40R5P0n8m12L89m5J48J59l19J51k19o6J58n5K09r3j85M68k80j48K5
7338f0l0K03j38q5L21J26k66j46k98N99m3l24K33l05L17q6k72L0K80r2j6k60L70
7361E8j04Q2j5p4l2p9K9k2J56n4QK35l86k0O5J99J24m9j61K46k39J84o3r2Q9r8
7387a3J9k8K80k85J10k18O9n6J96o1l3K0L5j58J22q7J39j47o6J92j23M90l73o9
$$ y = [-47, 0, 128, 61, -31, 280, -145, 54, 157, 5, 5, -252, -5, -26, -85, 25, 91, -30, 54, 192, 64, -145, 54, 210, -59, -52, 76, 101, 134, 197, 41, 256, 81, 35, -138, 140, -88, -34, 51, 7, -48, 84, 60, -48, 101, 89, -320, 2, -111, 219, -10, 164, 54, -105, 34, -81, 12, -28, 234, -8, 22, -92, -15, 24, -95, -190, -7, -139, -211, -27, -150, -52, 110, 293, -27, -144, -11, 53, -76, -202, -111, 13, 175, -142, -127, 106, -83, -68, 208, 34, 270, 142, -19, -192, -52, 43, 113, 55, -357, 32, -13, 135, 294, -25, 126, -93, -159, -1, -56, 153, 60, -125, 343, 63, -85, -60, -90, 113, -25, -110, 211, 337, 71, -75, -373, 226, 183, -141, 92, -213, 104, 18, -254, -224, 56, -36, -52, -312, 58, -46, 36, 21, -53, -85, -164, -135, -157, -1, -55, -47, 188, -198, -218, -153, 46, 170, 121, -40, 206, -33, 151, 88, -4, 85, -13, 6, -22, 258, -27, 83, -135, -66, -122, 74, 13, -20, 0, 35, -123, -1, -88, 51, -96, -162, 30, -93, 397, 24, -45]
7411d5J17Q4q4k05K52J06j07N8l16Q2r2K03k34J57j11L0J98nj25j6l0K01j4j3
7435I1J66k77j3j60M10k32J37l9j7q7J31o1M5rl2M5k10j50R8K82M0l0l63jL23
7460H7j0k11m7K77l30jJ32J86j92k4J55P7J66l76J41K58j98mm4K36l42j05M52
7483B83l25k59K87K0K6P9q4N2K32k40k07P5J77MP9m3J2l34K48jj81l9R7K10j47
7508B1Q8j1rj49r0J78l09K98J9j11r9J22N4J8n1RM8k90P3J08J9J53k81J16M8L43
7534C15j18J23k59j10O8N2k78J92O5rp8Q7p5J3J25k50m1K3K60l37L69r7l8jk37
7559b36L86k00m4J80j91M0NJ49k22N4J95n3k8J15j66o5J73J64j11j20l36K86j
7582b6NP9Q6k54p6P1N9j14q3K9L35J6o8J69k89J01j01q0k1N13m48P8K49j74j5
$$ y = [-45, 72, 156, 72, -133, 119, 225, 118, 176, -140, -58, -150, 53, -181, -24, -135, -105, 93, 88, -37, -53, -83, 118, 104, 91, 257, -20, -33, -193, 217, -15, 122, 83, 66, -21, 110, 49, 94, 85, 53, 98, -112, -262, -164, 118, 158, 128, -235, -236, 87, 77, -134, -181, 96, -234, -235, -103, 83, -109, -133, 22, 99, 265, -111, 30, 288, 90, 86, 42, 278, -64, -169, 283, -42, -301, -14, 6, 32, 111, 27, 79, 311, 71, -136, -61, 116, 120, 199, 156, 168, -166, 82, 81, -100, -139, -42, 168, 21, 109, 98, 89, -60, -150, 28, -281, 17, 36, -75, -174, -52, 2, 20, -31, -22, 26, -264, -191, -83, -64, 89, -192, -76, -28, 315, 197, 320, 61, -49, 19, 71, -207, -15, 50, 41, -37, 50, -25, -12, 113, -137, -178, -155, 105, -232, 137, 40, 2, 1, -236, 150, -50, -94, 86, -105, -65, -60, 89, -133, -79, 116, 63, 35, 150, -16, -81, 92, 256, 145, 25, -311, -25, -26, -21, 58, 144, -110, -186, -115, -56, -170, -253, -224, 111, 127, 59, 228, -61, 40, -61, -141, -162, 351, -97, -19, 230, 56, 41]
7607D1kk74J93j26K73j68k34K96R3l97J74J94m4j90J89J4K3L9k08L59j96R4N9
7630B02k07k66J89L6j52K89k26K35k31l6K68l46j3K51r5p0M0J40K63l91J9j82
7652b83J16J45M2J41Q0j87K0o2J31l29K13k7r2l14M51J34k15J65j16J57m50J86
7674i4Q6KM2O4k28L8K27k42M46m72J87j63j7J35n6l1J44Pk28J25j6R1j12J20j75
7699a20Q1jm6M5J03R2L3j94k6k57M29k09MK98k32k23M33j37r1q6qO8J64k19J51
7724E2J36l88J85j53L54j47j54L00k0n24J58L72k83J38j16M8j50L75j50j30j22
7745b19K48K3j83K3K34J05n11J38R8P5K05l51J16q5Q3j25K20m3j21P1L15m37n7
7768a78K39L9j91L0N2K2l5P8k95K24K17j26K08l22K14l01J35N7q8oq9K08n9j40
$$ y = [41, 39, -235, -42, -168, 105, -63, -297, -1, 92, -305, -131, 63, 19, -171, 18, 32, 55, 94, -114, 245, 49, 143, 202, -5, -271, -82, -46, -198, 91, -135, 100, -131, -167, 101, -245, -258, -7, -102, -172, -132, 8, 271, -120, -101, -283, -167, -22, 20, 161, 241, 54, 74, 12, 143, -186, 27, 0, -92, -406, 45, 179, -36, 129, 13, 170, -280, -94, -8, -6, 36, 100, -128, -90, 137, -105, 341, -131, 56, -107, -124, 11, -45, -76, 68, 75, -153, -28, -44, 47, -65, 55, -120, -39, -40, -86, -41, 62, 154, 187, -7, -33, -290, 139, -70, -66, 232, 0, -223, 210, 73, -18, -104, -112, -44, 120, -99, 52, 188, -200, -15, -168, 186, 39, -115, 185, 165, -359, -201, 171, -112, 26, -90, -42, -192, 183, 33, -97, -219, 29, 52, -131, -108, 126, 231, -280, -142, -44, 31, 236, -115, 1, -84, -1, -126, 94, 51, -70, 1, 316, -121, -178, 61, 100, -91, -61, -9, 13, -22, 56, -239, -15, 202, 76, 284, -38, 176, -125, 10, 67, -21, -27, -116, 92, 33, -107]
7792a07J11K5J9q1j66j5K84j37J24j10P3J32k91J37J90k97J4J04l6K89l51L9l1
7815h1N4m3K90l04j70J90K04l04K58m81L35K74j73p6j50K61k4k30o4M32m40O07
7837C65m65MJ30MJ5j13j34J92m8K28Q0k16j77j81J47J57J08m2K42o11M18j89K29
7860A43l2j32J23J86r6k93J25n6K61l97K36j70J13K4P4J76l61K2j12K31m03L14
7882b4j42K2N3M5P0K2M3k28P0J49oq0J23j4j80j45J99r0L0J5l6j61L44r7K6n1
7908d3Lj55M2J2J02j3J39O3k38K58l36k1J20l8K31k08o1J15K95k94P0P4j01Rn9
7933c4N8p4q7K97j24l50J75p6J22j65M23r8k38R1Jm3K27m6j94m2J90L5k32mK41
7958E3K64q22Q65l86R6m9M8j43J35J9j43qp2J42r8K47r6j47L15q6j40qM1n9m7
$$ y = [-107, 4, 29, 48, -33, -199, -214, 70, -67, 57, -53, 20, 152, -139, -2, 188, -109, -95, 9, -27, 262, -89, -50, -81, -27, -70, 220, -84, -254, -64, 140, -164, 94, -387, -52, 222, 49, -27, -177, 84, 60, -170, -234, 198, -242, 365, -100, -96, 34, 38, 53, -60, -194, -2, -50, 178, 258, 42, -135, -316, -169, -12, 96, 54, 296, -315, 103, -86, 143, 111, -21, 102, 288, 192, -101, 24, -32, 229, -168, 68, -102, 11, 35, 109, 285, -76, -54, -166, 65, -338, -24, -166, -144, -91, -46, 24, 46, 89, -139, -69, 80, 74, -6, 117, 103, -77, -222, -23, -113, -83, -68, -104, -265, 79, -18, 8, -43, -40, -195, -153, -141, -39, -52, 87, 150, -88, 170, -166, -187, -67, -105, 126, -82, -143, -28, 267, -27, 43, 117, 16, 25, -34, 24, -50, -137, 160, 36, -314, -139, -215, -93, -258, 165, 67, -171, -80, -79, -122, 105, 59, -135, -177, 13, 48, -184, -188, 53, 317, -505, 360, -26, 70, 21, 69, -74, 61, 80, -63, -71, -143, -1, -99, 148, 52, -95, 220, 134, -6, -14, 27, -32, -79]
7983g9M4J69P9k40K06l78R5M2K60l07P6K6l6r9K17n4J38k3j50M1L5J8j1j56J3
8008g4L4Q5k4J13k55J34j17J13j13jj7L1j82K73r0R6m0J02rK68n02K60J40l73
8032a48lK49j77J80qj22m0OJ71l00K6J20Jk2r2J02J65j91K33k9j12k7N7j84J62
8057A7K8m7k4j09J25o1oP7J61p9j63J77k18M6L3P3%n21L88K83m37J58N7J09j91
8082a24J48J38q3j49Rl9K35J1l48J63R3l6J8M14m31J08l9k02m0K64k42R2L7J15
8106A12l0j48O2r6L27j69k19k31L57L0l3lN9j26L10l65J54K0K14l75R2m1k5J53
8130B9j05o2K52j73N3j13K22nm5J78j07l13l6K88J23j51j89P8q4K70j48L1r7K90
8154A86o0j29j23K20l19K43O0J55n6n3q8l2J0K1j12J74l44K65l39R2L41K6j09
$$ y = [-79, -35, 134, 213, -27, 179, -199, -104, -62, 198, -109, -33, -7, -43, -142, 75, 21, 159, 136, -14, 27, 62, 80, 69, -87, -74, -40, 45, 21, 134, -121, 13, -104, 9, -104, -105, -122, -91, -273, 0, -90, 6, -34, 68, 59, 327, -175, 85, 225, -148, -151, 98, -79, 101, 93, -29, -69, -63, 108, -192, -166, -46, -45, -67, -159, -57, 108, -83, 150, 121, 9, -18, 39, -145, 17, 45, -2, -26, -135, -10, -71, -77, 0, 161, 82, -81, 96, -122, -76, -43, 30, 30, -491, -103, 180, -257, -99, -42, 67, -124, 24, 162, 79, -70, -61, -100, 135, 146, -202, -39, 54, 18, 36, 450, 19, 127, 88, -114, -154, 110, -132, -40, -3, 112, 82, -66, -4, -100, 227, 58, -161, -392, -35, -5, -38, -41, 18, -108, 202, -163, -9, 11, 225, -150, -58, -99, -124, 29, -76, -138, 114, -59, -6, -119, 103, 98, 53, 231, 124, -189, -225, 63, 186, 35, -154, -76, -160, 110, -38, -7, -104, 186, 126, -3, -126, 94, -225, 18, 78, 233, 177, 124, 36, 4, 14, 35, -77, 97, -247, 18, -321, -229, 112, 138, 29]
8177B9j13J87oj20k1O6J76l33J63k3J92J00m13n3
$$ y = [29, -84, 103, 97, -23, -44, 22, 198, -135, 28, 5, 197, 297, -116, -169]
8191a69
$$ Imaginary data points
##PAGE= N=2
##DATA TABLE= (X++(I..I)), XYDATA
0@%%%%%%%%%%%%%%%qJ6j6J6j6J6k4L2l2M0m8N6o4P2q2R1j05J20j37J54j71J91
37A01k15K40k67K96l28L65m03M46m93N43n98O58p24P98q79R68j071J187j316J463
57G71j631J831k071K356k710L166l769M609n855P884j1721K1308q5131j27133
71a98096K61342O231j55941J10650O1767j37966L5299O9223q5410L753O6841n5011
83a7318M881O1931n8669l3334O8892j9374m8881M0832J5855l2674M697K81m336
96a7217K4170n120j8824K2099J064j3707L1524L115m0864J1225J9751k0646J3502
109A0072J8036l3011P113L4579l7376k2073M4677r810l6177L4438R716m3940J1016
122a2740K0675l2711N135L5571j5382r557J9823j6838j0152L1546n658k4955K0917
$$ y = [0, 0, 0, 0, 0, 0, 0, 0, 0, 0, 0, 0, 0, 0, 0, 0, -8, 8, -8, 8, -8, 8, -16, 16, -16, 24, -24, 32, -32, 40, -42, 49, -56, 64, -73, 81, -90, 101, -114, 126, -141, 155, -173, 192, -211, 235, -258, 285, -313, 345, -379, 419, -460, 508, -563, 624, -692, 771, -860, 971, -1100, 1256, -1454, 1712, -2057, 2552, -3303, 4581, -7140, 14168, -70963, -198096, 63246, 69477, -86464, 24186, 85953, -52013, -16714, 52509, -32901, -29148, 37693, -17318, -12437, 49494, -9175, -42509, 26383, 7009, -41872, -1040, 14815, -17859, -13162, -12881, -17217, 6953, 1833, -16991, 5108, 6172, -7535, 23989, 27104, -13760, -2535, 17216, -3430, 10072, 28108, -4903, 2210, 36789, -587, -22660, 22017, 12207, -23970, 10468, 20184, -23756, -12740, 7935, -24776, -19641, 15930, 548, -9009, 10814, -6024, -16176, 15370, 9712, -15243, 5674]
135E674J1250j8916P846N082k2634N819J7889j4903n110J2416j1539o860J2288
148a698o540p204J5153p14j1112J2163O347j0270N451N830j3601J640J7361l016
162I790j1956K683M760j883l907l259Q33L528J396J607R4n633l271M825L639N33
178C779j0J342M365k429j0211J477J0394k884p113M072K602l793j925j385l300
193e019l87J047J279M13m774k036O598L111n015k464L735N881K029n324o43O950
209E381l803n799P342K646p400N816M626j1206k577N589m699j421L830q035R35
224h775J2895r172j1313J6146O323j1805Q101J0177j2369J253J3920q103p914
237f36J1724k58o570P811l462j1377R671K012j7407K377J0397j0869l788Q872
$$ y = [5674, 16924, -1992, 5854, 10936, -11698, -5879, 12010, -2893, -8003, 4413, -7126, -13986, -1698, -8238, -15442, -289, -1003, -12115, 48, 6395, -3875, 1576, 7406, -6195, -4555, 12806, 9790, -2166, 517, 5277, 3394, -513, -3772, -2939, 589, 1985, 3592, 3686, -1947, -5218, -393, 3246, 3779, 3769, 5111, 9476, 7047, -3164, -1687, 8707, 5823, -1290, 2782, 5384, 1591, -334, -1719, -5019, -5406, -4359, -3080, -2667, -7441, -9477, -2879, 232, -4783, -7247, -3512, 2369, 4398, -926, -1569, 5381, 1578, -4221, 3121, 5767, -1633, 4183, 8809, -2397, -4974, 615, -4084, -5505, -1675, -9710, -8775, 4120, -5052, -16365, -219, 6104, -5701, 2400, 12577, 208, 1461, 15381, 7278, -636, 11088, 10830, 4260, 12071, 8609, -2768, 6903, 8915, -8492, -6115, 4282, -6587, -10375, -1503]
251a503q709l926J3219k150o474J0431J081n857R070j249j1401J1450O825j2377
265a570M099P466j1781K363R876j4536m544J5233p072j0643R304l644p118J1539
279a028j303j1685J2624O449j2446P818Q091j3585L721J3860j0993m731J3133
292I925l676m939Q233p034o065J4820m381j6324J2424N598j7231M480J1942j4331
306f559j488J5750p031p365J0113m035n418J2793m425j4403J4621Q415j8659J469
320f222J5636r211o732J1383k658p957N923L01m878L958j120m271Q686J179j1264
335g247L816J0036o760n221N796L67j208J568l395L36M495m343j773R279l463
350B283r105Q605M083j1959K25R100k626j048M367l949L01O979o137l932J0174
$$ y = [-1503, -10212, -14138, -919, -3069, -9543, 888, 1969, -3888, 5182, 3933, -7468, 3982, 10807, -1570, 2529, 9995, -1786, 577, 10453, -4083, -8627, 6606, -466, -11109, -1805, -5449, -12567, -1028, -2331, -14016, -1392, 5057, -7389, 429, 8520, -5065, -1344, 12516, 1523, -3208, 9925, 6249, 1310, 9543, 2509, -3556, 11264, 6883, -9441, 2983, 8581, -8650, -4170, 7772, -6559, -8047, 7703, 672, -6693, 3420, -615, -6033, 6760, 2335, -12068, 2553, 10968, -7691, -6222, 9414, 203, -6529, 4854, 2196, -5761, 162, 463, -4415, -457, -1577, -5848, 2838, 4017, -7247, -3431, 6605, -155, -5376, 420, 787, -421, 1147, -2248, -1912, 2583, -1760, -3533, 5746, 2283, -6822, 1783, 5866, -6093, -5868, 3232, 606, -442, 3925, -24, 277, 7256, 1119, -2813, 7361]
365G361j250q540O694K227j0264K620O278o157j390M572l235L74K850p435k098
380g393Q608k622p164P062L453n518L581L009o525J298O079l894r50N901m096
395H29m900O555j400p289P246N294p693J59M472n834j627N649n016k071R116j635
411A855p719M502J689m461M413L925m855J497K670k538J257J211m584L386N836
426H084n921j032O089l535m224K561k962k244N387l266m868N920j096p559N190
441c476L366p922L994R438n780m229O218j596k919O215o90l576O971L45p953L419
457A825L002q555J558Q043o211m059O492k327o693L414J243k311M351O30m839
472d437L660L752o749M05O662k174j600O418l69n927K011K155j880N59k56j147
$$ y = [7361, 6111, -2429, 4265, 6492, -3772, -1152, 5126, -1031, -2421, 2151, -1084, -710, 2140, -5295, -7393, 1215, -1407, -8571, -1509, 1944, -3574, 7, 3016, -3509, -2211, 3868, -26, -976, 4925, 829, -4071, 2484, 1084, -6205, 1041, 6335, -1358, -1199, 3273, -2561, -4188, 1461, -3555, -5626, 3490, 1855, -5864, -1362, 327, -4134, 279, 4204, -651, 846, 3516, 978, 2235, 3446, -1138, 2248, 8084, 2163, 1131, 7220, 3685, -539, 2022, -940, -3184, 2203, -1063, -5931, -11, -1107, -8666, -3476, -110, -8032, -4038, 5400, -380, -4609, 1609, 13, -2906, 3309, 2619, -957, 6014, 6359, -1594, 1825, 4827, -3728, -2170, 5873, -338, -4397, 2095, -232, -6925, -3511, -2268, -4579, -228, 402, -4437, -777, 2975, -3774, -3369, 3293, 1119, -481, 5937, 5568, -359, 1652, 3807, 1927, 2486, 2230, 1083]
488A083K801N66n706o3L729m519l494M877Q11l158J256P33k540L36J175R42L296
505B125m81k624L301J616o156q28N297l16j386K644o59l934O56K75j602J730O0
522b82k367K190J162m703M02M932j997k563M831J785k968J512J97m062J159K019
538A247l703J570N005l143k545M783l421n133O716K941n826L187K614p773J261
553b220N520n330j94Q938l606n607O642k328p039O177O41o942N184M148p844J331
569b529N287o900o03P362k983l025N658m22m514K626j507k620O363J685m089L925
585C714K012o960J04M328l475j42M120l200k251J896l284j107N067l140l148P528
601B062J9p891M385M011o534J747N924l720J111N803m850j127N891n944l661R173
$$ y = [1083, 3884, 4450, -1256, -1319, 2410, -2109, -5603, -726, 85, -3073, -1817, -1084, -3624, -3288, -2113, -1171, 2125, 1644, -980, 2321, 3937, -2219, -3047, 2250, 1934, 548, 3192, 2533, -1401, -745, -470, -2072, -342, -282, -2649, -459, 703, -4000, -3598, 1334, -663, -3226, 1605, 3390, 422, 1934, 2131, -1931, -772, 1247, -2456, -886, 4119, 976, -1569, 3214, -207, -5340, 1376, 4317, -1509, 1678, 4292, -3481, -2220, 3300, -2030, -2224, 6714, 3108, -2499, 4143, 1815, -5224, 953, 1594, -5348, -164, 3984, -3860, -2529, 2758, -4142, -4745, 2617, -366, -3391, 2267, 1845, -2669, -43, -1550, -4170, 2193, 3878, -211, 3714, 5726, -1234, -1130, 3198, -277, -419, 3701, 501, -1750, 146, -3138, -4245, 822, -2318, -5466, 2062, 2081, -5810, -1425, 2586, -3948, -2201, 3723, 3, 1114, 6917, 2067, 940, 6831, 887, -2774, 6399]
617F399j470q354N908J724j0208J735N291n941J694N168o092o30O019n001k418
632f176Q737j839n499Q010J315p102M247M075n782J443L780m585P35L726m978
647A07j584M098m325k886N864j304m684M538o15m828K752J762k648L540J884l499
663a828K223K456m594J605N194l678j065N618l215l825M094o19m198L354J65m542
679b855K921Q10n041J860L223m651k05N561k396k334N088r21m155L471J611l497
695a510K104L218l147j45K764l372j408M101j876k576L756m50m280J517K522l228
711b010m7L443j202j377J857n18j303J502l18r08J768J65k210R11J621k224o81
728a531K805n48k295J320R54j807j46J248k53L34M03q63Q64J478k023o40K942
$$ y = [6399, 4929, -3425, 2483, 4207, -6001, -4266, 1025, -4916, -3222, 1946, -4146, -4776, 1243, -3758, -6176, 2561, 722, -4777, 3233, 4548, -2554, 1693, 5768, -14, 1429, 5209, 624, 1359, 5085, 107, -1477, 2621, -1704, -4590, 1274, -30, -4714, -176, -791, -5619, -2867, -1105, -3753, -213, 1671, -1828, 395, 2851, -1743, -138, 5056, 1378, 313, 5931, 2716, -1109, 2985, 2366, -1832, 1522, 1687, -2855, 66, 876, -4165, -2305, 918, -3733, -3938, 1623, -773, -3107, 1981, 1060, -3095, 376, 1987, -1510, 594, 3812, 665, 520, 3284, -88, -1496, 2605, 729, -1847, 1909, 1459, -2821, -1304, 1218, -2010, -2057, 1386, 184, -1193, 664, 146, -1157, 345, 27, -881, 887, 1052, -1158, -247, 1374, -850, -1531, 1274, 726, -1569, -249, 705, -1102, -1248, 0, -253, 81, 484, -379, 485, 1963, -60, -700, 2242]
745B242q71l140K925J226l482O76J622k374k2J593k473J412K291m170L0M455k959
762a019k789N205N70m045K673J802l067K006J295k581K172J610m907J099M265
777D289n314j589N862k567m346L681N9l941K663N09l833L632J799n120K305M702
793B791m924m81O795k475l613N622l33l737L269L45l944K974J037n106J584L054
809B858n280q59M379l532j539M046j669k674L910k99k990M321J164l692L108K530
825C782m280J430L440l188r0L512k541j971L575k357l663L343j14m051K426J024
841B77l563J421J537l389J524K095k673J672L467l551q75M703j685k914M410J17
857B573k430K368j26l713K533P74m675K611L563n576m90N102l594l645M765Q46
$$ y = [2242, 1371, -1769, 1156, 2382, -1100, -424, 1198, -1176, -1198, 395, -2078, -666, 1625, -2545, -2515, 1940, -1019, -3808, 1397, 1967, -2078, 595, 2397, -670, 1336, 2631, 50, 2222, 3832, -1075, 24, 4289, -1025, -2614, 3248, 681, -3665, 16, 75, -3866, -1203, -694, -4527, -895, 904, -4216, -1911, 2791, -2133, -2614, 4181, 1706, -1907, 3715, 3382, -355, 2914, 3259, -685, 2289, 3326, -1780, -196, 2858, -2422, -3281, 1098, -2434, -3973, 73, -1596, -4270, -360, -659, -3649, 672, 1836, -1856, 1252, 3782, -498, 932, 4372, 1184, 1094, 4606, 2065, 94, 3669, 1312, -2351, 992, 878, -3173, -747, 277, -3286, -1865, -328, -3717, -2193, -98, -2771, -1099, 2368, -1183, -2058, 2645, 960, -1954, 2456, 2573, 143, 2511, 2385, -1328, 1205, 1979, -2696, -85, 3478, -2098, -2588, 2514, -1080, -4725, 40, 886]
873H86l633K851J001k814J975P28k922J660L136k887o07M091j949l207K620J016
889A945k250O59J498j031N2r10j454J698P51k612J146K718k289j173K233j297
905c16k143K528q6j303K074l68k450K356N98m270K309L858l957q91M471k078l062
922b730L108N9j891K032R76k127J568M15k958J461K411l010o20L542j283k750
938a797K412q4k684J344J552j397J182O83k824R21J472k321J84M326k080k456
954a567L392J91l279J893J335j699R64R93k402k2J915k145q02K444k020j552L049
971F88m00k362R59M63k034P91J289j218J358J459k176K02J410j413M70L082r98
988A570p95K188j459l013K595M88k223K392J099m199J20J637k586J35K674k185
$$ y = [886, -2747, 104, 1105, -1709, 266, 994, -1928, -268, 2868, -19, -626, 3465, 1516, -1691, 929, 1945, -305, 354, 1852, 821, 873, -37, -1491, 207, 958, -1654, -508, 2210, -79, -1252, 981, -316, -2459, 69, -17, -1320, 754, 386, -2064, 292, 890, -3380, -1071, 2787, -1170, -2061, 2410, 332, -2730, 378, 437, -1454, 578, 1554, -573, 995, 1410, -1548, -87, 2324, -686, -1306, 2236, 953, -1797, 615, 531, -2153, -809, 743, -654, 528, 1211, -1613, -692, 780, -1541, -1357, 2969, 889, -1567, 1825, 2016, -1263, 630, 1965, 266, 1230, 2223, -179, -201, 1714, -431, -1233, 1211, -809, -2361, 688, 288, -2074, -1115, -652, -2686, -1895, -606, -1824, -466, 993, -1183, -981, 429, -984, -514, 2568, 1570, 775, 2963, 1504, -1509, 1086, 1574, -649, 1743, 2842, -1357, -1237, 400, -2186, -2051, 623, -1562]
1004a562q12L020k061j604L270N43k927K480K257k301Q67K076j318o06J407j532
1020A197o42J862q59j210J836j345l436J028J368k035m8J738r30j036L45l43K09
1037b301J464n94O67K606q62j875J602Q23j482N68K095n77q86o21p69M32K39j980
1055a451R17J576j999j300K003o74k277K117J327q01O65P14j428J306J033j817
1071h9R40K114k287j068L096l14k564R72K30k088L05J719j135j42Q09j714q63
1088b079J493m91o39K468O37j708J41M39j963Q49K647r47o86J337k042j732K029
1105b47M2r50J560J39k312J259O58j865J116J730k042L20K469j759r93K947m35
1122A637j891J457j86j841J777N48j802O94L06k995P32K190j115p19K233j356
$$ y = [-1562, -2374, 646, -1415, -3019, 251, 794, -2133, 347, 2604, 303, 1170, 3246, 1928, 1322, 2729, 1197, 555, 2417, 1558, 348, 2184, 839, -2597, -1569, -201, -2236, -2284, -546, -1476, -2512, -2167, -2510, -2301, -837, -1431, -764, 1842, 980, -895, 707, 1530, 48, 616, 2711, 2134, 1248, 627, -142, 290, 529, -1451, -534, 1042, -957, -2257, -254, -928, -3205, -1088, 239, -562, 103, 817, -611, 695, 1728, -89, 851, 2965, 678, -390, 2706, 2392, -172, 800, 1030, -1058, -753, 966, -169, -311, 498, -1216, -2079, -586, -1077, -1716, 752, 1389, -319, -178, 261, -1702, -853, 1794, 847, 161, 1498, -544, -2276, -247, -205, -1155, 405, 544, -1768, -509, 149, -1716, -600, 1130, -912, -592, 1877, 118, -875, 2072, 1637, -254, 1203, 1017, -824, 953, 1501, -301, 393, 699, -2296, -1564, 626, -489, -1208, 1025, -331]
1138c31j429J463l7o5J986p69q12K496r89k723K744J219l430J065K733l198j316
1155a393K494j791j420K401j897j601K665n27k826K996J377l809J261L815k429
1170f84m96L157o20j407J568M78j562J969p03j719K127j07l121R87J753k928l19
1187a627J864j460q62J109m52k31J154q15l01L113p70j990K590J307k862J070
1203H37K561j671r15J320r45l70M39j398m39J509j588j353J749m43k344J518J209
1220c24j688K93J191o08M62P66r00R33J082j412L80J641q47j146J157J15j172
1237g7N41N17j159j83P96j280j94J189r40l33J142J2j005O22Q63j024K75R16k79
1256C99m77P55j58k86O02J0m65N20j08n82J74K7k96j61L93p14K44P78q54m87J193
$$ y = [-331, -1760, -297, -334, -399, 1587, 818, 6, 2502, 1513, -1210, 1534, 2753, -677, 388, 3121, -77, -1393, 1101, -690, -2110, 291, -1606, -3207, -542, -1069, -3895, -899, 478, -3331, -2070, 1745, -684, -1180, 1977, 1357, -50, 1518, 1996, 434, 2403, 1700, -19, 2108, 2001, -1120, -133, 1620, -1308, -1627, 237, -1223, -2085, -976, -1428, -1659, -505, -1320, -1621, 1492, 722, -1268, 1322, 2629, -233, 837, 3398, 1727, 812, 2132, 1187, 817, 1256, -142, -581, 928, -660, -2013, -264, -707, -3051, -1533, -324, -2012, -1719, -528, -1136, -674, 92, -808, 125, 1207, -205, 175, 1816, 969, -177, 980, 1095, -77, 464, 981, -178, -361, 435, -845, -1039, 150, -790, -1123, 19, 31, -974, -352, 511, -513, -238, 678, 399, -78, 677, 519, 233, 835, 845, 380, 900, 792, 210, 384, 411, 115, -46, 347, -367, -123, 655, -199, -686, 507]
1277E07p86n16L65P91q23l50K09R9K46J02o21Q68Q7j031k24J396k2j451J160J071
1297A077j612j23J195l51n51Q74j19J0P15j182p3J398p50j268J064Q29j472j45
1315d84J226r05k24L47l94J49Q85j136p3J754j243j280J786Q50j946J001J488
1332A801j531k90R45o69k0J013j249k33K050j868j572K200j67k494J478J044j829
1349a391N16M73j462O72R09j401N98K138j705n67K782j188j470K193L63j468J322
1366A314O92j507M36M08j817O67J291j826k88J750k083j305K006l11j747J874
1382d46P33j437Q37N95j535R77J598r97q5K063j423m63K060j279j485J797N6k236
1400f70J153M00k234J65R91j964J92J528j283j02K028j447p76K198o45q89J688
$$ y = [507, -279, -795, -430, 361, -462, -812, -603, -504, -258, -156, -777, 91, 178, -853, -1077, 319, 297, -1154, 6, 1077, -535, -658, 537, 186, -365, 509, 390, 400, 1115, -67, -140, 1258, 508, -760, 304, 1133, -339, -484, 742, -163, -387, -40, -434, -285, 600, -536, -609, 1145, -98, -1378, 408, 1258, -688, 313, 1801, 270, -20, 925, 256, 236, 1249, 0, -233, 1817, -51, -1623, 577, 410, -2084, -606, 438, -1391, -875, -402, -1864, -1192, -283, -1684, -1086, 1052, -653, -1220, 1562, 374, -1096, 1097, 1460, -8, 1314, 2006, 499, 935, 1343, -474, 193, 1484, -342, -630, 1120, -963, -2268, -262, -573, -2320, -446, 287, -1150, -313, 282, -1253, -276, 1322, 325, 240, 2303, 880, 417, 2477, 1198, -287, 1510, 1566, -670, 483, 883, -1351, -1186, -195, -2159, -1967, -439, -1722, -1824, 204, -1243, -2019, 179, -466, -1355, 333]
1417C33J170j598J006O50j134L30P10o38L58M75j665j06R09j487n85J581m98q69
1435a058N71M22j313L72M87l41Q71Q12j019K98R25p34j8J444o69j324J350M38
1453A514j376o5O49r92m03M27n31N5J216q69n88J249o04j350J744N25j146P77
1471B32J047j612m10J004l64M00M75p31n70J023q50r84J412J83j599J108J293
1488A057j277m19Q00k92k2P06k00Q0P78o19q34J041J76j501N19Q40o18o42M72
1507D5o46k76L96m53M94M69o47J3P83J32q88Q75J09l37Q08K02p27M10K7q38L34
1528B85O07n87k46O17j095r35J076o57j016J103O03j328J003M47j213K14J626
1545E04n42k35J604o56n88J601l29j186J322P7j767J040P89j944o4J112j364j374
$$ y = [333, 1503, -95, 911, 1561, 427, 757, 1467, 829, 1187, 1662, -3, -109, 800, -687, -1272, 309, -189, -1058, -487, -65, -1378, -1006, -519, -860, 11, 823, -196, 102, 1027, 293, 275, 1719, 1050, -274, 1076, 1514, 138, 73, 722, -270, -673, -246, -777, -722, 494, -375, -963, 286, -318, -1668, 76, 601, -545, 232, 1279, -333, -743, 261, -103, 297, 772, 41, -529, 494, -356, -1340, 72, 255, -1344, -236, 1057, -220, -639, 161, -131, -153, 553, 353, 433, 1211, 592, -242, 799, 975, -526, -7, 833, 215, -427, 45, -601, -877, -481, -934, -440, 29, -618, -605, 178, 310, -578, 297, 406, 69, 877, 1079, 352, 762, 789, -49, 285, 892, 305, 59, 676, -419, -1354, -278, -935, -1951, -848, -245, -1573, -570, -123, -1336, -1122, 504, -38, -273, 1331, 675, 87, 1688, 1359, 173, 1495, 1572, -195, 845, 1634, -310, -374, 738, -626, -2000]
1563b000J859m10p94P95N4p80O44r0n91J381L57m65K30Q58n57n88J489J91p67
1582H16O8L30n13l44l41j76N03l19j037J26Q69p81m11P94n01m14O09J91N4N46
1602F9n18j59J282k50q74J197J210j639j79J329r82r36R95On72N33l78j130J106
1621A10l25j243J445R13k329l0K143q76p38J259L3q81Q80N02j079R62L37j539
1639d56O04O72j466K85J781r46j280J214q9j131O23M92r10M13L46r06M57N07p51
1658e41K7J062n84n06Q64j11p88M29M94p37L58K65n17M00N06r24j56R32p03L41
1678A11Q55r90r7R83p61n51Q87K70j062R15p3j401J008M84j210L42Q18j425q5
1697i82J443r84o86J851p60p43J103K92j355P66R19j009N58P71j412N55J157j684
$$ y = [-2000, -141, -551, -1345, -550, -496, -1276, -632, -722, -1313, 68, 425, -40, 190, 1048, 491, -97, 1392, 1583, 816, 884, 1214, 701, 357, 16, -160, 343, 24, -1013, -887, -18, -799, -1210, -416, -917, -1331, -722, -531, -477, 69, -449, -608, 674, 424, -450, 747, 1957, 318, 139, 1468, 486, -450, 545, 551, -21, 512, 134, -996, 110, -215, -1458, -13, 900, -1429, -1459, 684, -192, -930, 329, 362, -519, 361, 863, -216, 746, 1083, -456, 148, 820, -646, -361, 1420, 474, -806, 408, 319, -812, -189, 303, -607, -194, 152, -754, -297, 210, -541, -514, 548, -36, -542, 322, 211, -577, -148, 346, -391, -33, 232, -285, 115, 621, -303, -459, 473, -230, 111, 966, -24, -121, 862, 101, -450, 437, 707, -355, 560, 487, -914, 94, 578, -632, -290, 528, -897, -982, 461, -523, -1209, 642, -118, -861, 242, 534, -821, -55, 864, -145, 413, 1184, -228, 327, 1484, -200]
1715b00J37J380j098j214J283l4j315N66N72j076N20K18r29L70Q07j080M75R37
1733C19o33m22J543L5j038R98M05n45J74K13n39O33J15j489N01O78j717j25J294
1752D00m49j392P61J64m57L52k74r2J032j34p34J510K91j323L52J436j037l08
1770I8J118l69o08L87l33m07R53n73j140R10M0j417j30J393r34o19J303m28k98
1789a054J153j84p8L82J81l34P46J29o52K14Q47j067m00J077m43m73K80k27p84
1808f87L53m1l01QQ9J18J40L21n16L43M79k31ML24P4n14L95J89o69L07K54K2j95
1831B66K18n57k06L08o64J58O04k81m52Q24K39j263O35N68o50J25N91l48l09N2
1851a42k60J38M84m45j42R98L0j309L68O19p67j8O21lj14n2P9p8L76l87j84J084
$$ y = [-200, -63, 1317, 219, -995, 288, 254, -1061, -495, 77, -999, -479, -261, -1190, -820, -13, -1093, -618, 319, -314, -736, 807, 842, -196, 802, 1207, 662, 836, 1049, 510, 1143, 1258, -231, 270, 948, -769, -894, 400, -49, -1441, -680, -516, -973, -621, -895, -987, 45, -89, -823, 687, 978, -345, 7, 1443, 406, 98, 1216, 847, 239, 626, 293, -114, 839, 266, -874, 36, 76, -1341, -1471, -78, -1012, -1631, -328, -756, -1054, 99, -85, -163, 219, 400, 66, 812, 941, 289, 503, 1350, 283, -117, 960, 517, 44, 324, 97, -687, -334, -375, -676, -668, -579, -461, -321, 0, -516, -173, 306, 75, 79, 403, 477, -37, 358, 547, -122, 185, 439, 461, 266, 484, -73, -279, 29, -635, -477, 127, -154, -606, 218, 457, -806, -171, 397, -253, -128, 463, 115, -194, -142, -402, -264, 220, -225, -367, 631, 661, -648, -280, 339, -428, -446, 175, 172, 58, 6, 85, 7, 383, -4, -188, 896]
1873H96l89r20P53M30j118j46Q01l62l31M29%m97R8q8l69J289p29o97J063O36
1893G49j118j77J469p29l34Q06J09l51J78m03n05R35n68p66R75O6j353N08N31
1912B2j106J04N28R8k52L72k18K59L76o92K76R56J16j247J186J35o50O0M82o41
1932A64J72K65m22j32N08r87k37P65m57p19P23K26r33M88L07m79q3J249p51J22
1952b11J070m91l34Q05m05l79Q78J77r12N75m6o90l0K16q02j16R83p00l56Q52
1972H4n39m35L62p8L0O65j00l48M00N5n02P35O00n72J05N97l48l83J72m15k09
1993a24O24q78n01J061k66q74M81O60j223N26N08k77j20L93l18K2O47p01L81J116
2013A137l63j339R64N10j054l7P76l85m51J85N2k99nL6j47Q58k89p86M02P43r40
$$ y = [896, 507, -413, 340, 770, -348, -494, 307, -55, -386, 43, 43, -454, -356, -444, -813, 476, -253, -950, 113, 749, -369, -546, 923, 194, -140, 666, 775, 424, 602, 199, -306, 629, 61, -705, 270, 336, -1017, -509, 22, -1084, -980, -452, -354, -606, -234, -452, -193, 183, -509, -233, 723, 839, -408, 778, 913, 263, 323, 805, 164, 336, 601, 179, 47, 555, -432, -669, 96, -361, -1080, -357, -131, -1064, -576, -269, -748, -831, 418, -333, -211, 859, 368, 34, 839, 434, 55, 933, 1110, 198, 773, 727, 37, 7, 223, -579, -695, 288, -412, -768, 84, -455, -890, -528, -606, -576, 89, -11, -359, 41, 96, -406, 329, 929, 357, 462, 1059, 711, 328, 500, 85, -124, 500, -378, -879, 182, -84, -958, -477, 183, -1040, -514, -6, -283, -403, -10, -328, -306, 341, -360, 21, 1137, 774, -565, 399, 909, -145, -182, 594, 209, -242, -57, -5, -304, -309, -273, -420, 438, 149, -637, -235, 508, -432]
2034d32M5Q52m19o27O81K55l96K73k39NK72k79m59N88L87p74q9O84n38k07N83
2055A66M63n08K6j74n9L74l10p4M54K01n61j94L77l91m5K72l23J88k64j66K33
2076c15L63n17p0P84k26l90O25M92q04J38N78n95J88N40n53j47P13p85l91Q34
2096D62j86j007P6N87q20L34N08n73j28N31q8m64Q14N43j056P33J74l78j94P05
2116E73j7j15L38k48k16J77l65j38L47j94q09K37J42l25j44M50R1j64m46K63K13
2137c50l5K56K52K42l69J08M81L12j37k83L02j48j70l56J38K07j32p32K13K35
2157C4o20l36P37Q8m96R8N5J41J69j07o7O86K79n85M17N56n91l76P03N4j195L22
2179c4P26p88p8L98l10K54k77n54K62N94o55l83Q02N0n95K02P11n04j4Q62n05
$$ y = [-432, -387, 465, 46, -581, 100, 355, -41, 232, -7, -2, 270, -9, -468, 120, 507, -267, -356, 328, -210, -417, 166, 629, 121, 147, -27, -86, 288, -22, -96, 358, 559, -2, -196, 181, -210, -255, 17, -306, -118, -382, -548, -315, 48, -469, -539, 245, 19, -371, 254, 746, -58, 80, 658, 63, 251, 791, 238, 91, 804, 19, -372, 462, 276, -731, -655, -68, -888, -554, -46, -619, -747, -216, -304, -768, 46, 589, -467, 266, 440, 62, -132, 573, 556, 441, 779, 531, 315, 492, 127, -11, 336, 142, -667, -430, -288, -613, -757, -307, -216, -380, -826, -563, -350, -385, -129, 123, 365, -4, 104, 585, 897, 760, 477, 779, 631, 461, 105, 243, 450, 318, -414, -201, 34, -586, -922, -185, -97, -593, -495, -440, -299, -130, -237, -304, 382, 661, 76, 493, 1049, 458, 82, 785, 839, -356, -34, 692, -96, -174, 224, -86, 168, -109, -663, -401, 193, -462, -845, -43, 7, -588, -386, 325, -179, -193, 669, 164]
2200A64J01O4j1l9L59p36j34P44m34l33K27K24k17j5r2j70L22P7m08L65q4l52
2222c78M47J42j83k70M84m5l47J12K85m40M88n8l64K76K69p58L76J8k07j03O35
2243C79m57k39O89o8m49N04M7p34N91L70r20L49J10o94K87L89n03j4M39k93l30
2264e47O27j69o75N08O37p38J04P44l75n4L22j48K78J39n11k02M71k1p58M42J11
2285A85m45m4K48m58K14K6j59O4L50o83O63J42m74j29P75J77m64K28N66j7j68
2306E97k79J99q0j34k72L05J19p42j98P43n93m86K60M39k16k94R0j62L01M1K8
2327c34M44L29l14k70Q60l8n10O09r3m99K18J4m2j31q6o00J63J69l70O1K02j21
2349c39o65M74J17j33J74K76j06M5K05L9K41L33k96k26M19m4l18J59p0j11j04
$$ y = [164, 265, 329, 318, 279, 638, -98, -232, 512, 78, -255, -28, 196, -21, -36, -128, -298, 24, 101, -307, 58, -26, -378, 69, 211, 28, -242, 242, 197, -150, -38, 247, -193, 295, 237, -127, 149, 418, -340, 36, 54, -153, -256, 379, -78, -317, 372, 304, -145, 359, 406, -328, 263, 633, -287, 62, 172, -522, -235, 154, -349, -363, 76, -217, -547, 80, -89, -764, -256, 381, -357, -253, 491, 116, 62, 384, 236, 514, 653, 142, -60, 411, 390, -368, 74, 185, -260, -304, -56, -514, -300, -274, -433, -369, -19, -702, -39, 103, -371, -500, 275, 452, -12, 216, 782, 765, 597, 318, 517, 437, 303, 31, 336, 455, -287, -485, 258, -335, -821, -561, -122, -338, -632, -542, -704, -403, -362, -334, 110, 439, 125, -145, 715, 677, 167, 776, 683, 184, 402, 416, 374, 243, 157, -443, -280, -111, -481, -420, -218, -339, -1004, -530, -413, -546, -372, -96, -202, -157, 48, 87, 328, 661, 365, 139, 558, 514, 196, 355, 285, 174, 70]
2370G0K04l35o8N5k06K18k28j80l50N63m9N3N9L72j46K61l89K39K07%q2j40K51
2393C79l01pJ10k2K9l7Nl46K42k65l21O66q6n48N99J65j50m46N36p0m42M97j37
2416E0L5P4j33l25L56o1p14P07N98j069l2O25O3p47N84m6J21K17J0k04L60k91
2438A78m16J41M75k81M3M30n09l66Q2K37k04J8q0j11M27j51q21O80M61o29N63
2459A67L92m54r6K45P5j33L11l06L7M26n86j80O24l72n85J84K78l50j59K99l55
2480e38k96M00k5J29M72j86lK67M04r15M89L69n08K45M44j02o30N60k63j61j05
2501D7J34m68M76l67n99M77J76l93n9J59M7k68L47P4J05J95O3j53M27o3q4L67
2523F40j23j87P8n5k78J47l6l15R0j5l67j96K33j78R1J32m7J01K96p3k12M75J07
$$ y = [70, 274, -61, -129, -74, -280, -62, -290, -470, -820, -257, -306, -253, -194, 178, 32, 293, -96, 143, 350, 350, 268, 128, 379, 78, 71, 181, 159, 188, 151, 156, -190, 52, -213, -534, 132, 46, -502, 97, 262, 112, -334, 202, 132, -310, 187, 50, 85, 159, 26, -299, 57, -4, -718, -11, 587, -482, -514, 111, 174, -573, 11, -35, 86, 303, 313, 109, 469, 178, -238, -97, 378, 97, 140, 570, 61, -305, -223, 14, -190, -172, -252, -363, 64, -87, -908, -228, 233, -396, 167, 559, 105, 9, 254, 329, 196, 507, 201, 238, 664, 78, -102, 522, 150, -435, -251, 27, -323, -482, -183, -538, -834, -434, -459, -330, 142, -44, -47, 220, 624, -291, 198, 567, 59, 304, 748, 646, 16, 576, 313, 152, 47, 181, -287, 189, -178, -777, -300, -124, -517, -576, -417, -370, -638, -291, -217, -112, 83, 146, -7, 420, 357, 273, 640, 517, 330, 408, 353, 75, 222, 186, -129, -39, -54, -421, -617, -384, -562, -471, -339, -386, -285, 11, -62, -274, 201, 308]
2546C08m83L19N12m69k31O77l53k92M27j76j14K89m95j20L9j58j63J25L77n06
2566d87k08M04K05n06M98p%R5K31l42N86j57m64K76M87n47m65N32K18n40N2L83
2588B44k36l31JM51j35l47j19N46j71m8J06N09k72k53j02M01j75j09n9P1J95k36
2610f9K7J66m91O1L41m6j98J17o3K42J69k73J92j49M65l53kM40l33n58K80K42
2632B07l38j05L93l92J0J44k13P4J34q8j40Q9L05o62M20O60o23K30L01k91r3J25
2654A47J89k19M6R0k29K39r6m03J39J11l85l87K67L46k44K78j52R9j0J34r0q7
2676b17M97K18o17L38J25l9M18r1l44M4j26N7J35n08k08N9J88m57K4O0j4O3J44
2699b51k45K68J00j82K20L64K3k87N35j67l01J62J05l36L24q2k9j43J01l59n9
$$ y = [308, -175, 144, 656, 187, -44, 633, 280, -12, 415, 239, 125, 414, -81, -201, -162, -320, -483, -358, 19, -487, -695, -291, -86, -592, -94, -101, -101, -6, 225, -117, 469, 312, -152, 124, 611, 64, -401, 131, 349, -191, -139, 244, 8, -323, -322, 129, -6, -353, -472, 74, -97, -145, -39, 470, 198, -55, -157, 244, 69, -40, -99, -28, 167, -69, -42, 124, -367, -306, 35, -11, -209, -92, -155, 87, 256, -17, 175, 26, 491, 138, 136, 576, 243, -315, -35, 207, -131, -236, 157, -235, -225, -81, -294, -220, -86, -174, -314, -225, 80, -582, -162, 498, -125, 105, 406, 115, 22, 147, 336, 117, 163, 253, 24, 263, 167, -236, -97, 14, -371, -758, -491, -145, -389, -111, -263, -164, -174, -40, -130, -217, 280, 498, -119, 219, 344, 305, 723, 632, 288, 332, 206, 263, 398, -110, -318, -259, -71, -528, -504, -444, -458, -395, -251, -496, -228, -128, -310, -90, 274, 297, 10, 545, 378, 77, 239, 344, 8, 332, 250, 221, 78, 179, -180, -239]
2720b39K79n10j93N79mo56R0M32j24oL5L60k31K41n8R0L64l66K91QK7l78O6L84
2744D81m02o2K25o0k36k9l09K16Kk61n6M43j66k43N04J80m12J30K43j16J18m0
2766A50K06m50L10k61L23J13l82M1K18J93o43K40o2j64K42m22l6M84rj88K8J28
2788E9p4j26K59l04j1N01o6l47K8R0J7j25L84l11RJ71k79n5L92l45k2K77j20L04
2812C06k10r9j13L58J23j95m2O3K1k41K08k07r7J00l09J66J23n1l61K83L27j92
2834c9k95K90L48l34Ro6J63K50j45k2M7K34l16J74Pp17J65P8M7p7j38j1J65l45
2858e28K77j62M06l74O8N62K63p09K16N11l11nJ91J13k16k6j70M71l30j82l10
2879b45K89j79m46K56J41n6m40L95j71L06l04L50L3K40j42j68N15k03o3K72N52
$$ y = [-239, 40, -470, -663, -84, -88, -744, -654, -222, -346, -352, -317, 43, -188, 53, -5, 85, 449, 83, 374, 382, 409, 31, 97, 481, 79, 17, 242, 182, -54, -83, -392, -176, -174, -435, -491, -48, -214, -457, 47, 227, -185, -55, 188, 72, 190, 150, 356, -94, 216, -45, 278, 391, 9, 50, 268, 461, -182, 58, -4, -168, 74, -348, -384, 100, 91, -97, -69, 59, -15, -141, 118, -186, -197, 304, 238, -109, -81, 9, 26, -99, 285, -26, -17, 154, -125, -180, 212, -133, -155, 122, 2, 306, 96, -3, -116, 242, 365, 170, 128, 191, 212, -29, 179, -28, -125, -25, -334, -168, -45, -96, -457, -174, 153, -39, -334, -44, 304, -30, -21, -87, 76, 326, 181, 159, 206, 440, 124, 298, 305, -412, -247, -169, -122, -199, -337, -348, -183, -528, -251, -413, -7, -381, -313, 249, 512, -197, 19, 530, 219, 214, 405, 518, 302, 276, 106, 577, 247, 65, -245, 44, -135, -581, -325, -184, -240, -680, -285, -456, -150, -454, -104, -71, 169, 27, -141, 374, 171, 108, 380, 932]
2900I32o48l6K17k26J12n8l90N9j33k17K02j63J56k66J02L89k09p1Q1r8Q8K57
2922H0O1J10J21j65J81K1k25m0L20l35J25k1j89k65J64j26k02k4K82j44N5K01
2944a5k60k0oL09J38j75J04j66R8K87k30J04J67n9l88J95j22J76j90J29m8k24
2966a96J15j28K29L84n21l7L57m64K01J33j35K47l77L54n6p0K69n45L27J1m10
2987c12J79M48l67k85L92K62o24L59q3K00k71P5K48l7m8l6J23N0n71J99n1J53
3009Cl6r1J36M3k57j96K06j14J50J51n3J92m57K91L81l44n5K65j0qJ50M1l54L7
3033G1m5j41L85j26k86J86J39l66p8K32l07n2J49o5n7N7J13k82L92K99k91j9M54
3056C62m0q2K7K96n61r9L77k43J38j04k07L19k20k25l72P24r8j55j53q9K05l4
$$ y = [932, 284, 248, 465, 239, 351, 293, -97, -38, -171, -388, -186, -349, -193, -459, -357, 32, -177, -248, -167, -265, -177, 80, 141, 251, 372, 207, 388, 409, 184, 144, 464, 129, 254, 233, 44, -221, -57, -183, -385, -409, -127, -271, -216, -15, -275, -295, -301, 8, 146, -29, 75, -91, 7, 294, 64, 168, 335, 276, -112, 83, -39, 137, -53, 76, 28, -196, -81, -209, 20, 404, -117, -154, 203, -261, -60, 73, -62, 185, -192, 162, 106, 36, 305, -240, 87, 98, -312, -133, 315, -52, -337, 55, 317, -307, 52, -31, 169, -102, -27, 221, 184, 136, 100, 223, 273, -298, -99, -150, 3, -33, -124, 12, 55, -202, -398, -192, -306, -156, -5, -58, 134, -323, -32, 349, 5, -50, 215, 205, 197, 347, 388, 34, 71, 26, -115, 270, 144, -142, 44, 183, -183, -261, -29, -336, -388, -239, -304, -361, -304, -191, -473, -81, 218, -73, -92, 362, 322, 240, 267, 563, 2, -97, 280, 37, 175, 71, -136, 183, -37, -262, -634, 90, -8, -163, -316, -405, -200, -234]
3078b34j68L91K11j36j69L09O2q8K19Q4k30r4K04k67Q1j49kr9K75n38J06J98j41
3101a75k47J0K44l35J61J94k3Q6L23j71o2M88l13Q6M7K12m35Q5L69m09k21J95
3123A09k42l0K14k10k30K03R6n80N18L36n61Q6L26J19k10J38k6K05k31J55Q2k73
3145fj39j58L89L7k18nJ16J3j30OM8K9j96K91J89O8n73J06L50k73K23j14q7j86
3169b20J55L40l6j77r9r9K98k7k78O6L44l84j94M61j07l01P9P0j20M01O8k92K59
3192B07k01j51K00L7j7l70L20J28k64j43L04l2K7k85J34OJ99l30J95K54j76J99
3214B41k72M3O8K86j59j1k18P3K88l17j26O16m87k97J82Q9j27K8l69J94J04J6
3236a55j16K08L4k1K56L9M6j5J4J4L3l53K89J55l71p6K83K3p81Q11j29l34p8J66
$$ y = [-234, -402, -11, 200, 64, -105, 204, 266, 178, 397, 481, 251, 157, 361, 94, 175, 26, 24, -75, 200, -338, -232, -34, -175, -422, -412, -168, -503, -342, -148, -171, -85, 238, 67, 5, 493, 180, 266, 313, 525, 90, 175, 544, 135, -86, 109, -133, -163, 51, -159, -389, -186, -90, -670, -152, 184, -377, -291, 35, 154, -56, 82, 56, 261, 30, 185, 267, -6, -145, -303, 86, 123, -95, -100, 16, 29, -101, -95, -47, -18, -214, 77, 266, 334, -239, -133, 217, -56, 167, 53, -34, -220, -65, 275, 239, 62, -37, -136, 162, 135, -143, -77, 267, -117, -311, 150, 43, -258, -179, -109, -229, 172, 240, -52, 207, 6, -145, 55, 92, 75, -295, 25, 153, -111, -254, 50, 18, 45, -240, -106, -100, 99, -231, -36, 218, 42, 241, -31, 12, 80, 366, 207, 196, -22, 51, 339, 22, -104, 512, 25, -272, -90, -1, -128, -100, -469, -275, -171, -155, -271, -63, -29, -50, 206, 245, 291, 276, 290, 304, 337, -16, 273, 428, 57, -19, 264, 287, -494, 317, 188, -146, -224, -58]
3260e8k84J55n6j44K00J37q8KJ47N8j26j3K25J7J09K30j36k32J39J30j95m45K27
3283aK87k70j16k99L42Ln42K09R4K64l51K44l1K34j76K00l52K19J98r1K44M9k66
3306I2R0k8M7j15jQ0l06J27k0%k51J02j02M72J17n36m7M91l39j16K38N6J14K10
3330C75j15j40j44r7M70n2j30j05J62L4m09L16k09K14m1j4rj31P9l1rj2nJ22N9
3355A78N9N1j88k38J43K9R7j88j9K99j64m50L71j02K97k91J79K15k38lk72L70
3377A35k71K35J12J35j00k54K11l6j16k46J57j4J4m7j97P5j17j32K51r0N6M8K40
3400D9n4K58j23j4R7K20k42k5Mk92l8K94J0k13k08R6K52l16j89R8O1o6J09O1k21
3425c92K7K39L9oo9K19K10k2k41K25J53R8k78k66J30Pr7n7j94J96k41r6J51l9
$$ y = [-58, -342, -187, -243, -387, -187, -50, -138, -136, 11, 69, -57, -70, 155, 172, 281, 511, 375, 143, 282, 412, 217, -228, -1, 286, 16, -100, -399, -57, -54, -596, -387, -293, -29, -380, -136, -167, 67, -109, 91, -261, -42, 156, 65, 309, 358, 92, 182, 154, 201, 86, 85, 165, -141, -14, -34, -34, -285, -183, -285, 187, 304, -232, -279, 212, -127, -243, -5, 51, 165, 375, 260, 120, -24, -121, 349, 297, 167, 62, 224, 258, -151, 165, -44, 170, 129, 115, 106, -25, 54, 23, 14, 2, -3, 119, 178, 237, 288, 100, -138, 5, 34, 131, -57, -76, 223, 59, -391, -20, -122, 175, -116, 63, 278, 40, 37, -235, 135, -136, 99, 211, 346, 246, -8, 203, 167, 51, -195, -38, -52, -38, -85, -282, -207, -324, -456, -205, -295, -239, -191, 49, -5, 253, 130, 116, 213, 433, 191, 166, 170, -122, -160, 134, 144, -69, -277, -181, 71, -245, -434, -336, -275, -341, -232, -171, -392, -365, -126, -87, -93, -162, 57, 267, 245, 4, 229, 382, 480, 202, -64, 66, 73, -24, -81, -275, -79, -320, -416, -265, -304]
3449c04O5j09p2K62m75N77r5P4J19j03K29j45K40l44O02j10j93J33k94L4k9l63
3471c01L31O5m51R4J36p0j29K58r7j24K48k87L13j25N7J59j26K23j27K43j78L11
3493D23m72K56k14J44k95L24J19l75K02l46Q1j3M6r8k5K5O8J66l04J48K92l3O5
3516A84j13J63m09K09P1K44m06R9K12m62J63L68j72j67J46n3J34j98j43J76J05
3537A51j18j59R6J57o6j78j16M64k21L21k85m0j02qJ14r1%j82N59j15m04J95K0
3560hL61l93k7o8Q3j25K31L6J88m81M2K92Q0k08J60k20j89J79kN8N0j55N8n2p5
3585a85J12J00Q7k29J81J43L8l60M2J76J38k70K28j08j45J93k27K97j19j65l35
3606d08L50L48o91K87n1J5L5P1j11R9J09J56j93R8R1j34J69k60M0L5J41O4n5k49
$$ y = [-304, -239, -348, -420, -158, -633, -56, -151, -77, 42, -61, 168, 23, 263, -81, 521, 411, 218, 351, 57, 91, 62, -301, 30, 95, -356, -262, -126, -196, -325, -67, -164, -288, -40, -327, -14, -139, -82, 77, -49, 174, 47, 290, 112, 423, -49, 207, -7, 137, -158, 166, 285, -90, 112, -234, -153, -166, -120, -218, -243, -218, -150, 16, -288, -140, 152, 119, 184, 71, 234, -175, 34, 105, 349, -57, 42, 254, -208, -45, 323, 151, -16, 130, 77, 211, 13, -130, 46, 151, 33, -126, -30, 127, 61, -117, -233, 231, 10, 331, 46, 6, -96, -104, 10, -81, -81, -263, 296, 181, -223, -28, -8, 353, -40, -67, -135, -52, -177, 54, 90, 278, -203, -161, 131, 211, 3, 163, -57, -246, -67, -69, -11, 39, -116, -58, -110, -185, -73, 27, 114, -115, 66, 209, 247, -113, -71, 105, 243, -27, 201, 93, -52, 141, -86, 211, 92, -73, -408, -58, 290, -401, -114, -165, -150, -115, -44, -155, -56, 53, 209, 16, 114, 205, 71, 240, -20, 20, 55, 196, 260, 205, -44]
3630d4j45K98j34k10L21l04Q5k8R7r2k34J99o7l8L24O3j97N3K11k47K17o9K60
3653C19k02P1K7j59Qk05N7K83p6l44p6L90l44j88L53K7n15M51N6n8L35J42l23
3676B9M5K14j19L27k82J73m85J97Rr6j73J05k3Pp2K87j93K41l06k50K50Nl03L02
3700a11J79P4J4k62J25m7P0N35l38j95J16J36l77q9J13M94k63j33k73K53k06N5
3722a30M2J82ok10J24J9j7k74M29j02q2J19j46Om8J28p3k0p7J74r5P6J87m69K00
3747f3M05j54K7p5K7l70K1%K59J6p5Q3O5m15R0LJ44o6Q0o6L2q2m1n7J23P7Q5q4
3775a1r0l4K15j96L99j73K63k18R3qj26PO2k19J13K78m44j72J33p8L18l01l0k21
3799d40J15K07J69j49n5K48k80J29J31K45Om9J78j79j01O3k16K98k25q1m4j8j84
$$ y = [-44, -189, 109, -25, -235, 86, -218, -133, -161, -64, -156, -390, -191, -258, -296, 28, 91, -106, -53, 158, -89, 128, 59, 319, 117, 188, 215, 56, 64, -141, -84, 199, 123, -221, -297, 93, -251, -439, -86, -59, -574, -123, -67, -125, 210, 352, 29, 74, 288, 169, 496, 214, 387, -98, 99, 108, 12, -161, -56, -79, -72, -144, 143, -50, 191, -115, -365, -115, -110, -413, -111, 68, 142, 156, -106, 19, -28, 42, 577, 239, 44, 160, 296, -81, -170, -57, 437, 174, 41, -232, 21, -185, -130, -88, 94, 88, -122, 2, 21, 4, -270, 159, 57, -25, 94, -52, -46, -94, 34, -39, -59, -136, 38, -57, 19, 206, -263, -63, 342, 188, 215, 140, 167, -203, -182, -182, 77, 93, 18, 101, 166, -249, -159, -156, -12, -78, 2, -64, -32, -114, -155, -212, -89, -12, 73, -11, -101, -135, 80, -116, 283, 110, 373, 155, 248, 240, 114, 121, 183, -36, 77, 355, -89, -261, -128, -206, 112, -189, -219, -440, -325, -118, 51, -98, -153, 95, -185, -56, 75, 320, 326, 277, 455, 276, 175, 238, 22, 320, 95, 14, -30, -48, -232]
3822b32j23L70j42m6oJ76m01R4K50J5P1j17kO7L12o5P3l22N6M5R8j39O4j87k96
3847c87K47k1o7O3j01Q9r0qJ61j37J14m05L16L51j99P7J44j52J78j04J03kj83
3870a3J94mj44l2jJ89j49j47J24J68m32J94K25o51M02p1o5K94j92k14K64N8l7
3893d0J88k46P1O2R8k54M36j34k05k1N4k0Q7l04K00j32J44k02K53kk55J19K37
3916A34k54J48K52n12J50k39R1M46l74K78j31l8N3k08K20l60L97k64K19J71j70
3937Ij5j14J7J11J94l7k22K73l54L01k0j70R2j75J34J66k90k3l5j25K75m14N25
3960A03j58j65K1L43j91j04J75J09k05m4K42j03J76j67j91J74J74l50j9K73q3
3981A0k2l2Km8n5r1O9J83m35J73K24P1L3j45J67p8j13J5K40L07k17ON0k63k52
$$ y = [-232, -355, 15, -127, -173, -179, -3, -404, -310, -60, -45, 26, -91, -93, -26, 286, 221, 294, -28, 28, 73, 171, 32, 96, -91, -387, -140, -161, -228, -165, -266, -177, -267, -275, -114, -251, -137, -542, -226, 125, -74, 3, 147, -5, 173, 69, 172, 170, -13, 181, 177, 33, 1, 0, 189, 40, -107, 17, 185, -247, -53, 172, -479, -77, -148, -213, 81, -111, -325, -61, -3, -40, 148, -98, -27, 35, 133, -121, 315, 181, -24, -45, 9, -11, 76, -228, -28, -160, -16, -218, 35, 33, -222, -103, 134, -120, 28, 280, -232, -82, -321, -230, 216, -158, 120, -11, -49, 4, -204, 16, -344, 53, -211, 8, 179, 9, -6, -120, -103, 8, 202, 165, -57, 216, -138, 163, 143, -27, 65, -110, 24, 190, -100, -123, -158, -283, -8, -422, 103, -55, -220, -199, 144, -47, -151, 24, 133, -72, -116, 126, 23, 199, 32, -159, 15, 189, -161, -180, 93, 10, -12, -44, -42, -90, -145, -236, -167, 16, -419, -246, -22, 49, 82, -63, 104, 26, -87, -72, 168, 475, 258, 264, 314, 51, -201]
4006b01J28J85l08Q2k0M9o3m8R2o9K00k87N8L36j87k9p3K99q9J24k07O2K10L8
4030B82m2n4Nj11O2j20m4j92K45k25j0j05O3R7q5J44J83l26J5P4K17l0j4j0m1
4055b2K76j4k94O5L55j31p6M8j68k12l5K0m7J14O0m39M83j59P5J9m4J93J76j44
4079I9j32J04K52l77K32J2k33K8j13K09o3p5M7J23k47J7J74l78K40O8j1J14k89
4102a99K50K40l62O6J41o4j1j4j78M19n7l91L6J85l8j43LK79k76j36R8M24k82
4125a0j17K84Q0l02J49r1L47j32k16k11K37J20k45l7K18j64J18Nq5k42P5K05p1
4148h5n3j08K45N2k3j56L01J81m66L14j8p3Q0k43R9N5k04J46L96m72l3q0J59k03
4172a89J7j62RJ51L04k54q1J03P5M6N4l6J91l89L71l61K60J23R4l19J2p2m8J27
$$ y = [-201, -73, 112, -196, -114, -134, -85, -148, -196, -104, -173, 27, -260, -202, 134, -53, -82, -155, 144, 55, 179, -28, 34, 244, 282, 240, 186, 191, 80, 142, 22, -22, -214, 31, -194, -204, -309, -246, -149, -234, -90, 93, -233, -218, -144, 73, 43, 29, 19, -22, 254, 240, -54, 11, 366, 235, 159, 207, 39, -173, -208, -188, -235, -121, -61, -500, -17, -176, -101, -82, -126, 67, 243, 99, -33, 71, 323, -54, 178, 190, -43, -15, -128, 81, 18, -57, -10, 113, -134, -117, 57, -321, -81, -13, -24, 90, -199, 51, 291, -71, -5, 136, 72, 61, 47, -131, 288, 231, -160, -124, 61, 23, -120, -117, 162, -114, -250, -152, 272, -10, -127, 157, 237, -65, 84, -7, 340, 208, -8, -219, 18, 138, -107, -144, 74, -90, 28, 33, -52, -294, -219, -14, -85, -138, -246, -1, 51, 28, -128, 173, 354, -112, 202, 184, 111, 191, -52, 47, 102, -102, 44, 440, -32, -65, -145, 14, -189, -172, -334, -325, -174, 130, -124, -205, -102, -27, 19, 73, 37, 228, -161, 210, -151, 109, 232, 326, 7, 19, -53, -101, 26]
4196B6k9N0m11K80k00K05l0J13m2J33l67Q9O4M0J93m1K07j26k2K08j15O1Or3l44
4221a45J78j17K40k83m9J73k57K09k52K35K6j1l16K57K63k33J50J04j75R1K48
4242C36l12O7P3k28L37j51R8k99K20O7O1p9m69J83J60k94L26q1J07m54L72o1l1
4265e2k90M39R3j62j66J93J87l7j80n1M92m43O0J46j60M9n5l48L04LO2l1K59n20
4289b08K24j56J76j88N8K31q0k68j0K62o1K80m14K54l61K06j61Q8M93l68J1l0
4311b2J39p7m83K86M42k63q8J94j63J64K1l33K82k3j48j2J99k17q7J54j69j67
4333c71L53j64J34Q5k41k8J54M8Q7l8Q6L54n23K6Q1K26j74n3q7K6J50k82R6L5
4357b0l5O0jO5n2j96Q6r2k03M72j80N6k05K22J63J83k06J35J09k38kj44L42j2
$$ y = [26, -3, 47, -364, -84, -284, -79, -109, 4, -38, 95, -272, -183, -119, -79, 114, 73, 280, 154, 132, 340, 225, 286, 292, 199, -145, 33, -84, 156, -127, -176, -3, -260, -51, -303, -68, -42, -53, -369, -112, 151, -82, 68, 172, -3, 88, 336, 24, 91, 164, -64, 273, 122, 220, -79, 141, 208, 269, 190, -279, -96, 64, -230, 96, 15, 122, -332, 40, -21, -52, -342, 97, 190, 28, -138, 55, 242, 205, 25, -26, 466, 23, 83, 229, 69, 118, 63, -285, 19, 22, 84, 53, 312, -208, 16, -140, 36, -152, -94, 137, 57, -211, -221, 41, -20, 260, -154, 100, -261, -55, -216, -128, 365, -3, 8, -22, 117, 40, -443, -157, 285, 22, -66, 128, -35, 129, 150, -183, 99, 76, -72, -84, 115, -102, -189, -35, -204, -371, -18, -182, -48, 37, -204, -232, -78, -30, 57, 19, 105, 459, -64, -38, 43, 269, 95, 42, -45, -19, 131, -151, -55, -20, -55, 5, 4, 69, 17, -179, -93, -185, -388, 84, -96, -40, -245, -23, 140, 323, 117, 252, 361, 123, 121, -23, 319, 307]
4381C07k51j5k22R4J86n59M66j75j8J79k07K09m2O4q9k9J51r1P4K11k1O2L6P6
4405C96m84L99j00j29M7j77K94l11R9k68K6n5R5k19K99l48K09J16n6n2M48l14
4427h5J79K40k12j21J17M5L2r5k12L06j08j71K92j69J45k20p3J4l65K19M2J8O2
4450a20o4rn4J85K27L0k21J36j5j10K26k80J21l3n4N9j5K12m41R3r4J87R1k59
4474b02K15k50J72K54j53L9r9P6K02k46j30J23J94j31j34J78j62jK07k00n1J73
4496G4l3j28M03l18n9m9J58j48J40j8J01j76n3N52m28R5n9j63j86K83J48p4M2
4519A04l10K52J01k50O7J14M0m47K49J24k10K43K86l43L0l8K45j31p1q5J31q9
4541A2j46J83k51M25m22J71k14J37j24j23M97k87O6Q2q6J83l5l8J78j93K45j37
$$ y = [307, 56, 41, -181, -87, 99, -460, 6, -169, -187, -8, -215, -6, -48, 16, -73, -102, 49, -42, 32, 243, 222, 284, 320, 396, -88, 311, 211, 82, 129, -48, 246, -65, 34, -234, -208, -263, -168, -387, -88, -436, -227, -111, -167, -219, 229, -85, 94, 334, 122, 1, 118, 163, 195, 100, -112, 194, 86, -85, 207, 38, 183, -37, -110, -96, -461, -242, -200, -182, -120, -184, -193, -247, -62, 165, 195, -26, 110, 95, -15, 211, -69, 52, 19, -35, 24, 9, 221, -220, -127, -221, -34, 57, -202, 13, -237, -65, 189, 36, 75, -24, 52, 254, 8, -122, 1, 195, 64, -70, 108, -54, -55, 152, -48, -99, 74, 41, -87, 316, -2, -61, -110, 48, -100, 40, 22, 123, -53, -106, 446, 18, 113, 54, -109, -295, -12, 136, 62, 104, -206, 46, 147, -103, -36, 78, 118, -329, -80, 44, -166, 77, 363, 20, 50, 12, 257, 126, 55, -30, 101, 12, -134, 49, -202, 223, -199, -28, -242, -105, -229, -352, 145, -142, -76, 6, -80, 103, 68, 30, 208, 15, 260, 123]
4563A23Q0n9j97J23J06l5k54K24J17j78j65r7J01k76J96Q9O7l33K84O5j45O3J49
4586D8r4K90j83j18P3Q1N2j56K76r0J04k36j11k2K66j60L6l54K06k09R8O5k3r7
4610b58K58J37K4k96K27o8M0j36rL21j54M2K3k19l1K52k81K76l56J71j0lK06K
4634A58l99l6M5o3J62q7K56l26M20l6N7j43j4j05L0J90k11M03k54m7K5K0K99l53
4658iJ17J32k27j3J13p7J82J19k32k3N5l99J60J43k61J30J01J58j68q3k9R0R7
4681G6j67J46N7P4n20K72M00k97J0j95Q9kn2L2J19N4j25J64p7j31O1o1kQ7k59
4706b47m0L01q1j71K88k90K55j53J69R4k01k4M55j95k74p1J71K08K7j77j03R0
4728C1j99K1J31J87k09k6j19K86j58L8N8j70l2L2K10k04l2J13j11K51j86O5J06
$$ y = [123, 203, 144, -53, 70, 176, 141, -113, 111, 228, 50, -115, -212, -111, -387, -191, -102, -35, -368, -84, -19, -164, -101, 48, -46, 244, 61, -57, 16, 97, 149, -7, 269, 179, 283, 47, -64, -86, 180, 20, 56, -298, -92, -301, -203, -138, -161, -258, 0, 137, 161, -135, 92, 24, 64, -72, -81, 240, 86, 128, 151, -68, -99, 153, -128, 148, -208, -37, -47, -50, 156, 158, -241, -277, -232, -295, -133, -220, 36, -290, 130, 94, 151, 8, -6, -111, -81, 109, -102, 301, 47, 0, 25, 45, 344, -9, 108, 240, 13, 0, 113, 36, 218, 337, 105, 82, 137, -262, -102, 41, -220, -90, 11, 169, 1, -82, -111, -21, 76, -91, 55, 112, 186, -334, -62, 338, 41, 51, -144, -55, -57, -109, -77, 42, 96, -29, 135, 58, -73, -12, -73, -75, 12, -247, -287, 14, -67, -238, 50, -240, 15, -138, 31, 125, -76, -100, 355, 160, -114, -185, -14, 194, 221, 44, -59, 31, -168, -147, -16, 171, -38, -64, -183, 103, -55, -17, 41, -129, -161, -129, 81, -123, -155, -42, -153, 98, -88, -23, 83]
4751H3m8Q7L6l5J55j45j29O1j20J03j58j43j47L06m8K4J3J15l69K23j22J99L8
4774b1K29j66K79m96K12K00rp7j52N2K5J91l24j9M03j48j73n9j60p3l0J24L4J52
4798fr6J27r5R0j90L21J4m05K28L22j45j07J07l1P9j60J4K13l31m1J46r1l0j6
4822h3p3J26N0j0k83M13j79p7J89L0j73QK48kk03L04R1l99J50j50J6l9J42J34
4846B30l09J48k59J38j8J43N0r9j67rj1J81N5k00p3K83j15K02l18J42R9J01m2
4869A52k15J57j93L5K56k04R3j04j31L41l7k57N7p3J26j30K01pJ0p6J09r2r0J71
4893I9j90Q8jJ46k94J7J3M25j31j18J87m95J67K32j49k1O6j2J09N1q2j91K08l8
4917H6p9J06M4k73l9K04J55l65j94J06M90l90P6K1j00l8R3J7K30K61j6l52O4K70
$$ y = [83, 35, 122, 158, 123, 278, 133, 4, 65, -55, 48, -110, -253, -400, -94, -142, -118, -105, 10, -359, -136, -258, -59, -21, 208, 42, 321, -175, 37, 237, 228, 151, -1, 51, 76, 267, -57, -76, 327, 179, 6, -53, -213, -286, -316, -192, -158, -6, -102, 25, -70, 20, -170, 151, 165, -240, -12, 310, 165, 58, 165, 134, 213, 53, 67, 280, -51, -92, 54, -37, -67, -83, -156, -30, 20, 10, -273, 140, -39, -116, 73, 103, -70, -62, 186, 184, -19, 285, 376, -23, 127, -23, -7, -46, 96, 230, -79, 69, -190, -52, -70, 73, 123, 24, -143, -152, -163, 18, 73, -127, -200, 83, -32, 170, -148, -6, 93, 194, 152, -63, 94, -99, -64, 192, -12, 81, -23, -154, 187, 150, -107, -50, -123, 3, -127, 74, 67, 77, 1, 110, 18, -72, 99, -91, -3, -4, 142, -152, -135, -122, 303, 172, 54, 241, -254, -87, 145, -4, -25, 41, 29, 138, 189, 107, -84, 124, 86, 7, 113, 157, -116, -155, 49, 204, -161, -355, -249, 241, -149, -73, -52, -152, -190, -97, -80, 150, 411, 395, 43, 107, 377]
4941C77l89K23K22o02L43l1M1k06J4m2j68P2p2L0K02j4l12K19k04M09j64J48k9
4964F7J82m0k40J37j48J13n0L40k20n5k00J63R8j81M3J66m20K56k37J08k07J16
4986b09K16o1nj6J74m17M41j25o8J92n2l9j35K77l07R6j08J43j18J22k20K23j38
5009a34J31k8M0k83P0p1K05l4j37J67J07j11J07N9k16L50k19r7J55j52J68o0P6
5032I3j33O2l9lQ6r5Q4r5j87M7K20J2J10j93K08K9j33k01P4R0k27q8L19m8J87
5057A79k17o6O1K17j6j20o4K84l22J06r8Q4K0N5R7k34L6P3JO2j90M6O8j83o4K38
5083E3k9J76l32j49m7K66n2j72J44j11M82o3M6j21n6j1J1J28J50k76j62J64q5
5106d6J05q4l44M01jj08o2p4L51l25J8j21K40J33k01j18J38L54k69m2K99l9J42
$$ y = [377, -12, 211, 433, -169, 174, 143, 184, -22, -8, -50, -218, -146, -218, -188, 14, 0, -312, -93, -297, 112, -52, 96, 67, 249, 209, -31, 106, -42, 71, 21, 361, 141, 86, -114, 49, 147, -34, 9, 175, -245, 11, -226, -118, -325, -209, 7, -54, -59, -75, 99, -318, 123, -2, -70, 122, 70, 31, -104, 173, -134, -38, -146, -3, -121, 1, -219, 4, -134, -3, -31, 9, -274, -204, -275, -70, -104, -241, -74, 33, -78, 29, 88, -128, 222, 3, -94, 61, -91, 77, 17, 93, -40, 22, -17, -20, 66, -29, 55, -40, -227, -180, 40, 52, 162, -31, 177, 206, 73, -128, -54, 36, -191, -279, 40, -8, 179, -38, -104, -43, 174, 158, 38, -26, 258, -64, 42, -56, 28, 48, 103, 200, -34, 2, 75, 76, 138, -52, -6, 62, -121, -185, 53, 24, 200, -132, -281, -328, -62, -114, -286, -142, -253, 229, 166, 212, 91, 35, 24, 35, 163, 313, 37, -125, 39, -46, 59, -25, -369, 32, 31, -77, -139, -213, 138, -187, -169, -290, -50, 83, -118, -236, -98, 256, -13, -55, 244, 205, 347]
5129C47l14K53p6Q5k99J78k66J70j25Q2J4k09MK34k4k0k66P2K06OJ23k43P7l5
5153b6J51M2j24J63j18K05m3j39n2M1J21k39K14l12k8N3Q6j51j36O7J3J21J65
5176G4j39M4MJ65J32l22oO7jJ60r8n7J2o2k1K76k97J00L53k77o8j76k98M54j66
5201a47L1Q7J75l11j86M36p3J68J26k96N3J18j29k02K09p0j00K10J2p2j18K18
5223A39k44J27J07n10M93J07j03j64J62j59J55j89K57k41R9k35L26j82p1J18m7
5244e5K39k53J87o7m16M17m8k84M3K57k26L40k32J31j16K53k29K55j48j0j79J21
5266b0J74p0j03J18r3J07j30k2K93n44K40k34J82J47rR5M3j67Q0J4K0q9j29M30
5290C33j82l7j30k61L09J40k5r8O0l63K63k72J10J67k05k6J18k30J62K72j40K08
$$ y = [347, 33, 286, 210, 295, -4, 174, -92, 78, -47, 35, 49, -160, -156, 78, 54, 34, -232, -160, 46, 52, 175, -68, 9, -26, 125, 167, 43, 206, 88, 293, 250, 111, 59, 100, 221, -18, 196, -116, -144, -91, -5, -156, -292, -225, -212, -91, 74, -65, -21, -17, 148, 280, -42, -48, 19, 18, 178, 80, 23, 35, -27, -48, 228, -69, 31, 384, 107, 39, -137, -435, 19, -147, -116, -29, 146, -165, -351, 85, 12, 180, 306, 10, 63, 181, 52, -150, 59, -11, -111, 99, 111, 39, -79, 139, -105, 22, 129, -381, 112, 219, 116, -48, 114, -45, 110, -79, 178, -63, 36, -199, 127, -55, -126, -8, -55, 184, -69, 118, 51, -365, 52, 4, -280, -237, 20, -206, 134, -98, 33, -83, 170, -59, 196, 48, 38, -141, -20, 154, 84, -19, 99, 6, 113, -17, -39, 254, -290, -50, -284, -102, 45, 36, 131, 174, 7, 87, 101, 121, 32, -97, 333, 151, 114, -16, -277, 32, 172, 147, 49, 109, -254, 9, -263, -153, 14, -191, -217, -99, -329, -167, 105, -35, 173]
5312A73j27j86J53J49J4k9J19K8m47L37k44j07Q6j06K50N3j38k05O6O7J15l67
5334c46J65J47o2o1L74j18L01j40k17L55k91lk00M4J75K17k68K7L4l00J27J80
5356A40l11K43J5k40Q3k42N59m89J90r0J51J20j68o6J51o6j22J17J93r8j74K37
5378A33j89J35j26j63J03J21rn9Kn8J40n0l03L74l56J27L57k20J67O8k70K16p4
5401F6j55K46j18j73N8l3L31l70k9J74n7K20j35q4J01k63L39j07J23j60n4q1K9
5424a32J24q7R6kK06l33J19J92m5k54K05j44n6K12j63K46k95J76k08Mj16L21Q1
5447A47o2J02J0j48k46K85j20N6J24m13J40J44J65m65M85j40j02L3k41p3Q5L05
5469G1N2R0j74qk19L37j76M6J13k77K08j6j80K95j41lj51J29J73j02q2l7j04j97
$$ y = [173, 46, -140, 13, 162, 176, 147, 266, 294, -153, 184, -60, -167, -81, -187, 63, 116, -22, -227, -161, -94, 21, -346, -181, -34, -96, -157, 217, 99, 400, 260, 43, 398, 107, 104, -96, -52, 123, 340, 72, 99, 133, -167, -40, 140, -171, 72, 87, -153, -70, -312, 247, -242, -52, -142, 9, 129, -39, -105, 46, -20, -142, -25, 168, 70, -104, 133, -56, 79, -47, -210, -107, 14, 5, -54, -52, -110, 30, -20, -323, 51, -305, -178, 179, -41, 126, 194, -76, 140, 66, -89, 157, 39, -134, -76, -109, 222, -148, -177, -3, -60, 160, 25, -59, 42, -221, 118, 11, 134, -26, -80, -161, -132, -8, -95, 1, -1, 205, -128, -9, 183, 138, -116, 89, -55, -111, 101, -62, 184, -111, 65, -143, -139, -255, 66, 147, 85, 187, 197, 49, -197, 88, -32, 24, 148, -265, -125, 19, 184, -281, 204, 64, -38, -5, -246, -319, -234, 71, 123, 213, 39, 31, -188, 149, -27, 19, 132, -145, 63, 47, -133, 162, 21, 18, -133, -4, 169, 67, -15, -52, -156, -353]
5493c53L93J9j53m9O1n3QK60O0m53M31j79J73Q1k90M61n28J3J3K87m4p9j6j58
5517i5K2J76j83j85L7M42k36J90j45k26M56k21j50J78K82l03r9J14K54k66K90
5538C32l08j23K20Oj81j45L14j62j42j73P06o63K81p4M8J05j65J93J65l4k20%
5560b0p0K04k15K84Q3m91K75j16KJ5P1k00J99o0K40j71J3j73R1pLJ85j36J08k60
5585a46L3m8K90m7J15k06K12k15NL5R0N5m8k06N3L6J6j06J02O1N5m39L30j43K25
5610A09j85q4n4L81l50R4j07K05L7Q7o7J37k10J39o8j23L3n9L3J10k17J8M46k25
5634H0m5J15r3k04J34J0p2p2K38l1l40N81k98l3J10J6K1m12J95k97R0M48k45J37
5658C3K29o0j13j92K20J95j75J70l79q9J56j38K20J76l22k8N4J67k41K23k75J74
$$ y = [-353, 40, 59, -94, -143, -82, -135, -127, 133, 193, -260, 171, -8, 165, 246, -44, 417, -111, -98, -85, 202, 158, 79, 63, -95, -73, 103, -80, -265, -228, 214, -22, 168, 23, -203, 253, 32, -118, 60, 342, 39, -60, 54, 308, 42, 332, 24, -99, 121, 127, -54, -199, 115, -47, -189, -362, 344, -319, -38, -112, -64, 41, -124, 69, 234, 200, -20, -20, -90, 114, -101, 183, 266, -225, 50, -66, -64, -49, 22, -178, 21, -39, 201, 30, 43, -130, -39, -46, -43, 142, 6, 114, -146, -113, -161, 129, 82, 197, -9, 203, -12, -7, 28, 118, 173, 125, -81, -28, 8, 24, -82, 20, 81, 136, -303, 27, -116, 109, -76, -160, -214, 167, -183, -89, -196, 9, 46, 133, 66, 203, -7, 132, 64, -59, -26, -85, -52, 58, -159, -141, 305, 80, 35, 150, 57, -147, -13, -3, -75, -147, 91, 60, -280, 301, 3, -30, 80, 96, 117, -295, -100, -397, -307, 141, -104, 33, 262, 202, 89, -103, 117, 312, 137, 307, -72, -161, -5, -143, 77, 253, -69, -97, -43, 124, -117, 106, -169, 5]
5680Ej61P3R6P8o4J27q5jj12j9K79r9J30j12k07J90l3m6J15k59K73l54M6K47k73
5705a66k71K68j69P0L00o8m9m6L23k2R9n2j96Q4q2j12Q2k65K85m11K98K41n1K8
5729A18k7j56m3LJ73j86j39O0K5P0K53j45k87L68K57n00J13k7J90k63J08k14J43
5752a06M00j84k94J64J63p8k26K52j32L6L1J62k65J5K23j24k85K37M1j80K52q6
5774A6j97L33j75k7J12k02K15j58j88K62J06j32R5j23o5j06J14L6o9Q7q5lJ50
$$ y = [5, -156, -83, 13, 91, 27, 154, 69, 68, -44, -63, 216, 117, 247, 135, -72, 118, 85, 39, 154, -105, 168, -186, -140, 107, -166, -437, -169, -338, -268, 32, -36, -85, -131, 192, 170, 269, 217, 21, 105, 23, -89, -7, -272, 13, -398, -100, 141, 90, 118, 91, -65, -108, -105, 68, -118, -257, -197, -172, -102, 151, 6, -281, 87, 344, -156, -43, -70, 120, -143, -35, -249, -106, 294, 110, -184, -20, 143, 65, -161, 91, -41, -5, 26, 188, -77, -62, 161, 37, -248, -11, 30, -150, 102, 16, -181, 152, -23, -50, 62, -140, 75, -83, -271, -9, 97, -35, 60, -63, -128, -234, -120, -84, -153, -66, -151, -154, -4]
$$ [...]
8191a09
##END NTUPLES=NMR FID
##END=
