##TITLE=1H_SL34-Dau
 CDCl3,8 sc, 
 1.10.2021
##JCAMPDX= 6.0         $$ Bruker NMR JCAMP-DX V2.0
##DATA TYPE= NMR FID
##DATA CLASS= NTUPLES
##ORIGIN= UXNMR, Bruker Analytische Messtechnik GmbH
##OWNER= root
$$ XWIN-NMR		Version 3.5
$$ Fri Oct  1 09:10:43 2021 Russian Standard Time (UT+4h)  she@DPX200
##.OBSERVE FREQUENCY= 200.1313468511
##.OBSERVE NUCLEUS= ^1H
##.DELAY= (6, 6)
##.ACQUISITION MODE= SIMULTANEOUS
##.ACQUISITION SCHEME= undefined
##.AVERAGES= 8
##.DIGITISER RES= 18
##SPECTROMETER/DATA SYSTEM= spect
##.PULSE SEQUENCE= zg30
##.SOLVENT NAME= CDCl3
##.SHIFT REFERENCE= (INTERNAL, CDCl3, 0, 15.7039)
##AUDIT TRAIL= $$ (NUMBER, WHEN, WHO, WHERE, WHAT)
$$ ##TITLE= Audit trail, XWIN-NMR		Version 3.5
$$ ##JCAMPDX= 5.01
$$ ##ORIGIN= Bruker BioSpin GmbH
$$ ##OWNER= she
$$ F:/spectra/data/she/nmr/H-F/1/audita.txt
$$ ##AUDIT TRAIL=  $$ (NUMBER, WHEN, WHO, WHERE, WHAT)
(   1,<2021-10-01 09:09:11.34 +0400>,<she>,<DPX200>,
      <created by zg, POWCHK disabled, PULCHK disabled
       configuration hash MD5:
       00 E9 B6 7A A2 85 ED C7 34 08 36 98 17 FE 4E 26
       data hash MD5: 16K
       FD 39 CC AA 12 9A F4 4D 53 1E 97 E1 1F 6E F9 15>)
$$ ##END=
$$ 
$$ hash MD5
$$ CE A0 5B C3 54 B9 5C BB 97 5C CE 95 02 A0 90 27
##$RELAX= 
##$RELAX= 
##$RELAX= 
##$RELAX= 
##$RELAX= 
##$RELAX= 
$$ Bruker specific parameters
$$ --------------------------
##$DU= <F:/spectra>
##$EXPNO= 1
##$NAME= <H-F>
##$PROCNO= 1
##$TYPE= <nmr>
##$USER= <she>
##$AMP= (0..31)
100 100 100 100 100 100 100 100 100 100 100 100 100 100 100 100 100 100 
100 100 100 100 100 100 100 100 100 100 100 100 100 100 
##$AQSEQ= 0
##$AQ_mod= 1
##$AUNM= <au_zg>
##$AUTOPOS= <>
##$BF1= 200.13
##$BF2= 200.13
##$BF3= 200.13
##$BF4= 200.13
##$BF5= 200.13
##$BF6= 200.13
##$BF7= 200.13
##$BF8= 200.13
##$BYTORDA= 1
##$CFDGTYP= 0
##$CFRGTYP= 5
##$CHEMSTR= <none>
##$CNST= (0..31)
1 1 145 1 1 1 1 1 1 1 1 1 1 1 1 1 1 1 1 1 1 1 1 1 1 1 1 1 1 1 1 1 
##$CPDPRG= <>
##$CPDPRG1= <>
##$CPDPRG2= <>
##$CPDPRG3= <>
##$CPDPRG4= <mlev>
##$CPDPRG5= <mlev>
##$CPDPRG6= <mlev>
##$CPDPRG7= <mlev>
##$CPDPRG8= <mlev>
##$CPDPRGB= <>
##$CPDPRGT= <>
##$D= (0..31)
0 1.2 0 0 0 0 0 0 0 0.06 0 0.03 0 0 0 0 0.0002 0 0 0 0 0 0 0 0 0 0 0 0 
0 0 0 
##$DATE= 1633064950
##$DBL= (0..7)
120 120 120 120 120 120 120 120 
##$DBP= (0..7)
150 150 150 150 150 150 150 150 
##$DBP07= 0
##$DBPNAM0= <>
##$DBPNAM1= <>
##$DBPNAM2= <>
##$DBPNAM3= <>
##$DBPNAM4= <>
##$DBPNAM5= <>
##$DBPNAM6= <>
##$DBPNAM7= <>
##$DBPOAL= (0..7)
0.5 0.5 0.5 0.5 0.5 0.5 0.5 0.5 
##$DBPOFFS= (0..7)
0 0 0 0 0 0 0 0 
##$DE= 6
##$DECBNUC= <off>
##$DECIM= 32
##$DECNUC= <off>
##$DECSTAT= 4
##$DIGMOD= 1
##$DIGTYP= 9
##$DL= (0..7)
0 120 120 120 120 120 120 120 
##$DP= (0..7)
150 150 150 150 150 150 150 150 
##$DP07= 0
##$DPNAME0= <>
##$DPNAME1= <>
##$DPNAME2= <>
##$DPNAME3= <>
##$DPNAME4= <>
##$DPNAME5= <>
##$DPNAME6= <>
##$DPNAME7= <>
##$DPOAL= (0..7)
0.5 0.5 0.5 0.5 0.5 0.5 0.5 0.5 
##$DPOFFS= (0..7)
0 0 0 0 0 0 0 0 
##$DQDMODE= 0
##$DR= 18
##$DS= 0
##$DSLIST= <SSSSSSSSSSSSSSS>
$$ [...]
##$SUBNAM2= <"">
##$SUBNAM3= <"">
##$SUBNAM4= <"">
##$SUBNAM5= <"">
##$SUBNAM6= <"">
##$SUBNAM7= <"">
##$SUBNAM8= <"">
##$SUBNAM9= <"">
##$SW= 18.0517286264689
##$SWIBOX= (0..15)
0 0 2 0 0 0 0 0 0 0 0 0 0 0 0 0 
##$SW_h= 3612.71676300578
##$TD= 16384
##$TD0= 1
##$TE= 0
##$TE2= 300
##$TE3= 300
##$TEG= 300
##$TL= (0..7)
0 120 120 120 120 120 120 120 
##$TP= (0..7)
150 150 150 150 150 150 150 150 
##$TP07= 0
##$TPNAME0= <>
##$TPNAME1= <>
##$TPNAME2= <>
##$TPNAME3= <>
##$TPNAME4= <>
##$TPNAME5= <>
##$TPNAME6= <>
##$TPNAME7= <>
##$TPOAL= (0..7)
0.5 0.5 0.5 0.5 0.5 0.5 0.5 0.5 
##$TPOFFS= (0..7)
0 0 0 0 0 0 0 0 
##$TUNHIN= 0
##$TUNHOUT= 0
##$TUNXOUT= 0
##$USERA1= <user>
##$USERA2= <user>
##$USERA3= <user>
##$USERA4= <user>
##$USERA5= <user>
##$V9= 5
##$VALIST= <valist>
##$VCLIST= <CCCCCCCCCCCCCCC>
##$VD= 0
##$VDLIST= <DDDDDDDDDDDDDDD>
##$VPLIST= <PPPPPPPPPPPPPPP>
##$VTLIST= <TTTTTTTTTTTTTTT>
##$WBST= 1024
##$WBSW= 4
##$XGAIN= (0..3)
0 0 0 0 
##$XL= 0
##$YL= 0
##$YMAX_a= 127986
##$YMIN_a= -254805
##$ZGOPTNS= <>
##$ZL1= 120
##$ZL2= 120
##$ZL3= 120
##$ZL4= 120
##$ABSF1= 10
##$ABSF2= 0
##$ABSG= 5
##$ABSL= 3
##$ALPHA= 0
##$AQORDER= 0
##$ASSFAC= 0
##$ASSFACI= 0
##$ASSFACX= 0
##$ASSWID= 0
##$AUNMP= <proc_1d>
##$AZFE= 0.1
##$AZFW= 0.1
##$BCFW= 1
##$BC_mod= 2
##$BYTORDP= 1
##$COROFFS= 0
##$CY= 11.3945322036743
##$DATMOD= 1
##$DC= 2
##$DFILT= <>
##$DTYPP= 0
##$F1P= 2.36226072786647
##$F2P= -0.459571619588291
##$FCOR= 0.5
##$FTSIZE= 0
##$FT_mod= 4
##$GAMMA= 1
##$GB= 0.15
##$INTBC= 1
##$INTSCL= 1
##$ISEN= 128
##$LB= 0.24
##$LEV0= 0
##$LPBIN= 0
##$MAXI= 10000
##$MC2= 0
##$MEAN= 0
##$ME_mod= 0
##$MI= 1.114404
##$NCOEF= 0
##$NC_proc= 0
##$NLEV= 6
##$NOISF1= 3.799351
##$NOISF2= 2.8
##$NSP= 1
##$NTH_PI= 0
##$NZP= 0
##$OFFSET= 15.70392
##$PC= 1
##$PHC0= -14797.44
##$PHC1= 12.00082
##$PH_mod= 1
##$PKNL= yes
##$PPARMOD= 0
##$PSCAL= 0
##$PSIGN= 0
##$REVERSE= no
##$SF= 200.130013532006
##$SI= 16384
##$SIGF1= 3
##$SIGF2= 2
##$SINO= 400
##$SIOLD= 16384
##$SREGLST= <1H.CDCl3>
##$SSB= 0
##$STSI= 0
##$STSR= 0
##$SW_p= 3612.71676300578
##$SYMM= 0
##$S_DEV= 0
##$TDeff= 0
##$TDoff= 0
##$TI= <>
##$TILT= no
##$TM1= 0
##$TM2= 0
##$TOPLEV= 0
##$USERP1= <user>
##$USERP2= <user>
##$USERP3= <user>
##$USERP4= <user>
##$USERP5= <user>
##$WDW= 1
##$XDIM= 8192
##$YMAX_p= 0
##$YMIN_p= 0
$$ End of Bruker specific parameters
$$ ---------------------------------
##NTUPLES= NMR FID
##VAR_NAME=  TIME,          FID/REAL,        FID/IMAG
##SYMBOL=    X,             R,               I
##VAR_TYPE=  INDEPENDENT,   DEPENDENT,       DEPENDENT
##VAR_FORM=  AFFN,          ASDF,            ASDF
##VAR_DIM=   8192,          8192,            8192
##UNITS=     SECONDS,       ARBITRARY UNITS, ARBITRARY UNITS
##FACTOR=    0.0002768,     1,               1
##FIRST=     0,             0,               0
##LAST=      2.2672688,     0,               0
##MIN=       0,             -254805,         0
##MAX=       2.2672688,     127986,          0
$$ Real data points
##PAGE= N=1
##DATA TABLE= (X++(R..R)), XYDATA
0@%%%%%%%%%%%Qj6J6j6K4l2L2m0N6o4P2q8J04j23J47j74J99k26K63l03L45l93
33b09M47n08N72o43P23q08R00j003J118j243J377j523J684j860K051k259K489
50A305k743L023l331L672m055M484m967N521o160O907p795Q867j0195J1892j4148
65g723J7308k2095L0279m8017J58234j26453j73289K54748l5479p0246M6346O193
77B9806p2906L3772j7164k6671P1276K9569q2542K2977L3578n0198j8418M6851
89g0o198k0486Q922J7453K263j0768k948M7477J8250l2238j2053o454m556M7600
103D6194L204o8527Q327M0331o6679k8118Q1630J1864m9838J729j5122j2345O4250
116A6900J5094o0728J7469M2875m1528j8827L9103P195Q53J2940l1321k0436L8392
$$ plain form
0 0 0 0 0 0 0 0 0 0 0 0 0 8 -8 8 -8 16 -16 16 -24 32 -32 40 -48 56 -67 80 -94 105 -121 142 -161 184 -209
33 -209 238 -270 302 -341 382 -426 474 -529 589 -654 723 -800 884 -976 1075 -1184 1305
50 1305 -1438 1585 -1746 1926 -2129 2355 -2612 2909 -3251 3656 -4139 4728 -5467 6425 -7723
65 -7723 9585 -12510 17769 -30248 127986 1533 -171756 82992 47513 -22733 23613 29806
77 29806 -43100 -9328 -26492 -53163 18113 47682 -34860 -11883 21695 -28503 -46921 -70
89 -70 -6268 -26754 -17832 -379 1884 -8884 -11832 35645 53895 21657 9604 3150 -1406 46194
103 46194 49398 -19129 -10802 29529 -37150 -65268 16362 28226 -21612 -19883 -35005 -47350 16900
116 16900 31994 -28734 -11265 31610 -9918 -28745 10358 17553 18406 31346 25 -20411 17981
129A7981J6099k0842q85k940k7338j0013J5075J5627L316j0250j0407j36q5L131
143a1667J1962J1165J759j4815k0438P468K0674o275R19L4913M959m2791j6912
156a9079K5971J5290j2181j2981J579j356k0377j1519K4386K4981l943j8652j3003
169b0884J1069K3371n713j6824J2335M568j9926M584J7198n51J1009L486l0971
182g249k108K6991j4009j4416K4618p666l2312J0182J3982o896P604K667j1074
195i686R260k061k0477K0061K6737k1585j3501J8771K268m255N925k244N668N263
209B0144k6728j4520K5125Q281j2237j702o085k775P750j3076l033L5920m78m0637
223b4051j25J7651m126J4402J5289j5126n12O973j7111J1870K8186k3554j8578
$$ plain form
129 17981 34080 13238 12353 9413 -17925 -27938 -12863 2764 6080 -4170 -14577 -14713 -14798 -11667
143 -11667 295 11460 13219 -1596 -22034 -14566 6108 -167 752 35665 40624 -2167 -19079
156 -19079 6892 22182 10001 -2980 -1401 -2757 -23134 -34653 -10267 14714 10771 -7881 -20884
169 -20884 -9815 13556 7843 -8981 3354 7922 -12004 -7420 9778 9227 20236 23722 -7249
182 -7249 -9357 17634 3625 -10791 13827 6161 -26151 -15969 -1987 -8883 -1279 1388 -9686
195 -9686 -426 -2487 -22964 -2903 23834 2249 -11252 7519 9787 5532 11457 9213 14881 20144
209 20144 -6584 -21104 4021 12302 65 -1637 -7722 -10497 -2747 -15823 -18856 17064 16586 -24051
223 -24051 -24176 -6525 -10651 3751 19040 3914 3402 10375 -6736 5134 33320 9766 -8812
236h812K5163o666k7407J3917J2379r097L765q904j7868J9896J4141k3967r84
249a4444J8423r678r392Q197L839O977N872j1357k165J1830m155k133J4014K824
263A8652o570o689j1552M325J8594r567j7692Q279j370j7913O671J4540p38n8
277a088n199p680J2711O858j3184P202J6233j6725j7745J3055J5032M646N48r212
291E452m285Q503j765n738O254K177r713r875n622L484Q690l523j550R365m139
306b285j2602O305J1304L82K38k785l423O834j102j0616J2682J6259j1556j4467
320d832L509M911L702J516p361p64J890j3642m493J9549N956j5892q232J807O463
335e913O099l225J247J2393m805j5564P914J4248l785m652p94j603K548m358q594
$$ plain form
236 -8812 16351 9685 -17722 -3805 8574 -523 3242 -5662 -23530 -3634 10507 -13460 -14444
249 -14444 3979 -5699 -15091 -6894 -3055 3922 9794 -1563 -3728 8102 3947 1814 15828 18652
263 18652 12082 5393 -6159 -1834 16760 7193 -10499 -2220 -3590 -21503 -14832 -292 -1030 -1088
277 -1088 -6287 -13967 -1256 5602 -7582 -380 15853 -872 -18617 -5562 9470 14116 14664 5452
291 5452 1167 9670 7905 2167 8421 10598 885 -8990 -14612 -11128 -2438 -5961 -7511 1854 -2285
306 -2285 -14887 -8582 2722 3104 3342 557 -2866 3968 2866 -7750 4932 21191 9635 -4832
320 -4832 -1323 3588 7290 8806 1445 681 2571 -11071 -15564 3985 9941 -5951 -14183 -12376 -5913
335 -5913 186 -3039 -1792 10601 5796 -9768 -1854 12394 8609 3957 3163 1560 4108 -250 -8844
350h844J2581J1855j5830r816J1257l97q700L959L777J85k521j1633O4J9646L784
365I367j1322L387N046o842p37M297L922N723p674j5200O657J0699p894k497R757
380F689k336j0354n001K76J0311O694j2128n610J1187m23o476Q560Q622j539k968
395E504o613j695J0306K878q333P51J203q283j024N946K385L55m224o818L438
410d224K746q719J667J1612j830p538j892J042P009R172l469j718O462m146q029
425a855O342Q227k190o133p711k370P033j989o851N609L352r095m919M550N931
440b069N103n028o776O453L624q237O138J2738n947o123M636r34K427N325p257
455D073o32R774j1173j5076J2674R556j1952l293J929n361J510K669n868O151
$$ plain form
350 -8844 3737 15592 -238 -10054 1203 806 -7894 -3935 -158 27 -2494 -14127 -14063 5583 9367
365 9367 -1955 1432 6478 -364 -1101 3196 7118 12841 5167 -10033 -3376 7323 -571 -3068 6689
380 6689 4353 -6001 -11002 -10726 -415 6279 -5849 -11459 -272 -695 -7171 1389 10011 8472 5504
395 5504 -1109 -2804 7502 10380 2047 2798 4001 -4282 -5306 640 3025 3380 -844 -7662 -4224
410 -4224 -1478 -10197 -8530 3082 1252 -6286 -8178 -7136 -127 9045 5576 3858 10320 6174 -1855
425 -1855 4487 12714 10524 4391 -3320 -5690 1343 -646 -7497 -1888 1464 -7631 -12550 -8000 -2069
440 -2069 3034 -1994 -8770 -2317 1307 -6930 -792 11946 5999 -124 4512 3578 6005 11330 4073
455 4073 3441 13215 2042 -13034 -360 9196 -2756 -6049 -4120 -9481 -7971 -5302 -11170 -5019
469e019R123r821o238J1590M422k080N504L080l482m016l378M680Q747m690q827
484d05q42q82J7K954k018J041N211j0075q981J1580L514r945L808N207q225K366
500e675N088n239Q761J3159j2307p358J4317r74j0317Q086K484j0802J89L37o464
515f715O842N170j1758j604R266n376o304Q646M968n369k514P10K653L976m59
530B132j090M737J739o263n049N190Q409j776r710j198M277l459j119O358M46
545C624n959k640j724J909O439j775o525M716L630o528O25R205J716k182M92j854
561C169o11J254k817o98M493j535r341l161N682M768j571k147J492J54l546O92
577c723N172J996k647l306j034M058L259l328K6O438o80o276K53L045P12J24m311
$$ plain form
469 -5019 4104 -5717 -11955 -365 4057 1977 7481 10561 7079 3063 -315 4365 13112 8422 -405
484 -405 -1247 -2129 -2112 842 -1176 -135 5076 -4999 -13980 -2400 1114 -8831 -5023 184 -8041 -5675
500 -5675 -587 -5826 2935 16094 3787 -3571 10746 9772 -545 7541 10025 -777 -588 -251 -6715
515 -6715 127 5297 -6461 -8065 1201 -4175 -10479 -1833 3135 -2234 -4748 -4038 -1385 2591 2132
530 2132 1042 5779 7518 1255 -3794 1396 9805 8029 -1681 -2879 1398 -2061 -3180 3178 3624
545 3624 -2335 -4975 -6699 -4790 1649 -126 -6651 -1935 1695 -4833 -4208 4997 6713 4531 5023 3169
561 3169 2558 3812 995 297 4790 3255 -6086 -9247 -3565 1203 -368 -2515 -1023 -869 -4415 -3723
577 -3723 1449 3445 798 -2508 -3542 516 3775 447 473 6911 6231 -45 208 3253 3965 4089 -222
594b22l795K608j871m635N695O013o336n087K072K821M670O92n311K622M955o958
610b067q46J0693O18o393K153l75l888L462j068m344O359j56j3664R70J0174m391
626b763k771O428j374m979Q48j042L665R511m222j0341M746O919l465R23N032
641G115k99j887k798j860L270J379l983p07k14m075j628l6J153N697r53q405K234
658e997O395l781M46P659l410m583L630l10R36P833l289p805P112L800j0376J129
674f11Q686n072m788J224m176k07O264l093m319N803k41q513K820P818J14k277
690e68j2j100O42K089J418K719J170l181l840R33L886J180m173j716L257k744
706d0o297K003N522p95k393j327j450J658J685j719K755N022m308n780M169N130
$$ plain form
594 -222 -4017 -1409 -3280 -7915 -2220 3793 -2543 -7630 -5558 -2737 1933 2625 -2686 -64 4891 -2067
610 -2067 -2913 7780 8398 2005 4158 3783 -105 3357 2289 -2055 4304 4148 -9516 -8546 1628 -2763
626 -2763 -5534 894 -480 -5459 -4611 -5653 -1988 7523 3301 -7040 -2294 4625 1160 2083 7115
641 7115 6816 4929 2131 271 3541 4920 937 230 16 -4059 -5687 -5723 -4570 1127 174 -8231 -5997
658 -5997 398 -3383 -2937 4722 1312 -3271 359 49 985 8818 5529 -2276 4836 8636 -1740 -611
674 -611 8075 3003 -1785 -561 -4737 -4944 1320 -1773 -6092 -289 -530 -9043 -6223 1595 1709 -568
690 -568 -580 -1680 -1038 1051 2469 5188 6358 3177 -663 270 4156 5336 1163 -553 2704 -40
706 -40 -6337 -4334 1188 393 -2000 -3327 -4777 -3119 -1434 -3153 -398 4624 316 -5464 -1295 3835
722C835k03p10q4l66p92j653k14M016P35m276k919J136J104j554r48J882K058
739A047l210l977L095L707l44l99K34n75R40o63m05M872K080n514l507L754Q61
756A996q15Q13j019r06p15l141k90N443L48m903K21J774j060J61J280K158K738
773D083l305m449L870M105k463n56K291j423j700r96j230L581K664o268l255M133
789i18p21l428L886K728l375l18m61m31M535J660l680J624L130m192j090L941
805B890J639n08j642l156L65K646k252j706K664o54m145j148R95K330J509k633
821b806j390L292J82k295L672L565j262j044m54p01L098P67l028J023J856n294
837h19k138M201Q58k377j136r66l27K70j982J82M375O5n253j50L890J743M34M00
$$ plain form
722 3835 3632 2922 2838 2472 1680 27 -187 3829 4564 288 -2631 -1495 -391 -1945 -2893 -1011 1047
739 1047 -2163 -6140 -3045 662 318 -81 153 -422 518 -145 -550 4322 6402 888 -2619 1135 1996
756 1996 1181 1994 975 69 -646 -3787 -4077 1366 1714 -3189 -2968 -1194 -2254 -2093 -813 1345 4083
773 4083 778 -3671 199 4304 1841 1285 3576 2153 453 -543 -1773 1808 4472 -1796 -5051 -918
789 -918 -1639 -5067 -1181 1547 -1828 -2146 -2607 -3038 1497 3157 -523 1101 4231 39 -1051 2890
805 2890 4529 4021 2379 -777 -412 2234 -18 -1724 940 286 -3859 -5007 -4012 -1682 -173 -2806
821 -2806 -4196 -904 -722 -3017 655 4220 2958 1914 1460 759 3857 4624 1596 2619 4475 -819
837 -819 -2957 1244 2102 -275 -1411 -2377 -2704 -2434 -4416 -4234 141 206 -5047 -5197 -1307 436 870 1270
855A270O22J434q97j751K747K667j768k430o03j024N22m56r53J376o19m312j668
872e843L677M43j241O67k28l30O22p23J854M946m06m106J386K508m61n53R96M09
890C617k03k480k941K579K836k489k580O07o81j167l35K48J728O23l304j110L720
907a332J474q10J815K001o34r67j062K225K696k293l174Q05P29k470l85J837O89
924A144o14k786j761L079J665k653l22K709j620j979J170J695J738J115k728n07
940f55L703j027j953K688K233m159k188R79O3J258l66k397J08P43j677o50K962
957c35J535k217j002L46J840P01j96J148J248o06k131k99J488J351j224k205M68
974i0L31k452l10L427R19k763j737K80Q13J645l65j222J673M33l023O77M131K91
$$ plain form
855 1270 1892 3326 2429 678 3425 6092 4324 1894 1291 267 789 333 -620 756 137 -4175 -5843
872 -5843 -2166 -1723 -2964 -2297 -2525 -2855 -2233 -2956 -1102 3844 3438 -668 718 3226 2765 2212 3208 3617
890 3617 3414 934 -2007 572 3408 919 -1661 -1054 -1735 -2902 -3237 -2989 -1261 -638 -3942 -5052 -1332
907 -1332 142 -668 1147 3148 2514 1547 485 2710 5406 3113 -61 744 1473 -997 -1382 455 1144
924 1144 530 -2256 -4017 -938 727 -1926 -2248 461 -1159 -3138 -1968 -273 1465 2580 -148 -655
940 -655 3048 2021 68 2756 4989 830 -1358 -379 -316 942 576 -1821 -1713 -970 -2647 -3297 -335
957 -335 1200 -1017 -2019 -1673 167 868 672 1820 3068 2462 331 32 1520 2871 1647 -558 -90
974 -90 241 -2211 -2521 906 1825 -938 -2675 -2395 -1582 63 -302 -1524 149 582 -2441 -1764 2367 2658
992B658j546K80O14J99r3j177L66J789j534m033M32J372j008l6M22j77o75j265
1010c412Q80L122J132k606r68J964O82K32J21J150J294j420k153J262K005q12
1026B473j643l68J82p08j815j502K312K441k860k424J131M51k54J916K20l17L49
1043d16j331MM653J458l554R72K195k158o35J336n31m49K17l093q56K379j622
1060a431k353L484J298m080j046K088J054J416j80k568N59K008o68K45K945M99
1076C270k180o32J655J351o76j613N0J66j167j242n07N06P91q60k148J151J339
1093g46k235K87M068n48l278N99J217R74K071R4k484J541J133k655N38L832k130
1110B278l727J803J38j427L45O4j124J320K07l378P02L308n36j810J761N85k362
$$ plain form
992 2658 1112 1392 2006 2205 2112 935 1301 3090 1556 -2477 -2045 -673 -1681 -1717 -1295 -1472 -2147 -3412
1010 -3412 -2532 590 1722 -884 -1852 112 794 1026 1147 2297 3591 2171 18 1280 3285 2473
1026 2473 830 462 644 -64 -1879 -3381 -1069 1372 -1488 -3912 -2781 -2330 -2584 -668 -448 -765 -416
1043 -416 -1747 -1743 2910 4368 814 1786 3981 1823 1188 2524 1993 1544 1761 -1332 -2188 191 -1431
1060 -1431 -3784 -300 998 -3082 -4128 -2040 -986 430 250 -2318 -1759 249 -419 -174 2771 3270
1076 3270 1090 458 2113 3464 2788 1175 1225 1391 224 -1018 -1525 -1019 -228 -1088 -3236 -2085 -746
1093 -746 -2981 -2694 1374 826 -2452 -1853 -636 338 2409 2503 19 1560 2693 38 576 4408 2278
1110 2278 -1449 354 492 -935 -590 -526 -1650 -330 -123 -3501 -2799 509 -27 -1837 -76 509 -1853
1127a853M72K017J597K2r72j573M48K314p9k445N84J256k534j316K162M71j979
1144a408J04N28m86O01k68r96K076J996k964j194K529N63q63P23J149j181r08
1161Aq1N35J523L6l000n91J515o7j495L75Q87k37o90j268J686J126l44j92Q26
1180E45M38r06m5N32K018K44k258o25J232l22p91P30M5j249j151q07R70J886j160
1199f74k002J266J366j641q8J807N23O49p24j316J710J583j562J8K349j435j967
1216a38L30O85J41K89j567j784J226J91k459J723J645k060j401J692O88M40O32
1233B73n21M54J391p33r97K114J665j422j432L55M06k15j058L68M59p23k250m28
1251b294R82N07o17q69Q1J024n40p44K334J480j739l31J665K12N6Q52l66N44O62
$$ plain form
1127 -1853 -1381 636 2233 2255 1283 -290 158 2472 2393 -52 532 1788 -746 -2062 100 571 -1408
1144 -1408 -1304 -776 -1262 -661 -929 -1925 151 2147 -817 -2011 518 1081 218 941 2090 909 1
1161 1 -80 455 1978 2014 -986 -1577 -62 -129 -1624 -1249 -362 -599 -1289 -2557 -871 255 -89 -281 545
1180 545 983 77 32 564 2582 2826 568 -57 1175 853 62 792 837 -412 -1563 -2370 -1400 486 -674
1199 -674 -2676 -1410 -44 -1685 -1773 34 557 1206 482 -834 876 2459 897 915 3264 1829 -138
1216 -138 192 877 1018 1307 -260 -2044 -818 -627 -3086 -1363 282 -1778 -3179 -1487 -799 -359 273
1233 273 -248 206 1597 864 -133 1981 3646 2224 792 1147 1553 1338 280 648 1107 384 -1866 -2294
1251 -2294 -1312 -805 -1422 -2291 -2210 -1186 -1726 -2470 -136 1344 -395 -726 939 1151 1207 2059 1693 2237 2899
1270B899k315r84K115P30k512n71M97q54q25L50L03K93k94j278m88K036O42q28
1288a084Q39R63k10q49L51J759M69q40l96K97J4l83m13L13P03j172k047J22J538
1307b6o05j068L30K42n57j57J09J499J085m70j185R28J538j086j93J446J27j026
1325I31j020K1J274k2j259m2K58m68j076K14P20M98q95j235N29J157j61m20J476
1344D80M77j097k61N59J021J137j199p94O36K54j601m5J352l95j200o01m5Q14
1362e08K45o01J03J239q51j364J086J677j37l43k12J13P55q74j36J194Q25k000
1380B11j067Q72M09k30n97l67L77k27j374K15J996m41j025P9N53L09K15L43R21
1399A172Q37j113r63J181J102p29n64o5j57n96j101J66Q49M57j846m90P15Q8j6
$$ plain form
1270 2899 584 -400 1715 2445 -67 -638 -141 -995 -1820 -1470 -1167 -874 -1168 -2446 -2934 -898 -256 -1084
1288 -1084 -245 718 508 -341 10 1769 2238 1398 1002 1299 1313 930 517 830 1533 361 -1686 -1564 -26
1307 -26 -631 -1699 -1369 -1127 -1684 -1841 -1732 -233 852 382 -803 125 1663 577 384 1830 1957 931
1325 931 -89 -68 1206 1184 -75 -117 141 -327 -1403 -1189 -469 29 -866 -2101 -1572 -415 -576 -996 480
1344 480 957 -140 -401 158 1179 2316 1117 323 959 1213 -388 -433 919 524 -676 -1277 -1322 -508
1362 -508 -263 -864 -761 478 -373 -1737 -651 1026 889 546 334 447 1202 328 192 1386 2211 211
1380 211 -856 16 425 195 -402 -769 -392 -619 -1993 -1778 218 -223 -1248 -1169 -616 -307 -92 251 1172
1399 1172 2009 896 -67 1114 2216 1487 923 858 701 105 -996 -830 19 476 -1370 -1860 -1145 -1057 -1073
1418a073j48N91L29m19p97Q90J807k47o31K88Q89m47J93J61N28L15j421j011N36
1437C33M08j240l13M63l93j392m4N73J007K82j081k24J358K51m62Q51Q87L79p67
1456H76o07Q91P77m85o57N10j23q39q28J12R88j18j577q51J166k83p09M04Q87
1475d66k62n09j7K64J451M59p85L96R87n28p87J373O13r44k77o55j04K92n86j159
1495a244J104K31j791o57J574N15q82K93pJ51pL04K77J228R1j177n51J513P53
1514A718p21m7R2j9j137l13P55J10l29j024k07O07L0r08L17J345j56j344K54J173
1534A96j2M99L33m23rp4p51Q34J658j288j580O69O01j070k23Q11o44J71m75k94
1554a071K00R89n47o18J078O79j301k85J267R12l97n01m1j5P72k50m63L31k16
$$ plain form
1418 -1073 -1221 -630 -301 -720 -1517 -627 1180 933 302 590 1479 1032 1225 1386 1914 2229 808 -203 333
1437 333 741 -499 -812 -349 -742 -2134 -2178 -1605 -598 -316 -1397 -1621 -263 -12 -474 377 1264 1643 876
1456 876 269 1160 1937 1452 795 1305 1182 343 -485 -373 615 497 -1080 -1931 -765 -1048 -1757 -1353 -466
1475 -466 -728 -1237 -1254 -990 461 920 135 531 1518 990 203 1576 2189 1245 968 313 209 501 -85 -1244
1495 -1244 -140 91 -1700 -2357 -783 -268 -1150 -857 -864 -713 -720 -416 -139 1089 1180 3 -548 965 1718
1514 1718 997 950 1042 1023 -114 -427 328 438 109 -915 -1122 -515 -485 -1393 -1076 269 113 -1231 -977 196
1534 196 184 683 1016 593 584 510 -241 593 2251 963 -617 52 653 -417 -640 171 -473 -302 -777 -1071
1554 -1071 -871 118 -429 -1047 31 710 -591 -876 391 1303 906 405 364 349 1121 871 408 739 523
1573E23j371q7J362j18j326j20O41k94L1L4k8P82N35q87j80J414K0j138J161J017
1593A971q90j131O98k22P49J2j692n94Q69j30r56R53L06j242k88M75O37K56k47
1612d66J21L55P40n61l34R76O92k22n74P3N36j083j4P79J27j065q17n73P29P55
1632A74j039j114R52L58j163O03J410m27j43K18L25M29P16o66j11J626l34j690
1650A24L70Q61q02n5M10r61n08k36j80K82Q82j125j583R61J308o90p2P05J42l77
1670e44N19K11M20P14m95j34M77L21r71j90N78N34j220p34n9M16k82j79j66k9
1690h13K53r47k39K018L6j259j31J152K46l19O27j20M14J98q40J78P38J20j323
1709a1J03O64j013o54L21O18j07m58o33L6M19K66j12M14O20n69q06R96R60k86
$$ plain form
1573 523 -848 -935 427 309 -1017 -1137 -496 -790 -759 -725 -753 29 564 -323 -503 911 931 -207 954 1971
1593 1971 1081 -50 648 426 1175 1187 -505 -1099 -230 -360 -1316 -363 -57 -1299 -1587 -1112 -475 -219 -466
1612 -466 -345 10 750 189 -145 831 1523 1301 727 800 1336 253 239 1018 1145 80 -737 -1310 -581 174
1632 174 -865 -1979 -1027 -669 -1832 -1229 181 -246 -389 -171 154 583 1299 633 522 2148 1814 124
1650 124 494 1355 553 498 908 -53 -561 -797 -977 -695 187 -938 -2521 -1560 -252 -942 -1014 -309 -167 -544
1670 -544 -25 186 606 1320 825 691 1168 1489 518 328 906 1440 220 -514 -573 -157 -439 -618 -784 -813
1690 -813 -560 -1507 -1746 272 308 -951 -1082 70 316 -3 624 504 918 1116 276 454 1192 1312 -11
1709 -11 92 756 -257 -911 -590 28 -79 -537 -1170 -1134 -715 -449 -561 -147 473 -96 -902 94 1054 768
1729G68m53L62k47J95j87k85J40M32m40j140M84O28p24o30N70L25m18l94L35L98
1749b81P32l37q39P22Q62p01j28J127p5q95l47M57K75q3o83k61P62n55q11L01
1769g58P61j89m92l79Q27J70n03R4R77K2l88j46O46K21J88m12k55J97q7n45O4
1790A3O40m99r99k10N93l09q1n5K19M01k46p52J335M78m36k4K61N84k41p1J94
1811G95N89p7j218l27R41k10m30k99P6k25k76p38L47Q84k88p36K9O53M9j75N22
1832a14O89j8N3l65N41Q25p60M4N8L13j263P2J29L10l11j134N3J14K8m79J54L08
1854g53M08n80O8J41R55l43k4O29K17m42p9P33L01j47l83l98N91%r63n4N87m14
1876E0j119P9K66J20j37k45J18N57k45j15M01P73k40j2n8N29K32l08JN25k02o22
$$ plain form
1729 768 315 677 430 625 438 153 293 725 285 -855 -371 257 -467 -1097 -527 -202 -620 -1014 -679 -281
1749 -281 451 114 -725 -3 859 158 30 1157 1082 187 -160 297 572 489 -194 -455 307 -248 -1059 -758
1769 -758 3 -186 -678 -1057 -230 -60 -563 -469 508 530 142 -4 642 863 1051 639 384 581 494 -51 13
1790 13 653 154 -845 -1055 -462 -771 -852 -907 -688 -287 -533 -1285 50 528 92 68 329 913 672 601 795
1811 795 1384 1307 89 -238 703 493 63 -236 -160 -385 -661 -1399 -1052 -168 -456 -1192 -1163 -510 -461 -636 -114
1832 -114 575 557 610 245 786 1611 851 895 953 1266 3 75 204 514 203 -931 -878 -764 -736 -1215 -1061 -753
1854 -753 -345 -925 -857 -716 239 -104 -128 501 718 276 197 930 1231 1084 701 303 894 894 -69 -123 464 50
1876 50 -1069 -990 -724 -604 -741 -986 -868 -311 -556 -671 -270 503 263 251 193 722 954 646 647 1172 970 348
1898C48j25K84P9m59m38l28M74J01p91J66L70m04j35q6P78L4rj11N66M30o42L0
1920A32M67O71o48m06J52j15n9k50j9J85J78r82k04Q94j48l07o5K22K49j12m10
1941e75Q33M01k00l32j12N30O9l87J6O06k01j081j08Q14J33m78l75R1J08m32l7
1962g17M55M81l97n51M45N58l41J09M09M21l79j01j35L98J94m50q29M05O23j039
1982d41j03L62J75n18k25l2K04M85l99j68P82p8k56L9O45L20k20r7J16K14m60
2003C45%L90j14k39q39m50Q98J83r00l81N46j88o5K39j1J98J56k91L14N55J68
2024E14m24N09N92l94n46K59L57k58L7j70m88R3o81k48M45N94p66r10O06M77n46
2045i48N53k17k1M69J80r5N47L44m41J71J44M42n51L7N37k63o29j95l19K49K44
$$ plain form
1898 348 223 507 586 127 -311 -639 -165 -64 -855 -689 -319 -723 -858 -944 -166 -132 -141 -252 314 744 102 132
1920 132 599 1270 622 216 368 253 194 -56 -75 110 288 -694 -898 -4 -152 -459 -524 -302 -53 -165 -575
1941 -575 258 659 459 127 15 545 614 227 243 849 648 -433 -541 273 406 -72 -447 -356 -248 -680 -717
1962 -717 -262 219 -178 -729 -284 274 -67 42 451 872 493 392 257 655 849 399 -430 -25 598 -441
1982 -441 -544 -182 -7 -525 -750 -782 -578 -93 -492 -660 122 44 -212 -173 472 792 572 475 591 805 345
2003 345 345 735 621 382 -457 -907 -9 174 -726 -1107 -561 -749 -814 -575 -586 -388 -232 -523 -209 346 514
2024 514 90 599 1191 797 251 510 867 609 646 476 -12 81 -600 -848 -403 191 -575 -1485 -879 -402 -948
2045 -948 -395 -612 -633 -164 16 -79 468 812 371 542 686 1128 577 614 1151 888 259 64 -255 -6 238
2066B38n55o44L04j05q00M14J038j77p65N04J86O94K85k31k89N34N51r61J85P92
2086A198o21l63M56M2q06Q1o3j48K54l64o54K07N10k36l50R08o2n96K18M76L66
2107D53R9j46k93K95N49m48n19M99K12n45k73L17l04m37L01M09n63K79n73j70
2127h58R67M73j050j95N51M17l15L12P33p23j56K10l97P30n1j086J58N47l62p11
2147h06N09M15o80L05j71j48O4K33K04J07M27p13k03Q70L23k07k70J13Q1l03K00
2168C50n8k96Q7k36m31N18R5o70n33R05L40o84j36L01K51M85O7l95L63J41j63
2189C01l6R46l83j007M81L47l76O0k97k63Q0J74r47M12K27j84k45Q2M48l14K8
2210d66R9N85N01k71n07K42O26k18m5J70j50K4n93L49J86m58n57J41l15J36p6
$$ plain form
2066 238 -317 -961 -657 -762 -1562 -1148 -110 -287 -1052 -548 -362 332 617 386 97 631 1182 221 406 1198
2086 1198 577 214 670 712 -94 -13 -76 -224 30 -334 -988 -781 -271 -507 -857 51 -11 -607 -389 87 453
2107 453 552 406 113 408 957 509 -10 489 701 156 -117 200 -104 -541 -240 169 -394 -115 -688 -858
2127 -858 109 582 -468 -663 -112 305 -10 302 1035 312 156 366 -31 699 648 -438 -280 267 -95 -806
2147 -806 -297 118 -562 -257 -428 -576 -512 -279 -75 32 459 -254 -457 413 736 529 259 372 453 150 350
2168 350 292 -4 83 -153 -584 -66 29 -641 -1174 -269 71 -613 -749 -448 -197 288 355 -40 323 464 301
2189 301 265 1211 828 -179 302 649 273 333 36 -227 -147 27 -920 -508 -281 -465 -710 -628 -180 -494 -466
2210 -466 -367 218 719 448 -59 183 809 591 546 716 566 590 -3 346 532 74 -483 -342 -657 -521 -597
2231e97j13J48K03l96k74P07K18q0J70K54L42j46o0K48J63K01m77l85Q99k87o41
2252I7PK58n95k16j62j08M79l51l82L08L72l36Q4M12K51j57j51J64N22j25J92
2273E63k76M83J53l65l95J89L78o20k97j13J97k22j90J48kj57j69j28M79K08j14
2294b50J99K17r1j31L27L77k2k00l12K76lK07m35j0L24l49m93k60O60P5n98k62
2316g54L57j42K42l56K70M67J25k78N0M20k0k62K11J96k09m80K65K57q2l05p2
2337a00k3q5q1k50J35L67j41m75N14L89l33L24q4K59k11j99K9M14J14j57j81j6
2359B09L12n13j30K48O2m15k66r1M31k61k8J22K42n9P8j52N33L70l33m2R6K85
2381F98n43J83k2K26l16l51J21q5K47l87m71J44J66j21j52N87r4q7j12L98K50
$$ plain form
2231 -597 -710 -562 -359 -755 -1029 -322 -104 -184 -14 240 582 436 376 624 787 988 511 126 1025 738 97
2252 97 104 362 -233 -449 -611 -719 -240 -591 -973 -665 -293 -629 -545 -133 118 -39 -190 -26 496 371 563
2273 563 287 770 923 558 163 352 730 110 -187 -300 -103 -325 -515 -367 -369 -526 -695 -823 -344 -136 -250
2294 -250 -51 166 75 -56 271 648 626 426 114 390 387 594 159 149 473 124 -369 -629 31 106 -492 -754
2316 -754 -397 -539 -297 -653 -383 84 209 -69 -19 401 381 119 330 526 317 -163 102 359 277 -28 -100
2337 -100 -123 -208 -289 -539 -404 -37 -178 -653 -139 250 -83 241 157 416 205 6 35 449 563 406 225 209
2359 209 521 8 -122 126 188 -227 -493 -584 -153 -414 -442 -320 -78 -137 -59 -211 322 692 359 317 413 698
2381 698 155 338 316 542 226 -125 -4 -89 158 -229 -700 -556 -390 -511 -663 -76 -170 -257 -369 29 279
2402B79l67J81j01O92j99p2r9J22J21k63j13J41j72j54k84J53K27n59j60J03R2
2423d32j57J78j49O12n00J11P8N32j08J72P9OL27l01j3K66O8m38j92o2J2j39l40
2446c90k28N77o27k79M77j58K65m00J7M17L46j31J78L73r9j50J20j05O24l79k72
2467A76K93k35J3k88k22K01K1n60Q5K01k12l69M64j25J46K4Q5O2O16J9l05O6L74
2490E30N3m20L65K57l50j92j63J36j56l5o4k25L36l73m08K89K50p3l27K53K38
2511g9j01J24L48m7J43k01p0K48R1L7p24L17M93n63mj24n6J72R0n38O5L01k34
2534c12j33O00j27k65j13L48P4N2P9n0p4J79K00l80K29q1j15k67L83ol83k74K80
2557a56k69J31NL5j54L36l43L7N51lk60N20K34o45Q9l38M61J46k41L7l32J98R0
$$ plain form
2402 279 -88 93 -8 684 485 413 314 436 557 294 181 322 150 -4 -288 -135 92 -467 -627 -524 -432
2423 -432 -589 -411 -560 52 -448 -337 -259 273 165 337 416 422 749 448 435 701 769 331 139 77 89 -50 -390
2446 -390 -618 -41 -668 -947 -470 -628 -363 -763 -746 -329 17 -114 64 437 338 188 308 203 827 448 176
2467 176 469 234 247 -41 -263 -62 -41 -601 -516 -315 -527 -896 -432 -557 -411 -387 -302 -240 376 395 90 156 530
2490 530 583 163 528 785 435 243 80 216 60 25 -39 -264 72 -301 -709 -420 -170 -243 -570 -317 -79
2511 -79 -180 -56 292 245 388 187 117 365 456 493 -231 86 579 16 12 -112 -168 4 94 -444 -379 -78 -312
2534 -312 -445 155 28 -237 -350 -2 72 124 203 153 79 258 458 78 307 226 111 -156 227 221 -162 -436 -156
2557 -156 -425 -294 -289 -254 -408 -72 -415 -378 173 170 -90 430 664 19 108 -230 231 377 136 173 -159 39 129
2580A29o52M26J54n43M35k62M2k24m0M13j79M93k09k52L93N56m90M21P3k01l28
2601A55J52K15o8k37k98k20K06Pn84J68J24J5k75K88Q2o6j52M59m8O5P2J21j9
2624A62M88J25o45M89r9r3l21L31m71k54K79j9m8l12j5j87J49M32m63M4R3K23
2646a12p8J61N8P6L56m56K96N20p1l58r6L75P7m59l28K86P9o69L34l28k97L22
2668c12m20J79J43J09j96K2P10k91P9l1J66q0L97k41L00k90j18k40N20K18m25
2689A99m56J09L46m69J04j05m04J85J59l1j38L82j18m8N42L0l21J56L86k3%j97
2711B88J4o8K35l17k1j60M3l73q9K26k0j97K4j23K71J99J1l55K40K36k4j57M82
2734C65k8j17j06J24l10J15j95Q1L59k16k71j03L05j21l26P2K91j46m19O10j26
$$ plain form
2580 129 -523 -97 57 -486 -51 -313 -271 -495 -535 -122 -301 192 -17 -269 124 680 190 611 684 483 155
2601 155 307 522 454 217 -81 -301 -95 -88 -672 -504 -380 -365 -640 -352 -270 -336 -488 -29 -77 -12 60 181 162
2624 162 650 775 130 619 520 427 106 437 -34 -288 -9 -28 -76 -388 -403 -590 -441 -9 -472 -428 -335 -112
2646 -112 -190 -29 29 105 461 5 301 821 750 392 296 671 748 289 -39 247 326 -343 -9 -337 -634 -312
2668 -312 -732 -553 -410 -301 -497 -475 235 -56 23 -8 158 78 475 234 534 244 126 -114 406 624 199
2689 199 -257 -148 198 -271 -167 -272 -676 -491 -332 -363 -501 -119 -237 -285 257 287 -34 122 508 485 485 288
2711 288 302 234 469 152 131 -29 14 -359 -448 -222 -242 -439 -415 -538 -267 -68 -57 -412 -172 64 40 -117 365
2734 365 337 220 114 238 -72 43 -152 -71 288 72 -199 -302 3 -118 -444 -372 -81 -227 -646 -36 -162
2755a62K48J03k46K49J37J37n26L31L21l12j69J18J41o08k9J36m8J05l32k12M88
2776a30L2l80p4L52K26j66P4K74J25k96K33j72M33k3l06k14N10k33m19M66j52
2797A60j50J08j92R8l83l2j10K8K14j38K88j51N89Pl01L77n9M2K71l47J27K34
2819F80k82j88j59K14j52o24L41J41k49k63N0J71k61K25p9J07Q6j44M48n3L24
2840C33l29L53r3K18l4r7M9k1j94k02q9L31k99j10k14J83r9j46k14J46O0J01k13
2863e80K18L78q4m4L12Q1ll05L62Q9q5j06O7o4l0j18N5j32oj28l1l17P0r5K39
2888b57j51J55J96J27jNR0l09Q4L17j21J49k63K74R6j98k39Q5L93n16k94o2N30
2911I0l42o0J15q3k82K51K23l8J67J20k25J92K29O4m56L99j12n0j04j83K50k02
$$ plain form
2755 -162 86 189 -57 192 329 466 -60 271 592 280 111 229 370 -238 -267 -131 -179 -74 -406 -618 -130
2776 -130 -98 -478 -552 -200 26 -140 -66 208 333 37 270 98 531 508 202 -12 498 265 -154 312 160
2797 160 10 118 -74 24 -359 -391 -501 -473 -259 -397 -109 -260 329 336 35 412 353 395 666 319 446 680
2819 680 398 210 51 265 113 -511 -170 -29 -278 -541 -491 -320 -581 -356 -435 -328 -242 -386 62 9 333
2840 333 4 357 264 482 448 351 400 379 185 -17 -106 225 -74 -184 -398 -215 -314 -460 -674 -528 -468 -367 -580
2863 -580 -362 16 -68 -112 200 281 278 -27 335 424 339 233 300 236 206 88 143 11 5 -123 -154 -471 -401 -496 -257
2888 -257 -408 -253 -57 70 69 74 164 -145 -61 256 135 284 21 295 391 193 -46 39 432 -84 -378 -440 90
2911 90 -252 -312 -197 -280 -562 -311 -88 -126 41 161 -64 128 357 421 -35 364 252 202 98 -85 165 -37
2933c7oj07J47J63l00p6K2k3n5k17K06M97k00K7K08k71K78j82O9J10j10k23L42
2956B62r2r4k65j30L36k28l5l19K82J22o0j50K10J11J3j89nJ62L65l3k3j34K49
2979C55k82N0J32r5m7j61j56M72m36l05J7M03j55j49l30N64o2k63L30j94N29j51
3001F6k56L85K00p1R4l9k0j53O2J10K1m98k13M01j88J30q71K15K89J3j33P8l8
3024d16J77K27m42M71L1J95j27P7J00J83k3j30K85j80J8l04k81J89l0q0j65L6
3046a89j38l78J96N55l93j72J51L8M2O2R9J32L83j7l12P5J96j55J70J5k47m5p8
3069a0P4K1m5j00n52J32K78j84p2K52rj39J45L50j05J19K5m4J48K8l33J64L57
3092E00j86j7j02J82m93k43P5K92l62J69k31M6K89j89O6j44L84j14N6j29L02k40
$$ plain form
2933 -37 -43 -150 -3 160 -140 -216 -194 -217 -272 -489 -283 214 14 41 249 -22 256 74 143 253 143 -80 262
2956 262 170 76 -189 -319 17 -211 -246 -565 -283 -161 -221 -371 -161 -50 -37 -226 -231 -69 296 263 240 106 355
2979 355 73 123 255 160 113 -48 -204 268 -168 -473 -456 -53 -208 -357 -687 -123 -185 -448 -118 -312 217 66
3001 66 -190 195 395 324 418 379 359 206 268 378 399 -99 -312 89 -99 31 -840 -625 -336 -323 -456 -378 -416
3024 -416 -239 -12 -454 17 48 243 116 193 293 476 453 323 608 428 446 142 -139 50 20 -60 -225 -189
3046 -189 -327 -705 -509 46 -347 -519 -368 -330 -288 -226 -127 5 388 371 59 134 330 175 345 360 113 68 -10
3069 -10 64 85 40 -60 -612 -480 -202 -386 -458 -206 -215 -354 -209 141 36 155 180 136 284 312 -21 143 500
3092 500 314 297 195 377 -116 -359 -284 8 -354 -185 -416 -370 -81 -270 -204 -348 36 -78 -22 -151 151 -89
3114h9l3L19K7P7k10L2J0K58k95n73M82j60k5K3L08l25J8j5R8J96Q8j09r3L54
3138C63J05n69K12J49j18K23j17j56k26K84n0j76Q3Q7m76K12K06j07j52O2J49
3159a2l68J33K74j29j27K53Rj0M35J0j60k05M12n97L93l13j3K3J74l06j77N17
3181B16n91q2Q3J43k27K83M42p7M0j73M4o2K38K5l62N56K9m49mJ79k60P8O9k20
3205h2l9J65l44k43J29L01l65j08M58j16o3L09j2N6K2l6J29M33k97N7j3K86k02
3228D25l98J23q3j83Q6m2P8n06L91j52k55L01J15l05L06L20k37m1j10L33m0J59
3250B85J73n9J1j87q0L49k05l91J19J64j74j45n1K18J46l52j72J57j87L27j77
3271b31J96J55J29j15j30K75k51K44N6Q4j21p7m0l6O1r9k66K11m0j99j93K96p4
$$ plain form
3114 -89 -122 197 224 301 91 123 133 391 96 -477 5 -155 -180 -157 151 -174 -156 -171 -73 123 211 102 9 363
3138 363 468 -101 111 260 142 365 248 92 -134 150 100 -76 7 94 -382 -170 36 -71 -223 -161 -12
3159 -12 -380 -247 27 -102 -229 24 33 23 458 468 308 103 515 -82 311 -2 -15 8 182 -124 -301 216
3181 216 -375 -457 -374 -231 -458 -175 267 190 230 57 101 39 277 302 -60 496 525 76 72 251 -9 69 138 -82
3205 -82 -121 44 -300 -543 -414 -113 -478 -586 -128 -244 -307 2 -10 46 68 32 161 594 297 354 341 627 425
3228 425 27 150 67 -116 -30 -72 6 -500 -109 -261 -516 -215 -100 -405 -99 221 -16 -57 -167 166 126 285
3250 285 458 399 410 223 143 492 287 -104 15 179 5 -140 -191 27 173 -179 -351 -194 -381 -54 -231
3271 -231 -35 120 249 134 4 279 28 272 328 412 291 214 174 138 199 100 -166 45 5 -194 -387 -91 -165
3294a65k46K30k20L03Q9J0j01Q2J37j02P4M2kK20k80j41j57L42Q4j50o8J88j74
3317eP9j64kj20J46j89Q6k53P9K73j02O0J73j24K62k56L15k02J90k52p4Q2K33
3340B35M1r4j9m36K74r7Pj46J30j11j14J35K61k60K58J38k11L39j49k5J04J0o8
3363B02K7r5J83n04K28j65l3o0o8J35N6l0J9K33j50j74M61J05j50J36k34J76j12
3386A86M8l3j7pL31l39j71K14j92J41m29L1J53k69L33k06m0K51j17o9K38J30m4
3409A23m2J93j57K42L1N0k25J10j35j04K06m1l17j73L1oM5J7j76k7K75m09K12
3432b77l7J35L0J94j46J68K23p0J2L7K23j64J6j08j09J12j34r9J39m4k49k10j11
3455d69L42m3k13K95j53k82M11L74l36K15k25M11P5r3j48L9K3q3K26p1J79n74
$$ plain form
3294 -165 -411 -181 -401 -98 -9 1 -100 -18 119 17 91 133 131 351 71 -70 -227 115 199 49 -19 169 -5
3317 -5 74 -90 -92 -212 -66 -255 -169 -422 -343 -70 -172 -112 61 -63 199 -57 258 56 246 -6 -80 2 235
3340 235 276 182 163 -273 1 -96 -89 -235 -105 -216 -330 -195 66 -194 64 202 -9 330 181 156 260 270 202
3363 202 229 134 317 -187 41 -124 -157 -217 -285 -150 -94 -124 -105 128 -22 -196 265 370 220 356 122 298 186
3386 186 234 201 184 177 508 169 -2 212 20 161 -268 -237 -84 -353 -20 -226 -266 -15 -132 -201 37 167 123
3409 123 81 274 117 359 390 440 215 325 190 86 292 251 -66 -239 -208 -214 -169 -152 -328 -355 -80 -489 -277
3432 -277 -314 -179 -149 45 -101 67 290 220 232 269 492 328 344 236 127 239 105 6 145 101 -148 -358 -469
3455 -469 -127 -170 -383 -88 -241 -523 -112 262 -74 141 -84 327 402 309 161 200 223 140 366 295 474 -100
3477a00r8L13o3k77J2Q9P1k45K63j34l56M72j66O9K24l4N4L7J91j81j18K93O0
3500C76r8j51n1l4PM7j70Pj19J4L6j42K80k51K03j15K6L49r0n4J69j76L7K42j93
3525A49K63k08j17j93R9k0q2P6P2J6m03K33j74K14J03j36k52L97j38J85J1K47
3547C42l84N6Q8K33p1j33j77J82J24l50j23L07p5j84l32N27j09l02J67R1K7K71
3569A75p5k92K27l5K5j42J84K34m2o7J95k25o9N5j0j04j34j55l62O30j42k26L28
3592b7k56n8j94L68J08P7j86K14Q2L15j35k28L11l3k92L1NJ31j99j25J8k65J45
3615a93j42J40r8J25k05J92j83Q7L2L17J81k78L05j05m0J19J2j3J9K4P2l34K16
3638B50l25nJ67k47K32k52Kl70J51M88l32r4Q8M56q6m49N34l06M51%r7J54j86
$$ plain form
3477 -100 -198 115 52 -225 -213 -124 -53 -298 -35 -169 -525 -53 -219 -150 74 40 94 131 322 141 23 316 376
3500 376 278 127 76 42 49 96 -74 -67 -186 -172 -136 -278 2 -249 -46 -161 -135 214 124 70 239 63 100 342 149
3525 149 412 204 87 -106 -7 -27 -109 -33 39 55 -348 -115 -289 -75 28 -108 -360 37 -101 84 95 342
3547 342 -42 14 102 335 264 131 -46 136 260 -90 -213 94 19 -165 -497 30 -79 -381 -214 -123 -96 175
3569 175 100 -192 35 0 25 -117 67 301 259 192 387 162 93 148 138 34 -100 -255 -617 13 -129 -355 -27
3592 -27 -283 -341 -535 -167 -59 18 -168 46 128 443 308 80 391 358 66 97 102 233 34 -91 -73 -338 -193
3615 -193 -335 -195 -293 -168 -373 -181 -364 -277 -245 72 253 -25 280 175 135 254 266 253 272 296 368 34 250
3638 250 -75 -80 87 -160 72 -180 -178 -548 -397 91 -241 -335 -247 209 123 -326 208 -98 353 353 256 410 224
3661B24k5r4J34K19l28j90O8J74k21k60q9MJ54L6m5j11K04j00K04J76k39M3J11
3684D9K71n4J35j18j78l9L69j00k51J16k48n5l5J74q6O2j89K68l03O9J61l9j14
3707a35K14k51K24R3k27K21R9j36N6O0K5k11J46K6m5k31K16J59m33j37nJ52m6
3730a66J94J3J74j22j01J23P6m05O2K22L3P8J02p9j76j85K03jL4l01O2N2J09q8
3754h7k01L9n7J97j67L22j78K85k19K21P6n2J21k37J68J64l25j8j20J00n7j85
3776b10j26N4J08J12j46K86k57j09M8K24R7n7r4J17J36o3j20J46J89j08K22m44
3798EL74k70k20R1j9m4j17r0R6pN4j9j34J62N8n1k16K98J61k45K73j0J09j45K4
3823A18J65k10J23j63R4k56J40J54r2k70K55k86N4J17J29j99k45M61k07J91j8
$$ plain form
3661 224 199 105 239 458 130 -60 8 182 -39 -299 -388 -384 -230 -194 -239 -350 -146 -246 -42 134 -105 -62 49
3684 49 320 266 401 283 105 66 435 335 84 200 -48 -103 -138 36 -50 12 -177 91 -212 -143 18 -21 -135
3707 -135 79 -172 52 145 -82 139 238 102 158 218 243 32 178 204 159 -72 144 303 -130 -267 -272 -120 -166
3730 -166 28 41 215 93 -8 115 191 -214 -152 70 103 181 283 204 28 -157 46 45 79 -222 -160 -108 1 -87
3754 -87 -288 -249 -306 -109 -276 46 -132 153 -66 155 231 179 300 63 231 395 70 52 -68 32 -25 -210
3776 -210 -336 -282 -174 -62 -208 78 -179 -288 -240 -16 81 24 -70 47 183 120 0 146 335 227 449 5
3798 5 379 109 -111 -20 -39 -83 -200 -290 -194 -201 -147 -166 -300 -138 -80 -131 -347 -49 112 -133 140 130 239 94 118
3823 118 283 73 196 33 127 -129 11 165 73 -197 58 -228 -174 -57 72 -127 -372 89 -118 73 55
3844E5k7J80j8p0O8R3k06n1J13qR0l2j11K47k57m09L02r1J9N1q8KP1k27l0K54
3870h0O2J29m77L60L38j61k76K20R8l0q3r5L32j00l2r5k32n8j38L3L0p8K29o3
3894a67R6m7R2q0n7L09r2J06j99M4L18N5l85J0J56j01nJ5l5l2k09J22N1J8J19
3919A02j76j17p2K5R1L35k83j7jJ42pM9l0j7P8J56j79j03K23k61J98k09r2K07
3943D2nk54P6j00L1K42l8J14l07J32O8K86k55J32n2q2K40l2j72m1j18J71p2j55
3967a49Q7j37j6kQ2J27k54L6L02J1l83L27J86j12j58J03k5J04L8J80m9j1k7l01
3991d1o2o7J83k64J12K02k20k69J84j05K06n1Q0J2K77k11O2J60n3n4J31Q0O6j81
4015A77j11Q5j48P8j71P9k40JJ22j7pJ14k17O6K11m10L12l0K96j13m3j73M19L3
$$ plain form
3844 55 28 208 190 120 188 281 75 24 137 129 219 187 76 323 66 -343 -41 -132 -113 -62 -150 -148 -77 -304 -334 -80
3870 -80 -18 111 -366 -6 332 171 -105 115 213 183 100 5 337 237 205 110 -122 -180 -318 -285 -255 -333 -104 -167
3894 -167 -71 -118 -26 -106 -163 146 54 160 -39 5 323 378 -7 3 159 58 53 68 33 1 -208 -86 -35 -17 102
3919 102 -74 -191 -263 -238 -147 188 -95 -112 -113 29 22 71 41 24 102 258 79 -24 199 -62 136 -73 -165 42
3943 42 37 -217 -141 -241 -210 32 -6 108 -199 -67 1 287 32 164 112 30 270 238 66 25 -93 78 6 -149
3967 -149 -62 -199 -215 -217 -135 -8 -262 -226 76 87 -296 31 217 105 -53 50 25 129 167 347 298 287 260 -41
3991 -41 -103 -170 13 -251 -139 63 -157 -426 -242 -347 -141 -192 -112 -100 177 -34 28 188 135 81 212 292 358 177
4015 177 66 151 3 81 -90 -11 -251 -250 -128 -145 -152 -38 -255 -189 22 -388 -76 -106 190 77 34 -139 280 313
4039C13k09J54k53M16j76j67Q6J37l90K76n74K67M4J2J44l86J61m0r3R6L56m91
4061c17M18k68J68J03q1L85l74L54k36j57J99j39jl6p0Q2p8o3j73l1J35L17n98
4084d61L20J62l21P4M68r9j93J39P4j1m2K13l51O7K84k92J04K3j39j48k74M11
4106Hk10K50M0l47O6K67M3l64j4M58k89r4K68P2j31J26k6j49k6J1J18j19M0OJ7
4131B1K2p5j76J72k15J06R2l3P0L2j2j65J93J88j18q1q8k6K31k6J41j48J94n80
4155b81J24J69k56J76OR8M3k66R2J45k13O1j74J94J16Q4J03J58k20j76L27oPj9
4179B92j02j22M5k03j80J39j54K24o8m2L19k61P1l23M32j22RJ32j0J93J57l04
4201A22n9L51k46Q7L8j02K66m73J10j56K1m1j94J51j77Q1K67n40K59L36n32N32
$$ plain form
4039 313 104 258 5 421 245 78 164 301 -89 187 -387 -120 -76 -64 80 -306 -145 -185 -278 -182 174 -317
4061 -317 101 -167 1 104 23 408 34 388 152 -5 194 55 54 18 -52 30 -48 -111 -284 -315 -180 137 -461
4084 -461 -141 21 -300 -226 242 143 -50 89 163 152 110 323 -28 39 323 31 135 158 19 -129 -403 8
4106 8 -202 48 88 -259 -193 74 117 -247 -261 197 -92 -186 82 154 23 149 123 -26 -52 -41 77 -42 -2 4 21
4131 21 43 -32 -208 -36 -251 -145 -53 -86 -16 16 4 -161 32 220 102 21 -67 -93 138 112 253 105 299 -281
4155 -281 -157 12 -244 -68 -62 36 79 -187 -95 50 -163 -102 -276 -82 34 118 221 379 159 -17 310 304 311 292
4179 292 190 68 113 -90 -270 -131 -285 -61 -129 -171 148 -113 -42 -365 67 -55 -46 86 76 269 426 122
4201 122 63 414 168 255 293 191 457 -16 94 -62 -41 -82 -276 -125 -302 -221 46 -494 -235 101 -431 101
4223A01R6l34J31K18J00j45n4r2Q4L42m56L34k47j44K90l83R5j42o5R3r1J21n8
4246b06J52l88K33O5J41l54L54J60kp7Q2J27p3o7J48j31J61m61J79N7o2N6m28
4269c34J54K7J7J37Rk4N7m03L10l4J27j36J09J38J95j18J87m61J22l02K37n5j37
4292a78K60k09k19L49k5j09m5P7J34l00k8J44L00j8j98J52L8k16p5K65J62k26
4314C5Rm2J33l21K20J42L3m35M00k01NP4m23K28J04R2J04j69mJ08J1n4J37j36
4338E0J06o3l19L30Mj90J19Q7r4k45j1L00m54M31l16L16k10r6j6K48j80M8J78
4361B3K3J2L2p6K78K4k6O9l53K66k34j71O3J50j46K13k78J07j97K48k9j55J67
4384A0k20L23k7J6K55l72m5R8j97M41k63J3R3%J04l01L40k15k27l5J78k74L52
$$ plain form
4223 101 197 -137 -6 212 312 167 113 21 105 447 -9 325 78 -66 224 -159 -64 -206 -271 -178 -269 -148 -206
4246 -206 -54 -442 -209 -144 -3 -357 -3 157 155 78 160 287 214 147 295 164 325 -136 43 100 38 94 -334
4269 -334 -180 -153 -136 1 10 -14 43 -360 -50 -84 43 -93 16 154 349 231 418 -43 79 -223 14 -41 -178
4292 -178 82 -127 -346 3 -22 -131 -176 -99 35 -265 -293 -149 151 133 -65 87 125 -91 -166 99 261 35
4314 35 44 2 135 -186 34 176 209 -226 174 -27 -22 52 -371 -143 -39 53 157 -12 -16 92 103 49 186 50
4338 50 156 93 -226 104 108 -82 37 124 30 -215 -226 74 -380 51 -265 51 -159 -255 -271 -23 -203 -155 23
4361 23 46 58 90 14 292 316 290 359 6 272 38 -133 -70 80 -66 147 -131 -24 -221 27 -2 -157 10
4384 10 -210 113 86 102 357 -15 -60 38 -159 282 19 32 125 125 229 -72 268 53 -174 -209 -31 -305 47
4407D7k16L5q1L3J80N4J18j30L3R7j66K09j59J11l3j01m0J11Q8j43K2k90J99n6
4431g8k4j32n4L00k45o9j58K69J29j6J15j51K22J09j28J7j4j72L96j52j6r1J29
4454A86n6j41j12j60L14j43kk0O9j41J68r5J06k3J41J37l82J67k2J07j27M8M46
4477D65j99m49M50J06k58o7j24J14j10j64P9Q9M8M3l3q2j62K42k4p7Q6L97m23
4500e3L85r0m9j11k07K64j45%M4P3R5k86n2j12L56l00J88M5j19N6k43M20k60K80
4524A79r8R3j35R5q1J43o4n0M4k8o2j85J41k17L6N2k75K79J30M2j2j05K32k37
4548h3K9Q3j93K69P9j23J07m5K89n66J71J18K0N8J08k22l43K31k12J3J29K75m1
4571A51j42k21Q9J11K9L42k82j55J64k08M58j54P8r7o2J03k74M0K46k19k27J64
$$ plain form
4407 47 -169 -134 -215 -182 -2 52 170 40 73 170 4 213 54 165 132 31 -9 102 190 47 69 -221 -22 -78
4431 -78 -102 -234 -288 12 -233 -302 -460 -191 -62 -78 37 -114 108 217 89 106 92 -80 316 164 148 57 186
4454 186 130 -11 -123 -283 31 -112 -114 -134 -65 -206 -38 -133 -27 -50 91 228 -154 13 -9 98 -29 19 465
4477 465 266 -183 267 373 115 48 -76 38 -72 -236 -157 -68 -20 23 -10 -92 -254 -12 -36 -113 -27 370 -53
4500 -53 332 242 193 82 -125 139 -6 -6 38 111 206 -80 -132 -244 112 -188 0 45 -74 -18 -261 159 -101 179
4524 179 81 174 39 134 53 196 132 82 126 98 36 -149 -8 -225 -189 -137 -412 -133 -3 39 27 -78 154 -83
4548 -83 -54 29 -164 105 184 61 168 123 412 -154 17 135 155 213 321 99 -244 -13 -225 -212 -83 192 151
4571 151 9 -212 -123 -12 17 359 77 -78 86 -122 336 182 260 163 101 204 -70 -30 216 -3 -230 -66
4593f6j69J62j85j17J10J93J03q2k0M1K6j06P4J60k48J27K8J18J15l03j09J73
4615B5J42j39m8j27l0l4lQ2j72M59l85n4R9K65k85J53n4j11J80K29R3k62p8P6
4639B1j23R9K27j40j11K79l05k50L33k21J51M9k11J94k70M58l32k1R6j74K96j65
4661a20J81k27M00j13r9j38K95k64j10N69n12J02J9J12r9k75L01LO3k07J7j48
4683b50J58j37j8R3L17k87K51j38j3J18J30o7Q0q0J45m05n1J31n6R3r8P4JM4k55
4708b20J36K04k04K08j13K17j46o7J11j04R8j45J98l4R5j47m0l91M01O6M3k18
4730e2j65j54O15l64L01l49J75j41P6K6o9M8l7m7J00L35j05n8J77j23j97J10o5
4753C7O0j18J0k54p1L41J87l04L4R1K0l08K55j40L44j08R7k43K69j51p8k15N63
$$ plain form
4593 -66 -235 -73 -258 -375 -265 -72 31 -51 -71 -30 -4 -110 -36 124 -124 3 31 149 264 -39 -148 25
4615 25 167 28 -20 -147 -177 -211 -214 -132 -304 155 -230 -284 -185 80 -205 -52 -106 -217 -37 192 285 23 -55 21
4639 21 -102 -3 224 84 -27 252 -53 -303 30 -191 -40 9 -202 -8 -278 180 -152 -173 -77 -251 45 -120
4661 -120 61 -166 234 121 22 -116 179 -85 -195 374 -138 -36 -17 95 -4 -279 22 25 88 -119 -102 -250
4683 -250 -92 -229 -247 -154 163 -124 127 -11 -24 94 224 157 237 157 302 -103 -154 -23 -79 14 -84 -10 -9 35 -220
4708 -220 -84 120 -84 124 11 228 82 15 126 22 120 -25 173 139 234 87 47 -344 57 123 166 -52
4730 -52 -217 -371 244 -120 181 -168 7 -134 -58 -32 -101 -53 -90 -137 -37 298 193 135 312 189 -8 102 37
4753 37 97 -21 -11 -265 -336 5 192 -112 -78 13 33 -275 -20 -160 184 76 173 -70 199 48 -30 -245 318
4776C18o9k78q0K6J04k6J7O5k08L0J54j10j16k23J76K80l1r2m8J84Q4j25k07J54
4800b1J57L2l4J88j64n0J16j44o8j23K5j33J96j20j33K08j04j5R9M0J41r3j6j45
4824a61L07j56K9J10%P2M5j13n9J3N6j1l17J78j32N0p8l1K9O1J32j45l9K24j23
4849e9M2L1J82M9l64K71J32j72l2J29j33KJ64k96M0j01K07P9m44L16j03q4K4q5
4873b05kJ09lL21n4K5k90J63J1j83J88m0Or0N0K5j04j86L93mj94j6j93P5L44L0
4899A76k35j55RJ63J52j10ml9J50k27L82m1j62L2j42JK27l33L3J72k42J98j04
4922i9L13l45M1l8o1J66j05j01M08j09L2j47p3J35L3K2l11N55k33j69J22K07j63
4945H0J2j19M0K8O8j4l19J37l4r5K81j29j18L87j73L01l23O6k3K94n49L10O3j90
$$ plain form
4776 318 249 -29 -109 -83 21 -5 12 77 -131 -101 53 -57 -173 -396 -220 60 29 -63 -111 73 157 32 -175 -21
4800 -21 136 168 134 322 158 108 224 80 12 -111 -86 -219 -23 -143 -276 -68 -172 -187 -88 -48 93 0 -16 -161
4824 -161 146 -10 19 129 129 201 246 133 74 87 143 132 -185 -7 -139 -89 -167 -198 -169 -108 24 -121 -160 64 -59
4849 -59 -17 14 196 245 -119 152 284 112 80 209 76 78 242 -54 -14 -115 92 171 -273 43 -60 -144 -120 -205
4873 -205 -207 -98 -101 220 166 191 -99 64 75 -108 80 40 46 -44 6 31 -73 -259 134 130 -64 -80 -273 -198 146 176
4899 176 -59 -214 -205 -42 110 0 -4 -43 107 -120 262 221 59 91 -51 -50 177 -156 -123 49 -193 5 -99
4922 -99 214 -131 -90 -128 -189 -23 -128 -229 179 70 102 -45 -118 17 50 72 -239 316 83 -86 36 243 80
4945 80 92 -27 13 41 109 95 -224 -87 -121 -216 65 -64 -182 205 32 333 10 76 53 347 -202 108 171 -19
4969a9K84l28P3J05j38l14L53m4k95L02J38j74o5J03J38k74L59j39q5L91k21k54
4991a04M2m1K8K46P3k64J11k70J50l64L04J49j70k35J64r3J15J66j22K14j39K84
5013B44j82J2K08l41K86l72M23K8j1p5k68L05l00J7j28J80j62j16K85K0j98K57
5035A12l2k06j92J86R9J90k54p1K80JJ36j39J4K12j48q6l13L83m7j70J52j17j88
5058a98K57l49J17L7K19j76j05L5K23j48K00nN4j26R2o4J03k93K41j78o6J78M8
5081I6j10P4j88O1Q8mj72O8k1Q2J01J29k49o6q9K22M7K27l70J52J23k82J31o4
5105a4j16J31N4m9N7k18J71r8m7n0L34j70k04K08K01l65K89j30o7J74J96k08K70
5128C49k36K4M8q0J16j77k81J90j24K60k31j02J26J11m5j4K98m69J81J54n0j33
$$ plain form
4969 -19 265 -63 10 115 -23 -337 16 -28 -323 -21 117 -57 -122 -19 119 -155 204 65 -20 371 150 -104
4991 -104 -62 -103 -75 171 244 -20 91 -179 -29 -393 -89 60 -110 -345 -181 -274 -159 7 -115 99 -40 244
5013 244 62 74 282 -59 227 -145 278 306 295 220 -48 257 -43 -26 -154 26 -136 -252 33 53 -145 112
5035 112 80 -126 -318 -132 -33 157 -97 -168 112 113 249 110 124 336 188 102 -211 172 125 -45 107 -10 -198
5058 -198 59 -290 -173 -136 83 -93 -198 -163 60 -88 112 107 161 35 127 63 166 -127 114 -64 -130 48 96
5081 96 -14 60 -128 -67 21 17 -155 -87 -108 -26 75 204 -45 -111 -200 22 69 296 -74 78 201 -81 50 -14
5105 -14 -130 1 55 6 63 -155 16 -82 -129 -179 155 -15 -219 -11 190 -175 114 -16 -83 91 287 79 349
5128 349 113 137 185 105 221 44 -237 -47 -171 89 -142 -244 -118 -7 -52 -66 232 -237 -56 98 48 -85
5150h5j31L08p9L66j56k67N3K79l67O1M08l37q5p3n0L1J76K5n3k86J6K94J13l77
5174b16J44L04l66J14J79q5M0k3K05l95K04np4m8J62k15K39j93R3j16L5J81k08
5197d4q3j20J04j9j36N08o6k39M01l86K9J67j85K20J69l3j72k4J02p8j51J36l74
5220b74P1J97l85J6M61j73O3J52k04M9m4K11j38j7K31p9Q9j82L76l18J99l06K87
5243B82l42K6j33k0K38j4k78O6j8P0o5N0j36J10M6K05M2q9o4Q2j35J25J94l73
5267a31J94J41r2j93O5j31K56l10O3K08r2p3j44L41j26J4j77NL30o6j47J14q5
5290c6J52P8l7k38K87pj34K1o4qn9j1j77q5K90m2LK24k61K49k90K22j31K9K4J27
5316A26m31M46K2k06P6J58k67L8J23j34r9J77r8P9P0j88P9j42K03j34k30J47L97
$$ plain form
5150 -85 -216 92 13 379 223 -44 9 288 -79 -18 390 53 -32 -105 -155 -124 52 77 24 -262 -246 48 161 -216
5174 -216 -72 232 -134 -20 159 74 114 91 296 -99 105 100 26 -22 140 -75 164 -29 64 -52 -17 164 -44
5197 -44 -127 -247 -143 -162 -298 210 144 -95 306 -80 -51 116 -69 151 320 287 115 91 193 115 -36 100 -274
5220 -274 -203 -6 -391 -375 86 -87 -24 128 -76 -27 -71 140 2 -15 216 137 226 44 420 102 301 -5 282
5243 282 -60 -34 -167 -187 51 37 -241 -175 -193 -123 -188 -138 -274 -164 -118 87 129 40 -24 58 -77 48 242 -131
5267 -131 63 204 112 -81 -16 -147 109 -201 -138 70 -22 -95 -239 102 -24 -10 -187 -182 148 82 -65 49 -36
5290 -36 116 194 157 -81 206 199 65 86 22 14 -45 -56 -233 -318 -28 -70 -67 157 -104 145 -145 77 -54 -25 -1 126
5316 126 -305 141 163 -43 33 191 -76 -38 85 -49 -148 29 -69 10 80 -108 -29 -171 32 -102 -332 -185 212
5339B12j62j57J30l9K38j90k30MJ33J50o4j56j7J11k7L12l46R9k35R8q4M8M6O3
5363f3o2k02K74j59J78K10oP9P9k19k2k05L40J35l32k9j33J10K7j34J53k44J95
5386c0L1p5m6J23j03q7K05QL19j55Km46M54J82k29J0J78j45l00l1L45k46q7j23
5410b46M16o0l35P5L30k35K28Qk40J15k1Q3j60j5M18j30j96j6j38M53j96j68J31
5433A01j67N4K7K20m79K02j91L64l45l1Q9RL0QN3R4j05J6J00K0j85M52o5m1p0
5458A60j93J11k31P6K44m23j29L47p0J22j79M7j56K70j72P5r3M37j32J87m03N0
5480e5O4O2P7p9J62l15R9J24k28p8L65n9k75K6N7L9k58N2l8L81j39k0M6J64K6
5505B00j34M9r8j4J50j80P2l1J16l71M22k07r0l6j60N07l1p7k48K7j26J99J12
$$ plain form
5339 212 50 -107 23 -16 222 32 -198 -194 -61 89 25 -131 -148 -37 -64 248 -98 1 -234 -136 -220 -172 -126 -63
5363 -63 -125 -327 -53 -212 -34 176 170 249 328 109 87 -118 222 357 25 -4 -137 -27 0 -134 19 -225 -30
5386 -30 1 -74 -120 3 -100 -187 18 26 345 190 192 -254 200 382 153 163 341 196 -104 -135 210 -36 -123 -246
5410 -246 170 110 -225 -150 180 -55 173 181 -59 56 35 118 -42 -57 361 231 35 19 -119 334 138 -30 101
5433 101 -66 -12 15 235 -244 -42 -233 131 -214 -245 -156 -147 -117 -109 -56 38 -67 -51 49 69 -116 336 271 230 160
5458 160 -33 78 -153 -77 167 -256 -385 -38 -108 14 -165 -118 -274 -4 -176 -101 -194 243 111 298 -105 -55
5480 -55 9 71 148 69 231 -84 15 139 -89 -167 198 139 -136 -110 -53 -14 -272 -220 -258 123 -16 -36 10 174 200
5505 200 66 115 17 3 153 -27 45 14 130 -241 181 -26 -116 -152 -312 195 164 87 -161 -134 -260 -61 51
5528E1k9N9k9n1K63k2n02L10J31j70J18P7j19j92J67j24J24j18om6O4k30J85J45
5552E6k12J63m9J14k24K20l7q1K23k28K56j34L54n73K19j09nJ76q9J27j36j98
5574a67J08l77L12K7k28O1J32L1k7J53J70k16k4J26p4J06m30M17K4kO5ll69K41
5598E6J45j44m7j17q5K63k69J07J75J02j68n4J85k04j53L24n5J3k5m8L33j83j43
5621HJ82j98n5j12O2k28M33p7k28L49l26J50L18l69j26P6L1J69Q8j02JK16l28
5644f6J09j2P7j64N6m8J72j0m53K06J96J05k09O1l3l2j47K18k66J66K7Qj63L43
5668A41j17n6M8J22nJ48m51K34rj12l7K54k71J13k9J75m8j92r7M3q8J39J73k39
5692a61L0o0K04j96j8M30l8J85l50o1k89L7L24O1j58r8O5n3N8p2J27Kop3L04k12
$$ plain form
5528 51 22 81 52 1 264 242 -260 50 181 11 129 206 87 -105 62 -62 62 -56 -62 -108 -44 -274 -89 56
5552 56 -156 7 -42 72 -152 68 31 -50 173 -55 201 67 421 -152 67 -42 -47 129 40 167 31 -167
5574 -167 -59 -436 -124 -97 -325 -264 -132 -101 -128 25 195 -21 -45 81 7 113 -317 100 124 122 187 184 -185 56
5598 56 201 57 10 -107 -192 71 -198 -91 84 186 18 -36 149 -55 -208 116 61 74 49 1 334 151 8
5621 8 190 -8 -63 -175 -113 -341 92 15 -213 136 -190 -40 278 -91 -217 -141 -110 59 147 45 46 262 -66
5644 -66 43 31 108 -56 0 -48 124 114 -339 -133 63 168 -41 20 -13 -45 -192 26 -240 -74 -47 -39 -202 141
5668 141 24 -32 16 138 133 281 -170 64 55 -57 -94 160 -111 2 -27 148 100 -92 -189 -146 -234 -95 78 -161
5692 -161 -131 -191 13 -183 -201 229 191 376 26 -35 -324 -287 37 98 -60 -158 -93 -146 -88 -160 -33 -31 -37 -110 194 -18
5718a8j00J91J56j94j68L13l4J49k70K25k10O0k2o9J47j2j96J84j16J06k00J03
5740B5Qj21J40l36J48R7J12p7R7j19K73j97K15l74J34m9LQ8j44J33j42rK75k70
5764i0j04R3J47k83n4O49k92j37O1j19L50m64J72P1M7J59J65j94Q0l27j14M24
5786B40k27k3j60R3Q5qk83L19k39K06j80q3K41j87K41J30l24K17M4j63J80j82
5808f3K86l80K02Mj32rO6L03n51L18l53Q6M54l97kJ64j11JJ49j5j47j78K32J85
5832A12k2j9J00Q4l01J71n2j16J03j04O2j96Q1j1J07r0M5p7K70m05R6j03K35q7
5856a17K36k24J33O1j22J26m0J31n5n1k0R0M0M4j10j77j02J2n7O1p9j32K75L8
5880c9J14%m9k4j80l6N40l41K5n9R0j0L9O9m0k28j6j7O6j19J52j20J36m0N1J47
$$ plain form
5718 -18 -118 73 229 35 -133 180 146 295 25 250 40 100 78 9 156 144 -52 132 16 122 -78 25
5740 25 33 -88 52 -284 -136 -39 73 -4 93 -26 247 50 265 -109 25 -24 -21 67 -77 56 -86 -95 180 -90
5764 -90 -194 -101 46 -237 -291 358 66 -71 -10 -129 221 -243 -71 0 47 206 371 177 257 -70 -184 240
5786 240 13 -10 -170 -77 8 0 -283 36 -203 3 -177 -260 -19 -206 35 165 -159 58 102 -61 119 -63
5808 -63 223 -157 45 49 -83 -92 -26 277 -274 44 -309 -223 231 -166 -168 -4 -115 -114 35 20 -127 -305 -73 112
5832 112 90 71 171 255 -46 125 73 -43 60 -44 18 -178 -97 -108 -1 -91 -46 -123 147 -258 -162 -265 -30 -117
5856 -117 119 -105 28 89 -33 93 53 184 129 78 58 148 188 232 122 -55 -157 -145 -202 -141 -220 -352 -77 -39
5880 -39 75 75 26 2 -178 -214 326 -15 10 -49 41 31 70 139 99 -129 -145 -162 -96 -215 -63 -183 -47 -87 -36 111
5906A11k28K14j65J59j9m1jk1k29K60L3n6P5j48Q5J3K42j99m1Q1j60l0N7l4q1
5931a23n7j26Q8K40K5j57K40K2q8j23J15P6m8j72l8L44j92j15P7J85j66K6j69
5954a36R4R2rl03J10K40L7n1l1m6K59l74J46j78J7J23O7p8R0r6N3p2J35j34j31
5979a76K27L5k44L6P4k20J94L5r1J8R0l14J88JK18k17M3K38K5p3j48K18r9J3j26
6004e5J29j43m1J5k5P7j03k63K67j55J11l1K58j36J21j51J81Mn0j12K02J24l84
6027a60J37n3RM7Q1P0j32l4j53p4L61k04O9j1k27J18J41L44m80K13j17m0mr8K86
6052H9O7j66j03J48K50k44j10K3L7j13j00L53k98j5pK95j08j4O7k1j20L7mR6j47
6077a08j2k0J23J67r6J15k44m8L75l20K04r4k34O9j2L41k90J56R1j70J31q5pJ23
$$ plain form
5906 111 -117 97 -68 91 72 31 30 9 -220 40 73 17 92 -56 29 42 284 85 44 125 -35 -65 -8 -42 -123
5931 -123 -180 -306 -218 22 47 -110 130 152 64 -59 56 132 84 -88 -126 218 26 -89 -12 173 7 33 -136
5954 -136 -42 50 41 -262 -152 88 125 74 43 -3 256 -118 28 -150 -133 -10 57 -21 69 -27 26 -46 89 -45 -176
5979 -176 51 86 -158 -122 -48 -268 -74 -39 -130 -112 -22 -336 -148 -147 71 -146 -103 135 160 87 -61 157 58 71 -55
6004 -55 74 -69 -110 -95 -120 -43 -146 -409 -142 -297 -186 -217 41 -95 26 -125 56 60 10 -102 100 224 -160
6027 -160 -23 -76 -67 -20 61 131 -1 -35 -188 -262 99 -105 -36 -47 -274 -156 -15 329 -151 62 -55 -95 -99 -197 89
6052 89 156 -10 -113 35 285 41 -69 -46 -9 -122 -222 131 -167 -182 -189 106 -2 -16 51 30 -90 -53 -57 39 -108
6077 -108 -120 -140 -17 150 54 169 -75 -123 252 -68 136 42 -192 -123 -135 206 -84 72 163 -7 124 39 32 155
6101A55l23P0L15j05m2K21k45J19k75K39P3j60m0M2K9j63k9p7L01j21j23n8L52
6124A55J8l28J5L13n78L68L03j81k19J33M7L60k82oj49J99j43P2o9n2P1j47j6
6147a16J1O2%r7J56j54J23p7K25j82K25j38J51n5o5j12K01P9l42J47qJ0k67L65
6171A42k57j2K17j30L6O4k2n0m4Q5P7j27lj85M21k18L17l22J89j31n0l8l3R8Q8
6196A12n6l01J92J30o4j29J08j15p5Q2n8N6J9J55m6j25J51pJ3k1P4KQ0j21J01
6221A57k67J15M3k34R0K79k00l15L70k38O7j18K80j28n1J16M2k01J44J91o9K11
6243B84l57J02P2j1j81K75n3o7p8j11K7J21k6j46J46P4M7J59j80j30p3K33j84
6266e7J67J4j07n7L47l76J85O8l6k45K25j85R1Kj82K27j66K5k12J11J89k14o9
$$ plain form
6101 155 -168 -98 217 112 70 291 46 165 -110 129 202 42 2 44 73 -90 -119 -196 105 -16 -139 -197 155
6124 155 173 -155 -140 173 -405 -37 266 85 -134 -1 46 406 124 118 -31 168 25 97 28 -24 47 -100 -116
6147 -116 -105 -43 -43 -140 16 -138 -15 -92 133 -49 176 38 189 134 69 -43 158 237 -105 42 34 44 -223 142
6171 142 -115 -127 90 -40 -4 60 38 -12 -56 29 106 -21 -24 -209 212 -6 311 -11 178 47 -3 -41 -74 24 112
6196 112 56 -245 -53 77 13 -116 -8 -123 -198 -116 -174 -118 -99 56 10 -115 36 29 42 21 95 97 177 56 157
6221 157 -110 5 48 -186 -96 183 -17 -332 38 -200 -133 -251 29 -99 -150 -34 8 -193 -49 142 73 284
6243 284 -73 29 101 90 -91 184 131 64 -14 -125 -98 23 -3 -149 -3 71 118 277 97 -33 -106 127 -57
6266 -57 110 124 17 -40 307 -69 116 184 148 -97 128 -57 34 36 -146 81 -85 -60 -272 -161 28 -186 -255
6289b55K30K05m40K24JrL1J84l14K42o5%R7k51K10j00J18j91J07k80J49J64k49
6312a92J91J1j7Q8q3J7J14J14k83K86j15J29j24l23J82r8k5K27j4k23N5j29K31
6335A9L0k52K17k9J74l8k92J47jK2j25J54l32L98mJ18j52J00rj93n5j09O5K28
6359H1k67O6j3k8k64K74J20j96K80m39N45m7j52L5N7q5K14m6j8j51R2L4k4L8k71
6384a65J47K75m69R4m1M0r0k6K69r8j2J16k33J47J21N4j87J1L53m09J95r4Pj27
6408a22N7L28j82j89M7K4J32n4j78q0R0P3j08L16q3j52J23j22K31j09n6l0J87
6431A43r2j06J95J91j21j05j05j4n8L01k48r3k57K48n4J94k48j16J55J86Q0j03
6453b7J15J81l12J9k50J95M12k17k98K23j28K93k62K5K75r8l10J16J38j62R4o9
$$ plain form
6289 -255 -25 180 -260 -36 -35 -44 -13 171 -143 99 34 34 131 -120 90 -10 108 -83 24 -256 -107 57 -192
6312 -192 -1 10 -7 81 -2 15 129 243 -40 246 131 260 136 -187 -5 -103 -128 99 85 -138 -83 -212 19
6335 19 49 -203 14 -15 159 121 -171 -24 -25 -3 -128 26 -306 92 88 206 54 154 145 -48 -103 -212 -147 81
6359 81 -186 -120 -133 -161 -425 -151 -31 -227 53 -386 159 112 -40 -5 52 -33 181 135 117 -34 58 92 68 106 -165
6384 -165 -18 257 -212 -118 -159 -119 -209 -235 34 -64 -76 40 -193 -46 75 129 -58 -47 306 -103 92 -2 5 -122
6408 -122 -65 263 81 -108 -61 -37 95 41 -137 -217 -127 -54 -162 154 71 -81 42 -80 151 42 -14 -44 143
6431 143 51 -55 140 331 210 105 0 -14 -72 229 -19 -112 -369 -121 -175 19 -229 -345 -190 -4 76 -27
6453 -27 88 269 -43 -24 -274 -79 333 116 -182 41 -87 206 -56 -31 244 146 -164 -48 90 -72 22 -47
6475d7J97j75J98k42P9J7n6l2Q2J08o2K36j32k93J90j23Q3p6j04J56j41K16j76
6498i7J90p2k55K03J72j75q1R5J60m57L81qK24k53Q9K7k43J57J3j96L09l78L40
6521A45j49r8k4J09M3O0k18o6K86k17J73j07j02K53r7M1j08J96j96J76p7k2M6
6544D7NL20m67R4k3j49J28j0q1j02K23j85N9K01k90K13N2k04K64p9j37K83O4j91
6568C5n4P8n6Q3m6j08j91O4O9L3J10m00K20J17j24K18k61qK39J10j03P8q6j4J20
6593A23j20L0n3J94k98J8j0jM1J8J12j59O1m3rK17l66K06J07l18K66Q1l5J4j87
6618a11K59j42J37r5l4K15j53j21K11J05j09l7j30L8k8J6j66J89j89jR5K25k09
6641c5k6l4P9j50J00K15N2Q8j08j80M55o68M00j08r2j00J84j14j61J12n3J68n
$$ plain form
6475 -47 150 -25 173 -69 10 27 -29 -61 21 129 67 303 171 -122 68 -55 28 -48 -152 4 -137 79 -97
6498 -97 93 21 -234 -31 141 -34 -115 -20 140 -317 64 56 280 27 116 143 -100 57 70 -126 183 -195 145
6521 145 -4 -102 -126 -17 26 86 -132 -198 88 -129 44 -63 -165 88 -9 32 -76 120 -76 100 23 1 47
6544 47 52 372 -95 -1 -24 -173 -45 -55 -136 -238 -15 -200 -141 60 -230 -17 35 -169 95 16 -121 162 226 35
6568 35 -19 59 3 86 40 -68 -259 -195 -126 -93 17 -383 -163 -46 -170 48 -213 -221 18 128 25 103 17 3 123
6593 123 3 33 -20 174 -124 -106 -116 -117 -76 -58 54 -105 -44 -87 -96 121 -245 -39 68 -250 16 97 62 76 -111
6618 -111 148 6 143 48 14 229 76 -45 166 271 162 125 -5 33 5 21 -145 44 -145 -146 -51 174 -35
6641 -35 -61 -95 -16 -166 -66 149 201 289 181 1 456 -212 188 80 -12 -112 72 -42 -203 -91 -144 24 19
6664A9j02J35O1p3J58j47L8j65Q4J42L8lj78J1J95k69L57k00j39j15P3K94l0P0
6688B54j55j2k22%M3P6O6m6J0Q5j69P9J14j42K1K76j57J74r3m15K66J60k20k2
6712b9K34j94k41K49Q1j09m50M34j59K06M0j23K56m21L45l1j8k4K8j9J31j14q5
6735a3J94q6j55J13Mj05j69J82J77j31k49J49n9J22K49m80K71J1j93M27k41J38
6757A56j34K13n7k58J32l3Q6q0j24j32j23M11l1J80l68J77k16J11K17j26%nJ63
6780A59J05k82j27J97q3nK99q2j83J3p0l5J21J48m52L62k80P0j88J01M7J55J34
6803A24k31L6O2KmJ23J48r2J06k57r2n2P1K67m02J22M9n3j51J64Q4q9l1R2j52
6828a56M9K64k57K10j04k0K54q4j35qJ14o6k31N3j8L97l41L11j85j44Rk19L48
$$ plain form
6664 19 -83 52 113 40 198 51 89 -76 8 150 188 185 7 18 213 -56 301 101 -38 -153 -80 214 184 254
6688 254 99 87 -135 -135 -92 -16 50 4 14 99 -70 9 123 -19 2 278 121 295 202 -213 53 213 -7 -29
6712 -29 205 11 -230 19 100 -9 -459 -25 -184 22 62 -61 195 -226 119 88 70 46 74 55 186 72 -13
6735 -13 181 95 -60 53 57 -48 -217 -35 142 11 -238 -89 -148 -26 223 -257 14 25 -168 259 18 156
6757 156 22 235 178 -80 52 19 105 25 -99 -231 -354 57 26 206 -162 15 -201 -90 127 1 1 -4 159
6780 159 264 -18 -145 52 -31 -36 263 181 -2 11 -59 -94 27 175 -277 85 -195 -125 -313 -212 -165 -10 124
6803 124 -107 -71 -9 -7 -11 112 260 168 274 17 -75 -127 -56 211 -191 -69 -20 -73 -224 -60 24 -65 -96 -4 -156
6828 -156 -107 157 -100 110 6 -14 240 156 21 13 127 61 -170 -117 -135 262 -79 232 47 -97 -88 -307 41
6851D1j33j10K04q4O6m9o6l2J19j52k33M28O0q5j28K64N2k57q5J87n4M7J17o1
6875E6J60l23p6J28N1m9J54j02K0j52K62j46j34K59qj43J03k11K43J62k81k62
6897b89L11OQ0L3l0j00j4j9L7l4l2j56K80j63j37K85k46J69n9r8J72o9M5J35j10
6922cJ76j43K7j85j06J47R7N3l7j24J20oj25Q9K13k18j30K01p5J90Lj22j70Q7
6946d1M0k1O9r3K05Nk08J72k58M32j67l71K34J79k07j07k5O7J96J70j35j26N1
6969F1j88L1J00k34N82l07R6m1J7m4K8l29N16k70j75K28J59l49J6L14l05M2j47
6992a99KL5M54l08M4J23p7k3j0J86l88j04M73P8j86n7KJ43q2j00k9P1k48N5O0
7017h5k16J40R6NOJ89j23j62o7M35k28J95j88N6m5l19M37J44k76L0k84M58j09
$$ plain form
6851 41 -92 -202 2 -82 -16 -65 -131 -163 -44 -196 -429 -1 59 -26 -154 110 162 -95 -180 7 -47 0 117 56
6875 56 216 -107 -183 -55 -4 -53 101 -1 19 -133 129 -17 -151 108 100 -43 60 -151 92 254 -27 -289
6897 -289 22 28 108 141 111 11 -3 -22 15 -19 -51 -207 73 -90 -227 58 -188 -19 -78 -176 -4 -73 -28 107 -3
6922 -3 173 30 57 -128 -234 -87 10 63 26 -98 22 16 -109 -20 193 -25 -155 46 -29 161 164 42 -128 -41
6946 -41 -1 -22 47 -46 159 164 -44 128 -130 302 135 -236 -2 177 -30 -137 -162 -95 101 271 136 10 61
6969 61 -127 -96 4 -230 352 45 141 100 117 73 101 -228 288 18 -157 71 230 -119 -103 211 -94 -52 -199
6992 -199 -197 -162 292 -16 28 151 74 51 41 227 -161 -265 208 286 100 43 45 188 106 6 -23 48 -200 -145 -85
7017 -85 -301 -161 -65 -60 -54 135 12 -150 -217 218 -10 185 -3 53 8 -311 126 270 -6 24 -260 198 89
7040H9j30K26j17J00l97JK05o3l9J73P0n5o5K54k12n8K44k23k22N22j06k29q3
7063a15K92l22J4M8p4J69k33j12Q7J21j13K65n3k07J82o0r8K79Nj96J24K80k55
7086B8r6P8R2k29J33J4Nj25L74m61q9J00J35n4O2K67k3O2j32L7j76J10Rpl7j63
7112h6K04p9O5M6k9j82Q0Jj59K81j29o2J73m14L88k1j98K85J57L9k99j1j2J30
7136A68l03Q7K25j49Q7J15j01J42l12J43j11K7j51P6n3j04P3j03L2K16P5q4j48
7159a53K36k07K83l5k04M5J50r7J16j7q7l0R4k85Q4p3J42Q0j15L1j01ko4L19m5
7184F5q4J1MJ48k02jJ94k25J91k19J84K4p2KKJ37k59K07K15l5j67l01K21M4m2
7209D2j28mj17J92O4j56O5K77k29K81j70j21JJ20q6j58J68j03q0Q2N2l1j42M34
$$ plain form
7040 89 -41 185 68 168 -229 -228 -23 -86 -125 48 118 63 -2 252 40 -18 226 3 -219 303 197 -32 -115
7063 -115 177 -145 -131 -83 -157 12 -221 -333 -246 -125 -238 27 -26 -233 -51 -111 -209 70 75 -121 3 283 28
7086 28 -68 10 102 -127 6 20 25 -100 274 -187 -276 -176 -41 -95 -33 234 211 273 141 178 2 112 121 114 77 -86
7112 -86 118 39 104 150 121 -61 19 20 -139 142 13 -49 124 -290 98 77 -121 164 321 360 61 50 38 168
7136 168 -135 -48 177 28 115 230 129 271 -41 102 -9 18 -133 -57 -110 -214 -141 -244 -212 4 79 -5 -153
7159 -153 83 -124 159 124 -80 -35 115 18 134 117 30 0 94 -191 -107 -180 -38 42 -73 -42 -143 -145 -209 110 65
7184 65 -19 -8 -4 144 -58 -59 135 -90 101 -118 66 90 18 20 22 159 -100 107 322 287 120 -181 40 84 42
7209 42 -86 -90 -207 -15 49 -107 -42 235 6 287 117 -4 -3 117 31 -127 41 -62 -142 -60 -8 -39 -181 253
7233B53k48j20J87j12J40l38P2K77j93R7J2p8K88r3KR6P1j98j51L1J7Q9o4j24
7257h7o7Q0K6j55L49m9m3n8p7r2J0J51K31l35L22j42r9J28l24Q7J9rj18K92j09
7282f9l7L5J14J00k61j07J42m1R7j74J73%K94l48J23j67J37J43m62K70J05J2r9
7305b0j5Q0Oj42L42j75J10j94j16l5M71l08j1Q9m7r2l6J51r0j47K82k2J2Kl77
7330b82M04k05Q8J85l37J58o7J41j38J49l40K95j53Q9o7N9J02n57O29l04m4K06
7352A1N4j91J73K40l12j54K52M0j62Q5j07O4nJ65j37q3k9K00j43j59NK99oj91
7376i1p0n7K54j68J64J7Q5O2k42K63j42P3M1j77m7o5j35L62O3l30J56r0Q8l83
7400c69O50l70m7J88LJ60j33j82J14R1l7j29P5N2M0n9j69n2m7L38j11J12j27j10
$$ plain form
7233 253 5 -115 72 -40 100 -238 -166 111 -82 15 27 -51 237 144 146 242 313 115 -36 -5 12 101 37 -87
7257 -87 -154 -74 -48 -203 146 97 54 -4 -81 -173 -163 -12 219 -116 206 64 -35 93 -231 -144 -125 -134 -252 40 -69
7282 -69 -106 -71 43 143 -118 -225 -83 -124 -27 -201 -28 -28 266 -82 41 -126 11 154 -308 -38 67 79 -20
7305 -20 -35 45 51 -91 251 76 186 -8 -124 -159 312 4 -7 82 35 -57 -93 58 -32 -179 103 81 93 95 -282
7330 -282 122 -83 5 190 -147 11 -56 85 -53 96 -244 51 -102 -13 -80 -21 81 -476 153 -151 -195 11
7352 11 65 -126 47 287 -25 -179 73 113 -49 36 -71 -7 -12 153 16 -67 -96 104 -39 -198 -193 106 100 -91
7376 -91 -161 -218 36 -132 32 49 134 196 -46 217 75 148 189 12 -35 -100 -235 127 190 -140 16 -74 14 -369
7400 -369 281 -89 -136 52 55 215 82 -100 14 105 68 -61 14 66 106 47 -122 -174 -221 117 6 118 -9 -119
7424a19R1n5J12jJ79k59p4K47k83K97O3k48j4K00N2j17K9J87L0n82J08J23mj51
7448a89J87j07K00p4m9l8R1j74J4L55m44K22j11p1M18l68O7K98n6k25Q1M4L8M5
7472A54j14Qj8q5M00n15K48k23o2J86n4J61M6J1k69o3P9N2L20k6k58j96K30Q3
7496I5Kk24J20q2o7J15j94K11o5J21j94J92Q9j31j33J71l4K06p3l31N3J02j71
7519b22N34j03k69J32j16j15J33L3M0p1J6j3k23J51r1L61k03k66L28%L6J9l88
7542b97M22j17l4K51l33LL20l3k80J21J05k23j53L88n64N06J70l96M6J1N3k29
7564b63N6j03M60R4m41j3K31j85J78J49J30j34k1k02K31p2k63J25n4o4J35L9j37
7587a24K34r0o1K9p6JK47j07PR1J05m2j89n3P6K9n7j98J94N0p8N3Q5k87J55Q5
$$ plain form
7424 -119 -28 -83 29 28 207 -52 -126 121 -162 135 198 -50 -64 136 188 71 100 287 317 -265 -157 -34 -38 -189
7448 -189 -2 -109 91 17 -32 -70 21 -153 -139 216 -228 -6 -117 -188 230 -138 -71 227 171 -54 27 71 109 154
7472 154 40 48 30 -55 345 -170 78 -145 -207 -21 -75 86 132 143 -126 -189 -110 -58 262 236 -22 -218 12 95
7496 95 97 -127 -7 -89 -156 -41 -235 -24 -89 32 -162 30 119 -12 -145 26 -8 198 125 -206 -153 -51 -222
7519 -222 312 209 -60 72 -44 -159 -26 7 47 -24 -8 -21 -244 -93 -184 177 -26 -292 36 36 72 91 -297
7542 -297 125 8 -26 225 -108 -105 215 182 -98 23 128 -95 -248 140 -424 82 252 -144 -98 -87 -34 -263
7564 -263 -207 -310 150 244 -197 -210 21 -164 14 163 293 159 138 -64 167 95 -168 -43 -97 -161 -26 13 -124
7587 -124 110 20 -41 -12 -88 -87 160 53 60 151 256 214 25 -28 48 77 20 -178 16 66 -12 41 126 -161 -6 79
7613G9k42p9K37Po7r6P3q0j7K06K72j83J5P2K0k62J39k04Q3n1J00q5nJ00j41R5
7639a4r9K52J4k50N9l3n2J32k0K5O0J7j50M6O1l51M11J11k78l3L03k83O5R3M3
7664A29K01k83j32K0m1k3K8M6JK79k67O6k02J86K6k21P0p0J38p0K50L0n9q3l8
7689a9J75k1M4l06M6q1J91L9J4j23p2P6J0L1r0J40R3p5L2j16J07Q3q6p3j47K32
7715A04J95j10k26j47PJ67J47j21j31J92J50m21RR4P9J72l9l29J42J57O1r4K7
7738H5R2J50n75L06q7P9r0o3q7J34K9j07r7J17J8J19l8j4r0J56o5K79l7o8lr4
7764D9Q2j20K15j37O9j06J7m8J38o6l39K37j16J26l6M8k02L64p1J7j04J30k75
7787a28K63j47K74j85k71K08J59j74pk13J05K32k54M2P6n6J0n2K09j58j78N3P
$$ plain form
7613 79 -163 -242 -5 2 -65 -161 -88 -168 -185 21 293 110 125 197 217 -45 94 -110 -27 -78 22 -63 -68 32 -109 -14
7639 -14 -113 139 153 -97 -38 -71 -123 9 -11 14 74 91 -59 -13 48 -303 108 219 -59 -92 211 -72 -7 86 129
7664 129 330 47 -85 -65 -106 -129 -101 -55 -54 225 -42 24 -178 8 34 -187 -117 -187 -49 -119 131 161 102 19 -19
7689 -19 156 135 179 -127 -81 -162 29 68 82 -41 -113 -37 -27 4 -86 54 147 72 104 -12 95 178 92 19 -128 104
7715 104 299 189 -37 -184 -177 -10 137 16 -115 77 227 -194 -185 -91 -12 160 121 -208 -66 91 152 58 85
7738 85 177 327 -248 58 -29 50 -40 -103 -190 -56 -27 -134 -231 -114 -96 23 -15 -29 -119 37 -28 251 214 146 143 49
7764 49 131 11 226 89 158 52 69 21 159 93 -246 -9 -125 1 -35 13 -189 175 104 121 17 147 -128
7787 -128 135 -12 262 77 -194 14 173 -1 -8 -221 -116 116 -138 -96 -20 -76 -66 -118 91 -67 -245 -192 -185
7810a85K59Lj45j95L34JJ45k90J03P9O2O1k15k9J22J74l10J85j52q5p7J22o3q4
7834a80K10k90L60J9j61M8n2k06K29J51j19J52j89M5o9K45k75N0N4j40K21q2k17
7857a96J40l5k6k6%Q7J35j05J90j53j15M3J6J41l14L12O2m1j38L0O2k7q8L1J85
7882A70j6Qj81Q8k28Jl7L95o4l02R6N3J54J08j15r3J35Q1l48J30j05J32N6k14
7906i6L0q2J73L6R4k71j57K1L98m57L70j93K48L1j82Q4j27J40o0K83l24j32L26
7929A53j11K4k10K69k00J02Pn8j03K60k39J86J08j96J65l08K11r8J43K9l52N8
7951a60L50j01j57L10k72k7J26j89m2K6K13k66K05j54Q1k65L77j09j8J05o5l3
7973f5L6J26k37K83j1k50K10J67k34l1O4m0N5j17p6K3J16P2j47q5J56k29K71m04
$$ plain form
7810 -185 74 77 -68 -263 71 72 217 -73 30 109 171 232 17 -12 110 284 -26 159 7 -78 -155 -33 -96 -180
7834 -180 30 -260 100 119 -42 6 -46 -252 -23 128 9 161 -28 17 -52 193 -82 -32 22 -118 103 21 -196
7857 -196 -56 -91 -117 -143 -143 -56 79 -26 164 11 -104 -61 -45 96 -218 94 156 115 -23 7 69 42 -46 -15 170
7882 170 154 162 -19 69 -159 -158 -195 200 136 -166 -70 -17 137 245 130 37 172 253 -95 35 -70 62 118 -96
7906 -96 -66 -148 25 61 155 -116 -273 -252 146 -311 59 -134 114 145 -37 47 -80 60 0 283 -41 -173 153
7929 153 42 66 -144 125 -75 27 34 -24 -127 133 -106 80 188 -8 157 -151 60 -38 105 134 -218 -160
7951 -160 190 89 -68 242 -30 -57 69 -120 -162 -136 77 -189 16 -138 -57 -322 55 -54 -72 33 -32 -65
7973 -65 -29 97 -140 143 132 -118 92 259 25 -6 58 18 73 -44 -120 -97 19 91 -56 -141 15 -214 57 -347
7997c47K29J50Mn5j55L16j00j43K3J12O6L1j92j03K77k5k43J19qK57j45K4j60
8020f8rj7K65j34l4p5J01j26j9RK2J64o1O2j78J08L4qK63j30l91J11K27p2J01
8045A45k38J6p2R5k7J12r1K29o0k59K95j19j54J09RJ6L04k94o9J59k93J27J42
8068H2J2k7K60l79L0j56N2J95j75o2K2J2J47K57j91k01n6J41K17l43M2K18j83
8091h6K03R5j98q2j20N2j01K53J66k02L3L2O3k04J13j27m6L94k12L8j16K82j15
8114A15k33j59L50lJ61k10r1N1Kj34J94j55Lq4L27j33K4p9K36j36L25j79l18p3
8138a99J60J23p0K87j69j52J45k23Q4L2J68k91j21M25j57j26J5J23j93R9r1K06
8160G5J01M5k53R7j65Q8K13k29o1L17K4l08L04l44J95j26J75j05j26J0J48l00
$$ plain form
7997 -347 -118 32 36 -19 -174 142 42 -101 -78 34 100 131 -61 -164 113 88 -155 -36 -44 213 68 92 -68
8020 -68 -77 -94 171 37 3 -72 29 -97 -116 -107 -85 79 18 80 -98 10 44 36 299 169 -222 -111 116 44 145
8045 145 -93 -77 -149 -54 -81 31 -60 169 109 -150 145 26 -128 -19 -10 6 310 16 -53 106 -187 -60 82
8068 82 94 67 327 -52 -22 -178 -126 69 -106 -168 -146 -134 13 270 79 -122 -178 -37 180 -163 -121 97 -86
8091 -86 117 212 14 -68 -188 -136 -237 16 182 -20 13 45 108 -96 17 -110 -156 238 26 64 -52 230 115
8114 115 -118 -277 73 70 231 21 -70 -19 -17 -151 43 -112 -109 -193 134 1 25 -54 182 46 371 192 -126 -199
8138 -199 -39 84 14 301 132 -20 125 -98 -14 18 186 -105 -226 199 42 -84 -69 54 -139 -40 -131 75
8160 75 176 221 -32 65 -100 -12 201 -28 -89 228 252 -56 248 -96 99 -27 148 43 -83 -73 75 -225
8182b25M11l28K76j58j23K06l2J89m29
$$ plain form
8182 -225 186 -142 134 -24 -147 59 27 216 -213
8191b13
$$ Imaginary data points
##PAGE= N=2
##DATA TABLE= (X++(I..I)), XYDATA
0@%%%%%%%%%%%%%qJ6j6J6j6K4l2L2m0M8n6O4p2Q8j04J20j36J53j74J98k23K51
35A33k82L17l57M00m45M96n51O10o75P47q26R11j005J109j222J344j480J632j800
54i44J989k203K447k727L051l434L896m464N179o114P397r267J2252j7761L1184
69B0481j21893j53393K90774P4571j28297L3406O0661q5722K4623K5733l9229
80A715M3118K5392r2788q714N3092l9593k9574N6819m14l3245P167J2299m794
93i520j3423m865L3188J0807l8463j2606K2509J1756L4317J1735n9629n03N7573
106D2876l8426l3486P8310J7588p4771q478J4933j2408L9608J1748p3982o234
118d2722M8155l4488k9650M7255J8115j4569J0526j0069j0789M3918K3076l0813
$$ plain form
0 0 0 0 0 0 0 0 0 0 0 0 0 0 0 -8 8 -8 8 -8 16 -16 16 -24 24 -32 32 -40 48 -56 64 -72 81 -93 105 -118 133
35 133 -149 168 -189 211 -234 262 -289 321 -354 393 -433 478 -527 582 -640 704 -776 856 -944
54 -944 1045 -1158 1289 -1438 1613 -1821 2075 -2389 2790 -3324 4073 -5194 7058 -10703 20481
69 20481 -101412 -254805 35969 110540 -17757 15649 76310 -9412 15211 40944 1715
80 1715 44833 70225 -22563 -31277 21815 -17778 -47352 9467 9053 -24192 -17025 -4726 -9520
93 -9520 -22943 -27808 5380 16187 -22276 -34882 -12373 -617 33700 45435 -14194 -14697 42876
106 42876 4450 -29036 49274 66862 -7909 -16387 -1454 -13862 25746 37494 -36488 -42722
118 -42722 5433 -29055 -58705 -11450 6665 -7904 2622 -7447 -18236 25682 48758 17945
130A7945j2244L055j9240n173K1590J2412o228j4325q217O889P818L558O734O96
144A5270j2152j9955j7560P951K2152l089p166K3461N236l5638n419M2027K2159
157C7277j6075j4864K046J887j4228p211K1473J6461j8831k5853o163J4523K0365
170A0807p370k1563Q611J0915j6899J733K2631k054l168L482k0742j549L4329
183A9163k843k0342K0545J263l1570Q979K3003j1502m583L226j4022P98N066j5565
197a8384J1018K5165k2737k1566K1095P658j0508N052K072P17P451j3433o882
210a3282L1710J4452j9427o326m5n261M788o330q890K1525j925m2263q34L2613
224E05j36P44J1793j8073j0259J2342q637K975K5329j6661k3916K7818Q916k4153
$$ plain form
130 17945 5701 8756 -10484 -15657 5933 18345 12117 -2208 -10425 -3536 4282 7840 14574 15270
144 15270 3118 -16837 -34397 -26446 -4294 -7383 -14549 8912 14148 -21490 -26909 15118 37277
157 37277 21202 6338 8384 10271 -3957 -11168 10305 26766 7935 -17918 -24081 -9558 10807
170 10807 3437 -18126 -9515 1400 -15499 -13766 8865 6811 3643 7125 -13617 -15166 19163
183 19163 16320 -4022 16523 17786 -13784 -4805 18198 6696 2113 5339 -8683 -7885 -2819 -18384
197 -18384 -7366 17799 -4938 -26504 -5409 2249 -8259 -3207 -1135 -418 7033 -6400 -13282
210 -13282 18428 32880 13453 7127 7082 1821 6609 279 -8611 12914 10989 -31274 -32108 505
224 505 369 1113 12906 -5167 -15426 -3084 -11721 -8746 16583 -78 -23994 3824 12740 -11413
238a1413J5637K3833j2530m792p66j4756J2293J4396k5999j1017J8816p474j5103
251a8875J0282O522j213K297j0197m586J3914O74n553J1628L804j0738k490j08
265d639P045J8440n594j9829Q489P851j4241M210J6160o247j0479m466p396O945
279c751P229j4445j485J4109j3246j6581J8399J9508k193n633o534j853J0907
292D431L462n173N191L642r008o291K434O522Q187l737p411L855l985j3691M032
307g540J1474m425o549k065l020N523L225p324Q395J5787j2303j4601R689J1349
321G615J709N56n859k663M765o151l062J6852L650k0965r403P132O423K672m749
336a478m255O887l386j4214P722J6550n342q488K344J812K309P78m375R594J1641
$$ plain form
238 -11413 4224 28057 15527 10735 9969 -4787 7506 21902 -4097 -15114 3702 -3772 -18875
251 -18875 -8593 -2071 -3284 -987 -11184 -15770 -1856 -1182 -6735 4893 8697 -2041 -4531 -4639
265 -4639 2406 20846 15252 -4577 3912 11763 -2478 1732 17892 11645 1166 -3300 -10696 -3751
279 -3751 3478 -10967 -12452 1657 -11589 -28170 -9771 9737 7544 1911 -4623 -6476 4431
292 4431 7893 2720 7911 11553 2545 -3746 -1312 5210 13397 9660 2249 6104 2119 -11572 -7540
307 -7540 3934 -491 -7040 -9105 -12125 -6602 -3377 -10701 -2306 13481 1178 -13423 -3734 7615
321 7615 9324 9880 4021 1358 6123 -28 -3090 13762 17412 -3553 -12956 -5824 599 3271 -1478
336 -1478 -5733 1154 -2232 -16446 -8724 7826 2484 -6004 -3660 -1848 461 1239 -3136 6458 18099
351A8099j4703j2038J4145M170j0750K279M666m231m622p084J85J6338J704j7049
365h891k77Q303n103j091P997L283J048n185j0373P874J5556o443o470R153j093
380H288j1719j114N381O480K501j3542q647J0497J797r582N168P810n310n100
394g092j376K056J1095M740r054r88N451n065n25Q184J191l060l534m713L643
409I53N473o561j267R157m538j3025j526L053L612M773n172n495O449O47m548
424h015R213J0998l677n805k977J603P815L17p385K569L702r091m626O607M615
439E863o78p009q912M486M485q241J179J1101o388r192P582M683J037N616k601
454C011k716R546m609j2658J3809J2876j3565o866O474k575j079L871n751o90
$$ plain form
351 18099 3396 -8642 5503 9673 -1077 1202 5868 1637 -2985 -10069 -9884 6454 8158 -8891
365 -8891 -9168 -865 -5968 -7059 938 4221 5269 84 -10289 -2415 13141 6698 228 9381 8288
380 8288 -3431 -4545 836 7316 9817 -3725 -12372 -1875 -78 -9660 -4492 3318 -1992 -7092
394 -7092 -8468 -6412 4683 9423 369 -619 4832 -233 -758 7426 8617 5557 2023 -2690 953
409 953 6426 -135 -1402 7755 3217 -9808 -11334 -8281 -4669 104 -5068 -10563 -4114 -3467 -8015
424 -8015 1198 12196 8519 2714 -263 1340 9155 9472 2087 4656 8358 -733 -5359 1248 5863
439 5863 5185 -1824 -10736 -6250 -1765 -10006 -8827 2274 -4114 -13306 -5724 -1041 -4 5612 3011
454 3011 295 9841 5232 -7426 6383 19259 5694 -1172 5302 2727 1648 5519 -232 -922
468i22N183j1290r885J0433M398o294K128L004l629l55K711P771Q283l656r053
483a173J548M098L16J947r12k514L317o072p655J1303O218j1751p12N950r210
498e302l409N942m826O82R740j0452r848J6514O039r831P426Q397r840j77O417
513G472m151K826N674j1489m944R878k430q806O830M720q535m290K219J836K146
528a044j468k460K821J769m324j888P342P898k450r560N95P283q18k593M965M55
544F523p269j896K440J887M051k625q503J448M275o856k068Q220Q40m890J62J596
560b665J444L748J071m2M188j029q555j290O871K873m276m715M41N79k014J021
576b350M409P35m331l402L10L202K242l696j810N465J02n300K047O626J314k75
$$ plain form
468 -922 4261 -7029 -16914 -6481 -2083 -8377 -6249 -3245 -6874 -7229 -4518 3253 11536 7880 -1173
483 -1173 375 4473 4789 6736 5824 3310 6627 555 -7100 4203 10421 -1330 -2042 3908 -5302
498 -5302 -8711 -2769 -7595 -6913 2827 -7625 -17473 -959 5080 -4751 2675 11072 1232 1055 7472
513 7472 3321 6147 11821 332 -4612 5266 2836 -5970 860 5580 -2955 -7245 -5026 -3190 -1044
528 -1044 -2512 -4972 -2151 -382 -4706 -6594 748 8646 6196 -3364 -2769 4514 3696 1103 6068 6523
544 6523 -746 -2642 -202 1685 5736 3111 -5392 -3944 331 -6525 -8593 -373 467 -4423 -4261 -2665
560 -2665 -1221 2527 3598 3556 7744 6715 -1840 -3130 3741 6614 2338 -2377 -1936 -1357 -3371 -2350
576 -2350 2059 2794 -1537 -4939 -4629 -1427 815 -2881 -4691 774 876 -4424 -2377 4249 5563 5288
592E288k106k549L261M36m133K727M006p934o515L783L473J202j257n463l28N402
608g07m190k879R857J549q356J906M372k399L896L056l735L740K345j1177m69
623c191J2134l388q204M969p15p229J832J626J103N441m781j1668M612Q719l887
638b627k247M893M1k482L80J670M832L360l513p92J735k305j777J588L80J578
654D714k213q626P94P498l581l186N925k842p293L794L099j628N094j556p964
669g971O508P409p783K54J0749k615o920L448l75j272N369k046o937L161J334
684B313p888J246P721j608o081m60j87L34K388M90J122J79k653j906L783N470
700D263J004l307j284L976o52m701K152N618k358m985j460j14P94J724k193L32
$$ plain form
592 5288 3182 633 3894 4330 197 2924 6930 -1004 -7519 -3736 -263 939 -318 -5781 -6109 -707
608 -707 -4897 -7776 2081 3630 -4726 -2820 1552 -847 3049 6105 2370 6110 8455 -2722 -3191
623 -3191 8943 5555 -2649 2320 1605 -5624 -3792 -2166 -1063 4378 -403 -12071 -7459 1260 -2627
638 -2627 -4874 19 60 -2422 -2042 -372 4460 7820 4307 3515 5250 2945 1168 2756 3136 4714
654 4714 2501 -6125 -5331 2167 -1414 -4600 1325 -1517 -8810 -5016 -1917 -3545 1549 -7 -7971
669 -7971 -1463 5946 -1837 -1583 9166 6551 -369 3079 2704 1432 6801 4755 -2182 979 2313
684 2313 -5575 -4329 3392 1784 -4297 -4757 -4944 -4610 -2222 -1732 -610 -431 -3084 -4990 -1207 4263
700 4263 5267 1960 676 4652 4000 -701 1451 7069 4711 -274 -1734 -1848 -1054 670 -1523 -1191
716a191K726m412n648M601N896j748k433r9O06K32O66J314L666J010m424j802
732a040K899K017j471j243P10P19l809l202K952L747j893k562Kr05O09P40m15
749b145K716K201n314k264N611K755j763P81j13j102k4j240O7M223o99n721p34
766b765K353j078o25J034Q24M51k735l248L777N301k799k217L015m59j671J275
782D33M29K969K038n007l646N074J044m343K372K229m934k110P01m58K659J212
798F62m749K19L591k726j284N657J991k008r52j346J328L840r18j886K297j41
814C575l828m46K428J141m88l138l168K070L70l505K043K947k738k379J423Q31
830b862K814K094k133N66L407l217j569N387J852l625j659M55k57M21o85j230
$$ plain form
716 -1191 1535 -2877 -8525 -3924 1972 224 -2209 -2308 -1702 -1470 -804 510 4176 5186 762 -1040
732 -1040 1859 3876 2405 1162 1872 2591 -1218 -4420 -1468 2279 386 -2176 -2174 -3079 -2470 -1730 -2145
749 -2145 571 2772 -2542 -4806 805 3560 1797 2578 2465 1363 1339 99 166 4389 3690 -2031 -2765
766 -2765 -412 -1490 -2115 -1081 -257 194 -2541 -5789 -2012 3289 490 -1727 1288 829 -842 433
782 433 862 3831 5869 862 -2784 2290 3334 -1009 1363 3592 -1342 -3452 -2751 -3209 -550 662
798 662 -4087 -3868 -277 -3003 -4287 1370 3361 1353 401 -945 383 4223 3305 1419 3716 3575
814 3575 -253 -699 1729 2870 2382 -756 -3924 -1854 -1484 -4989 -2946 1 -2737 -5116 -3693 -2862
830 -2862 -48 2046 -87 479 3886 669 -900 4487 6339 2714 1055 1510 1253 1674 989 -241
846b41K696q43o007p11L878O80k164r63J3O96k23o07K967L403j707j810J442J570
864B069J209N40m04Q12J24m048j024L757J35l128r12k18j676j44n41J01L378j433
882a403m179J413L808j31l81J477L57L71j008j129L035L471k404k760J507M67
898B511j178M31L04J04p87l885j665K868O99k846K24R43n23r65R65K519K972j218
916A473k532J710K412j576n85K272J08j641k222o67K928J661l212j836K587j331
932d51k580J167J614k06m67k573l82L361J034k700K900K281k851j904K895J508
948B646K91j66k080m05J142j054j146K419J89l353j688J074O25L07m82L32R67
965c82r01r45J331K543J406q35k152M51J257j345p43K959O93m099j179J172J550
$$ plain form
846 -241 2455 1612 -4395 -5106 -1228 -548 -2712 -3675 -3662 -2966 -3189 -3796 -829 2574 867 -943 499 2069
864 2069 3278 3818 3414 4226 4350 302 -722 3035 3170 42 -870 -1088 -2764 -2908 -3449 -3348 30 -1403
882 -1403 -5582 -4169 -361 -492 -873 604 961 1332 324 -805 2230 5701 3297 537 2044 2511
898 2511 1333 1764 2068 2172 1385 -2500 -4165 -1297 -598 -3444 -3220 -2277 -2800 -3765 -2800 -281 2691 1473
916 1473 -1059 651 3063 1487 902 3174 3282 1641 -581 -1248 1680 3341 129 -1707 880 -451
932 -451 -3031 -1864 -250 -456 -923 -3496 -3878 -517 517 -2183 717 2998 147 -1757 1138 2646
948 2646 2937 2771 691 286 1428 374 -772 1647 1836 -1517 -3205 -2131 -1506 -1199 -1681 -1349 -382
965 -382 -1283 -2228 -897 1646 3052 2217 65 516 1773 428 -315 2644 3337 -762 -1941 -769 781
982G81O90j110j828R10L02l255J00L413l37k619N51J495M47R16O6J246K240q19
1000C189k932P95K581r08j252j60j082j233p32J29K580l01l232j442K094J036
1016h70p33j27N64R51j071j508K352K919l30j389Q05R39l67m00m61J578J545l566
1034H31l009K081P14j146J70k38j874l02m81m51L352R25m198M39L693q75n89K846
1052A888N26o49Q50j058r77L041n72l113K132J314m527j821L416O20p26j134k449
1069c239j85K386q55q94J730M37k247l87L223J783o45r34J304J155l62p17M04
1086A957P19J77j280k307Q10J327k128p18K447m81m173M02K240q6L95n76j863
1103c138J157K638k024P03L967j187l463K235K073j773O8Q46j172M89m53k585
$$ plain form
982 781 1471 361 -1467 -557 -255 -3510 -3410 3 -334 -2953 -2402 -907 -460 456 522 1768 4008 3189
1000 3189 257 1052 3633 2725 1473 1313 231 -1002 -1734 -1605 975 674 -2558 -4000 -1906 -870
1016 -870 -1603 -1730 -1166 -215 -1286 -2794 -442 2477 2147 758 1563 2502 2135 1735 1274 2852 4397 831
1034 831 -2178 -97 617 -529 -359 -597 -2471 -2773 -3254 -3705 -353 572 -3626 -3187 506 -369 -958 1888
1052 1888 2414 1765 2615 1557 580 3621 3049 -64 2068 3382 -1145 -2966 450 1070 344 -790 -3239
1069 -3239 -3424 -1038 -1893 -2787 -1057 -620 -2867 -3254 -31 1752 1107 173 1477 2632 2270 1553 1957
1086 1957 2676 2853 1573 -734 76 1403 -725 -1443 1004 523 -3650 -3248 -1008 -1094 -699 -1275 -3138
1103 -3138 -1981 657 -1367 -664 3303 2116 -1347 888 2961 1188 1256 2102 930 1419 966 -1619
1119a619K01L606j133k912P80Q95k233k19K619L33j063j133l18J097K431N65k038
1136a41M40J812j457q25K193P58k254k98R0r9n80J28q82J029J060k762j787K678
1154h97J463j793M52R39o88o75J025R75J441N2k761j12K487L48j747k44R47q68
1172C44j199o86J153J010j289r92N47J45q74L32P98J649n17j674k59K387O85q09
1190G51J201J5j093m63M41M55J362j571k510N68J479k220n48J713m03m12n27q21
1208b583J338J833j177o29K371k60k240J438K024j12L82r74j304J259Q53j613
1224F06M6J507k437k224J485Q61j001l58m01l01Q97m96r91K092J630j274o94J155
1242A02J073K7l2O43Q70o99j316J06J495J47j149j454k7J12o99j023J088Q28k577
$$ plain form
1119 -1619 -1418 2188 1055 -1857 -1077 -182 -2415 -2634 -15 318 -745 -1878 -2196 -1099 1332 1897 -141
1136 -141 299 2111 654 -171 2022 2780 526 228 318 219 -361 -233 -1115 -86 974 -1788 -3575 -897
1154 -897 566 -1227 -775 164 -524 -1199 -174 801 2242 2294 -467 -579 1908 2256 509 265 1212 344
1172 344 -855 -1541 -388 622 -667 -1659 -1112 -967 -1841 -1509 -711 938 421 -1253 -1512 875 1560 751
1190 751 1952 1967 874 411 852 1307 2669 1098 -1412 -844 635 -1585 -2133 -420 -823 -1235 -1762 -2583
1208 -2583 -1245 588 -589 -1218 1153 893 -1347 91 2115 2003 2385 1411 107 1366 2219 606
1224 606 652 2159 -278 -2502 -1017 -156 -1157 -1515 -1916 -2217 -1320 -1816 -2807 -715 915 -359 -1053 102
1242 102 1175 1202 1170 1813 2683 1984 668 774 2269 2416 1267 -187 -214 -102 -801 -1824 -736 92 -2485
1261b485j041J840L84o7M82K28L71Q64r42m45K888J131k120j77J257n63p63M04
1279A246M18k77o91j539n69J460P0j855P6N52n44j072Q63J607L75q80m12Q13P28
1298C69M09n7Q65N55o24j492N35J939n43j789K87L84j110j076N32L69M43j157
1316a161j444J139J090o58j82J451K58q93l53P17J546K86j257r9Q52m78p17O17
1334G14P52k55r32j247O97O16o12r97O69K52j183l79J078Q50O59n79q75J048R49
1353A225q78L06J526k97j763j26N84K34j52r18k70O66q32j121J080J328p86r31
1371a125k32M90Q83k11j16J077M56j404l81J324P39k27j88o48K67J31j204K17
1389a52J261p59j630qN82m67j05J5M55K30o28n79J255J702o44l19Q12J85r0q6
$$ plain form
1261 -2485 -3526 -1686 -1302 -1369 -887 -659 -288 576 -366 -811 2077 3208 1088 911 2168 1605 842 1246
1279 1246 1664 1387 696 -843 -1412 48 118 -1737 -1661 -1109 -1653 -2725 -1862 -255 120 -760 -1172 -359 369
1298 369 778 721 1586 2141 1517 25 560 2499 1956 167 454 838 -272 -1348 -816 -447 -4 -1161
1316 -1161 -2605 -1466 -376 -1034 -1216 235 493 -400 -753 -36 1510 1796 539 440 1292 814 97 714
1334 714 1466 1211 279 -968 -271 345 -267 -1264 -595 -343 -1526 -1905 -827 23 682 103 -772 276 1225
1353 1225 347 653 2179 1882 119 -7 577 811 659 -259 -529 137 -695 -1816 -736 592 -194 -1125
1371 -1125 -1357 -867 16 -195 -311 766 1222 -182 -563 761 1500 1273 1085 437 704 835 -369 -152
1389 -152 1109 350 -1280 -1288 -706 -1173 -1278 -1263 -808 -578 -1206 -1785 -530 1172 528 209 1021 1206 1116 1030
1409A030O5Q54r1j771o14J350j2p90m54J34k35n86r43Q10J239l71j672M24Q68
1428g65r9J20O13P30N51o70l68J409Q64q49m62P73n72q89l57N54K17m98j582m59
1448a739P31r0o85J25J189m11p92O3J001J235j90l98M76N61m42K12L69R46k75
1467A886r21q68R82Q1j192J62Q28j209j121J59j0Q23j83j694K90J483j79r66J778
1486A29P23o70k99N94N67N10k86o98N47N62j412p33J247N75j407m10m34J83k67
1505i79j59R7R45m58j504M72J466P51p49l30Q09L52m72J61J031Oo18m25J32K70
1525G98j02r51l8J214n80j841J71J097j33l55L51p40L6O57l65O91J570j085j500
1544a105J267J518p35n44P12m61n55j4m04L02P90j047r51Q90N22j387j57J128
$$ plain form
1409 1030 1095 1949 1858 87 -527 823 811 21 -433 -299 -534 -1120 -2063 -1253 -14 -385 -2057 -1633 -765
1428 -765 -864 -744 -131 599 1150 480 112 1521 2385 1536 1074 1847 1275 386 29 583 800 302 -1280 -1739
1448 -1739 -1008 -1098 -1783 -1658 -469 -880 -1672 -1609 -608 627 437 39 515 1076 634 846 1215 2161 1886
1467 1886 965 97 1079 1160 -32 130 958 -251 -1372 -1213 -1223 -400 -583 -2277 -1987 -504 -683 -1649 129
1486 129 852 182 -117 477 1044 1554 1268 570 1117 1679 267 -466 781 1356 -51 -461 -895 -712 -979
1505 -979 -1138 -1041 -96 -554 -2058 -1586 -120 631 -118 -448 361 713 241 402 1433 1439 821 396 528 798
1525 798 696 -255 -293 921 341 -1500 -1329 -232 -365 -720 -369 -1109 -1073 -416 -781 -90 1480 395 -1105
1544 -1105 162 1680 945 401 1113 652 97 83 -321 -19 771 -276 -1227 -337 185 -1202 -1359 -231
1562b31M64q73j22K78M82N42M36o39K61N09j055J03J424Q5j732l63P86j16p03
1581d64L40k80l75O14q68o54J408K11j260O80J454j141o98R48R94O62m25r53m15
1600b22J779j31r07K56J33r70q92Q91K57m31l63o61L54L87o60l74J112O17p52
1619e77n16J081K91k90L85R74L32q22m61M50M92R10j305j453N11L46j015j31Q27
1638B9o81r10j79N75J08Q17q88l04J401K75j244O83J576k91k93N52j64k99M17
1657A180k27J14L57p50j768O14J394j140p30L31k75m61J86rJ62O83o53j28Q30
1676b90O57m35j75J291N48r16l64N01P42n58N5k82m12k08n04l82J103j39j573
1695a341m55J049L21q25K92K84l6L24k6K3R85O07r30L9R68l35r19O33J010p83
$$ plain form
1562 -231 233 -640 -762 -484 -2 540 976 337 598 1107 52 155 1579 1664 -68 -431 355 239 -464
1581 -464 -124 -404 -779 -165 -1033 -1687 -279 -68 -1328 -648 806 -335 -1033 -85 909 1571 1146 193 -222
1600 -222 1557 1426 519 775 908 -62 -954 -63 194 -237 -600 -1261 -907 -520 -1180 -1554 -442 175 -577
1619 -577 -1093 -12 279 -11 374 1348 1680 858 397 847 1339 2249 944 -509 2 348 -667 -798 29
1638 29 -652 -1562 -1741 -1166 -1058 -241 -1129 -1433 -32 243 -1001 -318 1258 967 674 1226 1062 763 1180
1657 1180 953 1067 1424 674 -1094 -480 914 -226 -956 -625 -900 -1361 -1175 -1184 -1022 -339 -992 -1120 -290
1676 -290 367 -68 -243 1048 1596 680 316 817 1559 1001 1056 774 362 154 -350 -732 371 232 -1341
1695 -1341 -1796 -747 -426 -1251 -959 -675 -711 -387 -413 -390 595 1202 272 311 1279 944 25 658 1668 885
1715H85o43m03p9L79J73p98k54N08n54q33J000Q31n00o32J68O72L78k01j98N02
1735D01M52j81r53O48P85o43o82N69J71r88j30N11j7J01o79n89K06P69l31%Q94
1756C14p2o82J98Q36J22Q1m60J3M82l41n59K59P54n48q26q7K90K60l47k64J81
1777c96K31r12M3R76L21M8m93L42K10K87o20O64O67l50o52J66J48K55q56O6%K7
1799A72o81q48N70O51q74m65N59K65J74j11N44L05M68n60q5O79O23o10k36K97
1819H37q5n2m65K07K62r5j111m72P95n52p0J06j54k0n11k4R71O45k97j99O83L70
1841G69m37J34M96N97l95q60J95M49j45l34l55K26k88j195j10O37J69l86l92M45
1861g80J37nl57P57K80k46J73j90O11Q14p84L65M38K1r21L95K78K4o55r58M30
$$ plain form
1715 885 242 -161 -240 139 312 -486 -740 -232 -786 -1619 -619 212 -288 -920 -752 -80 298 97 -101 401
1735 401 853 672 -281 367 1152 509 -173 396 567 -421 -551 -40 -57 44 -635 -1224 -1018 -249 -580 -580 314
1756 314 242 -440 -242 594 716 797 337 350 832 491 -68 191 945 397 -429 -516 -226 34 -313 -577 -396
1777 -396 -165 -1077 -1034 -58 263 311 -182 160 370 657 37 701 1368 1018 366 532 680 935 79 145 145 172
1799 172 -509 -1357 -787 -136 -1010 -1475 -916 -651 -477 -588 -44 261 729 169 84 763 1386 776 540 837
1819 837 752 700 235 442 704 609 -502 -974 -179 -731 -801 -695 -849 -869 -1380 -1404 -433 212 -85 -284 399 769
1841 769 332 466 962 1559 1164 304 499 948 803 469 114 340 52 -1143 -1253 -616 -447 -833 -1225 -780
1861 -780 -643 -648 -1005 -248 32 -214 -41 -231 380 1194 410 775 1213 1234 313 708 986 1010 355 -603 -173
1882a73j69l78k25N56J8n14l54K7O76N76j95k28N23K66m40k4O31N97m52n91N37
1903F64K53j62n46m2N23o38o34J34N91l7o23j80J04J82k16q2O02P09q28p4L13
1924A3L11p9L22j2J86n7o95K73N07j73q35J09m7p9l09k92N69N37o36n79N75K26
1946a65o4J99K6L09K15m66m5N95M34p79j16J07K14l31l68J16L40k10q27J64N04
1967a48l23l33L43L25k77j05L20L63P32n42o93N47Q51p12R6N12k94n25l03O0P7
1988b9K42p26j79J45J81q48K77P51l5n20m9N35M18P5j22O32M3o4m10j16R43K2
2010A166p99j27L53k58o41j53M91m35l43j67k10P17r5n54J26R59l45n14Q42M79
2030D92j46q5K98J54n3J52m44N62J96q62p61N90M50q25m4m24J9R4j50k9J26M39
$$ plain form
1882 -173 -342 -720 -945 -389 -371 -885 -1239 -1212 -536 40 -155 -383 140 406 -34 -58 573 1170 718 127 664
1903 664 917 755 209 167 690 52 -582 -448 143 106 -517 -697 -593 -411 -627 -709 -107 602 -226 -300 13
1924 13 324 245 567 555 741 684 -11 262 769 596 -239 -130 -177 -256 -565 -857 -288 249 -387 -966 -391 -165
1946 -165 -229 -30 -4 305 520 54 9 604 1038 259 143 250 464 133 -235 -119 221 11 -816 -652 -148
1967 -148 -471 -804 -461 -136 -413 -518 -198 165 897 355 -338 209 1060 348 444 956 662 137 -166 -106 -29
1988 -29 213 -513 -692 -547 -366 -1214 -937 -186 -221 -741 -790 -255 163 238 116 748 791 727 317 201 1144 1166
2010 1166 367 240 593 335 -306 -459 32 -403 -746 -913 -1123 -406 -501 -1055 -929 30 -315 -829 13 492
2030 492 346 261 559 713 660 812 368 930 1126 264 -497 93 543 -282 -326 -750 -731 -637 -787 -816 -690 -251
2052b51p84L15Q06j12j75k01Q54L37l36l1P1L89L01n55k69Q1J21n23k35P35l05
2073B33j273K75K56j37J42j76k20K94M91o53J13J130j50p05J158N4p91K67K93
2092F01l00N50l07o23K4O29m06o35N31k11n22j23M88m1k91n7J58K44M68m90J3
2113c00M76P22n98j10M91K5m80M49l00q4r8j66nM1M95j229l75P76K30n83L95K45
2135A7n06n2N19L2K88K66p43J1J179m22q42P71K64n08l49L80k99k92L20k30j29
2156c25K70n07n81N77Q02m30n07L84K63M7L1M41J84j67k4k73L80J36m29n16Q15
2177E71k54o79k41M48k59rN3l81J8K88J42r8R70k28q75L53O61J84o4J08k51r3
2199C64N84q60K97J89j87q93L54L71n18m77L56J4K5p1n12Q33K92l37k78L57L37
$$ plain form
2052 -251 -1035 -720 86 -26 -201 -402 452 789 453 422 493 882 1183 628 359 440 561 38 -197 538 233
2073 233 -1040 -765 -509 -646 -504 -680 -900 -606 -115 -768 -655 475 325 -380 778 832 41 308 601
2092 601 301 851 544 -79 -55 574 168 -467 64 -147 -669 -792 -304 -345 -636 -693 -535 -291 177 -313 -300
2113 -300 176 898 300 190 681 706 226 675 375 291 193 27 22 63 558 -671 -1046 -270 -40 -623 -228 17
2135 17 -489 -541 -22 10 298 564 -179 -168 1011 589 -253 518 782 274 -75 305 6 -286 34 -196 -325
2156 -325 -55 -562 -1143 -566 236 -194 -701 -317 -54 -7 24 465 649 482 458 185 565 701 272 -244 571
2177 571 317 -362 -603 -155 -414 -423 -370 -751 -733 -445 -303 -401 569 341 -534 -181 480 664 600 708 457 364
2199 364 948 88 385 574 387 -506 -152 219 -299 -776 -420 -406 -381 -452 -964 -131 161 -176 -454 -97 240
2220B40J49l69P17K00m33k68N11j1j18k40k74q9K41m17m42L56j01m16k05N82l24
2241g11l94M33J16M06K34m59JQ18J59k32J00J33Ql06J13J90k21m8l42l79N53k95
2263a23p86L87K74m83k19K39K50J16j63J91M9J12J67K12K90L99l22n33K16M58
2283G31k95p9r4N5j96k86k45K41N5m01k61L75J76m90J30K10L73j46l08M61K18
2304B24K47m24M14L08l11j5J2K41k55j00l48J65j25m13k08L45K23m07k63J36L84
2325a70Mj44J52J64J38m48K55O09N3l63j26J32K21k3k80k23K26j46n39J52N62
2346B06m43p3R7J50j49r5K06K31K46m53L6L67K32k62N9j36K74k59j88%L94k21
2368B19n15nM20o38rJ28j05K76k49l37N78M87l52J51L25l4Q5j83l1N26r4m58L3
$$ plain form
2220 240 389 20 737 937 504 236 747 736 618 378 104 15 256 -161 -603 -247 -348 -764 -969 -387 -711
2241 -711 -1105 -672 -556 -150 84 -375 -374 444 603 371 471 604 612 306 419 609 388 340 -2 -381 172 -123
2263 -123 -909 -522 -248 -731 -950 -711 -461 -345 -508 -317 -268 -156 11 223 513 912 590 57 273 731
2283 731 436 357 263 318 122 -164 -409 -168 -113 -514 -775 -400 -224 -714 -584 -374 -1 -147 -455 6 224
2304 224 471 47 461 769 458 443 455 696 441 341 -7 158 33 -380 -588 -243 -20 -427 -690 -554 -170
2325 -170 -166 -310 -158 6 144 -304 -49 560 613 250 124 256 477 454 174 -49 177 31 -508 -356 206
2346 206 -237 -310 -213 -63 -212 -307 -101 130 376 -77 -41 326 558 296 355 219 493 234 46 46 440 219
2368 219 -296 -301 119 -519 -528 -400 -505 -229 -478 -815 -237 250 -102 49 374 340 425 242 211 737 643 185 218
2391B18K29j75k54O4j02R5m57r1j24K88p0l88K07L65Q3l07M16M45k36j21j46M04
2413C43K51k67j8K99n2l30J13r9L9j62j75k67K43m11j66Q7L09k65j41l7K80L71
2435e5Q2j18L94q7M7k70M59J66j9q1K7n0o1l98J24o7j01k42m86K91Q0k14k9n3
2459f61K29O1j76J68M01j29K0M10jJ7K5L4J99K90o96L58j77J56m76p0L20o24p9
2482d01j02J02L2k43j09L47J08J39J2lL48J72n15L07M11k6l19J9LNK50n93Q9N44
2506E77n20o23J37K14j9j27k37O51k89k2M7Q6J23M0l18M46N04l76l25L24Q4R7
2528D74l18j4k5L0j31j67L31k84k19j74L09K10l11K3r6L92k3j58J35j72M15m5
2550A82m4J39Kk18J72P9q1l51Q5j73J55J44l93l64J84L14n20N07J27j18n39O35
$$ plain form
2391 218 447 272 18 82 -20 75 -382 -473 -597 -309 -379 -767 -560 -195 -112 -419 -3 442 206 85 -61 343
2413 343 594 327 309 608 556 226 339 240 279 117 -58 -325 -82 -493 -659 -572 -263 -528 -669 -706 -426 -55
2435 -55 27 -91 303 216 263 -7 452 618 599 518 545 495 434 36 160 93 -8 -250 -736 -445 -365 -579 -608 -661
2459 -661 -432 -371 -547 -379 22 -107 -87 323 322 339 364 398 597 887 191 549 372 528 52 -18 302 -322 -401
2482 -401 -503 -401 -369 -612 -721 -374 -266 -127 -115 -118 230 402 -113 194 605 579 260 279 282 287 537 -56 33 577
2506 577 57 -566 -429 -215 -234 -361 -598 53 -236 -258 -211 -125 -2 38 -280 166 670 294 -31 293 377 474
2528 474 156 142 117 147 16 -151 180 -104 -323 -497 -188 22 -289 -266 -362 30 7 -151 -16 -188 227 182
2550 182 138 277 279 61 233 312 231 -120 -35 -208 -53 91 -302 -666 -482 -168 -688 -181 -54 -172 -711 -76
2572g6M08j02j72K66k99M08j8j33j49K37n4l04J30Pl06k00Q7P8r7k4m92M31M01
2595B7k74m38P73j44k00J62P80q5m36K78k30L90M0j88m32J40O8o38M62P9n58j77
2617f01L53k21l8j09l0J37L58M5m44M57M34j15j88O11j67j09J41J2oN6l56j4k47
2640d1K70k81m04K57q5k56K27m58J62L75l02L31J10O3m63L18M05M17m72j13K98
2661C58J67K8R3k84k22K92k97o2R5k00n56J36L72k56l23K27qnK16qM0J45L50j55
2685A43J94O0m4l37L38M73m50p8l97L18j09l3k44p6L7j63l01K68J70j35J99K7
2707a40J7j50J51j2J06L82r4k92L41K28n43M35O9K1m65J37l27J57J10m20l00L93
2729a96n8o2OM41j59k26K63J83j15l20L70MJ65k33K04k89N16k83l01K57Q8m44
$$ plain form
2572 -76 332 230 58 324 25 433 415 282 133 370 316 12 142 149 -157 -357 -270 -192 -289 -313 -805 -374 27
2595 27 -247 -685 88 -56 -256 -94 686 601 165 443 213 603 643 455 23 163 231 -407 55 134 -424 -601
2617 -601 -248 -469 -507 -616 -646 -509 -151 -106 -550 -93 341 226 38 649 482 373 514 526 520 576 220 206 -41
2640 -41 229 -52 -456 -199 -284 -540 -313 -771 -609 -234 -536 -205 -95 -32 -495 -177 228 645 173 60 358
2661 358 525 553 646 362 140 432 135 73 168 -32 -588 -452 -80 -336 -659 -432 -440 -445 -229 -237 -197 -52 298 143
2685 143 337 397 353 16 354 827 377 299 -98 220 111 78 -166 -242 -205 -368 -669 -401 -231 -366 -167 -140
2707 -140 -123 -273 -122 -134 -28 354 260 -32 309 537 -6 429 498 519 54 191 -136 21 131 -289 -589 -196
2729 -196 -254 -316 -310 131 -28 -254 9 192 77 -243 127 131 296 63 267 -22 494 211 -90 167 255 -189
2751a89j16j8M9P3J01j20j96L41J50k09J14K53l35oL13Q9ok69K12k12L92j24k29
2774E8J39j37j02m20P6L88m46K07k17L36k17k25L29J36K03j70M04q6O6k34J49
2795B37J75L3k71L25k36j22L91n19j25m7m28J79j26J11O0j81J29kJ23J62K08o7
2817Iq9J71k1J4N17j89k62J34K32j65j55m0K51j12m27l12J90P8j77l29M75k38
2839d45j5QN12j59q5O3J09J95O2J27l3J48K58m51j10J13J48j80j03O1k89r7m06
2862e69K63J63n41L25j40L20j56K14k0K47l9O1j99M40j08J0K31m73J95J6p8L1
2884A93P1k93l3j48MO0j34L4%j01j12j02N17Q5l75L35o3P1j28P2M03k9P3j68j39
2909I3K58k16k05J74L6k53j15k16L28J52k77l9J73j97N5o2L95J68J81n99L75k7
$$ plain form
2751 -189 -305 -323 -274 -201 -100 -220 -416 -75 75 -134 -20 233 -102 -108 205 294 288 19 231 19 411 287 58
2774 58 197 60 -42 -462 -386 2 -444 -237 -454 -118 -335 -560 -231 -95 108 -62 342 256 322 88 237
2795 237 412 445 174 499 263 141 532 13 -112 -159 -587 -408 -534 -423 -363 -544 -415 -417 -294 -132 76 9
2817 9 -80 91 70 84 601 412 150 284 516 351 196 156 407 295 -132 -444 -254 -176 -353 -682 -207 -445
2839 -445 -460 -452 60 -99 -184 -121 -12 183 245 372 339 487 745 294 184 297 445 265 162 223 -66 -163 -569
2862 -569 -306 -143 -684 -359 -499 -179 -335 -121 -141 106 67 128 -71 369 261 271 502 29 224 240 162 193
2884 193 264 -29 -62 -210 -206 -146 -280 -246 -246 -347 -459 -561 -44 41 -334 1 -62 9 -119 -47 356 327 400 232 93
2909 93 351 135 -70 104 140 -113 -228 -444 -116 36 -241 -280 -107 -304 -249 -311 84 252 433 -166 209 182
2931A82J78k06J31P8j79k19o6K38r9k22O5M4N0k13j01K03j90P6l2P2K09jM1J24
2955A63j3k0K72l29L29J89n73j5M23k97oj36m7j57l0k89K05p2Q7j10Q2N05r3n08
2979d40N91L3j94L15j85K92r1j15J8pJ13k98l5L55l60r6l76J69Lm0J7k11L24j1
3003b29O6N4K89j69QL04L3k20O6m1J61Jr5j06P4j94J66k52j0j40J43l64J53M4
3027b58l9j11k90M52J3m8L27l47N14P9L9j86L08j70Q5m2M6o3J19k28k96L08j01
3050A11l80K12l71J10J06r7j18K18O9j65N8L18k74M11j46K66k93lM18l0n2p9m19
3073a30L37P6r6k57K28p9k81J41k66O6RJ3k45J50J94K88k25K29L40l18k1Jj68
3096a4K19K88j27l72o8K9J18K29k04j46j14q1O0o3J9J54k70j25L41K78k20J66
$$ plain form
2931 182 360 154 285 363 184 -35 -101 137 38 -184 -119 -75 -25 -238 -339 -136 -326 -250 -282 -210 -1 -2 39 163
2955 163 150 130 402 73 402 591 18 3 426 129 123 -13 -60 -217 -247 -536 -331 -403 -316 -426 -344 161 68 -440
2979 -440 151 184 -10 305 120 412 321 206 224 217 330 32 -3 352 -8 -104 -480 -311 -308 -348 -331 -542 -218 -229
3003 -229 -163 -109 180 11 19 323 356 136 202 161 322 323 228 122 196 2 168 -84 -94 -234 -91 -455 -302 -258
3027 -258 -297 -408 -698 -246 -233 -281 46 -301 213 292 331 145 453 283 368 326 372 309 428 200 -96 212 111
3050 111 -269 -57 -428 -318 -212 -309 -427 -209 -140 -305 -247 71 -203 208 62 328 35 32 450 420 368 289 -130
3073 -130 207 283 187 -70 158 79 -202 -61 -327 -261 -252 -239 -484 -334 -140 148 -77 152 492 174 153 154 -14
3096 -14 205 493 366 -6 -74 -45 73 302 98 -48 -162 -243 -183 -246 -227 -73 -343 -468 -127 151 -69 97
3118I7j56J60J89l21j56M85L18m99O6k3j70l7J21l39M03n41J70M9J15k3j24l19
3140e35M02M51l60j10L12O2J6J76P0M8k82j01R5J68j32n78K47o3PJ3k9l14J74
3163b63Lk37J09O75k74l07J55qj05K88J54J7P8K06j84q1L21m03l0J3N0k42k28
3186b93L95m8l70N2j12J48Rm4L42q7j72L18Nl1J7P9K55J08k42j01o6P2o7l6j49
3211a8R2l5m52P4O1M2k50J09Q3Q1K18J58k63K30J49Q5l85K74K16k63l3J98N3J0
3235D34j13j16j8l1k49q7M0m6k70j71M79m00L2L46K96m70K05M75l12N2K89k54
3257A11J4J09J00N5j86L3J45j42K16m76j22L0j42k14J48J16j71K48P0L1k07L9
$$ plain form
3118 97 -59 101 290 -31 -187 298 616 117 183 160 -10 -47 74 -265 138 -403 -233 -184 -69 -92 -216 -535
3140 -535 -133 318 -42 -152 160 222 238 414 484 532 250 149 244 412 280 -298 -51 -114 -107 -94 -123 -437 -263
3163 -263 -260 -497 -388 287 13 -294 -139 -147 -252 36 190 207 285 491 307 226 547 144 114 127 177 -65 -293
3186 -293 102 54 -316 -264 -376 -228 -219 -263 79 -8 -180 138 143 112 129 208 463 571 329 228 162 234 167 131 -18
3211 -18 74 39 -413 -339 -278 -236 -486 -377 -294 -213 5 163 -100 130 279 364 -21 253 469 206 173 371 424 434
3235 434 321 205 187 156 -93 -180 -140 -186 -456 -627 -148 -548 -516 -170 126 -344 -139 336 24 76 365 111
3257 111 125 234 334 389 203 236 381 239 455 -21 -143 -113 -255 -469 -321 -205 -376 -128 -58 -27 -234 -195
$$ [...]
8191a17
##END NTUPLES=NMR FID
##END=
