##TITLE=1H_SL34(mCPBH)
 CDCl3
 40 sc, 
 17.11.2021
##JCAMPDX= 6.0         $$ Bruker NMR JCAMP-DX V2.0
##DATA TYPE= NMR FID
##DATA CLASS= NTUPLES
##ORIGIN= UXNMR, Bruker Analytische Messtechnik GmbH
##OWNER= root
$$ XWIN-NMR		Version 3.5
$$ Wed Nov 17 11:58:15 2021 Russian Standard Time (UT+4h)  she@DPX200
##.OBSERVE FREQUENCY= 200.131346
##.OBSERVE NUCLEUS= ^1H
##.DELAY= (6, 6)
##.ACQUISITION MODE= SIMULTANEOUS
##.ACQUISITION SCHEME= undefined
##.AVERAGES= 32
##.DIGITISER RES= 18
##SPECTROMETER/DATA SYSTEM= spect
##.PULSE SEQUENCE= zg30
##.SOLVENT NAME= Acetone
##.SHIFT REFERENCE= (INTERNAL, Acetone, 0, 15.7039)
##AUDIT TRAIL= $$ (NUMBER, WHEN, WHO, WHERE, WHAT)
$$ ##TITLE= Audit trail, XWIN-NMR		Version 3.5
$$ ##JCAMPDX= 5.01
$$ ##ORIGIN= Bruker BioSpin GmbH
$$ ##OWNER= she
$$ F:/spectra/data/she/nmr/H-F/1/audita.txt
$$ ##AUDIT TRAIL=  $$ (NUMBER, WHEN, WHO, WHERE, WHAT)
(   1,<2021-11-17 11:57:17.62 +0400>,<she>,<DPX200>,
      <created by zg, POWCHK disabled, PULCHK disabled
       configuration hash MD5:
       00 E9 B6 7A A2 85 ED C7 34 08 36 98 17 FE 4E 26
       data hash MD5: 16K
       1A 60 AE 96 C0 EB FE BC 5F B7 33 E1 22 60 0A CF>)
$$ ##END=
$$ 
$$ hash MD5
$$ AF FC 34 8A 2D 1C 2B DA EB 3E 4E 74 45 F4 DE 96
##$RELAX= 
##$RELAX= 
##$RELAX= 
##$RELAX= 
##$RELAX= 
##$RELAX= 
$$ Bruker specific parameters
$$ --------------------------
##$DU= <F:/spectra>
##$EXPNO= 1
##$NAME= <H-F>
##$PROCNO= 1
##$TYPE= <nmr>
##$USER= <she>
##$AMP= (0..31)
100 100 100 100 100 100 100 100 100 100 100 100 100 100 100 100 100 100 
100 100 100 100 100 100 100 100 100 100 100 100 100 100 
##$AQSEQ= 0
##$AQ_mod= 1
##$AUNM= <au_zg>
##$AUTOPOS= <>
##$BF1= 200.13
##$BF2= 200.13
##$BF3= 200.13
##$BF4= 200.13
##$BF5= 200.13
##$BF6= 200.13
##$BF7= 200.13
##$BF8= 200.13
##$BYTORDA= 1
##$CFDGTYP= 0
##$CFRGTYP= 5
##$CHEMSTR= <none>
##$CNST= (0..31)
1 1 145 1 1 1 1 1 1 1 1 1 1 1 1 1 1 1 1 1 1 1 1 1 1 1 1 1 1 1 1 1 
##$CPDPRG= <>
##$CPDPRG1= <>
##$CPDPRG2= <>
##$CPDPRG3= <>
##$CPDPRG4= <mlev>
##$CPDPRG5= <mlev>
##$CPDPRG6= <mlev>
##$CPDPRG7= <mlev>
##$CPDPRG8= <mlev>
##$CPDPRGB= <>
##$CPDPRGT= <>
##$D= (0..31)
0 1.2 0 0 0 0 0 0 0 0.06 0 0.03 0 0 0 0 0.0002 0 0 0 0 0 0 0 0 0 0 0 0 
0 0 0 
##$DATE= 1637135837
##$DBL= (0..7)
120 120 120 120 120 120 120 120 
##$DBP= (0..7)
150 150 150 150 150 150 150 150 
##$DBP07= 0
##$DBPNAM0= <>
##$DBPNAM1= <>
##$DBPNAM2= <>
##$DBPNAM3= <>
##$DBPNAM4= <>
##$DBPNAM5= <>
##$DBPNAM6= <>
##$DBPNAM7= <>
##$DBPOAL= (0..7)
0.5 0.5 0.5 0.5 0.5 0.5 0.5 0.5 
##$DBPOFFS= (0..7)
0 0 0 0 0 0 0 0 
##$DE= 6
##$DECBNUC= <off>
##$DECIM= 32
##$DECNUC= <off>
##$DECSTAT= 4
##$DIGMOD= 1
##$DIGTYP= 9
##$DL= (0..7)
0 120 120 120 120 120 120 120 
##$DP= (0..7)
150 150 150 150 150 150 150 150 
##$DP07= 0
##$DPNAME0= <>
##$DPNAME1= <>
##$DPNAME2= <>
##$DPNAME3= <>
##$DPNAME4= <>
##$DPNAME5= <>
##$DPNAME6= <>
##$DPNAME7= <>
##$DPOAL= (0..7)
0.5 0.5 0.5 0.5 0.5 0.5 0.5 0.5 
##$DPOFFS= (0..7)
0 0 0 0 0 0 0 0 
##$DQDMODE= 0
##$DR= 18
##$DS= 0
$$ [...]
##$SUBNAM2= <"">
##$SUBNAM3= <"">
##$SUBNAM4= <"">
##$SUBNAM5= <"">
##$SUBNAM6= <"">
##$SUBNAM7= <"">
##$SUBNAM8= <"">
##$SUBNAM9= <"">
##$SW= 18.0517287032376
##$SWIBOX= (0..15)
0 0 2 0 0 0 0 0 0 0 0 0 0 0 0 0 
##$SW_h= 3612.71676300578
##$TD= 16384
##$TD0= 1
##$TE= 0
##$TE2= 300
##$TE3= 300
##$TEG= 300
##$TL= (0..7)
0 120 120 120 120 120 120 120 
##$TP= (0..7)
150 150 150 150 150 150 150 150 
##$TP07= 0
##$TPNAME0= <>
##$TPNAME1= <>
##$TPNAME2= <>
##$TPNAME3= <>
##$TPNAME4= <>
##$TPNAME5= <>
##$TPNAME6= <>
##$TPNAME7= <>
##$TPOAL= (0..7)
0.5 0.5 0.5 0.5 0.5 0.5 0.5 0.5 
##$TPOFFS= (0..7)
0 0 0 0 0 0 0 0 
##$TUNHIN= 0
##$TUNHOUT= 0
##$TUNXOUT= 0
##$USERA1= <user>
##$USERA2= <user>
##$USERA3= <user>
##$USERA4= <user>
##$USERA5= <user>
##$V9= 5
##$VALIST= <valist>
##$VCLIST= <CCCCCCCCCCCCCCC>
##$VD= 0
##$VDLIST= <DDDDDDDDDDDDDDD>
##$VPLIST= <PPPPPPPPPPPPPPP>
##$VTLIST= <TTTTTTTTTTTTTTT>
##$WBST= 1024
##$WBSW= 4
##$XGAIN= (0..3)
0 0 0 0 
##$XL= 0
##$YL= 0
##$YMAX_a= 147860
##$YMIN_a= -168201
##$ZGOPTNS= <>
##$ZL1= 120
##$ZL2= 120
##$ZL3= 120
##$ZL4= 120
##$ABSF1= 10
##$ABSF2= 0
##$ABSG= 5
##$ABSL= 3
##$ALPHA= 0
##$AQORDER= 0
##$ASSFAC= 0
##$ASSFACI= 0
##$ASSFACX= 0
##$ASSWID= 0
##$AUNMP= <proc_1d>
##$AZFE= 0.1
##$AZFW= 0.1
##$BCFW= 1
##$BC_mod= 2
##$BYTORDP= 1
##$COROFFS= 0
##$CY= 11.3945322036743
##$DATMOD= 1
##$DC= 2
##$DFILT= <>
##$DTYPP= 0
##$F1P= 2.36226072786647
##$F2P= -0.459571619588291
##$FCOR= 0.5
##$FTSIZE= 0
##$FT_mod= 4
##$GAMMA= 1
##$GB= 0.15
##$INTBC= 1
##$INTSCL= 1
##$ISEN= 128
##$LB= 0.24
##$LEV0= 0
##$LPBIN= 0
##$MAXI= 10000
##$MC2= 0
##$MEAN= 0
##$ME_mod= 0
##$MI= 1.114404
##$NCOEF= 0
##$NC_proc= 0
##$NLEV= 6
##$NOISF1= 3.799351
##$NOISF2= 2.8
##$NSP= 1
##$NTH_PI= 0
##$NZP= 0
##$OFFSET= 15.70392
##$PC= 1
##$PHC0= -15514.54
##$PHC1= 16.20081
##$PH_mod= 1
##$PKNL= yes
##$PPARMOD= 0
##$PSCAL= 0
##$PSIGN= 0
##$REVERSE= no
##$SF= 200.130013532006
##$SI= 16384
##$SIGF1= 3
##$SIGF2= 2
##$SINO= 400
##$SIOLD= 16384
##$SREGLST= <1H.CDCl3>
##$SSB= 0
##$STSI= 0
##$STSR= 0
##$SW_p= 3612.71676300578
##$SYMM= 0
##$S_DEV= 0
##$TDeff= 0
##$TDoff= 0
##$TI= <>
##$TILT= no
##$TM1= 0
##$TM2= 0
##$TOPLEV= 0
##$USERP1= <user>
##$USERP2= <user>
##$USERP3= <user>
##$USERP4= <user>
##$USERP5= <user>
##$WDW= 1
##$XDIM= 8192
##$YMAX_p= 0
##$YMIN_p= 0
$$ End of Bruker specific parameters
$$ ---------------------------------
##NTUPLES= NMR FID
##VAR_NAME=  TIME,          FID/REAL,        FID/IMAG
##SYMBOL=    X,             R,               I
##VAR_TYPE=  INDEPENDENT,   DEPENDENT,       DEPENDENT
##VAR_FORM=  AFFN,          ASDF,            ASDF
##VAR_DIM=   8192,          8192,            8192
##UNITS=     SECONDS,       ARBITRARY UNITS, ARBITRARY UNITS
##FACTOR=    0.0002768,     1,               1
##FIRST=     0,             0,               0
##LAST=      2.2672688,     0,               0
##MIN=       0,             -168201,         0
##MAX=       2.2672688,     147860,          0
$$ Real data points
##PAGE= N=1
##DATA TABLE= (X++(R..R)), XYDATA
0 0 0 0 0 0 0 0 0 0 0 0 0 0 0 0 0 0 0 32 -32 32 -32 32 -34 64 -64 64 -96 96 -121 128 -160 164 -193 224 -253
35 -253 284 -317 355 -394 444 -491 545 -605 672 -743 818 -905 1000 -1099 1212 -1334 1472
52 1472 -1621 1792 -1975 2186 -2426 2703 -3022 3394 -3845 4393 -5082 5980 -7192 8942 -11700
67 -11700 16727 -28993 140649 63699 -40532 147860 27517 -62570 33321 26991 -85523
78 -85523 -10948 7870 -52899 -24721 7649 -40775 -8073 15959 -18612 -13827 -5099 -49053 -27009
91 -27009 -1032 -29493 -15223 27363 12778 28248 50953 5861 -13699 18639 -4290 -32681
103 -32681 -10875 -986 -8823 863 6013 14931 22621 -867 -3155 26238 12304 -13090 1949
116 1949 -1510 -27691 -16429 -4079 -16863 -10233 10747 18041 10432 -3710 -4664 4862 -9256 -16135
130 -16135 10826 18184 4967 19213 30733 16118 11803 8896 -2174 1057 2701 -6440 -5229
143 -5229 -10324 -15519 2793 21 -18015 3568 15603 -13133 -2527 14255 -25784 -31017 1758
156 1758 -22672 -38578 2791 757 -24028 7541 21260 -2593 6805 16068 6419 24503 29586
169 29586 6259 18709 25725 -5256 -3208 8128 -21602 -24774 761 -14113 -25043 -2787 -10053
182 -10053 -21739 -1926 4078 -2121 8571 7938 1220 12544 8428 -1006 10968 12592 8269 24022
196 24022 22759 2887 13382 15556 -11798 -12587 -432 -16772 -22617 -2440 -1856 -9623 -829 2899
210 2899 -2728 -886 -647 -6189 -9349 -11731 -11701 -11000 -12450 -10198 -4497 -1013 3769 7994 8878 11662
226 11662 9052 2494 4570 4997 -1363 6885 14242 6041 10903 18236 3283 -2610 6676 -7418 -20027
241 -20027 -8474 -12528 -21126 -6656 -2079 -9217 3780 9869 509 9832 12814 -3001 2150 6290
255 6290 -9502 -3853 8610 -2081 3143 19202 10589 8349 18778 7094 -2619 2556 -8452
268 -8452 -17062 -7429 -11229 -15538 -1874 -4283 -10265 3666 375 -12549 -875 -1445 -17685 -6185
282 -6185 1878 -11993 -3650 9702 842 4996 16717 8239 8777 15932 4765 1228 9159 899
296 899 -835 10065 2306 -1444 8072 833 -7781 -3040 -9299 -17171 -7967 -9054 -13171 -555 714
311 714 -3916 7330 8513 2 6107 7281 -1722 4557 4494 -6234 3766 9866 -1335 6178 16625
326 16625 1954 1292 10892 -2477 -9354 -2066 -10790 -14341 -4183 -7548 -8605 3493 -2790 -8036
340 -8036 3034 -2319 -12845 -2893 -1668 -9447 -1918 2300 -2283 6590 9683 4474 12011 13395 3811
355 3811 8228 9654 -2768 -735 2771 -4067 2556 8001 -2516 1817 7641 -9469 -11238 782
369 782 -13613 -20276 -2235 -4508 -10740 3417 5896 267 10465 10843 3282 8808 6567 -4027
383 -4027 2137 2436 -7841 -501 7736 1279 5587 12328 5613 3685 3518 -5800 -6543 -6415 -16345 -13568
399 -13568 -5346 -10530 -8681 -1877 -6161 -2845 2921 -4254 -778 8562 -2104 -2350 11882 3718 -1827
414 -1827 15659 13634 4295 16828 15342 120 3881 1964 -10222 -4101 -4742 -15440 -2777 4279
428 4279 -12756 -6519 5956 -7897 -6744 7222 -1518 -4032 7866 -570 -5531 8109 1886 -6418
442 -6418 6708 5905 -4743 4861 5318 -7289 -416 4092 -4933 606 6693 62 5846 9872 -2456
457 -2456 426 8438 -4871 -9525 2109 -1921 -10629 -6498 -6138 -11196 -8904 -8750 -8610 -1019 841
472 841 2106 6040 6901 5921 7717 8095 7893 8234 8838 7932 5442 304 1490 1918 -3844 -3459 2782 16
490 16 -2447 -208 -6262 -8019 -3980 -11693 -15198 -2048 -1632 -10318 1464 6022 -1884 3914 9890
505 9890 1877 5896 11272 3036 4327 7888 -65 1035 7435 -1798 -620 11232 1197 -6607 2039
520 2039 -4741 -16240 -10148 -11330 -15279 -3959 -1979 -6492 4955 8553 -1459 4549 9077 518
534 518 4218 8996 -1127 200 6858 -2787 -2760 7743 1022 -572 9562 1498 -6277 1898 -1788
549 -1788 -11681 -4146 1892 -2663 2189 6532 3097 5189 4059 -3630 -2976 -2350 -8814 -9038 -4946 -6932
565 -6932 -6914 -2394 -1296 351 5016 7651 7767 7936 8282 7506 3017 178 2404 1472 380 4036 3303
582 3303 -227 2059 -224 -8871 -7693 -5834 -11625 -9923 -4825 -7544 -5466 -736 -3190 884 7793
597 7793 3083 4260 11297 4976 1302 8792 3028 -2771 6564 4956 -2330 5721 6924 -2240 1853
612 1853 1608 -7892 -4202 -1587 -11449 -6561 791 -9253 -6954 3059 -5639 -5659 6148 -698 -4099
627 -4099 7749 3374 -4035 7104 6635 -2451 6335 9182 -387 4691 8428 -1227 680 3210 -5367
642 -5367 -3374 1603 -5231 -3947 2444 -4877 -5873 1686 -3630 -5406 1389 -835 -4069 606 -86 -3320
658 -3320 694 -750 -1847 1894 1710 -737 3901 4163 814 4715 4632 70 4037 5280 -837 917
674 917 3281 -1877 -2580 -510 -3370 -2950 -2701 -4832 -2988 -1851 -4995 -3684 -2036 -4365 -2281 987
690 987 -1161 1396 5242 3799 4319 6999 4091 4360 6691 2165 1305 4653 420 -1475 1887 -1736
706 -1736 -3248 949 -3649 -6290 275 -2655 -9090 -1683 -1401 -8467 -3352 -251 -5854 -696 4098
721 4098 -1601 1954 6674 -796 761 6592 -271 -188 7390 1663 -1661 6843 3238 -2584 4236 2172
737 2172 -3222 2274 1019 -5610 -269 -364 -8772 -4210 -330 -6353 -3171 1815 -3317 -479 3259 -1793
753 -1793 -1453 5206 745 254 7311 3828 888 7255 4709 -697 2757 3679 -1556 -160 1414 -1484
769 -1484 -979 -1516 -4819 -2406 -1684 -5102 -4041 -1095 -2718 -3832 -2855 -3178 -2354 -807 -940 880 2319
786 2319 2084 3550 3775 1784 2719 3170 979 3020 3566 1177 2492 2505 -2039 473 2412 -3383 -2676
803 -2676 1907 -2126 -3856 -604 -3227 -5142 -923 -3101 -3405 1212 -372 -2591 1899 2534 -1397 2825
819 2825 4277 1679 4235 6024 3009 3080 3412 -207 398 1347 -2573 -1758 45 -3243 -4538 -1864 -3772
836 -3772 -4586 -2425 -4070 -3173 -354 -3319 -4174 768 -1020 -3323 1970 2008 -353 3704 5272 2866
852 2866 4049 4043 1749 3193 2593 128 2235 2641 -1472 -101 883 -2730 -1417 297 -1637 -642 584
869 584 -2530 -2246 -672 -3433 -3068 404 -1206 -952 1509 257 -624 1261 491 -283 2687 507 1003
886 1003 4248 2370 -907 2887 2185 -853 1403 1781 -1240 -433 -509 -3664 -2317 -1714 -5253 -2760 -1491
903 -1491 -4767 -2508 -360 -3871 -2959 -15 -2423 -2144 2509 882 1385 5434 3806 2961 6018 5192
919 5192 2878 5547 3802 1261 2918 433 -4062 -1261 -3088 -5469 -2130 -1528 -4925 -1513 -199
934 -199 -4974 -2544 456 -2365 -663 1563 95 1674 2547 511 2347 5084 1660 2541 4865 1474
950 1474 419 2571 -1056 -2957 -1447 -3446 -4132 -955 -2591 -4440 -487 -2425 -3766 231 -870
965 -870 -3192 1431 1313 -2122 2577 2647 -2004 1325 3418 -2193 1020 4165 -347 -64 4402 -94
981 -94 -1241 4274 1301 24 5130 1945 -1292 3650 887 -2976 1172 197 -4288 -310 -519 -5137
997 -5137 -2508 -226 -4289 -2476 -194 -3100 -1859 888 -2013 -1067 2327 -101 867 4274 2673 2277
1013 2277 5531 3140 1616 4275 1435 -1443 7 -1808 -4703 -2426 -2998 -4977 -3581 -3234 -4137 -2062
1029 -2062 -1499 -2444 -277 1037 -600 1405 2106 845 2743 3764 2287 3490 4242 3093 2555 3051
1045 3051 1892 2031 1319 -372 362 175 -2793 -1667 -1612 -4229 -2926 -1126 -3608 -3429 -115 -1647 -2167
1062 -2167 1360 528 -858 1935 515 -834 2369 410 -1303 1699 1181 -1364 1437 1944 -1421 1226
1078 1226 1926 -852 418 2369 -1698 -1067 713 -1975 -2209 999 -2274 -2878 431 -1394 -3007 223
1094 223 -939 -1970 1434 191 -541 3281 1208 -1097 2581 2938 299 2400 3995 1287 3047 4257
1110 4257 417 1074 2665 -654 -1043 936 -1977 -4266 -1322 -3370 -5126 -2454 -2229 -4528 -1851 694
1126 694 -637 -405 1287 -69 1248 2207 237 484 2916 2110 743 1071 1646 1104 727 1253 679 394
1144 394 384 89 -1320 -998 -1300 -2393 -3019 -803 -1364 -1597 -60 -724 -1673 1341 657 -1063 1756 2923
1162 2923 906 1733 3109 846 1705 2370 -485 1128 2623 368 177 2695 128 -1591 1311 -1677
1178 -1677 -2511 443 -1136 -3573 -1585 -1974 -4190 -1809 -1645 -4192 -1038 1783 -1522 194 2440 -238
1194 -238 -197 2955 1086 714 3335 621 -74 3326 489 -889 1599 806 -930 1715 1117 -1800 -224
1211 -224 23 -3248 -2329 -1263 -2663 -1179 -808 -1274 -854 321 -779 75 1952 1670 1618 1802 1730 2347
1229 2347 2841 604 820 1494 985 937 942 140 378 230 -823 -787 -1348 -1565 -1896 -1287 -2033 -2062 -1997 -2871 -3057
1250 -3057 -609 -1567 -1386 611 -213 860 2728 904 -302 2598 2132 -378 3022 2026 -555 2086
1266 2086 1201 -1519 640 1031 -1784 257 1902 -1536 -1000 616 -2965 -2754 574 -2130 -3486 917
1282 917 -576 -2438 1433 195 -1432 2745 2837 -367 2975 3526 -846 1641 2895 -524 733 1752
1298 1752 -780 -896 1452 -2050 -1713 254 -1247 -2086 39 -1711 -2558 -71 -1372 -2717 -1057 -1395
1314 -1395 -2580 -65 -20 -991 843 1203 -29 1571 2551 512 2046 2526 725 1764 1692 -471 706
1331 706 1503 -388 321 973 -710 -768 606 -1347 -1794 -1285 -2675 -2678 -1360 -2578 -1981 -383 -1010 -366
1349 -366 1232 1045 1307 3246 1643 1713 3745 1817 760 2587 1477 85 1106 -58 -2177 -897
1365 -897 -501 -3076 -2059 -1433 -3124 -1737 -323 -1709 -1517 235 -1182 -773 1590 -164 -532 1885
1381 1885 890 671 2103 1581 694 2621 2126 490 1747 1029 -612 279 68 -1769 -130 -139 -1330 -294
1399 -294 320 -1627 78 345 -2041 -642 149 -1542 -1433 187 -1632 -866 772 -149 -453 1236 580
1416 580 144 2002 1101 677 1752 446 -249 1119 1123 81 952 243 -848 -114 -302 -2186 -1131 -1238
1434 -1238 -2039 -1284 -1199 -1695 -1359 -880 -1935 -474 283 -797 -44 1318 488 1639 2739 1703 1963 3367
1452 3367 2103 1811 2208 741 -133 657 -710 -1639 -1263 -2342 -2422 -1025 -1461 -2047 -1011 -974 -1495 -66
1470 -66 -262 -852 390 1034 502 1190 1794 1110 1866 2704 1090 1602 1886 143 204 479 -890 -589 415
1489 415 -1072 -1039 -387 -938 -1210 -439 -1090 -1334 -499 -610 -1104 -627 -225 -39 569 53 132 1055 69 -568
1509 -568 275 146 419 1498 1148 500 1605 1141 370 1086 1198 -414 399 -5 -1332 -361 147 -2015
1527 -2015 -735 -74 -1923 -1566 208 -1575 -1247 68 -1020 -1650 848 -431 -706 1855 1237 393 2916
1544 2916 1404 381 2151 1836 -743 1165 1042 -731 369 622 -1066 -803 67 -2367 -1435 -435
1560 -435 -2182 -2216 -694 -987 -1244 806 631 -627 1595 1302 212 1423 994 257 1384 1431 638 1785
1578 1785 1101 622 1155 838 9 -27 -65 -1480 -1651 -1016 -2541 -1427 -355 -971 -1253 -229 -445 -97 -408
1597 -408 -507 -191 104 -229 359 534 393 1000 1482 401 1493 2246 1001 672 1115 -226 6 514 -783
1616 -783 -620 99 -729 -1799 270 -614 -1995 -823 -892 -2298 -119 -409 -1676 280 1198 -545 633
1633 633 2475 -268 469 1651 66 702 1680 739 -502 1680 652 -72 1115 -231 -1212 899 -141
1650 -141 -2793 -970 -386 -3078 -1352 113 -1414 -360 837 -1159 -74 1275 -995 -954 1349 405
1666 405 39 2112 1495 404 2177 1229 36 1725 1340 -319 -164 92 -1607 -638 -202 -1371 -1134
1683 -1134 -491 -1194 -768 -1209 -922 -1793 -1201 -1125 -309 -60 163 185 575 1079 1272 576 494 1550 163 507
1703 507 838 616 81 1473 604 -423 439 551 -919 -298 46 -1717 -1617 -207 -2281 -1586 113 -799
1721 -799 -911 640 165 -411 1148 437 -350 1201 1677 -127 1438 1487 647 939 1919 267 411 591
1739 591 -556 -449 -167 -1197 -1164 73 -812 -1507 253 -688 -1508 -293 -858 -1625 -419 -306 -988 175
1757 175 599 -276 1478 1288 584 1143 1441 266 847 997 408 161 376 144 32 597 -21 -86 -2 -715
1777 -715 -1358 -1259 -1567 -1958 -712 -711 -923 -306 -383 395 688 309 371 721 80 692 1287 1272 1019 1506 1058 724
1799 724 838 298 166 44 -1055 -1281 -751 -1116 -1696 -462 58 -830 -17 -118 -848 -84 -117 -836 -414 -282
1819 -282 -515 -48 609 -113 988 1215 639 919 1629 236 -364 965 -124 -375 1242 492 -676 947
1837 947 -264 -574 -164 -373 -1070 -755 -567 -1575 -781 -318 -1579 -103 659 -342 27 1174 -180 24
1855 24 1166 417 -376 1219 243 679 1785 762 6 1037 542 -271 215 -170 -1338 -881 -987 -1809
1873 -1809 -1074 -394 -1351 -598 -617 -810 -829 450 -420 595 141 334 658 1270 933 1233 1893 1326 1369 2116
1893 2116 421 148 385 -806 -513 -496 -669 -959 25 -1521 -1790 -878 -1077 -1477 -489 -422 -636 458 469
1912 469 -85 980 780 396 1311 1003 -291 164 491 -644 8 857 -465 252 845 -441 -265 587
1930 587 -558 -947 -30 -1083 -1192 -73 -412 -862 -146 -264 -777 217 -254 -521 -121 237 -735 660 709
1949 709 394 1225 1655 492 1385 919 385 491 663 318 -65 693 -60 -170 71 -375 -1087 -422 -1100 -1961
1969 -1961 -612 -1566 -1773 52 -532 -1212 5 301 350 1304 686 308 601 449 -239 680 267 245 445
1988 445 784 229 954 629 -26 26 -476 -1732 -1310 -1348 -1867 -1230 -890 -671 -181 419 1 349 914 888 553
2009 553 619 530 -534 1394 791 601 1404 1284 -11 724 820 -801 -602 77 -862 -815 -320 -864 -327 -265
2029 -265 -1263 -490 -156 -403 -867 -597 -857 -1026 -15 -311 -479 466 924 53 574 711 994 428 279 474
2049 474 365 -252 -427 71 288 14 362 -402 -497 -526 -572 -419 -927 -1231 -935 -1155 -780 -366 -264 523 -112
2070 -112 695 759 354 734 784 422 575 1304 113 1116 924 76 446 953 -100 -883 100 -535 -918 9
2090 9 -1113 -1269 -879 -1024 -1403 -77 -681 -524 -201 587 -824 -751 686 -34 1069 1341 218 1092 1131
2109 1131 293 26 649 222 511 433 -54 -72 656 358 -526 52 -351 -678 -849 -646 -961 -154 -407 -915
2129 -915 -526 159 111 365 409 137 1043 860 685 1003 584 254 1287 1005 288 409 559 -217 -15 -72 -576
2150 -576 -638 -488 -749 -1001 -510 -824 -670 46 -889 -1075 -114 -702 -713 -825 -389 -388 163 304 107 1472 943
2171 943 320 1184 670 311 1111 172 -97 485 419 -554 148 777 -546 -1009 188 -756 -1327 120 -981
2190 -981 -542 378 -304 -900 488 -221 295 904 652 200 853 801 -399 961 1095 -295 342 892 -549
2209 -549 -35 13 -826 -344 -6 -562 -699 -399 -1117 -915 -318 -522 -808 -604 -755 -555 279 -66 -235 350
2229 350 470 19 927 828 851 1357 948 128 512 722 61 456 152 -481 -501 -316 -424 -651 103 -881 -528
2250 -528 -18 -861 -1039 -268 2 -479 31 431 290 313 72 465 640 93 178 376 183 -166 699 531 339
2271 339 653 157 -370 9 -206 -965 -567 -718 -1287 -447 -1037 -783 13 -438 -599 -267 -411 -891 -277 399
2291 399 -250 -314 807 365 636 1288 736 977 1970 1169 576 377 -167 -333 -235 -846 -1031 -242 -509 -922
2311 -922 259 -52 -623 1 -29 -709 -354 240 -668 -710 232 108 -196 880 1094 422 933 846 586 909
2331 909 520 -96 303 -131 -158 139 208 -135 -270 -269 -1462 -832 -175 -809 -534 -326 -730 -393 376 327 167
2352 167 577 680 434 928 243 401 355 224 -59 -20 264 859 606 89 385 412 -311 360 82 -1053 -926
2373 -926 -24 -750 -551 138 -570 -255 163 -380 -610 236 -678 -1024 67 -366 -13 307 471 225 850 908
2393 908 375 1175 1462 239 892 747 -151 -199 86 -1063 -1145 -223 -848 -1119 -236 -439 -793 403 169 -602
2413 -602 216 7 -355 654 126 233 620 1084 375 662 968 259 405 1092 355 329 134 -476 -633 -91
2433 -91 -792 -584 -738 -845 -179 -376 -776 -465 -275 12 -75 -653 -102 -131 620 490 154 853 526 490 782
2454 782 556 155 595 -367 -112 359 458 42 195 243 -60 -410 -593 -864 -396 -73 -829 -772 -649 -583 187
2475 187 178 -478 353 929 405 666 400 366 226 478 -582 -56 706 846 732 563 553 406 335 178 -412
2496 -412 -360 -295 -683 -668 -544 -940 -666 -692 -275 -125 112 79 119 220 -270 -107 397 391 -90 712 845 273 570
2519 570 251 159 451 169 393 12 -170 -117 -310 60 -520 -408 -518 -668 -601 -312 -401 -245 -210 -572 96 100
2541 100 -284 252 759 516 357 1025 219 161 701 356 214 349 -266 288 -89 -696 -224 336 77 -1078
2561 -1078 -333 -640 -1114 -259 -490 -1035 -341 -489 -284 319 -54 123 252 567 487 247 771 261 667 702
2581 702 519 -190 381 -51 526 595 -252 -332 -118 -180 -760 -219 -683 -858 -181 -871 -738 -479 -899 -670 218
2602 218 202 -9 227 204 426 -216 515 850 454 909 560 454 222 222 -270 170 236 -19 137 -501 -283 -622
2624 -622 -342 -533 -32 -285 -469 -268 -242 -33 -27 86 -369 223 -53 370 342 -108 411 193 448 614 523 688
2646 688 282 58 34 -154 190 307 -390 -276 144 -747 131 102 -255 -179 -124 -743 -594 -16 -325 -718 109
2667 109 159 -13 426 435 598 606 375 369 297 106 21 324 100 -202 223 -131 -795 -489 -9 -612 -187 165 -245
2690 -245 -197 -142 -253 -354 -67 -533 -621 -273 249 -5 -156 47 -22 413 748 717 271 521 197 307 580 44
2712 44 36 257 -18 -211 19 209 -170 -220 -961 -642 -739 -739 -507 -818 -132 342 -9 -17 180 496 449 705 189
2735 189 -18 78 724 62 342 -243 -156 29 -52 -483 6 -223 -261 -296 -329 -255 -646 -71 -268 40 30 -231 21
2758 21 -577 311 92 392 441 99 -289 704 231 683 93 733 -136 437 497 197 14 -520 -935 7 -594
2779 -594 -1385 -367 -454 -665 -470 111 9 139 -14 21 33 523 -136 92 613 -329 -45 308 311 164 89 331
2801 331 449 429 158 -229 127 170 -291 -8 43 131 57 87 42 -171 -660 -336 -245 -371 -622 -257 -556 -281 -145
2824 -145 247 498 395 597 650 725 548 91 457 324 233 -66 257 -418 163 226 -387 -332 -54 -461 -348 -345
2846 -345 -465 -573 -626 -680 -616 179 -440 -7 892 161 262 198 214 -74 273 27 211 369 378 212 644 364
2868 364 -106 79 61 -547 -273 -199 -529 -769 -404 -409 -248 -242 433 -565 95 91 25 223 389 -518 -112 331 -70
2891 -70 419 224 -160 356 744 147 -163 230 132 -565 -345 -56 -561 256 -124 -404 -168 259 -205 -34 -528
2912 -528 -217 -31 -273 -450 183 69 -254 29 277 62 20 960 333 475 209 551 341 34 -83 -387
2932 -387 380 198 380 -63 -676 -583 -289 -488 -289 -200 -213 -111 -274 -689 65 272 -261 161 339 369 347 822
2954 822 -16 4 437 -361 265 269 581 -92 -110 -322 -299 502 -38 -187 -9 -383 -738 -683 -88 124 5 35
2976 35 -666 -345 90 -118 -40 187 75 32 266 84 229 449 156 269 -51 385 349 -156 585 310 -423
2997 -423 5 -346 -291 -338 -574 -309 -215 -572 -368 -295 -122 -36 41 -67 281 491 158 25 333 143 441 452
3019 452 678 695 386 296 108 -160 360 -325 -172 -103 131 -185 -132 -579 -334 5 -326 -83 457 -660 55
3040 55 150 -251 61 23 56 628 804 -37 683 522 104 577 638 271 -7 74 -203 308 40 -95 -288 254
3062 254 -72 -473 -208 -92 -688 -606 -248 -688 -71 -584 -203 -68 -65 45 476 328 432 469 164 -36 119
3083 119 270 353 608 -135 -29 -410 -30 -142 -287 -320 -23 385 -308 -374 -583 -57 82 -30 -203 -49 10
3104 10 387 559 -441 449 -341 206 641 341 75 -26 19 -139 416 -123 -248 314 49 17 -359 -122 -495
3125 -495 -79 0 -327 -271 -249 -105 -198 196 75 -250 -160 -202 167 188 227 207 497 45 -306 80 450 25 156
3148 156 485 -3 27 -104 -377 -523 -96 493 -346 -627 -312 -246 -8 -329 -679 -261 -16 -306 -387 -357 -143
3169 -143 155 -96 -320 -299 62 491 804 -79 393 476 -38 101 76 66 -123 131 -318 -410 -293 155 -577 -198
3191 -198 -76 -483 -122 -404 -193 62 208 -150 465 136 225 -74 343 -352 338 761 5 -77 476 245 -71
3212 -71 455 221 -173 464 269 -132 41 234 -676 -618 -460 -216 -282 -723 171 -16 137 339 -16 103 -138
3233 -138 -38 520 615 -99 404 458 193 756 83 -429 322 244 -111 -502 -349 -161 -1 50 -218 29 -437
3254 -437 57 -81 -92 -51 144 198 -241 -179 60 -424 11 -351 244 -24 -40 222 663 332 589 283 -26 -305
3276 -305 -250 -254 -61 -108 -140 -323 -656 -325 15 -471 -196 236 -268 -144 -249 -41 237 406 645 356 203 74
3298 74 117 -43 -221 -82 97 -54 -269 419 475 -641 -8 -57 -19 -156 89 249 229 46 64 -480 -432 -205
3320 -205 -36 -421 -458 86 -313 93 266 -252 -282 209 354 310 595 561 -90 248 -151 12 302 160 235 41
3342 41 -89 -391 96 -368 -252 -210 62 28 -19 162 -306 74 149 301 -119 -23 -24 358 269 90 -83 608 -6
3365 -6 200 248 275 334 251 151 -220 -408 263 -90 272 50 -809 -423 -209 255 -151 185 -810 -79 523 188
3387 188 32 55 348 262 217 163 273 359 29 783 -27 -88 -11 244 -135 -293 -208 273 -116 -228 -299 -222 -256 -301
3411 -301 -634 -449 -110 -383 -335 233 -138 -583 204 196 47 605 -203 346 12 -156 -288 293 -606 33 23
3432 23 -146 -147 -320 92 -55 -147 -85 -39 -226 -246 210 25 -1029 -509 -217 -368 -230 -236 -102 -77 530 725 -150
3455 -150 410 419 34 292 84 229 384 225 -104 -340 -76 -182 -175 -356 354 -269 -279 -757 -490 9 -160 -343
3477 -343 -346 87 199 512 100 447 -307 -126 44 171 -175 369 262 -164 329 -17 237 445 199 -292 92
3498 92 223 -172 -81 -170 -43 -530 415 -219 -561 86 -37 25 -86 -57 -191 -33 207 43 -231 420 72 40
3520 40 143 288 -204 157 -27 -151 20 -171 136 -190 -93 89 97 -53 -479 -132 -180 -94 -483 294 -695 64
3542 64 439 -222 -4 104 17 260 8 340 -13 394 -123 378 85 107 -193 185 522 -398 454 58 311
3563 311 144 433 -26 -396 -402 -84 -142 0 -329 -197 -303 -373 -133 139 55 -207 -127 99 510 158 320 -38
3585 -38 17 -109 -163 -26 -143 159 -133 -312 -194 23 -307 47 -637 -334 84 128 -168 314 -139 -36 -283
3606 -283 -284 -23 -144 949 388 -114 -14 -202 -114 27 -84 129 708 422 18 315 214 125 -282 166 -544
3627 -544 -221 98 -78 -292 -386 45 -537 458 -34 58 81 -147 580 218 -85 218 -283 3 540 241 296
3648 296 335 -458 421 -72 -235 187 -170 -183 -434 93 -419 15 -174 80 -316 411 -450 -414 -124 202 -78
3669 -78 -119 294 -46 -407 141 440 -62 222 -95 643 432 200 -72 186 204 48 -433 -59 139 -242 -279
3690 -279 124 -74 638 142 -318 -437 83 -506 -214 -321 -181 -51 466 -168 -670 -53 -209 93 366 -169
3710 -169 -379 -106 75 -48 -148 351 -548 -103 16 -8 251 -60 171 196 -81 -458 -347 -52 -54 -24 -109 -75
3732 -75 193 59 257 61 -123 402 144 220 -27 305 160 680 232 32 -28 -161 -60 -32 -208 -467 -190
3753 -190 -194 129 33 -292 -544 185 -391 91 170 102 -18 -16 -105 -292 421 91 213 -168 521 120 129 -34 40 -292
3777 -292 368 131 87 86 -316 -587 -685 -524 -398 -189 51 -340 -215 -23 44 187 97 111 -230 268 -52 375
3799 375 -129 -74 187 -39 19 -148 -279 121 222 149 -258 -26 -231 -73 -306 328 -256 -683 -523 -170 -331
3820 -331 -79 -271 -427 -84 8 -58 155 57 -123 227 344 -237 105 282 130 74 115 370 -217 -29 448 -58
3842 -58 -544 -393 95 126 -30 621 -290 -86 240 61 -16 -241 51 271 87 96 -68 87 -129 397 104 -17
3864 -17 259 121 387 -238 -394 15 428 358 228 -319 -70 498 212 -247 -232 23 -14 -35 373 -244 -188 201
3886 201 95 319 23 -31 183 83 145 -266 510 -171 -269 -16 586 320 240 7 128 -117 207 -46 6 409
3908 409 150 204 -143 -75 -586 -40 -701 -267 -63 -196 -483 -339 -71 207 353 52 -98 277 -331 -29 -222
3929 -222 70 274 11 436 242 -95 61 -98 -322 62 122 -2 -453 -15 -360 -426 -267 156 44 -232 -182
3950 -182 78 -214 -112 -93 306 -187 279 -435 -106 -240 -12 127 -60 -1 160 167 41 289 251 0 -97 -105 -22
3973 -22 -176 48 -32 -120 71 -353 60 -7 173 -781 -233 -145 -104 44 -113 -175 202 -112 437 107 -113 -78 -93
3996 -93 -200 -83 -135 4 -394 -9 374 -52 155 109 -6 -32 -13 -97 4 142 77 -145 -435 -342 -452 40 -68
4019 -68 49 -23 201 625 359 72 19 -231 28 199 -287 217 -312 47 99 -55 -249 -152 -283 32 50 70
4041 70 -261 -30 38 -331 214 187 -183 481 -202 -203 -53 204 158 191 -235 132 -374 74 -580 -25 182 64
4063 64 133 -378 176 294 211 51 -9 -257 -293 104 184 390 289 -5 104 110 -332 54 -399 248 -505 421 329
4086 329 -117 317 83 -363 -599 -177 154 236 31 407 117 -173 -168 -421 -99 -289 271 7 -290 -211 254
4107 254 -582 147 175 -136 -294 7 465 116 715 572 215 -145 -85 323 -480 9 415 -30 -467 -156 -269
4128 -269 -539 121 97 -213 196 -170 -12 145 111 -227 303 -181 -391 -115 81 -29 166 -107 122 -3 25
4149 25 289 149 252 142 242 -481 -172 -87 78 -307 -282 40 105 22 211 -254 -63 -29 -360 312 313 4 261
4172 261 -296 -41 83 321 -205 -168 -63 349 -76 -22 319 216 427 613 407 135 -226 -379 147 -190 187
4193 187 -318 -106 -103 44 -383 80 -358 58 211 29 21 259 -176 75 -187 208 -293 -144 190 -95 -574
4214 -574 -252 -152 267 283 45 -137 -121 96 -975 -369 275 -306 -541 493 -36 -638 -188 -225 34 87 -263
4235 -263 -142 -211 122 94 -44 -186 -207 139 247 -149 3 -53 -23 58 -253 80 -131 -108 -184 82 -239 115 198
4258 198 144 -113 -94 413 203 -435 -126 257 -235 -378 -55 221 386 165 26 -100 25 -53 189 146 -202
4279 -202 -395 -169 74 51 0 -530 -169 -96 -101 -172 18 162 189 302 -151 -220 -297 87 -1 -538 -338 265 438
4302 438 -136 -169 -102 -42 -360 267 137 -128 13 293 153 21 199 4 108 -322 313 -148 -263 -38 55
4323 55 33 187 22 280 -105 269 30 260 0 255 132 79 64 -51 97 292 -251 -162 -536 -368 78 164
4345 164 129 -436 -179 -252 -226 -11 363 89 -290 -387 -167 -61 81 5 -91 -233 791 -270 -131 8 590
4366 590 197 386 330 52 183 -253 24 -147 279 222 -118 -18 37 -225 76 25 -143 -164 -453 329 240 88
4388 88 86 -43 17 -144 -134 87 297 75 66 157 137 -161 38 523 178 41 176 92 -258 -2 -57 -60 -191 108
4412 108 85 39 46 -328 51 50 620 38 -277 134 -25 108 -315 84 -317 -345 103 96 -120 120 427 -23 221
4435 221 -1 281 258 -235 307 -217 -106 175 236 6 -490 -357 145 365 -22 482 -126 -111 65 -333 309
4456 309 -37 23 -114 -365 250 -257 -159 -118 217 472 -530 -309 -370 320 63 559 49 -164 531 -11 317
4477 317 323 -229 -39 22 368 -194 130 -208 144 180 374 -22 14 -233 33 251 -443 228 -285 205 -77 -234
4499 -234 -573 -299 32 434 -235 177 449 -99 -303 -322 44 173 -303 133 -343 -279 238 391 -13 151 -15
4520 -15 -168 -5 -43 232 159 183 -15 317 -161 -173 128 -13 182 -51 152 248 59 -38 177 -151 -207 -663 6
4543 6 69 -127 10 -72 -88 -124 60 -56 188 56 336 434 -222 582 -255 -112 213 334 -418 557 -239 -39
4565 -39 163 -262 -72 87 -4 -361 11 -398 220 -48 133 -416 -170 294 -340 -24 -205 294 -144 191 -365
4586 -365 180 126 -178 319 341 43 560 35 -233 152 285 -172 -55 23 -86 -238 -18 -175 -362 196 94
4607 94 -165 161 -180 -305 -106 -456 254 -106 -156 -76 313 422 512 -31 34 793 24 -114 249 183 -261 11
4629 11 218 375 343 -13 -257 195 -42 79 245 150 -369 -296 29 -285 539 -37 -27 -208 -316 165 30 193
4651 193 179 413 -162 293 319 -115 -69 -245 15 309 165 -365 -97 -353 -114 57 -37 -394 104 -102 -367
4672 -367 481 -327 263 86 -11 370 56 -76 -163 -145 267 -188 146 180 -340 -135 104 -72 -233 -229 -273 -121
4694 -121 -73 -278 213 -229 -464 -69 -37 182 351 195 -117 490 27 -298 -520 73 -337 78 483 -141 307
4715 307 -80 -143 92 92 200 132 -22 -104 -4 370 -99 -558 -13 272 -354 105 330 -175 -374 -474 24 -347
4737 -347 71 -115 258 80 71 -291 226 429 141 -287 -308 -78 -89 217 203 -571 -162 -260 110 361 -93 83
4759 83 -306 -330 -756 -192 -19 95 -312 -29 25 234 381 -505 -44 98 -166 399 257 -125 134 236 -288
4780 -288 -12 62 -161 -223 -218 384 47 -5 -204 -283 -172 -5 -127 -133 -183 -62 -361 -505 -256 451 287 -10 -160
4803 -160 275 -348 -85 158 -488 276 353 182 147 310 62 336 40 -41 31 -174 255 282 241 -63 149 125
4825 125 -721 -29 -174 98 263 -223 -205 -169 -313 453 -658 160 281 -190 -58 460 -434 109 151 483 110
4846 110 -257 131 -7 211 -318 556 -218 358 -109 186 342 -366 -15 -76 33 1 241 156 416 107 175
4867 175 464 202 257 47 134 38 -106 -42 37 290 -581 -192 29 135 385 -521 4 501 15 93 -78 172
4889 172 -285 -162 29 -268 -29 -137 -420 175 344 115 -168 157 -212 -205 188 457 183 211 -18 238 406
4910 406 -344 -231 282 -299 540 255 91 51 -167 -296 130 -116 139 -45 -102 47 87 -241 734 262 40
4931 40 148 -297 -8 -449 269 46 -68 425 187 209 -271 125 -104 331 461 -74 -102 100 306 -425 109
4952 109 -306 108 289 232 134 -369 210 -71 -53 110 -213 562 -275 -330 -139 232 249 151 -55 63 -203 -259
4974 -259 -84 -99 -216 240 -22 -2 -147 313 302 379 -195 386 -153 -779 -55 205 365 243 100 -608 199
4995 199 311 175 38 -71 11 518 -83 156 -274 30 155 188 -10 139 -220 59 90 23 -248 -303 -10 25
5017 25 139 577 263 102 401 254 346 277 193 -138 -82 -54 355 313 64 251 -439 306 -37 222 -98 318
5039 318 -565 -110 -83 -16 192 -7 208 -91 -96 -81 190 -193 101 177 -196 -64 -90 -50 -7 46 451 514 -418 212
5063 212 306 -92 240 77 -1 -292 -205 91 -74 -262 233 -175 -548 -199 244 204 -117 -367 -267 479 19
5084 19 -416 318 -349 631 -151 -120 2 25 233 -456 312 -307 520 74 188 60 -563 247 -5 56 228
5105 228 -35 207 206 195 -358 -110 248 355 -239 -33 -440 60 40 -683 99 -614 582 129 -268 -137 -281
5126 -281 -62 148 1 -130 102 240 502 72 362 54 -393 180 -254 -396 -214 265 488 -409 -175 -713
5146 -713 49 127 51 -49 485 104 -228 124 507 -308 495 -87 77 252 457 -191 -300 -165 142 -59 -648
5167 -648 -119 7 -382 227 460 33 -47 -50 -79 -174 -466 90 505 273 306 -128 -203 -255 -167 233 -43 -167 -74
5190 -74 46 -162 426 -377 -6 -64 -422 -270 95 -377 -108 47 -78 139 -128 -450 54 251 -136 147 -9
5211 -9 263 155 -155 121 -414 177 -42 401 368 534 -307 -129 -621 -374 396 -103 11 -193 -329 -397 138
5232 138 -274 35 -274 174 57 -216 -161 -201 -354 178 92 588 -25 13 113 -246 125 -245 -18 275 89
5253 89 -35 -531 -152 124 -44 115 346 129 89 359 -326 -179 65 -271 -456 -15 517 -69 114 291 -2
5274 -2 -166 28 -21 -165 441 -297 -98 -310 10 -343 -127 148 -384 85 369 409 -22 -196 -37 80 -13 -195
5296 -195 113 293 -196 2 -113 -196 -159 -21 256 37 184 55 30 340 -50 237 -107 -38 252 358 109
5317 109 357 362 -152 -406 -54 116 -138 63 64 -142 141 -35 -358 309 -65 -121 112 81 -286 649 -506 -138
5339 -138 -348 -33 -321 16 510 30 -282 202 -253 -297 114 -126 -346 -128 356 51 338 -181 -158 109 -943
5360 -943 -251 199 -324 -296 -238 -11 -209 37 -89 -235 -38 394 64 -235 -175 17 268 243 35 40 108 264
5382 264 114 37 -227 94 257 -366 -65 -384 -249 175 -9 399 128 -416 -127 65 120 -276 -401 162 216
5403 216 218 400 218 20 95 -72 -407 -49 6 -283 -54 -254 82 250 -165 251 -139 -77 -337 -118 -63 -163
5425 -163 338 -217 -321 -457 100 202 -5 -61 364 -149 355 103 536 318 117 156 80 167 251 360 120 86
5447 86 82 467 -526 -358 666 402 -219 35 -190 -15 -610 -118 -7 501 -303 171 128 332 -93 476 15
5468 15 -395 126 -78 78 -389 542 -364 496 -308 -52 -565 65 -32 264 263 -376 60 330 565 30 248
5489 248 -331 43 166 -265 307 219 401 4 -139 601 56 -541 -217 -417 174 176 38 -280 -8 -30 -76 -555
5511 -555 18 -240 -100 560 -12 181 140 -172 -96 -274 170 -86 -481 146 353 91 -183 -290 -273 -232 14
5532 14 130 66 -153 -33 22 468 80 255 281 270 -66 -43 -182 -141 -53 -587 -64 -5 -135 186 247 137 -10
5555 -10 16 -502 -581 172 -362 171 -136 367 -100 -438 -50 74 313 100 -109 257 -66 -248 201 -366 -42
5576 -42 -149 -77 -261 -39 115 140 -99 -33 -139 -89 -388 -237 -182 373 176 -116 279 141 261 -98 165 -162
5598 -162 -122 134 792 -470 -372 132 20 -426 262 190 10 263 93 405 -371 -5 239 -14 380 -136 -181
5619 -181 104 -96 -163 43 -28 -224 -130 -181 231 183 214 -52 169 -171 519 310 -162 -126 111 -99 8 200
5641 200 129 90 -210 666 13 138 -20 193 -237 -249 156 3 565 -342 -64 310 418 -285 -3 130 165
5662 165 -191 337 330 -228 -447 -398 -6 -333 -395 -257 -202 413 61 21 -2 -41 -244 137 46 89 207 115 -196 -389
5686 -389 -593 -67 -35 196 18 390 -165 43 -71 264 -111 -270 419 -1 -473 58 105 19 61 -497 303
5707 303 53 249 -95 -445 90 -120 274 218 -34 -300 695 238 -48 79 15 80 469 161 -268 211 185
5728 185 -159 -74 -142 -212 216 232 -362 -425 516 -203 -228 -214 379 -316 180 96 54 195 86 39 52 -40 -146 166
5752 166 177 226 146 -50 303 316 -99 268 -97 476 -198 -317 -73 -117 -252 -226 -320 3 -12 -206 -270 -480 159
5775 159 -11 185 -56 -328 932 -71 -35 164 -166 -50 360 -119 -70 -105 17 81 -314 -9 -227 392 -56
5796 -56 -93 -48 172 146 223 -498 477 -119 288 259 33 28 -277 761 -128 214 192 -33 171 182 275 250 210 -125
5820 -125 230 -475 -36 -52 -149 -141 45 141 -621 -115 229 45 -400 -242 199 116 -12 5 -12 -188 -21 22 243
5843 243 383 -90 -207 17 704 61 73 183 397 561 -35 50 -198 -62 -104 -47 -271 200 -211 491 -579
5864 -579 -313 -343 -55 282 -223 141 -23 -243 280 44 -54 -61 177 -265 -320 -194 -803 255 175 116 -8 -359
5886 -359 -5 32 -113 -8 161 -367 67 -213 37 124 -34 89 -190 -150 39 -29 -108 -335 -110 -65 -4 338
5908 338 259 266 -392 -154 -136 323 -252 0 -26 -23 -266 -335 -623 -536 31 -138 104 -141 -176 -117 196 -227 179 -5
5932 -5 561 -306 265 -172 -156 446 -85 130 391 292 564 125 -230 408 -116 315 210 -112 66 353 53
5953 53 557 280 352 -70 -195 136 -473 -302 233 30 -118 -184 -163 323 -35 116 97 236 140 -251 177 59
5975 59 135 165 -70 -118 -99 -5 -117 -88 -645 187 39 240 216 -30 150 -364 97 -195 -82 369 206 -47 2
5998 2 38 383 -430 158 570 -142 -35 -728 -778 -143 233 -20 406 22 66 341 -338 229 594 -145 -116 -256
6020 -256 106 159 -183 -365 -287 6 -257 89 57 1 -232 523 -53 114 -54 -76 584 17 187 213 31 11
6042 11 20 215 277 -102 87 130 193 163 106 -36 148 140 159 -326 -516 -38 333 -107 -160 -42 -144 85 63 624
6066 624 -220 112 -232 -152 -118 -64 85 202 -279 -235 -225 -498 -373 30 203 -1 -204 337 218 -21 40 -190
6088 -190 -63 -247 -129 203 -373 -1 427 242 767 181 288 258 10 -48 -80 -790 -153 -102 328 -307 -112
6109 -112 400 288 47 -193 474 -87 62 129 -292 69 -546 -54 -580 64 49 197 146 355 150 -95 289
6130 289 372 -43 -602 -37 147 -164 82 261 261 287 -275 67 297 266 509 85 -121 120 -265 -77 96 -286
6152 -286 63 -472 11 371 234 206 68 -163 131 55 -90 291 242 -224 23 -192 229 155 46 -376 -100
6173 -100 145 -531 20 98 75 137 -70 359 -110 320 -355 -133 -43 -418 181 -411 45 -741 423 83 -82
6194 -82 22 172 78 113 142 149 285 -369 -157 13 -437 258 235 -120 288 145 -190 -49 151 -195 263 -68
6216 -68 -340 -241 -276 426 55 538 32 2 -178 475 -66 -229 -5 -137 212 -75 -59 398 88 -678 -1 202
6238 202 -362 -61 -4 -353 171 -184 -208 -347 164 -165 -110 207 419 301 309 598 140 23 -220 140 474 -210
6260 -210 157 306 -194 -244 655 279 0 242 58 -42 -195 -346 38 42 147 13 -362 -31 146 73 401
6281 401 -90 -160 26 57 -184 -45 13 437 370 -214 186 715 -80 93 524 -167 -331 -350 -64 339 51 -149
6303 -149 322 273 -389 254 -465 -315 164 120 -280 -182 365 -220 -122 250 14 176 -213 -347 546 44 -294
6324 -294 469 54 -261 162 -89 -419 104 434 -111 -330 73 425 112 -210 367 -125 49 87 -125 255
6344 255 213 201 -415 -256 -399 -469 -491 -274 327 -332 -41 163 8 -264 -483 -355 288 -15 -552 156 -492
6365 -492 354 169 69 -281 309 -229 -670 -639 205 167 -220 81 226 47 -84 -10 -287 -160 -35 98 -290
6386 -290 -75 389 -712 -139 -49 -307 -141 -385 -657 -85 -386 -67 -67 26 14 -70 -54 147 213 101 245 -536
6408 -536 -76 158 187 347 140 153 68 362 -578 77 184 -176 167 -175 -280 -251 35 -290 18 -207 108
6429 108 407 19 195 -187 -78 -550 -605 487 160 -111 265 81 -179 158 -294 -329 -19 2 -53 -22 -201
6450 -201 -262 374 -653 -170 -180 -523 20 -189 -646 5 51 29 -239 13 295 -34 215 -214 -217 -164 83 -167
6472 -167 443 156 485 116 -144 332 25 436 -31 -20 166 136 3 -535 4 281 197 66 -89 239 -628
6493 -628 213 -493 -204 -394 118 22 362 52 -116 653 -178 70 -93 105 246 -392 297 -90 260 311 158
6514 158 -310 25 110 505 51 -216 -78 -146 -449 -132 -128 -330 3 -64 183 -119 305 -1 -871 -699 -177 430
6536 430 -235 5 30 39 148 -291 69 -346 152 -480 -86 58 81 59 76 28 153 -116 40 -245 -88 -33 -3
6559 -3 -287 -214 -38 -181 -232 -268 -119 32 -254 609 -138 -593 366 -560 -222 -155 177 567 -308 38 342 301
6581 301 50 430 161 -145 260 41 323 79 -159 -58 550 -204 109 -131 -217 -221 221 302 -7 -118 -4
6602 -4 35 215 -229 233 -785 520 -208 -251 26 171 79 -167 148 153 149 -229 -136 -391 -151 193 -411 258 201
6625 201 -150 141 303 33 -329 -401 43 -169 149 571 481 63 103 -351 -341 -61 -522 -122 -291 -352 448 27
6647 27 -471 33 -75 -417 44 -15 -42 138 81 -321 118 213 71 11 122 -2 -212 83 -129 119 -422 -512
6669 -512 35 37 174 326 -318 279 95 -143 42 258 -152 -542 -242 -322 -100 166 419 293 160 -537 -93
6690 -93 320 174 22 -160 59 -234 116 3 -73 149 138 -102 -267 -285 -558 152 394 -52 -176 -351 43
6711 43 -152 -125 244 -28 233 173 151 -88 291 -286 -22 93 69 24 -10 153 185 400 113 87 -52 127 446
6734 446 -17 83 212 -351 -427 17 -264 -241 324 235 64 -82 165 -292 620 124 321 251 145 59 -350 17
6756 17 -2 -237 -86 189 437 203 173 124 128 161 59 -475 -358 403 193 382 245 282 -202 144 -32 -51 48
6779 48 22 242 194 271 -90 311 470 231 -47 -138 122 -72 208 -106 -12 15 169 -84 -377 232 -39 554
6801 554 452 835 -444 59 108 8 -79 33 -230 -132 210 131 242 235 115 309 234 -172 36 -482 -107 -63
6823 -63 108 6 51 -7 252 159 -307 -420 295 -231 182 232 -139 -505 63 117 221 281 -265 201 -263 95
6845 95 208 181 -371 -91 93 -149 75 336 229 47 -529 147 162 -72 402 -490 -76 -53 -15 -483 -5 187
6867 187 246 -115 -212 -151 279 81 -3 393 -141 -18 -144 -313 -394 816 443 196 261 -193 480 -14 180 164
6889 164 148 100 13 178 32 411 -437 -97 319 -130 -94 89 44 -256 255 21 -198 173 -299 -96 86 -692
6911 -692 -10 170 -341 -200 55 -325 35 482 358 25 2 128 70 515 24 102 226 75 -296 -350 404
6932 404 376 -198 573 -194 -194 -139 -371 -10 -53 155 -24 193 -45 93 -199 -11 331 26 698 35 -231 -583
6954 -583 -105 -171 198 -85 -28 302 -263 -60 135 -308 393 -203 149 -31 -218 279 223 484 -71 485 -167
6975 -167 105 212 -97 404 344 472 138 224 330 63 128 330 -191 -114 44 -130 -119 -107 -478 -123 -271 -259
6997 -259 -362 357 -62 -76 -200 306 39 673 166 89 236 -64 363 -164 97 -459 135 666 -149 85 -47
7018 -47 -173 69 23 219 -405 11 -90 -24 -29 559 -94 -264 -377 -120 -15 -813 246 -216 -213 383 44 367
7040 367 133 172 -102 -106 246 -198 129 97 -227 -114 -306 319 -171 386 106 -287 182 -209 -222 32 114 -265
7062 -265 75 -383 -29 -213 39 -585 -123 -482 -89 -174 -3 93 -46 -129 -134 731 -117 -258 119 -22 257 51
7084 51 -100 41 -38 -50 -168 14 -35 -262 -154 69 59 -156 466 179 458 -107 -423 -116 71 118 206 193 -228
7107 -228 260 -63 24 -256 348 125 20 245 -434 -107 -246 256 -648 76 40 -170 81 293 -137 357 162
7128 162 -52 -413 -241 162 -65 317 375 18 -269 -463 -9 177 -274 379 -132 203 290 292 21 497 -231
7149 -231 234 88 -343 140 -81 -88 -396 -156 -49 114 -94 124 -92 -110 -169 392 -10 136 -175 164 -344
7170 -344 -191 24 -192 134 212 70 200 -14 207 -25 -140 453 -304 54 -299 -380 78 -289 264 -258 395
7191 395 237 62 232 -36 199 327 -63 -1 -148 -90 -457 -25 245 -282 43 82 -342 -137 -268 -15 146
7212 146 -13 -180 -42 38 288 -152 -162 222 -660 196 416 460 380 -696 106 -4 -672 -190 -376 46 -61
7233 -61 341 31 249 -187 414 18 221 -56 286 147 -201 -282 -285 -101 -249 -253 -266 43 351 -27 318 5
7255 5 221 -870 569 255 -538 145 -109 417 -322 -116 -538 -357 -105 440 205 0 246 71 -279 97
7275 97 118 197 -545 -468 -214 -108 260 -78 143 220 185 196 -439 160 -146 441 349 353 17 -269 -333 351 -217 159
7299 159 -230 -300 -429 19 -32 -296 229 -345 262 101 223 209 -107 295 -7 403 -166 -92 176 66 -109
7320 -109 -406 -597 79 -223 -152 -58 146 -330 246 -424 -372 -116 121 -41 60 -61 209 25 3 506 52
7341 52 -81 -256 -412 -219 -295 285 -347 171 194 -149 255 -582 -110 418 222 196 189 69 20 16 -119 -168 3
7364 3 -158 413 351 -279 399 -134 270 -465 140 143 599 63 173 -17 293 -35 -100 450 138 62 246 139
7386 139 -233 413 -63 46 -35 129 -29 -126 392 -103 -78 -481 177 358 -425 3 -151 -173 169 178 174 -612 -133
7409 -133 -99 315 -250 -519 361 -438 273 120 174 98 350 356 -577 -348 325 -280 174 171 216 -438 -82 -95 -153
7432 -153 -108 -206 -345 -3 -139 -123 -49 421 -500 -513 -42 -165 104 -351 449 36 -133 -183 -28 327 16 -200
7454 -200 -224 -167 148 -36 -150 -19 -263 115 -151 36 52 210 52 264 12 -89 -314 127 594 160 -391
7475 -391 -287 -297 80 452 -342 -118 -116 -347 137 154 263 -198 160 20 364 -85 39 443 24 -175 -392
7496 -392 -65 172 -68 -26 -27 296 -79 91 -160 68 -9 146 29 70 172 -223 327 -113 7 39 -220 -607
7518 -607 -428 153 -97 -351 -348 402 -391 302 356 -206 -3 -400 86 -162 81 535 105 -155 -58 6 178 488
7540 488 -64 280 128 -289 73 -23 258 -518 -195 -480 112 -303 -168 -522 175 -41 -121 -23 -219 334 -113
7561 -113 -105 -287 -29 -22 -266 485 -421 130 13 372 93 -100 -205 -94 28 -226 203 63 -160 385 -13
7582 -13 -52 -275 -251 89 83 42 26 -47 -398 -156 113 207 -250 4 76 470 22 -231 -485 -3 -314 -10 227
7605 227 170 455 -141 72 124 478 -100 -216 440 19 -232 -81 -550 164 -579 -325 -69 -326 -241 -85 13
7626 13 130 173 -113 323 199 228 -48 -174 167 232 401 533 193 -92 361 312 -96 -226 -148 -247 -182 -344 408
7649 408 82 -59 -131 -72 283 -222 280 -202 231 281 -330 -243 298 -248 261 156 76 46 230 -147 -103 -220
7671 -220 126 66 165 490 99 509 0 -196 -715 -61 -106 -122 -139 79 -56 621 491 -29 54 -269 287 36
7693 36 -62 12 141 -283 384 267 124 -31 165 59 -413 -158 38 199 -119 207 -30 145 176 -52 54
7714 54 -181 -226 -427 -117 -269 121 252 -220 334 72 48 -155 225 -56 -474 -78 236 262 479 188 -211
7735 -211 -197 -97 54 40 297 -298 471 -194 -73 136 316 -354 -248 -549 -461 -127 202 -22 -708 173 -294
7756 -294 280 33 -73 -103 -73 -266 -221 -28 63 7 -125 -32 -199 85 321 -291 -219 92 -230 505 103 -300
7778 -300 -81 266 226 29 243 509 318 359 -83 -74 55 -143 -93 114 -222 -3 -481 -127 370 159 539 -119
7800 -119 207 124 24 -179 -14 546 -501 -281 -376 -63 114 -201 78 212 -252 -73 123 464 35 -383
7820 -383 306 -134 -190 228 186 -351 -626 -100 80 50 434 341 246 -12 -27 -213 -339 152 224 34 249 -196
7842 -196 -371 -202 -155 364 -252 1071 186 35 410 462 -207 -55 -33 320 -337 -130 -125 -248 531 -63 10 118
7864 118 -317 273 -203 -7 134 67 -163 -431 26 -118 -333 -23 541 -101 487 53 38 346 -289 -144 195
7885 195 529 37 214 -95 427 -88 419 274 -58 -163 174 -168 -49 181 -362 -82 145 -332 164 -321
7905 -321 -352 -110 15 -184 -61 -669 52 389 -312 615 551 -71 -472 257 189 290 74 -185 273 36 74
7926 74 402 224 503 -216 25 -235 -94 203 254 253 -96 -138 -260 378 1 226 -275 2 257 -492 -160 -156
7948 -156 460 -92 219 -276 55 93 -119 -95 -202 -102 3 80 -114 -73 612 11 152 115 177 319 -560 316
7970 316 398 340 -33 -4 -55 -23 162 -113 -201 218 -304 -111 -445 -114 203 392 286 -425 -52 628 -157 35
7992 35 -85 -194 -110 112 -275 146 308 -83 227 201 -125 52 -293 6 316 16 -188 258 -26 376 -278
8013 -278 -200 -677 -116 -90 -24 -67 95 185 79 385 -502 -210 -148 -394 -79 -127 -278 231 -69 416 -267 198
8035 198 -398 -421 -124 22 -160 -334 200 216 30 -380 44 -118 -219 -378 -432 -78 288 405 -317 -19 -13 547
8057 547 56 199 -131 173 109 -332 175 -287 -137 -14 -220 -347 209 275 -77 251 330 -188 166 -427 521
8078 521 176 81 49 660 -316 -88 -176 -59 -196 -272 -724 -107 -211 360 -148 230 114 -396 -242 -169 184 248
8100 248 -524 295 279 -176 295 -408 328 -57 -101 275 -326 -59 -82 -85 -183 -483 14 175 169 138 91 369 181
8123 181 206 132 -423 -7 -118 -187 27 51 -67 -27 -345 -42 275 -63 237 -205 -93 85 -68 326 30 12
8145 12 161 -286 -31 -524 -132 -179 28 -451 187 -57 294 271 -177 -188 -178 164 -177 111 -61 40 414 -234
8167 -234 -141 181 215 334 -272 271 231 444 128 -107 378 58 167 -32 -78 63 -322 -590 -269 -84 -258
8188 -258 43 -228 -177
8191a77
$$ Imaginary data points
##PAGE= N=2
##DATA TABLE= (X++(I..I)), XYDATA
0 0 0 0 0 0 0 0 0 0 0 0 0 0 0 0 0 0 0 0 0 0 0 -25 32 -32 32 -32 32 -32 52 -63 64 -64 85 -95 98 -121 128 -149
38 -149 158 -185 198 -222 250 -274 303 -334 368 -405 446 -493 541 -595 658 -726 801 -889 991
57 991 -1106 1242 -1401 1602 -1845 2160 -2578 3163 -4043 5505 -8376 16020 -77797 -168201 74293
72 74293 59423 -52628 64275 109687 -18515 17472 62056 -24888 -28879 20374 -23877 -11900
84 -11900 32790 -1262 -12542 7705 -32086 -34641 -7571 -41881 -50037 -4845 -13206 -13239 22912
97 22912 6300 -5552 43752 42134 4234 16980 22793 -8531 -16207 -15110 -16080 -5704 -8421 89
111 89 41562 46112 18784 29999 30891 -2883 -7812 1598 -17810 -22047 -4015 -1554 -11408 -17605
125 -17605 -12430 2632 -2069 -13350 4359 8540 -14996 -13984 -396 -12747 -15598 -2184 -6
138 -6 8389 18054 9652 5364 4135 -4360 4083 6326 -12730 2833 22355 -2195 -1358 23240 -6150
153 -6150 -21237 13366 -776 -31129 1127 5793 -31192 -12952 7975 -21288 -19685 891 -7255
166 -7255 1597 14219 -3950 4664 26146 7891 9494 36561 21113 12262 38591 25097 -2945
179 -2945 8845 2246 -22408 -11292 -3690 -18104 -13306 -9858 -19025 -11107 -9071 -20303 -10722 -2162
193 -2162 -9148 2699 8689 -5925 4527 19775 1666 -1249 17559 5060 -9858 4716 3246
206 3246 -13176 -7803 410 -2307 3744 10988 10449 9303 7981 4383 -945 -9027 -14898 -14671 -13252
221 -13252 -11852 -6897 -2631 2508 5373 2560 6083 9032 1805 1248 7574 -1777 -2756 8889 4011
236 4011 2533 20966 19633 7585 18601 17986 -2449 -897 -1390 -19435 -16711 -9522 -18584 -11289
250 -11289 613 -9199 -4893 6503 -6803 -9302 2696 -8760 -14010 1743 -2110 -8191 8783
263 8783 8205 818 12175 11781 1303 9284 7421 -4819 2482 2577 -7607 2958 7801 -4401 5319
278 5319 11294 -6176 -4753 3206 -14874 -18137 -4919 -14150 -15309 1576 540 -358 12718 9069
292 9069 3118 13118 8664 144 9002 4489 -2684 8036 8622 -192 8433 9783 353 6081 5677
307 5677 -6868 -4796 -5059 -16578 -11888 -6587 -15312 -8240 157 -6844 -2272 2361 -8137 -4573 3838
322 3838 -7084 -4268 10271 2080 -879 15754 9645 414 10180 6793 -2324 4680 1278 -6635
336 -6635 1878 650 -6331 5025 7432 -4270 2750 6639 -6869 -8192 -5779 -15502 -13189 -6768
350 -6768 -11093 -2627 7081 2152 7731 15784 6513 4794 10716 3253 2648 8506 -1234 -597 10492
365 10492 1120 -1160 13946 5702 -7050 5409 1419 -16305 -10689 -7959 -18681 -11294 -3334 -8981
379 -8981 -1649 4522 -3598 503 4604 -6830 -5079 3599 -4228 -4708 5672 3497 3146 10313 8261
394 8261 9128 13404 5394 3190 8510 232 -6705 -1475 -5327 -7351 618 -3856 -4990 3915 -4599
409 -4599 -12957 -1589 -6584 -17576 -2446 2453 -7490 5331 14353 3004 9182 17720 7832 10209
423 10209 13764 -734 1878 8169 -11817 -13400 1917 -7707 -12317 3875 401 -7606 3866 401
437 401 -9863 1399 1211 -10801 929 5417 -7289 -678 4748 -7224 -3521 4671 -4516 -3575
451 -3575 5496 -901 -384 6790 -1738 -1240 11154 4542 -1712 11755 12183 -120 2880 5994 -2223
466 -2223 -2297 -1623 -4258 -2660 -3025 -8543 -8971 -9231 -11184 -7649 -4723 -2000 1241 5120 6294 6308 4230
483 4230 5652 8982 4360 3573 9347 7457 2159 5144 2320 -1284 4003 -96 -7864 1126 579 -13462
499 -13462 -9437 -3510 -13825 -12039 -1574 -5955 -3921 5265 103 -2520 3842 -1585 -3727 5117
513 5117 601 -16 14392 11213 2598 13668 13793 1325 4754 6545 -3965 -1151 -2271 -13854
527 -13854 -10667 -5426 -13768 -10024 3118 -1356 101 8349 1182 -2712 5063 -2905 -7201 4610
541 4610 1447 -2770 7672 6106 -3054 5670 7506 -4638 -736 4988 -3167 -4277 -482 -3209 -1987
556 -1987 2415 123 2987 9580 4851 2647 4675 -840 -6903 -7164 -9173 -11528 -8396 -5058 -3776
571 -3776 -2393 54 1923 650 -180 3615 4278 2658 5187 7153 3696 5481 7610 2882 4791 10097
587 10097 3967 0 2522 -4219 -9107 -7432 -11756 -11876 -4578 -6307 -6724 1708 -342 -4937 2980
602 2980 1888 -5022 3298 5770 -2890 2974 8904 853 3741 10473 2786 4246 9892 879 182
617 182 7258 -3505 -8421 1310 -5267 -10987 1374 -1445 -9766 757 917 -10048 -1415 2551 -7844
632 -7844 -1531 5871 -2433 71 7711 718 238 7577 1580 833 8127 2569 -493 5550 -33 -4617
648 -4617 2386 -73 -5480 1633 1294 -4887 -1133 78 -4533 -1937 -730 -4142 -2027 -962 -4416
663 -4416 -1845 -29 -4367 -1327 1574 -1686 1613 6057 1470 2300 7198 3988 1885 5575 4150
678 4150 2100 3662 1295 506 1894 -962 -2261 -1060 -3918 -4580 -2561 -5429 -6283 -3172 -5552 -6122
694 -6122 -1752 -2880 -1507 2689 1641 1186 5961 3994 722 4850 2852 106 3420 2196 -2003
709 -2003 4430 4034 -3930 832 4084 -4728 -3119 1539 -5070 -5166 363 -6047 -5481 1002 -3583 -5053
725 -5053 2940 -965 -3549 5271 1634 -3914 4609 4412 -3000 4302 6807 854 5370 7735 87
740 87 3096 5974 -3236 -1984 3888 -3179 -4766 1594 -3283 -5504 378 -4606 -6851 167 -3491 -6369
756 -6369 719 -197 -5730 234 1778 -3751 902 5377 1077 3156 6140 3725 2949 3884 451 1369
772 1369 3390 -181 -1131 1911 -1047 -2753 -1713 -2526 -3030 -2072 -2597 -2477 -1005 -2467 -2217 -1349 -2339
789 -2339 -1286 373 -511 1336 2955 1464 2921 4068 995 2302 7190 3169 1455 6670 3947
804 3947 -1159 1546 287 -3504 -411 -1820 -4014 -543 -1708 -6340 -3132 -1885 -6257 -3176 -157
819 -157 -3651 -3190 796 -1503 -2372 1169 510 1420 5194 2402 2274 5837 2927 469 3193 2243 -323
836 -323 1399 369 -1328 816 -1300 -3961 -573 -2533 -6210 -1785 -87 -3707 -1662 1359 -1894
851 -1894 -773 1595 345 2195 3484 1367 3032 4384 609 443 2918 153 764 3618 2211 1092
867 1092 1913 -370 -2023 476 -2596 -3435 -1363 -2654 -4346 -1751 -2214 -4383 -1595 -1368 -1847 825
883 825 147 -2348 406 25 -3995 -432 1564 -1515 1500 4667 1540 2913 4957 2632 2645 4312
899 4312 1095 1732 3435 -1079 -1891 935 -3178 -5220 -1215 -2738 -4676 -503 -1553 -3412 -803 -1985
915 -1985 -3555 380 1156 -929 2886 4360 1989 4570 4776 1781 4247 4749 1098 3071 3403 -1108
931 -1108 -902 144 -3759 -5370 -1348 -4180 -5568 -2778 -4360 -4759 -2968 -4410 -3215 37 -371 -326
947 -326 3813 2361 1076 3850 2822 1074 3403 2593 226 3135 2047 -1151 1414 1278 -1888 1243
963 1243 2104 -2341 126 1754 -3212 -1119 985 -3898 -2186 2079 -2569 -1208 4020 318 -1833
978 -1833 3417 765 -2413 2034 670 -2438 1502 263 -3535 985 2240 -1676 2276 4286 -79
993 -79 1995 4139 -728 -923 2694 -1773 -2530 363 -3398 -4634 -1310 -4364 -5066 -1694 -3104 -4116
1009 -4116 -279 -765 -2093 2154 2053 427 4223 3890 2122 4518 4899 2047 3995 4708 1225 1952
1025 1952 2249 -556 193 92 -2309 -1908 -1208 -4375 -3905 -2144 -3841 -3685 -1715 -2169 -1279 527 370
1042 370 1109 2990 2602 2141 3137 2259 1841 2885 522 93 1966 -796 -948 1476 -1233 -2484 204
1059 204 -1115 -3498 -740 -1336 -4282 -1796 -1661 -3809 -561 -199 -2943 318 2510 -1320 273 2614
1075 2614 370 1256 3775 883 507 3421 -229 -398 2549 488 -189 2628 1254 -782 2751 1241
1091 1241 -1372 1412 708 -2204 -170 -508 -3986 -1011 -1304 -4669 -1721 130 -3239 -1360 1930 -504
1107 -504 53 3072 458 311 3413 1522 423 3650 2075 -621 2504 1087 -1831 72 464 -2473
1123 -2473 -1589 227 -2496 -2776 -2040 -3610 -2642 -1694 -2302 -2352 579 518 -814 324 1635 1796 1697 2652
1141 2652 3404 2418 2510 2829 975 1137 1546 472 -441 476 406 -667 187 -768 -2172 -257 -1063 -3306
1159 -3306 -1605 27 -2495 -2497 -1433 -2718 -1697 -280 -1616 -660 2828 707 -255 3057 2149 -416
1175 -416 2605 1816 -287 2187 2171 -2277 269 985 -2339 -504 464 -2619 -470 1666 -2543 -2759 725
1192 725 -2477 -3798 96 -813 -2271 1011 -27 -1049 2236 1955 -481 2291 3500 1588 3484 3519
1208 3519 216 1307 2217 -170 -826 1018 -3 -1101 372 -1298 -2286 -522 -1767 -2390 -465 -892
1224 -892 -2113 -1570 -1344 -1376 -580 -1937 -1298 538 1003 1144 1827 2176 1110 2134 1705 1203 1717 494
1242 494 355 631 -278 -977 -525 -2550 -1599 -112 -684 -1695 -305 -708 -1410 -235 -1139 -3231 194 48
1260 48 -1524 801 1542 -473 984 2815 76 2138 4288 971 1343 4219 808 -137 2703 -681
1276 -681 -2240 2196 -361 -3567 -171 -325 -3689 -803 -538 -3465 -287 150 -2740 -861 782 -2997
1292 -2997 -1358 1646 -1318 -491 2442 371 769 3982 1422 584 2968 1660 148 2047 1377 -1219
1308 -1219 952 330 -1793 -1048 -128 -2375 -440 135 -1820 -832 -508 -1657 -604 631 -1307 -592 1001
1325 1001 -112 -173 1196 229 594 2422 1573 2063 2706 1403 1116 2159 1008 346 1142 -215 -1095 250
1343 250 -1469 -2487 -1437 -2127 -2483 -1595 -1613 -2662 -1551 -855 -1688 -220 -407 -1168 1299 1782 -359 1715
1361 1715 2795 975 2063 3401 684 1010 2178 -187 -349 932 -1191 -2377 -674 -2545 -2487 -433
1377 -433 -662 -1776 -312 -514 -1831 230 539 -1295 625 1296 99 660 1072 267 1193 1578 46
1394 46 1312 1422 614 570 1234 -202 -329 1086 -207 -441 597 -1054 -1679 15 -1793 -1537 -333 -2058
1412 -2058 -1625 60 -910 -1242 74 -274 -1031 26 50 -1543 457 697 -433 958 1559 835 1697 2482
1430 2482 1515 1742 2021 779 -67 388 -410 -765 -474 -1717 -1542 -1228 -1793 -1842 -1469 -2118 -1373 -656 -803
1449 -803 -1214 535 215 308 1205 1147 1261 2342 2437 1521 2309 1824 354 1318 937 -917 -180 -323 -2498
1468 -2498 -1547 -1282 -2535 -2444 -1613 -2040 -1359 -923 -1454 -239 907 395 728 1823 1071 472 1849 418
1486 418 670 1249 336 -374 1258 941 -549 601 523 -108 482 190 -522 -65 -498 -1333 -372 -1114 -1321
1505 -1321 -837 -596 -1010 -41 -220 -764 -98 282 -569 439 493 -5 651 1136 -118 999 1511 15 650
1524 650 1481 16 430 2247 9 -866 697 -367 -923 -264 -959 -2148 -472 -1391 -2551 -1196 -369
1541 -369 -2304 221 1040 -724 877 2010 -47 574 2390 506 484 2034 1051 640 2339 1016 52
1558 52 1615 217 -808 534 -445 -2012 -1042 -1510 -2894 -1459 -1410 -2638 -1180 286 -967 -146 845
1575 845 -534 -39 1110 -12 781 2026 793 1063 2006 1253 419 1302 171 -183 76 235 -832 -374
1593 -374 -530 -1069 -813 -1292 -770 -777 -824 -1318 -730 -736 -688 -98 -1198 -382 978 441 296 1577 1126 889 966
1614 966 279 -64 1252 532 -89 2055 1671 -744 390 890 -907 -219 -13 -2213 -1411 -164 -2478
1631 -2478 -2061 -287 -1453 -1478 1095 -213 -937 1654 617 -1415 1332 1213 -194 2149 1538 419
1647 419 2100 2067 -467 196 1953 -933 -440 1220 -1126 -1314 288 -1543 -1841 70 -1270 -1891 -179
1664 -179 -730 -2084 80 -645 -2004 258 1435 -632 1069 2128 1039 1185 1734 429 541 1620
1680 1620 -568 34 907 183 -43 104 187 -435 -58 -513 -1056 -566 -1510 -1402 -1198 -946 -611 -707 -359 -85
1700 -85 83 217 1192 678 -355 723 1102 -23 1011 1470 1124 1003 1799 443 75 1039 -461 -1171
1718 -1171 108 -584 -1863 -293 -801 -1661 -73 -247 -1096 -493 -145 -1498 -908 50 -793 -192 1014 -159
1736 -159 317 1704 736 1100 1975 851 159 1098 518 -724 1090 115 -663 574 -238 -1098 200 145
1754 145 -1495 -1255 -860 -2062 -1123 -410 -1022 -846 503 -265 82 1019 132 163 770 719 628 1340 1406 450
1774 450 1476 1757 906 544 -51 -427 -362 -501 -1695 -1390 -1178 -1086 -1577 -1199 -1479 -403 -552 -729 -466 -153
1794 -153 12 -238 781 620 1426 1520 1163 1579 1498 654 837 766 -401 -70 115 -454 -188 -171 -592 43 268
1815 268 -630 -279 -187 -720 -1281 -169 -1223 -1355 -401 -423 -246 553 324 191 837 1170 -179 953 872 -640
1835 -640 270 1107 -161 942 1297 173 125 1206 -613 -625 163 -1320 -1311 -925 -1457 -1928 183 -684 -1175
1854 -1175 399 -178 -552 -4 -103 -922 427 281 -251 601 1057 347 968 1584 659 1207 1087 -364 576
1873 576 679 -512 -420 207 -856 -1046 -458 -1203 -1417 -853 -1439 -1877 -1011 -800 -983 734 121 167 1517
1892 1517 1507 1161 2324 890 945 1421 994 -75 544 1053 -695 612 -75 -910 -250 -729 -1790 -1221
1910 -1221 -604 -1337 -849 -113 -1035 -542 257 -329 247 1204 -181 32 917 -85 -10 957 -99 1 1651
1929 1651 1224 -42 1066 867 -111 490 561 -644 36 127 -606 211 357 -1134 -340 -251 -1048 -1396 -665
1948 -665 -1601 -866 70 -951 24 717 329 567 1409 730 446 880 242 183 849 261 -17 699 833 91
1968 91 521 824 -1115 -370 -790 -1799 -1385 -409 -1104 -804 -390 -1362 -782 -447 105 119 737 -366 267 240
1988 240 72 975 1110 1115 1563 1738 1319 784 867 210 -306 22 -610 -1543 -656 -915 -842 -487 -366 -685 12
2009 12 -39 -805 -379 -438 -798 4 266 -228 1118 1236 376 981 1860 541 1219 624 -110 -501 -234 -610
2029 -610 -794 373 -88 -235 98 43 -669 -496 -283 -1736 -903 -606 -1372 -478 -149 -535 346 579 -1 321
2049 321 625 640 653 558 829 631 487 610 1549 1419 1057 910 -23 -568 -820 -491 -464 -1089 -658 -1287 -857
2070 -857 -769 -1291 -152 -543 -688 -123 -179 -626 -522 43 226 -69 690 980 593 1634 1167 -336 1013
2089 1013 575 -309 -235 -408 -1076 -289 132 -717 59 194 -727 -1016 -153 -1174 -640 349 -360 -1055 68
2108 68 104 -257 105 234 -22 959 650 523 892 426 199 781 738 630 402 255 -254 -298 -609 -1021 -797
2129 -797 -475 -563 -816 -297 -511 -389 -56 -692 -448 -256 -710 -274 92 -239 -10 409 208 762 928 757
2149 757 724 1351 478 -71 177 -297 -342 476 -904 -1310 -339 -507 -504 -449 103 -1139 -643 -622 -765 -593 30
2170 30 -581 256 201 515 1097 955 314 807 1176 -149 988 782 466 449 1094 531 90 790 -245 -812
2190 -812 -260 -628 -1555 -672 -995 -1788 -584 -411 -63 -246 36 -633 153 597 -1015 -10 189 -488 109
2209 109 1176 137 272 1258 406 173 781 402 -233 316 -193 -625 -185 -166 -900 -825 -608 -696 -546 -264
2229 -264 -699 -352 204 -543 184 126 83 295 459 477 390 1009 233 593 581 251 -158 246 339 80 472 358
2251 358 -760 -457 -46 -1418 -1004 -697 -308 -326 -450 -593 42 -434 123 328 -128 89 139 -277 -626 420
2271 420 182 -164 874 945 625 731 1066 166 843 160 -444 -239 -138 -687 -580 2 -1220 -1335 186
2290 186 -1210 -1291 -24 -596 -818 -438 -161 -565 737 276 173 1153 1047 666 1112 871 218 260 555 9
2310 9 -298 35 -213 -122 464 -292 -676 404 -1290 -1126 -649 -893 -1716 -276 -594 -778 594 -79 -148 1010
2330 1010 246 -4 1000 276 100 909 357 -442 492 811 210 435 975 -24 255 -185 -345 -866 -716
2349 -716 -809 -704 -359 -619 -394 -186 403 -38 105 196 -82 346 384 533 551 -10 487 21 -43 102 759 526
2371 526 337 563 -66 -185 84 -141 -714 295 -404 -494 -262 -189 -451 -325 -408 -1372 -497 -497 -854 92 -358
2392 -358 -330 -504 576 -14 958 996 1000 696 1079 686 -10 727 226 84 44 -313 -336 -318 -107 -514 52 -127
2414 -127 -1009 -804 -366 -1192 -349 -677 -817 -296 -35 226 -18 1292 865 337 972 294 80 359 293 -237
2434 -237 83 -122 508 -212 -134 37 -175 -43 -667 -153 -725 -785 -582 -707 -1006 -105 26 -44 -18 419 266
2455 266 349 638 299 429 111 239 460 438 257 707 560 309 366 402 -48 -250 -29 -558 -717 -48 -307
2476 -307 -687 -594 -432 -319 203 -235 -302 5 -304 -592 105 54 -174 288 442 -53 491 558 403 884 539
2497 539 -449 414 736 -544 -312 90 -455 -567 129 -794 -665 -35 191 -447 -166 -766 -124 -269 -585 -463
2517 -463 -174 123 553 659 1251 355 680 923 103 322 136 285 207 651 -427 436 836 -301 -373 219
2537 219 -328 -112 -669 -813 -636 9 -939 -83 -100 -615 -24 245 120 360 565 359 146 765 684 227 639
2558 639 533 198 566 400 165 -235 120 33 68 177 -296 -846 -7 -635 -782 153 -300 -96 -745 -593 44
2579 44 -101 -217 33 490 284 498 481 302 669 314 319 281 -241 118 -376 -37 6 -432 -576 -339 -618 -526
2601 -526 -106 -937 -143 -403 -105 -414 -225 -117 -255 432 303 -336 385 589 -84 580 583 142 779 249 383
2622 383 208 485 273 -63 -366 -299 -162 39 -150 -442 -143 -1061 30 -605 -618 -387 -14 -500 -208 -70
2642 -70 -143 27 418 -60 -21 435 63 576 1022 56 233 51 508 150 365 -311 -515 -9 -720 -532 67
2663 67 106 -353 -464 552 -643 -281 -569 -435 -78 -333 14 -188 660 63 1 593 516 302 683 526 288
2684 288 549 534 -384 135 -123 -210 -275 24 -774 -344 -112 -462 92 -95 -674 -236 -532 -272 0 -309 123
2705 123 -379 363 173 501 246 -238 422 510 412 498 558 814 387 362 -5 106 -166 72 308 -19 -340 -534
2727 -534 -598 -419 -456 -135 -343 -197 65 -737 353 -71 348 498 465 84 625 512 -23 618 838 457 -22
2748 -22 710 121 428 137 245 -284 -509 228 -598 -239 -44 -314 -150 66 -229 -321 157 -89 -380 -173 -73
2769 -73 -40 41 42 162 535 726 243 999 299 311 -196 684 127 -160 -316 53 -134 -71 -415 -218 -202 -283 -204
2792 -204 266 -54 -634 293 377 -413 110 150 -387 -181 -54 181 503 -295 129 370 242 518 514 241 484
2813 484 612 129 93 321 -257 -279 -353 -7 -653 -685 -545 -937 -293 -58 -445 -361 9 741 -134 431 453 245
2835 245 865 486 520 608 354 391 621 125 427 39 -129 -212 55 -673 -1343 -684 -14 -1120 74 10 -392
2856 -392 86 233 245 204 -185 107 -125 -195 -121 -10 39 -270 220 973 551 319 922 646 -209 630 -67 -39
2878 -39 194 -459 -632 -318 -226 -459 -96 436 -362 -51 -60 -180 -295 -47 -598 359 540 156 73 122 371 497
2900 497 276 154 -251 199 -106 -255 93 -595 19 59 -25 -135 335 -322 -264 112 -310 -431 -794 -506 166
2921 166 135 -256 155 -585 5 320 579 545 492 28 263 -72 12 524 -448 375 651 303 -134 364 -93
2942 -93 -8 -333 -247 -219 -554 -474 -403 -53 -510 -260 -263 330 -640 335 -29 167 148 196 -428 51 283 360 550 440
2966 440 495 188 267 605 515 235 209 -135 -210 191 -358 -172 -27 -471 -218 -140 -753 -286 -79 -217 331 -21
2988 -21 -258 375 198 131 495 685 192 632 346 203 155 501 -141 63 -259 -170 63 110 -45 -409 184 -787
3010 -787 -331 -382 -336 -402 -523 -835 -192 -267 -231 562 292 14 245 576 196 399 341 -296 272 201 432 -203
3032 -203 289 83 191 50 178 -153 434 -54 -840 304 -532 104 -318 -572 68 105 -266 -414 -184 203
3052 203 -233 496 435 -53 89 151 767 282 309 224 264 97 507 -570 -447 350 -486 -403 -261 398 66 -601
3074 -601 -404 -387 50 -128 128 90 -80 326 25 22 -303 409 180 -233 341 -47 63 42 189 4 59 55 209
3097 209 596 -10 -319 -162 -235 -122 -16 -398 -666 -210 -84 -134 -127 -443 106 -326 -50 -236 285 421 416 -125
3119 -125 50 580 152 3 320 -236 277 -93 -58 -310 26 -241 -64 -313 -935 -276 34 1 -157 -314 -324
3140 -324 311 292 -282 -118 110 374 324 71 -62 22 163 -9 -142 -362 -74 117 99 -375 -32 406 -608
3161 -608 -103 379 27 22 -716 -429 -409 -215 -337 -262 -421 -331 -204 17 -411 -141 154 108 62 162 445 -105
3183 -105 383 175 327 472 -10 -138 -221 -573 -289 -74 -342 -427 -306 482 -357 -617 -297 -277 143 57 -317
3204 -317 -63 397 -219 51 71 -90 523 619 12 218 512 298 54 126 -41 -10 123 248 549 407 23
3225 23 -13 -556 -263 -531 -761 35 -454 -138 -272 -91 -574 480 -192 142 0 168 43 485 231 -108
3245 -108 250 140 96 -51 487 -252 -213 -300 -280 -219 36 -146 -88 -104 233 -252 -332 -342 -277 -150 -321 304 118
3268 118 166 -358 257 71 148 166 276 323 475 -59 262 182 370 324 78 -36 -480 -12 296 -144 -384 -25
3290 -25 205 66 -185 -347 -205 -34 23 -51 245 181 311 616 286 211 732 56 308 76 -29 -76 -84 -44 106
3313 106 393 -351 -267 103 141 -50 180 68 -475 -20 -70 137 -681 -408 14 -237 302 156 -518 283 -94
3334 -94 -374 51 624 445 4 363 466 304 41 392 71 585 18 367 -389 -75 -245 -214 -419 -564 -308
3355 -308 -641 -47 -314 222 -101 -176 -262 96 16 -14 209 -122 -46 310 127 -16 238 -377 439 218 176 -409
3377 -409 175 501 -152 222 69 47 -307 61 173 177 -325 -484 -338 42 32 -154 -310 251 114 66 -98 172
3399 172 144 -133 480 200 119 -168 560 115 -234 -191 -407 118 -41 270 -254 46 182 -575 52 -428 -258
3420 -258 160 19 -442 139 559 55 32 129 -423 -265 822 249 -226 -92 42 76 313 270 141 -376 119
3441 119 -139 -233 171 -209 -109 164 -121 -181 274 -95 -466 -260 299 -398 -607 150 259 -176 70 167 43
3462 43 -56 -48 399 -110 -114 328 239 484 329 37 -182 352 201 -138 -160 -176 49 -238 233 76 -407 -266 309
3485 309 201 297 392 -336 3 -125 57 286 -245 -5 68 116 -42 507 299 18 -108 -7 142 16 -48 -92
3507 -92 170 -33 -41 107 -434 -137 -218 51 -272 -285 -333 -340 59 -62 234 68 -137 -206 18 321 229 32 320
3530 320 780 -200 148 -148 26 -196 -308 -157 -320 -534 -348 -63 -370 -387 37 4 4 243 126 -321 -88
3551 -88 189 -557 95 399 176 -355 346 661 492 107 -40 50 -406 137 50 -38 -156 -271 -426 160 -149
3572 -149 -101 109 -404 -305 169 -446 -311 -379 56 -283 -705 -187 -143 71 -3 163 -210 217 259 113 102 38 393
3595 393 -93 -103 -28 65 29 87 -274 -56 15 361 -547 -228 406 -267 -132 95 -143 -10 -82 -321 566 -346
3617 -346 -284 -40 111 494 35 -357 -180 156 572 -42 -28 228 -103 74 11 -172 249 -227 24 -117 -271
3638 -271 -73 -189 -118 42 317 112 152 -220 289 169 196 234 -82 338 -151 72 -440 -753 -200 -347 -123
3659 -123 256 -33 -219 -367 -39 156 300 -511 -172 -339 2 65 -436 404 -208 55 -84 -5 -487 185 313
3680 313 478 -376 -86 407 42 534 335 476 -293 372 242 -431 -52 173 -512 68 191 -312 -136 -182
3700 -182 -400 275 393 -88 -294 -252 47 22 314 -217 124 472 -393 -151 -374 -38 -338 362 291 235 283 -43
3722 -43 26 275 -22 47 316 222 110 -239 -85 -592 -529 62 212 232 -77 144 -213 -768 246 19 434 -226
3744 -226 306 -121 537 17 109 184 138 -60 533 -269 249 -82 -196 -26 311 -257 -640 -247 -366 157 -186
3765 -186 -463 126 -221 241 39 -155 -595 885 -48 -152 255 92 491 204 -105 618 132 -272 109 -92
3785 -92 59 -281 -84 -69 -334 -79 -320 -301 82 -95 -259 -46 -215 -147 -401 -520 -86 209 235 -49 241 235
3807 235 -392 715 378 -80 320 -58 41 -30 198 -365 -253 -229 -67 -238 -138 -102 527 -211 -152 70 -188
3828 -188 20 -119 -358 373 -250 -92 -194 34 -143 -434 486 70 -202 536 122 -36 -218 -9 16 253
3848 253 -52 -824 -14 -443 -194 -159 -126 -148 -490 229 -94 -367 122 -255 99 -46 -39 -113 30 -66 -507 395
3870 395 -88 -101 423 206 -159 -388 212 -95 146 129 44 625 416 -461 -163 -387 -143 230 -65 -276 -174
3891 -174 -129 156 -460 142 -12 51 -229 193 -86 -61 403 288 315 136 237 -42 247 145 167 28 -89 51
3913 51 -101 274 -100 178 218 37 160 -345 -475 272 -33 -283 -197 -76 -241 242 -593 -71 -257 262 193
3934 193 -69 75 39 127 -17 297 -282 -129 -194 -331 -294 -528 170 339 -218 -20 146 3 -83 95 75 -330
3956 -330 55 52 -198 -256 463 229 -162 -92 -69 -75 -359 -67 -94 300 -34 -4 43 202 -648 -118 85 58 -383 33
3980 33 83 289 279 -236 -474 -234 582 -506 -223 -101 -34 -201 348 552 -187 191 -224 -305 131 -66 209
4001 209 -110 -305 312 32 -361 110 -273 471 -97 -361 -239 -207 -3 83 -247 -399 -62 -186 56 312 393
4022 393 97 -75 151 216 182 -6 -175 172 30 48 307 -122 -149 -72 -49 111 -146 -300 -103 -491 -582 49
4044 49 -150 -102 -202 350 -145 -137 398 -164 -242 106 -53 -324 -174 140 -101 49 506 181 -137 99 192 603
4066 603 223 609 -13 287 -256 419 143 -313 -189 331 -228 -233 63 -433 -51 -263 428 -264 165 -419 -134
4087 -134 326 373 -220 402 392 -20 279 394 -50 -34 -122 172 109 331 51 401 -355 -47 -355 -139 186 217
4109 217 -384 -204 -66 39 145 -35 48 126 -175 25 3 260 -28 -8 -6 151 98 163 162 469 312 -117 453
4132 453 80 202 -87 530 97 67 -19 -66 200 -142 49 -127 -242 -377 454 296 -169 467 5 275 -136
4153 -136 -11 -125 -427 -490 35 13 -611 184 230 345 -185 76 280 -161 -371 7 207 -667 -277 -379 -256
4174 -256 -54 564 -187 79 -243 -52 246 -223 147 159 -12 -35 -4 86 -62 -244 330 500 -115 -84 97 -33
4196 -33 340 70 83 -101 119 15 193 -219 -107 -185 0 -375 -71 379 -201 -76 4 -362 11 -91 -111 -62
4218 -62 -519 -261 -89 -251 89 -215 42 -491 18 441 200 311 274 72 102 161 -281 211 -214 -347 -632
4239 -632 -261 110 -193 21 -342 74 -111 354 -94 -172 -173 94 -15 327 366 -142 102 -451 -138 411 31
4260 31 121 39 -161 -244 -278 28 59 -161 -104 -48 -299 -218 27 -72 -88 103 -186 -82 -19 -8 -116 40 149 93 -477
4285 -477 -103 55 170 -80 -196 137 -240 223 46 23 -345 310 2 264 -47 0 -119 -121 70 -313 226
4306 226 101 -294 125 208 -640 259 -135 489 19 -216 -103 -80 175 -72 -117 26 -229 275 -220 71 198
4327 198 -528 57 -197 212 -19 71 -61 -17 -468 319 347 285 -355 163 325 -192 238 -11 501 266 70
4348 70 80 59 167 -80 -181 93 120 198 -324 274 439 -258 -141 115 -498 -124 -252 197 40 -150 -76 105
4370 105 -283 122 125 -272 311 -648 113 183 -26 333 -246 -139 -538 144 20 9 79 379 172 -84 -107 -156
4392 -156 -30 40 -145 160 91 -150 200 153 48 -90 -12 -256 -248 -105 -164 -336 68 -28 99 -368 -543 -166 120
4415 120 -99 19 9 -167 -252 259 -271 106 -434 66 -373 -540 314 95 134 -551 327 -265 -171 -390 235
4436 235 138 97 -33 -233 430 -368 95 223 274 -35 -408 -211 262 -383 -93 -2 294 1 -300 -262 -394 -222
4458 -222 40 -122 -547 -306 -127 73 205 453 -220 6 501 152 329 -154 -54 190 -140 52 -226 102
4478 102 100 -186 -106 -583 -165 -54 -249 -252 -352 -234 16 -97 46 -294 255 55 -281 98 509 177 -107 198
4500 198 -104 24 -24 238 -365 -363 182 -51 154 123 -471 -358 532 71 398 -204 -3 52 151 118 -171 -351
4522 -351 -350 -189 -292 -296 101 216 -179 218 261 -429 -100 551 54 389 -269 340 -40 222 275 385 -84 130
4544 130 -359 -181 -177 -276 -85 -67 -85 -44 -161 101 -72 43 79 -267 370 -158 190 451 -350 107 -317 -127
4566 -127 93 1 -72 -74 -45 -263 293 -264 -251 25 -334 -419 -100 -311 -554 -334 52 174 107 -323 -498 -7 -227
4589 -227 -178 60 121 -211 -223 -70 -21 -134 -318 -12 -321 174 -172 201 -29 112 508 478 -671 -298 181
4610 181 70 -3 54 -185 -535 -75 100 192 310 151 -137 -580 385 73 481 -97 181 220 -271 -488 4
4631 4 -322 234 -2 215 39 -97 252 465 200 20 74 -674 265 -245 -495 -125 -137 -368 -92 -292 300
4652 300 152 107 -13 -287 -430 -91 -155 -414 -252 -10 -107 -146 43 -234 68 -16 481 312 -271 65 362 -8
4674 -8 138 -437 -182 -257 153 140 -45 -54 185 44 -179 -72 202 -152 22 17 210 -641 89 51 -389 -217 161
4697 161 237 124 47 -107 320 -16 -53 214 -338 268 205 136 -55 -89 -291 47 -112 377 -178 409 -17 -278
4719 -278 624 -499 -102 -190 -512 -143 11 198 -13 -239 435 324 190 51 526 -302 -14 -106 59 -384
4739 -384 -313 211 -401 199 -28 108 247 -257 -102 -163 -323 73 374 327 -492 42 -47 361 -396 -247 700
4760 700 257 -477 527 73 -41 -290 -149 127 74 -70 -436 -167 80 146 -178 76 -170 51 -125 581
4780 581 -292 -145 554 -874 307 -111 -269 73 186 93 80 398 18 335 138 -318 -126 -57 183 221 70
4801 70 -112 -234 349 83 -350 -115 -14 -685 704 -162 -46 56 -26 367 -73 -195 -212 9 -179 319 -142
4822 -142 240 147 221 592 -92 -324 84 323 51 -172 -309 79 -405 -278 -140 73 28 -99 -238 292 162
4843 162 25 -198 44 -918 221 198 -228 -113 -101 469 -188 266 -170 -67 92 79 -121 -379 -191 121 376
4864 376 -59 228 128 -214 -285 -81 -127 -153 -56 153 -17 -558 142 -56 146 67 5 -32 219 9 8 -150 -321
4887 -321 -90 356 -68 -172 80 -197 -179 -45 -110 412 -51 -416 -289 -251 -145 -225 145 -309 336 272 -273 -54
4909 -54 -211 23 -228 -132 375 188 553 -78 -233 243 28 662 -79 20 -125 74 -43 9 -543 126 139 161
4931 161 -40 -187 444 15 93 346 -228 -62 -541 101 -266 -307 107 197 73 23 388 -30 -201 -90 253
4952 253 -50 30 196 380 -470 151 159 143 125 14 -185 278 140 74 266 291 63 -287 22 157 -210 315
4974 315 95 -214 -40 -180 -46 435 -201 -408 -254 -465 98 149 136 -72 -308 494 90 -58 -507 223 -515
4995 -515 -299 46 -252 -16 415 193 33 50 49 374 444 -32 1059 389 166 384 71 -53 -177 -378 137
5016 137 93 85 143 -308 143 305 308 -286 -517 -401 -76 -436 -172 -297 392 314 32 -215 242 272 283 -296 403
5039 403 371 -241 -207 110 82 -34 -295 -130 622 292 408 -26 -254 54 -32 -329 21 -172 -73 -35 -314 164
5061 164 -69 393 274 -357 276 160 -123 292 -383 106 -226 -311 -5 -302 365 39 388 53 -101 -179 -580
5082 -580 55 -387 -101 -223 -304 371 257 248 230 -330 689 -219 -232 80 331 -360 91 -147 -162 217 -4 -434
5104 -434 89 -381 346 -480 179 95 -155 275 -177 31 24 -491 -29 -93 -329 159 -265 -285 -63 -65 -318 -219 -375
5127 -375 -552 155 411 233 112 -277 253 -420 141 76 202 99 103 361 55 159 -225 115 325 -82 3
5148 3 174 99 -150 -211 -375 606 -301 -188 -298 88 -199 -227 21 -193 244 -40 100 156 -253 149 -244 207
5170 207 -521 113 -102 19 53 430 -67 -11 -90 -242 -220 -255 -205 -304 -131 -134 123 63 242 -5 -254 302 174
5193 174 -86 -12 104 74 136 -551 552 584 -17 44 30 93 -110 -129 444 -177 -41 169 -116 2 78 -275 301
5216 301 52 -261 -5 171 -245 -270 -201 674 169 141 170 -89 11 -222 250 525 -145 -245 -57 133 -110
5237 -110 -313 265 -250 -218 116 -357 -383 81 130 326 -213 -501 206 -405 59 -161 -150 -13 -161 -132 -377 0
5259 0 93 -113 543 103 96 -221 134 359 -152 37 180 325 -90 -74 -135 -272 -590 105 -442 -119 -225 153
5281 153 -599 186 -85 472 329 110 -363 -141 12 -110 -142 -223 -133 65 -479 -409 165 -94 -480 -260 23
5302 23 -620 -131 -171 56 -300 -248 46 -616 -167 49 -169 69 24 -22 -318 -98 -358 118 66 319 -48 391
5324 391 211 145 104 -79 -501 321 88 187 -242 -75 -348 179 212 153 44 -302 431 213 30 307 -392 -194
5346 -194 278 -419 -105 -139 215 -115 -88 206 449 -58 453 -164 428 -441 91 98 -107 39 110 340 -246 352
5368 352 351 19 -9 -65 10 232 52 169 -79 249 -108 -132 179 341 -183 -52 -32 -296 -9 625 -499 292
5390 292 296 401 -254 -187 -116 78 -327 -196 754 -270 -770 -337 -25 336 -208 -179 93 176 29 -420 -100 136
5412 136 367 -355 209 -40 -564 226 270 81 38 305 -241 -22 587 16 322 28 -16 153 162 368 -29 -276
5434 -276 -85 -344 62 -303 -18 -13 -284 -232 221 443 213 114 141 -140 -226 -241 -708 430 -39 127 391 -37
5456 -37 -346 -8 226 -36 -477 -38 -184 -270 -428 97 48 -117 349 86 178 169 125 -255 -342 -48 -170 -507 -194
5479 -194 165 -580 -296 -24 -44 -12 -170 57 162 273 -207 -138 97 277 187 -723 78 -163 21 -146 412
5500 412 5 -572 -43 -239 -154 -65 -622 -56 99 332 192 305 82 -117 197 89 20 -193 171 -210 -166
5521 -166 203 -65 -447 42 -95 -33 -314 452 197 390 -136 -315 -272 -73 3 -525 334 348 187 33 -333
5542 -333 -251 151 -8 45 119 -217 117 -108 73 -235 397 -117 -328 -172 -506 101 42 -613 -198 -370 -611
5563 -611 -371 29 -105 51 821 -274 -80 65 16 5 275 -46 99 132 388 -447 195 -410 -467 56 97
5584 97 -369 254 -253 63 198 16 280 189 159 -251 -30 -77 -224 8 -162 -311 -89 41 -54 -14 143 283
5606 283 254 85 266 -188 -73 55 -24 216 -19 77 -161 -165 199 0 100 -522 -293 113 200 45 -137 -90
5628 -90 -63 89 -224 -151 71 -92 51 -139 -98 60 3 -101 -205 259 368 385 256 -272 274 -110 143 409
5650 409 -207 -188 -21 -323 177 -337 -71 3 361 168 -99 -13 393 -141 -205 -118 -193 502 -414 -16 -155 -309
5672 -309 -276 399 346 78 -316 363 -467 -62 -100 -29 209 -214 244 -495 276 60 169 163 180 192 -129 -132 204
5695 204 -126 -134 277 -133 184 -651 -243 -498 269 -468 -82 370 219 52 219 191 141 -173 622 -235 277
5716 277 135 -373 -60 1 92 541 -4 -200 261 -86 16 -164 -201 144 -231 -265 -416 -57 212 -56 642
5737 642 35 307 -365 -516 -112 -217 -132 407 228 -319 103 -322 56 -118 307 95 -222 -303 209 -259 -99
5758 -99 -122 93 259 384 -67 146 -136 113 -146 28 -3 -252 28 -378 -238 323 33 62 205 157 -381 89
5780 89 184 -159 82 59 142 50 147 -454 173 566 -215 526 415 -96 -11 324 -165 -146 354 180 -205 -416 152
5803 152 143 464 -238 -174 30 385 -357 -159 82 418 -194 47 118 -250 371 348 399 323 201 115 -391 -23 236
5826 236 230 249 -713 358 136 848 -59 94 366 169 223 15 -412 -10 -349 143 177 -437 83 -206 -169 447
5848 447 9 181 175 -83 -151 96 -168 54 239 -181 44 73 -182 -229 730 -43 -347 -80 83 139 -456 -36
5870 -36 12 21 44 177 -166 339 -36 21 301 56 285 -328 -257 -213 -429 -18 -288 59 -159 301 -46 498 101
5893 101 331 167 -149 -272 -154 -347 267 -322 -456 -151 -59 432 214 -152 -94 305 550 121 52 213 -273
5914 -273 -135 -77 333 -115 -15 -428 118 -92 234 -76 288 -461 193 270 -109 250 154 354 -277 253 -246
5935 -246 -12 48 597 292 -299 -202 70 56 -264 161 1 214 64 144 383 -401 108 340 60 221 -14
5956 -14 -130 411 -29 -407 -212 -293 -28 4 112 116 91 94 -473 116 -80 431 386 -21 -222 -296 40 -178 -138 -36
5980 -36 -123 145 248 -265 -118 -143 47 -477 -18 -489 116 21 183 -343 271 -283 170 283 41 -152 174
6001 174 -520 184 101 169 -9 156 138 112 -63 -43 88 -404 340 25 1 205 449 106 230 142 281 258 5
6024 5 220 95 161 289 -236 161 -194 183 -65 253 -101 48 228 -257 103 51 -204 116 254 242 -392 -30
6046 -30 231 -182 71 11 23 181 -47 184 498 174 398 -186 -245 -58 -570 -209 62 104 -351 -108 168 -37
6068 -37 535 105 -121 -218 133 205 309 430 -119 -167 -99 134 -447 57 444 -273 244 272 399 -124 211 -312
6090 -312 398 359 -118 547 119 -51 -276 177 975 371 70 -158 110 147 266 -109 -2 529 103 224 -181
6111 -181 -182 -253 -134 274 -94 59 -48 -208 -565 -118 160 69 68 280 36 25 -68 -413 -82 -216 453 332 -15
6134 -15 220 -26 -329 -99 81 44 -67 -535 -476 -8 249 -94 -222 164 -33 -253 -131 55 281 11 -357
6155 -357 -362 -235 303 -724 90 -165 344 314 124 -340 320 -73 260 72 -347 147 248 256 98 -162 433
6176 433 269 -398 245 133 -132 -171 53 -29 -7 -456 260 -366 481 278 -456 -25 328 192 187 134 447 213
6198 213 24 -160 -121 168 0 396 274 132 355 -459 -199 396 440 -641 420 285 -218 -4 -118 -492
6218 -492 -391 3 -480 -158 -225 -15 -136 366 -374 -278 40 271 -360 246 94 12 87 152 -110 223 -369 -263
6240 -263 66 -280 271 157 40 97 370 -27 307 372 -393 -688 143 -282 -55 -297 -217 287 -374 -195 -154
6261 -154 -408 -268 43 -104 -138 -405 -2 93 -260 -56 362 -238 -311 -198 -613 -390 -135 -297 -397 -409 86
6282 86 1 63 -90 -366 -59 -286 -83 556 -441 -237 -531 134 29 -300 254 324 -276 154 -60 -25 172 -5
6304 -5 -255 -106 195 13 347 55 109 32 264 226 229 148 180 372 265 -304 507 24 166 -95 -362 -99 370
6327 370 79 -195 188 -96 196 -315 -123 -317 -284 13 -229 211 -76 427 -129 -198 -261 477 212 -287 210
6348 210 357 90 38 690 42 -296 97 229 183 11 -160 173 -77 -32 522 211 -341 -21 258 -66 -145
6369 -145 46 94 115 287 117 -75 3 12 -206 128 -85 307 -156 50 -4 108 358 471 -257 54 277 167
6391 167 85 -348 226 -42 -430 -471 308 -150 702 -148 -237 5 -484 458 -69 185 35 -289 -284 -213 18 -253
6413 -253 -128 -201 -515 -416 -153 22 261 -50 -38 -135 39 -408 40 79 -55 -100 101 -110 -129 168 328 -86
6435 -86 -269 -348 108 5 -24 -75 -243 155 158 222 149 -55 -309 -108 -161 4 647 44 125 -89 69 -149 -145 327
6459 327 102 26 -226 42 -457 -155 -263 -106 -133 -304 -122 -140 -290 -293 -46 19 -506 103 314 -3 33 -458
6481 -458 -224 -166 285 26 568 -17 151 21 -181 -102 448 -48 434 -148 75 163 -300 -249 -177 -49 -112 -207
6503 -207 -3 -25 51 250 -494 26 248 -543 -142 32 50 -27 -4 127 -202 70 -210 -251 12 -452 -74 119
6525 119 314 37 -188 31 -75 13 28 -297 -74 165 -328 -266 -338 -451 4 -253 -220 -107 -297 -109 302 258
6547 258 -191 -56 185 52 -192 -66 -113 -161 63 228 -300 284 341 -218 62 180 93 207 -69 -93 -479 198
6569 198 -684 109 187 -213 -85 -247 198 180 -153 235 136 -83 -146 -45 167 -250 189 -107 -338 -222 115
6590 115 47 82 -112 517 -439 -93 -253 160 -230 223 -56 -418 -63 363 184 25 80 -338 -311 270 -170
6611 -170 -179 -78 265 -2 116 127 64 -21 98 -170 36 417 345 -18 -37 480 25 -398 -123 -321 -218 518
6633 518 193 -90 242 -83 86 16 -124 137 240 -135 -50 96 519 296 -392 -222 -44 353 -245 7 -80
6654 -80 378 -349 706 -13 60 -21 568 104 -602 -251 -214 330 152 -28 51 49 297 9 4 141 110 -191 -96
6677 -96 326 -200 166 -133 34 -340 -37 179 365 -292 -39 27 -500 224 122 -135 -130 -441 134 309 322 233
6699 233 43 191 137 398 245 180 514 283 -47 -55 375 -177 19 141 -538 -22 198 -619 -106 -137 -259 410
6721 410 -321 -155 464 -73 -15 -154 -194 190 102 28 213 -448 168 544 16 37 246 211 363 -271 222 168
6743 168 -215 -97 311 324 186 133 267 -439 176 -203 64 -150 140 -364 0 -142 -37 -267 180 -476 -29
6764 -29 240 -200 -244 29 -205 -177 228 47 18 4 -81 142 353 -24 525 64 205 -114 -81 79 -272 178
6786 178 75 -343 -247 -612 224 469 -220 358 272 -306 199 -432 -86 234 -237 332 245 266 -240 -48 79
6807 79 -103 -277 -799 59 3 148 -321 -121 149 -171 420 313 97 -436 372 -249 230 211 -24 429 82
6828 82 370 100 323 296 221 -88 -293 -219 188 205 677 -401 -138 -165 460 243 211 -143 -313 -285 -30 375
6850 375 19 -44 -235 89 -146 339 299 -77 232 233 -295 -78 84 77 170 -394 -397 -257 -258 387 68 61 48 313 -503
6875 -503 -315 153 427 -151 -224 218 3 -132 -113 -130 -99 -327 101 185 29 283 -104 -25 -552 128 -28 271
6897 271 133 82 -403 -446 56 -101 -404 55 -241 -1 137 -106 168 194 195 1 107 149 -218 96 104 -129 168
6920 168 -188 19 211 -343 -264 136 -813 -290 221 -145 -206 -294 85 -363 -28 61 252 197 268 -43 242 -74
6942 -74 125 -345 -239 -76 -199 57 580 -177 -175 321 -64 -93 -78 178 8 284 -166 -193 146 -77 357 480
6964 480 138 516 108 238 64 -7 -6 -16 -242 -164 -451 470 359 313 41 -213 -180 546 -64 612 -257 207
6986 207 -65 210 627 -52 58 319 135 465 354 -472 144 146 -442 439 -359 -57 60 379 -417 -412 -315 13
7008 13 -224 -248 -392 181 -13 -121 473 -256 -346 33 -241 334 568 217 -121 88 150 -255 -125 -222 -383 191
7030 191 -76 -152 634 -33 -233 -191 -200 94 -89 334 285 107 3 65 188 -349 241 -182 204 -52 -169 -250
7052 -250 -35 349 -362 -69 192 298 10 154 -216 123 99 242 -208 -157 346 237 -240 -389 410 82 170
7073 170 346 3 -114 -57 340 439 -445 -334 -141 523 305 -103 -175 216 -86 -117 249 388 -81 -146 -216 -214 -376
7096 -376 98 196 114 13 -51 127 -239 -113 502 -235 164 -100 -119 -39 -148 88 -79 -232 223 -153 243 -39
7118 -39 82 -351 212 202 -92 148 -98 -523 -208 -83 -352 -35 -191 416 145 -194 250 -38 -173 -658 -330
7139 -330 221 -233 -379 -96 -109 80 -136 49 -514 -198 -469 -214 -288 84 -307 146 32 -291 182 231 -153
7160 -153 162 -308 168 346 442 2 -124 377 -87 195 115 143 349 -297 215 294 263 137 -140 -545 179 80
7182 80 -1 -144 445 103 -264 -66 229 286 -471 -75 115 -131 53 185 -175 -113 -74 -47 71 225 352 30
7204 30 -68 -254 -329 -304 -166 157 -169 -36 -122 -117 -112 20 -39 306 71 -414 -298 -516 -448 -138 125 -313 -83 258
7228 258 105 212 -551 289 -249 -856 -92 -186 -33 26 333 176 -46 111 -264 -13 248 258 234 -204 -522
7249 -522 -625 -367 -520 201 105 68 -612 459 -12 -4 -152 -126 11 -111 162 -58 363 42 -158 373 336 216
7271 216 -373 -424 -123 -347 -328 -365 154 -113 -411 422 -115 168 -741 -174 -367 6 -542 219 -2 -156 397
7292 397 174 -60 -52 140 41 -424 17 184 -288 290 -326 79 -230 -62 -62 -214 -149 -84 -4 380 640 259 2
7315 2 64 -628 108 -214 -163 462 274 342 184 -271 -132 432 373 102 75 140 9 -72 96 -172 250 25 -120
7338 -120 -124 266 196 205 -227 -3 -513 -98 453 -301 -64 -354 -222 -215 -32 78 84 -392 -208 307 145 -71 116
7361 116 -53 58 196 83 -23 395 -15 383 -105 -156 -419 -392 -391 -147 6 -125 247 44 501 -255 131
7382 131 40 -41 -48 -178 172 512 -193 -90 112 329 117 20 -402 -89 -27 -387 -732 39 -245 -73 -115 -177 53
7405 53 134 -45 -345 21 391 536 94 359 62 -47 40 6 -9 175 -6 -514 -75 -2 155 131 -73 71
7427 71 542 -84 -383 -174 -198 -36 108 -511 -80 -1 102 54 -343 145 58 -265 -169 -251 293 158 -217 -59
7449 -59 333 -251 -42 242 -96 -24 -203 471 -373 -173 -84 269 329 -346 -422 -209 -467 -96 -489 -432 -92 51
7471 51 151 67 -449 -143 -128 -416 -4 71 256 295 -250 -159 -151 -179 187 244 77 -62 -183 -185 45 -74 155 -132
7495 -132 -572 -212 -62 -144 277 157 224 593 -105 283 191 -331 -285 24 166 -218 123 161 -705 -187 -86 185
7517 185 89 170 -237 -444 525 70 -176 160 -2 -8 284 -478 434 -10 -257 -466 119 -274 -16 -190 234
7538 234 113 267 485 -207 -173 315 -181 60 -159 78 -496 208 290 2 417 -86 93 -376 -553 -107 256
7559 256 113 -506 -241 -85 -176 -571 198 -167 -384 277 143 267 -99 94 -162 -360 -145 466 64 -193
7579 -193 -17 35 382 378 -407 582 234 209 56 184 -397 13 82 -391 15 -39 196 44 -159 -451 147 123
7601 123 214 -280 -190 -282 -35 -291 -134 302 243 719 500 -35 283 -379 59 61 240 30 12 -28 -351 105 -129
7624 -129 -77 -341 -301 -11 -91 -375 145 22 195 327 -12 80 -149 199 -79 500 -340 -171 -397 316 146
7645 146 -341 127 9 -361 -132 -665 271 -66 -353 253 -298 97 -279 98 -156 134 52 -9 173 87 309
7666 309 -224 -185 -65 151 171 -25 162 -60 -60 -492 -412 60 567 -468 213 70 101 440 52 40 -44 -102 -220
7689 -220 -169 591 481 -114 348 110 30 3 -351 86 193 422 -127 -314 -12 -76 -495 661 204 -177 -135
7710 -135 -2 -122 289 -55 69 42 122 -33 256 -221 -323 84 -182 62 -337 -495 -444 216 142 170 218 114
7732 114 -70 62 138 243 30 224 416 -263 -284 -77 238 -151 9 108 -114 101 -270 46 -5 227 -97
7753 -97 -69 -129 -267 -98 42 -166 -16 400 -310 -307 -75 -199 123 292 169 -227 -148 301 92 526 385 -288
7775 -288 297 -235 -250 -5 -90 152 86 96 -307 51 208 -179 500 51 -317 -353 -331 16 517 304 115 -167
7797 -167 -25 42 92 165 163 272 -197 153 155 -433 -236 95 94 -194 -145 67 259 -221 531 -19 -229 -204 -166 -32
7821 -32 82 173 38 -308 95 514 -316 113 165 -204 -33 17 316 -2 -243 -46 58 -242 -187 80 227 -257
7843 -257 -121 43 170 -41 -284 -307 -521 80 -232 -129 -209 -376 -354 33 -73 502 188 -37 -271 25 115
7864 115 -390 -359 -170 -210 142 169 71 -192 -104 -168 93 -528 214 631 -392 170 -109 162 223 127 -104 -349
7886 -349 479 119 -241 161 -210 171 389 521 -331 -210 -362 -857 69 -204 -61 134 566 -449 222 -97
7906 -97 -209 -76 -66 474 230 -152 -379 265 145 -383 -223 -15 -434 404 -362 -177 258 292 127 -195 -568
7927 -568 -186 438 -136 132 587 -156 54 7 269 -318 -270 -225 -69 -190 8 75 -450 149 298 -297 -249 7
7949 7 -22 -324 292 -330 281 -199 -208 336 4 -400 2 332 -14 323 -290 -361 14 -309 -435 115 -191 -354
7971 -354 414 -154 442 -186 -110 -256 364 -32 -325 -34 199 -22 -83 209 -121 227 -219 326 -184 -173 -52
7992 -52 -56 -73 613 13 180 -393 -154 -87 422 -63 -167 20 -382 -178 -179 118 403 -253 183 59 -358 -18
8014 -18 -414 -103 -409 -304 -18 386 417 127 -193 93 134 -295 31 -129 420 -374 -24 52 107 -126 112 93
8036 93 367 271 -190 -234 11 1 411 132 -18 135 2 210 429 -152 -22 -540 -207 74 142 -58 307 158
8058 158 -164 63 -51 114 -134 -316 -457 293 394 -155 -226 -359 -346 60 -36 299 200 458 -240 340 121
8079 121 237 383 -526 178 39 77 333 -6 119 7 -34 -236 -202 -11 250 148 -145 331 68 104 -64
8100 -64 277 57 339 336 -185 169 -285 -135 -132 124 -78 124 86 -104 523 -285 -702 102 -268 36 129 280
8122 280 -456 118 -125 115 367 97 -88 -104 105 143 -5 68 -97 222 -60 -486 13 179 -256 -59 -317
8143 -317 183 -301 264 -268 -365 -90 -30 22 241 219 -277 -263 128 -384 51 -125 306 139 -187 36 -264 72
8165 72 349 -104 -28 -103 18 124 314 -255 165 91 -390 21 -170 121 157 -7 305 240 -314 495 190 5
8187 5 -985 -125 -507 176
8191A76
##END NTUPLES=NMR FID
##END=
