##TITLE=1H_SL34(AcOOH)
 CDCl3
 8 sc, 
 17.11.2021
##JCAMPDX= 6.0         $$ Bruker NMR JCAMP-DX V2.0
##DATA TYPE= NMR FID
##DATA CLASS= NTUPLES
##ORIGIN= UXNMR, Bruker Analytische Messtechnik GmbH
##OWNER= root
$$ XWIN-NMR		Version 3.5
$$ Wed Nov 17 11:29:25 2021 Russian Standard Time (UT+4h)  she@DPX200
##.OBSERVE FREQUENCY= 200.131346
##.OBSERVE NUCLEUS= ^1H
##.DELAY= (6, 6)
##.ACQUISITION MODE= SIMULTANEOUS
##.ACQUISITION SCHEME= undefined
##.AVERAGES= 8
##.DIGITISER RES= 18
##SPECTROMETER/DATA SYSTEM= spect
##.PULSE SEQUENCE= zg30
##.SOLVENT NAME= Acetone
##.SHIFT REFERENCE= (INTERNAL, Acetone, 0, 15.7039)
##AUDIT TRAIL= $$ (NUMBER, WHEN, WHO, WHERE, WHAT)
$$ ##TITLE= Audit trail, XWIN-NMR		Version 3.5
$$ ##JCAMPDX= 5.01
$$ ##ORIGIN= Bruker BioSpin GmbH
$$ ##OWNER= she
$$ F:/spectra/data/she/nmr/H-F/1/audita.txt
$$ ##AUDIT TRAIL=  $$ (NUMBER, WHEN, WHO, WHERE, WHAT)
(   1,<2021-11-17 11:26:59.06 +0400>,<she>,<DPX200>,
      <created by zg, POWCHK disabled, PULCHK disabled
       configuration hash MD5:
       00 E9 B6 7A A2 85 ED C7 34 08 36 98 17 FE 4E 26
       data hash MD5: 16K
       5D C3 71 61 B5 97 24 3D 74 60 EC 32 62 46 99 D5>)
$$ ##END=
$$ 
$$ hash MD5
$$ 9D 9C AC DD B1 51 39 6A D2 9C 8F 14 D6 50 EE 91
##$RELAX= 
##$RELAX= 
##$RELAX= 
##$RELAX= 
##$RELAX= 
##$RELAX= 
$$ Bruker specific parameters
$$ --------------------------
##$DU= <F:/spectra>
##$EXPNO= 1
##$NAME= <H-F>
##$PROCNO= 1
##$TYPE= <nmr>
##$USER= <she>
##$AMP= (0..31)
100 100 100 100 100 100 100 100 100 100 100 100 100 100 100 100 100 100 
100 100 100 100 100 100 100 100 100 100 100 100 100 100 
##$AQSEQ= 0
##$AQ_mod= 1
##$AUNM= <au_zg>
##$AUTOPOS= <>
##$BF1= 200.13
##$BF2= 200.13
##$BF3= 200.13
##$BF4= 200.13
##$BF5= 200.13
##$BF6= 200.13
##$BF7= 200.13
##$BF8= 200.13
##$BYTORDA= 1
##$CFDGTYP= 0
##$CFRGTYP= 5
##$CHEMSTR= <none>
##$CNST= (0..31)
1 1 145 1 1 1 1 1 1 1 1 1 1 1 1 1 1 1 1 1 1 1 1 1 1 1 1 1 1 1 1 1 
##$CPDPRG= <>
##$CPDPRG1= <>
##$CPDPRG2= <>
##$CPDPRG3= <>
##$CPDPRG4= <mlev>
##$CPDPRG5= <mlev>
##$CPDPRG6= <mlev>
##$CPDPRG7= <mlev>
##$CPDPRG8= <mlev>
##$CPDPRGB= <>
##$CPDPRGT= <>
##$D= (0..31)
0 1.2 0 0 0 0 0 0 0 0.06 0 0.03 0 0 0 0 0.0002 0 0 0 0 0 0 0 0 0 0 0 0 
0 0 0 
##$DATE= 1637134018
##$DBL= (0..7)
120 120 120 120 120 120 120 120 
##$DBP= (0..7)
150 150 150 150 150 150 150 150 
##$DBP07= 0
##$DBPNAM0= <>
##$DBPNAM1= <>
##$DBPNAM2= <>
##$DBPNAM3= <>
##$DBPNAM4= <>
##$DBPNAM5= <>
##$DBPNAM6= <>
##$DBPNAM7= <>
##$DBPOAL= (0..7)
0.5 0.5 0.5 0.5 0.5 0.5 0.5 0.5 
##$DBPOFFS= (0..7)
0 0 0 0 0 0 0 0 
##$DE= 6
##$DECBNUC= <off>
##$DECIM= 32
##$DECNUC= <off>
##$DECSTAT= 4
##$DIGMOD= 1
##$DIGTYP= 9
##$DL= (0..7)
0 120 120 120 120 120 120 120 
##$DP= (0..7)
150 150 150 150 150 150 150 150 
##$DP07= 0
##$DPNAME0= <>
##$DPNAME1= <>
##$DPNAME2= <>
##$DPNAME3= <>
##$DPNAME4= <>
##$DPNAME5= <>
##$DPNAME6= <>
##$DPNAME7= <>
##$DPOAL= (0..7)
0.5 0.5 0.5 0.5 0.5 0.5 0.5 0.5 
##$DPOFFS= (0..7)
0 0 0 0 0 0 0 0 
##$DQDMODE= 0
##$DR= 18
##$DS= 0
##$DSLIST= <SSSSSSSSSSSSSSS>
$$ [...]
##$SUBNAM2= <"">
##$SUBNAM3= <"">
##$SUBNAM4= <"">
##$SUBNAM5= <"">
##$SUBNAM6= <"">
##$SUBNAM7= <"">
##$SUBNAM8= <"">
##$SUBNAM9= <"">
##$SW= 18.0517287032376
##$SWIBOX= (0..15)
0 0 2 0 0 0 0 0 0 0 0 0 0 0 0 0 
##$SW_h= 3612.71676300578
##$TD= 16384
##$TD0= 1
##$TE= 0
##$TE2= 300
##$TE3= 300
##$TEG= 300
##$TL= (0..7)
0 120 120 120 120 120 120 120 
##$TP= (0..7)
150 150 150 150 150 150 150 150 
##$TP07= 0
##$TPNAME0= <>
##$TPNAME1= <>
##$TPNAME2= <>
##$TPNAME3= <>
##$TPNAME4= <>
##$TPNAME5= <>
##$TPNAME6= <>
##$TPNAME7= <>
##$TPOAL= (0..7)
0.5 0.5 0.5 0.5 0.5 0.5 0.5 0.5 
##$TPOFFS= (0..7)
0 0 0 0 0 0 0 0 
##$TUNHIN= 0
##$TUNHOUT= 0
##$TUNXOUT= 0
##$USERA1= <user>
##$USERA2= <user>
##$USERA3= <user>
##$USERA4= <user>
##$USERA5= <user>
##$V9= 5
##$VALIST= <valist>
##$VCLIST= <CCCCCCCCCCCCCCC>
##$VD= 0
##$VDLIST= <DDDDDDDDDDDDDDD>
##$VPLIST= <PPPPPPPPPPPPPPP>
##$VTLIST= <TTTTTTTTTTTTTTT>
##$WBST= 1024
##$WBSW= 4
##$XGAIN= (0..3)
0 0 0 0 
##$XL= 0
##$YL= 0
##$YMAX_a= 138741
##$YMIN_a= -213596
##$ZGOPTNS= <>
##$ZL1= 120
##$ZL2= 120
##$ZL3= 120
##$ZL4= 120
##$ABSF1= 10
##$ABSF2= 0
##$ABSG= 5
##$ABSL= 3
##$ALPHA= 0
##$AQORDER= 0
##$ASSFAC= 0
##$ASSFACI= 0
##$ASSFACX= 0
##$ASSWID= 0
##$AUNMP= <proc_1d>
##$AZFE= 0.1
##$AZFW= 0.1
##$BCFW= 1
##$BC_mod= 2
##$BYTORDP= 1
##$COROFFS= 0
##$CY= 11.3945322036743
##$DATMOD= 1
##$DC= 2
##$DFILT= <>
##$DTYPP= 0
##$F1P= 2.36226072786647
##$F2P= -0.459571619588291
##$FCOR= 0.5
##$FTSIZE= 0
##$FT_mod= 4
##$GAMMA= 1
##$GB= 0.15
##$INTBC= 1
##$INTSCL= 1
##$ISEN= 128
##$LB= 0.24
##$LEV0= 0
##$LPBIN= 0
##$MAXI= 10000
##$MC2= 0
##$MEAN= 0
##$ME_mod= 0
##$MI= 1.114404
##$NCOEF= 0
##$NC_proc= 0
##$NLEV= 6
##$NOISF1= 3.799351
##$NOISF2= 2.8
##$NSP= 1
##$NTH_PI= 0
##$NZP= 0
##$OFFSET= 15.70392
##$PC= 1
##$PHC0= -15525.21
##$PHC1= 30.80081
##$PH_mod= 1
##$PKNL= yes
##$PPARMOD= 0
##$PSCAL= 0
##$PSIGN= 0
##$REVERSE= no
##$SF= 200.130013532006
##$SI= 16384
##$SIGF1= 3
##$SIGF2= 2
##$SINO= 400
##$SIOLD= 16384
##$SREGLST= <1H.CDCl3>
##$SSB= 0
##$STSI= 0
##$STSR= 0
##$SW_p= 3612.71676300578
##$SYMM= 0
##$S_DEV= 0
##$TDeff= 0
##$TDoff= 0
##$TI= <>
##$TILT= no
##$TM1= 0
##$TM2= 0
##$TOPLEV= 0
##$USERP1= <user>
##$USERP2= <user>
##$USERP3= <user>
##$USERP4= <user>
##$USERP5= <user>
##$WDW= 1
##$XDIM= 8192
##$YMAX_p= 0
##$YMIN_p= 0
$$ End of Bruker specific parameters
$$ ---------------------------------
##NTUPLES= NMR FID
##VAR_NAME=  TIME,          FID/REAL,        FID/IMAG
##SYMBOL=    X,             R,               I
##VAR_TYPE=  INDEPENDENT,   DEPENDENT,       DEPENDENT
##VAR_FORM=  AFFN,          ASDF,            ASDF
##VAR_DIM=   8192,          8192,            8192
##UNITS=     SECONDS,       ARBITRARY UNITS, ARBITRARY UNITS
##FACTOR=    0.0002768,     1,               1
##FIRST=     0,             0,               0
##LAST=      2.2672688,     0,               0
##MIN=       0,             -213596,         0
##MAX=       2.2672688,     138741,          0
$$ Real data points
##PAGE= N=1
##DATA TABLE= (X++(R..R)), XYDATA
$$ [...]
1788c29m90J529n25p60R24k1n46P85j0q32P04M33j885J386P93j853M93J249j394
1807c49m35J111m43l84P41o85Q3J161j046l80J468n67r54J522P5j225L83N64o96
1826e6M44L9n40P03J05j109P29N59j462J79R35q54l88O64k76oM00r63M65Q74j000
1847e58k68J162m65o21R83J05o19L56N2k46K77m8J81O0j02k83L85K5m96J95J09
1868A84l89K28k91J0P95q80m38R94J02q21M60P43j130L21O91r89N13M42j002P51
1888B94M55j083K71J329j344n40J069l71n48N74j15m96L27k35m16J065o10o47
1906a021J063K17j132Q18K83q99N80M18m16K34K97p56P16N10j282M37J187j105
1924A49o60J417o62q28J220n22m94O63n25k88J137p48o93R86J61j007N42M01m38
$$ plain form
1788 -329 -819 710 185 -575 349 328 -218 567 557 -275 429 862 -1023 363 1156 -697 -204 1045 -349
1807 -349 -784 327 -116 -500 241 -444 -361 800 -246 -626 842 275 -679 843 918 -307 76 640 -56
1826 -56 388 427 -113 590 695 -414 315 874 -588 -409 526 -328 -716 -52 -328 -334 66 -897 -432 442 -558
1847 -558 -826 336 -129 -750 233 338 -281 75 127 -119 158 110 291 351 249 -34 351 376 -120 75 184
1868 184 -205 23 -268 -258 537 -343 -781 213 315 -506 -46 697 -433 -112 579 -410 103 545 -457 294
1888 294 749 -334 -63 1266 -78 -618 451 80 -468 106 -9 -505 -178 -413 -829 236 -374 -1021
1906 -1021 42 259 -873 -55 228 -671 -91 327 -89 145 442 -314 402 912 -370 67 1254 149
1924 149 -511 906 244 -584 636 114 -380 283 -242 -530 607 -141 -834 152 313 -694 -152 249 -189
1943a89O8J7PK00o9j90N02K81j016O76K68q89N07M29n34m3k3n39N06Q3n95K40
1965c03P29j211j98J164l11l85Q00j81l12M18m45P8Q08m28m01R19k32q56R39J06
1985F98p50L11K44m20K09J71o28K48J88j248Q52O24j171O6J094n73n34O26m1k53
2005b87M89n27K44N65m37o29J115k14q62M78O14m42K35k83M43j05m71j12N29k87
2025E6m68N44Po87M5M48m83M80M04l40M61k70j033J176K93j047O5J120q39N0P87
2046G69n22l0M49o20l9N63p10j87R49m62r14N86k7l82J66N24j69k02k62J66P50
2067C96m95p01J262j07j235P47Q23j193M47L50n49L95M36r44N86P78j160l25J238
2086G49p52q36J458m16p09L26K4l25L43J20j06K58J92n93K79P70q87j31Q07l0
$$ plain form
1943 -189 -121 -104 -97 103 34 -156 346 627 -389 287 555 -334 173 602 68 25 2 -537 -31 52 -543 -303
1965 -303 426 -785 -983 181 -130 -515 285 104 -208 210 -235 -157 651 223 -178 741 509 -347 592 698
1985 698 -52 259 503 83 292 463 -165 83 271 -977 -125 499 -672 -606 488 -85 -619 7 -34 -287
2005 -287 202 -325 -81 484 47 -582 533 319 -543 -65 549 107 342 59 502 397 -74 -186 343 56
2025 56 -412 132 139 -548 -503 -55 -538 -58 346 6 467 197 -836 340 633 -414 -349 771 -68 -18 769
2046 769 247 217 666 46 7 570 -140 -327 622 160 -754 -168 -195 -577 -411 113 -56 -258 -520 -354 396
2067 396 -99 -800 462 355 -880 -133 690 -503 -56 294 -255 140 576 -368 218 996 -164 -489 749
2086 749 -3 -839 619 203 -506 -180 -156 -481 -138 -18 -124 134 326 -267 12 782 -105 -236 571 541
2106E41n43j78M53J97k96j04L15j54n26N98L86p34j46J91j72k93J57k61O14n0
2126en62J43Q49p70r3J190l15q14J64J32J78R7l43K9M39j98k92P57j80q10R54
2147E50o6n34J44j94m5L12q4q04P25j32q93J024O36j311M86J063p61l22Q72o66
2167@l7M32p25j48J189q31o45J099R6j029P59N61r92L15K01o82Q9K86o42N10J95
2188Ao63L42L95l62j04Q18j01m18L17j84K86j75l77J37L41l53l88R24j51k84L72
2209C73R9j77l50J97n0k26j14J34l8J46o35L69J19j55L47NM9J75l13k2N85m46
2231G2l92Q27k87p03L38N79n07K42l32j12M45J92o77L03O26j048n6P90n43n38
2251g81Q95k11n83Q73l33k59R54n82l98J146m71o75P59K53j301N93M20m79L71
$$ plain form
2106 541 -2 -180 273 470 174 70 385 231 -295 303 689 -45 -191 0 -172 -465 -308 -569 45 -5
2126 -5 -567 -424 425 -345 -438 752 437 -377 -213 -81 97 194 -149 -120 319 121 -171 586 406 -404 550
2147 550 484 -50 94 -100 -145 167 83 -721 4 -128 -1021 3 639 -672 -186 877 116 -206 666 0
2167 0 -37 395 -330 -478 711 -120 -765 334 430 -599 160 721 -271 44 245 -437 -348 -62 -704 -194 1
2188 1 -662 -320 75 -287 -391 427 326 -92 225 41 327 152 -225 -88 253 -100 -488 436 285 1 373
2209 373 472 295 -55 142 92 -134 -248 -114 -152 -6 -641 -272 -153 -308 39 44 93 268 -45 -67 518 72
2231 72 -320 507 220 -483 -145 434 -73 169 -163 -275 170 362 -315 -12 614 -434 -490 300 -243 -781
2251 -781 114 -97 -680 193 -140 -399 555 -27 -425 721 250 -425 334 587 -714 -121 299 -180 191
2270A91J41o53N21M04j087M57O37r71qP10o91l99R53k62m36N20j40k5L60k50k05
2291b33O16j11q15O50M01r31J62N74j6l16j39K12L66n35r0M18J90n97L0J78R7
2312A11m65K38q0rK9k17N49k32oM54J60m68j73M40J56o76K58K57l19R0l01m1R11
2335F66o44n09P32P8n44K50L3l30L0Q9l87M82k40k99Q27k39m22O55M79o96J74
2356A85M93o50J8J40l08N7M05p32K43P14p48m66J122l47m99O16m8l54K29j57l72
2377d59J90K03m43L52L92o27O36M61n56j25L71J02n78M48l52R8N8m03J30J59j99
2398a42j32K88L13m53j71K65j97O5L1nJ84j80n80R84m47k57M07M63l01j77L52
2419C10j43J50l15j30N02n9n50K97L29m83j64J83J37j3l04K18J57K03m92J61J61
$$ plain form
2270 191 332 -321 200 604 -483 -26 611 -360 -368 342 -349 -748 205 -57 -493 27 -113 -138 222 -28 -233
2291 -233 383 272 -543 107 508 -423 -261 313 297 -19 -158 54 420 -115 -205 213 403 -194 -164 14 111
2312 111 -354 -116 -196 -205 -176 -393 156 -76 -82 372 532 64 -109 331 487 -189 69 326 7 97 -204 -245 666
2335 666 22 -487 245 323 -221 29 62 -268 -238 -149 -536 -54 -294 -593 234 -5 -427 228 707 11 185
2356 185 678 28 46 186 -122 -65 340 -392 -149 565 -183 -649 473 126 -373 243 195 -159 70 -87 -459
2377 -459 -269 -66 -509 -157 235 -392 244 705 149 24 395 497 -81 367 15 113 171 -232 -102 57 -142
2398 -142 -274 14 327 -126 -297 -32 -229 -164 -133 -138 46 -134 -714 270 -177 -434 -27 436 135 -42 310
2419 310 167 317 2 -128 374 315 -235 62 391 -92 -256 -73 64 51 -253 -35 122 325 -167 -6 155
2440A55p28L19M80n81k29N21j29J33K21k58L23K93n35j80P27m06p51P24K26o63
2460c38K12M2k02L72k0m15L43K84o23R6O32n02n14Q08j57m28M09o5R3J49m9o1
2482F6L01k60K77j9l15n0K14k44j46L0o6K17M14n76OO18j89n96N93jn97L5N10
2505B22m59n3P8k38O11N1m03J81M19m84PN53k22k70K13p9mk55j47P3L84o36J41
2528c17N06m26j03M67j39l40M24K7m07L82l62N0N08k04l83P91J09q63L40P20r55
2549a75K73J40l69k22N78j61k60M37l96m5L00O8l73Q8J09k23J92k09K11j05m7
2570a89K77K7j42o6M66k18k27L34k1j13l6L2k0K40k59o56M33O1m58N40O06p27
2592a16j94O72n31k13M03L91o99L98k57L0J15p9j24P8K53j12J25K10o1K21l72
$$ plain form
2440 155 -573 -254 226 -355 -584 -63 -192 -59 162 -96 227 520 -15 -195 532 126 -625 99 325 -338
2460 -338 -126 -84 -286 86 66 -349 -6 278 -345 -249 383 -119 -633 175 18 -410 -1 -66 27 176 127 66
2482 66 367 107 384 365 50 0 214 -30 -176 -146 -212 5 419 -157 -151 467 278 -318 275 274 -323 -288 222
2505 222 -237 -290 -212 -450 161 212 -191 -10 409 -75 -68 485 263 -7 206 127 123 -132 -279 -206 178 -458 -317
2528 -317 189 -237 -340 127 -12 -352 72 99 -308 74 -288 -238 270 66 -317 474 583 -280 60 780 -175
2549 -175 98 238 -131 -353 225 64 -196 241 -155 -200 100 168 -205 -117 -8 -231 -39 -248 -37 -142 -189
2570 -189 88 115 -27 -93 373 155 -72 262 241 128 92 124 104 344 85 -571 -138 -77 -535 5 611 -116
2592 -116 -310 362 -169 -382 21 412 -287 111 -146 -116 -1 -80 -204 -126 127 15 140 350 289 510 138
2613A38J50j6m53k09Q45m92k11K54N4l98j4O76m80O9M15o32K07L67p15J36P49
2634D40q09j80P24k19j98L76J20m54M37J05j06l29L80l81K18k94o9K54j56j8J76
2655A7Ok08K69l51J98K61m18l9J32K03o00L90L38n39N06Q7k86J55J88l82P6K50
2677B53l86j53N86j86k29K10o9l7l90K91N4K88k92k4M2K0l70K70J48j52L54j68
2699F0l33M29l18L1N80k00l88M91P1n18J84M45l86k53L76m40j33K40l43L07J62
2720F4l10j5M42j08o89O28K12l48j76O20k55J56j62j12L07m7j68K78J71o23j44
2741b79M03k13J01j03R2j29Q0k1K2J44k26o7M47l01r0Q3K41m92R4K83m2k15J44
2764d4n0K92j58j91M72O8l99r0K83k19j03M6L20l01j57j03M2J66j62M42j55o2
$$ plain form
2613 138 288 272 -181 -390 455 -37 -248 6 60 -338 -352 324 -156 -87 328 -304 -97 270 -445 -309 440
2634 440 -369 -549 175 -44 -242 134 254 -200 237 342 236 -93 287 -94 124 -170 -239 15 -141 -159 17
2655 17 23 -185 84 -267 -69 192 -226 -265 -133 70 -530 -140 198 -341 165 252 -34 121 309 -73 3 253
2677 253 -133 -286 300 114 -115 95 26 -11 -401 -110 -56 232 -60 -84 -42 -22 -392 -122 26 -126 228 60
2699 60 -273 156 -162 -131 449 249 -139 352 423 -95 89 534 148 -105 271 -169 -302 -62 -405 -98 64
2720 64 -246 -261 181 73 -616 12 224 -124 -300 320 65 221 59 -53 254 207 39 317 488 -135 -279
2741 -279 124 -89 12 -91 1 -128 -48 -69 -47 97 -129 -196 251 -50 -140 -57 184 -308 -214 69 27 -188 -44
2764 -44 -94 198 40 -151 321 389 -10 -100 183 -36 -139 -93 227 -74 -231 -334 -292 -126 -288 154 -1 -63
2786f3l8O1J11J6k62j37M75K45p56J0Q21o68L30K25k42PK59k09k99Q4j56o5K73
2809B2k71l38O55J52o63L39K04l25K86o6j28R3J02l88K61K15k57J48K89n50N9
2830a61N46j36o28L54L1r1L63l68m8K08N9j73R8o9l03j5M84j70j90J49l9J95m6
2853E0j87R2J69m57M57J25k41j36J57P9lj06J16K97l46j27p4P3j86J50J80j54
2875g2j66M0o6K33k35O4J68K25l8k44L28j36m13M25K80m42L75k97L0K55l11K5
2897B8J35j86k32N62k65j20o8L97k56%J20P3l13L10n12K78K94l61j67M97m13j88
2919c87O80j90j37j28L22j35K66j62k83M17k81j09M3L30l49j13J93k05J45n1J39
2940Ej89J21j06J00K75k75n6R7O2J16j57R5j31P2j40J42Rl5j22M38j71k33J36
$$ plain form
2786 -63 -101 -40 71 87 -175 -312 163 408 -348 -338 483 -185 145 370 128 135 394 185 -114 -30 -186 -251 22
2809 22 -249 -587 68 220 -443 -104 100 -225 61 -5 -133 -40 62 -326 -65 150 -107 41 330 -220 -161
2830 -161 385 249 -379 -25 6 -85 278 -90 -138 70 129 -44 54 -15 -318 -333 151 -19 -209 -60 -99 96 50
2853 50 -137 -45 124 -333 124 249 8 -128 29 108 105 -1 115 412 66 -61 -135 -62 -248 -98 82 -72
2875 -72 -238 -198 -264 -31 -266 -202 -34 191 153 -91 237 101 -312 113 393 -49 326 29 59 314 3 28
2897 28 163 -23 -255 307 42 -78 -146 251 -5 -5 115 188 -125 185 -327 -49 245 -116 -283 214 -199 -387
2919 -387 293 103 -34 -162 160 25 291 129 -154 263 -18 -127 -84 246 -103 -216 -23 -228 -83 -134 5
2940 5 -184 -63 -169 -69 206 -69 -125 -28 34 150 -7 88 -43 29 -111 31 40 5 -117 321 150 -83 53
2963E3j8k86K14m7K33j38p9J67j59J76m08K55N2j43o7K66J12k80J41M0L8j4O4
2986A72j27K05l08m5N2p4J98K5j47J07K7j16p4L19m15k23O51j47l08K69j78o9
3008b06K54n9k25J81N2o0K10K02m73K98Nr0m6J60k99l7K02j83P5R6l6J27L1J4
3032A93n40O13k00k23j7Q3O2k4K3O1K86l94r6K36J78k88M08n7k51MK12k55J90
3055B04r8L6j72j05j74L27j51j56K62J03N9k86M0j7K14j07kJ69j62K12k34K04
3077A66o3j77M08m66J77J20l4j56L07j88l41L91%m11K51P4m34K45J06j02k51M90
3099A12k3m5o2k90L00k15O0K02O6j19j63K44J62j22o5L8j00J58j14mJ72Q5k78
3122aK76m78p5L86j18j87J93K7j93J15J54m06N04l32o5L07L30n50j04N59j15r8
$$ plain form
2963 53 35 -251 -37 -84 149 11 -68 99 -60 116 -292 -37 15 -128 -195 71 183 -97 44 84 122 108 172
2986 172 45 250 -58 -103 -51 -125 73 98 -49 58 85 -31 -105 214 -201 -424 227 80 -228 41 -137 -206
3008 -206 48 -11 -236 -55 -3 -63 147 349 -124 174 179 89 43 203 -96 -133 69 -114 -39 57 21 148 179 193
3032 193 -347 266 66 -157 -174 -91 -29 -53 -30 31 317 -77 -173 63 241 -47 361 304 53 57 269 14 204
3055 204 106 142 -30 -135 -309 18 -133 -289 -27 76 135 -151 -111 -128 86 -21 -23 146 -16 196 -38 166
3077 166 103 -74 334 -132 45 165 131 -25 282 94 -247 144 144 -267 -16 58 -376 -131 -25 -127 -378 112
3099 112 89 44 -18 -308 -8 -223 -163 39 105 -14 -177 67 229 107 42 80 -20 138 24 20 192 277 -1
3122 -1 275 -203 -278 108 -10 -197 -4 23 -170 -55 99 -307 197 -135 -200 107 437 -113 -217 342 227 129
3144A29j91R0m0o5N0L5k16K92j92K65rl07J70J52k73J09k41J50N3L0J9J66k17
3167d1m12M88K56m09J75P8l62M23k16P2J11Q5j22MJ74l10j89L97j25n26L59J3
3189g7RP1k86M20j21r9j20L44q0k60K74K54l34o8K5j21O0Q3O7J95j62j78L87n2
3213B31l06j64J92P6r4K56o35K24R9L0k05K46q2l9L08j79r9K56l16L41lk9P6k34
3237e0J85J66M2j62l61K72J72l07J28O8m00K37j06R9J74j24m14N36j21k48K18
3258DJ91m03K40P0k31j5K82j16j28L27k26o0K53j57J26k27M28n98K91J39l59N
3280a64M23k52p3j35k0J62J23l46L14J32l42J62l5M8O7RN8j09K35p9o2l6k5k05
3304a50L71k51m5q5K02q4k2j09j07L11k56K0k0K19j46J93M0N2mj82mO2j79J34
$$ plain form
3144 129 -62 28 -12 -77 -27 8 -208 84 -108 157 148 -159 11 163 -110 -1 -242 -92 -39 -9 10 176 -41
3167 -41 -453 35 291 -118 57 135 -227 196 -20 52 163 248 126 130 304 -6 -195 202 77 -449 -90 -77
3189 -77 -68 3 -283 137 16 -83 -203 141 61 -199 75 329 -5 -73 -48 -169 -109 -26 41 236 74 -104 283 231
3213 231 -75 -239 -47 29 -65 191 -444 -220 -121 -91 -296 -50 -132 -171 137 -42 -141 115 -201 140 137 108 184 -50
3237 -50 135 301 343 181 -180 92 264 -43 85 153 -247 -10 -116 -17 157 33 -381 155 34 -214 4
3258 4 195 -208 32 102 -129 -144 138 22 -106 221 -5 -65 188 31 157 -70 358 -240 51 190 -169 -164
3280 -164 259 7 -66 -201 -221 -59 64 -282 32 164 -178 -16 -51 -3 64 73 131 22 257 178 116 80 55 -150
3304 -150 221 -30 -75 -160 42 -42 -64 -173 -280 31 -225 -205 -225 -6 -152 41 81 133 129 -53 -57 5 -174 -40
3328d0L72j27m21K97jj43K05%j04O0Lj24N6j25p2K27R8j92l17L07k64J60R9j27
3352a73m3K42Q3o6J03j32J39Q7k02l48L13K10k21K0J72l32L56k57K7k6K85o11
3374c74K55J05M4j49J64j47PK66j33j79J42p2j30L00q3O7J43j58o0k33J88n5j56
3397b48p2M68j13j51M9L39k19j57J19J07r9Lj39O2K78k92K28j54R1k31K12j13
3419c2j5J85j14K38k28r8J01j46K38l44R6M54p19M89J38l45Q9KO6n5qk69R3L46
3443A62k25q3K23j74K08R5k5j12N6R9k86K4K75j53p9K20j07Q1J07l53j35J7L67
3466B02j10j44L63m78m7r0J73n5J16m4q9m2J84J8N0N5k12J03Po3J36j48j08K27
3490DK0k0K24l70J89r2P7J1n2Q0j72P1R0R1k94O3j27K13m1j00L45J0n13jL03o5
$$ plain form
3328 -40 332 205 -216 81 80 -63 142 142 38 98 101 -23 33 -92 -164 63 161 -31 -348 -41 -305 -145 -46 -173
3352 -173 -216 26 109 43 146 14 153 240 38 -310 3 213 -8 12 184 -148 208 -49 -22 -48 237 -374
3374 -374 -119 -14 30 -119 45 -102 -95 171 38 -141 1 -71 -201 99 16 83 226 68 8 -225 -37 -92 -248
3397 -248 -320 148 35 -116 -67 272 53 -104 15 122 23 26 -113 -51 227 -65 163 9 100 -131 81 -32
3419 -32 -47 138 24 262 34 -64 37 -109 129 -215 -119 335 -384 105 243 -102 -13 -11 55 0 -8 -277 -184 162
3443 162 -63 -146 77 -97 111 206 181 69 125 224 -62 -38 237 84 5 225 118 199 306 -47 -182 -165 202
3466 202 92 -52 311 -167 -214 -304 -131 -186 -70 -114 -203 -245 -61 -43 7 62 -150 -47 -40 -103 33 -115 -223 4
3490 4 24 4 228 -142 47 -45 32 43 -9 71 -101 -30 60 151 -143 -80 -207 6 -35 -135 210 220 -293 -294 9 -56
3516e6K97q9r2O3j84J27L9Q3q1l09K05J8k35L92L2k23n7r8J39K8k40J60qj08L
3541a94L1K23p7j70K84Q9k08L7j39L73m37Q9K17k61j32M83k52j10J93L9j08J52
3563A22n3k78M34k90k31J83K35k52J8P4o5P5j7J12j53J15m0K17K2l74K62Nj18
3586CJ4k7R8k88K96j31l2O7l0K01k9q3m22K51M16o47J37K58k57K21N0K7k22P0
3610e9mM5J00k06o0M24n7l49P4J5O7Q1m6J77l2j72m0K73j63m26K07K48j88q8L43
3635A64J13O0k59k20N0%j4J43L14n42K20o2R6j50P3K4Q4P4j04k6J92k50jK09j50
3660C8J54k94J18O0k4j28n4K62j13j44K35J70j94R2j6j60M9K9Lp1J97l07K09p6
3684C5l13K85l87M55k69J99J33k94J37j4j63J71qj68M9K5J23j32n6J33Q1K0O9
$$ plain form
3516 -56 241 152 60 123 -61 66 105 188 107 -202 3 21 -214 178 210 -13 -70 -168 -29 -1 -241 -81 -89 -197 -194
3541 -194 -163 60 -17 -187 97 186 -22 15 -124 249 -188 -99 118 -143 -275 208 -44 -154 39 78 -30 122
3563 122 69 -209 225 -65 -296 -113 122 -130 -112 -38 -103 -28 -45 67 -86 29 -11 206 228 -146 116 121 3
3586 3 17 -10 88 -200 96 -35 -67 0 -30 171 142 59 -363 -112 304 -343 -206 52 -205 16 66 93 -129 -59
3610 -59 -63 -18 82 -124 -184 240 183 -166 -92 -77 -10 71 25 202 170 -2 -42 231 68 -358 -151 97 -91 -179 164
3635 164 277 337 78 -142 -92 -92 -106 37 351 -191 29 -33 63 -87 -14 10 94 168 64 38 230 -20 -21 188 38
3660 38 192 -102 16 76 52 -76 -130 132 19 -125 110 280 86 178 162 2 51 80 83 12 209 -98 111 35
3684 35 -278 7 -380 75 -194 5 138 -156 -19 -33 -196 -25 -33 -201 -152 -127 -4 -136 -192 -59 22 42 111
3707A11j00K15j68J13l02L89m9k93m6L33l87LK44o0n0k94M71l40L85j66Rj24N
3730a01k35K83K13k79j9K79j24k31J95L49l28J34j00j4j56N6j69K52l2J26Nk58
3752a54J55R5k80n8L69k81M0J4J8K16p1j38J21k3m1O6pn4J51J95m98k0J34K55
3776B04j01M3j9q7R1j59k66N91k25k44K17o8l5N7J15q2J64k90K9l2k9J8J22J13
3800A27mj76K34j53k77J55K8J41j20K9j24Q9J06l54K34J83q6J84r2n1n8r3j44
3823b22L48k74K29j11j97J59J3J87j82nJ3K56j53K8J63j47N0j86j55K17n7n2K14
3846A36r3l43L19Q7j45O7o1p6j66L47k34K74p6k3j00K71m10L30m4k1jj91J49N
3870AMQ2j41K14l45K46K30j46m2j55r2J59o9l5Q7l17J41p1M02J5j56M5J73q7j04
$$ plain form
3707 111 11 226 58 171 -131 258 209 -84 -130 203 -184 -181 63 3 -47 -341 130 -210 175 9 18 -106 -101
3730 -101 -336 -53 160 -119 -138 141 17 -214 -19 330 2 136 36 22 -134 -78 -247 5 -27 99 104 -154
3752 -154 1 96 -184 -242 127 -154 -114 -100 -82 134 63 -75 46 23 -18 48 41 -13 138 333 -165 -185 -51 204
3776 204 103 146 127 40 131 -28 -294 297 72 -172 45 -23 -58 -1 114 32 196 -94 -65 -97 -126 -108 14 127
3800 127 123 -53 181 28 -249 -94 -66 75 -45 -16 -140 -51 55 -299 -65 118 32 216 124 73 15 -78 -222
3823 -222 126 -148 81 -30 -227 -68 -55 132 -50 -55 -42 214 61 89 252 105 155 -31 -186 31 -26 -78 136
3846 136 43 -300 19 106 -39 28 -33 -109 -275 72 -162 112 36 13 -87 184 -226 104 60 39 38 -153 -4 1
3870 1 5 87 -54 160 -185 61 291 145 103 -52 -144 15 -54 -89 -2 -319 -178 -249 153 168 12 57 230 143 39
3895C9o5Q5pJ77k55M2j15J13j21j5K65m9j39j18J98J13k06j36K66j16j37J78J11
3918A08r4n3mMK94o4j41J67j66O4j08L6k32Q2K35k2K0p6l69L38m8J7M0L3Rj87
3944a17j5L71l87R3q6O4J70j48n8K34k6l41L37j39K63m17M15j61j2M0q6K5p5j4
3968g0k6J28j11J08m0R3J20k92j01r6N03k55L4J4n9P4r9P4j88J11K59k67R5J22
3992A31m6j93J4L48k48j56K83k87M7J87N3l49J94J14j85o9R9K3l7J2Q0j37K81
4015A59j2j47m0J48n1J59k32j28J98O9O0j84K66l56k8R9l8%j60K31qj17Q0N3J28
4040A49k86r5N3L17j29j33J73j61j01L36j20o0J66or2K5L3p3J26N0l31M8K92k70
4064h9J71J08k9q6Ro6j90M25k90K24k98L4K4j55R2N2J47pk07K47q4K4j14J35k26
$$ plain form
3895 39 -26 59 52 229 -26 16 -99 14 -107 -122 143 94 -45 -163 35 148 -58 -194 72 -44 -181 -3 108
3918 108 14 -39 -43 -39 255 191 50 217 51 115 7 43 -189 -107 128 106 126 50 -319 19 -29 -12 28 61 70 -117
3944 -117 -132 239 -148 -55 -141 -77 93 -55 -113 121 95 -246 91 -48 215 -202 213 52 40 80 -6 19 -56 -70
3968 -70 -96 32 -79 29 -11 82 202 -90 -191 -287 216 -39 -5 9 -50 24 -75 -1 -189 -78 181 -86 9 131
3992 131 85 -108 -94 254 6 -150 133 -154 -107 80 133 -216 -22 92 -93 -162 -63 -40 -77 -65 15 -122 159
4015 159 147 0 -40 108 57 216 -16 -144 54 123 183 -1 265 -91 -119 -20 -58 -58 -218 13 5 -112 -32 21 149
4040 149 -137 -232 -179 138 9 -124 49 -112 -213 123 3 -57 109 103 11 36 69 -4 122 172 -159 -111 181 -89
4064 -89 82 190 161 75 84 18 -172 253 -37 187 -111 -77 -53 -208 -116 -64 83 76 -131 116 32 56 -58 77 -149
4089a49Q0p0J27r5Q6Jj73L6Q9oL0Q2L9Ll73J59K99k02K97j64r0P5j23jJ0N1O4
4116H2j14K74j35l22J55K02O4j28n2j28nj07K41l2j50J30K5k48K07n0N6L15k38
4139D2k38J38P8J62j26N3j94j63L24j06J09M9r2o4M8p2j08K61q2R3r9J53l78L15
4163A03j36j18J78k33L54r8J29n9k43L61m14M40m48K51l07N03k44l6K52L2l43
4184g6N0M9j21J56N1k27j8J09jPM5k08J13P3L5m6m26L96L8Rp8n9K19l02J17K51
4210A56j89j42J85j7M2J3k04J30J13k90J2L59j36O2Q5k38P0k02j03K02j32K03
4232b1K1q9k1L30k38R5l01L09j81O9p6K26j37J31k39O3J79O8l63J58M2L2j58L29
4256B28j86j29O9j03L50pm09M45j65j97l6K15l8K31k36j48M11k22k1P9l26L32
$$ plain form
4089 -149 -69 -139 -12 -107 -21 -20 -193 -157 -68 -74 -44 38 77 80 -293 -134 165 -37 260 96 6 81 -42 -43 -33 18 82
4116 82 -32 242 107 -215 -60 142 206 78 26 -102 -107 -214 27 -5 -155 -25 0 -248 -41 -91 -35 280 42
4139 42 -196 -58 20 182 56 109 -85 -248 76 -30 79 128 36 -28 20 -52 -160 101 19 112 13 166 -212 103
4163 103 -33 -151 27 -206 148 50 179 120 -123 238 -176 264 -184 67 -240 263 19 -17 235 267 -76
4184 -76 -26 23 -98 58 109 -118 -136 -27 -28 -21 24 -184 -71 2 37 -9 -435 -39 -1 8 -70 -129 90 -212 -95 156
4210 156 -33 -175 10 -7 35 48 -156 -26 87 -203 -191 168 32 94 179 -59 11 -191 -294 -92 -224 -21
4232 -21 0 -89 -110 220 -18 77 -224 85 -96 -27 -103 123 -14 117 -122 -59 120 188 -175 -17 25 57 -101 228
4256 228 42 -87 -18 -121 229 222 -187 258 93 -104 -140 75 37 268 32 -116 295 73 52 131 -195 137
4278A37k29n3J83k35J76L2O9J90j92J07k47L07k43k9J47k22J81n4j31J57j61j4
4300a24PJ92J1J78k07j89J66n8O9l02L72j63j12J53Rj35J89o8k0M32k34r0O1q6
4324E1j26J68P2j77j56M1K18O3r5k04K85k06J4J01j01J77%o9q6L02n18K28j74
4347a92J55Oj34N5J25j72L4m9J68k03K95j82Q1q6J07P4k4k77K23j80K96j07j51
4370a38L18j87J47r9j05J36n7j03K53p1k40J62Lj10J18k98M7K83j80K4p5J4Q3
4393g5j23L8J29O4K23l53K25j35j52K51p1J20J8k84R6J0J66k37J02R6k74L06k30
4416i0N6J04o2j76J8M2K68k68J9K2Q3p2J4Q8J52r2o7J3l5j32K39j5k23J54j0J01
4442A31k90M14n59J67J50j73L95k08j12J24l07L33j5j7K25m3q8m23J27L24j49
$$ plain form
4278 137 -92 -145 38 -197 -21 11 80 270 78 185 -62 245 2 -27 120 -102 79 25 -106 51 -110 -124
4300 -124 -117 75 86 264 57 -132 34 -24 45 -257 115 -48 -160 -7 2 -133 56 -12 -32 400 166 76 137 51
4324 51 -75 93 165 -12 -168 -127 91 154 59 -145 140 -66 -52 49 -52 125 125 56 -30 272 -246 -18 -192
4347 -192 -37 -31 -165 -110 15 -157 -123 -172 -4 -207 88 -94 -13 -99 8 82 58 -219 4 -176 120 13 -138
4370 -138 180 -7 140 41 -64 72 15 -88 165 94 -146 16 19 -91 27 -271 -224 59 -121 -97 -172 -158 -75
4393 -75 -198 -160 -31 33 256 -97 128 -7 -159 92 21 141 159 -125 -29 -19 147 -90 12 108 -166 140 -90
4416 -90 -34 70 8 -168 -150 -108 160 -108 -89 -67 16 -56 -42 46 198 106 39 52 17 -115 124 109 -114 40 30 131
4442 131 -159 255 -304 -137 13 -160 235 27 -85 39 -268 65 50 33 258 215 127 -296 -169 155 6
4463FK21n05M41j26j35P5k01N13l17O2n8J24k26J34Q6k69N8j60J76K14k20J02
4485eJ1L6o4qP2O6j25J53j59R3j66K20k38R4l5J47p2n7J4m0p1J03P9J5O5j32j66
4512a70M30l52P4j29K18k46K20k11K9K05j29P6M9Jr5K12k76J68j66P8J66k23J49
4535G8n1j56J94k64L13k03J99Jn6j57J2k2K02O5k90J06k0mj12M2J02K35r6k17
4559i9K0O3L5k9O9k68L96o9k20J91Q0j09K5l76K1K91r5j20o3j8PK86J09p1k1j36
4585a01o2J81J26j64j24J50j04n2K69n1m6lJ20L6k06J39P1k16K03l88L74j70o2
4608h0l4K55j82J54q9r6J26j30N9o4K77l60K37Mj33j35K74q1P7J9k38O7l7k8J14
4633b4J09j7j41l7K44k41J57Kj83J17J28k58L7k7P9P2J03k83L71j35p7J8j5J38
$$ plain form
4463 6 227 -278 163 37 -98 -23 -224 289 -28 34 -24 100 -126 8 94 -175 -117 -277 -101 113 -107 -5
4485 -5 6 42 -22 -30 42 108 -17 136 -23 70 -96 124 -114 -20 -55 92 20 -37 -23 -63 -134 -31 48 63 128 -4 -170
4512 -170 260 -92 -18 -147 71 -175 45 -166 -137 68 -61 15 64 65 -30 182 -94 74 -92 -14 152 -71 78
4535 78 27 -129 65 -199 114 -89 110 111 55 -102 -90 -112 90 155 -135 -29 -49 -53 -165 -123 -21 214 118 -99
4559 -99 -79 -16 19 -10 59 -209 187 118 -102 89 169 60 85 -291 -270 21 -74 -194 -257 -275 -268 18 127 56 35 -101
4585 -101 -163 18 144 -20 -144 6 -98 -150 119 68 22 19 139 175 -31 108 179 -37 166 -222 152 -18 -80
4608 -80 -114 141 -41 113 24 -72 54 -76 -17 -81 196 -164 73 77 -56 -191 83 2 79 98 -140 -73 -110 -138 -24
4633 -24 85 68 -73 -110 134 -107 50 52 -131 -14 114 -144 -107 -134 -55 17 120 -163 208 73 -4 14 -1 137
4657A37j7n9K5j44q8M30k84K61r5Q5j75k51J61J18j75K5p5N6l51N54l64J98k45
4680b73L58J60l51J84j08K43o2j77j9K92p9k08K84j06j23n0l8m7K06o4J0L3J58
4703B23R4l46L1L5J00k65j48K77k7J15m4j01J91j66K9L7J08j16j4O6J21j20j87
4726a07K19l13j27M09j53N6J11N1j70L8r4K29j32J25j05k11J82j27J25j26J72
4747E2P7j34J58Q7j82k8r9M4j36L18oJ7o7j90J63j91J56J84l48J2p9M66m43J69
4771@M6L9j12j71K73Q2J9n04L65j82J60j3L4rJ18k14K21l4m14J11J04K89o49M04
4795c7P9j83P2K9OR2j68j08J29NJ15j28L30j34j62K35k37j10N8Q0O1L0k17O4L58
4820B59l68Q9k8O6J09j70j11J93k19J92K45j84p4O4j4j71K63j4j78Q1Q7j73J98
$$ plain form
4657 137 120 61 86 -58 -146 284 0 261 166 251 76 -175 -14 104 -71 -46 -121 -65 -416 138 -226 -28 -273
4680 -273 85 245 -106 78 -30 213 151 -26 -45 247 168 -40 244 138 15 -35 -73 -120 86 22 32 65 223
4703 223 317 -29 2 37 137 -128 -276 1 -26 89 45 -56 135 -31 -2 35 143 27 13 79 200 80 -107
4726 -107 112 -201 -328 81 -72 -16 95 146 -24 14 -80 149 17 142 37 -174 8 -119 6 -120 52
4747 52 129 -5 153 240 58 30 -69 -25 -161 157 151 168 101 -89 74 -117 39 223 -125 -113 -192 274 -169 0
4771 0 46 85 -27 -198 75 157 176 -328 37 -145 15 2 36 27 145 -69 152 118 -296 -185 -81 208 -441 -37
4795 -37 42 -141 -69 -40 -34 58 -110 -218 -89 -84 31 -97 233 99 -63 172 -65 -175 -117 -37 24 54 -163 -99 259
4820 259 -109 -20 -48 18 127 -43 -154 39 -180 12 257 73 -1 63 49 -122 141 127 -51 30 117 -56 142
4843A42p7k48K01J01j14N5M7M3j61K8j13J16m4m6J37j3j43K06j13oj3r4R6K14
4867B01j09RJ42k78m5J72j98N6p7K22N0K9J12k23J57k81N5Q3j9j72J09j85M2K18
4891G0N5j50R9r3l6J78R0l47K19j78J44Q0L7j60J65j20L8j45J67k18J10j53J76
4914B8J39k25K21k88L4j52J23K16O3k43J58j61J45kNp6J40l20K29j10N1j91M40
4937B24l61j5J20K53k90P4R6k00J21k68K04l0j85L76o3R8q2k4P0l40J23r0L45
4960A56j86Q7J6k63J30J6K03j35j21j58K58n9J16j21l4K8Rn9P9K43k31K7j21j35
4984b55J24l2j24L65l34K54P9J11m65L76k5k64J24j02L53m31L16L6o6k0l69N06
5006A57k03J95j82jp5J41k13K28K68j34o4J34n51L86L7l22L27j95J12Q0k02J30
$$ plain form
4843 142 65 -183 18 119 5 60 107 150 -11 17 -96 20 -24 -70 67 54 -89 117 4 -2 -15 -109 -13 201
4867 201 92 101 243 -35 -80 92 -106 -50 -127 95 145 174 286 63 220 -61 -6 77 58 -114 -5 -190 -148 70
4891 70 125 -25 74 -19 -55 123 213 -134 85 -93 51 131 168 8 173 53 91 -54 113 -105 5 -148 28
4914 28 167 -58 163 -125 -91 -243 -120 96 159 -84 74 -87 58 56 61 -15 125 -195 34 -76 -25 -216 224
4937 224 -137 -152 -32 221 -69 5 101 -99 22 -246 -42 -72 -257 119 56 154 72 48 118 -222 -99 -189 156
4960 156 -30 57 73 -190 -60 -44 159 24 -97 -255 3 -56 60 -61 -95 -67 -58 -117 -38 205 -26 1 -120 -255
4984 -255 -131 -163 -287 78 -256 -2 77 188 -277 99 74 -190 -66 -168 185 -246 70 106 40 20 -349 157
5006 157 -46 149 -33 -34 -109 32 -181 47 315 181 117 251 -300 86 123 -199 128 -67 45 125 -77 53
5028E3n1lp2q9L7K64j86J50k01J90J0j05k3P3j17K10l45K86j37M00l95J70k0m9
5052E0l11L69J8o8K13l73P8j00J73J30l05K49r4Q7j06k14J79q0M10m17j02K71
5074E7J26l5j25J16m8k52J22K84m00J71p9J16K69l41j5J75l22J26J99J3m6k2l85
5097b96K60N8k07j3K01j77L73j22k31J45n5K39k82m2K38k39K96q6J21r1k8J36
5119A98l83M37l81L75o3k13P7Nj8K55k79j35J43K0rJ11j06k3jj67J22M8J1q8j2
5144g6O9J04j79K0K4o2J01j04J16L0P4k51K90K12k72r1j72K04j8K96k74ql7r2
5168i6J93k82K15q1q8K41j74l1K50N7L9m21L1J31J3R8J35j58j68J28N9J12kk51
5192e0o4k4J38q3O1K8q9K60j06Q4j22k5r5n6PJ96j66k00L89O6J71l64N6o5J22
$$ plain form
5028 53 2 -1 -73 -162 -125 139 -47 103 -98 92 102 -3 -26 47 -70 140 -205 81 -56 344 -51 119 99 50
5052 50 -261 108 126 58 271 -102 -24 -124 49 179 -126 123 29 116 10 -204 -25 -105 305 -112 -214 57
5074 57 183 148 23 139 91 -161 -39 245 -155 16 -63 53 322 -19 -34 141 -181 -55 144 157 111 89 -296
5097 -296 -36 22 -185 -198 3 -174 199 77 -154 -9 -64 175 -107 -149 89 -150 146 60 181 90 62 198
5119 198 -185 252 -129 246 183 -30 47 52 34 289 10 -125 18 38 29 140 34 11 10 -157 -35 13 24 -64 -76
5144 -76 -7 97 -82 -62 -38 -100 1 -103 13 43 117 -134 156 368 96 5 -167 37 19 315 41 33 -4 -96
5168 -96 97 -185 30 -51 -139 102 -72 -103 147 204 243 -178 -147 -16 -3 95 230 72 -96 32 91 203 201 -50
5192 -50 -114 -138 0 -83 -22 6 -83 177 71 155 33 8 -87 -143 -136 60 -106 -306 83 149 320 -44 12 -53 69
5217F9n6Jj52J43L4L2K29n33J98L6m3R1P5j90K7m0P8m3m1J14P9R3k99J38J8M0
5243I8J71k48J95j7k44J25k74J82q4J04j75L03j45o9N4K43k96Q3k35M39j26nl8
5266D1o4K02j15j2j19q3o2J73p8K31j40mL3J37l7k30K4J62J02n26M17p3J27m48
5290c42L70O9m90O40k50p4p3k4K4K03J30l48K98N7k1l38J20K24k58J51m6Q3j54
5313d9K92j82k62K53M9j80L6P6J36k3r9K3q7j19L65j31j24r9n0J3R1R6r0J78n0
5338F3k36MJ20q3r7J23K05J08k06j02K45j74j27J78j0J61k07n6J5K9Q0l9O8j70
5362a08J09n5K65l21N5J93j71l0j3M1K05j87P5j67J76j72j69K53J30N6l27k9J43
5385d8k74K66k4J19p6j07M33k44o4l3j5o9N3j3R8q6K90k41O5J7p7pK47j99M7J
$$ plain form
5217 69 13 14 -138 5 39 71 300 -233 -35 1 -42 49 124 -66 -39 -79 -1 -44 -85 29 108 201 -98 40 58 98
5243 98 269 21 216 199 -45 80 -194 -12 -96 8 -167 136 -9 -78 -24 219 -77 6 -229 210 84 79 41
5266 41 -23 179 64 52 -67 -150 -212 -39 -117 114 -26 -30 3 140 103 -127 -103 59 161 -365 52 -21 106 -342
5290 -342 28 97 -393 247 -3 -77 -150 -174 -150 53 183 -165 133 190 169 -169 -49 175 -83 68 22 105 -49
5313 -49 243 61 -201 52 101 -79 -43 33 169 146 47 70 -17 -136 229 98 -26 -125 -175 -162 -71 25 -65 113 63
5338 63 -173 -169 -49 -132 -229 -106 99 207 1 -101 144 -30 -157 21 11 172 -35 -91 -76 -47 33 -6 62 -108
5362 -108 1 -54 211 -110 -55 138 -33 -63 -76 -35 170 -17 58 -109 67 -105 -274 -21 109 165 -162 -191 -48
5385 -48 -322 -56 -80 39 -37 -144 289 45 -19 -52 -67 -136 -83 -96 2 -84 206 -35 30 47 -30 -37 210 11 58 59
5411E9R0k99L98Jl40K63q2K1k15J46R0k27O7j38K64l4N3q2N6q7j30J56j92K02
5435D0M7J5j59j50J84J11l08L15j24k1K50l02J65K9R5k31j83Q1M2J97k39L2J42
5458B8J96j93j05l4K6K6K86j35l11L41l2k10K97l17j03L39J19j94NL10m05%J78
5481A12j59L5r5J83m0K38l07k3j56K35O6j24r8R0j49J52J92j51o3L75j74l2O2
5504A69j64N4n7M7M6O8o9L8j44n9J10M9k6P1k09J55k18K20K3pk55K54j36Pj03
5529a36M4K53J04l28P3p7J95o9Kl1K21j62j48K02q0l99N58J45m96O4j00L22l6
5552A21O5j71P8j15P3N8k41j9K9K04n0J60j84j62J43o6K15l9r3k7k9N2k01L1J42
5577b6J47j88J93j59M3k5n9J26q2Q3J6p4K49j57q1j11k6M7qJ7O5K7J42j78Q8j52
$$ plain form
5411 59 149 -150 248 249 -91 172 90 111 -104 42 132 -95 -28 -166 98 64 117 35 91 4 -126 30 -162 40
5435 40 87 102 -57 -207 -23 88 -220 95 -29 -50 200 -102 63 92 187 -44 -227 -146 -104 93 -146 -114 28
5458 28 224 31 -74 -108 -82 -56 230 95 -216 125 93 -117 180 -137 -240 99 218 24 29 339 -66 -66 112
5481 112 -47 -12 -107 76 36 274 -33 -56 -212 23 89 -35 -133 -43 -192 -40 152 1 -62 313 139 107 169
5504 169 5 59 2 49 95 163 94 132 -12 -71 39 88 62 133 -76 79 -139 81 104 97 -158 96 -40 -33 -136
5529 -136 -92 161 265 -63 10 -67 128 59 61 30 251 89 -59 143 63 -336 222 367 -129 -65 -165 157 121
5552 121 186 15 93 -22 51 109 -132 -151 -122 82 32 192 8 -154 -11 -77 138 99 6 -21 -50 2 -199 -168 -26
5577 -26 121 -67 126 -33 10 -15 -74 52 -30 53 69 -5 244 87 6 -105 -131 -84 -92 -75 -10 17 159 -19 69 -83
5603h3L63m73J13J70r2J08j50k03K25J38q4J44j66k03J38R3n0M3r1j1Q9N6p1J32
5627A35j08j5N0K83m93j12L89r0N7J7jj34j72J99j70J61J1L9n8j54mJ53Q3m1m9
5652b4q9L72n42L42j22MM0RK0L6o4j60L37n3l3P7K2j82n0J69J9j83K65l96J95
5677IM2P2P7j05k35K74L3j85j97K04J28l06J90J50P8j63j81J60j25J7j48M37j64
5700F2k6L7k42pJ79J02Kn8j55j59K09J76q5J15o1R5j27K3O4k80M28k03R5k48N8
5725fj59K08R2k62M7O2j14L55l57Q3J4j99J95J56j8k26J79j76P1K16k20j14K61
5748H8j96j47K89k6r8N3mK49j83K81k45k04Q2k3L31k95J07Mj33J07q3Q5r7P0Q1
5773I3J99m21O3P4m7J13k02J02K25l4m5p5p9K46o6j57l4j08M05k47P7n8O6q4n9
$$ plain form
5603 -83 280 -193 -80 90 -2 106 -44 -247 -22 116 32 176 10 -193 -55 38 -12 31 -60 -71 18 74 3 135
5627 135 27 12 62 345 -148 -260 129 39 96 113 112 -22 -194 5 -165 -4 7 46 -12 -166 -170 -17 66 25 -24
5652 -24 -113 259 -283 59 -63 -59 -19 -10 10 46 -18 -178 159 106 73 150 172 -10 -60 109 128 -55 210 -186 9
5677 9 51 123 200 95 -140 134 167 -18 -215 -11 117 -189 1 151 229 66 -115 45 -80 -63 -211 226 62
5700 62 36 73 -169 -176 3 105 107 49 -106 -265 -56 120 35 150 89 184 57 80 144 -136 292 89 184 -64 -6
5725 -6 -165 43 135 -127 -80 -18 -132 223 -134 -51 -37 -236 -41 115 97 -129 50 -126 -55 161 -59 -173 88
5748 88 -108 -255 34 8 -90 -37 -41 208 25 306 61 -143 -61 -84 247 -48 59 63 -70 37 -46 39 -58 12 93
5773 93 292 -129 -66 8 -39 74 -128 -26 199 165 120 45 -34 212 146 -11 -45 -153 252 5 82 24 90 6 -53
5798e3J58R5l3k34p7J99R6q3k34J27rl5J03p1N6p1J36l5M5q7J96j67K7L4r8J81
5824A66j66j88kJ22R8r2j50K45J34k49j45J82m2L9J7K89l76L05l7j73O8j00m3
5847i8J72L9M5j86k35K99j07j75K14M5j3O1QJ37l87L8L87l29L05l08K12r9q3J2
5871d6J99l65K35n0k3J86Jj97Kj3N9M6N4j58RK26l08J26j14J37j73J84j87J09
5895f1nQ2K57j88k8N4k65K89m2J10l22K51k59K13M3j98J09Q8j3j99J18N5q7K00
5919B02k72J03R7k48N6p0K7K21o9j24J42j03pj22j06K74l7j81K30J17l23K82K47
5942C36l15J68l12L89j99o7n6L9J4p6M5J12n4k74J30K56j89k57K93P7j08L5oo7
5966h6J45q4P9qp3L5j8L00k43l5K4m8J63r0j50N8KR0J1j96M6j3J31K2K5k82J03
$$ plain form
5798 -53 105 200 167 -67 -144 55 151 68 -166 -39 -48 -83 20 -51 5 -66 70 35 80 -7 189 22 49 83 -15 166
5824 166 0 -188 -190 -68 30 -62 -212 33 167 -82 -227 -45 -87 -48 -31 258 -118 187 150 -23 45 -55 -98
5847 -98 74 113 158 -28 -263 36 -71 -246 -32 13 0 61 69 206 -181 -143 244 -85 220 -88 124 25 -58 -46
5871 -46 153 -212 23 -27 -50 136 137 -60 -58 -71 -12 34 88 -70 -61 165 -143 -17 -131 6 -167 17 -170 -61
5895 -61 -66 16 273 85 57 111 -154 135 93 203 -119 132 -127 86 129 -69 40 128 115 -84 34 89 2 202
5919 202 -70 33 130 -118 -62 -132 -105 116 47 -77 65 -38 -45 -167 -273 1 -36 -217 13 130 -193 89 336
5942 336 21 189 -123 266 67 0 -56 -17 -3 -79 -34 78 24 -250 -120 136 -53 -310 -17 60 -48 -13 -19 -86
5966 -86 59 -25 54 46 -27 8 -10 290 47 12 36 -12 151 61 -89 -31 -29 61 72 -124 -78 -91 40 62 87 -195 -92
5993i2R7r7R9ol2j43O8L01l7m65M03ll08P6L30j18L7K3j36k9r0L02j62j69J84
6018C3k0k22M52l26n4J77j47j11L12k9k60J69J5j54J19M1J81j78P5j78J08j75
6040a72K94R1j98O2n0j38R0Q3O7k01P5J41k74K63j35r3K52k85m5K00M1j35N6J51
6064A40M1k82J1L99l98n8q6L06o8r7j62K42k8q9M6j04J63J63j40oK50l59RJ08
6088Ak6j53K25nj07l6K5K34l9R9q4j29J15Q2j62r9J11k55L78m09L81l44j4M14
6112B03l45J23K99J8m5k39k44K04qo1j70K35RM5K2J05l39L27j52k6J3p0J64j67
6136i9M09o3j23j30J34l07J05J6J6j09J40Q4j20N5Q7m6j21K19L1j68J42j57k8
6159c3N9k34L74k4k05K5j27K13r7m1R1R2j13RMn6J36M5q8j00K50l66K40k6j43
$$ plain form
5993 -92 5 -92 7 1 -31 -174 -106 195 158 -307 96 93 -215 -139 191 73 110 133 -3 -32 -122 180 18 -151 33
6018 33 13 -209 243 -83 -137 40 -107 -218 94 65 -195 -26 -11 -165 -46 -5 176 -2 73 -105 3 -172
6040 -172 122 213 15 77 27 -111 -21 62 129 -72 3 144 -130 133 -2 -95 157 -128 -173 27 68 -67 -11 140
6064 140 181 -101 -90 309 -89 -147 -233 73 5 -92 -254 -12 -40 -129 -83 -187 -24 139 -1 -7 243 -116 -107 1
6088 1 -25 -178 47 42 -65 -101 -76 158 119 218 134 5 120 202 40 -59 52 -203 175 -234 147 -197 -211 203
6112 203 -142 -19 280 298 253 14 -230 -26 -34 -95 -265 -30 -21 24 46 151 -188 139 -13 -39 -26 -96 68 -99
6136 -99 310 247 124 -6 128 -179 -74 -58 -42 -151 -11 73 -47 8 95 49 -72 147 178 10 152 -5 -33
6159 -33 26 -208 166 142 -63 -38 -165 48 -49 -90 1 93 -20 -11 -7 -63 73 118 30 -70 180 -186 54 28 -115
6184a15J42o9L40j1l01p7p4J58J84j63k05K99j06J51n9l0n4j64J42j83P5L1N5
6207c4R5j08j66M12k09j6L7K01k66N4J87k27j80R6L26k6L6k35J96j84J9M7J8N
6231G8j43J69oo1M5j58M07l63J08k36K58l5p9J01l1J7r5l8k1L4p8j21L21m2p2
6256d1K68J4k9l15J42k53J68o3K20p7k7j28K59N4l51J53j74J14J36k14J88k31
6278a87K36m9l0m2j92L42j07n0K12j3k20K8K27k63K19k33l4N64m62P3O4n5k69
6301b41K30q3P9J97k57Q7j04K12oo1J32l58Q6L5o9j64J36J10O7J6J5kj17n0R4
6326a6J5J92r2Nk4m9J5o1J07K07m60M6J85Nj94O1M6Q0pQ9o5O1k56L25l23N1O0
6353CJ79k92J44J3p6jJ0P3p7j76K62j19N4Pk69M33k64J91n6j18O9K96k36J7k03
$$ plain form
6184 -115 27 -42 298 287 -14 -91 -165 -7 177 14 -191 108 2 153 94 64 10 -154 -12 -195 -120 -89 -34
6207 -34 61 -47 -213 199 -10 -26 11 212 -54 0 187 -40 -220 -124 202 176 212 -23 173 -11 8 55 73 78
6231 78 -65 104 98 37 82 -76 331 -32 76 -160 98 63 -16 85 54 71 -24 -62 -83 -49 -127 -248 73 31 -41
6256 -41 227 241 212 -103 39 -214 -46 -109 111 34 7 -121 138 192 -159 -6 -180 -66 70 -144 44 -187
6278 -187 49 0 -30 -72 -264 78 -29 -79 133 120 -100 -72 155 -108 111 -122 -156 408 -54 19 83 28 -241
6301 -241 -11 -94 -15 182 -75 12 -92 120 114 53 185 -173 -87 -52 -121 -285 -149 -39 28 44 59 57 -60 -110 -16
6326 -16 -1 191 99 104 80 31 46 -15 92 299 -161 -115 70 75 -119 -58 -12 68 61 150 85 146 -110 215 -108 -57 3
6353 3 182 -110 34 47 -29 -30 -20 53 -24 -200 62 -57 -3 4 -265 168 -96 95 39 -79 -10 286 50 67 -136
6378a36J03MK15j49m3K32k05o4N8j53J92j20O3R9j90K04j27j29p7L45qqk05O7
6402c2K28l20N9o4L0K5O5oK00k74K1m5mL05On1j66R6M7l42Q5J43J99j60k17J78
6428Fj5kJ89j23o5L13l30m6L0P6M6j23O2Q4l5Ml2J37j84k3Q8J96j85j71J83k04
6454a24J40k61K88o9J74k68N0J31j48K07j15j6K4N6k82J10K72k68J23J62k62K33
6476A57k11J32j93P9l5p2j30J43N0j47M42k58J4J03o2J1j55J94j13J4J12j1L1
6499I5o0o6j87P3L64l99J46j80L81j5q3m4j4j13K7J69Q7l65N46m11J27j50K42
6522A70l02J82q7M5K4j2k11K23m1j4o6K51l34j16J59M3J61M2r0l6L5k26K63p5
6546a2k7j27K82o2j96J72nJ17k23K89Qk22r6p9K61j22J22jj94j40R3J94K1mJ1
$$ plain form
6378 -136 -33 -29 186 37 -6 226 21 -43 15 -138 54 -66 -3 96 -94 110 -17 -146 -223 122 114 106 -99 -32
6402 -32 196 -124 -65 -129 -99 -74 -9 -15 185 -89 -68 -113 -117 188 194 143 -23 73 120 -222 -137 6 205 45 -172 6
6428 6 -9 -11 178 55 -10 303 -27 -73 -43 33 79 -44 18 102 67 71 39 176 -8 -31 57 253 68 -103 80 -124
6454 -124 16 -245 43 -26 148 -120 -70 61 -87 120 5 -11 13 69 -213 -103 169 -99 24 186 -76 157
6476 157 -54 78 -115 -36 -71 -143 -273 -130 -80 -227 215 -43 -29 74 12 23 -132 62 -51 -37 75 64 95
6499 95 35 -31 -218 -145 219 -180 -34 -214 167 152 69 25 11 -102 -75 94 181 -184 362 -49 78 -72 170
6522 170 -132 50 -37 8 32 20 -191 32 -9 -23 -89 162 -172 -288 -129 -86 75 117 27 -9 26 -200 63 -12
6546 -12 -39 -166 116 54 -142 30 25 142 -81 208 216 -6 -102 -181 80 -42 80 79 -115 -255 -162 32 53 49 60
6571F0j34J99m38K22L83m19K39q8p0P2j52j47K76J44k94L06o8j41O6J27j03K50
6593B90j44r6j54j32L74k26R0KN7kOj33r2M58l93J83j13l8K9J20q4Q3l52M7J66
6618e4N3o2J28j50j3J24k06J04J97K2k28n7K60j57j36J67k38K36q1N2J11O3l15
6641a80j49M65m2p2j8kl50K21M18k47J47k16r2J3j75K01P7oO0J56j83J50k45J20
6665E1qO4P2j20j72l8J76J8pJ87j26j69K28j31L3j14o4J88l9j6J2J29k77R0k4
6690e7J18o6r2M0j34M3o6M13j54j65K20O2k69K1n6J78QJ50j47k41K13j38NJ15
6714AJ74p7k55P4l6J06QR8j89K30J80m73K98j51M2k2R2j53J73o3j13j3j90L61
6738A02k68M6j14K31P3l3j29m8J78J2O6k64L36l07R5j43J88o2P5j26l1K5P8J93
$$ plain form
6571 60 -74 125 -313 -91 292 -127 112 24 -46 26 -126 -273 3 147 -147 159 91 -50 16 143 40 290
6593 290 146 50 -104 -236 138 -88 2 4 61 59 65 -68 -160 298 -95 88 -25 -63 -34 86 2 85 -267 -220 -54
6618 -54 -1 -63 65 -85 -98 26 -180 -76 121 143 -85 -142 118 -39 -175 -8 -246 -10 -91 -39 72 135 -180
6641 -180 -329 136 94 22 4 2 -348 -127 291 44 191 -25 -117 -104 -279 -78 -1 -7 53 209 26 176 -69 51
6665 51 43 107 179 59 -113 -151 25 43 36 223 97 -72 156 25 58 -56 -120 68 29 13 25 154 -123 -33 -57
6690 -57 61 -5 -97 -57 -191 -148 -214 199 45 -120 100 162 -107 -86 -142 36 44 194 47 -194 19 -119 -114 1
6714 1 175 98 -157 -83 -119 -13 -5 93 -96 134 314 -159 139 -12 30 8 100 -53 120 57 -56 -69 -259 102
6738 102 -166 -120 -234 -3 70 37 -92 -140 38 50 116 -148 188 -119 -24 -167 21 -41 34 -92 -123 -98 -20 173
6762A73n2jm7l57L59l8p4O1j27L42l53o3J42K27l17r2K40P7j33J71l1k31J13N
6786fr3Q2%M1PJ39m72L77j05J12j14p6L56l70j23J81J20Jq7L1J93j75k27J67J61
6811A20N0J4j76j07K70r7j4j32M6K6P0q9j26R7J42j65j37K21j3K09q6j3j18P8
6835G0M4j3k07q7K6K73j75k25J66K0L17k95J55j94K31J74k42J97l35L00l04jQ2
6858b3J99j46M7k40L21m85K16J39k19L00J05j59k30R1K10j07J92k33P6N1k46P5
6880f6L66r4j77K39m24m9L54j60m8L03j97j94J14MJ78K65l59r1Rk3j26J05J14
6903D3n9k9J35K09m23L08j69Q7K1J06k39j36J16Rj40J07J39k06J27p0m5J22L9
6926E2m6j1p2K4j34Q3K43k43L7o2J79J71j69j50K38j32M5J54r6J02k04O9R7jk41
$$ plain form
6762 173 121 120 73 -284 75 37 -37 24 -103 239 -114 -177 -35 192 -125 -217 23 100 -33 138 107 -124 -11 -6
6786 -6 -99 -17 -17 24 31 170 -302 75 -30 82 -32 -108 248 -122 -245 -64 56 57 -30 1 194 19 -208 -41 120
6811 120 170 184 8 -99 171 74 60 -72 -26 0 70 -19 -145 -48 94 -71 -208 13 0 209 123 110 -8 70
6835 70 114 101 -106 -193 -167 106 -69 -294 -128 -108 209 -86 69 -125 106 280 38 235 -100 200 -104 -105 -23
6858 -23 176 30 77 -163 158 -327 -111 28 -191 109 214 55 -175 -84 126 19 211 -22 54 105 -141 -66
6880 -66 300 206 29 268 -156 -205 149 -11 -59 244 47 -147 -33 -29 149 414 55 -36 -27 -50 -176 -71 43
6903 43 -16 -45 90 299 -124 184 15 102 123 229 -10 -146 -30 -21 -161 -54 85 -121 6 -64 -109 13 52
6926 52 6 -5 -77 -53 -187 -104 139 -104 -67 -129 50 221 52 -98 140 8 53 207 111 213 9 78 175 174 -67
6951f7J64q7j54R4J80N4j36Qk9j78L89j59q5k00K91q4p2L2J46p9J20j32k8J80
6975A68k48j73J4J37R2J17j2l91L44j39K10r0o0r7Po8J0J59K67j98k69M68j93
6998E5O9k85K48l80L83j28J86n3k48J33p0Q6J2L50k80j8l46M02N1l12K59n5J46
7021B05q4r2k48P3J44r2K31m71K59N6j91K21k5Q8pK3q6L5l5M3J20j24j12j4p1
7046a54J70nl2J07j55J22l00K83j13k22L08J20j48J1J46R7j03j92L4K68r5q9m1
7069A7j57L20j6k58M11k53J42q6rR8k53k9j59K29o1j80K12K1j30L39k32j13K99
7092A52k9j63j8P5J68p1j38j2K4J38k42J32N2J11j77r8L75k59Q1j84R3o4K30l32
7116a56J30L0n1J33j75k05M04j18K29k19k32K42J3r0K16M9m2j85k1k11K90j01
$$ plain form
6951 -67 97 10 -144 -50 130 184 48 56 27 -151 238 79 -6 -206 85 1 -71 -39 107 28 148 16 -12 168
6975 168 -80 -253 -239 -102 -10 107 95 -296 48 -91 119 29 -31 -128 -121 -189 -179 -20 247 49 -220 248 55
6998 55 124 -161 87 -293 90 -38 148 95 -153 -20 -90 -4 8 358 78 60 -286 116 167 -145 114 59 205
7021 205 121 29 -219 -146 -2 -94 137 -334 -75 -19 -210 11 -14 74 67 90 4 39 4 47 167 43 -69 -83 -154
7046 -154 16 11 -21 86 -69 53 -247 36 -77 -299 9 129 -19 -8 138 235 132 -60 -26 242 147 58 17
7069 17 -140 180 164 -94 317 64 206 120 111 209 -44 -73 -232 -3 -64 -244 -32 -11 -141 198 -34 -147 152
7092 152 123 -40 -58 17 185 114 -24 -36 -12 126 -116 16 68 179 2 -96 279 20 101 -83 10 -54 176 -156
7116 -156 -26 4 -47 86 -89 -294 110 -8 221 2 -230 12 25 -65 151 200 158 -27 -48 -259 31 -70
7138g0J49R7J9K9l78K13j37j32J57J31n78M14j11K20l8k64L64k18J30J26k0p2
7160C1m9N0j71j38L42j23j38J93J40j44j0J40k48mL85l97K1K24l13K23L7k67L47
7183A31j25O1pk54J00J43K8j5j53J34L8J99j23j51j18J74k1K12q5k66P7Rn2J80
7207A16j73J74j97O6l5K21K0l47K89j13j06K37nj31Q6k51J51q9J09k11J05K88
7229B04k80J49q2Q1L8k44J56jJ08k65K71m8k22J28j67M2k26J34L05l03K93j45
7251g4j91k9J86n3J73J92j45K08J39k40l72J34o0L00j84Mj71m9J55L9Q2K86k04
7274A26l48l9J74J64K34l88k7J5JJ38j48J9Jj8l1J44l8j07K3N8l0J91k27R7r8
7299a14K21l9J9r2J58LM1k26J44m7l4k86K68J87r5m4j6J00j17j6P9j14J51p7q8
$$ plain form
7138 -70 79 176 195 224 -154 59 -78 -210 -53 78 -500 -86 -197 23 -15 -279 85 -133 -3 123 103 31
7160 31 -18 32 -139 -277 65 -58 -196 -3 137 -7 -17 123 -125 -129 256 -141 -120 104 -209 14 51 -216 131
7183 131 6 67 60 -194 -94 49 77 62 -91 43 81 280 157 6 -112 62 41 253 168 -98 -21 -12 -64 116
7207 116 -57 117 -80 -14 -49 172 192 -155 134 21 -85 152 147 16 102 -149 2 -87 22 -189 -84 204
7229 204 -76 73 -9 72 110 -134 22 21 129 -136 135 87 -135 -7 -174 -132 -358 -224 81 -222 71 -74
7251 -74 -265 -294 -108 -161 12 204 59 267 406 166 -206 -72 -132 168 -16 -12 -183 -232 -77 -38 44 330 126
7274 126 -222 -261 -87 77 311 -77 -104 -89 -88 50 -98 -79 -78 -96 -127 17 -21 -128 -105 -47 -77 114 -113 -16 -114
7299 -114 107 68 87 -5 153 156 197 -29 115 68 34 -252 16 203 108 64 48 148 31 15 94 -20 131 54 -34
7324c4j6J02k55K49K35k81O0j4j20q1K5K36k83M47l81K97l46O7j8j0J1n6K25k08
7348a49K92k2L5l35J25J25K0p8l3J99k13R1l7J06l37J66P4k50K22J00n6m3J16
7371A18Rj2k33r1J11L78r3J5k7j53k27Q1L41l77J36O0k0j05K53o0l4l21K56j27
7395a22L15j00L1j21j65K84j66L4j42NK21k66M04k30l4J84n6L9k28L80j33r6K6
7418F4q5K16j66j1O5r8Jk22j7J48K22n5r4k1J74k57R7J48l35L26q5j23K44k42
7442a06O1J43j32K14j73R0k33J16j48L40k5k17K01p0p9j20K75j05r6J37j34J34
7464G3j25j17K02j28J75q4j46L20k59K89k7pj56J07j00k4j3J57j1q0J33l65N8
7487a28k5K65J28P1m85L01n5O3j08k91J98L0jJ76l7K84m23k35K68j39K04j37j39
$$ plain form
7324 -34 -50 52 -203 46 281 0 60 46 -74 -155 -130 106 -177 270 -111 186 -160 -93 -111 -121 -110 -166 59 -149
7348 -149 143 121 156 -179 -54 71 91 13 -20 179 -34 57 20 126 -211 -45 29 -221 1 101 45 2 118
7371 118 127 115 -118 -209 -98 280 187 202 175 22 -205 -124 217 -160 -24 36 16 -89 164 104 70 -251 5 -122
7395 -122 193 93 124 3 -162 122 -44 -10 -152 -147 74 -192 212 -18 -52 132 76 115 -113 267 134 38 64
7418 64 -21 195 29 18 83 -15 -14 -236 -253 -105 117 62 -32 -53 121 -136 -39 109 -226 100 15 -108 136 -106
7442 -106 -45 98 -34 180 7 97 -136 -20 -168 172 147 -70 131 61 -18 -138 137 32 -64 73 -61 73
7464 73 -52 -169 33 -95 80 -4 -150 170 -89 200 173 166 10 117 17 -7 -20 137 126 46 179 -186 -128
7487 -128 -153 112 240 311 -174 127 72 135 27 -264 -66 -36 -37 139 102 386 -37 -272 -4 -143 61 -76 -215
7510b15J36O0K0j9j61J78r7J32l7N2n1kj34J54M1k40L2P8J19r4K71k34k3k0r1
7535a45L7J08j14N02n92L80l74K44j56o0N08m17j03K33j09R4k4J9j73K04j19Q4
7557B7J96l68K9O4O7r0P7l16lL78j91J90n5j16j8K80q9j12K07j51JR0j16j17J31
7582eP9l08L87k58k7j52J71L39k87R4m3r1j52J05o4K50J3j69K44Jk15J63j6l22
7606b63J93N5mJ40j59J01m7Kj83J33l5j42j48O02l38l5o8PL79N7k90j64M08j18
7630H3p8K6k65m5N57k46p0R3n5J62K6m63L43j3n0l7jn9k13L52l97L43p8K45j70
7655a0m1rJ14K29l05J14P2j05j4j04J05j19K20r7j24L02j13k16J35p5K30j04l72
7678b87L51k55J38J08j74J47j55J76K0L5j37J58l13q5L35k23n2K28j16L3K40k06
$$ plain form
7510 -215 -79 -19 1 -18 -179 -1 -98 34 -3 49 -2 -4 -138 16 57 -183 -151 -73 46 -48 223 -11 -34 -54 -145
7535 -145 -108 0 -114 388 -204 176 -198 46 -110 -170 338 -79 -182 51 -58 36 12 31 -142 62 -57 27
7557 27 223 -145 -116 -52 15 -75 2 -314 -317 61 -130 60 5 -111 -129 151 62 -50 157 6 7 97 -19 -136 -5
7582 -5 74 -234 153 -105 -132 -284 -113 226 -61 33 -10 -101 -253 -148 -212 38 51 -118 126 127 -88 75 59 -263
7606 -263 -70 -15 -19 121 -38 63 16 18 -165 -32 -67 -209 -357 245 -93 -128 -196 -189 190 247 -43 -207 201 83
7630 83 5 31 -234 -279 278 32 -38 55 0 162 188 -275 68 55 5 -32 -33 -92 -305 47 -350 -7 -85 160 -10
7655 -10 -51 -60 54 283 -22 92 164 59 45 -59 46 -73 147 50 -74 228 115 -101 34 -41 189 85 -287
7678 -287 64 -191 -53 55 -119 28 -127 49 69 104 -33 125 -188 -273 62 -161 -213 15 -101 -68 172 -34
7700c4P7l7J01q8l7J52l79L49J51l28k1N6r2oLJ63k57L58k78O0L00k08j06J43
7724D2p4J45m06K52J90k7q0r8L6J6P5j66oP3K04n3j14Q2r7r9L5J75n8q7M8l1p2
7751i5n5J62M7l8j18J14o1R2j06k5K64l87pK52m2o0R4l7J6Jo0k8M09m76R9m0j4
7778i9J74k85J43J00j75L61k80J98l07L32m44L36p8l6qR1j62K33N8k22q7J03J02
7801D8m4J97k38N5k02M03m02K5M9J42j38J58n5K12k97MK01l46o9J13L62J25l44
7824d1P2p8L47l04j94L4K43q9j76K61m0j70L67l62J16r4J25m6l8L39l45K12j62
7847b3k7R0k67J22M26l22p7Q6P8j43L2k8k51M00q1j58K03m6o6j76K43j3J75j88
7871a1j20k15L74K56l00n4p0J29K9j10J57r5K91l58P3O3k23L58k33p8L17k12J43
$$ plain form
7700 -34 43 6 107 19 -18 134 -245 104 255 -73 -94 -38 -130 -136 -133 30 -227 131 -147 -87 213 5 -101 42
7724 42 -32 113 -293 -41 149 122 42 -56 -20 -4 71 -95 -101 -28 176 123 9 91 -6 -105 -70 105 47 -40 8 -23 -95
7751 -95 -150 12 59 21 -97 17 -44 48 -58 -83 181 -206 -213 39 -3 -63 31 -6 10 11 -49 -77 332 -144 -45 -85 -99
7778 -99 75 -210 -67 33 -142 219 -61 137 -170 162 -282 54 -24 -60 -68 23 -139 94 152 -70 -157 -54 48
7801 48 4 201 -37 18 -184 219 -183 -158 -109 33 -105 53 -2 210 -87 -83 118 -228 -297 -184 178 303 -41
7824 -41 31 -47 300 -4 -198 -164 79 -10 -186 75 35 -135 232 -130 -14 -108 17 -29 -67 272 -73 139 -23
7847 -23 -50 40 -227 -105 321 -1 -78 8 86 -57 -25 -53 -304 96 15 -143 60 14 -52 -228 15 2 177 -11
7871 -11 -131 -346 28 284 -16 -70 -140 -11 18 -92 65 -30 261 -97 -24 39 -184 174 -59 -137 180 -32 111
7894A11k1p2q8J52j94k6K12k87K06l4J15K76m21O6q7M0n7J02m3l0J13M7j11J17
7918H6j95KK9M3l1J06M6j31n7J60J23K4l33K01qmk21J4J18l7K18j37N8j17j42
7943a85KN6Q6J01j56j02L14k32k49M35L9q7n7m5Q9j61O2p9J90J3m8j06J50M2j50
7968g8n3J13J45j7l61K56J50p8pj40l3K53j44q2L2L0j1K88k33Mr3J46oj27N6J3
7994B3p4m7k6M3J17J01mk62Q3J84l28K01rM0j08J08j0N6J80j41j19o0L1O6J44
8019A89k19Nj07K95k26J05j4j65K98l18M2K0J06K9nn1M0k42K35m8M7K4NJ25j75
8044ek63K36O9%K3j10j88M07j59o2J05k22r9K19PP9J71r2j54K14k70J56j38o9
8068a45J31K45j22j7o0P3k07q1J86O6R7k07k75M33p0n8m4Q6J83m69L49m3l0q5
$$ plain form
7894 111 90 18 -70 82 -112 -138 74 -213 -7 -41 74 350 -71 -5 -92 -52 -109 -7 -50 -80 33 80 -31 86
7918 86 -109 -107 -78 -35 -66 40 86 -45 -102 58 181 205 -128 73 65 61 -160 -146 -28 -65 153 16 74 -43 -185
7943 -185 -183 -127 -41 60 -96 -198 116 -116 -365 70 109 22 -35 -80 9 -152 -90 -169 21 34 -14 -120 30 72 -78
7968 -78 -131 -18 127 110 -251 5 155 77 70 -70 -103 150 6 -76 -44 -14 -25 263 30 34 -59 87 81 -46 10 23
7994 23 -51 -98 -124 -81 36 137 133 -129 -46 138 -190 11 2 42 -66 42 32 88 268 127 8 -52 -21 45 189
8019 189 -30 -25 -132 163 -63 42 28 -137 161 -157 -115 -95 11 40 35 -16 24 -218 17 -31 16 40 45 170 -5
8044 -5 -268 -32 37 37 60 -50 -238 169 10 -52 53 -169 -268 -49 -42 37 208 116 -38 176 -94 62 -76 -145
8068 -145 -14 231 109 92 32 105 -102 -183 3 69 166 -41 -316 117 47 -11 -55 31 214 -255 94 51 21 -64
8092f4j43K07r5J00J17j54L43k99k01K47l8M2o5r8Q4k1J14j06P5q5p1J4J55l9
8116A9J02j74Q2J0k10L13k01k05M55r4Q3j86pR5J6k75K31j52O4n6L12l38M5K81
8140B10k55J61k69L6J56l45L11L01n91L45L7j49R8j36M9l2o3J08r0M23l75Q6l6
8163b0K3L3J03o4L9k98L03j10K5Q0j7n0K17k01k47M03Q9k46j31j99L54qo6j45
8187a33o0K51m9J74
$$ plain form
8092 -64 -207 0 -95 5 122 -32 311 12 -189 58 20 62 -3 -101 -17 -38 76 -30 45 -40 -111 -97 58 19
8116 19 121 -53 29 39 -171 142 -59 -264 191 97 180 -6 -13 82 98 -177 54 -98 -34 -90 222 -116 -71 210
8140 210 -45 116 -153 -117 39 -306 5 306 -285 60 97 -52 46 -90 -41 -73 -136 -28 -118 305 -70 16 -20
8163 -20 3 36 139 75 114 -184 119 9 34 114 97 47 264 63 -184 219 308 62 -69 -268 86 78 12 -133
8187 -133 -193 58 9 183
8191A83
$$ Imaginary data points
##PAGE= N=2
##DATA TABLE= (X++(I..I)), XYDATA
0@%%%%%%%%%%%%%%Nj3J6j6J6j6K4l2L2m0M8n6O6p4Q8j01J12j28J46j65J86k07
36a09K31k60K92l24L60m00M42m88N41n97O58p28Q00q81R72j070J179j301J439
55G56j596J774j981K224k510K857l287L836m564N574p068R496j4064K5383j00597
70h3767j29829L08538l1115k01812J52439R1168j72078L7548R6737r7263j4418
81d3852Q2948m6963j2550N9981l4451l7184L6992j4228k0425K8337k941j3810
93a8146K5029N873n583Q33k0885m558K8113p98j2070J0947K575o652n927j1168
107a2417J5491J3873k5662J1389M4823k9017l7670L6795M235m1318J8574K2108
119B1204l4207l945L2205m044k0679l641J117O197L536l398R299Q168j2083j1738
$$ plain form
0 0 0 0 0 0 0 0 0 0 0 0 0 0 0 0 5 -8 8 -8 8 -8 16 -16 16 -24 24 -32 34 -40 48 -53 59 -69 77 -88 98 -109
36 -109 122 -138 154 -170 190 -210 232 -256 285 -312 346 -382 418 -463 509 -561 618 -683 756
55 756 -840 934 -1047 1177 -1333 1524 -1763 2073 -2491 3083 -3985 5511 -8553 16830 -83767
70 -83767 -213596 94942 63827 -137985 14454 105622 -66456 -28908 67829 -29434 -43852
81 -43852 39096 -7867 -20417 39564 5113 -32071 4921 -9307 -29732 -1395 -4336 -18146
93 -18146 6883 12756 7173 8006 -12879 -17437 10676 9878 -2192 8755 11330 4678 -1249 -12417
107 -12417 3074 16947 -8715 2674 47497 18480 -19190 17605 21840 -19478 -904 21204
119 21204 -13003 -16948 15257 11213 -9466 -13107 -11990 -5793 -2257 -5655 3644 11812 -271 -12009
133a2009M313M745p056q493J4639J9901j3124j1570J3152p149p659K3824o364
146G150k4414K6261P737l3749K0669J6058m9380Q062M7879l4825j7065N5263j3832
159A5814m3719L7281J4259m0869P751K2254j0111O960j09k0234J4814P883k4810
172a2836J5010K1283k6684J161K5743j9042j4062J6944r602r974J3875m475n071
185g730J1240r227n995J4532r943j0504J8897K756p514J1247r118j4426J8430
198B645j326k1540J9367J5880k4697L517K5762j4896j4620J6575J999j1816N260
211B110O072m440m759r71K034j310n523K041P352J150r95K85J575J765o920l641
227d175J1533j339j2243R068O887j5819J546J1887j1005O9J4164r110l156J3243
$$ plain form
133 -12009 -7696 -2951 -10007 -18500 -3861 16040 2916 -8654 4498 -2651 -10310 13514 7150
146 7150 -17264 8997 16734 -17015 3654 19712 -29668 -21606 26273 -8552 -25617 29646 15814
159 15814 -27905 9376 23635 -17234 -9483 12771 2660 9620 9511 -10723 4091 11974 -12836
172 -12836 2174 23457 -3227 -2066 23677 4635 -9427 7517 -2085 -12059 1816 -2659 -7730
185 -7730 3510 -5717 -11712 2820 -7123 -17627 1270 4026 -3488 7759 -1359 -15785 2645
198 2645 1319 -20221 -854 15026 -9671 -6154 19608 4712 -9908 6667 8666 -3150 2110
211 2110 8182 3742 -1017 -1988 46 -1264 -6787 -4746 2606 3756 2761 3046 4621 6386 -534 -4175
227 -4175 7358 6019 -6224 2844 9731 -6088 -4542 7345 -3660 -3591 10573 1463 -1693 11550
241A1550j0856r158J4892p552j4812J5182J495j4646R724M721j2145O775L876
254i54q123J1034L455j3372J0801P045j8503M614J3490j5691j395J6177q560k546
268b528J2540q083k303J2315j0331m082J6772j1865j1711J9320m154j9117J4791
281A564M349j7847J0751R810j4404N243R583j2056L544Q743j3588P22J2251r866
295a201m312R714m336l913O058k961n91M613n512J267Q459q304n349Q731n686
310c323n667P429k049l930O677l213q71R302p567n198J5295k501j2522J3577L827
325I266j5449O853Q132j1852J957O722p262N108O178j1480K613R921j1971k891
339d155J2250p571p429R361m75n798K549k625m60O548m531j303R935m638o093
$$ plain form
241 11550 694 -8464 6428 -1124 -15936 -754 741 -13905 -4181 540 -11605 -4830 -954
254 -954 -9077 1957 5412 -7960 2841 9886 -8617 -4003 9487 -6204 -7599 8578 18 -2528
268 -2528 10012 1929 -374 11941 1610 -2472 14300 2435 -9276 10044 5890 -13227 1564
281 1564 5913 -11934 -1183 8627 -5777 -534 9049 -3007 537 9280 -4308 -3586 8665 -1201
295 -1201 -5513 4201 -135 -4048 2010 -951 -1542 3071 -2441 -1174 7285 -1019 -6368 2363 -3323
310 -3323 -8990 -1561 -3610 -7540 -863 -4076 -4947 4355 -3212 -8410 6885 4384 -8138 5439 9266
325 9266 -6183 670 8802 -3050 -1093 5629 -1633 3475 9653 -1827 786 10707 -1264 -4155
339 -4155 8095 524 -6905 2456 1981 -3817 -1268 -3893 -4353 2195 -2336 -3639 6296 1658 -4435
354d435Q476j922p108N258o05j906P860n409o810J2422l462j3490J4043O693j7725
369h120N291J3721j3444n986R329m608k730O562m093O60P881o079l321R603k598
384B068o135O766K853l509R36j585M22K008o452J473Q789p197m480J1883k101
399E739q786N277o13m790N552m526m764J2809n138j5135J4921O472j9944O653
413f273J6673j2916k537J3222q244m594Q836n728j903R688q037l655J3450o677
427A305j1675J3942K743j2095N366N701n777J857j782m131O736k547j0102R629
441h30P444j1096J553P971o099l14M615l793L315L849p627K566P440j2730j576
456e312J4587p385j0452J2662L496j1018J444N925k908k288j973J10N144j397
$$ plain form
354 -4435 4041 2119 -4989 269 -336 -2242 5618 209 -6601 5821 2359 -11131 2912 9605 -8120
369 -8120 -2829 10892 -2552 -8538 791 -3817 -6547 15 -4078 -3418 4463 -1616 -4937 4666 2068
384 2068 -4067 2699 5552 2043 2979 1394 1816 3824 -2628 -1155 7634 437 -4043 7840 5739
399 5739 -3047 2230 1617 -3173 2379 -2147 -6911 5898 760 -14375 546 7018 -12926 -6273
413 -6273 10400 -2516 -5053 8169 -75 -4669 4167 -1561 -3464 6224 -1813 -5468 7982 1305
427 1305 -10370 3572 6315 -5780 -414 5287 -490 1367 -415 -4546 2190 -357 -10459 -830
441 -830 6614 -4482 -2929 5042 -1057 -1371 3244 -549 2766 6615 -1012 1554 8994 -3736 -5312
456 -5312 9275 1890 -8562 4100 7596 -3422 -1978 3947 1039 -1249 -3222 -3112 2032 635
470F35n318K433K316l931j357J952M193J218l899K030M732o840k590R662k493
485B743o947P691R90q381L258K273l791N543k253q290J0962M343j6510M717J4169
500A0517j3042p487J2774j856n408O190j920j548N071n890j160J1065m740o210
514c644J1149k944j1292R491L375j0132N518K568p790N892J227j0977R160P052
528H653j6574J938J3893j0260m841J1711m723n555O791m467k859J1187l722o962
542e790J1290j715j2067R853O650j1604K493Q850p925m713N855Q10j588P7j958
557a482K098J519n272J42N930j912m204J67K123J047j680n58M095q3n592J992
573a670M020k680R16L544j949j467J21j783K401J706m687K442L849o550j778O445
$$ plain form
470 635 -4683 -2250 66 -3865 -5222 -3270 923 2141 -1758 272 5004 -1836 -4426 5236 2743
485 2743 -4204 3487 4477 -3904 -646 1627 -2164 3379 1126 -7164 3798 8141 -8369 -3652 10517
500 10517 -2525 -10012 2762 906 -4502 1688 -232 -1780 3291 -2599 -3759 7306 2566 -3644
514 -3644 7505 4561 -6731 2760 6135 -3997 1521 4089 -3701 2191 3418 -7559 1601 8653
528 8653 -7921 -5983 7910 -2350 -7191 4520 -203 -5758 1033 -3434 -6293 4894 1172 -5790
542 -5790 5500 3785 -8282 1571 8221 -3383 -890 7960 35 -4678 1177 1987 399 476 -1482
557 -1482 616 2135 -3137 -2995 2935 1023 -3181 -3014 -891 156 -1524 -2082 2013 1930 -3662 -1670
573 -1670 2350 -330 586 4130 2181 714 835 -948 1453 3159 -1528 914 4763 -1787 -3565 2880
589B880j361m005J924n45k2J205l682K793N598q589k674J0386l878o300J1208
604D938L04j0923O759L233r426N926O137r809M130N538j2160K210J1122j0465
618b486k777J2541o708p800J0453j960p231Q271j164q104P999J413q851P178M987
633E761j0554K021P308n807r49O747k258j692J448k750J096K565m027J902M215
648E026o120j971N828k815k927M605j295l068K686j068j297L979k343l035M502
663F87j53m173L583K900l557N8J756j534N49J126p25J003j2j509J18n85K06J234
681I72j179k56K073l233r57M942l394m465P798k54p630N538M399p902K218N158
697C828n919J129M788n598J577O630p220k140Q463n149m230R611k761p621P699
$$ plain form
589 2880 1519 -2486 -562 -1107 -1129 76 -3606 -813 4785 -3804 -6478 3908 30 -6270 4938
604 4938 5242 -5681 1078 4311 -5115 811 6948 -2861 1269 6807 -5353 -3143 7979 -2486
618 -2486 -5263 7278 570 -7230 3223 1263 -5968 2303 1139 -6965 1034 2447 -6404 774 5761
633 5761 -4793 -2772 4536 -1271 -2220 4527 2269 577 2025 -725 371 2936 -1091 811 5026
648 5026 -1094 -3065 2763 -52 -2979 1626 331 -2737 -51 -1119 -2416 1563 -780 -3815 687
663 687 534 -3639 -56 2844 -713 -655 1101 -433 116 1242 517 1520 1508 -1 117 -468 -262 972
681 972 -207 -463 1610 -1623 -2580 2362 -1032 -5497 2301 2047 -5583 -45 4354 -3548 -1330 3828
697 3828 -2091 -962 3826 -1772 -195 6435 -785 -2925 5538 389 -3841 5770 3009 -4612 3087
712C087K58q508N184K474o130L438K116o930M063L672q159K223P133o294j171
727c544O487l102j949M567l718j168N845l672k300O597k940m488N896m42n227
742c158M115J538m029K192Q80k927J774r32l790N014J497o350K515N297m542j347
758b253M211j155j217K097q63N17J361k450p17K360j901j095L007q05j031J210
774A276m39o58l22j957K045J652m027j78M083k912k452K810k11m83J746j846J197
791f76L962m055k698O824j784n488N981J586o320K851L483n261J096K773l850
806a576K347K746n078J404N013o818k379P135k257m504M608Q55k798J732r87n75
822a132L111j672k002N247m74m568K848J274l983N82J594j249J314j35k549L372
$$ plain form
712 3087 3345 -5163 21 2495 -3635 -197 1919 -5011 -948 2724 -5435 -3212 3921 -2373 -3544
727 -3544 2943 -159 -2108 2459 -1259 -2427 3418 -254 -2554 4043 1103 -3385 2511 2069 -3158
742 -3158 957 2495 -1534 658 1538 -1389 385 -547 -4337 677 2174 -4176 -1661 3636 -906 -2253
758 -2253 1958 803 -414 1683 820 1337 2698 248 -469 1891 -10 -1105 1902 1097 66 1276
774 1276 837 179 -143 -2100 -55 1597 -2430 -2608 1475 -1437 -3889 -1079 -1290 -1773 -27 -1873 -676
791 -676 3286 -769 -3467 3357 1573 -3915 2066 3652 -2668 183 3666 -1595 -499 2274 -1576
806 -1576 771 3517 -1561 -157 4856 -1962 -4341 2794 537 -3967 641 1496 -1302 430 -557 -1132
822 -1132 1979 307 -1695 3552 3078 -1490 1358 2632 -1351 -769 825 -424 890 755 -1794 1578
838A578p59n323L870L594o240K00N388k939k521K458j244l85K116j959J398M002
854C234l825j244N003j827l404L404J138k451J537j6j223J696k218j979M558n27
870A856l703L563K011m441k36J551j911O0N22n75K925q10m021L019K582n256P74
887b090N386k512j249K841j307j757R84k470R91L515l294j617N263k199m264M006
903B27N66l592J838J420k035J886q19k868L130O61m381L454L597l827j04L765
919B918j678j625J463J95R15j98k411J774J748m490o7L866j869j927K687K89j119
936D71K70j523K28J660l441J04M193k778k326M378r10l598L078Q47j846K798q2
953A523k915L313q7m854K914L049n454O9M674k869j235K717j238j97J496k698
$$ plain form
838 1578 819 -4504 -634 2960 -3280 -3080 2308 -631 -3152 -694 -1938 -2323 -207 -2166 -768 3234
854 3234 -591 -1835 3168 1341 -2063 1341 2479 28 1565 1549 326 2022 -196 -2175 2383 1856
870 1856 -1847 1716 3727 -714 -950 601 -1310 -1250 -728 -1303 1622 812 -3209 -190 2392 -2864 -2090
887 -2090 3296 784 -465 2376 1069 -688 296 -2174 -1183 2332 -962 -2579 2684 485 -3779 227
903 227 793 -2799 -961 459 -1576 310 -509 -3377 -247 414 -3967 -513 3084 -743 -847 2918
919 2918 1240 -385 1078 1273 2188 1990 -421 1353 3101 -1389 -1456 2410 541 -1386 1301 1590 471
936 471 741 -782 -554 1106 -2335 -2231 1962 -816 -3142 1236 326 -3272 -194 653 -1193 1605 1523
953 1523 -1392 1921 1834 -3020 -106 2943 -2511 -2442 2232 -637 -1872 845 -393 -590 906 -1792
969a792J002L073l633q21M373k654l203M009M23k322K564J39o94J445j476q27
985c94M122j616l560L916J006n375J619K776l668J24K631k726O26K461k885m56
1001a399L334k992k185L711p06k638K460Q81k130k25J002J41J399k67J2J445j353
1018D90j093J160J56p91p3r4j89M60j495P94L048k398j506L038q47k628L057N50
1036A639k810O76Q26k086J870J245k371J730J213k853J409K513k908Q70K354k688
1052F29j341J984k187M7K364k994k94L612l211j524M700r65l527K943j8l226K744
1069b64L11l204L466K94m443L091K805m046J768M390m833r34M873k570k156M200
1085B748r54k980J729j010r66K706n66k168K625M01k624J062J542j421M96m83
$$ plain form
969 -1792 -790 2283 -1350 -2171 2202 -452 -3655 354 777 -1545 1019 1158 464 1909 433 -394
985 -394 3728 2112 -1448 2468 3474 -1901 -282 2494 -1174 -1050 1581 -1145 -519 1942 -943 -1399
1001 -1399 1935 -1057 -3242 469 -237 -2875 -415 466 -1664 -1889 -887 -746 653 386 398 1843 490
1018 490 -603 557 713 -78 -151 -245 -434 26 -1469 -675 2373 -25 -1531 1507 660 -1968 1089 1639
1036 1639 -1171 -495 331 -1755 115 1360 -1011 719 1932 -921 488 3001 93 963 3317 629
1052 629 -712 1272 -915 -868 1496 -1498 -1792 1820 -1391 -2915 1785 820 -2707 236 218 -3008 -264
1069 -264 47 -3157 309 603 -3840 -749 2056 -1990 -222 4168 -665 -1599 3274 704 -1452 2748
1085 2748 1794 -1186 543 -467 -1433 1273 707 -1461 1164 1565 -1059 3 1545 124 620 137
1101A37j015N83Q00j103R99N40j688O72R34j015J077J398j199q63M8p96L88k13
1119c16j164J146J098k652m46K116k21m58L87J04k4k16q05J125L05j784J032J172
1137C99k147J227K567j929N8K217k052n42K322j745n81L634l021l232M295l9m383
1154b952L373J760l606J563J791l736J876K685m566N19L828l681q78L846k119
1169b97k265M134p92k886K718J262j542Q65n60j476J781r74k439K878L82l012
1185b223J026J558j839K09J169j079J559J022k749O20K062k273q3K400k286p75
1201a682K886%j559J636O3r92P69m5m59J179m34j956P01Q54j895q36J808N41o54
1220g5j000J193L61j202M75R79j137r07J827n03q57O36m26q07J955r03p25K906
$$ plain form
1101 137 -878 -295 505 -598 401 941 -747 -75 859 -156 921 2319 1120 257 305 -491 -103 -316
1119 -316 -1480 -334 764 -1888 -2334 -218 -439 -897 -510 -406 -430 -646 -1451 -326 -21 -1805 -773 399
1137 399 -1748 -521 2046 117 175 2392 340 -202 2120 375 -206 3428 407 -2825 1470 1431 -2952
1154 -2952 421 2181 -1425 138 1929 -1807 69 2754 -1812 -1293 2535 -1146 -2024 1822 -297
1169 -297 -2562 1572 780 -2106 612 1874 332 1197 637 -839 942 -32 -2471 407 789 -2223
1185 -2223 -1197 361 -1478 -1269 -100 -1179 380 1402 -1347 -727 1335 -938 -1021 1379 -907 -1682
1201 -1682 1204 1204 -355 1281 1344 352 1121 1076 617 1796 1362 -594 107 961 -934 -1770 38 579 -75
1220 -75 -1075 118 479 -723 -248 731 -406 -1313 514 11 -846 -210 -636 -1443 512 -391 -1116 1790
1238A790m81k850K736J561m321M95K720k238j24J339k051m9K416k725L56L588
1254B162k275j599L701m41l121K295j14j770J310N52j052J206k33j410K373K48
1270A832l210K008K060k711k07K044j984o15J254j772M26J472k482L46L222k056
1286c73j740K889q06j832K321K8j847J190M8q59R67Q1j575K211Q60k045P04J534
1304A756j492m97Q57k01m52k79m41J191n4j890P07J335r94Q8J069m63m5K66n87
1323a26L70q8j217J119J391j957K26J595j044r52J759M7p44O13r45lJ205j998
1341g49j112K121j94k377K166M05j704O20P75n96P51j1j467J789L21k150R20J654
1359A162k463K43K273r74j018J775l90j24Q94j210k34J784j737r92K135r36k119
$$ plain form
1238 1790 1309 -1541 1195 2756 -1565 -1070 1650 -588 -712 627 -1424 -1473 943 -1782 -1426 2162
1254 2162 -113 -1712 1989 1548 -1573 722 608 -1162 148 700 -352 854 621 -789 1584 1832
1270 1832 -1378 630 2690 -21 -228 1816 -168 -783 471 -1301 -875 597 -1885 -1539 1683 -373
1286 -373 -2113 776 -30 -1862 459 487 -1360 -170 -122 -981 -14 67 -1508 703 1563 -482 222 1756
1304 1756 264 -233 624 423 -29 -308 -749 442 388 -1502 -795 540 -454 -366 703 240 195 461 -126
1323 -126 244 156 -1061 58 1449 -508 -282 1313 269 -683 1076 1123 379 992 47 44 1249 -749
1341 -749 -1861 260 66 -2311 -145 260 -1444 -824 -49 -645 106 95 -1372 417 738 -1412 -492 1162
1359 1162 -1301 -1058 1215 241 -777 998 608 484 1378 168 -66 1718 -19 -1011 1124 188 -1931
1376a931J695Q44j927P75O52p11J003L61j453J290J46j741J055J354j975k5J268
1393F80n59m02O54m67N38M79j269J025P90j901l58J283o66j303J271k18m66Q34
1411e5k74m25J112n12n56J866p62j459J725L23j754P48P87r35L57L30o18P04L96
1430I98j270J259K96j565K03Q28j236K5M27q52M99L14j134P39J497j791l7K185
1448A385j619q50K165n34j295J145m6r27J082m00j039J744p3j558J306Q89j883
1465e08M33J060j238l80M63m55j37K03j16M33M91j094R32K75o96N00P80j329O97
1484C14K2p72J079M34j901N25J993j701p85K661j033j320J282j43j715J418j31
1501B27j604J578p8k022J321J061j975J241J396j750k71J642q84j8L83l44M31
$$ plain form
1376 -1931 -236 608 -1319 -544 108 -603 400 761 -692 598 744 -997 58 1412 -563 -588 680
1393 680 121 -281 373 -94 444 923 -346 679 1469 -432 -790 493 -173 -1476 -205 -423 -889 -55
1411 -55 -329 -754 358 -154 -710 1156 394 -1065 660 983 -771 -23 764 -171 186 516 -102 602 998
1430 998 -272 987 1283 -282 -79 749 -487 -462 -35 -887 -388 -74 -1208 -469 1028 -763 -800 1385
1448 1385 -234 -1084 1081 547 -748 397 351 -576 506 106 -933 811 738 -820 486 1375 -508
1465 -508 -75 985 -253 -633 -170 -625 -762 -559 -675 -242 249 -845 87 362 -334 166 946 -383 314
1484 314 336 -436 643 1077 -824 -299 1694 -7 -792 1869 836 -484 798 655 -1060 358 227
1501 227 -1377 201 123 -1899 -578 483 -1492 -251 1145 -605 -876 766 -118 -136 247 -97 334
1518C34n5j191N72J509j508K96J338j365k93J122q79N1J259j419p15J357r87j467
1536b041K314K2k025K020P65k251R11J291j353K75Q23r83K18J260j271l55J437
1553A057o83j465J422Q53j237N86K90o44m73j42L56M1o79P38k9r42J43J202q04
1572d10J81L42q58Q28J012j433j81K293j469j819K219P9j349Q28Q40j306M13L11
1590E21j361Q49R94j261J60Q16j883J94J101o27j22Q63q20J48M45o34R87P85j980
1609h25J37K064j540p44K154j89j903J515n52j162J961j68j408J598K75k867J753
1626I9J130k655O58K182k089p36K373j067r29J465m08n35J369n76p66J488j2j781
1644g90N65Q27q17L7R36k36l5l35n37O53m6l98L72N12j026Kj57m53M76r2L32L07
$$ plain form
1518 334 279 -912 -340 1169 -339 -43 1295 -70 -363 759 -120 -69 1190 -229 -944 413 -574 -2041
1536 -2041 273 295 -1730 290 1055 -1196 -285 1006 -347 -72 751 -232 -14 1246 -25 -380 1057
1553 1057 374 -1091 331 1184 -53 533 823 179 -294 -436 -80 -39 -718 20 -9 -951 -808 394 -410
1572 -410 -229 113 -745 83 1095 -338 -519 1774 305 -1514 705 784 -565 263 1103 -203 210 521
1590 521 -840 9 1003 -258 -98 718 -1165 -971 130 -497 -619 244 -576 -428 17 -617 370 1155 -825
1609 -825 -688 1376 -164 -908 1246 1057 -846 669 117 -1045 916 748 -660 938 1213 -1654 99
1626 99 1229 -1426 -768 1414 -675 -1411 962 -105 -1034 431 23 -512 857 281 -485 1003 991 -790
1644 -790 -225 602 -215 -178 758 522 487 152 -385 268 222 -176 196 708 -318 -316 -473 -926 -450 -542 -210 97
1666I7q57j03J191N11j420N95Q03p43l74O94Q2P1m43l21M13J4n76M79O28p21k21
1687b01P59j057K2J041q44K30N23j453L34J461j479p71K187m06j448J819K29j365
1705d19O15M33j460J041M03j510J615Q21k449L93J785j804l87J899p46j302J494
1722D22l66r59Q97l18q26J554k85j349J471K81j402Q14P90q88J39P15p68M83L94
1741G99j255P43P60j346o8J397p90p53P09l8m89K88knL71p15j58R39n70m14N72
1762b5M83r09P7N62K28m15k88O98K33r05K15O97o60r4M40j08m58N81o93L0Q42
1783E31j146r9J351m15j380J317K73j251Q75L90q68L30P10r51N83N12j117L78
1801B3J537j538n81J672p51r12J300j37j048P45m2n66O19n49j055J424r3j206
$$ plain form
1666 97 -760 -863 328 839 -581 14 817 74 -300 394 476 547 104 -217 196 210 -366 113 741 20 -201
1687 -201 558 -499 -477 564 -280 -50 473 -980 -646 815 -664 -1435 752 346 -1102 717 946 -419
1705 -419 196 629 -831 210 613 -897 718 1539 -910 -517 1268 -536 -923 976 230 -1072 422
1722 422 56 -903 -6 -324 -1150 404 119 -1230 241 522 -880 -66 724 -164 -25 690 -78 405 799
1741 799 -456 287 1047 -299 -367 1030 240 -513 196 158 -331 -43 -45 -50 321 -394 -552 387 -183 -597 -25
1762 -25 458 -451 -374 188 416 1 -287 411 644 -261 -46 651 -9 -103 337 229 -229 352 -341 -311 531
1783 531 -615 -714 637 222 -1158 159 432 -819 56 446 -422 -92 618 -333 250 762 -355 23
1801 23 1560 22 -559 1113 362 -550 750 613 -435 310 268 -298 321 -228 -1283 141 48 -1158
1819a158J024O95j423L52R59r29L76L62n81K11P13j052M59R97j362l0J366p14
1837B65q24R98j08m37K77k24m88J117o11o07Q08K8j125P16O09p33j85P90k77Q
1857cR1m0Q6J59m15M84M47p39J28K59k42k31J05J0M53m21q49P56O26j627Q37N19
1879C93j122kR15n66j66P99r32p5J178p52l99J379p15o40J176Lr74Q66K61o27
1899@K66J87n68Q75k03j406J223K03j164J57Q67j161M10M99n51K93N36p87L23
1918aP46j056p2J232q24p00J278j63q94R38m86k27Q29k99p27Q90O6j192O87L87
1938D12j173L37P14o29k15L03mKJ70n03N55L45o75L29P30q17j06N66l76k6M08
1959C47l46L48K64p90j40J149p14l39P76r1r05Q00j95n90J24J94l76L64j16l82
$$ plain form
1819 -1158 -134 561 -862 -510 449 -480 -104 258 -323 -112 601 -451 8 1005 -357 -387 979 265
1837 265 -559 439 331 -106 171 -53 -541 576 -35 -642 166 194 -931 -215 394 -339 -524 266 -11 -3
1857 -3 88 48 134 293 -122 362 809 70 198 457 215 -16 89 99 552 131 -718 38 664 -963 -126 393
1879 393 -729 -731 184 -382 -548 251 -681 -756 422 -330 -729 650 -65 -705 471 474 -500 366 627 0
1899 0 266 453 -115 760 557 -849 374 577 -587 -430 437 -724 -314 185 -366 -73 463 -324 -1
1918 -1 745 -311 -383 849 25 -675 603 440 -454 484 -2 -229 600 301 -426 464 530 -662 25 412
1938 412 -761 -424 290 -339 -554 -251 -255 -253 -83 -586 -31 314 -361 -32 698 -119 -225 341 -35 -61 347
1959 347 1 349 613 -177 -317 832 118 -221 555 464 -441 359 164 -426 -302 -108 -484 -120 -236 -618
1979f18Q30k84m60L92Q43p85j71O39l27R5J03n78K68J99o18R5J023q01l14Q35
1999C66k66q20Q69J4n77N22n00k64N94p1o04R70K95r26J46Q24o21J75K80j55N2
2020C03k16l36R85l92n61M39M01r18L12M86n26M58j82n50L51l8o13M49N71q87
2040d64k74J063m27p86J115K09p89N74k83l09J042m59n18J162p57r91J034L47
2058D89q48K32R07q38jk03j00P53l05o95N70M01j092J98O56m90L02N28o86K74
2078E2O29q55K55J079j247m76J414n50j027J148N90j362K84O36m28m4N55r19K12
2097e4L44n90l54Q55q18j44P53j79j62K0M54Q1l37p3L45J9m63N53M48o33l83L48
2119C0%n1K50r4J97J06o92j26J019m05p12Q52j72q50K40N29l22J46j55o8M30k09
$$ plain form
1979 -618 212 -72 -532 -140 703 -82 -253 386 59 154 257 -321 -53 146 -472 -377 646 -155 -469 366
1999 366 100 -720 149 163 -414 108 -392 -656 -62 -133 -737 233 528 -398 -252 572 -49 126 406 251 303
2020 303 87 -249 736 344 -217 222 623 -295 17 503 -23 435 253 -297 54 16 -597 -148 423 -464
2040 -464 -738 325 -102 -888 227 436 -353 221 -62 -371 671 212 -306 856 99 -892 142 489
2058 489 -359 -127 780 -58 -59 -262 -362 391 86 -609 -39 362 -730 -532 124 -366 -64 464 -222 52
2078 52 681 -174 81 1160 -87 -563 851 301 -726 422 1012 -350 -66 570 142 98 653 -266 -54
2097 -54 290 -300 -654 201 -617 -761 -8 -187 -349 -329 125 206 -131 -204 141 160 -303 250 698 65 -318 30
2119 30 30 -21 229 135 332 438 -254 -380 639 234 -478 374 202 -648 -408 121 -201 -55 -210 -278 152 -57
2141e7l54Q89J99q34L50L21o46J69K1R5M38n09n78O31M16j202P11P07j000l77
2161f10J203p94o40Q86j02r13Q76l7m03J076j36j045J130K68j271P66N79q90K48
2180A91K23m89j56O16p55J99O22p16R1P15k44q99Q30K12n48L4J09k62L4j04K3
2201b74L29Qm87P23L7m87L59M22m55l95L27K66k25n0k64L89j05m12J80J46k69
2222b37K08L05j97j34l31N6K09p7m93N48K75q10M63O46l97j18L46j20R0M45p64
2243h7N9O08q05k79R42l43p50R46q3n15N22m9n19O19m91k02M25J49j281J163M26
2264D55j229N27Q05o15J64M53m75J38M90q43r9J174r37m64Q66m7j205R32J72n84
2284c22K29N50o32J61k36K6L85l23n99O79O04q92k27J190o05N1J24J33P2n9k05
$$ plain form
2141 -57 -411 478 677 -157 193 514 -132 37 58 153 591 82 -496 135 551 -651 60 767 -233 -610
2161 -610 593 -201 -841 45 -57 -970 -94 -131 -534 542 406 -639 491 759 -512 254 833 -57 191
2180 191 414 -75 -231 385 -370 -171 451 -265 -174 541 297 -602 228 440 -108 -74 35 -227 -193 -297 -274
2201 -274 55 63 -424 299 336 -151 208 630 175 -220 107 373 148 98 -166 223 118 -294 -114 32 -237
2222 -237 -29 276 79 -55 -386 -330 -121 -198 -691 -143 132 -678 -215 431 34 -84 262 142 232 677 -87
2243 -87 -28 580 -225 -504 438 95 -655 291 208 -307 215 166 -353 266 -225 -427 -2 147 -1134 29 455
2264 455 -774 -247 558 -57 107 560 85 223 713 -130 -229 945 8 -456 410 363 -842 90 262 -322
2284 -322 -93 457 -175 -14 -250 -224 161 -162 -761 -82 522 -370 -597 593 -12 39 163 296 368 309 104
2305A04R6K43l36k27K23q4K1j56J59k51K30k01M65k08l14L0K85L4n19L00K38m02
2327b70J22K04kJ85n05K31O36l31n32O67m3n54J75K21m22N6Q4n5K17o5o08Q22
2349B33J1n35K52O76q98p7L59j60l14M28n1j81P84o59j85J076l54p23R00J0p00
2370a08L52J56p17K72J41n02K65q0k08N71M99j186K24R10n77n50N42n1l16J35
2390b28J96o3J64j84o4O82n01OK61K52l01k32L90o1m20j85L40K15m35N3N2J46
2412H3o70L82L41k89J2J81o9n5K70n06J60L67n72L37M66l47lJ82J95l34j28K97
2434C00k87J32m17J03N85j003J11L89K41o14O06k10l6J57k34j99N35k74l05M48
2454B8J62p02N65L40o78K77M01k42L3K33m33L99K04q64M8O20r0r39P34P1n07M36
$$ plain form
2305 104 200 443 107 -120 103 19 40 -116 43 -208 22 -179 286 78 -236 -206 79 113 -406 -106 132 -270
2327 -270 -148 56 54 239 -266 -35 601 270 -262 405 362 -192 -17 204 -218 -162 -78 -133 84 19 -589 233
2349 233 244 -291 -39 637 -261 -338 21 -139 -453 -25 -76 -257 527 -132 -317 759 405 -318 582 592 -108
2370 -108 244 400 -317 -45 96 -406 -141 -221 -429 142 641 -545 -321 589 12 -538 4 -47 -363 -228
2390 -228 -32 -95 69 -115 -179 503 2 8 269 521 220 -12 378 317 -103 -288 52 267 -168 -115 -63 83
2412 83 -587 -205 136 -153 -141 40 -29 -84 186 -320 -160 207 -365 -28 438 91 88 270 465 131 3 300
2434 300 13 145 -272 -169 416 -587 -476 -87 154 -460 146 -64 -100 57 -177 -376 159 -115 -420 28
2454 28 190 -512 53 393 -285 -8 393 151 184 417 -16 383 587 -277 -229 391 301 -638 96 167 -340 96
2476I6j87l4j30L8J30Q2J6m08M76j86k22J40L61q4OM4J69k20Q9j97L86j07m52
2499a94J79M01o97l3M13l28k00M73q3j46L56k48J86Q2m35k79O50J61m11O8J70
2520H5j10nQ6q3N06l20k48O72m66l38L73N2m28J68L65o82K76N5j43K26Q6m81L05
2543d9L76l73l35O59j61m61L57r9j81O48j94pj29L50r8k44M14l77j52L26j23o02
2565d55L66j9p6m4K01N4k29j77N88k11j27M33m4k50Q9R9m12L06Qk19J49K76k53
2588E3j5N75l20m82O81j05l78kM02o67J21R6k56K13M6j72K43P6l53J59m4L72O6
2611C09k97L7J57j63k77L91J45o25L52N01n63J51L03j52j42K33l85k69O07p48
2631d35P1M96j47p09P07L74p06L77O23p37o3K60Jp8q9j6Kj04K15j30N6K63R3j27
$$ plain form
2476 96 -91 -125 -255 -217 -87 -5 11 -397 79 -107 -329 -189 172 88 94 138 307 87 176 -21 365 258 -194
2499 -194 -15 386 -311 -344 69 -259 -459 14 -69 -215 141 -107 79 161 -274 -553 97 258 -153 -85 85
2520 85 -25 -30 56 -27 479 159 -89 583 117 -221 152 204 -224 -56 309 -373 -97 -42 -185 41 127 -354 -49
2543 -49 327 -46 -381 278 117 -344 13 -86 -267 381 187 180 51 401 303 59 473 96 -56 270 147 -455
2565 -455 -89 -108 -184 -228 -27 27 -202 -379 209 -2 -129 304 260 10 99 198 -214 92 100 -119 30 306 53
2588 53 38 613 293 -189 492 387 9 7 409 -258 -137 -41 -297 -84 -38 -210 33 109 -244 -85 -129 243 309
2611 309 12 49 206 43 -234 157 302 -323 29 530 -33 118 421 269 127 360 -25 -294 313 -435
2631 -435 -364 132 -15 -724 -17 357 -349 28 651 -86 -149 111 112 34 -55 -71 -69 -173 42 -88 -32 231 324 197
2655A97j46J4p6k7K19k02m23O89k18k97j53N14k39l2J55j94J96M81m91p6K78q1
2677H8j7N5O0l39L68o6n2k09L64j98J46k39qK31l84q0J99K69l79K20j19j44K13
2700b1k0l28N33r6o47L86O87o98J90M58m51l01P38l28J20L6k16l00M55l2n49O41
2722B57j22n30L87K68p58K07M24k98J71l8j22K92k78J39J3J56k97L2L38k63m6
2743f8J24J12k00MJ3M13L9l80l03L43J33k98lK21m20j10J03j70K05O9r0N11m42
2766a94K35j39M84l06k50K87P7k4j52R9K69k06l47N80l32k51M25M2k53j06j34
2787a96lO7J15J8p3J43n41K86M39j57l16L15L07n81J30L45m03N87l74k75N25l57
2809Ak41N09j58n22L75K43l80o6L24o3j99j2Q9k05L47j46q9K69jn47R02k51l53
$$ plain form
2655 197 51 65 -11 -38 181 -21 -444 245 27 -270 -423 91 -148 -180 -25 -219 -23 458 -33 -109 169 88
2677 88 71 126 186 -153 215 149 97 -112 252 54 200 -39 -47 184 -200 -280 -81 188 -191 29 -90 -234 -21
2700 -21 -41 -369 164 68 -579 -193 494 -204 -14 444 -7 -308 430 102 222 258 42 -258 197 165 -384 257
2722 257 135 -395 -8 260 -498 -291 133 -165 6 -32 -154 138 -140 -1 12 168 -129 -97 241 -22 -68
2743 -68 56 168 -32 -28 -15 398 437 57 -246 97 230 -68 -71 150 -270 -380 -277 -447 -242 -173 -263 248 -194
2766 -194 41 -98 386 80 -170 117 194 170 18 117 386 180 -167 413 81 -170 255 297 44 -62 -196
2787 -196 -199 -132 -17 1 -72 71 -470 -184 255 98 -218 97 404 -177 -47 298 -105 482 108 -167 358 1
2809 1 -240 269 111 -411 -36 207 -173 -239 85 22 -177 -189 -100 -305 42 -104 -193 76 75 -472 430 179 -174
2832a74K64L77k00j35J4l7J67J25n44K92r5j31K39l5R2k72K07M4l36J69k02mK17
2855D2k45j15K67M7j99R9J53q6O5%J74N4n15N36J7k30R3j26R8l61O37j59l00L58
2879C04o58J67M66n93J53N08k57m04L78K03m66J12J28k17K00o8k59N30J2m93L20
2900F6M15l44l07J37J29k47K60R0r6k58J02k04J98k88j95P20k94o6J99j13m8l2
2922a76J40l07K45J99m17L18P5k28J78K22k50n0J18ml2j10P0K2K20k75Q7K83l55
2945b7l81N8M13j99J41j68J75r2r6K72q3j3q2M11l30R3R6k36K57Pk3j45J41l19
2969a30O3J83J54m06j4L20l53J75M7k19J39n7l6K92k80J45N1N0k94J84Q7k17J31
2992A5N5J16M2j13Q0j87K66j30k58M42l01k07M08Kn63M66n5k99J53j51J40K68
$$ plain form
2832 -174 90 467 267 132 146 109 276 401 -143 149 54 -77 162 127 219 -53 154 198 -138 31 -171 -175 42
2855 42 -203 -318 -51 -4 -203 -104 49 -37 28 28 202 256 -259 277 294 64 157 31 129 -232 405 246 -54 304
2879 304 -354 -187 279 -314 -161 347 90 -314 64 267 -199 -87 41 -176 24 -44 -303 227 239 -254 66
2900 66 481 137 -170 -33 96 -151 109 199 103 -155 -53 -257 -59 -347 -542 178 -116 -182 17 -96 -144 -176
2922 -176 -36 -343 -98 101 -316 2 77 -151 27 249 -1 -51 67 63 31 -79 -9 13 233 -42 45 328 -27
2945 -27 -408 -350 63 -136 5 -163 12 -80 -176 96 13 0 -82 329 -1 92 188 -48 209 216 193 48 189 -130
2969 -130 -67 116 270 -136 -150 170 -183 -8 39 -180 -41 -98 -134 158 -122 23 74 124 -170 14 101 -116 15
2992 15 70 186 228 115 195 8 274 144 -114 328 27 -180 228 230 -333 133 78 -221 -68 -219 -79 189
3014A89p7l43K01J18j86J69k1K21n97M07P3k06J53l8K24k98l40L81NO7o5Po2J07
3038H9j66J16m6P2k78o5K71oj34L31J68n15L20m9L9m27L96k32K29J92j39m6k8
3061I2j29L6J54j43k58M62k66P9n1Q7P6j83k03R2M10m93J96K66k93j62J81J35
3083H5j04K59j58O9k40K84l02J15L19l75p8K91l65J29J77j1k51J01j32Q3J73j84
3105a15K2J7L20m24J83p4J94j57K52l94o4K12N7K10j43j60J59N5l78K88Jo8r5
3128a02J73j83J62q3l5pL74l22l35M61l62J49K87J30k61J0R4j50j8j39L08q3m0
3151B8k6J47j68N8L17k86K32l30K96n1j52k57J54p3J68l50L85J44n04K23Q6q8
3173d7k09K59j72J35J29k08O7M99l77m86O08q2l16nM96l05J9j00J71Mj17k42M16
$$ plain form
3014 189 112 -231 -30 88 -98 71 50 271 -326 81 154 -52 101 63 287 -11 -351 30 35 102 37 44 -18 89
3038 89 -77 39 -7 65 -213 -278 -7 -13 -147 184 352 -163 157 108 147 -280 116 -116 113 305 166 120 92
3061 92 -37 -1 153 10 -248 214 -52 27 -24 63 139 -44 -247 -155 255 -238 -42 224 -69 -231 -50 85
3083 85 -19 240 82 151 -89 195 -107 8 327 -48 -126 165 -200 -71 106 95 -156 -55 -187 -104 69 -115
3105 -115 -93 -76 244 -180 3 -71 123 -34 218 -176 -240 -28 29 239 96 -64 95 150 -228 60 61 -7 -102
3128 -102 71 -112 50 -33 -68 -75 299 -23 -358 103 -259 -110 177 307 46 56 150 0 -18 -157 151 68 28
3151 28 2 149 -19 39 356 70 302 -28 268 217 65 -192 -38 -111 57 -293 92 236 -268 -45 41 -47
3173 -47 -256 3 -169 -34 95 -113 -46 453 76 -410 198 116 -200 -205 291 -14 5 -95 76 80 -37 -279 137
3196A37p1l77Q6K14j27l1K55j82jJ52J8oK1l32K17L38m37J52J34l76K10K23l33
3219a16Q4q3J10j29L26j77%J19k81j62j2L20j41p9Q9K27k25K08j73L03j94j83
3241a69R9J4j45K14J81l65K25J59k08N4R4r2j6j14j21J97J06j39j23J61q1j21
3263a90K23q1l83J97J74J2M73m05j92L5K16M0j22j5q6J62j42K40j67l3j25K36
3285F7k10L4J59O2l15k4J84j17J36p4j04K67J12j08k05K98q7k33K05J66l92K02
3307B3K70k09p5O7j56J29J24k67L14k7k46m8J77q9pk35J72O5J12k04J03Nj56N0
3331a08J51n6R5J75l09J19k08K38j52J58m6q5N6P3l17M51l69J81j8J62l31J13
3353b7p3rJ17k80p9J88L19l82K81j3j41K74p6j95J02m4oQ1l9o9N8K77j97j59K95
$$ plain form
3196 137 66 -311 -225 -11 -138 -169 86 -96 -97 55 73 67 88 -244 -27 311 -126 26 160 -216 -6 217 -116
3219 -116 -32 -115 -5 -134 192 15 15 134 -147 -309 -321 -1 -142 -221 -132 95 -130 78 -95 208 14 -169
3241 -169 -70 -56 -201 13 194 -171 54 213 5 59 153 61 45 -69 -190 7 113 -26 -149 12 -69 -190
3263 -190 33 -48 -431 -234 -60 -48 425 20 -172 -137 79 119 -3 -18 -104 58 -84 156 -11 -44 -169 67
3285 67 -143 -109 50 112 -203 -227 -43 -160 -24 -98 -202 65 177 69 -136 162 75 -158 47 213 -179 23
3307 23 293 84 9 76 -80 49 173 -94 220 193 -53 -101 76 -13 -20 -255 -83 -18 94 -110 -7 -2 -158 -108
3331 -108 43 -13 82 257 -52 67 -141 97 -55 103 57 -28 28 101 -216 235 -134 47 29 191 -140 -27
3353 -27 -100 -109 8 -272 -351 -163 156 -226 55 42 -99 175 99 -96 6 -38 -44 37 -2 -71 -13 264 67 -92 203
3378B03k57K26k63L27m4k44k09J23M61l61j57L09j12k32J76J71k88J80Q7j7j69
3399i0O8R9j57K04j0j16p9R6M2j46J30J37m4q0j75J29P9J98m49M3j99J51J89j81
3423a61O7J14j45J46J35l8l0k43j86P82l14J6N4L1r6l11K66J9l5L3j48J63j87
3446f8J06L6K10m18J89k17o9RK87r4N8j92P6K38j33J42l31L07lj29K84j56l10
3469a78L39q7l07J83J17j81R1L49k70j62J80j07j42J29l0m2M3K02k23o5L33o6
3491A06j02L7k35O01l98q9J48oj68J01KN3K29j76j38J21k38J12J91p8n3j23J43
3514D0j54M1j90K61L8o3j99Q9M01l82J83j94K53j11P5J55k07r8J46j66Q7L05j27
3537A83j72q4K86j93j82K11j16L5K0M2o7r6j60J38j4J67K7k67L89j9J12l01L90
$$ plain form
3378 203 -54 172 -91 236 192 -52 -261 -138 323 -38 -195 114 2 -230 -54 117 -171 9 96 79 -90
3399 -90 -22 77 -80 124 114 -2 -81 15 57 -89 41 178 134 54 -121 8 87 285 -164 -121 -320 -169 20 -161
3423 -161 -94 20 -125 21 156 118 88 -155 -341 441 127 143 197 228 132 -179 87 106 71 104 -44 119 -68
3446 -68 38 74 284 -134 55 -162 -231 -222 65 -29 29 -163 -87 151 18 160 -171 136 133 4 288 132 -178
3469 -178 161 74 -233 -50 67 -114 -23 326 56 -106 74 -33 -175 -46 -76 -118 -75 127 -96 -161 172 106
3491 106 4 41 -194 407 9 -80 68 62 -106 -5 -3 50 279 103 -35 86 -152 -40 151 73 20 -103 40
3514 40 -114 -73 -263 -2 36 -27 -226 -137 264 -118 65 -129 124 13 88 243 36 -62 84 -82 5 310 183
3537 183 11 -73 213 20 -162 49 -67 -32 -12 30 -37 -133 -293 -155 -169 -2 25 -242 147 128 240 -61 329
3560C29m34P5r6L3K30j03j2j82K44o6j42J36k43O7J10j9J16k04k61M29j62o1J76
3583d0J79j63kO8J42k72J90j6j95K14K9j55q2k2K8J18J22Q2l12K67n93K43K06
3606C6K99m43N8j55J67j16P8j22L54k00j62J88J23rK0L38m37J61m26J93K89j51
3628H3j35J58K4r1k6j14K02j47l5K10k55L12k97O8K9N7j50J24j72J4J29J02K15
3651C05l00M5j78J08R2q2m9j94K57j06J81M2j99K75j38L5m5j89P1k05J37J67o7
3674c7Q7qj16J93jk19R1j09J52O7J11j78L0q8r1J96r4k08K33p4J02j21J73p2j43
3699a24J21J92m02K61J38j61o0O9o6j3jJ5r4L32k00J08K80k87j74l6J58J6Kj3
3723F1j62J79l8p2O9j11n0r6R8r2J38O8K1k99P3L90k34J18k20K77k58K72j89j15
$$ plain form
3560 329 -105 -30 -126 -93 137 34 22 -160 84 18 -124 12 -231 -164 -54 -73 43 -161 -422 7 -155 -216 -40
3583 -40 139 -24 -26 42 184 -88 102 86 -109 105 134 -21 -103 -125 -97 21 143 225 -87 180 -413 -170 36
3606 36 335 -108 -50 -205 -38 -154 -76 -198 156 -44 -206 -18 105 96 116 454 17 178 -248 -55 234 83
3628 83 -52 106 130 39 13 -101 101 -46 -81 129 -126 186 -111 -43 -14 43 -107 17 -155 -141 -12 90 305
3651 305 5 50 -128 -20 72 -10 -59 -253 4 -102 79 121 -78 197 59 94 49 -140 -69 -274 -137 30 -37
3674 -37 50 42 -74 119 118 -101 -10 -119 33 100 211 33 63 -25 -116 80 -14 -222 11 -63 39 -82 91 19 -124
3699 -124 -3 189 -213 48 186 25 -35 34 -32 -45 -46 -31 -125 207 7 115 395 108 -66 -102 56 72 74 61
3723 61 -101 78 40 -32 37 -74 -124 -220 -122 -214 -76 -8 13 -286 -213 177 -57 61 -159 118 -140 132 -57 -172
3747a72K5J21k7n3K57j1o0k11J32j13J9J48Q8j03kK66k55LK6K9J7j20j91J60j17
3772a44K01k4l1n8J6L5J59K29k95j13n3L05q3j95L1K1m3qj39N6L73k23K61k63
3796A5P1j0J7q6J8n5l9N2o1P1k95N07J97k66l40J68J61j22K4k62J37pK46n48L44
3821f3O1r4l1K58r5l8O0o7P1j08K27k81J61k37L17P2j56J62Rl73M95k82J61l30
3845a01K18j38P3j52J34j2J61l35J03O7K8p5K3r4K04j87L28j26k50J69M2o6J19
3868A33l05K82k03K25N8k45J65L5Q9j75l1K52r7r5j8p8J88l18O8J67l5k47l6J98
3892b3K94n34J55J70j68J36j1q4Q4J19j6O0k55Q0J5p4M2L15l81p8J28k9K83m29
3916b01J77o8NJ09k37J82n6j4J92j2Mo5o8j34K21l04J56M25j89j00K31l45K81
$$ plain form
3747 -172 -147 -26 -53 -106 151 140 80 -131 1 -112 -93 55 143 40 38 304 49 52 78 107 124 4 -187 -27 -144
3772 -144 57 33 2 -56 -40 -5 154 383 88 -25 -78 227 144 -51 -20 1 -42 -50 -189 -133 240 17 278 15
3796 15 86 76 93 7 25 -30 -69 -17 -78 -7 -302 205 402 136 -204 -36 125 3 27 -235 -98 -105 141 -407 -63
3821 -63 -2 -96 -127 131 36 -2 58 -9 62 -46 181 -100 61 -176 141 213 57 219 228 -145 350 68 229 -101
3845 -101 117 -21 52 -100 34 22 183 -152 -49 18 46 -29 -6 -100 104 -83 245 119 -131 38 80 14 133
3868 133 -172 110 -93 132 190 -55 110 145 234 59 28 280 183 88 70 -8 180 -138 -70 97 62 -185 -221 -23
3892 -23 271 -263 -108 62 -106 30 19 -65 19 138 122 182 -73 7 22 -52 -10 305 -76 -154 -26 -55 228 -201
3916 -201 -24 -92 -87 22 -215 -33 -89 -103 89 77 81 16 -52 -186 35 -269 -113 312 123 23 254 -91 190
3939A90n7j50o5L30k67j7J6J05j6l6n3rL4n6M06m88J52rQ4n4N8k00J86M9r1j3
3965B9j00m1L44l84J65L1P8k94O8J07j51L77j17j73o9J40m9k12M7J30M6k1J77
3988A28k97K67r9k7j1M8J1n8j42k1J50J8N9k40K45nJ20o0J07Oj92k64L37r8o7
4013h5q5K13l33J01K45k05J53n0j03K56K5j08j25M6J09j51K70j87J90k12K11m03
4035b28J94k9M0J50l05K04L9j23J9k3N1M2j5J25j25J36j56k78M07k01j2J77j3
4058G6k1l32K68O6p0n7J51q3J55n1j42J31o5ln0K6p5J19Nj7p8j44J72N9K46k48
4084C8J27N5m28M66l55l5L73l44K53M5j99j4O7O6m0j76J67k32JQ6L29k33o6K9
4108b0k0kJ79j18j66K30K80k36r4j18l3J32J75j96p3l3K18j09j24K09j05jL1O3
$$ plain form
3939 190 133 -17 -82 248 -19 -36 -20 85 69 33 -20 -29 5 -51 355 -133 19 10 94 40 98 -102 84 133 42 29
3965 29 -71 -112 232 -152 13 44 122 -172 -104 3 -148 229 112 -61 -130 10 -39 -251 -204 -74 -28 -49 128
3988 128 -169 98 -1 -28 -39 9 20 -38 -180 -201 -51 -33 26 -214 31 26 146 86 193 199 7 -257 80 -18 -85
4013 -85 -170 43 -290 -189 56 -149 4 -46 -149 107 132 24 -101 -55 54 -97 173 -14 176 -36 175 -228
4035 -228 -34 -63 -23 127 -178 26 65 -58 -39 -62 -11 31 16 141 16 152 -4 -282 125 -76 -88 89 76
4058 76 55 -277 -9 57 -13 -70 81 -2 153 102 -40 91 26 23 -27 -1 -76 43 48 31 -47 -191 -19 40 286 38
4084 38 165 220 -208 258 -97 -132 241 -103 150 195 -4 -18 49 115 75 -101 66 -166 -165 -79 250 17 -49 -20
4108 -20 -40 -42 137 19 -147 83 363 127 33 -85 -118 14 189 -7 -80 -113 105 -4 -128 81 -24 -25 6 69
4132F9j80K4K5j01K17Ol61J83K89j41N6k49J81K27l09K46l45O5L12m16K93L1j49
4155b7Q6K3k27J30j47J23n1n9K76p7p1K10j66j65M39o6n94J76M0J68q0j19L16
4178A38k49J74j26P3N3j5k1O0J4j08J49j3r7j36L56j65k77J60J92n2k94R9L2K99
4202B46l67K52o6k59J93o9L1J4o0J07j37L27j95q6K72j02J34k68P4Q0k70J39R4
4225H4j04K34k76J34k17J41j37O8j52m0L6O2K7P9M1j3J16n8K14j97k64K62j26
4248h6o8l8L96k67K32j36j64L22j28J5m72M47K7j58m1J8P2J19j42L02k07k92K7
4271b22n4J79o8Q0K42k61q3J69j3K36j34k64M04lk47J6j5J55j77ML2J2Q3k11J81
4296D1m1J60j46j98J55j07J53J21k04j5P8K8p9L55j45K9j57J18l29K91k39R8K17
$$ plain form
4132 69 -111 -87 -62 -163 54 60 -301 -118 171 30 86 -163 18 245 -64 182 -163 -98 214 -202 91 122 -27
4155 -27 59 82 -145 -15 -162 -39 -90 -149 127 50 -21 189 23 -142 297 231 -363 -187 -147 21 -59 -178 138
4178 138 -111 63 -63 10 63 48 27 87 101 -7 142 129 32 -104 252 87 -190 -30 162 110 -184 -85 -53 246
4202 246 -121 131 65 -194 -1 -70 -39 -25 -85 22 -115 212 17 -69 203 101 235 -33 41 121 -149 -10 84
4225 84 -20 214 -62 72 -145 -4 -141 -73 -225 -265 -229 -167 -140 -61 -20 -33 83 25 239 42 -222 40 -86
4248 -86 -154 -192 204 -63 169 33 -131 191 63 78 -394 53 80 -78 -119 -101 -29 90 -52 250 43 -249 -222
4271 -222 -276 -97 -165 -85 157 -104 -187 -18 -31 205 71 -193 211 208 -39 -23 -38 117 -60 -56 -24 -12 71 -140 41
4296 41 0 160 14 -184 -29 -136 17 138 -66 -81 -3 25 -54 301 156 185 28 146 -183 108 -131 -33 184
4319A84j09o1l77N39k80M1K06k17J25j90K44j15r4J64k21K85k25J46J50j46k18
4340a69J83J68q8j34J34oL2n2j87K75k35j74L81j04m4j49J02J0k30L49N4K7l20
4363a77J54p1K42j72R7M9Np4kQ9o0O5j82O0j12J38K92l01M2o1K09l18K75J51k40
4388I8j57k06L40j4J15j43j34j04K91m5N0j20p0M6r4K8K27j39l2P3m5k05M05n0
4412A15N4l3j05O8j6J1J59k53o6K57k52JN0l8O9j27J34k7J00k9j72OJ06L1N5j70
4438g2Q7j43K01k06K71j87Q8p1Q6J20k00R6j12j60L79k4k58kJ92j54L70j94O8
4461A75k08P6j95P7M63k86j45M8J15J12j05J02l57J27M24k67k3O6k13P4J7m7j86
4484a56K06Ol7j81rK70k08R2J45N8q7j39N5k18K28p4m2J91L4L5k6j51O7j83L06
$$ plain form
4319 184 75 14 -363 176 -104 -63 143 -74 51 -139 105 -10 -104 60 -161 124 -101 45 195 49 -169
4340 -169 14 182 94 -40 94 88 120 68 -119 156 -79 -253 128 24 -20 -169 -67 -57 -287 62 116 143 -177
4363 -177 -23 -94 148 -24 73 122 127 53 51 140 80 145 -37 23 -89 49 341 40 82 21 230 -88 187 338 98
4388 98 -59 -265 75 61 176 33 -101 -205 86 41 91 -29 -99 -53 -147 -119 108 -31 -63 10 -35 -240 165 115
4412 115 169 136 31 99 83 94 253 0 -66 191 -61 -60 -10 -48 21 -106 28 1 101 72 -100 -94 12 43 98 -72
4438 -72 15 -128 73 -133 138 -49 39 -32 54 174 -26 70 -42 -202 177 153 -105 -107 85 -69 301 107 175
4461 175 -33 43 -152 -75 388 102 -43 5 120 232 127 229 -128 -1 423 156 133 199 -14 60 77 30 -156
4484 -156 50 56 19 -162 -171 99 -109 -17 128 186 99 -40 15 -203 25 -49 -91 100 134 169 143 -8 59 -124 182
4509A82j20l5J58r5j07J04j7j93l8P5K64k35O9r8K8J05j13j16M33j72j30M3J84
4532A76k77J45K1j01L54k60PM1j28K60j27K19m76J47j59K15J48j64j26L4r3l5
4554a79K19j3p6J86l31L72k57K93j49o1k1J58j15J36M3j82K55n03K80Q1j25j95
4576a84J75o8J02j29K36j48mj67Q9j42L13RK58l92m5J54j77L08k60L8K8QN7J67
4600B26j73j1M4j41K6O5J5k22K50L9j27N8q2J94j30Rj73L34n6k06j34Q3jK43l1
4625I9J6k62p1K49K00k32L0Q4K9Qj14J81l73J77k9m8Q9K09j8J25m94o9O2K74j15
4650Gj65J72J93j81J77j97N0l06J6L77j57k30M16j02r1K41k78L07j26k94J72P9
4672H0j22j34o1L17m3k2qJ8jK01j33l7r3Q4L3lo4l8J50l00K09kr1KK86l58Q1Q9
$$ plain form
4509 182 62 27 185 90 -17 87 70 -123 -161 -86 178 -57 12 -86 -58 47 -66 -182 251 79 -51 -8 176
4532 176 -101 44 65 -36 318 58 65 106 -22 238 111 330 -146 1 -158 57 205 41 -85 -51 -144 -179
4554 -179 40 27 -49 137 -194 178 -79 214 65 4 -17 141 26 162 205 23 278 -225 55 136 11 -184
4576 -184 -9 -77 25 -104 132 -16 -20 -187 -98 -240 73 82 340 -52 -97 57 -120 188 -72 -34 -6 2 59 226
4600 226 53 42 86 -55 -29 36 51 -171 79 118 -9 49 -33 161 31 40 -133 201 145 -61 -195 -112 -113 130 99
4625 99 115 -147 -218 31 231 -1 29 113 142 150 36 217 -156 21 -8 -56 33 242 224 349 -145 -214 -152 122 7
4650 7 -158 14 207 26 203 6 56 -250 -234 143 -14 -244 172 70 -21 220 -58 249 123 -171 1 80
4672 80 -42 -176 -237 80 37 15 7 25 24 225 92 55 -38 46 79 76 12 -26 124 -176 33 31 -60 -58 228 -130 -49 40
4700D0k29K09k7r6K8K20r2j37j61J71K40k77l4L21q9k80J16j8J61J8j7n5r9j17
4724b04K97k10L40k31p7P6J4M1R9k68J96q1k9k63L15j82K39J64m60K34r2l5J10
4747go9PR2Pk6J1J5j72M0K15l20K02j18M1K78m12L10L5O2k30K49k82M2K83m38
4772a85J50O6N2m4k1l1L13m06L2p9K11K4j41j04J20J03j67K6J60l0P7j23j17R0
4796b4j81L08p6l2k50L39j49k1k8o2J94L20m15K92R6j59j39L2n5k01M3L09j70
4819b9K25r4k69L19k03j03J55J61m42M85k2k52j2J13P1k59m2J9q4J82J88o7j72
4842a32K49j10Q3KN4Ql54k8K02J03j77J23r8K17q8p1M7j77o5L23j13j62J9K68
4866A23m5o7k1r3r9J71m5o6j1L20j98K41M2m90N52k04k2j97K16q3J88q8j09%j15
$$ plain form
4700 40 -189 20 -7 -103 -75 145 53 -84 -245 -74 166 -111 -145 176 87 -193 -77 -95 66 84 67 12 -87 -204
4724 -204 93 -117 223 -8 -85 -9 5 46 145 -123 73 -8 -37 -300 15 -167 72 236 -224 10 -82 -117 -7
4747 -7 -76 -69 23 30 4 15 30 -142 -102 113 -207 -5 -123 -82 196 -216 94 129 191 -39 210 -72 -30 253 -185
4772 -185 -35 31 83 39 18 -13 300 -106 -74 -153 58 82 -59 -163 -43 60 -107 -81 79 49 126 3 -114 -24
4796 -24 -205 103 27 -5 -255 84 -65 -86 -114 -176 18 338 -77 215 311 152 13 45 -10 -211 -168 141 -29
4819 -29 196 102 -167 152 -51 -154 1 162 -280 205 183 -69 -81 32 103 -156 -198 -179 -263 -81 107 40 -132
4842 -132 117 7 90 92 146 154 -200 -228 -26 77 -100 23 -75 142 54 -17 30 -147 -212 111 -2 -164 -145 123
4866 123 78 11 -10 -103 -202 -31 -76 -142 -153 167 -31 210 252 -238 314 110 88 -109 107 24 212 124 15 15 -100
4891a00K04KJ01l14J60o1j47o8Q1J61R8m69K59J94j58O7j79k9L11k38K30L5k27
4914h7O6R7j39oM0j58J15L2qp6K01j72LK01q9j1jp2J08L7k4j84L69k1k61J5o5
4941i0pK72j63j07P8J70k43J76j59J73j17p3J46N7j43j46L06r6J08j08r4N7KM6
4965D5k11Q2RJ5K10k81J23J06J0j73J14O1j12N4J47l93J47N1q5R0k36L42k91Q5
4989i1m2j45K78j33J41L5k0l36L70j64j29M13j26j0j05Q3m5m3k6QpR5j97J90R8
5014I2p6R5j38k06J39J08R6q6o9o1m7J92J4k62J19M8R8j61Q0J06o3L0J13q4n1
5039B6J61j82Q7j59K02k23K37k59j62N38k74p6O7j18K51K0n4ol49L13R8j87O2
5062A3L8j31J4p1J12J4j07%%L2J02k7o4K45k74k6L2K9m4J19j1K7m8k17J75M1r7
$$ plain form
4891 -100 104 106 207 -107 53 -8 -155 -223 -142 19 117 -352 -93 101 -57 10 -169 -198 113 -125 105 140 -87
4914 -87 -21 76 -63 -69 -29 -187 -72 -40 -48 -124 77 -95 -92 109 20 9 8 -64 44 81 57 -127 242 221 -40 -25 -90
4941 -90 -97 175 12 -95 -17 153 -90 86 -73 100 -17 -90 56 113 -30 -176 130 34 142 34 -60 -3 -1 45
4965 45 -166 -84 -75 -60 150 -131 -8 98 108 -65 49 110 -2 52 199 -194 -47 4 -81 9 -227 115 -176 -91
4989 -91 -133 -278 0 -133 8 43 23 -313 57 -107 -236 177 51 41 -64 19 -26 -69 -95 -87 -94 1 -196 -6 92
5014 92 16 111 -27 -233 -94 14 110 24 -45 -106 -153 39 53 -209 -90 -42 56 -105 -25 81 18 48 161 77 26
5039 26 187 5 92 -67 135 -88 149 -110 -272 266 -8 -84 -17 -135 116 136 82 76 -273 40 138 -49 13
5062 13 51 -80 -66 -137 -25 -11 -118 -118 -118 -86 16 -11 -75 170 -104 -130 -98 -69 -113 6 -5 22 -26 -243 -68 -27 -124
5089a24Q6K49n7k58L4J56M5k28K4M1P4Q6l9po7K6p0R2k53J5p5K75J78k16j04M6
5115g1LM21m25K64q3j89k89J76K81k66O1M1J46J38j71j04m2R9J20j02O5J88k77
5138a6J11r8j5Q4j24L32m48J62n0J17O8J0j01K4k19k0J74J97mk21j27J52j48L39
5162A79N1j00j55K40P4l27p1J66nj09n2J53n3J49o2j60K40o2j47P4j41K87k39
5185g0k3J5Q9k09J60K40j09k93L26J65j54o2j52j5K52p3j20k03L13q6j30J88o8
5208a9j11Q4j07L4M6P2Q6j27K54l60J64R8j4N5o8J68k02Nk4O5m5l1R7j32j99K42
5234C1m7k00K14m9P5n7k7J25q3nQ8J2l6j32M8O8L1l25J53J11j08J01R6K7j1j67
5260f7O7K40m72K61k09K14j85L65k23R2k9j29n2M5J25j14J38J82k88j78R6J56
$$ plain form
5089 -124 -38 211 154 -104 -70 86 131 -97 -73 -32 42 128 89 82 15 41 -29 63 -190 -175 -250 25 203 -13 -117 -71
5115 -71 -68 353 -72 192 109 -80 -369 -193 88 -178 -117 -76 70 208 37 -67 -109 -10 110 8 73 261 -16
5138 -16 95 -3 -18 66 -58 274 -174 -12 -62 55 123 133 32 56 -163 -183 -9 188 184 -37 -164 -12 -160 179
5162 179 230 130 -25 215 289 -38 -109 57 52 -57 -109 44 -9 140 78 -82 158 96 -51 23 -118 169 -70
5185 -70 -93 -78 11 -198 -38 202 93 -200 126 291 137 75 -77 -92 160 87 -33 -236 77 -9 -139 49 -19
5208 -19 -130 -46 -153 -119 -73 -1 85 -42 212 -148 16 114 100 155 87 255 53 58 34 99 54 23 120 -12 -211 31
5234 31 -16 -216 -2 -51 24 -33 -60 65 -18 -23 65 77 41 -91 -43 25 56 -269 -116 -5 -113 -12 84 111 100 -67
5260 -67 0 240 -232 29 -180 34 -151 214 -9 83 54 -75 -127 -82 43 -71 67 249 -39 -217 -121 35
5282C5Q5K4n4q4lO5K97n15M06l04j41K77n0p0K92m15K44j99J19N1k00J94j87J73
5306D0k81K09P9j50J26j64K19l7j27J03J74k76L26j11j31q9K35j60j18n2J67j77
5328a95K3K8J19j43J84J2R2j93p2K18j39m8O5J81j94R4l1p4Q1o3n7j9M3J4K29
5353A55j19J50j62j87K32M9p2k98L42j84N6o5J7p5J58j25j44L9M01l28L50k00
5375a0L2K43j47m2%M3k13M48l26P9j01k4P5r5Lj38K38o7J16k72R4K26l61J65m5
5400g9m0Nj95L22j19J07m0K06k49J22k08J43J35k36K65k82K21J15k95L30k46l9
5422e7p0l4r8K66J13j29j61K37n3J19j48l5qP0J6O4k97j5K55K1m7j09l5K34r6
5447CP3k09L6K04k72J23J81j90J20j26J5k21P0O6j30L72n4k23M18j84L1k81L28
$$ plain form
5282 35 120 144 90 6 3 68 365 -150 256 -48 -189 88 38 -32 260 -155 89 -110 9 60 -140 54 -133 40
5306 40 -241 -32 47 -103 23 -141 78 41 -86 17 191 -85 241 130 -1 -90 145 -15 -133 -185 -18 -195
5328 -195 -172 -144 -25 -168 16 28 120 -73 -145 73 -66 -114 -49 132 -62 32 1 -73 8 -55 -112 -131 -88 -74 155
5353 155 36 186 24 -163 69 118 46 -252 90 -94 -38 -103 -86 -161 -3 -128 -272 -233 168 -160 190 -10
5375 -10 22 265 118 76 76 119 -94 354 28 107 6 -18 57 -38 -35 -173 65 -2 114 -158 -64 162 -199 -34 -79
5400 -79 -119 -114 -309 13 -106 1 -39 167 -82 40 -168 -25 110 -126 139 -143 78 193 -102 228 -18 -57
5422 -57 -127 -161 -259 7 120 -9 -170 67 14 133 -15 -50 -58 12 28 92 -205 -220 35 56 9 -100 -135 99 3
5447 3 76 -133 -97 107 -165 -42 139 -51 69 -57 -42 -263 -193 -127 -257 115 61 -162 256 72 103 -178 150
5470A50j20j06J25r5K03L1j6k87J27M3k9N3K5K3nk24K01n4m0N2m0lj40J95j56
5495h7L8j35J95lm0j20Q3K08o2R0q8j44l1k1QK18L7j15k09J88P5q4K48j16k33
5520a00K0K9P7q3J27k02J20r7j34J17n3K00j53K8L6O6J2p6o5J43M2O7j82j04j86
5545c51K19K37L2j13l40L03J9J64j45k31J46k6L7J30m3o6k48K90J23l27L54k24
5567f0L87k92j2Q7J9j1j43O5o6Q4k76O34n21K57k57j03J20J51J7r7q4J66Lj16
5591d8j29p9L6L19l9J9q8j38K7K06j83Q4J9J11j21q9N7rj63K66J35m27J10J35
5615A1k8j50K64j26J50j52J60L3l00M7K77k37J1j05nQ3J52J28k61J56k46kK15
5638G5m8m1nL57k19j31Q9j10j07no2K69l27K91J79k23J17qr9K56m29J19K53l33
$$ plain form
5470 150 30 -76 49 -46 157 188 172 -115 12 55 26 79 104 127 122 -102 99 45 5 57 17 14 -126 69 -87
5495 -87 -49 -184 11 8 -32 -152 -69 139 77 167 79 -65 -96 -117 -109 109 146 31 -178 10 85 1 249 133 -100
5520 -100 -80 -51 26 -57 70 -132 -12 -109 -243 -126 -179 21 -132 -104 -68 -2 10 -66 -131 12 54 121 -61 -165 -351
5545 -351 -132 105 137 24 -316 -13 6 170 25 -206 -60 -86 -49 81 38 -28 -276 14 137 -190 164 -60
5567 -60 327 35 23 110 129 118 -25 40 -26 58 -218 416 -105 152 -105 -208 -88 63 80 -17 -101 65 68 -48
5591 -48 -177 -256 -220 99 60 79 -9 -147 -120 86 -97 -13 6 117 -4 -93 -36 -45 -208 58 193 -234 -124 11
5615 11 -17 -167 97 -29 121 -31 129 162 -138 -91 186 -51 -40 -145 -150 -67 85 213 -48 108 -138 -140 75
5638 75 27 -14 -19 338 119 -12 77 -33 -140 -145 -207 62 -265 26 205 -18 99 91 -8 248 -181 -62 191 -142
5662a42P8k5J84J8k64r2N31j93j05N7j75J10P3j48J57p4J8r3P9J60m0j77p4J36
5686aQ0j28k16J12K16k07R3K06l55j7L27k77K72j81J02N4J28l92L18j38P9j12
5708c7J35j83j1J26o1O2o6R1k33L24j64l1JJ07k59P2l3LJ07L12l38N3l3L44m53
5733a65L05k82J15m6J51j94r3MM40k49p9oJ28n0K51l55J47j5K66k26k10K63j25
5756b5J76k01j0J61o9j37K31J61l02k0L2q3J8j74N24l01l2jO7k00M4K2J47k85
5780b57J78J5J7J68k82r4K38LM9M2k01K80k72L32j51k2K25j08k56J58j61J3K14
5803A28j83J66q4lk64J45j74J73k3o1J71n3J43o8k09J03K68k67K18n8k0J0l3j06
5827h1J18J59k90L59l84o9K09j39K99J11m47L66j99l3Om25M51K01m40m1K76N3
$$ plain form
5662 -142 -64 -89 95 113 -151 -243 288 95 -10 47 -128 -18 55 -93 64 -10 8 -85 -6 154 114 -63 -137 -1
5686 -1 79 -49 -265 -153 63 -144 -51 155 -200 -217 110 -167 105 -76 26 80 208 -184 134 -4 75 -37
5708 -37 98 -85 -96 30 -31 31 -35 56 -177 147 -17 -48 -47 60 -199 -127 -160 -157 -50 262 -76 -23 -56 288 -165
5733 -165 140 -142 -27 -73 78 -116 -209 -205 235 -14 -93 -99 29 -21 230 -125 22 7 273 47 -163 100 -25
5756 -25 151 -50 -60 101 32 -105 126 287 -15 -35 -3 -86 -68 -242 282 -19 -51 -52 15 -185 -141 -119 28 -257
5780 -257 -79 -64 -47 121 -161 -255 -17 -14 35 77 -124 156 -116 216 65 43 268 160 -96 62 -99 -86 128
5803 128 -55 111 27 24 -240 -95 -269 -96 -119 -180 -9 -62 81 13 -196 -93 175 -92 126 68 48 58 25 -81
5827 -81 37 196 -94 265 -119 -188 21 -118 181 292 -155 211 12 -21 -15 -440 11 212 -228 -269 7 60
5849F0r4j21K67m2R5J16l00k33K58J36J03j42o0q7k8N5N0o7Q9N4k51O3j64L89
$$ plain form
5849 60 -34 -155 112 70 165 281 -19 -252 6 142 245 103 43 -44 -72 -17 33 -34 55 109 -142 -79 -243 146
$$ [...]
8191H1
##END NTUPLES=NMR FID
##END=
