##TITLE=1H_SL33-Dau
 CDCl3,8 sc, 
 1.10.2021
##JCAMPDX= 6.0         $$ Bruker NMR JCAMP-DX V2.0
##DATA TYPE= NMR FID
##DATA CLASS= NTUPLES
##ORIGIN= UXNMR, Bruker Analytische Messtechnik GmbH
##OWNER= root
$$ XWIN-NMR		Version 3.5
$$ Fri Oct  1 09:32:11 2021 Russian Standard Time (UT+4h)  she@DPX200
##.OBSERVE FREQUENCY= 200.1313468511
##.OBSERVE NUCLEUS= ^1H
##.DELAY= (6, 6)
##.ACQUISITION MODE= SIMULTANEOUS
##.ACQUISITION SCHEME= undefined
##.AVERAGES= 8
##.DIGITISER RES= 18
##SPECTROMETER/DATA SYSTEM= spect
##.PULSE SEQUENCE= zg30
##.SOLVENT NAME= CDCl3
##.SHIFT REFERENCE= (INTERNAL, CDCl3, 0, 15.7039)
##AUDIT TRAIL= $$ (NUMBER, WHEN, WHO, WHERE, WHAT)
$$ ##TITLE= Audit trail, XWIN-NMR		Version 3.5
$$ ##JCAMPDX= 5.01
$$ ##ORIGIN= Bruker BioSpin GmbH
$$ ##OWNER= she
$$ F:/spectra/data/she/nmr/H-F/1/audita.txt
$$ ##AUDIT TRAIL=  $$ (NUMBER, WHEN, WHO, WHERE, WHAT)
(   1,<2021-10-01 09:30:50.12 +0400>,<she>,<DPX200>,
      <created by zg, POWCHK disabled, PULCHK disabled
       configuration hash MD5:
       00 E9 B6 7A A2 85 ED C7 34 08 36 98 17 FE 4E 26
       data hash MD5: 16K
       90 2F BC 30 51 03 6A F2 37 46 39 DD 60 52 29 34>)
$$ ##END=
$$ 
$$ hash MD5
$$ 58 7B FE C8 A2 D8 DB 50 1C BB 4C 17 9C D1 7D C5
##$RELAX= 
##$RELAX= 
##$RELAX= 
##$RELAX= 
##$RELAX= 
##$RELAX= 
$$ Bruker specific parameters
$$ --------------------------
##$DU= <F:/spectra>
##$EXPNO= 1
##$NAME= <H-F>
##$PROCNO= 1
##$TYPE= <nmr>
##$USER= <she>
##$AMP= (0..31)
100 100 100 100 100 100 100 100 100 100 100 100 100 100 100 100 100 100 
100 100 100 100 100 100 100 100 100 100 100 100 100 100 
##$AQSEQ= 0
##$AQ_mod= 1
##$AUNM= <au_zg>
##$AUTOPOS= <>
##$BF1= 200.13
##$BF2= 200.13
##$BF3= 200.13
##$BF4= 200.13
##$BF5= 200.13
##$BF6= 200.13
##$BF7= 200.13
##$BF8= 200.13
##$BYTORDA= 1
##$CFDGTYP= 0
##$CFRGTYP= 5
##$CHEMSTR= <none>
##$CNST= (0..31)
1 1 145 1 1 1 1 1 1 1 1 1 1 1 1 1 1 1 1 1 1 1 1 1 1 1 1 1 1 1 1 1 
##$CPDPRG= <>
##$CPDPRG1= <>
##$CPDPRG2= <>
##$CPDPRG3= <>
##$CPDPRG4= <mlev>
##$CPDPRG5= <mlev>
##$CPDPRG6= <mlev>
##$CPDPRG7= <mlev>
##$CPDPRG8= <mlev>
##$CPDPRGB= <>
##$CPDPRGT= <>
##$D= (0..31)
0 1.2 0 0 0 0 0 0 0 0.06 0 0.03 0 0 0 0 0.0002 0 0 0 0 0 0 0 0 0 0 0 0 
0 0 0 
##$DATE= 1633066249
##$DBL= (0..7)
120 120 120 120 120 120 120 120 
##$DBP= (0..7)
150 150 150 150 150 150 150 150 
##$DBP07= 0
##$DBPNAM0= <>
##$DBPNAM1= <>
##$DBPNAM2= <>
##$DBPNAM3= <>
##$DBPNAM4= <>
##$DBPNAM5= <>
##$DBPNAM6= <>
##$DBPNAM7= <>
##$DBPOAL= (0..7)
0.5 0.5 0.5 0.5 0.5 0.5 0.5 0.5 
##$DBPOFFS= (0..7)
0 0 0 0 0 0 0 0 
##$DE= 6
##$DECBNUC= <off>
##$DECIM= 32
##$DECNUC= <off>
##$DECSTAT= 4
##$DIGMOD= 1
##$DIGTYP= 9
##$DL= (0..7)
0 120 120 120 120 120 120 120 
##$DP= (0..7)
150 150 150 150 150 150 150 150 
##$DP07= 0
##$DPNAME0= <>
##$DPNAME1= <>
##$DPNAME2= <>
##$DPNAME3= <>
##$DPNAME4= <>
##$DPNAME5= <>
##$DPNAME6= <>
##$DPNAME7= <>
##$DPOAL= (0..7)
0.5 0.5 0.5 0.5 0.5 0.5 0.5 0.5 
##$DPOFFS= (0..7)
0 0 0 0 0 0 0 0 
##$DQDMODE= 0
##$DR= 18
##$DS= 0
##$DSLIST= <SSSSSSSSSSSSSSS>
$$ [...]
##$SUBNAM2= <"">
##$SUBNAM3= <"">
##$SUBNAM4= <"">
##$SUBNAM5= <"">
##$SUBNAM6= <"">
##$SUBNAM7= <"">
##$SUBNAM8= <"">
##$SUBNAM9= <"">
##$SW= 18.0517286264689
##$SWIBOX= (0..15)
0 0 2 0 0 0 0 0 0 0 0 0 0 0 0 0 
##$SW_h= 3612.71676300578
##$TD= 16384
##$TD0= 1
##$TE= 0
##$TE2= 300
##$TE3= 300
##$TEG= 300
##$TL= (0..7)
0 120 120 120 120 120 120 120 
##$TP= (0..7)
150 150 150 150 150 150 150 150 
##$TP07= 0
##$TPNAME0= <>
##$TPNAME1= <>
##$TPNAME2= <>
##$TPNAME3= <>
##$TPNAME4= <>
##$TPNAME5= <>
##$TPNAME6= <>
##$TPNAME7= <>
##$TPOAL= (0..7)
0.5 0.5 0.5 0.5 0.5 0.5 0.5 0.5 
##$TPOFFS= (0..7)
0 0 0 0 0 0 0 0 
##$TUNHIN= 0
##$TUNHOUT= 0
##$TUNXOUT= 0
##$USERA1= <user>
##$USERA2= <user>
##$USERA3= <user>
##$USERA4= <user>
##$USERA5= <user>
##$V9= 5
##$VALIST= <valist>
##$VCLIST= <CCCCCCCCCCCCCCC>
##$VD= 0
##$VDLIST= <DDDDDDDDDDDDDDD>
##$VPLIST= <PPPPPPPPPPPPPPP>
##$VTLIST= <TTTTTTTTTTTTTTT>
##$WBST= 1024
##$WBSW= 4
##$XGAIN= (0..3)
0 0 0 0 
##$XL= 0
##$YL= 0
##$YMAX_a= 94925
##$YMIN_a= -186969
##$ZGOPTNS= <>
##$ZL1= 120
##$ZL2= 120
##$ZL3= 120
##$ZL4= 120
##$ABSF1= 10
##$ABSF2= 0
##$ABSG= 5
##$ABSL= 3
##$ALPHA= 0
##$AQORDER= 0
##$ASSFAC= 0
##$ASSFACI= 0
##$ASSFACX= 0
##$ASSWID= 0
##$AUNMP= <proc_1d>
##$AZFE= 0.1
##$AZFW= 0.1
##$BCFW= 1
##$BC_mod= 2
##$BYTORDP= 1
##$COROFFS= 0
##$CY= 11.3945322036743
##$DATMOD= 1
##$DC= 2
##$DFILT= <>
##$DTYPP= 0
##$F1P= 2.36226072786647
##$F2P= -0.459571619588291
##$FCOR= 0.5
##$FTSIZE= 0
##$FT_mod= 4
##$GAMMA= 1
##$GB= 0.15
##$INTBC= 1
##$INTSCL= 1
##$ISEN= 128
##$LB= 0.24
##$LEV0= 0
##$LPBIN= 0
##$MAXI= 10000
##$MC2= 0
##$MEAN= 0
##$ME_mod= 0
##$MI= 1.114404
##$NCOEF= 0
##$NC_proc= 0
##$NLEV= 6
##$NOISF1= 3.799351
##$NOISF2= 2.8
##$NSP= 1
##$NTH_PI= 0
##$NZP= 0
##$OFFSET= 15.70392
##$PC= 1
##$PHC0= -14803.82
##$PHC1= 21.60082
##$PH_mod= 1
##$PKNL= yes
##$PPARMOD= 0
##$PSCAL= 0
##$PSIGN= 0
##$REVERSE= no
##$SF= 200.130013532006
##$SI= 16384
##$SIGF1= 3
##$SIGF2= 2
##$SINO= 400
##$SIOLD= 16384
##$SREGLST= <1H.CDCl3>
##$SSB= 0
##$STSI= 0
##$STSR= 0
##$SW_p= 3612.71676300578
##$SYMM= 0
##$S_DEV= 0
##$TDeff= 0
##$TDoff= 0
##$TI= <>
##$TILT= no
##$TM1= 0
##$TM2= 0
##$TOPLEV= 0
##$USERP1= <user>
##$USERP2= <user>
##$USERP3= <user>
##$USERP4= <user>
##$USERP5= <user>
##$WDW= 1
##$XDIM= 8192
##$YMAX_p= 0
##$YMIN_p= 0
$$ End of Bruker specific parameters
$$ ---------------------------------
##NTUPLES= NMR FID
##VAR_NAME=  TIME,          FID/REAL,        FID/IMAG
##SYMBOL=    X,             R,               I
##VAR_TYPE=  INDEPENDENT,   DEPENDENT,       DEPENDENT
##VAR_FORM=  AFFN,          ASDF,            ASDF
##VAR_DIM=   8192,          8192,            8192
##UNITS=     SECONDS,       ARBITRARY UNITS, ARBITRARY UNITS
##FACTOR=    0.0002768,     1,               1
##FIRST=     0,             0,               0
##LAST=      2.2672688,     0,               0
##MIN=       0,             -186969,         0
##MAX=       2.2672688,     94925,           0
$$ Real data points
##PAGE= N=1
##DATA TABLE= (X++(R..R)), XYDATA
$$ [...]
1765b6O3k63N02j38m07K41K87l51J39L70l68k39N85j70k84L08Lk89nJ72m99L5
1787c34J88j86k38O04k22l18L71M39n46J9K81j83pM19n0l42J3L18q0K15k4k35
1809A02J5L05m21k04L55K9p45M19M04l93l12N79n1l85K82J5l57O28k56m1N4K52
1831B74k72k26N67j83r3M14j92n27L08L26n41K52J22j65l31M30k61M2j80L61m07
1852b82P5K07j43k9L26k03j6K75n0k92J64K55l61L30j92l7K24J37k55j24K3J07
1874A39j59L2K72n73J27L18k99K8j00L40l96rK04j62J28J15j28p5K96J17n99L10
1896g4L31j84j43Q1P3j76K28N5l81L47O9n56K08K34m4j19L05l81LK66n09J15J56
1919i6O7q7r4P6j26J27J14K06k60L32J81o47K9N97n18j8M61m37l0J06K29j42n6
$$ plain form
1765 -26 37 -226 276 138 -269 -28 259 -92 47 417 49 -190 395 225 -59 249 252 -37 -42 130 -369 -334
1787 -334 -146 -332 -570 34 -188 -506 -135 304 -242 -223 58 -125 -132 287 237 -105 -92 226 146 361 337 102
1809 102 117 422 1 -203 152 181 -564 -145 259 -134 -446 133 82 -303 -21 -6 -363 265 9 -32 22 274
1831 274 2 -224 343 160 67 481 289 -238 70 396 -145 107 229 64 -267 163 -98 -56 -236 125 -282
1852 -282 -207 0 -143 -172 154 -49 -65 210 160 -132 32 287 -74 256 64 27 251 388 133 9 32 139
1874 139 -20 12 284 -289 -162 156 -143 -115 -215 125 -271 -280 -76 -238 -110 5 -123 -198 98 215 -384 -74
1896 -74 257 73 -70 11 84 -92 136 191 -190 157 226 -330 -122 112 68 -51 254 -127 -124 142 -367 -252 -96
1919 -96 -29 -116 -210 -134 -260 -133 -19 187 -73 259 440 -207 -178 419 -99 -117 344 -93 -123 -17 212 70 14
1942A4r0m3kJ94k14M0n2J75n49K30N34k89P8j53J58J87q6j24K38N8j00k67J45
1965H2K43m55K1N8K83j68M4k97J85K8j04j51L33J21k96m4L9J24k12Q5J65k65L70
1988A89m6k50Q7J24j64L45j3P3m5n0j64%J96j36m3j54K71M3l50J87j29Nl03JL6
2013b90J23RPN5K40l04j1M96j94l52K76K3LJ18p4m8K38J59o53l8K77Rj01R4j59
2038i7O6kK21m58L8P2K8J29Mj7r2J58Q4j4k05Rpm8L13o7j97L95n41J31M23j32
2064A94m61K65j8MQ0p8J40o8k3j43P6mq9p2K67l1j34R6j46J03k70kM25k92L31
2089A50l56J24J01M49l89J91l9l29l7J47jJ49m44K0J70j03J74l09l2K21L8K4J33
2112E2j26n1J7J88lJ80j82J80k18J44j2J78l76K42m32N7J65j94L73k28J6J03j49
$$ plain form
1942 14 -76 -119 -121 73 -141 -101 -153 22 -527 -297 237 -52 26 -127 31 218 132 8 246 304 204 -63 82
1965 82 325 -130 -109 -51 232 64 108 -189 -4 24 -80 -231 102 223 -73 -117 -78 46 -166 -81 84 -181 189
1988 189 143 -107 -20 104 -60 285 272 345 300 250 86 86 282 146 103 -51 220 263 -87 100 -29 -24 -327 -326 -290
2013 -290 -167 -158 -151 -96 144 -160 -171 325 131 -221 55 78 81 199 125 77 315 474 -179 -217 60 69 -32 62 -97
2038 -97 -31 -33 188 -270 -232 -160 -132 -3 1 -16 -108 50 134 120 -85 -76 -83 -131 182 115 -82 313 -228 -97 326 194
2064 194 -267 -2 -20 -16 64 -14 126 58 35 -108 -32 -36 -125 -197 70 39 -95 1 -145 -42 -312 -314 111 -181 150
2089 150 -206 -82 19 468 79 270 231 -98 -135 12 11 160 -284 -264 -94 -197 -23 -332 -364 -143 -105 -81 52
2112 52 -74 -125 -108 80 77 257 75 255 37 181 169 347 -29 213 -219 -162 3 -191 182 -46 -30 73 -76
2135g6m6P2j02jJ50j16K79k70J56R7j49M8j2R4k98L16J39k96O9KR5l25J07j23
2159a90J94j54J71lK8Q3k4k17l0J96j25n6j08J21O8J89k52o1K29l0P6k18K05p
2183H5K3o8K52k51K60j24j06J76k10j44K27k47K11k11K5J03k60K13K9k67MK11
2205f9j20O9J0M1O5K03l59K92j03m2Q1N4J77l77K22k79L06l23K70k14j9K46K2
2228A53l18K05j40J11l9J34k84n7M48m49K6R6J60r3J72J28l29Q3M30m28M8j58
2250a01n0L9K36J49l35J24R8j42R4k34J70j06j80K22j18L26j37k50P7K4m1K06
2272G1J80l27J32k48K11J76P4r7k54O3N3k7p8o3J98L7l83K34q7J37n1R8k54J45
2296f0J50l01M9K93k69L54Q0k81o5mJ34k11L16r6k7J01n4p8k10O1K76O5j68j62
$$ plain form
2135 -76 -122 -50 -152 -153 -3 -119 160 -110 46 143 -6 42 30 124 -174 142 281 -15 54 56 151 -174 -67 -190
2159 -190 4 -150 21 18 46 129 105 -112 -142 54 -71 -127 -235 -114 -46 143 -109 -170 59 29 105 -113 92 85
2183 85 108 40 292 41 301 177 71 247 37 -107 120 -127 84 -127 -102 1 -259 -46 -17 -284 -280 -69
2205 -69 -189 -120 -110 -69 -4 199 -160 132 29 -13 68 122 299 -78 144 -135 171 -152 118 -96 -115 131 153
2228 153 -165 40 -100 11 -28 106 -178 -235 213 -236 -210 -114 46 -47 125 253 -76 7 437 9 57 -101
2250 -101 -151 -112 124 273 -62 62 160 18 112 -122 48 -58 -238 -16 -134 192 55 -195 -118 -94 -135 71
2272 71 251 -76 56 -192 19 195 269 172 -82 -19 34 7 -71 -134 64 101 -282 -48 -135 2 -49 49 -205 -60
2296 -60 90 -211 -162 131 -138 216 296 15 -50 -54 80 -131 185 89 62 163 109 31 -179 -118 158 223 55 -107
2320a07J51k06L96l96N7J89l06M1K31j8j37O5j7L5rR3r3L3J25j14P9K82j29j27
2344A18J5k11j3%K26j30m5j46J03O1J27m9o5j61J86l9m5Q9j81J99Np8j52N15o2
2369B67j14j65J79k32J64l02J85j78R7Q9L6k0R8k52R5L7Q5j55K31j91j24L3J96
2392E9l56K52J58j24R2OJ18k4r3Jk61K85K1j57j2J17J86j88k9J82j99N4m2Q9k69
2417a34J69l08K12R2J54m50L34j48m0R2J39k53K84J7l36J31OJ16OK5L0j19Kj36
2441a15J08pq9j06L86k11J04p7J00k44m4J49J45j37k76Q1L56q9k41L69k80L03
2463A85P5p4j55J09q6q5Nr4R4j52Q4L8J6K14o6k40K56j37j96K71M0L0J62l59l7
2488a02O0J99k11p1J1P0j5J9J2j5P7r0K33k53j4J45j28k39K21j71J80JL87n90
$$ plain form
2320 -107 44 -162 234 -162 -105 84 -222 -181 50 32 -105 -40 -57 -22 -31 62 -31 2 127 13 92 374 245 118
2344 118 133 -78 -91 -91 135 5 -40 -186 -83 -22 105 56 -9 -170 16 -23 -68 21 -160 39 44 -34 -186 329 267
2369 267 153 -12 167 -65 99 -203 -18 -196 -99 -10 26 6 104 -148 -53 -16 69 -86 145 -46 -170 -137 59
2392 59 -297 -45 113 -11 81 87 205 181 88 89 -172 113 134 -23 -35 82 268 80 51 233 34 88 46 135 -134
2417 -134 35 -273 -61 31 185 -265 69 -79 -119 -27 112 -141 143 160 -176 -45 -39 77 83 108 138 19 21 -115
2441 -115 -7 -14 -103 -209 177 -34 70 -7 93 -151 -195 -46 99 -38 -314 -233 123 34 -207 162 -118 185
2463 185 260 186 31 140 54 -31 -26 -120 -26 -178 -94 -56 -40 174 108 -132 124 -13 -209 62 102 132 294 -65 -102
2488 -102 -42 157 -54 -125 -114 -44 -59 -40 -28 -43 34 -56 177 -76 -90 55 -73 -312 -91 -262 -82 -81 306 -284
2512b84K83L9j04J01P4j14L7j62J48k86L27P1k37M09k06o5M4n2k26L44j37nL6
2535C5J19n1k95J15n7j88L17j30M5j61Q7M2j07N39l45R9J28j76K10k54J97j58
2557A1j06J68j35K2k41M06r6P9k35j5K23j23P3k23M76l59J31j7J7k0l8k2O0k02
2581a66n7K43j65QK16l95L91p2J37Op1j53j23L94Mk40P5L5k58M60k14K91l49q1
2605h4L36k23j07K21o7nK09j87%j2r6k2L3J1j17L0q4j17K76J33l68J82O1O3M0
2630A06Kk42J36r4P4K01J6q3K3j96m8R7j46Q4J10j17Q6K22m09K12K22n67M06m3
2654E2j14l5J67J50p1l06K18m3p9J35Oj9M3l27K46J10j4k25j6L45k38j0J80j59
2678dj98J60P4L0N9k15j9J39r4j42M05nk70j7M7M09l86k0J46n1l6J6l04M10l09
$$ plain form
2512 -284 -1 38 -66 35 109 -5 32 -130 18 -268 59 130 -107 302 96 31 75 23 -203 141 4 -1 35
2535 35 154 103 -192 -77 -134 -322 -5 -135 -90 -251 -164 -122 -229 310 -35 64 192 16 226 -28 169 11
2557 11 -95 73 -62 -40 -281 125 29 108 -127 -142 81 -42 31 -192 284 -75 56 39 56 36 -2 -24 36 -166
2581 -166 -223 20 -145 -137 79 -316 75 3 140 146 75 -78 -201 193 197 -43 32 67 -191 269 55 346 -3 -84
2605 -84 252 29 -78 143 76 71 280 93 93 81 -15 -37 -4 7 -110 -80 -164 -281 -5 128 -240 -58 3 66 106
2630 106 108 -134 2 -92 -18 183 199 116 139 -57 -105 -8 -154 -70 40 -77 9 231 -178 34 256 -311 95 52
2654 52 -62 -97 70 220 149 -157 61 18 -61 74 80 61 104 -223 23 133 119 -106 -122 223 -15 -25 155 -4
2678 -4 -202 -42 32 62 121 -94 -113 26 -68 -210 195 190 -80 -97 -50 359 -27 -47 99 48 12 28 -276 134 -175
2703a75K44p7j53K2k2J01J75j91n5J5J14mj35M3O2j55L67k44P8j65K04J6j1J4
2727F8j09R6l09K59k8Q7L3J70l56K68k02N0j11q8K36l9%l3j56J43M7Rr7M8M1J05
2753A32j45J54j14l5j55K43j39mK2j1J8N7j8j91J03q4l8L45k40k7Q7J64k44L4
2777h6P7J14m7k10K11j64L0J36R7m4N2l77J87j80K06j66N19l59QJ23j51K5J97
2800A98k81L6m9Q5o5j0j64K44m7J01Mk21J28o0M09k13j5k24N7J11J7P4J51n13
2824b47K75M0j81K16j81J81j17k6N9K94k34lm79L92j21l5n3K51q2J6J29J04j94
2847Dk2or5Q6q7j26M85l78K10p2q1lL8J84j46m7L9r3L0qk06K59K02l04J96K9j7
2874G1N5k00J75k28J14j02K2K7J79l44J63J14q1mo2J67j21pP3O5R8p8k53K5n1
$$ plain form
2703 -175 69 -8 -161 -139 -161 -60 115 -76 -131 -116 -2 -6 -141 -98 -36 -191 176 -68 10 -155 49 65 54 68
2727 68 -41 55 -254 5 -23 64 97 267 -89 179 -23 27 -84 -172 64 25 25 -8 -164 -21 26 35 -62 -14 27 132
2753 132 -13 141 27 -8 -163 80 -59 -63 -41 -52 -34 23 5 -186 -83 -167 -205 140 -100 -127 -40 124 -120 -86
2777 -86 -9 105 58 -152 59 -105 -75 61 158 114 166 -211 -24 -204 2 -164 355 -4 4 127 -24 1 198
2800 198 -83 -47 -96 -11 -76 -86 -250 -6 -53 48 52 -169 -41 -101 308 95 80 -144 -87 24 41 115 266 -247
2824 -247 28 68 -113 103 -78 103 -14 -40 19 313 79 76 -403 -11 -132 -167 -220 31 -51 -35 94 198 4
2847 4 -18 -24 -119 -33 -120 -246 239 -139 71 -1 -82 -85 -47 137 -9 -56 -17 -110 -80 -88 -294 -35 167 -137 59 88 71
2874 71 126 -74 101 -127 -13 -115 -93 -66 113 -231 -68 46 -35 -39 -101 66 -55 -62 11 76 174 96 -157 -132 -183
2899a83L65m68L20j74NN09l83m7j32K38k39L9J15J45l37J83j22R7O9K8k90K53
2921iR6j42J07L8k38K23P5J44m56O1Q0P9L1Nk1p6J03k48J78j88L33n1O9J13k72
2946C4O8NJ25J8k14k30J83M5N6q3k7R1m9k9J61j04j81J35o2K73k71p9J59J15k48
2971a09m0l3Q4K31l32K11Q1K6n8Q0j04j09J5L42j30p1J75m3j18K4k80K40K05l20
2995c3L7M7j03PK2m3N8n7J17j32o5L45k21j20K7K59l5%l25K15K15k08k0J1P0J22
3021A90p6o2j10m2J7K6M0j21p6K80N6n6o2%Q9O2k49M8k0L03j06j07j15l0J33j44
3047a32K20k23j63K04L8k82L48l53N85j86m9j84K25K01m26N3K05j97K11m8P8k80
3069a55j47N19j81j00K12k73K54j17J51l30L56k6P1k85L16j57k11qK38J18k96
$$ plain form
2899 -183 182 -286 34 -140 -135 374 -9 -56 -188 50 -189 -150 -35 110 -227 -44 -166 -69 0 28 -262 -9
2921 -9 87 -55 52 90 -148 75 150 294 -162 -101 -21 58 89 94 73 -3 100 -148 30 -158 175 124 193 306 34
2946 34 102 107 232 250 36 -194 -11 34 90 7 -20 71 22 -7 154 50 -131 4 -58 215 -56 -135 24 139 -109
2971 -109 -149 -182 -98 133 -199 12 93 119 61 141 37 -72 -57 285 155 84 259 216 98 122 -158 82 287 -33
2995 -33 4 51 -52 -45 -23 -66 -8 -65 52 -80 -145 200 -21 -141 -114 145 110 110 -215 0 215 7 -13 -2 68 190
3021 190 114 52 -58 -100 -83 -57 -17 -138 -214 66 122 66 4 4 93 155 -94 -46 -66 237 131 24 -91 -121 12 -132
3047 -132 88 -135 -298 -94 -56 -338 10 -343 242 56 7 -177 48 249 -177 -124 81 -116 95 47 125 -155
3069 -155 -302 217 36 -64 148 -125 129 12 163 -167 189 163 234 -51 265 108 -103 -111 127 245 -51
3090e1K6k23L85j33L4J33k08k08K61J1k88J78K56k03K40J4k93J65j7p1m8j35Q6
3113h9O9J68j02J60p0j18J91m4j91J74k44k1K31m6J29k08nM1k02K09J79j95Q5
3136A01j17n4J89l55K40K3J77k23r9J92K5j51j3j17L7m5O2K9K27j45k5J9N8j26
3160i1j33J18J62P9q8l1J41k13J63m45M10J4J40l58P2l80M08M8q0J53j43N4j05
3183a05PK23Q5k24P9P2Lj71O2l39N35l87J72K23k71J33K07l78j6J58q1q7J66R1
3207A57k4j10j58J56j94J03R2K5m0j67K86k9k77J05N8oj95J53O7j89L66p5j46
3230d2oq5r3KL70jk0j79J90j92J77K30l80K24M9k39k07K56j80J80m0N7l12J30
3254a11L17j14p7J01j30j06P7j22J12j09K66k91L12j45j38M13k46j08J91Q7m5
$$ plain form
3090 -51 -25 -248 137 4 38 171 -37 -245 16 27 -261 -83 173 -30 210 224 -69 96 79 8 -40 -175 -89
3113 -89 -20 148 46 206 136 18 209 165 -26 148 -96 -117 114 68 197 -11 -16 25 -177 32 211 16 101
3136 101 -16 -70 119 -236 4 27 204 -19 -118 74 99 -52 -65 -182 -145 -190 -128 -99 128 -17 -42 -23 35 -91
3160 -91 -224 -106 56 135 47 16 157 -56 107 -338 72 86 226 -132 -60 -440 -32 16 -64 89 -54 0 -105
3183 -105 -98 125 210 -14 65 137 140 -31 31 -308 227 -160 12 235 -36 97 304 -74 -90 68 -13 -100 66 157
3207 157 133 23 -135 21 -173 -70 22 47 7 -160 126 97 -180 -75 -17 -23 -218 -65 2 -187 179 104 -42
3230 -42 -48 -133 -226 -224 146 145 125 -54 136 -56 121 351 -29 195 244 5 -202 54 -126 54 14 71 -241 -111
3254 -111 206 92 15 116 -14 -120 -43 -165 -53 -162 104 -187 125 -20 -158 255 9 -99 92 179 134
3275A34j93k5P0M8J80k87N0O7P5l03K31j50K13J14j3j65O2q2k60L09m5J27J3l20
3299a50K55O9K3j97o3j74L62K7K4j65J65m59O28l86L0KL0m3m5n1J52j75PJ4J60
3324D0J58j13k71K44n1Q7k35J94l2J87n78L74J43j90q8q8J54K9j31J65j10r2K50
3347D6j56L31k10p7n5Q7j52J43P0J47O0l31J76l04L54k9o4k7k38J55K21p0l30
3370b53J68Q4j76K13r0J9j42K03J08j55j5j0K14k54K80m09K67J70m00J25J87j46
3392a2j39O8N0R5n1pO7j60P7l0J3p0n8J63p8J4K1j9J78l90L23J27l58O9J72M1
3418A06q0l5J18j54L14k25o7oJ38k0k18L42j77q9J78k47J5R0J53KJ1k3j89N4n4
3443f3J55oq2K10k02j23L29l82K86j81O1K62m5j7j75k6J34j82J01j69L24l16j5
$$ plain form
3275 134 -59 -84 -14 34 214 -73 -23 44 119 -184 47 -103 110 224 211 46 108 26 -234 75 30 157 170 -150
3299 -150 105 174 197 0 -63 -237 125 152 176 11 176 -283 345 -41 -11 -9 21 -22 -67 -118 34 -141 -134 -120 40
3324 40 198 85 -186 58 7 94 -141 53 21 208 -370 4 147 -43 -131 -219 -65 -36 -167 -2 -112 -204 46
3347 46 -110 221 11 -66 -121 -34 -186 -43 27 174 234 -97 79 -225 129 100 36 9 -229 -74 147 77 -253
3370 -253 -85 -1 -177 36 -54 -35 -177 26 134 -21 -36 -46 168 -86 194 -215 52 222 -178 -53 134 -12
3392 -12 -151 -83 -33 62 11 4 71 -89 -12 -42 -29 -99 -157 6 -72 -58 -37 -56 122 -268 55 182 -176 -107 65 106
3418 106 26 -9 109 -45 269 44 -23 -29 109 89 -129 213 36 -53 125 -122 -107 -17 136 138 149 126 -63 -9 -63
3443 -63 92 86 4 214 12 -111 218 -164 122 -59 2 264 219 202 27 1 135 -47 54 -115 209 -107 -122
3466a22J57j03j89lJ04r5L85o5l76L19J93m53L48k05R6N1O7L9q5L8K0l22J50L0
3490b1k89K51K02j32K08j81l9o4j16L64m13J04J91l06K11R6j39J63l6K2j79o1
3512a64L83m6k59K60j76j08J74j79j01L04l6p7L6j01J2K52k53J51q9j23R5R2k25
3535a78K09j01Q2J7R0j82Q0q9O2K2j06o4Q5K88l73M07n66L53j19K1J0o4L33L3
3559B50l46R7K25m23J05M7J84m11L68j96j7K32j14p0J58J95m00M9K77r7l2pR0
3582A64r9J4Q8J98k55j74o5R3Q8j30q3K33M3l64K76p5R9m0j2%o8j21K54Q6K25
3607C75k49q8l5J59r1k31Q5J13r0N0K15k66J75K0p2k93L95m2m23K79K25l95L91
3630B07l17O1j2L46l27J05p0P3N6k14K54J12l86nl6k37L34M7l4r0J18k23J27J25
$$ plain form
3466 -122 35 -68 -257 -260 -156 -251 134 69 -307 12 205 -248 100 -105 -9 42 109 148 63 101 121 -201 -51 -21
3490 -21 -310 -59 143 11 219 38 -1 -65 -181 183 -230 -126 65 -241 -30 66 -73 90 54 76 -103 -164
3512 -164 219 173 -86 174 -2 -110 64 -115 -216 88 52 -25 11 -90 -78 174 -79 72 -17 -140 -45 47 -178
3535 -178 31 -70 12 29 119 -63 17 -72 -10 12 -94 -158 -73 215 -158 249 -317 36 -83 -62 -52 -116 217 250
3559 250 -96 1 226 -197 -92 -45 139 -272 96 -100 -117 115 1 -69 89 284 -116 -67 210 113 81 74 164
3582 164 65 79 167 365 110 -64 -129 -36 52 -78 -161 72 115 -249 27 -48 51 11 -1 -1 -69 -190 64 150 375
3607 375 126 38 3 162 71 -160 -75 38 -52 -2 213 -53 122 142 70 -223 172 130 -293 -14 211 -184 207
3630 207 -110 -49 -61 285 -42 63 -7 66 122 -92 162 274 -112 -117 -153 -390 -56 -9 -43 -133 -15 -238 -111 14
3654A4j12J35QJ26j34o2m0Q9j19K79j47j15L61k50j77J73J04J04k15N2j00M3j05
3677h8K94j06K17j65j90l7p0M5J18J13k91O0n0J20j81K22L0k15Q2K01q5J8J19
3700A61j00J19j74j7p4J5L47k87J50j08j6P5j60K79k06j25J22o5K63j94j74l1
3722b00K99k67m7R8Q6j34O1K64k59K44j19j3o7j70J41K0K32M9n80M26K1Rj44L31
3746B81k97L1qOJ56k01P9o5k07L36o5j82K71k4l58OL27J00j64m6J50P0j49L29
3770C76n04M0K4m3L35l46K24n4o2j34QK76j92j0k3L32m45P4P1j26R8N7Mj44J94
3795C0jk1k0J39J63k35L4p9M1L8K27l34K74m27J18O1M5q1K91m14Q4L4J83n1l24
3820b25L70k69r0K71L43k26k1%j76j80L36J28l66j15L40k86J55J82n6P3j61j51
$$ plain form
3654 14 -98 37 45 171 37 -25 -65 24 -95 184 37 -78 283 33 -144 29 133 237 22 74 -26 17 -88
3677 -88 206 100 317 152 -38 -75 -145 -100 18 131 -160 -100 -150 -30 -211 11 41 -174 -92 109 24 42 161
3700 161 61 180 6 -11 -85 -70 277 -10 140 32 16 91 -69 210 4 -121 1 -64 199 5 -169 -200
3722 -200 99 -168 -215 -117 -31 -165 -104 160 -99 145 26 13 -54 -224 -83 -63 169 218 -362 64 85 94 -50 281
3746 281 -16 15 7 13 169 -32 47 -18 -225 111 46 -136 135 111 -247 -241 86 186 22 -24 126 196 47 376
3770 376 -128 -88 -64 -107 228 -118 106 52 -10 -144 -136 140 -52 -62 -85 247 -198 -124 -53 -179 -81 -24 -20 -164 30
3795 30 29 8 -12 127 290 55 89 10 51 89 316 -18 256 -171 -53 8 53 -28 263 -151 -67 -33 150 99 -225
3820 -225 145 -124 -214 57 400 174 153 153 -23 -203 133 261 -105 -220 120 -166 -11 171 115 188 27 -124
3842a24J67J05k28J1J35P5Q1j18OJ06j69j35J85m6k10L49p5j17J79P4n61L45M2
3865G7r9J22j55K48j60j65J82k71K27l60L42O2j66J01J50j94J51j48J37O8p3J78
3887B54j77O6k25N0K17K2j18J05k40K36r9m88M71m78L11L46m15L81m18J86N9J31
3909A77l28Q5j87M00p8k6K0J06l10j34L45n6j9l5r5K80K6k23M0K03p8r3q4J61
3933I7o5j12N10l84K27l18n7K5K08M0m7j68J30r6j89O1J68j37O0j65O8J45R4j02
3957gO4qj91L85j82k93K74j08MJ52j63J02J11j54r6L6J41o3k11K78o5p9L1O5j06
3982h3o1J90O8l3k91O9J36r5J66J69k52n9L7J10K09l78J5p6L50k06j35J00j54
4005b04L41k39L18j87M9j54j25J32L0J58j67J8J94j57KJ50j9n5J7m6q2J03l72
$$ plain form
3842 -124 43 148 -80 -69 66 141 222 104 110 216 47 -88 97 51 -159 190 115 -2 177 251 -310 35 77
3865 77 -22 100 -55 193 33 -132 50 -221 6 -354 -12 50 -116 -15 135 -59 92 -56 81 149 76 254
3887 254 77 143 -82 -32 185 207 89 194 -46 190 91 -397 74 -404 -93 253 -162 219 -199 -13 46 177
3909 177 -151 -66 -253 147 69 43 63 169 -141 -275 70 14 -5 -40 -135 145 171 -52 -12 191 113 20 -64 97
3933 97 32 -80 430 46 273 -45 -102 -77 131 171 124 -44 86 -10 -199 -138 30 -107 -47 -212 -144 1 95 -7
3957 -7 57 49 -142 243 61 -232 42 -66 -62 90 -73 29 140 -14 -110 -74 67 4 -207 71 6 -73 -42 23 -83
3982 -83 -144 46 114 81 -210 -141 -5 -100 66 235 -17 -76 -39 71 280 -98 -83 -159 191 -15 -150 -50 -204
4005 -204 137 -102 216 29 78 -76 -201 -69 -39 119 -48 -30 164 7 9 159 140 85 102 56 -26 77 -295
4028b95M45r7o3j2K11l29P5j8rk18P0J25K24R5l84n0J74R7P6n6j20J14J19j52
4052B2M9L7r1J19L4l93J74K32k76J74l22M60p0k45M0%k94M10j25O7K18k90j13
4075a83K36Q0m58M89l5Q4M5p6j05p5p4R1n0j28K37p9l5j5N5k78J64J63M1r9Mj45
4101a46J63L1j80J76J16j35Q8k96J80J01l3O%J97j05J57k75J27k67JK61j90K1
4124bj81N8R3J03k36m3J6N48m68K06k97J84J2j47J94k40P5J69kk32L09l5k76J59
4148c3J17j43J42L3J7m27J50J35l04L57q4j88L73j57k91L00J66k44q4N9k3J11
4170a8J63n2j93K4L9k4n9K00o7J12l2J11l48R8K64k37K81k14J29l34K06P2j60
4193c9j26M3j0J45j55J66j00K24p8J34j47j44J12p9J68j44K16j28k5M1l31M36
$$ plain form
4028 -295 150 53 -10 -22 189 -140 -65 -83 -92 -310 -240 -115 109 204 -180 -230 -56 41 117 61 -59 55 174 22
4052 22 71 108 17 136 170 -223 -49 183 -93 81 -241 219 149 -96 -56 -56 -350 60 -65 2 220 -70 -183
4075 -183 53 133 -325 164 129 213 258 182 77 2 -72 19 -31 -159 78 -1 -36 -51 4 -274 -110 53 94 -5 -1 -146
4101 -146 17 48 -132 44 160 25 113 -183 -3 98 65 71 71 268 163 320 45 172 -95 -94 167 -23 -2
4124 -2 -183 -125 -32 71 -165 -208 -192 356 -112 94 -203 -19 -7 -154 40 -200 -125 44 42 -190 119 84 -192 -33
4148 -33 84 -59 83 116 133 -294 -144 -9 -313 44 -40 -228 145 -12 -303 -3 163 -81 -165 -106 -129 -18
4170 -18 145 93 -100 -76 -37 -61 -120 80 13 125 93 204 -144 -46 218 -19 262 48 177 -157 49 121 -39
4193 -39 -165 -122 -132 13 -142 24 -76 148 70 204 57 -87 25 -54 114 -30 186 58 33 74 -257 179
4215A79k94K19K0p0j41L17m40J97n8L03j97j26R5j55K22j45N2r9K76j1m11K86
4237A9J71k95J27J67k96J40M0R4l41J50k31K33J5k4r7j97M30m0J13j90m8O3r0
4260h7O2k63K95N4J45l77j19K32k5J19j52K0k5L94k27j09J46l9L2j68K47l1K5
4283A49k00j50J69J22j83l5J77l40M6K41Qp2J67R5l72M1K29j83j56K33P8j28J87
4306A23j32m4K54l9K1j76J32k91o1M5q9J74QK77j83j40r1J66j88L40J51k07j31
4329h1K4L6p6J31j66J15J60j73J83m6k84L64l9qn02K71O4j40R8q9J55m5N5r7J32
4354D2j33m7K85k10mJ62j04l21L44n8K8L87l75j08Q1J79r2Q8P8j36N4q9j77M5
4378h1r7M7J55kJ19l06J85p5k5nJ56j90J92J6J80l13J7J72J81l08r6J85J9q3j99
$$ plain form
4215 179 -115 104 124 54 -87 230 -210 -13 -71 232 35 -91 4 -151 71 -74 -22 -121 155 144 -267 19
4237 19 190 -105 22 189 -107 33 73 167 -174 -24 -255 -22 -7 -31 -128 -325 105 65 178 -12 -60 3 -87
4260 -87 -25 -288 7 61 206 -171 -290 -58 -83 36 -116 -96 -121 273 46 -63 83 44 76 -92 155 124 149
4283 149 -51 -201 -32 90 -93 -128 49 -291 -245 -4 4 -68 99 194 -178 -137 92 -91 -247 -14 64 -64 123
4306 123 -9 -53 201 162 183 7 139 -152 -213 -168 -257 -83 -75 202 19 -121 -212 -46 -234 106 257 50 -81
4329 -81 -57 -21 -97 34 -132 -17 143 -30 153 107 -177 187 148 140 -362 -91 -27 -167 -69 -158 -3 -48 7 -90 42
4354 42 -91 -138 147 -63 -67 95 -9 -330 14 -44 -16 371 -4 -112 -31 148 56 144 222 86 140 51 -126 -81
4378 -81 -178 -131 24 22 141 -165 20 -55 -80 -85 71 -119 73 89 269 -44 -27 145 326 18 -78 107 126 43 -156
4403a56J68M21l30l45L54k44K1q7Q1K63j98n2LJ37J28k99J45j81J93O6r3K96k13
4426G8q9K96l07j60J30L16Oo36M77m3j52%k12K87J92n19N09R0l64o2K31q1K7L4
4450D8K6P0j79Q5Q5m1j45K03l96J90Q7L8j33q6N3l7J73K70j74m8L1k5l81K87M1
4475D2k22M16l13J63J88m34K7K30k1k85J27P1O3K6J5q9j24N30m32J31p0l17J36
4498a42K08J65k38P9j99K01j01j43K13k27J00p8k9l0M9Q2J38n5J64k97K95j83
4520b8k04M17J4j64k69M65k09R3j96K01p1q7R2n6j44O5J43N6k19J51l95L00n5
4543a00K46j90P4j73J94L5j29K21m20K71Q1k70N3J33q1J65q2k1oo2J40l49L79
4566A09JM4j92j81J79j40K19q7K51l55J2J96j35K67j46pj20J00M6j22q1J92j79
$$ plain form
4403 -156 12 433 103 -242 112 -132 -111 -198 -117 146 -52 -104 -101 36 164 -135 10 -171 22 88 -5 291 78
4426 78 -11 285 -22 -182 -52 264 270 -366 111 68 -84 -84 -296 -9 183 -336 173 263 -101 -163 68 -13 14 48
4450 48 74 144 -35 50 135 94 -51 152 -244 -54 33 71 -62 -148 -95 -132 41 311 137 89 120 95 -286 1 42
4475 42 -180 236 -77 86 274 -160 -133 97 76 -209 -82 -11 52 78 93 4 -120 410 -22 109 39 -278 -142
4498 -142 66 231 -7 72 -127 74 -27 -170 43 -184 -84 -162 -191 -221 -172 -90 48 -7 157 -140 155 -28
4520 -28 -232 185 199 35 -234 231 22 115 -81 120 49 -38 54 -2 -146 -81 62 118 -101 50 -345 -45 -100
4543 -100 146 -44 30 -143 51 86 -43 178 -242 29 110 -160 -107 26 -55 110 28 7 1 -61 79 -270 109
4566 109 110 154 -38 -219 -40 -180 39 -48 203 -152 -140 56 -79 188 42 35 -85 15 61 -61 -142 50 -129
4589a29N1mK86m12M02j03q7J32P6j86nQ3m67J94K00k96L98k9j18j26k3J84L3j29
4613g5R1O8k81O31j16l16r6J82o0P2j24m5P1O1J72k64J14n1j54K27j44p6P9J10
4637G6j47N2Q6n2j41j92K23J32j32j07L46M4j16K25p05K95Q5J06k78L79j42o4
4659b7K24J25l01M3j17p0K9o7N3k1M5L04m74J19L99k97J09j59j5J60k53K31p0
4682c0j65M79n14L52j02ml1K02j79P8K6m0j66L10j58l33L98j44j81J52jq9K14
4705G4P5n8l77K85k26J35J7o7K10o3J24j58l6J47O4j89Q5K28m12j6K66j0l33L78
4729A43j19q2M9K4O8L8p7j73L33k40j02o1L85j35J9L63j82k42Q8j18l8J58k3N
4753H1J31r3L13l31J0K2q6l8J52l49k1K76m35K98J41j08o8J23J00j30kJ88j51
$$ plain form
4589 -129 -78 -82 204 -208 194 91 4 136 212 26 21 104 -363 -169 31 -265 133 104 -14 -140 -163 21 54 -75
4613 -75 16 84 -197 434 318 2 -94 88 28 100 -24 -69 2 63 235 -29 85 34 -120 107 -37 -113 -34 76
4637 76 -71 -19 67 15 -126 -318 -95 37 -95 -202 144 188 72 297 -408 -113 -28 78 -200 179 37 -27
4659 -27 197 322 21 64 -53 -123 -94 -161 -108 -129 -84 220 -254 -135 264 -33 76 -83 -98 62 -191 40 -30
4682 -30 -195 284 -230 122 20 16 -15 187 8 86 112 72 -94 216 58 -275 123 -21 -202 -50 -51 -140 74
4705 74 149 91 -286 -1 -227 -92 -75 -142 68 5 129 -29 -65 82 146 -43 42 270 -142 -158 108 98 -235 143
4729 143 24 -58 -9 15 83 121 44 -129 204 -36 -138 -199 186 51 70 433 251 9 97 -21 -59 99 76 81
4753 81 212 119 432 101 111 133 47 9 161 -188 -209 67 -368 -70 71 -37 -105 18 118 -12 -14 174 23
4776B3n1M2K8O3p2J62Pj13O6j51n7J42l6J17p9n9j97K20M1M9l45L3k00K19j34
4801b82R9M5K75%j68j89N25n7m47K94q8R3n5L81l60k15J61P3k95K64k5l6OR2j29
4826c8J33n0j0M9j80J57l05N79l23L39l54J43P5j02j2l3J21k35Q6l7j66K16K5
4849G8k03J42j79l7L14L0k22O5j4P8k01Q5n1rK96n47J21M29n3j28K20k82J83j12
4873Cj6J79k43K00o0l31L78j65Q7mk4j80OJ43qr9Q2K06j74j85R1j40J62j8K32
4898A22k34K09j13j47K58R4J52k06p4rr0J21J90m41K04k33L57j81K19j9l01J36
4920A4j13J54n9J56l18K87j43l4J51j00R5m9N2M7j12j4n8m2J76l8j34n3L03j51
4944A7j9J54j77j79M15l29qL69m19N8j12K82j70K4mL06m23J65M8N5m5R3j10q0
$$ plain form
4776 23 -28 14 42 105 33 195 202 89 155 4 -53 89 53 170 91 32 -165 55 96 145 -200 -167 -367 -148 -282
4801 -282 -183 -138 137 137 -31 -220 305 248 -199 95 7 100 45 426 66 -149 12 85 -210 54 29 -7 -1 91 -38
4826 -38 95 45 35 84 -96 61 -244 335 12 351 -3 140 215 113 101 68 189 -46 40 3 -163 53 78
4849 78 -125 17 -162 -199 115 145 -77 -12 -26 52 -149 -64 -115 -124 172 -375 -254 175 122 -6 214 -68 115 3
4873 3 -13 166 -77 123 63 -268 110 -55 32 28 4 -176 -170 -27 -35 -134 -52 154 -20 -205 -114 -254 -92 -110 122
4898 122 -112 97 -16 -163 95 189 341 135 61 52 -38 83 273 -168 36 -197 160 -21 198 179 -122 14
4920 14 -99 55 -4 152 -166 121 -22 -56 95 -5 90 41 93 140 28 14 -44 -86 90 52 -82 -135 168 17
4944 17 -2 152 -25 -204 211 -118 -126 243 -176 -118 -230 52 -118 -94 -98 208 -215 -50 -2 53 8 101 -9 -89
4968h9L12k78K7R4J3k40o3K35k04k06M27m5J35o2p7l39L71J93k6l31J91r6J26
4991F8r0j96N6K20j2r4j98J63R0mJ6J12k37Q3K42k86j82L87Nm8n7j89r1J07J33
5016bk09K50l8p8O8K47j46l8m5J0P6j28J38r4K70rk83mM18k83k45J46m1j82L22
5041A20J12k73j58J76J05p1J14M4k82P8K3n6L0J10p0%N3J1r0J24j63Q0k2j02M62
5066C55l58r3L0N2Q5k09K16k58K64o9K5n9q5J0R0J40j67L3j58P2mJ87j72R3j43
5091a23J24j27J61K89k65o7J20j7l08K38M7j67L39j52J26j76k4L9m03L22J00j65
5113h9j01M04j01j96J39o6N1q3K30j62o5J38j36K30k67K24L3j78K55j96j45O2
5135a9j12QK43k38P1J03k77J38k2J38j81K04k30J9J39k03L93m7l51J48k1R9J84
$$ plain form
4968 -89 223 -55 -28 66 79 -161 -224 11 -193 -399 28 -17 118 56 -21 -360 11 204 178 -153 38 -58 68
4991 68 -22 -218 -162 58 46 -48 -246 -83 7 3 19 131 -106 -23 219 -67 -249 138 143 95 38 -151 -242 -135 -2
5016 -2 -211 39 1 -77 -9 238 92 54 9 19 95 -33 105 11 281 272 -11 -15 403 120 -125 21 -20 -202 120
5041 120 232 -41 -199 -23 82 11 125 169 -113 -35 -12 -68 -38 72 2 2 55 66 -24 100 -63 17 -5 -107 355
5066 355 -3 -96 -66 -14 71 -138 78 -180 84 15 40 -19 -104 -94 -4 136 -31 2 -156 -84 -88 99 -73 20 -123
5091 -123 1 -126 35 324 59 -8 112 95 -213 25 72 -95 244 92 218 42 18 57 -346 -24 76 -89
5113 -89 -190 214 113 -83 56 -10 41 -42 188 26 -39 99 -37 193 -74 150 183 5 260 64 -81 -19
5135 -19 -131 -123 120 -118 -47 56 -221 -83 -105 33 -148 56 -174 -155 -16 -219 174 127 -224 -76 -97 2 186
5158A86k13L17p7k39J38OJJ16l08K5q0K10j19M1j22J19j47J94N7k17J67j75j08
5181b28K63m8OJ12J03l35J59j41K6K19Pj59m1J59k02J35L9J8k69J2O6m2R4k1j93
5206b61K20M7j45J82J9j46R3O1L7l01J52L24j14l03M06j58Q2j07n7j97J95J03
5228A32j97Q5P6j90J3J60j37K3j20K41l28K42j16J48p1K87l83l4L16J9o4p7P9
5251A04j31p3K68k70P9J62j52k3K09l01O3J88n3L6k74Q8J32j85L10j43l8r1J50
5274E5m6RJ42k19J21Oj64q0J89r4K68p9J4R1r4n4j06J75k45R8lK7k2r4k34K47
5300i2j95M04n3j66R9k58J83j49K44O2j00M81n50J58l34P09l87j81K67k8k39j20
5322b45L25J6j75J04j46O8p3K13j15j1p8J89o7J39k13J51j59J29k49J08M2j64
$$ plain form
5158 186 -27 290 213 -26 112 118 119 235 -73 -48 -128 82 -37 4 -118 1 -146 48 105 -112 55 -120 -228
5181 -228 35 -13 -7 105 208 -127 32 -109 -83 136 143 -16 -57 102 -100 35 74 92 -177 -165 -99 -141 -47 -68 -261
5206 -261 -41 6 -139 43 62 -84 9 70 107 -194 -42 282 168 -135 271 113 195 88 31 -166 29 132
5228 132 -65 20 96 -94 -81 79 -58 -35 -155 86 -242 0 -116 32 -39 248 -135 -169 147 166 102 25 104
5251 104 -27 -100 168 -102 -23 139 -13 -36 173 -128 -65 123 70 106 -168 -80 52 -133 177 34 -4 -95 55
5274 55 9 18 160 -59 62 68 -96 -176 13 -81 187 108 122 213 119 65 -41 134 -111 -13 -16 11 -11 -105 -339 -92
5300 -92 -287 117 64 -102 -3 -261 -78 -227 17 79 -21 460 -90 68 -266 443 56 -125 142 114 -125 -245
5322 -245 80 96 -79 25 -121 -53 -126 87 -28 -39 -117 72 5 144 -69 82 -77 52 -197 -89 -47 -211
5344b11L02J31j98J24O2p8M6l29K60k86Q5J32n7K41j83O4j84K01r1j09J33J51
5366B06j65j47j74L17j82K16o0N0J17k17L6j35K12k03P4J34m16K84K75J2m10K83
5388A07J73n76R8M18m62j33L25l9j23L39k86j79L24Q6K25k56j4lo4L04k11lJ14
5411A64k3k09k20M41l11K25M6K25l46m1J69j42J19l37L65k00L0j34J90k46J49
5432h6Q0k40J16K84J56j45j63j22J34n4J55k42M5J94j20J28j67K43k74J88K1o0
5454G1n8k25K94k0j19O3J1n4j02K44j43P2j00J42j14J80m5m3jKk10K02j75K46
5478A18j29J5L0j15L37q6p7j54m8O5j94K63Q9j94L4L8j19K35n5q4kj42J46j80
5502b09K50N1j27J66j06l1k37L20J15l35Q3M5jj01K24l73J75J7j41N0K83q8j12
$$ plain form
5344 -211 91 222 24 148 210 132 178 -151 109 -177 -92 40 -17 224 41 105 -79 122 31 -78 55 206
5366 206 41 -106 -280 37 -145 71 11 61 178 -39 -3 -138 74 -129 -55 79 -337 -53 222 234 -176 107
5388 107 280 -296 -198 220 -242 -375 -50 -89 -212 127 -159 -338 -14 72 297 41 27 24 -40 264 53 50 164
5411 164 141 -68 -288 153 -158 67 113 338 -8 -49 120 -22 97 -240 125 -75 -45 -179 11 -235 -86
5432 -86 -6 -246 -130 154 310 165 2 -120 14 -40 115 -127 -82 112 -8 120 -47 196 -78 110 131 71
5454 71 13 -212 82 62 -57 6 17 -37 -139 105 -38 34 -66 76 -38 142 97 54 53 55 -155 47 -128 118
5478 118 -11 4 34 -81 256 170 93 -61 -109 -44 -238 25 114 -80 -46 -8 -127 108 53 -31 -33 -175 -29 -209
5502 -209 41 92 -35 131 25 -6 -243 77 192 -143 -60 -15 -16 -117 107 -266 -91 -74 -215 -165 118 30 -82
5525h2j3o9j95L77N1k41K41R2k82j07J26L84k44R7pk20J35j04k15J38R6Nn0J33
5549D6J4j76K28l94M01k01m1J38qQ4J63j95k29J81J62j22K17K1m00L23n27J61
5571a54K47o4O8kQ7q5j26M18l10J57k23q1K63j42j17K27m0j03r1L5L1J11j80m3
5595a17L74l40J09rk9L3J44k41q8L27l31oK66l57J88J14J27k56M0j8K16L3j33
5618D6Mk43P2L03j49j68O2J17k80J07N1J73o3J33l15J90O1Mj99Q0N5j20J04j16
5642i1K91j73j28J52j29O5J28M6k45R2l7M4p3J75j56J38l00K63j17j1J35k66J35
5665f2k04M04k7N2o0J01j06j27n1P3q7n3J47k1J08k23J3r4J70J50j22K44l52j57
5689b84N48l15P5J13j00j97J11k4M8K24J09k96j50M18k27j4L20m10o0O6J04l58
$$ plain form
5525 -82 -95 -164 -359 18 69 -172 69 161 -121 -228 -102 282 38 135 128 -92 43 -61 -276 -138 -42 -37 -87 46
5549 46 60 -116 112 -282 119 -82 -123 15 7 91 254 59 -170 11 173 51 268 289 -111 212 -315 -154
5571 -154 93 29 97 95 182 97 -29 389 79 236 13 -68 195 53 -64 163 123 20 -71 -36 -5 106 -74 -117
5595 -117 257 -83 26 17 -12 21 165 -76 -164 163 -168 -174 92 -265 -77 37 164 -92 -52 -70 146 179 46
5618 46 50 -193 -121 182 33 -135 -73 44 -236 -129 -78 95 32 165 -150 40 101 105 -94 -14 41 -79 25 -91
5642 -91 200 27 -101 51 -78 -13 115 161 -84 8 -29 15 -58 117 -39 99 -201 62 -55 -66 69 -197 -62
5665 -62 -266 138 111 163 103 204 98 -29 -80 -7 -94 -147 0 -21 87 -136 -123 -217 -47 103 -19 225 -127 -284
5689 -284 264 -51 24 137 37 -160 -49 -73 -25 199 308 12 -138 280 53 39 359 -51 -111 -45 59 -299
5711b99O7J89j9Jr8j8NJ18R9m8q0J94j56m6J31k33K16M3qj87J76L55k15j68q5
5736f6P6l5l2O5j00K58j28L36k96j25r7q3J38J5p7J35O4j17l3R3K88j81J19k77
5760f0L53l5j5j28k4j67K11k04r7M31j68l07J25m3J8K30k85L4M1j35JK05j4j13
5784a46J4J17j50P7J73oJ43Jk06J42j22k15J77O0K8o3q9J77n0J01j21j99J05p5
5808a27PK75l87M60k25n6J50q2P4k51K87j58m0R7K4n7k8R4n6R9k25k0K77j23k6
5833a7o6J89j91J40j49m9K12o0K04j39o0J43j2j61J87j01R8j30j03n4L48k35j40
5856a46L45k19j09K28l4K9Kj66K50l56M16n7k42J4j1j81L25q8J58k18J44J9M4
5879A47M0m90M34p8L0L3q1j53J81j66J30J10k95L44k67J12j17J85l70L02L9j05
$$ plain form
5711 -299 -232 -43 -62 -61 -159 -177 -172 -54 45 -3 -83 111 -45 -91 40 -193 23 66 58 -129 47 402 187 19 -66
5736 -66 10 -25 -57 8 -92 166 38 374 78 -47 -144 -227 -89 -74 -151 -16 48 -69 -102 -9 279 98 217 -60
5760 -60 293 258 243 115 91 -76 135 -69 -166 265 97 -210 -85 -128 -110 120 -165 -131 -90 -225 -224 -19 -33 -146
5784 -146 -132 -15 -165 -88 85 79 222 223 17 159 37 -178 -1 59 87 24 -65 112 62 163 42 -157 -52 -127
5808 -127 -120 155 -232 228 3 -53 97 15 89 -162 125 -33 -73 24 48 -9 -37 57 1 100 -125 -145 132 9 -17
5833 -17 -83 106 -85 55 -94 -143 69 9 213 74 14 157 145 -16 171 70 168 38 -65 -119 229 -6 -146
5856 -146 199 -20 -129 99 65 94 96 -70 180 -176 240 183 -59 -45 -56 -237 88 0 158 -60 84 103 147
5879 147 187 -303 131 53 83 116 35 -118 63 -103 27 137 -158 186 -81 31 -86 99 -271 31 70 -35
5901c5J1J86l13k6Q2J34r5J74j63O0p8L4J7m1NJ7J32m1p8J28l20K08J05j83K72
5926A92r5j72K52l4k41M24m78K86k54K03n8J9j89K5K85k6l3k10K4K44o7k77J38
5949d2q6J69j09J37k29J93k69L40j15j48j20M58l58L29m9M6j6k67r8M21k41n9
5971a13J54k79L31J40j15j25R2L2k7J9j14O1N4M9q6k54J52m3k17J47J93k15J08
5994e6J59P9n73K89J82j36k28K89K3l82L17j96kK78k5Kj30M10n14J61J64k56q
6017a53P2J15j73K11j94Q1l7K43k79L11k58J31K2k79K60Q8m2p0J5K2P2j49p3L8
6041b6P9j02K34m64J54qM2N1K8j50J53l8J65k38L48m16p0J90lN6k49K95n5L5J53
6066A64m15P2J06R8o3K45p8j88L5j3r7L92k75n5J03j26J25p4K59j00l86L99l63
$$ plain form
5901 -35 -24 162 -151 -177 -95 39 -56 118 -45 15 -63 -29 -12 -53 -48 -31 101 60 -18 110 -210 -2 103 -80 192
5926 192 97 -75 177 143 -98 326 -152 134 -120 83 25 44 -145 -120 165 139 106 -104 -80 164 97 -180 -42
5949 -42 -128 41 -68 69 -160 33 -236 104 -11 -159 -279 179 -179 150 101 147 131 -136 -234 187 -54 -113
5971 -113 41 -238 93 233 118 -7 85 117 90 109 -5 56 110 159 73 -181 -29 -72 -289 -142 51 -164 -56
5994 -56 103 182 -391 -102 80 -56 -284 5 28 -354 -37 -233 -235 43 18 20 -110 300 -214 -53 111 -145 -153
6017 -153 -81 34 -139 72 -122 -41 -78 165 -114 197 -61 70 92 -187 73 161 119 49 64 86 158 9 -64 -26
6041 -26 53 -49 185 -279 -125 -133 -91 -40 -12 -162 -9 -47 118 -120 228 -188 -258 -68 -71 -15 -264 31 -24 11 164
6066 164 -251 -179 -73 25 -38 207 129 -59 -24 -37 -134 258 -17 -72 31 -95 30 -44 215 115 -271 128 -235
6089b35K68J05k8R9j16J72l0j82k68L8N7j01N6K77k53N7Q5j6O1M1M4l76K56Kk03
6114a90o2K13mk5k00K33N4j34J78k53M30m03J13K9j37J09J45m4k19M02k86K3J45
6137A17J20j96j38K17k75K46J03l48K06J39l00J45n4m7O2J50o5r1q5K5j63K56
6159B4J16r2j31q4K53k15J4L7K10j08P7l41MO51l82j87L17l5q4r6R4n9J85m52
6183b84L38j85M08k36j70K0RK8J74j48p5K75k52K10K16l25J28lm8N6q0r2J7k51
6207b70J64L64l27J82mk8J3n82K78O9J75K9k18n7Q5O9j77L20o5j61R5J33l74L45
6231E8J57o2j97K43j11n9J6k00K01o7Q8j65J87j27J17j59J80k11k9J09r8J27j75
6254a77J69L30j97n88M70j8p2R9K4j65R7J1J03n1K83k23M6n1j10j2J31l76J00
$$ plain form
6089 -235 33 138 110 209 93 265 235 53 -215 -177 -120 -221 -165 112 -141 -84 1 -15 46 87 131 -245 11 13 -190
6114 -190 -252 -39 -43 -68 -268 -35 19 -115 63 -190 240 -163 -50 -21 -158 -49 96 52 -167 235 -51 -28 117
6137 117 237 41 -97 120 -155 91 194 -154 52 191 -109 36 -18 -65 -3 147 82 -9 -94 -69 -232 24
6159 24 140 48 -83 -167 86 -129 -115 -78 132 24 101 -240 -236 415 33 -154 163 128 44 -52 42 -17 168 -284
6183 -284 54 -131 277 41 -129 -109 -100 -72 102 -46 -121 154 -98 112 328 3 131 128 80 136 56 -36 -19 -270
6207 -270 -106 258 -69 113 109 81 94 -488 -210 -141 34 63 -155 -212 -127 -58 -235 85 20 -141 -46 87 -287 58
6231 58 215 153 -44 199 88 29 45 -155 46 -21 67 -98 89 -38 79 -80 100 -111 -140 -31 -129 -2 -177
6254 -177 -8 322 125 -463 7 -11 -83 16 40 -125 -28 -17 86 35 318 95 141 90 -20 -32 99 -277 -177
6277a77J40K30k08N1q2K7n5k1jK41k54L48l63K22k45k7K97J30k7k48K84l03n3
6300i4L41k86O7J32j23q8J80P0k51J7j00J10j5j99K03j34K27q6j40K82J8l63K92
6323F0m7J22k32J05P6j37J08j76L45j66mj20J32o0J36k46j9K82j95q0L9K87l92
6346a82J99mn1N4Q9m48L86Q2j27J6J10j48Q2l25J18J27J12j34K82k34j16J8K3
6369g1J58r4P7o2l45L12k0J49k95J59J07Pj85k55M01j83N23m91J96J8J02k93J59
6392G4j99J02N3k0j00J17k81K39o3J54j03p0K02l08J25K13j43L1L0O6n2k83K45
6415B9j29q5J90J0R8M0k09L1J10j53N5j3k12K11R4j46NJ31j91J02J15j26K28j57
6439B8K83k35j10N6j87m8K84j39J0O0j45L89l61Q4l1K53j82L9j06J12J89l8l15
$$ plain form
6277 -177 -37 193 -15 36 -46 -19 -74 -95 -96 145 -109 239 -124 98 -147 -174 123 253 226 -22 262 -41 -94
6300 -94 247 -39 28 160 37 -51 129 199 -52 -35 -135 -25 -40 -239 -36 -170 57 -29 -169 113 131 -232 60
6323 60 13 135 -97 8 84 -53 55 -121 224 58 54 -66 66 6 142 -104 -123 159 -36 -116 -77 210 -182
6346 -182 17 13 -38 16 105 -343 43 125 -2 14 124 -24 58 -267 -149 -22 90 -44 238 4 -112 -94 -71
6369 -71 87 -7 70 8 -337 -25 -45 104 -191 -32 75 82 -103 -358 43 -140 383 -108 88 106 208 -85 74
6392 74 -125 -23 30 10 -90 27 -254 -15 -78 76 -27 -97 105 -203 -78 135 -8 23 53 119 67 -216 29
6415 29 -100 -185 5 15 113 153 -56 -25 85 -68 -13 -26 -238 -27 67 -79 -74 57 -134 -32 83 -43 185 28
6439 28 311 76 -34 22 -165 -213 71 -68 -58 2 -143 246 -115 -31 -62 191 9 48 -58 54 243 205 -110
6462a10J83k39J25J42j73J28Rk04J48L5j99J26J9K69l83j09J00J07j13rn1R9K48
6485A48k43N1N0p6j8J31J89r8j65L0q4J03o6J93M4m42K27J12k01P6K17k70L63
6508B71l32K94k38J41L4k87K66k48J97k3O9j35j3QJ44j47j07J59j65j5J63k56
6530b20J79LJ9j36K31j00Q0P2l5n8k15L37NJo3J77m10L4L7m8L04r1j14N3j85O6
6556g7K8J71l8j83L41k74j02O4Q7J61l2l9R6m0j8M3j47Q3J32m2j7j89n7r7K98
6581A52j46j14L9J26K34r1k93l0N7m2J97j41k88L95L3k8j70J39j06R1K10j63j82
6604a21n9J05o4M0J87j82J66K5Q1j69J12j47oP5j09K52j71J81k08j35k0P5j46
6627b38O9K00l97K82M4R0K35l1m19j09K49l1J86k13K70N5j31j01j74N7l0J12R2
$$ plain form
6462 -110 73 -166 -41 101 -72 56 65 -139 9 44 -155 -29 -10 259 -124 -233 -133 -26 -139 -148 -199 -100 148
6485 148 -95 -44 6 -70 -88 43 232 134 -31 -1 -85 18 -48 145 189 -253 -26 86 -115 -39 178 -92 271
6508 271 -61 233 -5 136 170 -117 149 -99 98 75 144 9 -4 4 148 1 -106 53 -112 -127 36 -220
6530 -220 -41 -38 -19 -155 76 -24 56 128 93 35 -180 157 162 163 100 277 -133 -99 -62 -110 194 103 -11 42 -143 -77
6556 -77 -49 122 84 -99 242 -32 -134 -70 17 178 146 107 203 163 145 188 41 124 256 214 197 8 -49 -146 152
6581 152 6 -108 -69 57 291 200 -93 -123 -66 -108 89 -52 -340 55 88 60 -110 29 -77 14 224 61 -121
6604 -121 -180 -75 -139 -99 88 -94 72 97 178 9 121 -26 -32 43 -66 186 15 196 -12 -147 -167 -92 -238
6627 -238 -169 31 -366 -84 -40 50 285 254 -165 -274 -25 -56 130 -83 187 242 111 10 -164 -107 -137 -25 67
6650F7j22N4l0j2J06r0n7J22j7N5K44r4l93K92j75L02k35M0k71M54j33K7j35M5
6674D4J30k26qN8k18K45q4j94K14J66k4n8oN8Qk66J72K3p3r8J01j8qJ04l5k61
6700b54Q7J80n8K3Q1j0K2K8R4l71L11j14Q1O8j38o5k1N8r2J08K7p2k32K43K06
6725A90k5k73K10r5P9n7k79K57q5j3K05K7l66K14P2k06M10l13J51j18Q8k42K01
6748C2j28o7M81k49k64K05Nj49L49k41n2M1j24K29L9k18J21j09K78lj30%M8j38
6772d4Q3pK9l2o8K01j43j34K26k81J11j32L38k97J23J59k23q4J71K50l53j44L64
6795A13R8l59O0J62lj53K72k42P1j98L20k47j6J01K2J1J12j62R8j36P4L6J56k73
6819h3kP4J18l08K57q7j77K64R6r7L0k62K76k23PR1K1K0n2J31l27K58Jj8j37L35
$$ plain form
6650 67 -55 -1 -31 -43 63 -27 -84 38 21 76 320 226 -167 125 -50 252 17 57 -214 240 107 134 -1 44
6674 44 174 -52 -60 -2 -220 25 -59 -253 -39 127 103 45 39 97 105 -161 11 34 -39 -137 -36 -54 -62 42 7 -254
6700 -254 -167 13 -45 -22 59 49 71 99 193 -178 133 19 100 168 30 -35 -56 2 -90 18 45 -27 -259 -16 190
6725 190 165 -108 102 7 86 29 -250 7 -78 -91 114 141 -225 -11 61 -145 265 -48 103 -15 73 -169 32
6748 32 -96 -163 318 69 -195 10 15 -134 215 -26 -78 -37 -161 68 107 -111 10 -99 179 176 46 46 94 -44
6772 -44 39 32 61 29 -39 162 19 -115 111 -170 -59 -191 147 -150 -27 132 -91 -175 -4 246 -107 -251 113
6795 113 211 -148 -88 74 71 -82 190 -52 19 -179 141 -106 -122 -21 1 12 124 -38 60 -76 -2 34 190 -83
6819 -83 -85 -11 107 -201 56 -31 -208 56 152 55 85 -177 99 -124 -117 -26 -5 15 -37 94 -233 25 26 8 -129 206
6845B06l14K26k16J80q0k48J2K93l8M1R7k15LK03k32J01l5j00J73J87l06q2j05
6868b49J82J04j37j14J76J05j72J38k1M5q1J16k34J98l10J67M1J29Q8k0l01R6
6890e4k17l8L98q7j55N9R7k39J66K8J12J01j60j19J61J7n58K61L13j05k52J54
6912a17M21l62J4K12j22l19J81K69r9K03l74J6j70J82J85j34n7K09j38R6k52l0
6934a86J46K24j40l4M6M0R6J12l50J10K7j60j0m1J85n2N0J76k61j73K04j30MJ80
6958F3ON6J10k57j3L5k21M20o1M8l08L83j02Jl82Oj55L65j58L19k31j2N2J52j37
6983b1j21J81P0k96K19j06k21L15l76M74k18Q9P5k0j05L5L2K59k71J4J01R4j42
7006F1j47k4N1M4oj26L30l4j06k38K39Q9j1k31K65m6j57jK2M8q8o9J1MJ87m7O6
$$ plain form
6845 206 -108 118 -98 82 2 -246 -234 59 21 62 159 -56 -53 150 -82 19 -16 -116 57 244 -62 -144 -249
6868 -249 -67 37 -100 -214 -38 67 -105 33 12 57 -24 92 -142 56 -254 -87 -46 83 171 151 -150 -54
6890 -54 -271 -309 89 2 -153 -94 3 -236 -70 -42 70 171 11 -108 53 70 -488 -227 86 -19 -271 -117
6912 -117 304 -58 -44 168 46 -273 -92 177 78 281 -93 -77 -247 -65 120 -14 -71 138 0 96 -156 -186
6934 -186 -40 184 44 10 56 96 192 304 -46 64 91 -69 -79 -120 65 13 63 239 -22 -195 9 -121 -117 63
6958 63 69 125 235 -22 -35 0 -221 199 138 186 -122 261 159 160 -222 -216 -371 -6 -164 155 -76 -88 -36 116 -21
6983 -21 -142 39 109 -187 32 -74 -295 20 -356 118 -100 -11 64 44 -61 -26 6 265 -6 8 109 203 61
7006 61 -86 -110 -59 -15 -21 -147 183 149 43 -195 44 133 122 -109 156 110 -47 -48 -26 22 -66 -135 -124 -120 67 20 86
7033H6j38L7j22K69k23K53j11j07o7m0M36k80J48k7J5k34K61o1Q7k66J54J81l96
7056a45J9K56j54N4j04J37p7O0Q7j4j04j27J42L7j38P2K13k61J35O4k40j7K06
7079A01q9pj0M6j74J77k6mJ18k1k30K50J09j56j10j5P5N8k57K28j80J76Jk83K74
7104E1P8n7k78J79j18O3j13K20J90k0k56n9K89Q8l04J24R0k31N7j37L94n1k63
7127f4J97l08K58Q1j88n3M6o3J27N9o1R6j55K2N2j4R1j10o1J74j96j16P0K54l25
7152a87L67j45j07p7K44J88l19k53N0K42J91l32K23J8J11j03l3J30l45j36L48
7173G5q4j28L0K84l36Q1O5j24L1l3O4L99l77n6J49j83o4J69o4J86J21k28R4K02
7197B73k42J19L5j54j98L05k27Q4J22j37K03k64J72l21M7K25j43R5J0k89L11k28
$$ plain form
7033 86 -52 -15 -137 132 -91 162 51 -56 -123 -163 273 -7 141 114 129 -105 156 95 182 -84 70 251 -145
7056 -145 -126 130 -24 30 -74 63 -14 46 133 119 15 -112 30 67 -71 1 214 -47 88 152 -88 -105 101
7079 101 12 5 -5 41 -133 44 18 14 132 111 -119 131 240 84 -26 -41 34 92 -165 63 -117 59 60 -223 51
7104 51 129 72 -206 -27 -145 -82 -195 25 215 195 -61 -120 169 257 -47 77 167 -64 -7 -144 250 199 -64
7127 -64 133 -175 83 164 -24 -77 -31 -94 33 92 31 127 -28 -6 46 32 123 13 -48 126 -70 -186 -116 138 -187
7152 -187 180 35 -72 -149 95 283 -36 -289 -239 3 194 -138 85 103 214 111 78 208 -137 -273 75
7173 75 -9 -137 -107 177 -159 -78 -13 -137 -106 -139 -75 324 -53 -109 40 -143 -207 -38 -102 84 205 -23 71 273
7197 273 31 150 185 31 -167 138 -89 -5 117 -20 183 -81 91 -230 -183 42 -101 -6 4 -285 26 -202
7219b02M7K69P7k90J76j84N3J67k39pJ21q1K56r9k90R6R4k40M33j57N3K9%n3L5
7244F4PJ0R5k53J46J10k26R1j00j73K60r7JJ90n3k83R9M05j35r3k26J31kj8K45
7269A95o5q1l19L83j12n5k08J92K87m22J84q3LM8k61L76J07j93J15j38j28L06
7291A31j78M7k16K02O5J19k08J85j39L7m1J03j82J00rj5M8o9n8M1k56L74K78k27
7315A32l05RJ80k9j01j19J58J05L17o54M45L8o6J6Qj63J35k19Q0O1k86N06o7o6
7339A15j41k15M93j74j87K18Rj95J08J42l87P3L27mj45K5J35rk53J47k86o1N34
7362B69k53n3K89l00R6l50K07pK87j41J27j51J52k37J16J66j12kQQ7k0k17j88
7385b27J08L16k1k19pk51L11O3j62O4k6r9K6j59J15j51J59J20K3j5l7j97K11L86
$$ plain form
7219 -202 -155 114 191 -99 77 -107 -54 113 -126 -133 -12 -93 163 64 -226 -130 -36 -276 157 0 53 82 82 29 64
7244 64 71 81 176 -77 69 179 -47 44 -56 -229 31 -66 -65 125 72 -211 -112 293 158 65 -161 -30 -32 -50 195
7269 195 130 49 -270 113 1 -54 -262 -70 217 -205 -21 -104 -101 -53 -314 62 169 -24 91 -47 -175 131
7291 131 -47 0 -216 -14 51 170 -38 147 8 45 4 107 -75 25 16 1 49 -20 -78 -37 -293 81 359 132
7315 132 -173 -164 16 -13 -114 -233 -75 30 347 -307 138 176 110 126 134 -29 106 -113 -33 28 -258 248 181 115
7339 115 -26 -241 252 78 -109 109 118 -77 31 173 -214 -141 186 182 37 62 197 188 -65 82 -204 -265 269
7362 269 16 -37 252 -48 48 -302 -95 -102 185 44 171 20 172 -65 51 217 105 103 111 198 178 -39 -227
7385 -227 -119 197 176 -43 -50 -301 10 73 -89 -25 -51 -150 -124 -283 -168 -319 -160 -40 -17 -32 -69 -266 -55 331
7409C31m56K73k41J81N0r9p4k12L19J16k14j19J85Q7k42L67l52l4K02m7l7J5J94
7432A93k50j56P5L49j98j15N5R3J38m4R1j66p6oj73J81J38Lm44L56Pj90K19o1
7456A9J96k74kM0L8o1N6rn8K3k63J68K16j67K29j04q5K0K19l82J29J83O1j83J63
7481A72k06k38K87K01k27p8j58J90J78l00K12j23k5L61k67L2P2p1R0p7qQ4j74
7504g3J83l06J75J14j41OjJ06K8q6m8p7l1OJ58l3K11j32j93L06o5j67R1N9mj31
7530d5J08l11M65l18j79K79K06j87j75O4J98j77K6R2j79K21j00k83K25j04J6L95
7552B37Lj75j4q0O2k2k9m3N4M5j09L10j90J3l2j32o0K55k63K58l88K60J73k23
7576i0N7j42J83P3k19K67j94K33l42k4J41O1M7j31P4o6K53J49l84n7J76j35L9
$$ plain form
7409 331 -125 148 -93 88 138 39 -35 -247 72 188 -26 -145 40 127 -115 252 -100 -134 68 21 -16 -1 193
7432 193 -57 -213 -138 211 13 -102 -47 46 184 140 231 65 -11 -17 -190 -9 129 132 -312 44 51 -139 80 19
7456 19 215 -59 -61 -21 17 -44 12 3 -55 -32 -295 -127 89 -78 151 47 -38 -18 201 -181 -52 131 192 9 172
7481 172 -34 -272 15 216 -11 -89 -247 -57 121 -179 33 -90 -115 246 -21 11 83 12 102 25 17 101 -73
7504 -73 110 -196 -21 93 -48 -42 -43 63 91 5 -43 -120 -151 -145 13 -20 191 59 -134 172 107 -60 31 90 86 -45
7530 -45 63 -248 217 -101 -280 -1 205 18 -157 -93 105 -72 -46 46 -133 88 -12 -295 -70 -174 -158 237
7552 237 240 65 51 -29 33 11 -18 -61 -7 38 -71 239 49 62 30 -102 -162 93 -170 88 -300 -40 133 -90
7576 -90 -33 -175 8 81 -138 129 -65 168 -174 -198 -57 4 51 -80 -6 -72 181 330 -54 -111 65 -70 -31
7599c1O2r1Q4j46J12Q4L0j07l5k21L75k36J00l0k14K75J71j72k94L07J2j03rK6
7623e1j17J83J09o2j26o3J06J01k30Q3m6pN7N9j28r0L47k41j34J65K02l6m4J11
7647A48Pj16l32M72J06k58M6R4r5l36M23n30K75O0m5K94j06j24L7jP6j30j22J53
7671dJ54k22J62j09j10J65Q0l1Q6K7m05K28j25Lo3J18K08j10j14O5R4N6m5q1K8
7696E5J1j20L68k76m8j48Q2J28MJ45k26n5j99K96q1J23k5k52J94j00K37k5j4k39
7720a65J4J69k74K70q4N2p3PJ08R4o0j10N1L6r5J48M3l3JJ36j96K6o8N4q9J86
7746A48j16k56J33P1L0O8r1k1O0K59k30J19k08K34l26J52j31n9L46k47o9K50m6
7769G0L8J40m89L19j14J83r5J53q2PJ14m66J37L96l77q3J20J74l90K45J78k85
$$ plain form
7599 -31 31 -60 24 -122 -10 74 104 -3 -38 -259 116 -120 -20 -50 -264 11 182 10 -284 23 35 -68 -77 -51
7623 -51 -168 15 124 62 -64 -127 -21 80 -150 -67 -113 -120 -63 -4 -132 -222 125 -116 -250 -85 117 81 37 148
7647 148 155 39 -293 179 285 27 73 167 72 -264 159 -371 -96 -36 -81 213 107 -17 20 19 95 -35 -157 -4
7671 -4 150 -72 90 -19 -129 36 116 85 171 198 -207 21 -104 -101 -164 -46 162 52 -62 3 97 153 108 27 55
7696 55 66 -54 314 38 -10 -158 -76 52 56 201 -25 -80 -279 17 -64 59 34 -218 -24 -124 113 88 74 -165
7720 -165 -151 18 -256 14 -70 -18 -91 -84 24 118 58 -52 -1 35 -60 88 131 98 99 235 39 65 -3 51 -38 148
7746 148 32 -224 -91 -20 10 78 -13 -34 26 285 55 174 -34 200 -126 26 -105 -164 182 -65 -134 116 70
7769 70 108 248 -241 78 -36 147 52 205 123 130 244 -222 -85 311 -66 -149 -29 145 -245 0 178 -107
7791a07K98k49j25J79N8j30Q1P1J32k38p0K30o8l26K74j15K67k43J67j31J41l2
7813F4j31J51Q0k79K86r3J8r4j03L14o9p3k1k1pJ02k55L1J67ok45J76J55l20K20
7838D7j48N9K2j79oK16j4L8J99m88K89k0N8j64J27j78K12M7j32Q1j62J13k88r
7862b80M19j16K0o5j15J71J42q6n8J48j10k22K43j10R5j99P4L05l65K35kj32K16
7885B08l66M27o6l23J76n5L37l00k0q8J41j74J10j8Q8m6J88k75J9p9J37L4Nj75
7909a15J74j80K29k91K7K04j62J05P5k97L08K16m22J69N6q9J0j89K11k08O2J38
7931C1k51M17K0l46K67o8Q8j45j25L9j0l8J91o3k5J7O5k41J37J61k58J87k63L87
7955A74j07J3K39l68N3k69L12J61l38K77j68j03M21J16n22k2L19kn03L14K84j98
$$ plain form
7791 -107 191 -58 -183 -4 54 -76 5 76 208 -30 -100 130 62 -264 10 -105 162 -81 86 -45 96 64
7813 64 -67 84 164 -115 171 78 96 2 -101 213 144 71 50 29 22 124 -131 -100 67 61 -184 -8 147 -173 47
7838 47 -101 -42 -20 -199 -205 11 -3 35 234 -254 35 15 73 -91 36 -142 70 117 -15 66 -96 17 -271 -280
7862 -280 139 23 43 -22 -137 34 176 90 32 180 70 -152 91 -19 76 -123 -49 256 -109 126 124 -8 208
7885 208 -158 269 203 -120 56 1 338 38 18 -70 71 -103 7 -11 77 31 219 -56 -37 -116 21 55 60 -115
7909 -115 59 -121 108 -183 -156 48 -114 -9 66 -231 77 293 -129 40 96 7 17 -172 39 -169 -107 31
7931 31 -220 197 217 -129 138 70 158 13 -112 -73 -83 -121 70 7 -18 -1 64 -177 -40 121 -137 50 -213 174
7955 174 67 80 319 -49 4 -265 47 208 -130 147 -21 -124 297 413 -109 -131 188 186 -317 -3 281 83
7977H3Q2j79J17J05k19l9j71L40l98J94M4j1K27k77J18r0L4J09n9O7j56K68j23
8000F6R0J6j79K58l81j56K01kL50k56r8J91j94J44J53j37l8Q9n2O1j29J35J9o2
8024H9K0R3r3J22k74K43k14N0K8K3j85L5L29l53j29L08k3k00j15J53K25m00K79
8047A1q6J77j78J41k5k59M06j68LM5j79M4M0J62j03P1m67K78J76p9J33j56J34
8070A21j10k2J72j24J22l33L66l04R8l2KJ89r6o1N7r2j35N8K68j46R7j95J38j86
8094a48j09n6K35K0J8O2P7p0j31Q1k8N2j7J87j91q7N8K6L17l30L21j71q7K40k57
8119A2o7r4L22j93L1Nj07N1k36O7o0K1O11k77L3K09j43k15R8J33m3l7J8k61J80
8144E8L4k46K25J79k59j63L79j92J36p9l5j0L6r5L22k99l18J99OJ95k66K91P9
$$ plain form
7977 83 165 -14 103 208 -11 -50 -221 119 -279 -85 -41 -52 175 -102 16 -74 -40 69 10 77 -79 189 66
8000 66 156 172 -7 251 -130 -286 -85 -87 263 7 -91 100 -94 50 203 66 28 117 65 126 -3 132 151 89
8024 89 109 202 109 231 -43 200 -14 36 64 87 -98 -63 266 -87 -216 92 69 -131 -246 -93 132 -268 11
8047 11 -75 102 -76 65 40 -219 187 19 22 67 -112 -68 -28 134 31 102 -365 -87 89 10 143 -13 121
8070 121 11 -11 161 37 159 -174 192 -112 -14 -46 -44 145 49 -12 45 -47 -182 -124 144 -2 95 -100 38 -148
8094 -148 -257 -313 -78 -58 -40 22 99 29 -102 -21 -49 3 -14 173 -18 -105 -47 -21 296 -34 287 116 29 269 12
8119 12 -55 -149 173 -20 11 16 -91 -40 -276 -209 -269 -248 363 86 119 328 185 -30 68 201 158 121 139 -122 58
8144 58 92 -154 71 250 -9 -172 207 15 151 72 37 27 63 -32 290 -9 -327 -128 -122 73 -193 98 177
8167A77k44M5j30J69J68j20K4n5k61L27j33kl0m48O13j57J15j17n4L05j16q7J67
8190A56n7
$$ plain form
8167 177 -67 -22 -152 17 185 65 89 34 -227 100 -33 -35 -65 -513 100 -57 58 -59 -113 192 76 -11 156
8190 156 99
8191I9
$$ Imaginary data points
##PAGE= N=2
##DATA TABLE= (X++(I..I)), XYDATA
0@%%%%%%%%%%%%%%Kj0J6j6J6j6K4l2L2m0M8n6O4p2Q6r8J11j27J45j63J83k06K33
37A24k61K89l23L60l99M44m92N43n99O61p29Q02q84R76j074J183j306J441j596
56h40J774j977K214k494K831l245L769m454N397o775Q980j3065K3036q9885j12235
71a86969K28662M4379j16516L4020N8470p4026J4126K1542l9076L1309L1964o4643
83a6758j9897M5885j1091k2391M8678K189m5332k520K4625j266j2221J6481K24
96F606k6796J4356j505k5849L0333M2890k9251l9281K8671J5691k3083J6144J2497
109B1423j8542K987M596k3420o55M0177k918m0564M467J3517j0400j009J1597
122A256j56o553O632j0025p731K8802M309j9931P317K498k5176J35L0727k441
$$ plain form
0 0 0 0 0 0 0 0 0 0 0 0 0 0 0 0 2 -8 8 -8 8 -8 16 -16 16 -24 24 -32 32 -40 46 -52 59 -68 77 -86 97 -109 124
37 124 -137 152 -171 189 -210 234 -258 285 -314 347 -382 420 -464 512 -562 621 -685 756 -840
56 -840 934 -1043 1171 -1323 1508 -1737 2032 -2422 2975 -3800 5180 -7885 15151 -74734 -186969
71 -186969 41693 86072 -30444 3576 62046 -11980 2146 23688 -15388 15921 47885 -16758
83 -16758 -36655 9230 -1861 -24252 24426 26615 -18717 -21237 3388 2122 -10099 6382 6606
96 6606 -20190 -5834 -7339 -33188 -2855 40035 10784 -28497 174 15865 -7218 8926 21423
109 21423 2881 5868 10464 -12956 -13611 26566 23648 -16916 -12449 1068 -9332 -10341 1256
122 1256 1100 -5453 1179 -8846 -16577 12225 16534 -3397 3920 6418 -18758 -18623 12104 9663
136I663j5693P080k511J982J1391j0272l448J7824j823k7073k59J9498o024n193
150d858O656l687m524J119J033J102J3092N630k1018q126J2983n60l293J0439
164E988J469j5276O91N301m593J4073Q098k0215k922J4826n823o698J5395J513
178A1827j6557K143L170m733O260L415n764p43K948o469o090J0220Q168q033q916
193i154K655N643k798M99L787p88M726k418r641O794J2966o451j0178P981J470
208E093r981M578P910k872k812j782k331J048L159k606k811O239k208j1740M85
223a0631J2251J608q641J476N184k011Q86J18p24O935Q8j0901J35J1032k344n960
239a499N078J95k525J779m431j679P719O96q536p93J933m026L234M778l480j622
$$ plain form
136 9663 -6030 1050 -1461 521 11912 1640 -1808 16016 14193 -12880 -13139 6359 335 -4858
150 -4858 1798 -1889 -6413 -5294 -4261 -3159 9933 15563 -5455 -13581 -598 -1158 -4451 5988
164 5988 7457 -7819 -7128 -1827 -6420 7653 15751 -4464 -7386 7440 1617 -5081 10314 11827
178 11827 -4730 -2587 583 -4150 2110 5525 -239 -982 1966 -4503 -10593 -373 7795 -238 -9154
193 -9154 -6499 -856 -3654 -3155 632 -156 4570 2152 -7489 -695 12271 5820 -4358 3623 5093
208 5093 -4888 -310 7600 4728 1916 134 -2197 -1149 2010 -596 -3407 2832 624 -11116 -10631
223 -10631 1620 3228 -5413 -3937 1247 -764 122 240 -484 6451 6539 -4362 -4227 6805 4461 -1499
239 -1499 3579 3774 1249 3028 -1403 -3082 4637 5333 -3203 -3996 -2063 -6089 -2855 1923 -1557 -3179
255c179k07j613L911M776l226k697N034l76o486L315O603R86l046n209j821N602
271B367M590n680l731N837n27o749j92M747J210j961k749j382K872J233n108K524
287b699M666l285l763L110K892N98l50k91J307L04l345L02N722p27m399k52K099
304A889L86j613j638K451L611m437p022L651N156k941l324Q08J391j13p63j281
320c789K800L617k919k695L094J348n63M85R00j70Q64j109l277K655L814l060
336A995k074J964j696k473K352J80j624J561j496m120L649K316l779O42L903l041
352a741l810L858L966M41k86l460o71N278j44m593K800N515n008o094L358L458
368B867n02r35k299j47J624k071j948L033J459m038q96K353O3l94P21J038J305
$$ plain form
255 -3179 -3386 -4999 -1088 3688 462 -2235 2799 2423 -4063 -748 5855 6841 3795 -1414 -3235 2367
271 2367 6957 1277 -2454 3383 2856 -3893 -4085 662 1872 -89 -2838 -4220 -1348 -115 -5223 -2699
287 -2699 1967 -1318 -5081 -1971 921 1519 1169 878 2185 2489 -856 -554 5168 4441 42 -210 1889
304 1889 2275 662 -976 1475 5086 649 -6373 -2722 2434 -507 -3831 -3023 -1632 -1745 -2508 -3789
320 -3789 -989 2628 -291 -2986 108 1456 893 1378 2278 2108 2972 1863 -1414 1241 5055 1995
336 1995 -79 1885 189 -2284 68 248 -1376 185 -1311 -5431 -1782 534 -3245 -2603 1300 -1741
352 -1741 -5551 -1693 2273 2714 2428 -1032 -1703 3575 3431 -1162 1638 7153 2145 -3949 -591 2867
368 2867 2365 1430 -869 -1016 608 -1463 -3411 -378 1081 -2957 -3853 -1500 -1437 -1831 -1110 -72 1233
385A233q45l022J795M033p70k556P62L78N92m50j325K667K251l196l787K093J296
402A149j102n26r30K08J307k591j498L651K372l355k106K660N24j078j58J172
418c01J932j41l454p80M399J930l566M35L760j414l684R37K471M58j210l386o14
435b228M095j349m261K586M024m077l432K065J917O21K6j236P1M92k222Q26M996
452B914L30l399p24J323J390K98o97P55J252k651k605K520J841q81j314j053j38
469h39L7j464p12J761J488j839k141J117K227k97K97J517j83j504L66N0O14L313
487C808m31n033R60L689j488o43J805j027j476K5j307LK488k100k488K277l5l210
505d183L85L545J662j784k231J282K032r73K21K029K78j319j771j99L432K157
$$ plain form
385 1233 388 -2634 -839 3194 2424 -132 630 1008 1600 1150 -175 2492 4743 1547 -2240 -147 1149
402 1149 47 -479 -1409 -1201 106 -2485 -3983 -332 2040 -1315 -3421 -761 -237 -1315 -1473 -301
418 -301 1631 1490 -1964 -2744 1655 3585 19 454 4214 2800 -884 53 2524 2982 1772 -1614 -2228
435 -2228 1867 518 -3743 -1157 2867 -1210 -4642 -2577 -660 -39 -13 -1249 -1178 -686 -2908 -2082 2914
452 2914 3244 -155 -879 444 1834 2132 1435 2190 3442 791 -1814 706 2547 1666 352 -701 -839
469 -839 -802 -2266 -2978 -1217 271 -1568 -3709 -2592 -365 -662 -365 1152 969 -535 -169 -119 495 3808
487 3808 3377 -1656 -696 2993 1505 862 2667 1640 164 189 -1118 -1115 1373 -727 -3215 -938 -973 -4183
505 -4183 -3798 -253 1409 -375 -2606 -1324 708 -265 -44 1985 2263 944 -827 -1026 2406 4563
521D563m219j378L567m41l151R63J965j071j174m36j296L76J367n72n35J707o30
538c95l583J032M283m02k103K076q58k495K991K557j457N58k94l887J719M477
554D219l240j862K943j213k064J681j200o51L557j343l863K129J615k947L10K843
570I14q93j601l67o15J878K748o22k301O06K041j191q10K658O99l280o32K054
587A286k54n44K43j158R14J184k751j282L210r3k445L70J311k318r73K630J460
604G90n06j092l56r31K591K056k207j235L198n34l591L389K616l994j05K849l391
621d53j68L578l679k193N338j100n983K600L016l108O63K468k912q51L586j312
637e10j150L506q61m107K664L528k580j370L771r96k579K088P45k028J617o37
$$ plain form
521 4563 344 -1034 2533 2092 -1059 -96 1869 798 -376 -812 -2108 -1732 -365 -937 -1472 235 -395
538 -395 -3978 -2946 1337 935 -1168 908 50 -2445 546 3103 1646 2204 1910 -1977 -258 4219
554 4219 979 -883 2060 847 -1217 464 -736 -1387 2170 827 -3036 -907 708 -2239 -1929 914
570 914 21 -1580 -1947 -2562 -684 2064 1442 -859 -253 1788 597 -213 2445 3144 -136 -768 1286
587 1286 1032 488 731 -427 487 1671 -1080 -2362 848 755 -1690 -1320 -9 -2327 -3300 -670 790
604 790 284 -808 -1164 -2095 496 2552 345 -890 2308 1774 -1817 1572 4188 194 89 2938 -453
621 -453 -621 2957 -722 -2915 2423 1323 -4660 -2060 956 -2152 -1489 979 -1933 -2784 802 -510
637 -510 -1660 1846 985 -3122 -458 3070 490 -880 2891 1895 -684 1404 2149 121 1738 1101
653A101l012K072K477m842j418N011r5m154J122J415j035K36N82p71O05R72j242
670i76Q1K233J63j792q0K654n33j964J719N53j897R81O59k566K90J913k448J74
688h36K672k652j990K855K45k622K009N79l011J917J695k384M91L060j932j791
704a695K588P29j945J316J063j981N56J413k293l24L347j394l501K397J493l389
720a620L55K481k331p82J780j737k73L607j758k888L013K149l946O04L924j691
736H87j730J886L7p61J315m95j384J523R33k996k87L572j204l131J824J005k541
753a547M8J524j007j5J021j717l65K544j3k293J562J483j851j59K052k21j094
770d8J259j97j128J351P35j786k08J780r47k016J676L40j622P87J0j837P81J462
$$ plain form
653 1101 -1911 161 2638 -2204 -3622 1389 1294 -2860 -1738 -323 -1358 -1122 -540 -1311 -706 266 -976
670 -976 -895 1338 1501 -291 -371 2283 1750 -214 1505 2058 161 1142 1801 -765 -475 1438 -1010 -836
688 -836 1836 -816 -2806 49 294 -2328 -319 260 -2751 -834 861 -1523 -1032 2028 96 -1695
704 -1695 893 1622 -323 993 2056 75 631 2044 -249 -573 2774 1380 -2121 276 1769 -1620
720 -1620 -1265 1216 -1115 -1897 -117 -1854 -2127 1480 -278 -3166 -153 1996 -1950 -1346 2578 887
736 887 -843 1043 1080 319 1634 1139 -245 1278 2211 -785 -1072 2500 1296 -1835 -11 994 -1547
753 -1547 -1499 25 -982 -997 24 -1693 -2058 486 473 -1820 -258 1225 -626 -785 1267 1046 -48
770 -48 1211 1014 -114 1237 1972 186 -22 1758 811 -1205 471 811 -811 -24 -14 -1851 -1070 392
788C92j940p6K553j563j592J975O96j493J119J108j630N84Q21j027J064J300j830
805D61r88K114r8k170J015J319j462p59L38m35M13J215j898p09J641k49j606R77
823h81J417j153j08J11n3M21J509p83o57J236j69q57O64Q78q11k35K56p27j99
842a41O76j04l84k39j68n33k2J145l42q49J69L40q45Q2Q92M47k17J44n21J61J576
863A267r1j347J060R23j376p42J024N05o74L4l46o00M46j88p08Q03O22j658l59
882a405J073j56p43P79N61p85L5j51L36J252N1j043M81J119r56r7J251l14n12
901G76m21j09k87N32j19l18l3J19j149j95J031j64o1j9m78m9O44j04m50R47O69
922G62j234o4P76J58L77L53q69L06N33m84k44P99n0r56l15K08m66N44m72m57N88
$$ plain form
788 392 -1548 -1624 929 -634 -2226 -251 445 -1048 71 1179 -451 133 954 -73 991 2291 461
805 461 -527 1587 1489 -681 334 1653 191 -568 -230 -665 -252 963 -935 -1644 -3 -252 -1858 -881
823 -881 536 -617 -725 -614 -667 -246 1263 480 -177 1059 890 33 697 1575 764 529 785 58 -141
842 -141 535 431 47 -192 -360 -893 -915 230 -112 -961 -792 -452 -1297 -1215 -323 124 -93 51 -470 -309 1267
863 1267 1176 -171 889 1812 436 -306 718 1223 549 583 237 -363 83 -105 -813 -10 612 -1046 -1405
882 -1405 -332 -488 -1231 -452 109 -676 -641 -792 -456 796 847 -196 285 1404 448 351 1602 1288 776
901 776 355 246 -41 491 372 54 21 140 -1009 -1204 -173 -337 -398 -417 -895 -944 -300 -404 -854 93 762
922 762 -472 -536 240 398 775 1128 259 565 1098 614 370 1169 1119 163 -152 56 -410 134 -338 -795 -207
943b07j65p05L35O78j61o76N17J64l94J23K55M55L81p38L6M62Q60l14q17R33K37
964A259r01m75Q28J80p69l48K9Q7n0p60J01O61J90p16o39O82M99n22L56Q55n28
985A9r03Q97M6K54P34k88j077O65N37q63N06Q58j139j65P53r65j17Q20o35q58
1005i21Q76j68j466O31J368q89l30L93k94M57N76k74l86J177n25r71J073J300
1023A627j006o87O93n1l47O74l09o39N93K61j214K15L88j292l6J427p62q13P57
1042e21K93n12P00L36r26K73O31m36J63J068o12j005J017O38p07r2M72n24PQ28
1062A091r75r96J219K47j234R2Q41j501K60J081n44j71M16n45q58J753O49j617
1080g92K63J351o72q71J690M8j130M53M15p29L76O59j260j81J749j115j956K102
$$ plain form
943 -207 -372 -1077 -742 -64 -225 -901 -384 -220 -614 -491 -236 219 600 -138 -102 360 1220 906 89 1022 1259
964 1259 358 -117 711 891 122 -226 -197 -110 -160 -920 -819 -158 32 -684 -1323 -641 -142 -664 -308 547 19
985 19 -884 13 59 313 1047 759 -318 347 884 21 527 1385 246 81 834 -131 -248 572 -63 -921
1005 -921 -45 -213 -1679 -1048 320 -569 -899 -506 -800 -343 233 -41 -427 750 225 -746 327 1627
1023 1627 621 -66 627 576 229 903 594 -45 548 809 -405 -190 198 -1094 -1130 297 -465 -1278 -521
1042 -521 -228 -740 -40 296 -630 -357 274 -162 1 1069 457 -548 469 1107 400 308 780 256 263 1091
1062 1091 116 -880 339 586 -648 -556 285 -1216 -956 125 -419 -590 -174 -719 -1577 176 825 -792
1080 -792 -529 822 150 -721 969 1017 -113 340 755 26 402 1061 -199 -380 1369 254 -1702 400
1098D00M81k000Q65O42j559J60J250p77j77J256j154j002J868R11j889P22J249
1115A246j594J26J296o38n32J271p19j068J136L79j703N54J313j323m45J078p44
1132c67p51J310K36j542M87Q03r94N0J396q28r35J369J12q25J061J35r67N95J001
1151A346j402j89J403q3j343Q23M70j932K23R08o48m2J052j303o24J546J21j688
1169a362R42J219j765k34J962l11j452J512j76j016J772j18j483R71J367j824
1185Dk34J309q05j033J390L4j268K46O87j173M93J017j272j017K107n75j196J481
1203A95L63j798N95J357q99j63J556j142r29J958p7j782J483P58j533Q9R10q89
1221E2l61J158m84j398J093L10j397K27J269p10q28J022l45p67J053O74j251M77
$$ plain form
1098 400 881 -1119 -254 388 -1171 -1011 239 -538 -715 541 -613 -1615 253 1164 -725 -3 1246
1115 1246 -348 -222 1074 436 -96 1175 456 -612 524 903 -800 -246 1067 -256 -701 377 -367
1132 -367 -1118 192 428 -1114 -627 176 -818 -768 628 -200 -1135 234 346 -479 582 717 -250 345 1346
1151 1346 -56 -245 1158 1075 -268 555 1025 -907 -684 224 -424 -466 586 -717 -1341 205 326 -1362
1169 -1362 -420 799 -966 -1200 762 451 -1001 511 335 -681 1091 973 -510 461 1828 4
1185 4 -230 1079 274 -759 631 665 -603 -357 330 -843 -350 667 -605 -1622 485 -90 -1286 195
1203 195 558 -1240 -645 712 -187 -350 1206 64 -865 1093 1016 -766 717 1475 -58 31 941 52
1221 52 -309 849 365 -1033 60 370 -1027 -800 469 -241 -1069 -47 -392 -1159 -106 568 -683 -206
1239b06Q15r59k0J740r57p40J386m8j527M38J100j033J92L70p03q63J498m72p04
1258f93P99K11j543N13J118r72j1Q67m27q07J229K64j049Q89N87j372n4J579q78
1277B50j98Q59l79q02P41L90j393P29P15j394j88J189o68o71J049k38j257O87
1295e79O46q20K33J122r88l08J154k39q07Q65Q67j089m94J078l62k61O68n60l50
1314b24O92j32q44M78J071j741j54Q40j75p25P59K66o97M10J05l57K11P86n62
1333Go45J182l48k86N24N20r38L9P85q11J54N88m44n03P23k08q32L30L06l07r9
1354b63M39o31l74O18K36n71O15j8n03j8P68k10j10N80j80l55K81M3n40P53K37
1375G97r21J67O16p18k48N94p0n15J94R8l86L84J23q36L27M13n90k1Q53M6o07
$$ plain form
1239 -206 609 -350 -370 1370 413 -327 1059 1011 -516 -78 1022 -11 181 551 -152 -1015 483 11 -693
1258 -693 106 317 -1226 -713 405 -567 -578 289 -138 -945 284 548 -501 388 975 -397 -451 1128 250
1277 250 52 911 532 -270 471 861 -532 197 912 -482 -670 519 -149 -820 229 -9 -1266 -579
1295 -579 67 -753 -520 602 -386 -694 460 221 -586 279 1146 57 -437 641 279 18 686 126 -224
1314 -224 468 336 -508 -30 1041 -700 -854 -14 -189 -914 -155 111 -586 -176 -71 -428 -217 569 7
1333 7 -638 544 196 -90 434 954 16 55 840 29 183 771 327 -176 547 339 -493 -163 143 -164 -263
1354 -263 176 -455 -829 -211 25 -546 69 51 -452 -470 298 88 -22 558 378 23 304 347 -193 560 797
1375 797 -124 43 659 -59 -307 287 217 -298 -104 -6 -392 -8 115 -721 -394 19 -571 -592 261 307 -300
1396c00J48P03o63O4M02K3l04M72m03k83N42L01o96n9O39p71j40L04j50L7J08
1417b6O5m70K11L62n11K10m1J92n85L75M26l04K92r6m81N53M46n34k12O72O2p21
1439a15L48m8l82K30M50p82JL07n26O9O03l19k18L67M2m88J6N32l6q4P3j68O8
1462f0O53l66m37M56L62p13K45M08p4o95K72J07n30J94L0j61L45j51m12j76P19
1483A6k7m56K74J73k99rK65J60OJ02P0m06L38R5j18J66k8J04k03m7j33j8L21k80
1507F6k99L54j99l70M17N1k53l81J73M15q0k3mJ2J74J12n14N77O73p63l25K48
1529F1J67R2j1j7k30K87k99n4l5K83l08l7K05n06K3J7M4J60K51j73l29J32K63
1552a4j36J61Q1J48k51L25J40l80O5J65R3j46J44k13o8K31k01k9j31j73J73k52
$$ plain form
1396 -300 -152 551 -112 -48 354 377 73 545 142 -141 401 702 6 -53 586 -185 -325 -21 -171 -134 -26
1417 -26 39 -431 -220 142 -369 -159 -200 -8 -593 -218 208 -96 196 100 -381 172 618 84 -128 544 606 -115
1439 -115 233 185 -197 33 483 -299 -298 9 -517 -448 155 -164 -382 -15 27 -461 -445 87 51 -33 40 -128 -60
1462 -60 593 227 -210 246 608 -105 140 548 474 -221 51 158 -372 -178 -148 -309 36 -115 -527 -703 16
1483 16 -11 -467 -193 -20 -319 -328 -63 97 103 205 275 -131 207 302 184 350 322 426 223 176 43 25 346 66
1507 66 -233 121 -78 -448 -31 20 -233 -614 -441 -26 -106 -129 -133 -121 53 165 -349 228 901 138 -187 61
1529 61 228 320 309 292 62 349 50 -4 -39 244 -64 -101 104 -402 -379 -362 -318 -158 93 -80 -409 -277 -14
1552 -14 -150 11 92 240 -11 314 454 74 139 304 397 251 395 182 114 345 144 115 -16 -189 -16 -268
1574b68J14j04J35l20J49K02m4R8m23Q3L96Pj23l0L10p0o0L18j03j68J50l74M39
1597C14L1k38m32J67O49n48j28K03k23j97M22k59J08q5j03r7L77K10j90l55M97
1618A23Q6P6J12l17N6k22K93j01k18K74J99l40K85P8J8k40l66J68N1k15O7k17
1640c50p7K95l8J19j87j12K97J61R2l84J34NL27k27J73j09j8j18J31K63l54L58
1662C81j73j53M5j11m46M38J88k11l87K33j26K60j38K25k22J12J83k96L91j19
1682G4j79q5M25Jq8N9J28k85J05J02j16p1J92n71L01J59k20m37K89L07l42PJ24
1705a21j31P1n0j96Q5O35J11o18J84K90m17M18kJ17l59L36j23k52L77J78o55M5
1727g7K7l01k92N46J78l35K25l61N1M16oo44J79P32l13l68M72P2j10l8J76j2j54
$$ plain form
1574 -268 -154 -258 -123 -443 -294 -92 -136 -38 -461 -378 18 25 -98 -128 182 112 52 370 267 99 249 -125 314
1597 314 345 107 -325 -158 491 -57 -185 18 -205 -402 20 -239 -131 -216 -319 -416 -39 171 -19 -374 123
1618 123 209 285 397 80 136 -86 207 106 -112 162 361 21 306 384 402 162 -204 -36 15 -200 -133 -350
1640 -350 -427 -132 -170 -51 -238 -350 -53 108 200 -184 -50 -45 282 55 228 119 101 -17 114 377 23 381
1662 381 208 55 100 -11 -457 -19 169 -42 -429 -196 -322 -62 -200 25 -197 -85 98 -198 193 74
1682 74 -105 -190 235 236 148 207 335 50 155 257 141 70 262 -309 -8 151 -69 -506 -217 90 -252 -245 -121
1705 -121 -252 -181 -231 -427 -342 293 404 -214 -30 260 -157 261 259 376 17 353 230 -22 355 533 -122 -77
1727 -77 -50 -351 -643 -97 81 -254 -29 -390 -339 77 71 -573 -394 338 25 -343 129 201 91 53 229 217 63
1750F3M15j71j59J83l26k17N23l02j27K69rk57m05M73J72l00J80j8p30O26M04
1771B87m21J60K50l75n8L17J89m21J97q7j75J27P5j7j22M50k39k11J31J29K6m42
1793b30L79n78L93J51l85l8M29j10m83K69M57k54p2P3J88l66M07j63j89K50M01
1814E29o45O7J05Q2l35O42j74n94L46k2l98J34M76l49l26N88m38k10N32k2l51
1835c63K84K13k90q8N10l80K05L75n59k96P99j5n22J13M49l59p1L15k71k32K45
1856F2O8n38L64J81n40K57K26m58J55K68j15l8K57j36n69M85M64l32j7J14J05
1877B63m75O68l24l03K33L70l87j79M45o85K30J34K5k50J45K34n73J11J56Q6k16
1898b92J20K48k10M55l60k10K58J5j29k41N57L7l45K40m1j98J85J16l26J47J09
$$ plain form
1750 63 478 307 148 331 5 -212 311 9 -118 151 142 -115 -520 -47 125 -175 5 -13 -743 -117 287
1771 287 -134 26 276 -99 -157 160 349 -72 125 38 -137 -10 65 48 -74 376 137 -74 57 186 212 -230
1793 -230 149 -429 -36 115 -270 -308 121 11 -472 -203 254 0 -72 1 189 -177 230 67 -122 128 529
1814 529 -116 -49 56 138 -197 445 271 -323 23 1 -397 -263 213 -136 -462 126 -312 -522 10 -12 -363
1835 -363 -79 134 -156 -244 266 -114 91 466 -93 -389 410 395 -127 -14 435 76 5 320 49 -183 62
1856 62 130 -408 -44 137 -403 -146 80 -378 -223 45 -70 -108 149 13 -556 -71 393 61 44 158 263
1877 263 -212 456 132 -171 62 432 45 -134 311 -374 -144 -10 15 -235 -90 144 -429 -318 -162 -76 -292
1898 -292 -172 76 -134 321 -39 -249 9 24 -105 -346 211 248 -97 143 102 -96 89 205 -121 26 135
1919A35l47K3K30k47m8J67o3j96N45j81k02RK00k64O6L00J9k01Q2J38k15J2K01
1942A63j10j09K11j33p6L03m6m83J08K16q3j02J73j9j72N2j02j14K69J07l20M20
1964A53Q5j41j74K47Kj97J2K66j35%Q0m01K01J53j94PK27j90K1j32%J6k7K6KJ13
1990B0l9M7j71J23J04k45J24L5o9J39k4r0K27l9k03N2J01J19k77j25M47l00R7
2013E3k05K51l20J88L9j31P4l4l3j83M16M9r0j27K85j54j10N3J90j20j23k5J16
2036E9k92K93k52J33R0m8L68l45k22Q6K90k25J06o9om6J96k78l0K65j22j16K10
2059D5O0P2j05p2R1K3K86l40J16n3J7J95m01kJ62k8j20J30l21L31l57J20j49L79
2083G9j94o7j2J99J50k43J93k14m3L59k02J44k2j49J46O7k17K02j45J32k41L11
$$ plain form
1919 135 -212 -189 41 -206 -254 -87 -150 -346 199 18 -184 -175 25 -239 -173 127 146 -55 27 165 -50 -38 163
1942 163 53 -56 155 22 -54 249 203 -280 -172 44 -39 -141 32 13 -159 -107 -209 -323 -54 53 -267 153
1964 153 238 97 -77 170 172 -25 -13 253 118 118 198 -203 -2 151 -43 -36 191 1 22 -110 -110 -94 -121 -95 -93 20
1990 20 -19 28 -143 -20 84 -161 -37 -2 -71 68 44 -46 181 142 -61 -9 92 211 -66 -191 256 -44 53
2013 53 -152 99 -221 -33 6 -125 -51 -85 -118 -301 115 164 74 -53 232 78 -32 21 211 91 -32 -57 59
2036 59 -233 60 -192 -59 31 -17 351 6 -216 -130 160 -65 41 -28 -34 -80 116 -162 -192 73 -49 -165 45
2059 45 105 177 72 0 91 114 400 60 176 123 140 335 -66 -68 94 66 -54 76 -245 86 -271 -151 -300 79
2083 79 -115 -182 -194 5 155 -88 105 -109 -152 207 5 149 127 -22 124 191 -26 176 31 163 -78 233
2105B33j68j67J45j59J11k28L76l81L79l0o4l04K10k65K25lL6N2J06j6j46L17
2127B59j55K90m07L38m37K33l7k5j63J97J08k06J75j80L7k01J35j24k6J62On6
2149g7J27J45j43j02K66j83K40q0j13N0j1j65j6K52j91N2J52j15J63L1l10J07
2171G9k79M18j90o9N6J81m6k59m8P1n4K42R7r6j18L20k30j13K26k10J44L6n6j97
2195i5J45QJ95l69L40j18j82k4K08j10J04j6k14q3J66J22l43K88J60k46J47K55
2217C38l50J24q2n6R7k71J39R4n6K02j27J8q7P4Q8j54J15n19N0J16L50M7k27r0
2241a67K43k24J8J9J4K87n66K21L42j00j67L10k89J50L72n80J80m9pj53J15q8
2263a19K84j35j4k24J5K85j95k73M51k46k%L05l30K66k81K60k11L04N9k3J67m26
$$ plain form
2105 233 65 -102 43 -116 -5 -233 143 -238 141 111 47 -257 -47 -312 -87 -90 -54 -2 104 88 -58 259
2127 259 104 394 -13 325 -112 121 84 59 -104 93 201 -5 170 -10 27 -174 -39 -163 -189 -27 -21 -77
2149 -77 50 195 52 -50 216 33 273 193 80 130 119 -46 -62 190 -1 51 203 88 251 282 -28 79
2171 79 -200 218 28 -41 15 196 150 -109 -157 -86 -140 102 199 103 -15 305 75 -38 188 -22 122 158 102 -95
2195 -95 50 58 253 -116 224 106 -76 -100 108 -2 102 86 -128 -211 -45 77 -266 22 182 -64 83 338
2217 338 -12 112 30 -26 71 -200 -61 33 -23 179 52 70 -17 57 145 -9 106 -413 -363 -247 103 150 -77 -167
2241 -167 76 -148 -130 -111 -97 190 -376 -155 187 87 -80 230 -59 91 463 -117 63 14 7 -146 -31 -119
2263 -119 165 30 16 -208 -193 92 -103 -376 75 -171 -173 -173 132 -198 68 -213 47 -164 140 199 176 343 -83
2286h3N5k2K63k57L17j83K3l1nj48J53j51O3j36L1K12j9j86K16k84K54k17K45
2309A10j67L9J56k79J66J03K39n73K66n8J39m1l10L01j14J21j9n3J28l76K05K27
2331B10k84j28K07p8l02M73k1k6j66J71p4P9J71j63j77P7R9J53k78J18J38j3j78
2354HM3l0r7j29J0L23k27P8p9K1O9Pj59l1J09J6K21m1o5L9l6j06J49k63N7M4j31
2381b00P3J2K95k02k05J66n0K83l48M83m90K77n5k08J28Q6L9k08K08r5K4p0j72
2404b29J68j80K11j59Q3L42l81J64r6J94l2m5p7J54l00K79p4m44L74K9O7k81L20
2427H7j84k7QQ6K1K8rj08K11j40o3N4J63o6Q3k99n7J83J02j33k3J13p3P3k92L39
2453G7j42j0J49l24R3J08J04k3L6p1j50K1J60k85J55L37j57j74J65j75K18l7J03
$$ plain form
2286 -83 -28 -50 213 -44 273 90 113 82 77 -71 82 -69 -6 -142 -111 101 82 -104 112 -172 82 -135 110
2309 110 -57 -18 138 -141 25 128 367 -206 60 2 141 100 -210 91 -23 98 79 26 154 -222 -17 210
2331 210 -74 -202 5 -73 -375 98 77 51 -115 56 -18 61 232 69 -108 -31 68 221 -57 61 199 186 8
2354 8 51 21 -76 -205 -195 128 -99 -21 -100 -79 -10 -3 -162 -193 -84 -68 153 112 47 86 50 -56 93 -170 -113 -69 -200
2381 -200 -127 -115 180 -22 -227 -61 -111 172 -176 307 -183 94 39 -169 -41 45 84 -124 84 -11 13 -57 -229
2404 -229 -61 -241 -30 -189 -106 236 -145 19 -77 117 85 40 -37 117 -183 96 22 -422 -48 -19 48 -233 87
2427 87 -97 -124 -116 -30 -9 19 10 -98 113 -27 -90 -36 127 61 144 -155 -212 -29 73 -60 -83 30 -43 30 -262 77
2453 77 -65 -75 74 -250 -157 -49 55 32 68 -3 -153 -132 28 -257 -102 235 78 -96 69 -106 112 75 178
2476A78q4j77L11m16K94k62J42K45m17L30l45J54M18m51Q0j67q9K57O9q8Q0j32
2498g0p4L98n60N29k62j27M7K33J70n44M47m04P5J33K85n23P4P4mK32l90J61J01
2521AJ27j92m7M3j79M10l59K28J39J05l10J29j84K93j69J96j33j97j6K75J33k12
2543H1M1j37J04k24K84k1l43n2L48p5j73J54k89K73J48k43j04K05j08j2J15J02
2565G4J7l20L85j52M8l40M97r4l5K27m24Q0K39J49m06O9j60N2m0K89j80l56M80
2588I9j84K40j82R1j22K5J37L0l26L58l43K09j47L40k14j13J41j94J39j53L95
2609B26j95J75l63L07K4k98K34K30m01n8J24K52k56n4K05J04m77K23K03j32o2
2630A1K2l3J83k37K11r3P4k52J61l4K13l73J71Pm1Q3k13J93J2k02kP8J70l82j52
$$ plain form
2476 178 94 -83 228 -188 106 -156 -14 231 -186 144 -201 -47 371 -80 0 -167 -256 1 70 -18 62 -70
2498 -70 -144 254 -306 223 -39 -166 -119 114 284 -260 187 -217 -142 -9 276 -247 -173 -99 -103 129 -261 -100 1
2521 1 128 -64 -111 -68 -247 163 -196 32 171 276 -34 95 -89 204 35 231 98 -99 -115 160 293 81
2543 81 122 -15 89 -135 149 128 -215 -267 81 6 -167 -13 -302 -29 119 -124 -228 -23 -131 -143 -28 74
2565 74 91 -229 156 4 52 -288 209 115 80 307 -117 -37 202 351 -55 14 -146 -94 -134 155 -25 -381 99
2588 99 -85 155 -27 64 -58 -33 104 134 -192 166 -177 32 -115 225 11 -102 39 -155 -16 -169 226
2609 226 31 206 -157 150 174 -124 110 340 -61 -119 5 257 1 -53 152 256 -221 2 205 73 11
2630 11 33 0 183 -54 157 64 138 -114 47 13 226 -147 24 31 -10 73 -140 53 65 -137 -139 -61 109 -273 -425
2655d25N99q0L0k78J07J50J26m01L61l33M2J32J5k05K31kj27O8p6O9k8Q3j70J52
2679D0O0j11J59k3K0k69K50k01n3J24p3m9l7J75j46J27K82j69j53J15k44K72j09
2702a3Q0J94k76m9j4P0L38j79r0J65k52O5n3q8L5J96j3j85P0k36N9L14r4NL92
2727D41m21M4j59nJ25JK05l15J58M3l0m2k77L37r5P4M0q6J77j19k6k15K44qj56
2752f5M7j0O1R5j00k21M14m41K08j01L34k24j31M45q1l17J82k2J13k96rK12j50
2775e7K74k45M0j44Q8M0j15j70J99L09j77ON9K1L7l19l4J10J02k32K29J18K2k06
2799d5j10M9m7K35o1p6N6p6N1J13j5k93L24r5n5k9OJ44J00k32j12K68l6j12M4
2824dO9j76J84O9L6k40J46j9K99k26k17J46j1j31K60l83K76o4J03j24k0PJ42R7
$$ plain form
2655 -425 174 94 124 -154 -47 103 229 -172 189 -144 -102 30 45 -160 71 69 -58 10 -66 3 -25 58 -112 40
2679 40 100 -11 148 125 145 -124 126 -75 -128 -4 -77 -126 -163 12 -134 -7 275 106 -47 68 -176 96 -13
2702 -13 67 261 -15 -64 -78 -8 330 151 61 226 -26 39 -14 -102 -67 129 116 -69 1 -235 -176 138 44 49 441
2727 441 20 64 -95 -100 25 26 231 -84 74 117 87 45 -232 105 10 84 124 38 215 96 70 -145 99 91 -65
2752 -65 -18 -28 33 128 28 -193 221 -220 -12 -113 221 -3 -134 311 230 -87 95 73 186 -110 -119 93 -57
2775 -57 217 -28 12 -132 -44 -4 -119 -289 -90 219 42 48 107 128 165 -154 -188 -78 24 -208 21 139 161 -45
2799 -45 -155 -106 -153 82 21 -55 1 -75 -24 89 74 -219 105 10 -45 -74 -68 76 176 -56 -168 100 64 -48 -4
2824 -4 65 -111 73 142 178 -62 84 65 364 138 -79 67 56 -75 185 -198 78 14 117 -7 -27 -20 122 219
2848B19Kk53J08o6j61J26j15K86k27P8J3j73n3N81l29k1j20R0P8J60j65k0J87
2871B25k33M3l9p2j34K56J59j06j74L88n55Q3J07J91j70j80J31l3K79m87M33n3
2893E9j7J4K5o5K8K3K2r3J6j11J60N7n6J1j32p9k8J33j82J83j4O6mP8j5J0K9j15
2921Cl14K31R7J58j29J84l98R1p2K07J02m31K15O7p5K1l3m7J98k9J50j30k23M36
2945B79l50L25J3k84QN8l2J0j61M2K3K57j25N2k79J63r6J63j78M35k35j99K36
2968A25j3j69j23K59j53K57q6l47K05R3Km00L47r0o0K34k05p3K13K15k16j16K01
2991A00k33P4K80k89j1k7J14J45p6l1j02K19Om56O7K61k4R3l08K62j30J79M0l80
3015b27J35M13o2m65L66j25j64J26k41L10L9j16k08L35k7p4R3o7k05K3J81j99
$$ plain form
2848 219 221 -32 76 10 -151 -25 -140 146 -81 -3 10 -163 -216 365 36 15 -105 -15 63 223 58 38 225
2871 225 -8 35 -4 -76 -210 46 205 99 -75 313 -242 -159 -52 139 -31 -211 -80 -113 166 -321 112 59
2893 59 42 56 81 16 44 67 89 -4 12 -99 61 118 62 73 -59 -138 -166 -33 -215 -32 -46 20 16 94 79 89 118 3
2921 3 -311 -80 17 175 46 230 -168 -77 -149 58 160 -271 -56 11 -64 -43 -76 -123 75 46 196 66 -157 279
2945 279 -71 254 267 -17 -9 49 17 27 -134 -92 -69 188 63 115 -164 -1 -97 66 -112 323 88 -111 125
2968 125 112 -57 -180 79 -74 183 97 -250 -45 48 50 -350 -3 -93 -153 81 -124 -197 16 231 15 -101 100
2991 100 -133 -59 221 -68 -79 -106 8 153 77 46 -56 163 169 -287 -220 41 17 110 -198 64 -66 113 153 -227
3015 -227 -92 321 259 -206 160 35 -129 -3 -244 66 105 -11 -219 116 89 15 108 41 -164 -141 40 -159
3037a59J4J95N1k20K01K1k17j62K57j59O2M38k24l31M05k04m0L0J82j14r9P9k3
3060a7J75k79j5J49R9n1l1M7j99J96j02l4q9J60J99k17o6O2J1M4j61L45j21j95
3084i0k4J10J04k81L89m70K80p5M8R1j00M8j28R7r9j08K36j18j30J10%K43m01
3107b68K96o1N2q3K93m60K20K09k70RM9J64k44L51j80n8j74K40P6k38l3o5N9n3
3131a69L57q0Q4l06J27P7j06j53R8j9R1o3l9J79o0k50K34m6p1J31n7J34k66K77
3155A04qJ18k86j16o8K06kO2N1L5q5J31k71K78k24n8J02J20k61K1K74l88L60J54
3179B49r2q9P1l02J32J33j58l5JJ39n6R5j44K14j97j25J48j05K19q3L22k62k36
3202a61Q9K3k09M67r4k50K85j78l6o4J39j81K25J65k90P0M1j6j76K21N3mN5j71
$$ plain form
3037 -159 -145 50 101 -119 82 103 -114 -276 -19 -178 -116 322 98 -233 172 -32 -72 -42 140 26 -73 6 -17
3060 -17 158 -121 -136 13 112 61 30 77 -122 74 -28 -62 -151 9 208 -9 -75 -13 -2 42 -119 226 105 -90
3084 -90 -114 -4 100 -181 208 -262 18 -57 -9 82 -18 30 -98 -1 -100 -208 28 -90 -220 -110 -110 133 -268
3107 -268 28 -33 19 -64 229 -231 -11 198 -72 -63 -14 150 -94 257 77 19 -155 85 161 -77 -110 -175 -116 -169
3131 -169 188 108 192 -114 13 90 -16 -169 -71 -90 1 -62 -101 78 18 -232 2 -44 -115 16 -41 93 -173 104
3155 104 96 214 -72 -188 -256 -50 -52 10 61 96 11 142 -129 149 -75 -133 -31 89 -172 -151 123 -265 95 249
3179 249 157 68 139 -163 -31 102 -56 -91 -90 49 -7 88 -56 158 -39 -164 -16 -121 98 15 337 75 -161
3202 -161 -72 -49 -258 209 115 -135 150 -28 -64 -128 11 -170 55 220 -70 0 41 25 -151 70 123 119 174 3
3226CN6M1n0j23L1J50j68K26l81K26p8K13l45L52k05J83k63K60j59L2K50l27L69
3249B93l42J14j5J27k74J24q2K17l05k4M40j71j18L0J73l2k51j17O2J53R1r0j23
3272a20J86k88J85q6k0J01R8j53J01j27k4L71n08n2N37l60K68l21RK12R7k16J13
3295Ck6J14J54l13L73k43L7N3l8m02K01M9O4l2o3L07l52j25K17l8j00K39L0k69
3319a60J39L1q2J9L5Kl4nK4J24L1P6j72l66N19p7j95J37j20J55oj3k91M57l45
3344a17K06j72q5K99j25n1j06PR6o9J93o3l9j52L49k8k54K31j34l45J46L31j66
3367d8j02J44l5L6j25J0P1J56J36j86k01K63m28K76m6k0K41K6j16j03J2J90m0
3390A11n4m1o4l7K28J09l84J19k3K15j6l36J42j6J66j11j07j94J01J32J59j94
$$ plain form
3226 3 59 100 50 -73 -42 108 -60 166 -215 11 -67 146 -199 153 -52 131 -132 128 -31 1 251 -76 293
3249 293 -49 65 50 177 -97 27 -55 162 -143 -167 273 102 -16 14 187 155 -96 -213 -151 2 93 3 -120
3272 -120 66 -222 -37 -123 -143 -42 56 -97 4 -123 -147 224 -284 -336 201 -159 109 -212 -203 9 106 -110 3
3295 3 -23 91 245 -68 305 62 99 152 114 -288 -87 -38 26 -6 -69 238 -114 -239 -22 -60 -160 79 109 -160
3319 -160 -21 10 -72 -53 -18 -16 -50 -55 -31 93 124 200 28 -338 181 104 -91 46 -74 81 75 62 -229 228 -117
3344 -117 89 -83 -168 131 6 -45 -151 -144 -48 -117 76 13 -26 -178 171 143 -111 120 -14 -359 -213 118 -48
3367 -48 -150 -6 -41 -5 -130 -120 -49 107 243 57 -144 119 -309 -33 -79 -99 142 168 52 -51 -39 151 111
3390 111 57 16 -48 -85 143 252 -132 -13 -36 179 163 -173 -31 -47 119 8 -99 -293 -192 -60 99 -95
3412i5n4o0J43j3L13q8j63J24k20m3L87r9j19M7m02M15k66L60k58m2K94j44Q0
3435I7m6j20J8K3j41M10j38j29j34L3L16l31O2Q4r1r5J54l5OJ15Q3m2L9k45J88
3460H1J51m27L48j15p5J59k46K19j5j25J22J03K3k89J43Jj11Q5L6p8o2j53P1J33
3484b1L8k08J88J77Q3j95K25m49N1P2J75K2j08K22j22j58N4K8o3j71L7m9R2J80
3508A00k03O8j02K26k40Q6K54j92J6r1nM2j75L98k40M3N8k74K75L6j3j68m6M45
3532B98l00j5J88k02j36L22J8n11J86K76k35K11j45m1k60K86J5O3j63K75p4j23
3554f7K78j36l6Q1q2Q3j40M2K30l34l5J04q0L20k57J57L0ql2M0j00Q4j10J38j88
3579a8J28j19qp1K13j54K33j25r8J38k53lJ01n8j9K21q0j9n9O4J50k08k13J80
$$ plain form
3412 -95 -149 -209 -66 -79 234 146 -17 107 -113 -156 231 132 13 60 -342 73 -193 167 -91 -133 161 17 97
3435 97 51 -69 -51 -28 -169 241 103 -26 -160 -127 189 -142 -80 4 -87 -182 -28 -63 -57 58 141 99 138 -107 81
3460 81 232 -195 153 38 -37 122 -124 95 80 -45 77 180 203 -86 57 58 -53 32 68 -10 -72 -225 -154 -21
3484 -21 17 -191 -3 174 257 62 287 -162 -111 -39 136 158 50 272 150 -8 46 74 11 -160 -123 -172 -80 100
3508 100 -103 -35 -137 89 -151 -65 189 -3 13 -78 -83 -41 -216 182 -58 -15 43 -231 44 80 67 -101 -147 298
3532 298 -2 -17 171 -31 -167 155 173 -338 -152 124 -111 100 -45 -86 -346 -60 -45 18 -145 130 56 -67
3554 -67 211 75 39 120 38 121 -19 23 253 -81 -116 -12 -92 228 -29 128 158 150 118 158 58 142 32 170 -18
3579 -18 110 -9 -17 -88 125 -29 204 79 -19 119 -134 -137 -36 -94 -113 108 28 9 -50 14 164 -44 -257 -77
3603g7J83j78J80j05k69l5K20L45m99N7K99k94K03J44j04k25J78J78l08J63k0
3624C6j55J63J87l20j08K77j12L8m0mo4j1K87j46k04K35j3K4j82J50J46k35R0
3647C9J17j75o0j02J65N2O0q4j80J34j40J57K15j60r5J13j65j73L61r8J80m64
3669c03K12k71L64r2R7J35K5j71J47o2J01k88r4L26n7j4k08K54j35J37K22j86
3691A39j65q2M0Q1ON5l8O4j26j13J95l55M4K72r8qL15l88M4k18L24J21l1P1k16
3716f7J48J52k7m8k93K53j49J96P4k15M0j89J94Q6j68q4K45l51K56o0m3J03o3
3739a0j51J21QO7j45N2L33k12q7K6J49k14R6j14J18m8Qo4P9q9O4J90j36j01q5
3764a45J24j3k87N16k80P8O7k23l1k5J15K37j08Q8nJ1k06K42k27K10k21J34M4
$$ plain form
3603 -77 106 -72 108 3 -266 -301 -81 264 -235 -178 121 -173 30 174 70 -155 23 201 -107 56 36
3624 36 -119 44 231 -89 -197 80 -32 6 -34 -38 -102 -113 174 28 -176 59 46 70 -112 38 184 -51 39
3647 39 156 -19 -79 -181 -16 36 96 12 -168 -34 -174 -17 198 38 -57 56 -109 -282 79 -19 161 -303
3669 -303 -91 -362 2 -90 7 142 167 -4 143 81 182 -106 -200 126 69 55 -153 101 -34 103 325 139
3691 139 -26 -108 -68 13 19 74 36 100 -26 -139 56 -299 -255 17 -81 -89 226 -162 -118 -336 -12 109 78 149 -67
3716 -67 81 233 206 158 -135 118 -31 165 239 24 64 -125 69 155 -13 -97 148 -203 53 -7 -50 53 -10
3739 -10 -161 -40 -32 35 -110 -58 275 63 -24 2 151 -63 33 -81 37 -11 -3 -67 12 -77 -13 177 41 -60 -145
3764 -145 -21 -34 -321 195 -85 -7 60 -163 -194 -219 -104 133 25 113 108 119 -87 155 -72 138 -83 51 95
3787I5J63n93J80K95m17K82K12l60J36J01j30j0m4K62j71J6K38l80j21L15QM8
3809A25j79K22j64M6j20J42j90J50l13L36L74l87l48J57J98r7l8L9K49k73j00
3830a71J17Mq7Q6Q8J1J81l27J32J43j12J16k49J28q4J20N0J8m9l68K91o1N8K0
3854E5j12L11l34j34j41M51n0P2k08mPL8K98k23k05L18P3K2k17N3r6P6p9qr3Q2
3880d8k26J9K39O1M2k33J82p3q8M7n2N1j37K33K14l01J90J31j68k36PK35O3n2
3904A00j32q0J4J76n9r3N5q0O6k27Q1L70j03p6j65J49j9R2l12K70p6j11P5L5M7
3929cr8K23Q3Mj06k37N8J60j42rR8n2Q3o2j38K49j41kJ28k93K07J17l00J85n30
3954e18J07M25L3p6n0j13J48J85N6k58N0J7p3J07o9M4j27K2J63j17m2k3Q6r5k9
$$ plain form
3787 95 258 -335 -155 140 -277 5 217 -143 -7 94 -36 -46 -90 172 1 17 255 -125 -246 69 77 125
3809 125 -54 168 4 50 -70 72 -118 32 -281 55 429 42 -306 -149 49 -48 -86 -47 202 -71 -171
3830 -171 -54 -50 -137 -51 37 48 229 -98 34 177 65 181 -68 60 -24 96 146 164 115 -253 38 -23 35 55
3854 55 -57 254 -80 -214 -355 96 46 118 -90 -94 -87 -49 249 26 -179 139 212 234 17 70 -26 50 -29 -37 -130 -48
3880 -48 -274 -255 -16 45 87 -146 36 -37 -125 -78 -130 -79 -216 17 231 -70 120 251 83 -153 -146 89 152 100
3904 100 -32 -112 -98 78 19 -74 -19 -99 -33 -260 -179 191 88 12 -153 -4 -23 69 -243 27 -49 -160 -85 -50 -3
3929 -3 -101 122 205 209 103 -134 -76 84 -58 -67 31 -21 62 0 -138 111 -30 -32 96 -197 10 127 -173 12 -518
3954 -518 -411 14 47 -29 -79 -192 -44 141 197 -61 -11 6 -67 40 -29 15 -112 -90 73 -44 -86 -109 -23 -118 -147
3979a47L40n07K20j66J19J76l75L22K17k2j31P3J44l43J28QJ24j69J59J06k42
4000C4O9mRj78L70l88J04j8j86K17j29J21n1k49J47J42J91m43J58l7J2K48l31
4023a92L5L12kk2K4m6N5K1p0j70j85L53j49n6O1J30k34jj94M90p8j54L0j4J0J33
4049H7l41K07j35j7j19K02L24l50nR8O3J56J0k55N7k94M88j41J33k30k50L80j57
4072h9j39J95K58l01k01K56m8p2Q4P1L5l37K88K51m55J51L45n29L32K08o7k14
4094B2K17j94j49K43j37J04J29n9k36m1J83J46k78j93J27k70K59R1j46M37n69
4115c14K60J00p7O0Q8l3k00K60j97J90l47K04L28l88K24K8j45J3j25L17p5k69
4137i8J64k40J18J63k24L02j41p4J49l22J88j97K5N67k38o9L2R2j17M14m98j21
$$ plain form
3979 -147 193 -314 -94 -260 -141 35 -340 -18 199 177 46 119 263 -80 48 56 180 11 170 276 34
4000 34 103 99 108 -70 300 -88 16 -2 -188 29 -100 21 -30 -279 -132 10 201 -242 -84 -121 -109 139 -192
4023 -192 -157 155 153 131 155 109 164 185 115 -55 -240 113 -36 -92 -31 99 -135 -136 -330 160 82 -72 -42 -56 -46 87
4049 87 -254 -47 -182 -199 -318 -116 208 -142 -147 -49 14 170 180 -75 -18 -312 176 35 168 -62 -312 68 -89
4072 -89 -228 -33 225 -76 -277 -21 -69 -141 -57 14 49 -288 0 251 -204 -53 292 -237 95 303 236 22
4094 22 239 45 -104 139 2 106 235 176 -60 -101 82 228 -50 -243 -116 -386 -127 -36 -182 255 -314
4115 -314 -54 46 -31 29 117 84 -116 144 -53 137 -210 -6 322 -66 158 186 41 54 -71 246 171 -98
4137 -98 66 -174 -56 107 -117 185 44 -30 119 -203 -15 -212 -187 380 142 73 105 197 80 494 -4 -125
4159a25k8M26l63J29J97L8m09K19J10j59J5KP2j97Jj22K20r6J16J23O2k11J07
4182A27l96M38j3j77K18l13R4Pn7J32j09j61K33P4k2j30k51L76J45l50K73P1m48
4205b39K72j99L21k66j51M53j48K8J49j54j89J49q1K31j76K33k26k7Q9l14K54
4226IJ52o3l26J05k2N8J16K50l99K36j23n9q1j46L42l86K59j0J34j71K78k79q6
4249b12O41p24K60l1K14j26K0L0k6J8n03L68k69M66k60P5J53l21K11l64M50l30
4271b60K5L43j56LM6p5J95k3l3q3o2K62l02J41k21K30k81J42K74k22O4K57L3l59
4295f2O3l7m4j39N1m3J49P2k18J26J07km6J27k6j03O3O0m27L67N4o7k04L17j25
4320A3m2N5O2k14P7j07J8K81l24p3J10K82j20q9k6Q6k36L43J15l19p6K88R6r4
$$ plain form
4159 -125 -153 273 -90 39 236 274 -135 84 194 35 50 52 124 -73 -72 -194 26 -70 46 169 231 20 127
4182 127 -269 169 156 -21 197 -116 -22 -15 -72 60 -49 -210 23 97 75 -55 -306 70 215 -135 138 209 -239
4205 -239 33 -166 155 -111 -262 191 43 71 220 66 -123 26 -55 176 0 233 7 -20 69 -245 9
4226 9 161 98 -228 -123 -145 -87 29 279 -120 116 -7 -66 -147 -293 49 -337 -78 -88 46 -125 153 -126 -212
4249 -212 429 -295 -35 -66 148 22 42 72 46 64 -439 -71 -340 126 -134 -59 94 -227 -16 -380 70 -260
4271 -260 -235 108 -48 -45 1 -74 121 98 65 -18 -80 182 -120 21 -200 30 -251 -109 165 -57 7 264 297 -62
4295 -62 1 -36 -80 -219 -168 -211 -62 10 -208 -82 25 23 -23 104 78 -25 38 98 -329 38 92 25 -179 138 13
4320 13 -29 26 88 -126 -49 -156 -138 143 -181 -254 -144 138 18 -71 -97 -11 -247 96 211 -108 -184 104 200 106
4344A06p8J62k61J1R8L7m0K24l14k24L88l26J10O9J94j21j32L82l85k20K01Q6
4366c3O3j47j4J69l21L22m2J34l1k30O9J34K04n80L21p1K19j07l29K09k65K59
4388f7p0j0P3J98l49K55J15q2n8J04m7r5O9l02Q1Q1P4Q0J1J4j61o8M41p5k11n4
4414e3N9Q0Lk4p6J7n8l8K52k44j88K09p5j16N1M29l70N0lM49l99N6Q2J99l33R
4440c2K06j98J27n1m8M8j49K44k22J49j1j76l7J1K07k64J02K98j48k31j60L57
4462B2l6Q0j09q1K48m7j55J86k96J94O0j88K57l11J93L1n9p4J67l09M11n4j25
4485EL7j26J9J88j27M8r6M49m91J01j0K00k54J69l6K3KJ49l33l8M48m07K12J67
4509B99k37r8q3Q0K19k55P6j24K48M7q4j34J4l1L3k10J49J4K67Q9j72J19l27J93
$$ plain form
4344 106 28 190 -71 -60 38 75 35 259 -55 -279 109 -217 -107 -38 156 35 -97 285 -100 -320 -119 -33
4366 -33 30 -117 -131 38 -283 39 -3 131 100 -130 -61 73 277 -303 18 -53 166 59 -270 -61 -326 -67
4388 -67 -137 -147 -74 124 -225 30 145 63 5 109 62 -33 36 -266 -185 -104 -30 50 61 75 -86 -154 287 212 1 -53
4414 -53 6 86 89 65 -11 6 -52 -90 162 -82 -270 -61 -136 -252 -201 228 -142 -92 -95 354 -45 11 93 292 -41 -32
4440 -32 174 -24 103 52 4 52 -97 147 -75 74 63 -113 -150 -139 68 -196 -94 204 56 -175 -335 22
4462 22 -14 66 -43 -124 124 77 -78 108 -188 6 66 -122 135 -176 17 48 -11 -85 82 -227 184 130 5
4485 5 42 -84 -65 123 -4 44 -52 397 -94 7 -3 197 -57 112 76 99 101 250 -83 -121 327 -80 132 299
4509 299 62 -36 -119 -39 180 -75 1 -123 125 172 88 -46 -32 -63 -30 -240 -91 -77 190 279 107 226 -101 92
4533I2j52n5P1J54Q9k25J38j97O1J03j09oj33L5J79k62J67R9m12K86J51j25J13
4556F2k23K14j64R1j67K43j1JK45l01J48k19L0R9R3l17J79K25j73o6Q5J31o8k08
4580g1J79L5k24J75k38J80J6k98J79J36J89k24M0L1k09K14M6k34K24N6j32q5J69
4603A54j32j23J41m5J22j28n5k52L33J96k65o0J7L2K0j89K86K06k10o4RP2k7k14
4627a76j6M79o9k70K5R8j48K04j52r2k06M53J44m19P3J00l44K05o7J51j10J2j77
4650c02K12L6k0m5q7J9Mj1J56L65l76JP1N3r6K14j24j35%J79j33O6j32r5m7K79
4676E2k37P5j63O08l08K55k91l11K45J69j68l5K20M6j09R4j7m24N47o9k81j86
4698b88M27K25k19J43o36K84K02j92k04L86k97K02n6L4p0r9J85J2r5L4Pk95M59
$$ plain form
4533 92 -60 -115 -44 110 199 -26 112 -85 -24 79 -30 -36 -169 -134 45 -217 -50 49 -363 -77 74 -51 62
4556 62 -161 53 -111 -20 -187 56 45 46 291 -10 138 -81 -51 48 141 -176 3 228 55 -11 74 205 137 -71
4580 -71 108 143 -81 94 -144 36 52 -246 -67 69 258 34 74 105 -104 110 156 -78 146 202 70 -15 154
4603 154 22 -101 40 -5 117 -11 -66 -318 15 211 -54 -114 -97 -65 -45 -234 52 258 48 -16 -7 65 38 -176
4627 -176 -192 287 218 -52 -27 71 -77 127 -25 -117 -323 130 274 -145 -72 28 -316 -111 -178 -27 -137 -125 -302
4650 -302 -90 -54 -74 -119 -206 -187 -183 -194 -38 327 -49 -48 23 76 -20 194 70 -65 -65 114 -19 47 -85 -180 -227 52
4676 52 -185 -110 -273 335 27 282 -9 -320 -75 94 -74 -109 111 157 48 142 125 -299 248 179 -102 -288
4698 -288 139 364 145 288 -348 -64 138 -54 -258 128 -169 33 -23 11 -59 -158 27 39 -56 -22 -15 -310 149
4721A49k95K37j51M3K68j82k71M08r2k68L89l60J21J64j48j62K96m17M3J02P9
4742d7R5N9j59J97l35K80o3r6j31L75k12J96J43k66L7j74L79l90J91j07L5K10
4764B17r6j09j8J9j47n0K19j76j29L85j37k57M00o6pn1L0l0j18K11Q6k2k66Q9
4788b3p1J92K9Q5l71J01r2N6L2J94k50J3P8J16o7q4m7q0L04m05J76J15n2N0k06
4813b07L43J16l08j6J97j98K61o5k37K36j03N9kk11M35l62p0K0J06k26K89q4J2
4836a5R8j99J46k84K80k42K83k7o6m2Q2J31k67J60Q3l24O9L33l66K17Q7l65M6
4859a82L26k28J39k45K63m38L68R4j96J08k82k0J82L09l04J48k02L15j16J00m0
4880I9P0k38J93J62n87L64l54K04J24k43R4J21r1P7j63K88k31K25J67j80k40J1
$$ plain form
4721 149 -146 91 -60 -17 251 69 -202 206 114 -154 235 -125 -4 160 12 -150 146 -271 -228 -126 -47
4742 -47 48 107 -52 145 -190 90 27 -69 -200 175 -37 159 302 36 73 -101 278 -112 79 -28 7 217
4764 217 121 12 -6 13 -134 -184 35 -141 -270 115 -22 -279 121 55 48 -3 27 -3 -121 90 176 154 -112 -23
4788 -23 -94 98 127 212 -159 -58 -150 -94 -62 132 -118 -105 -27 89 22 -62 -109 -189 115 -290 -114 1 -51 -1 -207
4813 -207 136 252 -56 -72 125 -73 188 123 -114 122 19 78 76 -135 300 -62 -132 -112 -6 -232 57 -27 -15
4836 -15 83 -116 30 -254 26 -216 67 40 -26 -68 14 145 -122 38 121 -203 -134 199 -167 50 137 -228 -182
4859 -182 144 -84 55 -190 73 -365 3 97 -99 9 -273 -293 -111 198 -106 42 -160 155 39 139 99
4880 99 169 -69 124 286 -301 63 -291 -87 37 -206 -112 9 -82 -5 -168 120 -111 114 281 101 -139 -128
4902a28L65l49J46j14J92j8k33K61l56L23P9j69m8m0J33j4N0j6j07J27q6J92k67
4925g7L07m47K10k5j27J27R6J3j23j20K01q5l25M89l14P1M5m2J02M6Q8n0n9j36
4949a35m4L94m86N17j92j32K17j77J31n2k59o9N30l12k25J58P1pl7J74J82k66
4971a9K23l65J89j7q9K60l9j87J59r3l1j26r6K73K0j62n4R5J06j50k0J93j32r0
4995a52k7j32L60O0j63j27L90k73K61j49pm0r9j40p7M20O8k25N5m5O6j0J56N1
5019B21k97qj05P3K53l60K20j80J67m1k5J00J75J6j16J51n18M87q7J31j44qK5
5042A30o1l6q2p0P8J06j33PR5l3p7L4r4r7J39J54KJ55j40j9j22P2L7J12k22P3
5068Hn9K4P1J1Q6k52M9K16j5j50K2l9R0J45k71p7L6P8R5k89J57k26L16n1j24J47
$$ plain form
4902 -128 237 -112 34 -80 112 94 -139 122 -234 89 168 -1 -49 -89 44 30 80 64 -43 84 -2 190 -77
4925 -77 230 -217 -7 -32 -159 -32 64 77 -46 -166 35 -50 -375 114 -200 -129 -84 -126 -24 22 110 60 1 -135
4949 -135 -179 215 -271 246 54 -78 139 -38 93 41 -218 -287 243 -69 -294 -136 -65 -72 -109 65 247 -19
4971 -19 204 -161 28 11 -78 182 143 -44 115 22 -9 -135 -231 42 62 -100 -154 -59 47 -103 -123 70 -62 -152
4995 -152 -179 -311 49 109 -54 -181 209 -64 197 48 41 1 -98 -238 -315 105 173 -52 3 -42 24 14 170 221
5019 221 -76 -84 -189 -116 137 -223 -3 -183 -16 -57 -82 18 193 209 93 244 -274 213 126 257 113 105 130
5042 130 69 33 -49 -119 -41 65 -68 -61 34 1 -76 -42 -136 -233 -94 60 62 217 77 58 -64 8 45 157 -65 8
5068 8 -51 -27 44 55 141 -111 -62 154 139 -11 11 -28 62 207 -64 -141 -105 -27 68 -221 -64 -290 26 -25 -149 -2
5094bK0j59J2J97J1l0J37k40M0M1J37j95O3k29J63r6K26p4n9J96K4j15J15j35
5118D8l20J26L58k13p7J69j75N3K09r3j0k24K66k2j83M7K99j31P2j06k10N3J61
5141I7r2j17R0n9j34K30K0l8j77K74j17j53L81j96j03Q5j11R7k8K2R1J26j0l25
5165a47L48q6j34J47m1M7k57r0N65l68k48L83k56J99N9p5K18m96L39k29L80k52
5187Fj62m5J26J87J80k51J63k72NJ53O0j85n1K80l87L73j12k73J05K7P2k45K19
5210b7j22J94j65j68Q3R6K16k03%K06k26K9J10j26O7OJ89n1l12M31j67j08J40
5233I2j91o6M12j43l1j02o2m0q6Q9J45k22K81N8k42P5M75m52j14Q1J71l5J06k44
5257d5j59K28j33Q9N7J36m6K34l86l2K11k79K92m8j11M4J54j01j84m6J78K6K5
$$ plain form
5094 -2 18 -141 -129 68 79 49 186 -54 -14 27 164 -31 32 -197 -34 -130 96 22 -37 159 183 68 183 48
5118 48 -272 -146 212 -1 -78 91 -84 -31 178 85 75 -149 117 95 -88 -41 258 127 199 93 -117 -64 97
5141 97 5 -112 -22 -81 -215 15 35 -3 -180 94 -23 -176 205 9 -94 -9 -120 -23 -51 -29 62 188 178 -147
5165 -147 201 115 -19 128 87 134 -123 -213 352 -16 -264 119 -137 62 121 46 264 -232 107 -122 258 6
5187 6 -156 -201 -75 112 292 41 204 -68 -63 90 150 -35 -86 194 -193 180 68 -205 -100 -73 -1 -246 -27
5210 -27 -149 45 -120 -288 -205 -109 107 -96 -96 110 -116 -87 23 -103 -36 -30 159 108 -204 227 60 -48 92
5233 92 -99 -165 247 104 73 -29 -91 -131 -217 -128 17 -205 76 134 -108 -33 442 -10 -124 -43 128 93 199 -45
5257 -45 -204 24 -109 -20 37 173 127 361 -25 -57 154 -125 167 119 8 52 206 105 -79 -125 53 79 104
5280A04k30J51J00k23j8J78m1P7nj32m9J71j21j23M32l48o6J20K1k0J47k21L32
5303B36j65j40k0p0L65l77K50m1j84K25m3JO1k14p3L62L1q1Ok72J02L3L0J30K
5328A54j1k91M14O0m41j28K04J21k49L9Q3j09L6N67n13j7J06o2P9O4k00L16k51
5351b9J9k05K59j88J28k35J52MK8KR9k4k28L62j18K9J11k13j2J27ol67M25L3l23
5376a70K56q4r2L8J88Jm56L89J45l25P6j12J26Q0K7j42K55j29m9K07j25J00l79
5399a75J72J75k83m4J63J39k36j27L64j66k62L99k27P9J34j79P3J39j14L12l21
5420A5L5j04L4J65k19P9K93n43M15k2qk39j28M80l01j12oJ83j32Q3L77m74J92
5443F3J48j80N6r8R1k44K75k2K4l69L40j61K11Jk99J13J23j42J55j0k61r8N5L83
$$ plain form
5280 104 -126 25 125 -98 -116 62 21 98 93 -39 -88 83 -38 -161 271 -77 -143 -23 -2 -22 125 -96 236
5303 236 71 -69 -89 -159 206 -171 79 38 -146 79 36 37 98 -116 -189 173 204 123 129 -143 -41 -8 22 152 154
5328 154 143 -148 266 326 -115 -243 -39 82 -167 -128 -45 -154 -118 449 -64 -81 25 -37 42 106 -94 222 -29
5351 -29 -10 -215 44 -144 -16 -251 -99 -95 -67 -65 34 10 -218 144 26 55 166 -47 -59 68 62 -305 120 153 -170
5376 -170 86 2 -90 -52 136 137 -319 70 215 -110 -34 -146 -20 60 87 -55 200 71 22 229 104 204 -175
5399 -175 -3 172 -111 -155 8 147 -89 -216 148 -18 -280 119 -108 -29 105 -74 -1 138 24 336 15
5420 15 50 -54 -20 145 -74 5 298 -245 170 148 140 -99 -227 253 -48 -160 -166 17 -115 -32 345 -129 63
5443 63 211 31 87 -11 80 -164 111 89 113 -256 84 -77 134 135 -164 -51 72 -70 85 75 -186 -284 -229 154
5467A54k41k32K10L52k25j1K16k44L9M2k9m0k54K55M8R0j3r7M5M2j61J38q3k02
5491b01L47jj25j29N3o1r3L81J4k62j6Q9P1k53K19r3k0J57k38O1J76O5l19n9K52
5516A5P5r4o0J42k08K01J5L3j36P2l78J88L18k17N4Q8k57LJ75N0J77m48Q0J76
5540F4K71q3k76j06J50M5j46K07o1m9q4J6J03j64L73p8p8O8k90J84j64L02l47
5563a43J77K75m71K39j41J28l4k14l0n5K30Pm2Q0J61j07l1J62k68J7L3J47r2j75
5587a47K61j26n2j30J71J81j36j18rP9L6j93J21M1J38r3L25k59J52m51K16j6l4
5610d3K04o7M5j61L2m5J38k8J21q4K36k38l46K58N3L4O1R8j04k95K27M4j34j41
5634a35%j10M29j20l9o0j86M34j97l09L52j92J29K18j64l0J07j71jj7o2R4j27
$$ plain form
5467 154 -87 -319 -109 243 18 7 223 -21 18 60 31 -9 -263 -8 40 130 117 20 65 107 -54 84 1 -201
5491 -201 146 145 20 -109 -56 -117 -210 171 185 -77 -93 -4 67 -186 33 -60 -80 77 -161 -100 76 141 -178 -237 15
5516 15 90 -4 -64 78 -130 71 86 119 -17 55 -323 -135 183 -34 20 108 -149 -146 29 79 256 -192 -112 64
5540 64 335 252 -24 -130 20 65 -81 126 65 16 -68 -52 51 -113 260 182 104 172 -118 66 -98 204 -143
5563 -143 34 309 -162 77 -64 64 30 -184 -214 -269 -39 -32 -74 6 167 60 29 191 -77 -60 -27 120 28 -147
5587 -147 114 -12 -64 -194 -23 158 22 -96 -105 -26 10 -183 -62 -21 117 24 349 90 242 -209 7 -9 -43
5610 -43 161 94 139 -22 10 -35 103 75 196 112 348 110 -236 22 75 109 170 268 164 -131 96 140 6 -135
5634 -135 -135 -245 184 64 25 -35 -221 213 16 -293 59 -133 -4 214 50 20 127 -44 -45 -62 -124 -30 -157
5657a57K0J44l1K11m30K57P2O5k01K85k02q9K50k27o9K31n6K8P6l41j18K70N9
5680D7o6O0k23J94K2Pj77M7Rk97M34p2R1k79M75K9j14k31O6j67P7J45R7j46l6
5705hJ75p5j29N4J07m4j77L8J61k9o4Lk20K09k50L31m2K8k25K83k96J56j37J48
5729cj23P5J08OMk15k0L26n5J37l58K10j91%J88j33p3K5J17m1O4J62k25k64L90
5754A11N6Rj86p9K06j14r8J29j3L35l44m9J08J72k22j01P9K6j50K05j09J04j54
5777g9J7J1Q7j4l3L13j93j80J55k1Q8l36J19lJ9K22j72J6P0l55J12J1L24l15K12
5802G5K45k98lj40J58k69J89J49j09J21P5k57L09l38P6m6L5J59j8l36J10J52r3
5825e4M5L0r1J61q2J32j35r3L0J49k77O0R8R2J21%l60J52R7j23J65o3j16M6k41
$$ plain form
5657 -157 -137 7 -24 187 -243 14 86 151 -50 235 33 -56 194 -33 -102 129 73 101 177 -164 -282 -12 47
5680 47 -19 41 -182 12 34 41 -136 -89 -80 -377 57 -15 76 -203 272 301 187 -44 22 -145 -68 77 174 28 -8
5705 -8 167 92 -37 17 124 80 -97 -59 102 73 9 12 -208 1 -249 82 40 68 -157 126 -170 -14 -151 -3
5729 -3 -126 -51 57 63 67 -148 -168 158 103 240 -118 92 -99 -99 89 -44 -117 -92 25 -16 48 210 -15 -279 111
5754 111 167 176 -10 -89 117 3 -95 34 21 356 12 -37 71 243 21 -80 -1 25 -125 80 -29 75 -79
5777 -79 -62 -51 36 22 -11 302 109 -71 84 63 151 -185 -66 -69 -50 172 0 16 86 -269 -157 -146 178 -137 75
5802 75 320 22 19 -121 37 -232 -43 106 -3 118 193 -64 245 -93 -17 -63 -28 131 113 -223 -113 39 -54
5825 -54 -9 21 -70 91 9 141 6 -87 -57 92 -185 -125 -27 65 186 186 -174 -22 75 -48 117 54 -62 -16 -257
5850b57l0K85Q0O4m2p1J41k47J81J56m19L63O6k87N7j72K98j0k25k9j56J56K09
5873A11j10K3k41P2L8P6j32J60K11k85K12l75M8K75j24L50l16o6K25q6RO5j49
5896ij50k1K28r4O2r5L85k59k64K40o6O5j25Q2j62L8K74J08L0k76m7j89L08l3
5920C0o1J56q8j99o5K99j09j6l6J42j03K41k95K84j52Nj13j34M3M12k66m4Pj48
5944b10J93l51K02K00J90l83M3Q2k6J42J0p8p2j49K39k5%n6J36O1j21q7j1K12
5968A41k35N5o9O6N1J5o1K1r8L13J04r7r7m12K95QJ90l01J5K92j59JR1p5j57L06
5994B03k93L37k60l5j03K6J79N0k85K43j28K50l21L55j20r1J03l10L45k8J04m45
6016b24K48Kk71L68j52m1j67J51J85k35J54k5j23K58k23J91K00m67K78j47M7m1
$$ plain form
5850 -257 -287 -2 78 142 100 29 170 -77 104 260 -159 204 270 -17 40 -132 166 156 -69 -98 -254 -98 111
5873 111 1 24 -217 -145 -107 -31 -163 -3 208 -77 135 -240 -192 83 -41 309 -7 -73 152 66 75 140 -9
5896 -9 -159 -180 48 -46 16 -79 306 47 -217 23 -43 22 -103 -21 -183 -145 129 237 267 -9 -56 -245 63 30
5920 30 -31 125 37 -162 -227 72 -37 -53 -89 53 -50 191 -104 180 28 33 -80 -214 -171 241 -25 -69 -62 -210
5944 -210 -17 -368 -166 34 224 -159 -116 -34 -60 82 92 14 -58 -207 32 7 7 -49 87 148 27 -60 -71 141
5968 141 -94 -39 -108 -42 9 24 -37 -16 -114 199 303 206 109 -303 -8 0 190 -111 -96 196 37 38 129 54 -103 203
5994 203 -90 247 -13 -48 -151 -125 54 104 -181 62 -66 184 -137 218 98 7 110 -200 145 117 221 -224
6016 -224 24 26 -245 123 -29 -70 -237 -86 99 -136 18 -7 -130 128 -95 96 296 -171 107 -40 7 -34
6038c4M3k56O4N7N9j35J69j20K38kj03%K21j13k23Q3j64J66j53J28j58J5J48J8
6062e2l8q4J24l5K15k47R1O5Rr7r8J54O7k19J44o1k4m9J83k08L72j45k38L09k97
6087a59M78j42q7k58K40P1k45J90n0j17m3P2j78K97k98j22M48j62j19M32l67j
6109a20K60M5n21j4N70l9k75J42J06p7o3j10P6o8J34j83N6%R3O7l21n0P9J02J32
6134B1j99K3L54m75K04L8J1nn9m6K87m4j56J6Q3n9j84J49J69k0j35jJ35n4j16
6159f3n4j39K21J21Kj77j16N4J13n3J2K47j15j64J4k5J65P9MJ25m01L94qk77r2
$$ plain form
6038 -34 9 -247 -183 -126 -67 -202 -33 -153 85 83 -20 -20 201 88 -135 -52 -216 -50 -203 -75 -233 -218 -70 -52
6062 -52 -90 -174 -50 -85 130 -117 -26 39 48 -49 -147 7 74 -145 -1 -62 -86 -135 48 -160 212 67 -171 138 -159
6087 -159 319 177 90 -168 72 143 -102 88 38 -79 -122 -50 -228 69 -229 -351 97 -65 -184 248 -119 -120
6109 -120 140 185 -336 -350 220 181 -94 48 154 77 14 -96 -20 -88 46 -137 -81 -81 12 79 -242 -292 -213 -111 21
6134 21 -178 -155 199 -276 -72 -34 -23 -28 -87 -133 154 110 -46 -30 53 -6 -190 -41 128 108 -27 -28 107 53 -63
6159 -63 -117 -256 -35 86 88 -89 -205 -151 -38 -91 -79 168 53 -111 -97 -122 43 122 126 251 -150 244 236 -41 -133
$$ [...]
8191d8
##END NTUPLES=NMR FID
##END=
