##TITLE=1H_SL31-DAU-A(500)
 CDCl3
 64 sc, 
 6.3.2024
##JCAMPDX= 6.0         $$ Bruker NMR JCAMP-DX V2.0
##DATA TYPE= NMR FID
##DATA CLASS= NTUPLES
##ORIGIN= UXNMR, Bruker Analytische Messtechnik GmbH
##OWNER= root
$$ XWIN-NMR		Version 3.5
$$ Wed Mar  6 18:44:35 2024 Russian Standard Time (UT+4h)  she@DPX200
##.OBSERVE FREQUENCY= 200.1313
##.OBSERVE NUCLEUS= ^1H
##.DELAY= (6, 6)
##.ACQUISITION MODE= SIMULTANEOUS
##.ACQUISITION SCHEME= undefined
##.AVERAGES= 8
##.DIGITISER RES= 18
##SPECTROMETER/DATA SYSTEM= spect
##.PULSE SEQUENCE= zg30
##.SOLVENT NAME= CDCl3
##.SHIFT REFERENCE= (INTERNAL, CDCl3, 0, 15.7039)
##AUDIT TRAIL= $$ (NUMBER, WHEN, WHO, WHERE, WHAT)
$$ ##TITLE= Audit trail, XWIN-NMR		Version 3.5
$$ ##JCAMPDX= 5.01
$$ ##ORIGIN= Bruker BioSpin GmbH
$$ ##OWNER= she
$$ F:/spectra/data/she/nmr/H-F/1/audita.txt
$$ ##AUDIT TRAIL=  $$ (NUMBER, WHEN, WHO, WHERE, WHAT)
(   1,<2024-03-06 18:43:22.78 +0400>,<she>,<DPX200>,
      <created by zg, POWCHK disabled, PULCHK disabled
       configuration hash MD5:
       00 E9 B6 7A A2 85 ED C7 34 08 36 98 17 FE 4E 26
       data hash MD5: 16K
       81 BB 91 CA D4 15 CB CD F9 E7 AE 5F 6F C1 AB 35>)
$$ ##END=
$$ 
$$ hash MD5
$$ CF 60 94 C6 2A 95 2E E7 9D 7A 65 21 AC B2 53 8F
##$RELAX= 
##$RELAX= 
##$RELAX= 
##$RELAX= 
##$RELAX= 
##$RELAX= 
$$ Bruker specific parameters
$$ --------------------------
##$DU= <F:/spectra>
##$EXPNO= 1
##$NAME= <H-F>
##$PROCNO= 1
##$TYPE= <nmr>
##$USER= <she>
##$AMP= (0..31)
100 100 100 100 100 100 100 100 100 100 100 100 100 100 100 100 100 100 
100 100 100 100 100 100 100 100 100 100 100 100 100 100 
##$AQSEQ= 0
##$AQ_mod= 1
##$AUNM= <au_zg>
##$AUTOPOS= <>
##$BF1= 200.13
##$BF2= 200.13
##$BF3= 200.13
##$BF4= 200.13
##$BF5= 200.13
##$BF6= 200.13
##$BF7= 200.13
##$BF8= 200.13
##$BYTORDA= 1
##$CFDGTYP= 0
##$CFRGTYP= 5
##$CHEMSTR= <none>
##$CNST= (0..31)
1 1 145 1 1 1 1 1 1 1 1 1 1 1 1 1 1 1 1 1 1 1 1 1 1 1 1 1 1 1 1 1 
##$CPDPRG= <>
##$CPDPRG1= <>
##$CPDPRG2= <>
##$CPDPRG3= <>
##$CPDPRG4= <mlev>
##$CPDPRG5= <mlev>
##$CPDPRG6= <mlev>
##$CPDPRG7= <mlev>
##$CPDPRG8= <mlev>
##$CPDPRGB= <>
##$CPDPRGT= <>
##$D= (0..31)
0 1.2 0 0 0 0 0 0 0 0.06 0 0.03 0 0 0 0 0.0002 0 0 0 0 0 0 0 0 0 0 0 0 
0 0 0 
##$DATE= 1709736202
##$DBL= (0..7)
120 120 120 120 120 120 120 120 
##$DBP= (0..7)
150 150 150 150 150 150 150 150 
##$DBP07= 0
##$DBPNAM0= <>
##$DBPNAM1= <>
##$DBPNAM2= <>
##$DBPNAM3= <>
##$DBPNAM4= <>
##$DBPNAM5= <>
##$DBPNAM6= <>
##$DBPNAM7= <>
##$DBPOAL= (0..7)
0.5 0.5 0.5 0.5 0.5 0.5 0.5 0.5 
##$DBPOFFS= (0..7)
0 0 0 0 0 0 0 0 
##$DE= 6
##$DECBNUC= <off>
##$DECIM= 32
##$DECNUC= <off>
##$DECSTAT= 4
##$DIGMOD= 1
##$DIGTYP= 9
##$DL= (0..7)
0 120 120 120 120 120 120 120 
##$DP= (0..7)
150 150 150 150 150 150 150 150 
##$DP07= 0
##$DPNAME0= <>
##$DPNAME1= <>
##$DPNAME2= <>
##$DPNAME3= <>
##$DPNAME4= <>
##$DPNAME5= <>
##$DPNAME6= <>
##$DPNAME7= <>
##$DPOAL= (0..7)
0.5 0.5 0.5 0.5 0.5 0.5 0.5 0.5 
##$DPOFFS= (0..7)
0 0 0 0 0 0 0 0 
##$DQDMODE= 0
##$DR= 18
##$DS= 0
##$DSLIST= <SSSSSSSSSSSSSSS>
$$ [...]
##$SUBNAM2= <"">
##$SUBNAM3= <"">
##$SUBNAM4= <"">
##$SUBNAM5= <"">
##$SUBNAM6= <"">
##$SUBNAM7= <"">
##$SUBNAM8= <"">
##$SUBNAM9= <"">
##$SW= 18.0517328524113
##$SWIBOX= (0..15)
0 0 2 0 0 0 0 0 0 0 0 0 0 0 0 0 
##$SW_h= 3612.71676300578
##$TD= 16384
##$TD0= 1
##$TE= 0
##$TE2= 300
##$TE3= 300
##$TEG= 300
##$TL= (0..7)
0 120 120 120 120 120 120 120 
##$TP= (0..7)
150 150 150 150 150 150 150 150 
##$TP07= 0
##$TPNAME0= <>
##$TPNAME1= <>
##$TPNAME2= <>
##$TPNAME3= <>
##$TPNAME4= <>
##$TPNAME5= <>
##$TPNAME6= <>
##$TPNAME7= <>
##$TPOAL= (0..7)
0.5 0.5 0.5 0.5 0.5 0.5 0.5 0.5 
##$TPOFFS= (0..7)
0 0 0 0 0 0 0 0 
##$TUNHIN= 0
##$TUNHOUT= 0
##$TUNXOUT= 0
##$USERA1= <user>
##$USERA2= <user>
##$USERA3= <user>
##$USERA4= <user>
##$USERA5= <user>
##$V9= 5
##$VALIST= <valist>
##$VCLIST= <CCCCCCCCCCCCCCC>
##$VD= 0
##$VDLIST= <DDDDDDDDDDDDDDD>
##$VPLIST= <PPPPPPPPPPPPPPP>
##$VTLIST= <TTTTTTTTTTTTTTT>
##$WBST= 1024
##$WBSW= 4
##$XGAIN= (0..3)
0 0 0 0 
##$XL= 0
##$YL= 0
##$YMAX_a= 151332
##$YMIN_a= -200071
##$ZGOPTNS= <>
##$ZL1= 120
##$ZL2= 120
##$ZL3= 120
##$ZL4= 120
##$ABSF1= 10
##$ABSF2= 0
##$ABSG= 5
##$ABSL= 3
##$ALPHA= 0
##$AQORDER= 0
##$ASSFAC= 0
##$ASSFACI= 0
##$ASSFACX= 0
##$ASSWID= 0
##$AUNMP= <proc_1d>
##$AZFE= 0.1
##$AZFW= 0.1
##$BCFW= 1
##$BC_mod= 2
##$BYTORDP= 1
##$COROFFS= 0
##$CY= 11.3945322036743
##$DATMOD= 1
##$DC= 2
##$DFILT= <>
##$DTYPP= 0
##$F1P= 15.7292609196834
##$F2P= 12.9074282941183
##$FCOR= 0.5
##$FTSIZE= 0
##$FT_mod= 4
##$GAMMA= 1
##$GB= 0.15
##$INTBC= 1
##$INTSCL= 1
##$ISEN= 128
##$LB= 0.24
##$LEV0= 0
##$LPBIN= 0
##$MAXI= 10000
##$MC2= 0
##$MEAN= 0
##$ME_mod= 0
##$MI= 1.114404
##$NCOEF= 0
##$NC_proc= 0
##$NLEV= 6
##$NOISF1= 3.799351
##$NOISF2= 2.8
##$NSP= 1
##$NTH_PI= 0
##$NZP= 0
##$OFFSET= 15.70392
##$PC= 1
##$PHC0= -24951.38
##$PHC1= 22.18731
##$PH_mod= 1
##$PKNL= yes
##$PPARMOD= 0
##$PSCAL= 0
##$PSIGN= 0
##$REVERSE= no
##$SF= 200.130013532006
##$SI= 16384
##$SIGF1= 3
##$SIGF2= 2
##$SINO= 400
##$SIOLD= 16384
##$SREGLST= <1H.CDCl3>
##$SSB= 0
##$STSI= 0
##$STSR= 0
##$SW_p= 3612.71676300578
##$SYMM= 0
##$S_DEV= 0
##$TDeff= 0
##$TDoff= 0
##$TI= <>
##$TILT= no
##$TM1= 0
##$TM2= 0
##$TOPLEV= 0
##$USERP1= <user>
##$USERP2= <user>
##$USERP3= <user>
##$USERP4= <user>
##$USERP5= <user>
##$WDW= 1
##$XDIM= 8192
##$YMAX_p= 0
##$YMIN_p= 0
$$ End of Bruker specific parameters
$$ ---------------------------------
##NTUPLES= NMR FID
##VAR_NAME=  TIME,          FID/REAL,        FID/IMAG
##SYMBOL=    X,             R,               I
##VAR_TYPE=  INDEPENDENT,   DEPENDENT,       DEPENDENT
##VAR_FORM=  AFFN,          ASDF,            ASDF
##VAR_DIM=   8192,          8192,            8192
##UNITS=     SECONDS,       ARBITRARY UNITS, ARBITRARY UNITS
##FACTOR=    0.0002768,     1,               1
##FIRST=     0,             0,               0
##LAST=      2.2672688,     0,               0
##MIN=       0,             -200071,         0
##MAX=       2.2672688,     151332,          0
$$ Real data points
##PAGE= N=1
##DATA TABLE= (X++(R..R)), XYDATA
$$ [...]
1792a18J0J17Q3p6l7N8J66k93J5P5J91m9r3j8p0J40k16J84Lj55J24m6r7J33k01
1817a70N1P9p8R8J11J27j91J8R2l58K41O1k54J01k08L08N7j91L60j75k4j6j85
1840a46K67j10J52k42K15n7k17K97k5r6k40J19J04Q9q4LL6k47O08j23k69j89O1
1863i4J05j57Q1J93k0j85Q5L6j60J27j68K28j63P0P8J5k50J5L85k67N7l19K99
1886iqK8r5K58q7l23L64Oj58J6J50k59K96k56p5K26n8k41K76Ok3K30l28l0J55
1911F1m7K13k66J2R6K0j29j16K13jo3j10K09M4J11l53J32J80o2l01L29j94j52
1934a74J6K18k36L18Nj64J52k41J4j96N00j33j18j34L39Q7j96j10L0J51N6k08
1956b4M4j10J47J00j36%k5J02j26j29J05R4k09J55m4O2J68k05r2K24l08J43R8
$$ plain form
1792 -118 -108 9 92 16 -21 37 203 -90 -75 0 191 142 49 31 -39 101 -115 69 72 -83 41 -5 -102 31 -170
1817 -170 -119 -40 -118 -20 91 218 27 45 137 -221 20 81 -173 -72 -280 28 85 -106 254 79 55 39 -146
1840 -146 121 11 163 -79 136 79 -138 159 134 38 -202 -83 21 110 26 29 65 -182 426 303 34 -155 -94
1863 -94 11 -146 -65 128 108 -77 8 44 -116 11 -157 71 -92 -22 56 71 -179 -164 221 -46 11 -308 -9
1886 -9 -17 11 -84 174 87 -236 128 134 -24 -8 142 -117 179 -77 -152 74 16 -225 51 57 34 264 -64 -94 61
1911 61 14 227 -39 -27 69 89 -40 -156 57 56 -7 -117 92 136 247 -106 26 206 144 -157 172 -22 -174
1934 -174 -158 60 -176 142 147 -17 135 -106 -92 -288 212 79 -39 -173 166 253 57 -53 -23 128 184 -24
1956 -24 20 -90 57 157 21 21 -4 98 -28 -157 -52 42 -167 -12 -56 6 174 -31 -123 101 -207 -64 34
1979C4j61J18q5J86K04k31r1L8J12j44q4N8L09l11J36k22l8L3J75k09R9o0K65
2002A31J08k03J95k27p1K49l1j30J48k01K3P5k18J30J21L9j05J10m8m1o0J28j12
2025A0l10K56J9m8L06r7j95k6p6K72n2n8j72J67p7NJ93o0j57O5p5J76m60N37l1
2050A12j00mK96k62k30K38j29O5q3J6r2K63p5J18m88M54k70L05k98J80k45L42
2072A13q4k40L59j93J8Q9J52j00l6j74L31q4n5k04N7j02L00k69J23r1N1o1L9J02
2096D1J53j39q8q5K07j16k38M03j97j18L16k30J98N5Pk19P6l5K54p2R6j74l13
2119b18L49m8j5L9k8l67M41m4k23Q6j40j3J71J21N6n8L3k16Q8q5K7j07K64r6R5
2144A12l23O2K83K1kk62N3j5J07rJ69o2j06j70J39J11l32K62k90J79R1o6k2j5
$$ plain form
1979 34 -127 -9 -94 92 296 65 -26 12 124 -20 -104 -46 263 -48 88 -134 -172 -139 36 -173 -74 -134 131
2002 131 239 36 231 4 -67 182 151 21 169 -32 -9 66 -152 -22 99 138 33 143 95 54 -6 122 10
2025 10 -300 -44 -25 -73 233 136 -59 -85 -161 111 59 1 -171 -4 -81 -76 117 57 -100 -35 -110 66 -394 143 112
2050 112 12 8 304 42 -188 50 -79 -14 -97 -81 -173 90 15 133 -355 99 -171 134 -164 16 -229 113
2072 113 29 -211 148 -45 -27 62 214 114 78 -96 235 151 96 -108 -51 -153 147 -122 1 -90 -39 -100 -61 41
2096 41 194 55 -33 -118 89 -27 -265 138 -59 -177 139 -91 107 162 169 -50 26 -9 245 173 269 95 -218
2119 -218 131 83 68 107 79 -288 153 109 -114 -28 -168 -181 -10 111 167 109 142 -74 14 -71 -44 -151 113 17 112
2144 112 -211 -149 134 155 153 -109 -56 -71 36 27 196 134 28 -142 -3 108 -224 38 -252 -73 18 -48 -70 -85
2168h5J68kj14M3J0L7R2P9j00k24o7K52j08K65k02j59J46nJ51j83J82k44J24M5
2192A01J3k43M1R6l3j76J71j85K33l0k78L29j83M26k32J12l1j87j61r1K74n0%
2215h4J57l9j9l21J85Q9N2r1J7Q6j14K03P9l42K4j47K09j68J25M15m34J94j55
2238g9j17N7M1L55j55l7p8P9j72K11O0k2j48Q7J12j71RJ9R5k88M46k95K7R2k90
2263a62J94J06k6j1M2j44M4J7J06j41qn2Q4k33R1J75j26J39k12L19j87j34J29
2286A0j3j32R3p9J11k6O0JP6k65J01L4J1j03k1O0M0m8J46j9J83k99Q7J80n58M70
2312A00n3n0j8O0r5q2L40m51L16m7m8K13j50j95J33J19m6l56L75m22l1K65L0R1
2336bl7q9m3K02n2J69n2j39j26K07P0j03Pj89l0K98k48O5m1L55m2k95R3j01O2
$$ plain form
2168 -85 83 81 -33 10 20 57 149 228 128 -96 -163 89 -19 246 44 -115 31 26 177 -6 176 -68 56 101
2192 101 114 -129 -88 8 -25 -201 -30 -215 18 -12 -290 39 -144 282 50 162 131 -56 -217 -308 -34 -84 -84
2215 -84 73 34 15 -306 -121 -32 20 -71 -54 32 -82 121 200 -142 -118 -265 -56 -224 -99 316 -118 76 -79
2238 -79 -196 -139 -98 257 102 65 -13 66 -106 105 165 143 -5 82 194 23 32 51 146 -142 304 9 36 128 -162
2263 -162 32 138 112 101 143 -1 43 60 166 25 17 -35 49 -184 -93 82 -44 95 -117 202 15 -119 10
2286 10 -3 -135 -42 -121 -10 -36 24 25 101 -164 -63 -29 -18 -121 -142 -82 -42 -90 56 37 220 -79 8 188 -370 100
2312 100 47 -3 -21 39 -56 -138 202 -249 67 20 -28 185 35 -160 -27 92 46 -310 65 -357 -388 -123 -93 -2
2336 -2 -39 -128 -171 31 -21 148 96 -43 -169 38 108 5 12 -177 -207 91 -157 -92 -133 222 180 -115 -22 -123 -61
2361f1K73l73rK31j5K6l05K83M7j44l1p3k1m2J00L10l8j76n5J71j9j91K84j28
2385D4j18K01Q6p5j63J26n8k58J84j8J7M7K12k05L4J25k03lJ48m35K63K07R3k39
2409A2K62k17j41r3L84j84J18J4j10j82L50k30o0J96k25m4J66j09j91M10j75J16
2431F7kN9l19J95q8K11J2R3k07k64L83q1k44L81o6n6P5j70L6nk4j37P0K43j97
2456c5J47m59M05J04j60j97L9R9j22K44P4j88P6J71j22m19K60m3P2M31l04mq3
2479a4R8j47K47km00m5L08j9N0mN7m27K76k6N0j93K82j31K02k53L4J71n2j7m1
2504DKk35M14r0k35J1M77j87l05K07j5j8J15j56R4j7o7P1k77M09k63l8J16J85
2528B02m01J79P7j81K44l81J83R8j16M0j8K04Pj72N2j4J05o8J59P7o9o4j7M2o0
$$ plain form
2361 -61 212 -161 -170 61 46 72 -233 50 97 -47 -78 -151 -172 -214 -114 196 158 -18 -73 98 79 -112 172 44
2385 44 -74 127 213 138 -25 101 43 -215 -31 -49 -32 15 227 22 56 181 -22 -25 123 -312 -49 158 251 12
2409 12 274 57 -84 -177 207 23 141 155 45 -137 213 -17 -77 119 -106 -150 16 -93 -284 126 -49 67
2431 67 65 124 -195 0 -88 123 135 228 21 -243 140 59 -185 196 130 74 149 -21 15 10 -14 -151 -81 162 -35
2456 -35 112 -347 58 162 2 -195 -156 -57 -179 65 139 -49 27 198 76 -343 -83 -126 -54 377 73 69 -14
2479 -14 84 -63 184 182 -218 -263 45 26 76 72 129 -298 -22 -48 2 -191 91 -40 162 -91 -57 114 62 45 4
2504 4 6 -229 185 95 -140 -129 348 161 -144 63 48 30 145 -11 83 66 -1 70 -207 202 -61 -99 17 202
2528 202 -199 -20 57 -124 120 -261 -78 20 -96 -56 -74 130 137 -35 17 3 108 40 199 276 207 143 126 168 108
2553A08p7l3J80n8k34k31L79J54O0o3k22J30M0l49J18J37OJ07k17J7j2n0Q5J90
2577A65k6k6r4j22j35L12m7%K94k22j33J49n3P0k33L16l01P0K03l61L83l22k46
2600c59L60R1k46L41k7j16l29J55K59j82Rk7K93k16K00j52o4M3%R3k08K7P8j8
2624EN0J40k48N7%O2k0l3j18Q0J23j30R3n0j87J98m2K9l0m3m9J90l10J86O5j0
2650HK90l40K5J2j06J12K9j88K0L82l1j43j4L0o9p1j07R4m9K64j87j89J87J64
2674A23j71R4l12K96M7q6j44K51n8r3O3j54K92j82J36m0p7j30J88jO1j61Q5J06
2698A33j47Jk55K21J81n2l26L19j84L24m84K03N9Q1j20kj32K50j68N0M0k03K95
2721H4k70K95k21J86J25j86LJ48r1j95O4Q5J69j84K2j15N7J67j17k72J24J23o
$$ plain form
2553 108 31 -2 178 120 -114 -345 34 188 248 185 -37 93 133 -216 -98 39 45 152 -65 -48 -60 -110 -25 165
2577 165 139 113 19 -103 -238 74 27 27 321 99 -34 115 62 132 -101 215 -86 -16 187 -174 209 -113 -359
2600 -359 1 92 -154 187 160 44 -285 -130 129 -53 -44 -71 222 6 206 54 -10 33 33 126 -82 -55 23 5
2624 5 55 195 -53 4 4 66 46 13 -105 -25 98 -32 61 11 -176 22 -20 9 -21 -64 -113 77 -233 -47 18 8
2650 8 298 -42 -17 -5 -111 1 30 -158 -138 244 213 70 56 86 17 -54 -161 -67 -116 148 -39 -228 -41 123
2674 123 -48 46 -266 30 77 -9 -153 98 40 -53 10 -144 148 -34 102 62 -15 -145 43 42 103 -58 27 133
2698 133 -14 -13 -268 -47 134 82 -244 75 -109 215 -269 -66 -7 74 -46 -48 -180 70 -98 -48 -8 -211 84
2721 84 -186 109 -112 74 199 13 16 164 73 -122 -58 27 196 12 34 -81 -24 143 26 -246 -122 1 -5
2744eJ31j37M8p1j60K34k9J13n6Q1j53l4J97j72R2j17l0J17K0l9Q2j81Q7Jk6o5
2770g2J19j94Q1mp4j07L42k54J32J2nJ40j19k46J87O6P5k8q5J94n7j57j14R3O6
2795ij18l3j6M39l19k1J42j80J88q1q3K56l16J20L06m50N4L60k28M9k92K29J13
2818A10j9M0j41J1M9j55L26j22p6q9lJ34K68l18k51L11j39J16q5j29l7K71Qj2
2842F8j90L45k21J07j46j07K6J77p8Kj9k84N33j91j33KL54j25n9L7l7l62L92N1
2866A42k57M4L14k13Pp7MJ56N9l45L47j26L2l6J66l17P4O2j96J01O7o2k1L8k9
2891f6J07l7J3j42%J32k2J19l05J64J6J58q9j24J64l20J07k1M5K18k06J72L2j38
2915b3O1j01J58j47J62j42L9J44j91J23j45O3k7J14O7J4j97J20j10P4QQj62J0
$$ plain form
2744 -5 126 -11 37 -34 -194 40 11 124 68 149 -4 -38 159 -13 79 -38 -68 49 69 30 112 -69 18 19 -7 -72
2770 -72 47 -147 -66 -70 -144 -251 91 -163 -31 -19 -24 116 -3 -249 -62 4 79 51 -34 160 103 -54 -168 -75 -9
2795 -9 -127 -160 -176 263 -56 -77 65 -115 73 -8 -91 165 -151 -31 275 -175 -121 239 11 60 -232 -3 110
2818 110 91 131 -10 1 50 -105 221 99 23 -66 -69 65 333 15 -236 75 -64 52 -33 -162 -199 72 80 68
2842 68 -122 223 2 109 -37 -144 -118 59 -19 -17 -36 -320 213 22 -111 -109 245 120 61 98 61 -301 91 142
2866 142 -115 -71 243 30 37 -40 -36 120 179 -166 181 55 87 51 217 -100 -26 36 -160 -59 8 -54 -75 -37 -66
2891 -66 41 4 17 -125 -125 7 -15 104 -201 -37 -21 137 48 -76 88 -232 -125 -146 -101 117 -89 83 115 -23
2915 -23 38 -63 95 -52 110 -32 7 151 -40 83 -62 1 -26 88 155 169 -28 92 -18 56 64 72 -90 -80
2939h0m4L21l39K92K68n60J32J71m7r6j2J37j48J56m8k47J6j7J98j69j29K76K60
2962B91j95j50j3p3j99O05m16K36K7Q2j77J55j96nL4m7l6M9O5nj43P2k6J24l8
2987B1k36J00K12m9k9p9j22L5K74Rr1J67k84J07m8RK08m22L02j29J50l25J61K19
3011A60j31J34jo4j88j04J08K00n4k43J91J88l99K25K54k16j10J89j5j44j06q0
3033b06J46K29O6j53p9j69P0j49J28J67j65K53k79J17r2J59p3L34l06J5J09N6
3055A78k19k05J87J82k81o9J70K2k26J62j71L05J6p4j0J50j53R5r4N7m4J7Po3
3079f1K3j22N4J83M4k0j80K92j64L0n8P7l66K89r9O8m3q9Q0L2k2J77j89J85j55
3104c4O3j08p2J13n0J85nN2j15o5J64j2j52J67j71j64L06j16k30J37K08k48P5
$$ plain form
2939 -80 -124 197 -142 150 418 -142 -10 161 114 18 6 143 -5 151 103 -144 -128 -145 53 -116 -245 31 291
2962 291 96 -54 -67 -140 -339 266 -150 86 113 195 18 173 -23 -28 6 -41 -77 -28 37 32 -111 -39 -65 59 21
2987 21 -215 -115 97 48 19 -60 -182 -147 127 136 45 212 -72 35 -13 -4 204 -218 84 -45 105 -220 -59 160
3011 160 29 163 162 98 -90 -194 -86 114 60 -183 8 196 -203 22 276 60 -50 139 124 -20 -126 -206
3033 -206 -60 169 235 82 3 -166 -96 -245 -117 50 -115 138 -141 -24 -116 43 -30 304 -2 13 122 178
3055 178 -41 -246 -59 123 -158 -227 -57 -35 -261 -99 -270 35 51 -23 -33 117 -36 59 -35 22 -22 -5 2 -61
3079 -61 -38 -160 -106 77 121 101 -79 213 49 79 21 98 -268 21 -78 -10 -53 -142 -62 -30 -52 125 -64 121 -34
3104 -34 29 -79 -151 -38 -88 97 92 144 29 -36 128 116 -36 131 -40 -204 102 -14 -244 -107 101 -147 -72
3127g2Q1J87k01M9l8R1n3j15P0j70K79k29J16j17J16J3k3K33k53L9j60K00Q5P0
3151A98l9k37J15k12L20n4L03l83k29K99J8j83J68j10o2J01mJ87j19j36J66M9
3173A56k47N8k0n3N5j10J36j71K59r0q2J39k15J68j67J56R1k33J38J92k65k36
3195c41M30p5j04p0M20j72j2j25j07J26J05K2k34Q0l06M87k99O8P2K19k23p3O07
3218D95m57l55K52K44k19o7K54k36J53J59n09L28j98J85J24k87O9R8L6q0P9p5
3240gp8J74j08J65l37Q0J24k62R0K77j97k6L36j87oK77k32j52K8m2K38k77L74
3263B52j99J28k87J28j80L58l81j31M75j79j38J76p6k3R2l0K5o0L7m5K37mm72
3286b97J29K71M9k96K88j81q6J96J57k27J3l2J20o3p0N2L4j01k65N30k75N0k84
$$ plain form
3127 -72 9 196 -5 44 6 97 44 -71 -1 -171 108 -121 -5 -122 -6 7 -16 217 -36 3 -157 43 128 198
3151 198 159 -78 37 -175 145 91 394 11 -218 81 99 -84 84 -26 -88 13 9 196 77 -59 107 156
3173 156 -91 -33 -53 -106 -51 -161 -25 -196 63 -27 -109 30 -185 -17 -184 -28 63 -170 -32 160 -105 -341
3195 -341 89 14 -90 -160 260 88 76 -49 -156 -30 75 97 -137 -57 -363 124 -175 -107 -35 184 -39 -112 495
3218 495 38 -317 -65 179 -40 -107 147 -89 64 223 -286 42 -156 29 153 -134 -65 33 69 -11 68 -7
3240 -7 -85 89 -19 146 -191 -111 13 -249 -159 118 -79 -105 231 44 38 315 83 -69 -41 -83 155 -122 252
3263 252 53 181 -106 22 -158 200 -181 -312 163 -16 -154 22 -54 -77 15 -15 10 -50 -13 -58 179 175 -297
3286 -297 -168 103 152 -144 144 -37 -123 73 230 3 16 -16 104 41 -29 23 57 -44 -309 221 -54 -4 -288
3309b88K84Q1J68k24J3k69J72O5R2k02m3M18k37J31J19j99J3o0j87N7J98k37Q7
3332d8N4r4JJ00O4j57J35j25P2J61k03j24K09o1P7k2k4k64L43k22K50l00L75j09
3356H8O6J0j11q9Q7K1J59p4l10J73j60J0K98k02j24K25j77P8l10L62NJ4Q6n8j40
3381g3Q1R4j84j7J6j9L03j35J1J97l96J19j50J56o2j58n1L33m5l3j75J99j55K03
3405E9M0j27J24l82J93kJ69mk65O4m9o6L09j42Q7j54L29q7j04Q4j32J56j10k6
3429c6q2j9L07n3J2j75RJ09j83J92l4l8J04J24l43J34j92K28k71Q2K8n8J00P4
3453A9k1j2J08K8l7O3o7n9k51K67M4j36J03OM0k45K43J55r0m8n6N0L7J31l78J37
3479C1J83p7j44M3J09k49k3K88l05M77l91m2K28k8q8l9j17j7K22l97J94J07k61
$$ plain form
3309 -288 -4 77 245 21 34 -235 -63 2 94 -108 -151 267 30 161 280 81 94 34 -153 -96 102 -135 -48
3332 -48 6 -88 -87 13 77 -80 55 -70 2 163 -40 -164 45 -16 61 39 15 -249 94 -128 122 -178 197 88
3356 88 154 164 53 -36 51 72 231 157 -153 20 -140 -130 168 -34 -158 67 -110 -32 -342 20 25 39 125 67 -73
3381 -73 8 102 -82 -99 -83 -102 201 66 77 274 -122 -3 -153 3 -59 -217 -268 65 20 -13 -188 11 -144 59
3405 59 99 -28 96 -286 -93 -95 74 70 -195 -131 -180 -246 63 -79 8 -146 183 96 -8 76 -56 100 -10 -36
3429 -36 -118 -137 170 117 129 -46 -37 72 -111 81 47 9 113 237 -106 28 -164 64 -207 -125 -97 -155 -55 19
3453 19 -2 -14 94 122 85 148 81 22 -229 38 82 -54 49 55 95 -150 93 248 158 110 54 104 141 272 -106 31
3479 31 214 137 -7 36 145 -104 -127 161 -144 333 -58 -100 128 100 12 -27 -144 -161 61 -336 -142 -35 -296
3502b96K77j80K34k5k16QK68m9k43L18l70K41j68J51M5O8o6L5k04K49p6O4J8m82
3526c99K85J14j0J28J4KR3m05K65k17J54J76j90j16jK77p0j05P5nl58N07j68j97
3550a51J87k09RJ03Q5J8j43m2L49k90p8K22K3m2l9O1k75J36j9q8K82M2k21J66
3574H6Q1k80J31Ok32K98j00J11k76J45O3j97R4nM1K12j51q1k21K17pK30J3n8J32
3599B52o1kj68k3J4J02j83J31j08J83j75j02P7J28n9J41j7nk08j4J91J66n3l16
3623a09J65p6J00j82l7K32j39J54J03l07J20k97K70J20j89P5J66p6j96R6o5n6
3645a28J81jj55j6LM50n05K2M47m41K65Mm11K81K8L7K81l88l8J57j19M31l82l8
3669c5j17l1J80n8Q0K03j55J1j12j97J22L6%R4j08J61j69J30Nj64J01j33N8J79
$$ plain form
3502 -296 -19 -199 35 10 -206 -198 70 21 -222 96 -274 -33 -201 -50 -5 63 -3 32 -172 77 1 65 83 -399
3526 -399 -114 0 -10 118 132 134 227 -178 87 -130 24 200 10 -106 -107 170 100 -5 70 65 -293 214 46 -151
3550 -151 36 -173 -164 -61 24 42 -101 -143 206 -84 -162 60 83 41 2 63 -212 -76 -95 -183 99 141 -80 86
3574 86 167 -113 18 24 -208 90 -10 101 -175 -30 33 -164 -70 -75 -34 178 27 -54 -275 -58 -65 165 178 120 252
3599 252 191 189 21 -2 12 114 -69 62 -46 137 -38 -140 -63 65 6 147 130 125 -83 -97 94 260 207 -109
3623 -109 56 -20 80 -102 -139 93 -46 108 211 -96 24 -273 -3 117 -72 3 169 93 -103 -7 -72 -128
3645 -128 53 52 -103 -119 -116 334 -171 -149 298 -143 122 126 -285 -4 24 61 342 -46 -84 73 -46 385 3 -35
3669 -35 -152 -183 -3 -61 19 222 67 78 -34 -231 -109 -73 -73 21 -87 74 -95 35 40 -124 -23 -156 -98 81
3693H1K88o08J26K43j42J95j88p9N7o6K9l5J08j17R4j13k8k9K50l7j36J39o0l5
3717f3K38J0l44K68r8k43L38m02N98m9l09L4K16q9m14L08Q0n3P9k22R3J9m7J73
3741A21j74K62l32k6M9l4M7L7L6K30m49J20L0J75O6n0L9k40K41l28l4L36k00k3
3765a01J19j11QQ4m7j84L80j16R9M4k18k91K00qM93m06l6q1K03m2K7Oj13J38j32
3790h5k08Q0K87j16K13k40J49k1P8j02l4K6M6l13L09Q3J26m8m29P3k1J77N6k06
3814a20J53p5kN1K72k62r6N2j41J69j46N05n08J11J85k79o1M46p0k02L4j17P9
3837b2r4J79M8j22k7j13K50rl46N16j64j99K46nr4k4j6J39p4L6J27j11Q7j41M8
3862A15k28m1O1K8J6P9J52j65j44J20oq7Q5m0L05j10j08j52J74j01N9k4J03K06
$$ plain form
3693 81 369 -239 -113 130 -12 183 -5 -84 -27 -93 -64 -99 9 -108 -14 -127 -155 -184 66 29 -107 32 -28 -63
3717 -63 175 185 -159 109 11 -232 106 -296 302 253 -56 -22 194 105 -309 -1 79 26 105 -117 -24 -5 -52 121
3741 121 -53 209 -123 -149 -100 -134 -87 -50 -14 216 -233 -113 -83 92 158 108 147 -93 148 -180 -214 122 -78 -101
3765 -101 18 -93 -85 -1 -48 -232 148 32 131 175 -43 -334 -134 -142 351 -55 -91 -172 31 -11 16 22 -91 47 -85
3790 -85 -293 -213 74 -42 171 -69 80 59 137 35 1 27 73 -240 69 152 278 230 -199 -126 -147 30 86 -120
3814 -120 33 -42 -44 7 279 17 -79 -27 -168 1 -145 360 -148 -37 148 -131 -192 254 184 -18 16 -101 -22
3837 -22 -116 63 111 -11 -38 -151 99 90 -256 260 96 -103 143 138 44 20 4 143 69 105 232 121 208 67 115
3862 115 -113 -154 -93 -65 -49 30 182 17 -127 -7 -13 -100 -15 -55 250 140 32 -120 54 -47 12 -12 91 297
3886B97k61Q8q2L3r1J28k64N2L34j94k56M26j22j35r0K91m55N08l48M26j72j35
3908b2J21o4m9OK8j27K06Q0k52J84k0o0lr8L9J34j04J3J8J53K11o62J96m5n0K36
3934F9p8J49k49J61q1L17l84K22P5k25M0J29q5j22j09J47L5O6q8j11J12ko2R8
3958B4O8k15L35m66J52J58J6m1l6j41Q0rJ29J74k92J78j04J2M5J58j70j80M61
3981C36n31L48p2o5M8N6k06J60r0j36J69j48K26l62L36m4p9l4P2J15J69l75q6
4004a93K64l88L50Q4j80j8q8O4J51q9j59M57j99j40j25L37J32k48j21J69J95m08
4026a53J82j94K04j1k36J78R6j99K25P9k90J06j1j13J30O3k24K33k74L05l73J90
4048h7J56j33J72M1j40L4J17k18O2N9o2j19K66k19K07j20p4m8J15L6j72M4j04
$$ plain form
3886 297 36 124 42 75 -16 112 -152 -100 234 40 -216 210 88 -47 -137 154 -301 207 -141 285 113 -22
3908 -22 99 35 -14 -8 20 -107 99 179 -73 111 91 31 28 -70 -31 103 -1 12 30 183 394 -268 -72 -117 -167 69
3934 69 -9 140 -109 52 -29 288 -96 126 201 -24 16 145 60 -62 -171 -24 11 77 -11 -122 -10 -12 -74 24
3958 24 92 -123 212 -254 -102 56 72 31 -5 -146 -66 -75 54 228 -64 114 10 22 67 225 55 -125 336
3981 336 -195 153 81 16 64 120 -86 74 -16 -152 17 -131 95 -267 69 25 -54 -88 -16 99 268 -107 -193
4004 -193 71 -317 33 117 -63 -81 -169 -105 46 -43 -202 255 56 -84 -209 128 260 12 -109 60 255 -153
4026 -153 29 -165 39 28 -208 -30 66 -133 92 171 -119 -13 -24 -137 -7 56 -168 65 -209 96 -277 -87
4048 -87 69 -64 108 149 9 43 160 -58 4 63 1 -118 148 -71 136 16 -58 -106 9 45 -127 -83 -187
4071a87L6N8p5J37n0k8O9p5J0J50j05L4r8j90K66P2N7j59M8K70j39q1J37k73K12
4096I6j44L9J03K1q4q6L45l54K27j59j21J04l01K35K40m5k48L11l95L98k90K78
4118A70mk02L0K5N6K3l03J87O2k01N1Pk41L04Q4nj69PL3J17N2r5j41J0QJ65k42
4145b12M69m19j23K69K1J46k87J04k17L39P8n5j09j88J22p5Q7R6j42l9j05J96
4167d4J10j86P9J19j04j05K41k08P0J14QJ6J4j61J53p5j41l1J46M4k4P6r0L2k57
4192b04J13J46N4q4k6J44j63O9j86J62K1l22L98l69K43Lk2K3L0P1K1l1O2l53N5
4217a45J58j25N3L3j71J45K88p3j57J03r3j9P2o2Q7l52L91J72j22k33J1j2K1K03
4241A73j65K7Km1J48n57K46K2LL70k86o9J2m4K31j44K0L5j49L5K69q7j71J15J59
$$ plain form
4071 -187 -151 -93 -168 -31 -81 -109 -40 -115 -105 45 -60 -26 -124 -314 -48 24 81 -78 -30 240 101 20 157 -116 96
4096 96 -48 -9 94 115 31 -55 290 -64 163 4 -117 -13 -314 -79 161 116 -132 179 -216 182 -108 170
4118 170 166 -36 -6 19 75 98 -205 -18 44 -157 -106 -99 -340 -36 48 43 -126 -119 -86 31 83 -12 -153 -143 -135 30 -212
4145 -212 257 -162 -285 -16 5 151 -136 -32 -249 90 168 113 4 -184 -62 -137 -50 46 -96 -135 -240 -44
4167 -44 66 -120 -41 78 -26 -131 110 -98 -28 86 94 110 124 -37 116 41 -100 -131 15 59 35 111 21 53 -204
4192 -204 -91 55 109 25 -1 143 -20 49 -137 25 46 -276 122 -247 -4 -1 -23 0 30 101 122 91 153 -200 -145
4217 -145 13 -112 -59 -26 -197 -52 236 163 6 109 16 -3 69 7 94 -258 133 305 183 -50 -39 -51 -30 173
4241 173 8 35 37 -4 144 -413 -167 -145 -142 228 -58 -127 -115 -159 72 -72 -52 -17 -166 -131 138 51 -120 -5 154
4266A54k19j1n8K14k5k95L83K2j27L6k27k8L40o9j12N6J81p4j45k4pN8J49k12
4290d0P1r6J30O9k08j10K33o2n1J36q7j35k27K87J25J81l73M13k86j57K5O2j7
4313a17K56n7k92O96n30M8L4O4r5k09M57j08o4J04pj21R5l16L52j47j58J89j01
4336b7K93k87j09K70k5lk18P3J10o3Q0j31M4j69K58j82L2j30L73k65O4J86j45
4359B9j23K14k2j75O5M8K83k98P1O2l61J26K17l6J04m60K18j46K13j1r1K11j63
4382b5K12k48L1J40j03k1J0j7J54j95j79J45J40Q2k34K40j19o7K29l03J53J18
4404A43k08L1J52j01j51J6J4R1j00J8J9r8L68j79j91J26j7J80k57Q9Q8l3Kq3P2
4429in6PK18q7Mj66Q8o3n9J77j25P2l6j41M63l36k92N54r0k68J80Jk12K1K63n4
$$ plain form
4266 154 -65 -76 -134 80 55 -240 143 165 38 74 -153 -181 159 90 -22 34 215 141 -4 -28 -35 23 172 -40
4290 -40 31 -65 65 134 -74 -184 49 -13 -64 72 -15 -150 -377 -90 35 216 -157 256 -30 -187 -162 -100 -117
4313 -117 139 82 -210 486 -44 4 38 102 7 -202 255 147 83 187 180 59 154 -162 190 43 -115 74 -27
4336 -27 266 -21 -130 140 115 112 -106 -33 77 14 94 -37 7 -162 96 -86 -54 -184 189 -76 -12 174 29
4359 29 -94 120 98 -77 -12 36 319 21 92 154 -207 -81 136 100 204 -256 -38 -184 29 18 -73 138 -25
4382 -25 187 -61 -30 110 7 -14 -4 -21 133 -62 -241 -96 44 126 -108 132 13 -54 175 -128 25 143
4404 143 -65 -34 118 17 -134 -118 -104 -13 -113 -95 -76 -174 194 15 -176 -50 -67 113 -144 -55 33 0 2 -81 -9
4429 -9 -65 -58 160 73 77 -89 -1 -64 -123 54 -71 1 -35 -176 287 -49 -341 213 123 -145 35 36 -176 -155 108 54
4455E4j23k5k80Q9J78j75K53j4J91k73J45k55M64q0k1Jk41J75q9J4J45j29N7L9
4479A00Lj42k7O1Kq2M1j20J31P0j90J87j2k14K25j34J33q6nJ68R8k92P1N0j97
4504a61L60j57P6k62J77k33M94n44M55m8p2J5j33O9j2n0m9Q4o2k4K41k76K20J73
4528B81k25J18j80r4K78j98J47j34j76M08l88K47Q7l8j46L03j36r5k74M24q2n9
4550F8j82J41r2L9R0m5K7q5jj29K72J00l57J38M5l40M14m5k26J16j0j32K24k45
4574b15K14r3K52k38rJ44q8noR3J21n7k88J25r5K47K6M0k61R7Q6j21N0J77j45
4599E1j44J7K46l24K58k00J68k45L26k54pJ03k1m6O1m4J94j56Q9j21j23K05k56
4622b23J69K00k41R4j19K26mJ67l62%K36Jlj19K44j19k15M7K63l64J86j43J2n
$$ plain form
4455 54 -69 -94 -374 -285 -107 -282 -29 -43 148 -125 20 -235 229 149 128 129 -112 63 -26 -12 133 4 61 100
4479 100 103 -39 -66 -5 -3 -85 -44 -164 -33 37 -153 34 22 -192 33 -101 32 -54 -59 109 207 -85 -14 36 -161
4504 -161 199 42 118 -144 33 -200 294 -250 205 157 85 100 -33 36 24 -26 -75 9 -53 -77 164 -112 108 281
4528 281 56 174 -6 -100 178 -20 127 -7 -183 225 -163 84 171 133 -13 290 154 59 -215 209 127 68
4550 68 -114 27 -65 -26 64 19 46 -39 -40 -169 103 203 -154 -16 29 -311 103 58 -168 -52 -62 -194 30 -215
4574 -215 -1 -94 158 -80 -89 55 -33 -38 -44 49 170 113 -175 -50 -145 102 128 168 -93 4 90 -31 19 196 51
4599 51 -93 -76 170 -154 104 -96 72 -173 153 -101 -108 -5 -26 -72 -11 -55 139 -17 72 -49 -172 33 -223
4622 -223 -54 146 -95 -1 -120 106 102 269 -93 -93 143 144 141 22 266 147 -68 -21 242 -122 64 -79 -67 -72
4646g2k7J32J69m82L30j39J29k04j55L11pJ62k73Q5J54k70L70j75j96J42N8K0
4668F2q4J74k61J98k70J03j75K41o4J39k19l7J96N0j00N2K13l22M0K5R1k35K71
4691H8k19J25R5r3J00j4j00L4kl5k23K27J80M6j40p6k16K79n9J25l4p1k46n4L16
4716C3j73L50o6n5k58K16k4N4O7k52O1J79k71K65n3j48L19l8j47l9k8jK03j40
4740E4l30K33j5l1J09K45l23O7rj36K6J55p3L3K73j80j70J93j22Q1j46K09j42
4763AJ98j74K0N9l71M38j28O7k22J17p1L01j00j66J34j94J50j67K34o0j25M4K1
4786FL3q5J37j11Q7j41K63k69o8Q0J58k07O8J49J6J7k59N6J73l64K88J27J00k36
4810A8r8J99j75K80j71j2ppm4J46j79M1R7R0l30M9O1J67m1j38K93k19M5l35J10
$$ plain form
4646 -72 -99 33 202 -280 50 -89 40 -164 -319 -8 -15 147 -126 -41 113 -157 213 38 -158 -16 42 62
4668 62 -22 152 -109 89 -181 -78 -253 -12 -76 63 -156 -193 3 53 -47 5 218 -104 -64 -39 52 -183 88
4691 88 -131 -6 89 -4 96 82 -18 16 14 -21 -244 -17 163 209 69 -7 -223 56 -3 122 88 17 -229 -283 33
4716 33 -140 210 144 89 -169 47 23 77 144 -108 -47 132 -139 126 73 -75 244 206 59 20 -8 -9 194 54
4740 54 -276 -43 -58 -89 20 265 -58 9 0 -136 -110 45 -28 5 278 98 -72 121 -1 80 -66 143 1
4763 1 199 25 45 104 -267 171 43 110 -112 5 -66 235 135 -31 103 -91 59 -108 126 66 -59 -15 6
4786 6 39 -46 91 -20 67 -74 189 -80 -148 -68 90 -117 -49 100 116 133 -126 -70 103 -261 27 154 254 18
4810 18 -80 119 -56 224 53 41 34 27 -17 129 -50 -9 88 178 -152 -103 -42 125 84 -54 239 20 65 -270 -160
4835a60J03K40k20k8K30k15j50J30pr7J28L1k54N76l39J59K0k65J20j3M2%J64
4858A95l76Q6J58j51Q5O2lJ08j77R9k43J52k31K74J77j10l22p2M08k10L41m23
4880a73r1L70L6j97o9J34J63k68J91o9J05J21k51o5J37J54k95j2j59L29M9k70
4902a30K69j60j08K95P2j70n1N4Ok6j0J90j34J5m5m1j75J87J11j41m11M53R7j32
4926A5j75J25j02J06p8J26qJ26l43M29J2k21K2J27j70N7j92J73M6j29K15l72K38
4949B7m7L0Q8R3l72J18n7L17p4j77MN5k91L83p3k59M13k4k53qJ15Q3j88N1J47
4974A01J01k57J26j80R5j6k4lM3j95J44j39M15j38j3j46J14J63j70K5K10m00K05
4997F1j1N3j93K53j41j04N7r7L53r3k62J98l5m6N9j17L0ol3j47N25l39MM1K38
$$ plain form
4835 -160 -57 183 -37 -65 165 -50 -200 -70 -77 -174 -46 -15 -269 307 -32 127 147 -118 2 -11 31 31 195
4858 195 -181 -95 63 -88 -3 59 56 164 -13 86 -157 -5 -236 38 215 105 -217 -289 119 -91 250 -173
4880 -173 -264 106 142 -55 -124 10 173 -95 96 27 132 253 2 -63 74 228 -67 -79 -238 91 140 -130
4902 -130 139 -21 -129 166 238 68 17 71 77 51 41 231 97 112 67 26 -149 38 149 8 -403 50 147 15
4926 15 -160 -35 -137 -31 -109 17 9 135 -208 221 233 12 34 161 -9 48 -144 29 75 -54 161 -211 27
4949 27 -20 10 98 191 -181 -63 -120 197 123 -54 -50 5 -286 97 24 -235 178 154 -99 -107 8 91 -97 -46 101
4974 101 202 -55 71 -109 -14 -30 -54 -57 -14 -209 -65 -204 211 73 60 -86 28 191 21 46 256 -144 61
4997 61 50 103 -90 163 22 -82 -25 -122 231 138 -124 74 39 -7 52 -65 -35 -41 -74 -221 304 -35 -31 10 248
5022B48n2j26k09O9M9N9m9j70J35J29K5M6j03n9J11n0k09L18k44K8K1j18j2Q7
5046g6R2q3J21o7j95K64k37L13j65K5J17N1j14p7K01l22K41k14K11k52O0J42n3
5069a7KJ25J1k59K57J21k00r4M3j17J35Q3Ok51K89p9m8j55L81j83j90J00J6r8
5093a22j06K32r6J83J25k36P5L0l9j73l6K66K5n4j09j84L27k08J23k38K30J01
5115A16o7j89Q1N9K76l41Q3P7j86K33j62j34r4J29k9J6J63q9O1n0p7J45j86m1
5139b06N00l67M0L2M6K02j88l55J19J22q6K77l19J98j00K1J89l90M34j72j07J63
5161E3Q9k21L16l84M6O0J06o8j66j5L14q4k4j19O9k9j22J76p4L38l83K56j95o6
5185a27J13P9K55j18k07j47L59k43r2q0J79J38k95J36K9Q2j3m4J7p6J6K83j31
$$ plain form
5022 248 196 70 -139 -70 -21 38 -11 -181 -46 83 108 154 51 -8 103 53 -156 162 -82 -54 -33 -151 -163 -76
5046 -76 16 -67 54 -13 -208 56 -181 132 -33 -8 109 160 46 -31 170 -152 89 -125 86 -166 -106 36 -17
5069 -17 -15 110 121 -138 119 240 40 -54 -11 -128 7 90 96 -155 134 55 7 -148 233 50 -140 -40 -24 -122
5093 -122 -228 4 -92 91 216 -20 55 85 46 -127 -163 103 128 74 -35 -219 108 -100 23 -215 15 116
5115 116 49 -140 -59 0 276 -65 18 95 -91 142 -20 -154 -248 -119 -148 -132 31 -58 3 -47 -124 21 -165 -206
5139 -206 294 -73 -33 -1 45 247 59 -296 -177 -55 -141 136 -183 15 -85 -64 125 -265 169 -3 -110 53
5161 53 142 -79 237 -147 -101 -41 65 -3 -169 -184 130 46 22 -97 -28 -57 -179 -3 -77 261 -122 134 -61 -127
5185 -127 -14 65 320 202 -5 -152 207 -36 -128 -208 -29 109 -186 -50 -21 61 48 4 21 -55 -39 244 113
5208A13R5q3%k74J59P5m1J17k44j5J26n4nJ05q0j89O6J11J52r9k95K11o7lJ0J12
5234CJ3m5m7m3Q2j49R4K01k26J15J17l53K53K09j33J90l93p8L95k69J48k06j9
5257a41P7r0K85o0k10p0J44K48j55R0j1j50o3J27j92J92k61L69mqr1k65K45K2
5281B8K5l44J83p1J29j84K74Q8k36l1K75l8j41J87k20K67j40J40m67J14K42k6
5303E4j79l7J64rJ41j32j68J74k87J40j2J41k49K32j10J28N5J04O2j26J35l64
5325a43J36Q1r8j8p4K38J57l05j07K22q7k42L01M3l08K13r6N7k7k22K21k7Q3r3
5349i5Q0M5p1j18O0Q4R0L4l29J61O1J08k21K68O3j49rj62N2P2k2j55lR3Q7k25
5375b01K68L1r7J25o9j76K33j69L9m6l9K9L68j71p0P5j92J96q8j59J60r8j53K89
$$ plain form
5208 113 208 125 125 -149 10 85 44 161 -83 -98 28 -26 -31 74 -6 -195 -129 -18 134 35 -260 -49 -116 -119 -109 3
5234 3 16 -29 -76 -119 -37 -186 -92 109 -117 -2 115 -238 15 224 91 281 -112 -190 205 -64 84 -122 -141
5257 -141 -64 -154 131 71 -139 -209 -65 183 28 118 107 -43 -106 21 -171 21 -240 129 125 117 26 -239 6 28
5281 28 53 -291 -108 -179 -50 -234 40 128 -108 -139 136 98 -43 144 -76 191 51 191 -276 -162 80 54
5303 54 -125 -162 2 -7 134 2 -166 8 -279 -139 -151 -10 -259 -27 -137 -9 46 150 212 86 221 -143
5325 -143 -7 74 -24 -42 -116 122 279 -26 -133 89 2 -240 61 104 -204 9 -87 -30 -57 -279 -58 -85 -2 -95
5349 -95 -15 30 -41 -159 -99 -15 75 109 -220 -59 2 110 -111 157 220 71 62 -100 -48 24 2 -153 -156 -63 24 -201
5375 -201 67 98 1 126 57 -119 114 -55 -16 -62 -101 -72 296 125 55 130 -62 134 46 -113 47 -51 -204 85
5399H5N9k72L24m9k85oM0q9R3J50j28qo9L40j23J5j8j64J47n4l6J52m03J42J26
5424c1j58L47r8p1P5m6j16Q9k1K46k87K15j42k26J06J54m01K05r3M41k91J62l3
5447B6m1K77k20m4j00J08N8j57Q7l5M9pj20N6o2P2K81j71n3L00j80k11K11L6l26
5472a66M62j55J03k68M4O0o8J1O3p0J78l45N1JL9l8J50j66n9K70k5j82P0n6j4
5497a10j8J90R6j94k6L78k78r2K37k04o1Q8J9J82j44r3k50L46j02M4K5q6L3n6
5521g6J37j88K83l0j78J10j74MJ13N8j9J41k12r2L2L14k35j0K9J29j27k38M26
5544A97j39J05n9k23l1M86l12j87J06K22j55pl2J2P2q9j17R2K46j75Q0j74p6K51
5568I3k28J12K03k8k61J7J67J13m15K01J0J21k59J54j34J08J69Q8j68q6J18k41
$$ plain form
5399 85 144 -128 196 147 -138 -144 -104 -193 -100 50 -78 -86 -155 185 62 77 59 -105 42 -12 -48 104 -299 -157 -31
5424 -31 -189 158 60 -11 64 18 -98 -9 -30 216 -71 144 2 -224 -118 36 -365 -160 -253 188 -103 59 26
5447 26 -15 262 42 -2 -102 6 64 -93 -6 -41 8 1 -119 -63 -125 -53 228 57 4 304 124 -87 124 160 -166
5472 -166 296 141 244 -24 20 80 12 23 86 16 194 -151 -100 -99 -60 -98 52 -114 -173 97 72 -110 -40 -96 -110
5497 -110 -128 62 158 -36 -62 316 38 -54 183 -21 -82 6 25 207 63 -30 -280 66 -36 8 33 -53 -20 -76
5521 -76 61 -127 156 126 -52 58 -116 -112 1 59 40 181 -31 -123 -91 223 -12 -22 7 136 9 -229 197
5544 197 58 163 104 -119 -150 336 24 -163 -57 165 10 3 -29 -17 55 -34 -151 -59 187 12 92 -82 -158 93
5568 93 -135 -23 180 152 -109 -92 75 188 -227 -26 -16 105 -154 0 -134 -26 143 231 63 -23 95 -146
5590a46J72n1q2R6P9k10K40Jl88K03J01l1o3j0J14j24K6o8KK66j25K56q6j68j45
5615a41j40K03J36q2J83k68n4m9J18K39J94m25J11k4o9j47K20L62l12k08L28k72
5637i7O9k8n9%j12L40m4JO5O3l58J05J75J0j12J45q6j9J24k59K30m7j74K5j03
5662a46M83l74r5m9K43n4q2J65j4l8l87L33m4K89j94N9j42r3M3p8M38l32J31q9
5686b7m0K65m32L09Q6n8K5j10Lm1k12L55K17l25J33k16K61J1j5o0k56J28J13o4
5710E0j01K23l16J2J6J29J71j53KJ50k5j93j89O7L8P9J30J6l6N0P3k51J9r8K13
5735G6J3n4k25L71j29n2K05j77P6j09P5l0j0j91j6M58m01K17j50J50k98L93k43
5758e1m0O7k9J22l21K07J53j34J82Mp4j84k1J92j2L6j17r6L20L1k79k24J88L08
$$ plain form
5590 -146 26 -25 -107 -11 68 -142 98 99 -289 -86 15 -16 -79 -89 25 -99 -73 -141 -139 127 2 258 172 4 -141
5615 -141 -281 -78 58 -24 159 -109 -163 -212 -94 145 339 -86 25 1 -68 -215 5 367 55 -153 175 -97
5637 -97 -28 -56 -115 -115 -227 113 69 70 135 198 -160 -55 120 130 18 163 77 58 182 -77 153 106 -68 -43 -146
5662 -146 337 -37 -132 -181 62 8 -74 91 77 39 -348 -15 -59 230 36 95 -47 -140 -97 -175 263 -69 62 -27
5686 -27 -67 198 -234 75 161 103 128 18 21 -20 -232 123 340 15 148 -68 193 204 189 129 -127 1 114 50
5710 50 -51 172 -144 -132 -116 13 184 31 33 183 158 -35 -224 -157 -119 -40 90 106 70 120 193 -58 -39 -137 76
5735 76 89 35 -190 181 52 0 205 28 104 -5 70 40 30 -161 -177 281 -120 97 -53 97 -201 192 -51
5758 -51 -91 -24 -53 69 -252 -45 108 -26 156 160 86 -98 -119 73 61 97 -20 -116 204 235 -44 -268 -80 228
5782B28r2O5k21R3k46J88k9k6j7p7R2K2j46l0j01K05O8p5L25J4k99J30N2k68K08
5807F3N1nj18J9J75l13K74k91N4M7q5J16Q1j75l4N7M8P2j94M32k52j95P1j86L51
5832F3j21j9K3R9j38J74nk45J95q4K6L6j45K17j46k01L07n5k9k92J70O7J03Jo3
5857f2Q5N4L2K05j21j24K9l07L34M4l05L3j55M11k01oL08l23J99k86K21m9J68
5880A84k89M1J50o2R1k29O9j27M08k70L3K9j07Q4j3L0q5K43K6k72J58k8R8n3k52
5905a43j25J1K94j70M29q4k30N5K26l45J23j25L42m9j31k01M35k74q3K7r7J66
5927E1Jj27J18J02k46J61k29j34N34j71P6j5j02j07K44l6o5K6o8j04J62k9n0J26
5951A18o3j06r6R4j28L08j59O1n3KJ38k8J27k48L11k22k64L57j61l02J88J84N3
$$ plain form
5782 228 136 201 -20 73 -173 15 -14 -40 -57 -134 -42 -20 -166 -196 -297 -92 -24 -99 226 240 -59 71 123 -145 63
5807 63 114 109 -9 10 185 -128 146 -145 -91 -44 -129 -13 68 -107 -141 -84 -36 36 -158 274 22 -173 -102 -288 63
5832 63 -58 -77 -54 45 -93 81 76 -169 26 -58 -32 4 -141 76 -70 -271 36 -19 -48 -340 -170 -103 0 1 -62
5857 -62 23 77 109 314 193 69 98 -209 125 169 -136 -103 -258 153 -48 -54 254 -69 130 -156 65 16 184
5880 184 -105 -64 86 24 115 -114 -45 -172 236 -34 -1 28 -79 5 -8 22 -63 180 206 -66 92 64 162 109 -143
5905 -143 -268 -257 37 -133 296 212 -18 37 263 -82 41 -84 258 209 78 -123 312 38 -45 -18 -115 51
5927 51 52 -75 43 145 -101 60 -169 -303 231 60 136 121 19 -88 156 120 55 81 13 -91 71 42 -8 118
5951 118 55 -51 -147 -53 -181 127 -32 29 -24 -22 116 88 215 -33 278 56 -208 149 -12 -314 -126 58 111
5974A11n1o6J48j44Op1k10J96J77J46k18j33J47K00j82j72K14O5j71R2K7j40K8
5997aM5N1k21K23J0l51K77j5J25m09K63J3l88M46pN4j10J62k05k3K60j25j33J81
6021A22j72J52k29J38j72J46O9j8K47l62j79K37M8j47K79k13p3J89j37j60K58
6042B3l32K12J71n0J48J29k48r8J51p0J10p2l68L24j03j55%K23p3J34J88k44K10
6065B10m19K85K5J31p9m08K65M1k7r9L7K2p7J06J48l2K7j05O3j30j56K37R3k05
6089d7N7O7R1k60J51Q1k67J91L60l95Q9O3l30L11j08m7j9J55k12K50l25j39M34
6112A51K5k28J99k78J62j65K04j65L26k42J50j45j80J77j11K06l53J39K16k19
6132a31K16j78J73o7j9j30K19L5J48l13K9R2j55K36k55L51l27ko9Q8L6j53K85
$$ plain form
5974 111 60 -6 142 -2 4 -67 -277 -81 96 242 24 -109 38 238 56 -116 98 163 -8 84 111 -29 -1
5997 -1 44 95 -126 97 107 -244 33 18 143 -266 -3 10 -378 68 61 115 5 167 -38 -61 199 74 -59 122
6021 122 -50 102 -127 11 -161 -15 54 36 283 -79 -258 -21 27 -120 159 -54 -127 62 -75 -235 23
6042 23 -309 -97 74 24 172 301 53 -45 106 36 146 74 -294 30 -73 -228 -228 -5 -78 56 244 0 210
6065 210 -209 76 101 232 153 -255 10 51 24 -75 -38 -16 -93 13 161 129 156 51 114 -16 -172 65 158 -47
6089 -47 10 77 168 -92 59 140 -127 64 424 29 118 181 -149 162 54 7 -12 143 -69 181 -144 -283 151
6112 151 176 -52 147 -131 31 -134 70 -95 231 -11 139 -6 -186 -9 -120 86 -267 -128 88 -131
6132 -131 85 -93 80 13 -6 -136 83 118 266 -47 -18 74 -81 155 -100 251 -76 -78 -147 -59 -23 -176 109
6155A09R2j79J58j00J7j44j00L30j60K3N7K7j05n7P6l3K18k46mj04L07j91k11
6178b20M61m16R5J1l0J20P9j17K02J08m37J30k28J88Q4P2K1j37j46J02k2K94k66
6201e2J38m6j82J95j61J80o3KJ04j68K5J78k8k12k3J20l6L89m20J90q2k43J47
6224d8L25k27q4p8J57R7m40J97J71K4o9o6K42l39J59j37L05j07J12l52R8j67K33
6247FK9p2l6p0K5K27k74J71k22L47k12M0M4j00K65k4M2k30l9K35p6j96L66k20
6271B6K29k20O2l4OR9k32K18j75K14m20K26m8OR0k36L35l76L31M2l17K17j87j3
6295a57J82l03J89P9j27J35j84J45j1K38j39n3K61m7n53K67K7O4l4J38m08M28
6317A37k0l6K97m08O5m0j09J91k00j12M56j50j73m7L8K09p0o2J16j33M1j8q6J81
$$ plain form
6155 109 201 22 180 80 97 -47 -147 183 23 46 103 130 25 -32 44 11 229 -17 -21 -125 182 -9 -220
6178 -220 241 -175 -80 -69 -99 21 100 -17 185 293 -144 -14 -242 -54 30 102 123 -14 -160 -58 -80 214 -52
6201 -52 86 40 -142 53 -108 72 9 11 115 -53 -28 150 122 -90 -113 7 -29 360 -60 130 48 -195 -48
6224 -48 277 50 -34 -112 45 142 -298 -101 70 94 25 -41 201 -138 21 -116 189 82 194 -158 -60 -227 6
6247 6 35 -37 -73 -143 -118 109 -165 6 -216 131 -81 -41 3 -97 168 144 186 -44 -83 152 76 -120 246 26
6271 26 255 35 97 63 69 168 -64 154 -21 193 -227 -1 -49 -43 47 -189 146 -230 101 143 -174 43 -144 -157
6295 -157 25 -278 -89 -10 -137 -2 -186 -41 -52 186 47 -6 255 208 -345 -78 -51 13 -21 117 -291 137
6317 137 117 81 378 -30 35 -5 -114 77 -123 -235 221 71 -102 -149 -111 98 28 -34 82 -51 -10 -28 -114 67
6341F7P7k02O0k5J15m9J13j39P2j67K87m26K58m5J72l12J97j45J67k3l4R2M5r2
6365F3k06L88l53JJ41K0J05k05K42j72R5k53L49p8l11L74l56l7K42JK1M3j49o
6389d1J29j10K3j42J61k41K92o8J42l04K1K87M0j01k20k2J04P4j96K43J33j22
6411H2j02K24l85J76j4j6O6R7k52J39L5j13K04o6p1n2J16m8N4j46k0j9l2K4K84
6436A65J59k87r2K0Q0q4K32O8l2l46L67Kj83r8J52k27J60k54K22N8o7J6qJ26k7
6461A22n4j8J15k13J23J69Kj77J02k16L8J7K32m02K09l6J26l06K37J24j59q6R4
6484D3j84J91p7K43p5j74K32l81L15j03K15k30j8j7K31q8j15j85K9j19L40j74
6506a01kK00q7N7M0o3K57j4l06o5K93j58j34L16l61K35o5lq4nJ18k0Qlj34J01
$$ plain form
6341 67 144 -58 2 -23 92 43 156 17 89 -78 209 -217 41 -4 168 -144 53 -92 75 52 18 110 155 63
6365 63 -143 245 -108 -107 34 54 159 -46 196 24 119 -134 215 137 -174 200 -156 -193 49 50 71 114 -35 -41
6389 -41 88 -22 1 -141 20 -221 71 3 145 -159 -138 149 189 88 -132 -154 -50 24 -172 71 204 82
6411 82 -20 204 -181 -5 -19 -35 31 128 -124 15 50 -63 141 75 4 -48 68 20 74 -72 -92 -111 -143 -119 165
6436 165 324 37 -55 -35 45 -39 193 261 229 -117 250 252 69 -29 123 -104 56 -198 24 82 15 31 23 149 122
6461 122 68 50 165 -48 75 244 246 69 171 -45 -7 10 242 -160 49 13 139 -167 70 194 35 -51 43
6484 43 -141 50 -27 216 141 -33 199 -182 133 30 245 15 -3 -20 211 123 8 -177 -148 -267 73 -101
6506 -101 -103 97 10 67 107 44 301 287 -19 -84 209 51 -83 233 -128 107 42 39 -45 -50 68 48 56 53 -81 20
6532B0j22K90l18J19J62j91j54N4L03l3K5q8o9K9L2qK01j83k55J51j93K47M2P4
6556A35j53J95k64Q1n6r7J20k1q0R0O1L6R2j28J58r1J55m69L12J70m56J61k9p5
6580a53J3R3L3k4L6n6l2N7O3N8n3o7J22J23l73K08N8j00n2O9J57j82J89k24OQ4
6606E3o0K00lj06k08K11ml55L00Q4M5O4k18%K23l97p5J53M4N5o8j48J18K44r6
6631E6Q0j27m0Q3J8n34L98k0qJ64j57j1k72K80J78J26k03J42j62P1M2k54J24K30
6655B04q5k66K62j69K5J46l42J20K45K4o1k6j68K16k43K20j97J27N5k56L22Oj18
6678D1K08j93k34L16k88K00n9k03K33P1K6j64oP3r1NN7r9K06J77j69k65K56l00
6702b02j3L14K3M6k36j08J32P5r4k00J57R5k71J15J46J62j79J1k26J80J33J71
$$ plain form
6532 20 -102 188 -130 -11 151 -40 -194 -140 163 130 155 67 -2 27 59 51 252 69 -186 -35 -228 19 61 135
6556 135 -18 177 -87 -6 -62 -159 -39 -60 -140 -50 11 47 139 11 169 78 233 -236 76 246 -210 -49 -78 -153
6580 -153 -140 -47 -14 -38 -2 -58 -90 -33 30 88 35 -32 90 213 -160 48 106 6 -46 23 180 -2 187 -37 -31 53
6606 53 -7 193 190 84 -124 87 83 -272 28 112 157 221 3 3 226 -171 -246 -93 -49 6 -62 -210 -92 152 56
6631 56 136 9 -31 52 70 -464 -66 -86 -94 70 -87 -98 -370 -90 88 214 11 153 -9 62 104 -150 -26 204
6655 204 119 -147 115 -54 -29 117 -225 -105 140 164 103 77 -91 125 -118 102 -95 32 87 -169 153 159 41
6678 41 249 56 -178 138 -150 50 -9 -212 21 92 118 -46 -52 21 -70 -65 -8 -107 99 276 107 -158 98 -202
6702 -202 -215 99 122 168 -68 -176 -44 31 -63 -263 -106 -11 -282 -167 -21 141 -38 -27 -253 -73 60 231
6724B31k50k54J32O9r8Q1O0Q1k46J61K9mk6r1N0K8K2j09K45l47O1K57k50J77K8
6749C7L2M3j80RK12J23r9j91rOo0R8p5Pj40K72L0j96J03J25o03M25J31l37L48
6774A11j24P2J01j25j58j13J73j1N3K99l30N0M8Q4M1k28M9J59m02L58R6k61K92
6797B34j62j8j97M2O6J30M7j11j39K13j07j03RK26l5m0j67P2P2L13m72J3K57k67
6821a24J49l7Rj23J04J06J65l00j73J58J20l11K62K75k47q0J02j43L39k44l22
6842c15K72nkO9r6K13Nm26L55N0m11M02M6l66L45Qm24K87j32P4J16r5K30n0L9
6867A89j25p9J57k53j04M26j14j29n6K02k92J07J86l7P5k41N0j01J12R0j62L63
6889B64k48p8n0K60j7j44N7Q4l3j91J32j21K9J30j55K44q8k63K11o9O0L2pJ07
$$ plain form
6724 231 -19 -273 -141 -72 -170 -89 -29 52 -194 -33 -4 -8 -34 -125 -75 -47 -25 -134 111 -236 -175 82 -168 9 37
6749 37 69 112 -68 -59 153 276 177 -14 -23 -17 -77 21 -54 -47 -187 85 115 -81 22 147 -456 -31 100 -237 111
6774 111 -13 59 160 35 -123 -236 -63 -74 -21 278 -52 -2 46 130 171 -57 -8 151 -251 107 203 -58 234
6797 234 72 54 -143 -101 -35 95 142 31 -108 105 -2 -105 -96 130 95 55 -112 -40 32 345 -127 -114 143 -124
6821 -124 25 -12 -3 -126 -22 84 249 -51 -224 -66 54 -257 5 280 33 -47 55 -88 251 7 -315
6842 -315 -43 -48 -50 19 -77 136 141 -285 70 120 -291 111 157 -209 136 144 -280 7 -125 -51 65 -30 200 150 189
6867 189 64 -15 142 -111 -215 211 97 -32 -88 114 -178 -71 115 78 153 -88 -38 -139 -27 63 -99 264
6889 264 16 -62 -112 148 131 -13 44 128 95 -96 36 -85 -56 74 -81 163 75 -188 23 -46 14 46 39 146
6913A46l38K78j1K4m01K15K20l21Q9K94k11j41J48N8oj12K08j48Q3p8JK13k15
6936eqo4J33j66J93J95l65J77j68k17J96J35O5k99J61K34j83j65L34p8o2l7nj89
6960a88K70J29l45K93L6k21k59K46J23k55N28m65J45P3r9q2J04n7Q9K9j05P8k49
6983a82L04k45k8J60L6k18J40N8Pk31J8K36q4J74k6q1O8j31k43K58l9P4K66j21
7007A70l18Q7OM5j59K54o7k05J77RK35j45j46J11M6l20J23L51m04N5L60l01k3
7030e9K55k97L90l68J75M1jj37j87K28O0j78k38L50O9k56k85O43j62n9Q7r2j06
7053a27J65j38J92j10J14l2l41L31k11K56j02k47K04J73j04k99L08j04N8K57k59
7074a6P3l02J42l2J80k1q8j83J83J88Ol25M53k73k7O9p7J18j47lK98m78L86j42
$$ plain form
6913 146 -192 86 75 99 -302 -87 133 -188 -99 195 -16 -157 -9 49 43 -69 139 -9 74 -4 -3 210 -5
6936 -5 -13 -77 56 -110 83 278 -87 90 -78 -295 -99 36 101 -198 -37 197 14 -151 183 105 43 6 1 -188
6960 -188 82 211 -134 159 195 -26 -285 -39 84 -171 357 -108 37 110 11 -71 33 -24 65 94 -11 67 -182
6983 -182 122 -123 -151 9 45 -173 -33 25 32 -199 -181 55 -29 145 119 38 106 -25 -268 -10 -49 25 291 170
7007 170 -148 -61 -55 -10 -169 85 18 -187 -10 -1 234 89 -57 54 100 -220 -97 254 -150 -95 265 -36 -59
7030 -59 196 -101 289 -79 96 137 136 -1 -188 40 100 -78 -316 34 103 -153 -438 205 43 -16 71 -21 -127
7053 -127 38 -100 92 -18 96 64 -277 54 -157 99 -3 -250 -46 127 23 -276 32 -72 -14 243 -16
7074 -16 57 -245 -103 -135 45 24 -64 -247 -64 124 130 -195 258 -15 -42 27 -50 68 -79 -82 216 -262 124 -18
7098a8J6P8j72l1L5M1R8r0J18K51m20l5L28j09l2K8k7o6J29j09OJ38j23j04K34
7123A64j88m1j93J25O9M80m60M5j2O8oo9j88K63j95K31j57mK15m8j17j3k84P2
7147b43K46k26K63j78J15J90n7p1Q0q5K2L8j43J38k7J7j74K26k28J20N6r2j6J4
7171a5r3n9K04K42k21k71K93j7r3J38q9J00j97K83N0k41J02k05M09l62K44j47
7193E5q4Q9k13K74rj00n1J03p5r4K29j08J80j54k23M11j56P0j89j48M3m0L14j6
7217A08r2K72l71J95j28J82l00p0K45j41mL49l38J38J02l06K19J21J9k15p9O9
7239b5R2n7K3P6L7j19M5j7j05J6J79k05o0K07n1Q8KN0k51j22Q7J26R8j32k2J1
7265b9k0K73k21n3J80j50K00j65K01l28Kn4M45l27J39m5l1m18N29j33O0Q9K5j79
$$ plain form
7098 -18 -2 76 -96 -127 -92 -51 47 -43 75 326 -94 -129 199 90 58 86 59 -7 122 13 19 157 34 -70 164
7123 164 -24 -65 -258 -133 -64 416 -44 1 -11 57 51 -18 -206 57 -138 93 -64 -68 147 99 -18 -31 -315 -243
7147 -243 3 -223 40 -138 -23 167 110 39 119 34 56 94 -49 89 62 79 -95 131 -97 23 79 -13 -29 -15
7171 -15 -108 -167 37 279 58 -213 80 63 -30 108 19 119 -78 205 255 14 116 -89 320 -42 202 55
7193 55 -29 60 -153 121 112 12 -39 64 -11 -105 124 16 196 42 -181 230 74 144 -45 -193 -150 -190 124 108
7217 108 16 288 -83 112 -16 166 -134 -204 41 -100 -104 245 -93 45 147 -159 60 181 200 -15 -94 -25
7239 -25 67 10 33 109 146 27 72 55 -50 -34 145 -60 -120 87 36 124 126 176 -75 -197 -110 16 114 -18 -40 -29
7265 -29 -49 224 3 -50 130 -20 180 15 216 -112 -110 -164 281 -46 93 48 17 -401 128 -5 55 144 169 -10
7289a0m8L03l78J24K98l33L7j19K1J16P4o2J08k7ko0J14l07K37j67m7r6kJ70k5
7314h1j3J91l54M49j14p6P1j50J18M4K2j21j38J4J23Q1J86j47Pj01j09K2p6J32
7338b0K23j86j38J16m9J80L7m6j6Om5j1R4k9q6J61l15K56q5K8p7K6m9o0J34J12
7364A61N7l20J43K14j76j21K73j96o5L36j50l12K09q4J54k55k4K44j68j40L11
7385I1J40l58J06L0j39J65K2j05K06j60j44K70j73j90L0K42n1Q5j69J07J79L1
7407B15j75j6k04L4L5P5O4J44k31l3J02l5J45r8R0k94J45J63k11J07n0R5j0k70
7431b13r5J89l2K46J28j18J04n12L35L43k78k56J69J00q0K6n7L9m6L2m2Q0L5P5
7455A72jk92M1L9J36j27%o2r4J71q3J61L8k16L04m1M6l64J83N1P5j57J49l23K76
$$ plain form
7289 -10 -58 245 -133 -9 289 -44 -7 -126 -105 11 85 23 131 104 102 42 156 -151 86 -81 -128 -224 -226 -56 -81
7314 -81 -94 97 -257 192 78 2 73 -77 41 85 107 -14 -152 -138 -15 66 252 105 112 11 -98 -76 -152 -20
7338 -20 203 17 -121 -5 -54 126 163 117 101 107 62 51 145 116 30 191 -124 132 47 75 -2 24 -25 -85 49 161
7364 161 218 -102 41 255 79 -42 231 35 -30 306 156 -156 53 -31 123 -132 -156 88 -80 -220 91
7385 91 231 -127 -21 9 -130 35 57 -48 158 -2 -146 124 -49 -239 -209 33 -18 67 -102 5 184 215
7407 215 40 24 -180 -146 -111 -36 28 172 -59 -92 10 -25 120 22 112 -182 -37 126 -85 22 -28 67 57 -213
7431 -213 -308 -119 -151 95 223 105 209 -303 32 375 97 -159 10 110 30 56 -1 38 -8 24 -18 62 97 172
7455 172 171 -121 -80 -41 95 -32 -32 -94 -188 -17 -100 61 99 -117 187 146 192 -172 11 62 137 -20 129 -194 82
7480H2k20K37j75kJ23j13p9J82k68J80j46J34j27l0J23j41J06J89k13K52M7J08
7502B49l36L4Q1j21k57J65K53k59L78l8j05L13k36k5j39l8J94k28LJ31K4q7N4
7525A0K8L5j3j02j09j24K20P5l1J18j33j66K47n6o5J62l6j00j67K18l9mJ04j82
7549a10J12R1p9N2o3L0n9J2P5q1N6k9j79J81k4J56k30P1j50J17K40kj43j93J48
7574aj7J54ko2N5j03j56K80L2k42p1J81m95L22K41j77K23J04k67J3l4o5K04k73
7598a56J81J45j63k6O0n2LJ14p1j77R9k20N96n99M41j38M9Pj01J60j42K4j08K17
7622A43l0k34J72Q6j18J49j75j73K35o3p8J31j1r5J82j04pN5r9J41k11l6L01r3
7646F8J79k09j61J3P5P6k30J30K13j97N0J39k34K2J27O5j21K3p7K04k00J53O2
$$ plain form
7480 82 -138 99 -76 -78 45 -68 -147 35 -233 -53 -199 -65 -192 -222 -99 -240 -134 55 -158 94 141 249
7502 249 -87 -53 28 -93 -350 -185 68 -191 187 149 44 357 121 96 -43 -81 113 -115 -112 19 43 -44 10
7525 10 38 73 60 -42 -151 -275 -55 20 -11 107 -26 -192 55 -1 -66 96 60 -40 -207 11 -28 -32 72 -110
7549 -110 2 93 14 66 3 33 -26 -14 61 -20 36 7 -172 9 -15 141 -89 -18 -168 -51 189 187 44 -149 -1
7574 -1 -18 136 134 72 127 24 -132 148 180 -62 -133 48 -447 -125 116 -61 162 266 -1 12 -22 -87 117 -156
7598 -156 25 170 7 -19 41 -11 -8 106 35 -142 -43 -263 333 -266 175 37 86 93 -8 152 10 34 -74 143
7622 143 113 -121 51 137 19 168 -7 -180 55 -8 -86 45 34 -61 121 17 10 65 -34 107 -104 -140 161 68
7646 68 247 38 -123 -110 -35 41 -189 -59 154 -43 7 146 -88 -66 61 126 5 28 -49 155 -45 108 170
7669A70m33K41R9k97Q9l21L71J24l9J41l18J58r3J8L44k20r5j47L30J18m4r3j25
7692b2j63J2q6Pk8J44J99R0R8j66K05m67L8J97j05J62J33l1k64L73l40K40j96
7715C0q2J92r2k00J97J03m12J80K95m27K33j30J59k0J36k58Q6L6l7j32K39j21
7737b5Nk8J7J13o5j25j2K70j27rJj2j83K26N0j36J28k40J72J01l29R2J85j45l7
7762a13J70p5N2N6l3k6m7p8K66L9r1l22L97k46J12q1r8J33P4n3n2p9K48j24j05
7787g6K34l50O5L22O3j03j14M4K92l69M4m7N8J02l34J23j5K89k87k0P4o9j22K85
7811H9k7k70J82j05Q6M0l0j25K38r6k30K08K05j32r3Q8R0l16K22M1M5p6ok16L02
7836A14p2r7pK00j20N9o8R0K3N1Q8j76m6k6j04K7K90k11Q7j75J33r2j78K36j44
$$ plain form
7669 170 -263 -22 77 -220 -131 -452 -81 43 4 145 -173 -15 -108 -90 254 34 -61 -208 122 240 196 103 -22
7692 -22 -185 -173 -259 -252 -280 -136 63 153 251 85 290 -177 -139 58 -47 115 248 217 -47 326 -14 226 30
7715 30 -52 140 48 -152 45 148 -264 -84 211 -216 17 -113 46 26 162 -96 -10 26 -11 -143 96 -25
7737 -25 -20 -48 -31 82 17 -108 -120 150 23 14 15 3 -180 46 96 -40 88 -152 20 121 -208 -116 69 -76 -113
7762 -113 57 -18 34 90 57 31 -16 -94 172 211 120 -202 195 -51 61 -20 -118 15 89 36 -16 -95 153 29 -76
7787 -76 158 -192 -127 195 258 155 41 85 377 8 52 5 63 165 -169 -46 -61 228 -59 -79 -5 -74 -196 89
7811 89 62 -208 -26 -131 -45 -5 -35 -160 78 -18 -248 -40 165 33 -60 28 118 -198 24 65 110 34 28 -188 114
7836 114 42 -55 -62 138 18 77 9 99 122 173 261 85 39 13 -91 -64 226 15 102 -73 60 -32 -210 26 -118
7861a18K49j00J67j65n04L71K31q3Q2J48l84J60k68L07No8j17L48m09L49j2k27
7883c8o0O6MQM5j19J49L61l07k98L17k40J54l4q7K17j46N9jj3J01r5j04J97l71
7908b35J92J00p4K44j63q0K1j10P7p9K87J0j93J56l5r3jj0p1j36qJ12J78Q1j63
7933Gj66J49Q7Q5j07J52k79Q3N7O4l78M12k0k70j02O8J56m3j33R8J08J09j09q6
7957e8o0K13L8l05J35K72k26J1Q8j55p9J04L55m88J60j06o0J20N7PJ21l90J54
7980i2L02j15k15K7L87k47L6q2j05K44k88J82k13K01P3Qk65J45o4N5L60m09l4
8003a09L11J11k63J81m47K7J62J19j01k35J12N4k8K87l67N03m03p0L37k93%k6
8025a38J52J98j62N9O8k20J85k65K30l13L02j80K48k63K35r7q5J68r2k51K06L08
$$ plain form
7861 -118 131 31 198 33 -471 -100 131 48 130 278 -106 54 -214 93 98 30 -87 261 -148 201 189 -38
7883 -38 -98 -32 -28 -20 25 -94 55 416 109 -189 128 -112 42 8 -79 138 -8 51 50 37 138 43 -61 136 -235
7908 -235 -43 57 -17 227 64 -16 5 -105 -28 -107 180 190 -3 153 118 25 24 14 -57 -193 -201 -89 89 170 7
7933 7 -159 -10 77 162 55 207 -72 11 68 132 -246 166 146 -124 -226 -158 -2 -45 -178 -80 28 137 28 -58
7957 -58 -118 95 133 -172 -37 235 9 20 108 -47 -126 -22 333 -155 5 -101 -161 -41 16 23 144 -246 -92
7980 -92 210 95 -120 -93 294 47 83 1 -104 140 -148 34 -179 22 95 103 -162 -17 -81 -26 334 -75 -109
8003 -109 202 313 50 231 -216 -189 -27 92 -9 -244 -132 -78 -106 181 -186 317 -86 -156 181 -112 -112 -138
8025 -138 14 212 50 109 177 -43 142 -123 107 -206 96 -84 164 -99 136 39 -46 122 30 -221 -15 293
8047B93l56L0O3k7jj5j82K94j40K02l38J46J39N0k56J03r4J17n7K10l45J88L3
8070E7J39p4k62M8J50j47K5M6qN5O3N8M4k30J30p2N3j28L14j66l7k16p8K43K5
8095C2j11K92j50R4k8J93l19j3k7j48M68k01m6P6j38M9j61K24k7P5k19L43j48
8118A10k03J89l3j31Q7j7L06j38k03J86q4k28qL00l07K34j50j5J67r1N2j00K08
8141A31k5j9q5r2J93k6l36J1J85J11Q2j67J61j76K79l14r8K30m4J67k20J13j28
8164f7j13M08l62J18P2j82N9J65j30k2Kj15j8J08R9j1j63J19J42j11J47j38J20
8187A27j97J94k1j70
$$ plain form
8047 293 -63 -33 30 3 2 -13 -195 99 -41 161 -177 -31 108 158 -98 5 -89 28 -29 181 -164 24 57
8070 57 196 122 -140 -92 58 -89 -64 -18 -26 29 92 150 194 -36 94 22 75 -53 261 95 58 -158 -236 7 32
8095 32 -79 213 63 157 129 322 3 -10 -37 -185 283 82 36 112 -26 23 -138 86 59 134 -85 258 110
8118 110 -93 96 63 -68 19 2 308 170 -33 153 69 -159 -167 133 -174 60 -90 -105 62 -29 23 -77 131
8141 131 106 87 2 -90 103 77 -259 -248 -63 48 130 -37 124 -52 227 -87 -185 45 1 168 -52 61 -67
8164 -67 -180 228 -134 -16 56 -126 -67 98 -32 -54 -52 -167 -185 -77 22 11 -152 -33 109 -2 145 7 127
8187 127 -70 124 103 -67
8191f7
$$ Imaginary data points
##PAGE= N=2
##DATA TABLE= (X++(I..I)), XYDATA
0@%%%%%%%%%%%qJ6j6J6k2L0l2M0m8N6p2Q8j04J20j37J61j91K21k53K88l29L75
33A99m24M80n42O07o80P60q48R47j054J170j295J434j585J749j931K128k345K584
51A354k844L134l458L819m225M684n207N813o523P366q390R665j1300J3486j6574
66i200K1301k9527M7866j64136M8128K36900j76127k3590J06398k047j15929O8321
78H358M3690o4631J3209O2603o3517m4276M8860L975m8835M5640L1837l3679m1763
91c8529K2372J8164k2438K3382J9625l5023m748L1390J1209n2002P398P1490j2461
104C9829n9486J2311K9881l7583j5130L9673m770j9305K1159J163m7873J6189
116b3942O0058k9363k6620L8806P716l5963l057L0416j3638r671K4046j7249k7488
$$ plain form
0 0 0 0 0 0 0 0 0 0 0 0 0 -8 8 -8 8 -14 16 -16 24 -24 32 -40 48 -56 64 -73 88 -103 118 -135 153 -176 199
33 199 -225 255 -287 320 -360 400 -448 499 -555 615 -680 754 -831 918 -1013 1115 -1230 1354
51 1354 -1490 1644 -1814 2005 -2220 2464 -2743 3070 -3453 3913 -4477 5188 -6112 7374 -9200
66 -9200 12101 -17426 30440 -133696 -85568 151332 -24795 -48385 58013 55966 -59963 8358
78 8358 52048 -12583 626 63229 -288 -44564 4296 8271 -40564 5076 36913 3234 -38529
91 -38529 -16157 2007 -20431 2951 22576 -12447 -17195 14195 25404 -26598 -19200 52290 39829
104 39829 -19657 -7346 22535 -15048 -30178 9495 4725 -14580 6579 7742 -40131 -23942
116 -23942 36116 6753 -19867 18939 26655 -9308 -12365 18051 4413 -5258 18788 1539 -25949
129b5949K0127J7818k4121r02L4678m197l1467k917K1504k314j0181J2439n69
142C949m605N330j882q724m4K2940m79k2893K900P927j0356o557J2848M845n504
157c05N653l923j3368N903J7566r283j3672J7686L269j8525j842J3012M748j689
171E230N250p371j0462J2266J647j6545J564J8418l288j7620L396P193l812Q8
185d046O888j019l597P148m661r440R572J1102n774r957O654M699j0628l546N063
200a542L147M35q63o603n319Q824N828p987j298J1639R02j4003J003J0824P51
215E738l049J933L43n387P80J060r351J858J1743l071j2494K604J0030m097l772
230e132P396K978m372R90O79o718K786R088m697n622N381K573j0232k338R480
$$ plain form
129 -25949 -5822 11996 -12125 -13027 21651 17454 -14013 -16930 4574 2260 -7921 4518 3949
142 3949 -656 4674 2792 -5932 -5976 16964 16485 -6408 -3508 4419 -5937 -12494 354 5199 -305
157 -305 5348 1425 -11943 -6040 11526 2243 -11429 6257 9526 -8999 -10841 2171 6919 5230
171 5230 10480 3109 -7353 4913 6560 -9985 -8421 9997 6709 -10911 -7515 -322 -4134 -4046
185 -4046 2842 1823 -1774 5374 713 -8727 845 11947 6173 -3784 2870 7569 -3059 -6605 -1542
200 -1542 1605 2040 1177 -5426 -10745 -1921 3907 -4080 -5378 6261 7163 -6840 -5837 4987 5738
215 5738 2689 4622 4965 -422 358 1418 -7933 -6075 5668 2597 -9897 -7293 2737 -1360 -5132
230 -5132 2264 5242 870 1860 2539 -4179 -1393 7695 2998 -2624 2757 5330 -4902 -7240 2240
245B240j4m139N69q31l526L391N292n082j092R237M83r686j361Q543O2l594K481
262B973p05l581J96J388m007rP435k129q000L179N604m074k905P113K298m283
278D93M20Q50k978J447M874l525m349N437J163p218j507N919J320l992N59q5k233
295c405K323J553k413P05N538p84n626N39M906L9l107J022R42k057r91m95j286
312b597J106K726j085m533K373M213l683k940M931M125l999j746K622m64m09K347
328B987r43l821L327K577o768l021N940J715m572N7L180k374p33L381j102l39
344e09L473j74m589J173M574k302k722K573J605l335j589Q87q91L83J993j507
360i57k271J962K712k761j391L572K375j846j392J332N9p64M60n46p70J034M44
$$ plain form
245 2240 2226 -1913 -1344 -2175 -5701 -2310 2982 -2100 -3192 6045 6528 -3158 -4519 4024 4086 492 2973
262 2973 2268 -1313 -1117 271 -3736 -3745 3690 1561 -6439 -3260 2344 -1730 -4635 2478 4776 493
278 493 913 1763 -1215 232 5106 1581 -2768 2669 3832 -3386 -4893 1026 2346 -1646 -1087 -1172 -3405
295 -3405 -1082 471 -1942 -1237 4301 3517 -2109 -1570 3336 3375 268 1290 2232 175 -816 -1311 -2597
312 -2597 -1491 1235 150 -4383 -2010 2203 -1480 -4420 511 4636 637 -1109 1513 1049 640 2987
328 2987 2044 -1777 1550 4127 -2641 -5662 278 1993 -2579 -2522 658 -1716 -2449 932 -170 -509
344 -509 2964 2790 -1799 -626 3948 1646 -1076 1497 3102 -233 -1822 -935 -1826 -1443 550 -957
360 -957 -3228 -1266 1446 -1315 -2706 866 3241 1395 3 1335 1394 630 1090 544 -226 808 1252
377A252l378j368L650P07k981M8K711q89j708J407J132j0J868j89k930P07K841
394B870j528k614K029J113k288j397R42k58L3J205j379p39K474J92k194k6L484
411A919P34k492q6J106q5m02l95j87J84Q61j016k150O37J868m58k153J126J761
429G72r63j322O00J687J44L64K7j384P16J519j243j978J382J512k497j262J648
446b78J79j284N41Q10j135P88J232j694o04K888L11k430M90K386q66j478P95O56
464A307q80j55j50j520M0J460q57j516J107K126j153r86J432P70r5j92l71l07
482F0P90O70j079j046J258O79j721j189J110M25j091rK76P6K74L44k43J16J526
501A226o1j139K75J340l06j331oN11m0n46n03n18J89R66r80q65J081J068m39n67
$$ plain form
377 1252 -2126 -3494 156 863 -2118 -2070 641 -248 -1956 -549 583 573 2441 2252 -678 29 2870
394 2870 1342 -1272 757 1870 -418 -1815 -873 -1131 -1098 107 -1272 -2011 463 655 -1539 -1565 1919
411 1919 2653 161 75 1181 1096 694 299 112 296 1157 141 -2009 -1372 496 38 -2115 -989 772
429 772 -191 -1513 -913 774 918 1282 1309 -75 641 2160 917 -1061 321 1833 -664 -1926 -278
446 -278 -99 -1383 -842 -32 -1167 -379 853 -841 -1445 1443 1754 -676 -186 2200 1334 -144 651 1307
464 1307 427 272 122 -1398 -1358 102 -755 -2271 -1164 962 -191 -1177 255 1025 930 738 367 60
482 60 850 1520 441 -605 653 1332 -389 -1578 -468 -43 -1134 -1143 -867 -791 -517 -173 -416 -300 1226
501 1226 1165 26 301 1641 1335 4 -2 509 469 -77 -580 -1098 -909 57 -923 -1788 -707 361 -78 -645
521f45O13Q45J27k37j55K33K90m8j124k59R87l70q84m20J018K3j315J5N84L65
541c57K0K35K90RJ169n3j377O71J109j014j465J041K65j167L9M98n32p2Q09p73
561f55o59J439L33j446L56J734l08r23R31J14o71R5N52r48j68O76l77j570K71
580a224J502n85o40M96N35n53J62M22m9m4N41N35q34o3R06m65j127M39O30p33
600a49r41Q93p1o07O35K1n15M78J035j273p48J635Q88j315M53N53k40o20L32j05
620C39o63N18Mr42k76R70N2o71QP97j49k27L16M25k69r5K39p5j61Q37n91o90M38
643A34J32n53p74O87Rl95p9K95M46j9L91k60l65R52M87r98J41N70m03k75J88j06
665B05ML2m96n27K31M62l20k62N51O2j76q8O50o1l6M41R0o98K82N0l55J05L10
$$ plain form
521 -645 -32 813 940 703 548 781 1071 1023 -101 -360 627 257 -627 -1047 -29 -6 -1321 -1306 -722 -357
541 -357 -337 -102 188 197 1366 1313 -64 607 1716 702 -763 278 543 -624 -585 -87 -619 -691 118 -655
561 -655 -1314 125 458 -988 -632 1102 794 -129 802 916 245 340 892 -56 -224 452 75 -1495 -1224
580 -1224 278 -307 -947 -451 84 -469 -307 115 66 22 563 1098 264 201 1107 642 -485 -46 584 -149
600 -149 -1090 -197 -268 -875 -240 -219 -734 -256 779 -494 -1242 393 1281 -34 419 972 732 112 444 339
620 339 -324 194 198 -744 -1020 -50 2 -669 -661 136 -13 -240 76 501 232 137 376 301 140 977 386 -304 134
643 134 266 -287 -1061 -374 -365 -760 -839 -544 -98 -117 274 14 -351 601 1088 90 231 801 398 123 311 205
665 205 209 241 -255 -782 -551 -89 -409 -671 -120 -58 -234 -322 328 267 231 672 762 64 346 396 41 146 456
688D56m15k89j65r9J35l04L15J55J37R3J84m33K02N88L0n56K47O35p12n29M95
709A70P2o5k57j7o05N6L39j07k16L34O18k16k61j7P65n55L13M20m61k12K42l06
731C4n96N37K67p93R1Q14n30m99O5N62j54J29K33l3j61N56Ko11K52P21p56o27
753d97K94N12l55J3j11m19J83O3q9J88K39J10p30M83K05L10m9q2MK79j53l74j25
776a01k90M62j15l60k54M29P5m18N40O5j71K92J41j61k47M95l7k18M1K17j02l37
798e4K51q4j80j78K09k10J0n9Q6L6K21N2k38K57J13k10M3K51r5J39j71rr9k12
822a31R4P0l84Q5J09L1k66J07J50K2K6K23J13j14n4K09l9j75J79l22n5J46j69
845a45k93P6K86o6m5K5K56o0j72L17l4q0L92k15k58J74L58k58m04J63j68K04J7
$$ plain form
688 456 41 -248 -413 -512 -377 -681 -366 -211 -74 19 203 -230 -28 560 590 34 281 916 204 -325 170
709 170 242 177 -80 -97 -702 -646 -307 -414 -630 -296 322 106 -155 -172 593 38 351 771 310 98 340 34
731 34 -562 -25 242 -551 -460 354 -176 -675 -610 -48 -202 -73 160 127 -34 522 524 -87 165 886 130 -497
753 -497 -203 309 -46 -33 -144 -563 -380 -317 -406 -218 21 131 -599 -116 89 399 350 268 272 551 398 24 -101
776 -101 -391 71 -44 -404 -658 -229 -154 -572 -32 33 -138 154 295 134 -113 382 345 127 168 385 283 -54
798 -54 197 113 -67 -245 -36 -246 -236 -295 -209 -173 48 100 -138 119 232 22 65 316 221 360 189 180 81 -131
822 -131 -37 33 -351 -266 -157 -126 -392 -285 -135 -113 -87 136 249 135 81 290 251 76 255 -67 -122 24 -145
845 -145 -438 -362 -76 -142 -187 -162 94 34 -138 179 145 65 457 242 -16 158 516 258 -146 17 -151 53 70
868G0l16J23k71L24Q0m36N09N9j03n3r8K33j08R7mJ8J20q3r0k18J24J75o03K8
892d23L43p2k42J22M14j44L15k51o3K39QJ28k01l21L84k33k42L40J4o9k81N8M0
915a37J7K57j07k02K03K5K21k87p9N62l59k78L11N1n2K11k45j32K4J10k77k83
937d46L70n7n2J32J84k06j18P38l34k97K94P6k34L42k21j93K6k46J36j8K02k70
959a92l8m1r2M01k84nJ29J55r2K33p0m3J38J0l71Q9K12j54k0R2J10l54Q6J70j27
984e8j6j77J65J23p3J0J80o4K77j6m93K34n0Q9m46mM47l26p9K14k8K8m4J86j10
1009c1r1J62Q8k68J80J40k14k8K48k2j90J91p5l4k15J30r5j1K32j92JJ06M3j13
1033e8j41M33q8j04L09k88K8j59J43r7j02J86j32k2rK37j45p2j24K64J23q6K5
$$ plain form
868 70 -246 -123 -394 -70 10 -426 83 142 39 -14 -112 121 13 110 106 124 244 161 71 -147 -23 152 -451 -423
892 -423 -80 -152 -394 -272 142 -2 313 62 -1 238 246 374 173 -148 236 3 -239 101 115 46 -235 -177 -137
915 -137 -120 137 30 -172 31 56 277 -10 -89 473 114 -164 147 198 146 357 112 -20 4 114 -163 -446
937 -446 -76 -133 -185 -53 131 -75 -193 545 211 -86 208 284 50 392 171 -22 4 -242 -106 -124 78 -192
959 -192 -230 -271 -363 38 -246 -251 -122 33 -59 174 104 61 199 209 -162 -73 139 -15 -35 57 167 -187 -101 69 -58
984 -58 -74 -251 -86 37 -36 -26 154 90 367 351 -142 92 42 131 -315 -319 128 -198 -277 -63 -91 -63 -107 79 -31
1009 -31 -122 40 128 -140 40 180 -34 -62 186 164 -26 165 90 56 -159 -29 -124 -135 97 -95 -94 12 55 -58
1033 -58 -199 234 146 42 351 63 91 -68 75 -22 -124 62 -70 -92 -101 136 -9 -81 -205 59 182 96 121
1056A21o2j61NJ24J6J72J3RJ04l74R3j40l4p9K7J53L9J99k80j3J95J2j02K70k27
1081H0k2rk34J00J6K17j05M4j65Q5j05j56K1P8K42j01K00l37k5K87o4j43L32j65
1105G1k66J78J06J31l32K05k20L70m25J81q1q1r3L00j84N8K54k10J9Q6R8k11J78
1128A32k24J49J25J01j94q0k9j03K58l34L1j2O0K57j00p3J6K46k48J84j00o2j50
1151a50K60J71l87PK8J75j7k59J7k4K67j41K71j46j90J18l9NK06k23K06J81o4
1174B72r8j82n4J61l35J76o5k6J25M6q0L1j06J93j84j00K81j43K76r6j5J8N4J09
1198B58l99L8N6j74K40k9j53j6p6K50Q6K2j26j48L18N6k0j7j80j43M47k23m8J3
1222C2r0Q8O2P7k6j14l4L1r5j28Q1J3J5J47J77k13J7J59L0k40K7lK5j86J43kK7
$$ plain form
1056 121 59 -102 -97 27 43 215 228 237 341 -33 60 -80 -114 -193 -166 -13 26 225 -55 -68 127 139 37 307 80
1081 80 58 49 -185 -85 -69 148 43 87 -78 7 -98 -254 -233 -155 87 -14 186 -151 -176 111 47 -96 236 71
1105 71 -195 -17 89 220 -112 93 -127 243 -182 -1 -82 -163 -256 44 -140 -82 172 -38 -19 67 165 -46 132
1128 132 -92 57 182 283 89 9 -20 -123 135 -199 -168 -180 -120 137 37 -36 -20 226 -22 162 62 0 -150
1151 -150 110 281 -106 -99 -71 104 87 -172 -155 -179 88 -53 218 72 -118 0 -39 -34 172 -51 155 336 272
1174 272 174 -8 -62 99 -236 -60 -125 -151 -26 20 -60 -29 -135 58 -126 -226 55 -88 188 92 77 95 149 258
1198 258 -141 -103 -47 -221 19 -10 -163 -179 -255 -5 81 103 -23 -171 147 203 183 166 -14 -157 290 67 19 32
1222 32 -58 30 92 169 143 29 -5 26 -69 -197 -116 -103 -88 59 236 23 40 199 229 -11 16 13 38 -148 -5 -7 20
1249B0rM5q0K28k42P9M8J00k5J41l16j8q0N5J19l6j25J34J42m43m2L86J18j04
1273I5k46L00l40K42j51O8k2mJ86j37K15l09K43j78J10l9j15K62j49k20K14k76
1295b51J37L6l02J02L40j30L8l6L92k20n2PJ90k69k00K94r2j34K79l01L91l14
1317i5kL1J22l3J40q4k10MO6K12j20l2r%k16M12j96k51J53J08m5j3O4j75J72o1
1343e8J51J40k23J67o8n7m4k23J30M83n59J96k46J38J35O9k78R6N3N9j19J5J47
1366A04n4L2r4Q5j01K93k68j1r5N7mj3j28L40k12R7L6k44M3J3K77m38K59R4L5
1391A03j73R6L12l91J43J8j82K33j68J66j63o1m3K35n4J63k78M2j25K82k90L10
1413A75k46K45k58K45k04N3J09j86JJ18K44k98m0J43p4K4k07J42j04J88nL5Q6
$$ plain form
1249 20 11 56 -24 204 -38 41 89 189 164 305 -11 -29 -109 -54 65 29 -96 38 180 -263 -305 81 199 95
1273 95 -151 149 -191 51 -100 -32 -54 -58 128 -9 206 -103 140 -38 72 33 -82 180 31 -189 25 -251
1295 -251 -114 -78 -380 -278 62 -68 -30 -66 326 106 54 61 251 -18 -218 76 -16 -150 129 -172 219 -95
1317 -95 -97 -66 56 23 163 79 -131 -127 -61 151 31 -1 -10 -10 -226 186 -10 -261 -108 0 -45 -58 6 -169 3 -58
1343 -58 93 233 10 177 109 52 8 -215 -85 398 -161 35 -211 -73 62 131 -147 -51 2 61 -58 -43 104
1366 104 50 82 -12 73 -28 265 -3 -14 -109 -52 -56 -69 -197 143 -69 28 64 -180 -137 -124 153 -285 -26 68 103
1391 103 -70 26 338 -53 90 108 -74 159 -9 157 -6 -67 -110 125 71 234 -44 -2 -127 155 -135 175
1413 175 -71 174 -84 161 -43 10 119 -67 -66 52 296 -2 -42 101 27 51 -156 -14 -118 70 65 100 186
1436A86r8M4o7J85k59J88k07J22r2j45k6K01m3l77K04K57j66J86j20J42j49j7
1458e1J35j37L10o5k25P7jk36Q6r7K26j51K61j87J23q3m6P8j53K12p2j3L6J93
1482B20k50J53j35j77L87o5n6m9j03o3K11P2k51J3J95j89l7mL98m19J35r1P0J00
1506F5j90Q7Q7M1j24K07l85L57k25K03k8n2j11L7j55K13K26m71L42k72l9j2L05
1529A06k87J93K8j81K7j88M30L6k8l76Q7J21N2k19J41J92l41K19J33j67N7m9Q8
1552G4JJ17k27n5k87K12Q7jM4J33P3j62J3P0r6PJ52j26J30k74M92q6m77J39M0
1577gKj40J22j8J22Kl6O7m0l8n9R2p5j9O7J1nj8Q6j64k15J68j8K24j81j37J23
1604h4J43j73L78j40k24J08k74L22j63J55j91L57l51J22J42p9j49j77L21j30L41
$$ plain form
1436 186 88 132 65 250 -9 179 -28 94 2 -143 -169 32 -11 -388 -184 73 -93 93 -27 115 -34 -51
1458 -51 84 -53 257 192 -33 44 43 -193 -107 -204 22 -129 132 -55 68 -15 -61 17 -136 76 4 -9 27 220
1482 220 -30 123 -12 -189 198 133 77 28 -75 -138 73 145 -106 -93 102 -87 -124 -128 270 -149 -14 -105 -35 65
1506 65 -125 -38 49 90 -34 173 -212 145 -80 123 95 43 -68 -31 -186 27 253 -218 124 -148 -187 -199 106
1529 106 -181 12 40 -141 -114 -302 128 164 136 -240 -153 -32 20 -199 -58 134 -207 12 145 -22 35 -14 74
1552 74 75 192 -35 -90 -377 -165 -78 -79 -35 98 171 9 22 92 -4 3 155 29 159 -115 377 291 -186 -47 -7
1577 -7 -5 -145 -23 -41 81 83 47 114 74 36 -23 69 -6 -25 42 53 48 30 116 -48 -263 -95 -113 111 -70 -207 -84
1604 -84 59 -114 264 124 -100 8 -266 56 -107 48 -143 214 -137 -15 127 48 -101 -278 43 -87 254
1625B54m93M56m44k9J91m5k8J49L5j76j44K54M4O1j57j02J96j21J12O8j39p4j17
1648b49J19oPQ7%j31L4J33J14q9M9k50L71J30m46k6N8N8j98K11m5J18N6l80O5
1673b10L2L10m03L66k03k28N94j59j33Lj96L29j94l8J93p5Q8j27R4o2n0l4R4k63
1697b72K39K01j32j46L13l12J31o5J43j3k41k1J30L7q8J65j72l4J69j28R8j1k9
1720c8J1j7K23l7J20k02m6J45O4l51m4L5K13k8j07j61j15L69j99K72k02J59j89
1743a25N2J37m4k0o7K92j57k00J09K43j61p2j69K51q7k6J20q1K49k46j02J13M9
1766E8m27K80J55o9J57k13J58j55k6MK24J98j70k38j5J07P2j49N4k85L83Oo3J15
1790A61j88k27K92j80J45J39j06n7N7j33pO7p5J95n7o3J11j41J01J39k60j24M72
$$ plain form
1625 254 -239 217 -227 -256 -65 -110 -138 11 46 -130 -274 -20 24 85 -72 -174 22 -99 13 81 -58 -132 -249
1648 -249 -130 -136 -129 -42 -42 -173 -139 -6 108 19 68 -182 189 319 -127 -153 -95 -37 -235 -24 -69 49 105 -275 -210
1673 -210 -178 132 -271 95 -108 -336 258 99 -34 -31 -227 102 -92 -130 63 -12 76 -51 43 -19 -69 -103 -9 -272
1697 -272 -33 168 36 -110 203 -109 22 -43 100 87 -154 -175 -45 -8 -96 69 -103 -137 32 -96 2 -9 -38
1720 -38 -27 -44 179 142 262 60 14 159 223 -128 -172 -137 76 48 -59 -220 -335 34 -165 107 -95 64 -125
1743 -125 -73 64 20 0 -67 225 68 -132 -23 220 59 -13 -182 69 -18 -44 76 -5 244 -2 -104 9 58
1766 58 -369 -89 66 -3 154 -59 99 -56 -82 -78 146 344 174 -64 -79 28 100 -49 5 -280 103 109 46 161
1790 161 -27 -254 38 -142 3 142 36 -21 36 -97 -104 -37 -112 83 26 -37 74 -67 34 173 -87 -211 261
1813B61k68k08L21j83nM6j19K64p9j82K54j7J29l08O7q5K00j42K22k42J10J94
1835B30l06J28j9m1j18m1L4K40k81J45K50l86L79o5k71k0L78l77J9J09J62K48
1857C97l83j85K06r6J48k24n8J26k03J25l8L74k40O3m9j72K12j38K67m9r7k22
1879b36Q2M8K49r0J04l36J01K33m4q1rQ4k79L4J42J00j08k1q6K29K7k69K69j16
1903B7JK37j52q7J89j51k48L21j2n6j66K59k52N1K9J20j4k27j81K81L30o16L88
1926G1k36M12j98k03J95L9j06j89K87j32J25j29O8R1k6k20L38r7l7j12J09M8l13
1949b15k6J88N3N1n1J68l43J59J05k82K99J7j87J7J06j28J12l5J87r7L9k93L4
1972a22J08k44Q8K12n1J38r7j98K16P3k36J50k28J13K58k61Q8j54J66r8q3J67
$$ plain form
1813 261 -7 -215 106 -77 -82 -36 -155 109 30 -152 102 85 214 -94 -27 -112 88 -54 168 -74 36 230
1835 230 -76 52 33 -8 -126 -167 -133 107 -174 -29 221 -165 214 149 -122 -142 236 -141 -122 -13 149 397
1857 397 14 -171 35 -61 87 -137 -195 -69 -272 -147 -185 189 -51 12 -37 -209 3 -135 132 83 -14 -236
1879 -236 -154 -106 143 53 157 -179 -78 155 111 30 21 105 -174 -140 2 102 -6 -27 -113 116 143 -126 143 27
1903 27 28 265 113 26 215 64 -184 137 125 69 -97 162 -90 -39 -10 110 96 -131 -312 -31 299 -317 71
1926 71 -165 247 49 -154 41 80 -26 -215 72 -60 65 -64 4 95 69 -151 187 90 53 -59 50 98 -215
1949 -215 -241 -53 0 51 0 168 -175 -16 89 -193 106 123 -64 -47 59 -69 43 8 195 98 137 -156 -122
1972 -122 -14 -258 -170 42 -9 129 32 -166 50 123 -113 37 -191 -78 180 -81 7 -147 19 -79 -162 5
1994EP7k10J74k06K57m6j7P2m17L97L6k10K68m6k9k37M94l78n0k7J16j27L10k93
2018h7N6J21l46N8J7K70j18M9L2r3j5L06j34j48L9J5j70J24R7j7k3k41n2K65J00
2043A05m9r1p4L5L60j58k89K78p9p4K15q8k60j20M32l56K34o6q3J40J54l74N3
2066a55K47q4K7l40K07R6j94N7J20k21J61J15j58J92P5O4j83j06l2K21L5r8n8
2089a2j14J44N1J85j46k07J18j33J18j17o2J46K24q1j79K16j84m6J51M4q0j08
2111g2k44L39k71K67k31K05oN6j61o9J08j15L22o2P0q1M7j5j54J16J04j20P3l50
2135b44O5j01N12j47j2j57K18j52j43K18j27O7j42n1N1K71l94L13q2K0L3l3mj09
2159a30j85M51N4k33J0J1j16J37MQ5q9j29K33r0J58k40n0O5j49L57l96K02k65
$$ plain form
1994 5 82 -128 46 -160 97 51 34 106 -311 86 122 -88 180 134 105 -132 362 -16 -66 -93 23 -104 206 -87
2018 -87 -31 90 -256 -198 -181 89 -29 20 52 -41 -56 250 116 -32 7 22 -148 -24 73 56 33 -208 -260 5 105
2043 105 56 -35 -109 -74 286 128 -161 117 38 -36 179 91 -169 -289 143 -213 21 -45 -128 12 166 -208 -155
2066 -155 92 8 35 -305 -98 -2 -196 -139 -19 -240 -79 36 -122 70 145 209 26 -80 -112 109 144 46 -12
2089 -12 -126 18 69 254 108 -99 19 -114 4 -113 -175 -29 195 114 -65 151 -33 -79 72 116 36 -72
2111 -72 -316 23 -248 19 -212 -7 -13 43 -118 -187 -79 -194 128 66 136 55 102 87 -67 49 153 33 106 -244
2135 -244 -179 -280 232 85 73 -84 134 -18 -161 57 -70 -3 -145 -196 -145 126 -268 45 -37 -17 16 -17 -21 -130
2159 -130 -315 136 190 -43 -33 -22 -138 -1 3 88 -1 -130 103 13 171 -69 -119 -54 -203 154 -242 -40 -305
2182c05L02Q2k1M8k34K25r3N0k1L3l3l30K06J92p5J36j44k4r2K52n1j03O7M7j24
2207a0Q2r0J3L8J02k2m7J02q9j47O6j79L2Q7K04l49J75J08j07J7q6j5J90n5n8
2232c8K80k96J54j69Q7l0J31n4l9N6k3j16k2P5P2j35O4P4k79K02J41No3r1J23
2257A09l29J45R9p5r8k03M75j31J26j29k22K54J79l54K55N4j10P8J4r3or5n0N9
2281d8L27k61K82k92K57k94q2J09q5q0m8K20j37K57k21J30k17K10k42L50m4j24
2303c3r0K11j78J12l3M5O9j66J11j03p9J09K58j61k73L18k21j86J01J64p3K91
2325A93k88J79J3k73K37j5J56l18k8J34j38L36Kk35J88r0n2q9J28k20O5J32m5
2348b8O1r7p9J55j50J48j00R0K48k71j94K63J62j86J21l39M09j97j5J13K3m15
$$ plain form
2182 -305 -3 79 58 106 -128 97 4 54 33 66 33 -297 -91 101 26 162 18 -6 -98 154 103 0 67 114 -10
2207 -10 72 -18 -5 33 135 113 66 168 79 -68 -2 -181 -149 -62 142 -207 -32 76 -31 -14 -100 -115 75 20 -38
2232 -38 242 -54 100 -69 18 -12 119 65 26 82 59 -57 -79 -4 68 -67 -3 71 -208 -6 135 140 77 -14 109
2257 109 -220 -75 24 -51 -149 -352 123 -8 118 -11 -233 21 200 -154 101 155 45 123 137 44 38 -57 -107 -48
2281 -48 279 18 300 8 265 -29 -111 -2 -87 -167 -215 5 -132 125 -96 34 -183 27 -215 135 91 -33
2303 -33 -123 88 -90 22 -11 34 103 -63 48 -55 -134 -25 233 72 -201 117 -104 -290 -189 -25 -98 193
2325 193 -95 84 97 -176 61 46 202 -116 -144 -10 -148 188 190 -45 143 53 1 -88 40 -180 -115 17 -28
2348 -28 33 -64 -143 12 -138 10 -90 0 248 -23 -217 46 208 22 143 -196 213 16 1 114 137 -278
2370b78K67J15j1l07P4L8J90j77J05j59L67k23J1J5l4L49m26K85MM6m42K55J64
2393B28m05J48k2o4P2j49K1K36k3PP2j95J01m5J8qJ35l28K68k36R3J54j40j7K16
2418A37J71j63k84n2N11j64l94K43J10j6J65q3j22k16L15o8o8j99L30j77p7K70
2440A69m17L06r9j00J69J00j6l12k1L47Q4m09L64j46m0r1Q7N2k12J58kk4K07j49
2464EK7J92k89P7j7O5j88K55K6k97J21K3RK31m28o7M22m69J76J96j01J74n5m8
2488D0o3n9l9N1J94m9j65N8K40l30J03J4O9l8k42J25K51m9K0j43kJ15m7j33J49
2513G0M3j8k16J35q6J69J34l59J89j42J27Kk24J56Q8q6O7m9j31J64k92J59m8J99
2537E1jj32R3N3j05p2J11L1J19k41q2Q8K19j75K09j39m3k50L64k67K06j45K4R0
$$ plain form
2370 -278 -11 104 93 -214 -140 -102 88 -89 16 -143 224 1 12 27 -7 342 -84 201 205 251 -191 64 228
2393 228 -177 -29 -51 -115 -43 -192 -171 65 42 49 121 -74 27 -18 0 -8 127 -201 67 -169 -76 78 -62 -79 137
2418 137 308 145 -139 -191 320 156 -238 5 115 99 264 181 59 -157 158 90 22 -177 153 -24 -101 169
2440 169 -248 58 -41 -141 28 128 112 -200 -221 126 210 -199 165 19 -21 -112 -25 27 -185 -27 -29 -53 154 5
2464 5 32 224 -65 12 -5 60 -128 127 153 -144 -23 0 9 240 -188 -255 167 -302 -126 70 -31 143 88 40
2488 40 -23 -82 -121 -70 124 75 -90 -32 208 -122 -19 -5 64 26 -216 -91 160 111 131 -12 -14 101 54 -79 70
2513 70 113 95 -121 14 -72 97 231 -128 61 -81 46 48 -176 -20 68 -18 49 0 -131 33 -259 -100 -148 51
2537 51 50 -82 11 64 -41 -113 -2 29 148 -93 -175 -87 132 -43 166 27 -16 -266 98 -169 37 -108 -84 6
2561Fl4J26Q5p3j50J57j27P3j53R7k56L9J73L15j21R7k50J06k39K27J0J61k74
2584eo3j3J74j21K2l2J50rN0q0q7K01k98j27J67J16k21K88j83q4J62R9j90N4J02
2609G2n1R9j15l8j02m5j55L42L6K3k09K05j33j00J42J04o6J42k36P8R0j44lP1
2633GQ6q3k8k4K9p5MK4r0J89O2k36K09q6J26k16M05k58J61l28K38M2n12J67K66
2658G9j12J50k6J46pj99R1n0N1l0k05K2K55m9q2Mj98J34N3R3m98K53Q5j08L02
2683A54J68l17k27K24j41N9L2P0k66J74J73k0k67K18j28L9J67j20j68K80k33J10
2705a9n5L78k97J54k27R1J81l44j0n0J15k5P5N4Mkj10l07J74L03%j11N1Ok05K85
2731A09M5K1q0o8o7O5j1L5Q8j61J57j08K68m50L16OJ6j29R1j27j04J60j47j09
$$ plain form
2561 6 -28 98 183 110 -40 117 -10 63 -90 7 -249 -210 -37 278 157 254 4 110 -129 98 108 269 -5
2584 -5 -68 -81 93 -28 -6 -38 112 103 153 73 -14 187 -111 -238 -71 45 -176 112 -71 -155 7 106 -84 -30 72
2609 72 21 120 5 -33 -135 -180 -335 7 43 66 -143 62 -71 -171 -29 75 9 151 -85 -7 83 -61 -64 7
2633 7 93 10 -18 -42 -13 -88 -84 -60 -150 39 101 -135 74 -12 114 -102 303 45 206 -122 116 158 -354 -187 79
2658 79 -33 117 91 237 230 31 122 72 123 93 -112 -90 165 116 34 38 -160 -26 27 120 -378 -125 -40 -148 154
2683 154 322 5 -222 2 -139 -80 -48 22 -244 -70 103 83 -184 34 -94 -55 112 -8 -176 104 -129 -19
2705 -19 -74 304 7 161 -66 25 206 -138 -148 -198 -83 -108 -33 21 25 23 -87 -394 -220 83 83 -28 23 29 -176 109
2731 109 154 175 95 27 -40 25 14 49 137 -24 133 25 293 -157 159 165 181 52 143 16 -88 72 -75 -184
2755a84J88J72k64O3R5q4J65k00O4J11n6j17p2N1k36M61j40N9q6j7j66J38J76
2778A21j06k6jJ70k82J38K45k94N4m8q8KJ93R3k12N5j23Q9Q8j09J38n5k30M9K22
2803H3O1l23J78J45k74J39n2M0J07j39r1J46j47J89J39j99n2O3P8n61L75J22m0
2826a3n8L00j10o7J39l84M18j73j67J49q3J6J39q5m8Q5n6J47N1m93M75l19J61
2849B4m0K5K32j81k45R3n4J37M5o8P4k76L33j73J43O1N1l46K77j03m8p8J75p9
2873b1R3r9n7K48j25J02n8m2l9j44J11J02k1O9j2k35J91Jk25K88m88N17j91R8
2897F3k23K2L18k46J31K08l92L9n2q2P9J45L9j38P5k29J25J50J14j70k6R2J93
2920B35l63l3J34O2j59q2R4K76k4l97L97k03J85j01K7J6J81m73K38l31K32K13
$$ plain form
2755 -184 4 176 -88 -25 70 -14 151 -49 15 126 70 -47 -119 -68 -304 157 17 76 -10 -27 -193 -55 121
2778 121 15 -11 -12 158 -124 14 259 -35 19 -29 -117 -115 78 171 -41 14 -109 -20 68 -41 97 42 -188 -139 83
2803 83 144 -179 -1 144 -130 9 -43 -3 104 -35 -126 20 -127 62 201 2 -50 13 91 -470 -95 27 -13
2826 -13 -71 229 119 52 191 -193 225 52 -115 34 -49 -33 106 21 -27 58 2 149 200 -293 182 -137 24
2849 24 -16 9 241 60 -185 -92 -146 -9 36 -32 42 -234 99 -74 69 130 181 -165 112 9 -39 -117 58 -21
2873 -21 72 -27 -84 164 39 141 83 41 2 -142 -31 71 50 119 107 -128 63 64 -161 127 -361 156 -35 63
2897 63 -160 -138 180 -66 65 273 -119 -80 -132 -214 -135 10 49 -89 -14 -243 -118 32 146 -24 -50 42 235
2920 235 -128 -161 -27 35 -124 -206 -112 164 140 -257 140 -63 122 21 48 64 245 -228 10 -321 -89 124
2942A24k53K5o5J41N7J25k44K46J1j65n5J31r2P3J00N5j75j3R5j05K6j65Q0R8
2966E5L7n5k68K37k24K93q4j86k6L22j92j79K85J89j23l05K34L03l61K11p5k56
2988a68K49j07N5O1j05Qk00K13k6KO3j61J56j78p5K00j1L12k18R0j96Q5J31l85
3012b05K31p9O3J09J20k98J63K8q5l2O8n0q9j52L05l26L17j44k4P6K07j96J3J1
3036C1j20J28N6M1j09k64K78l9j28K12q7kl9K39J3n41L87j88J06K6J3j83K0K78
3060A28k2m12K27J82k52M30k17l5J87J8k40N2r7N8k5O2q6o6K32q2J37k38K03p7
3084F7J84k33J08n6j3J16k7L5l93J87j21J53K21k53Q0j68J36l6j12j15J03p9O5
3107a51L96l40K19l7k53Q2N9k9P9j37M8K89j24p6o0J6k41L76q7k31K21j2qK9L4
$$ plain form
2942 124 -129 -104 -169 -28 29 154 -90 156 167 2 -53 78 -14 59 159 214 39 26 121 16 42 -123 -43 55
2966 55 92 37 -231 6 -218 75 -9 -195 -221 101 -91 -270 15 204 81 -224 10 313 -48 163 88 -168
2988 -168 81 -26 29 90 -15 -7 -207 6 -20 -18 45 -116 40 -138 -213 -13 -24 288 70 160 -36 49 180 -205
3012 -205 26 -53 10 119 239 -59 104 132 47 15 83 33 -56 -208 97 -229 88 -56 -80 -4 203 7 20 31
3036 31 -89 39 95 136 27 -237 41 2 -126 86 -1 -3 -42 197 210 -331 56 -132 -26 0 13 -170 -150 128
3060 128 106 -306 -79 103 -149 281 64 29 216 234 -6 46 -51 7 -18 44 -42 -108 124 42 179 -59 144 67
3084 67 251 18 126 70 57 173 146 181 -212 -25 -146 7 228 -25 55 -113 23 -13 -125 -240 -137 -216 -151
3107 -151 245 -95 124 87 -166 -84 -25 -54 25 -112 -64 225 101 25 -35 -19 -260 116 29 -202 19 7 -1 28 62
3132F2k2K17m83L15j95J44J04k81L15m11M06m07L03n1m5m2J93q8j00J61J26l03
3154h2j81J73K42j1l17P8J33K32k24j2k64K46j28K83k90K23Kl87M51l29L12J8
3176A68k09N4j61M05j85L2k80J85P6M0k84K67l16J92n0j6p1J76J65j75Q0k05L17
3199B05p2Kj22j75K49j76L16k71M6J81j41k68J84J66q7J41m33J61O9j59Q6J60
3221F2M7k68K23pk81J86l0p1J27j50J36k4Mj06M13l49J94q6o7K96l30k01N7J9
3245b06K34K1r4J31k18j9L25j91Jj95R8R2J20P3m8k53J73j76P3J37k15K09j76
3268a04K93k58J49k00R1J56L4j79J82k65L18k54J15r3K15k33j62K47j78k7K09
3289E6J3Q1j12J25k71K66r3q0J43k87K80R6r3J3k11q3m7j09J10L06k50K57p9J82
$$ plain form
3132 62 40 257 -226 89 -106 38 142 -139 176 -235 171 -236 67 16 -29 -71 122 34 -66 95 221 -82
3154 -82 -263 -90 152 141 -176 -98 35 267 43 31 -233 13 -115 168 -122 101 103 -284 167 -162 150 168
3176 168 -41 13 -148 257 72 104 -176 9 85 125 -159 108 -208 -16 -66 -82 -153 23 188 13 93 -112 205
3199 205 133 135 13 -162 87 -89 227 -44 2 183 42 -226 -42 124 37 178 -255 -94 -25 -184 -98 62
3221 62 109 -159 64 57 -224 -38 -68 -139 -12 -162 -26 -50 -46 -152 261 -88 106 20 -47 249 -81 -282 -225 -206
3245 -206 28 49 -45 86 -132 -151 174 -17 -16 -211 -113 -21 99 172 124 -129 44 -132 -59 78 -137 72 -104
3268 -104 189 -69 80 -120 -29 127 161 -18 164 -101 217 -37 78 -15 200 -33 -195 52 -126 -153 56
3289 56 69 150 38 163 -108 158 65 -15 128 -159 121 217 124 137 -74 -157 -204 -313 -203 103 -147 110 31 213
3313B13k72J81l35O1J26m48L48L4J63kK7j49J03j7k80J64l0K32J19l09J99m7M5
3336A26p0p3J92j28L2o1j38J43J55j35j53J92o1j18K27l31N7k2R1K52k06m8K2
3359e5P3J14o5m8K51l49P6j17K23j9j10J0J52j90J11L3kk48J91k62J07Q1L58l48
3383c3j74L26p8k56L03j91K08n2p7L0j80L24j38K9M4J3k7j10J55l59l8M64l5k20
3407g2K82j49m6k38O2M36k53n1J19P8l19L36K24m25K18j92j0j44qL27k91MJ3J39
3431D0j65J1J64j15l6j24o3L75l39K16n8o6K01j49J68j7J20j40j0QKlj62qR8J63
3457A11j06n1m4Q1R8j09R8L0j32j50L17l4j05r4K07L2l07L21n1K8j50j70P5J29
3481B4O9l21K31j07L3K04k39J07L3j16R1mr8Mo4q0J69L30l42Q8p1l2L64j30q5
$$ plain form
3313 213 -59 122 -213 -152 -26 -474 -126 -92 71 69 96 -53 50 33 -247 -83 -113 119 238 -71 128 81 126
3336 126 56 -17 175 47 79 18 -120 23 178 43 -110 82 21 -97 130 -201 -144 -166 -75 177 -29 -77 -55
3359 -55 18 132 67 19 270 -79 -3 -120 103 84 -26 -16 136 -54 57 90 88 -160 31 -231 -124 -43 315 -33
3383 -33 -207 119 41 -215 88 -103 105 53 -24 6 -174 150 12 41 85 98 71 -39 116 -243 -281 183 148 -72
3407 -72 210 61 15 -223 -161 275 22 -29 90 168 -151 185 409 -16 202 10 0 -144 -152 175 -116 -112 -99 40
3431 40 -125 -114 50 -65 -101 -225 -288 87 -252 -36 -94 -160 41 -108 60 43 163 23 13 21 23 20 -142 -150 -52 111
3457 111 5 -46 -90 -9 89 -20 78 108 -24 -174 143 109 4 -90 117 149 -158 163 112 140 -10 -180 -105 24
3481 24 93 -228 3 -104 -71 133 -106 1 34 -82 9 5 -93 -89 -153 -233 -64 266 -76 12 -59 -91 273 143 58
3506E8J22k0j11j69j35M90q9j42j47J73N8j67K9j15K32j86o1J17j14K25p1r3O7
3529d9j00R6j59O3L29J11l23J0P5j84j16J2K57p1J17j30J02j52J93j61O3J8j01
3552a00M4j70J11J66J22j2j96mJ06j1j90K31O1Lj98k22J87kJ14j34J31K9R5k10
3576d9L95k78l00M82j58o2j11K15K3q3o9J9j7M7j5r7J9K09j98n6L84j00m06L62
3600A56J33n9l37Oo6K08j46pP1J22j3J9N5k63N8R5K09j41l09L45r2k97K46O3k10
3625a54L09k76N7K01l18l3K0J24j15J48J68j00j64K15J04l40M02J1l60n4j3K05
3647C7K38k67j16K61j84o5K74k07K86k23k41L16k09k8L8K19k08%O1k7J0P7rj43
3671a10M1J42R1j77M0rO0L0j50k5j05pj06K77qj26K77Q0k01r8J81j56K21k72j6
$$ plain form
3506 58 180 160 49 -120 -255 235 146 4 -143 30 88 -79 -50 -165 67 -119 -180 -63 -177 48 -23 -116 -49
3529 -49 -149 -53 -212 -149 180 291 -32 -22 53 -131 -247 -235 22 -49 68 -62 40 -112 81 -80 -17 1 -100
3552 -100 -56 -226 -115 51 173 161 -35 -39 67 56 -134 97 158 161 -37 -259 -72 -74 40 -94 37 66 161 -49
3576 -49 346 68 -232 250 92 30 -81 134 157 74 5 24 7 54 39 -58 -39 170 -28 -84 300 200 -206 156
3600 156 289 230 -107 -101 -167 41 -105 -112 -41 81 68 87 142 -121 -63 32 241 100 -209 136 44 -253 -7 56 -154
3625 -154 155 -121 -64 137 -181 -214 -194 -70 -185 -37 131 31 -133 82 186 -154 248 259 -101 -155 -168 37
3647 37 275 8 -108 153 -31 -96 178 -29 257 34 -207 109 -100 -128 -90 129 -79 -79 -18 -45 -35 42 33 -110
3671 -110 -69 73 164 -13 27 18 78 108 -42 -67 -172 -179 -285 -8 -16 -142 135 215 14 -84 97 -59 162 -110 -126
3696a26q8L73k96J97O3j15r9M9O0l6m9m1Q6p4N3L2p6J06j50R6L69l40j43L03o7
3721H7k36L07Q0j51p9q2n1j92K04j12M06j44j68K72j91N3j7l7NJ53n7j65K92j76
3745Al0J11j28O9jQ8k12R4m3j12K19j24jJ85J15l14l8K13j41K61k87O7L5L0o3
3770fJ53J06j85j28J12m6j96K20j4J51j1LQ1k01l33N11j90Nk08K57m6o0j46J9
3794a52M0J53J76r9r8j18K05q8j73K29J16m12J90K9j16nK11k37K47j59K90l1j80
3817A8Q8k16M7j27K22J03l47L30%J5j79q1M7M0J08j95j01M14k06k11Qj4J76M1
3841b0q5K43j43K25m07L81k62J75k39K33j09N2j43L03k46n0J88m0m0l6k62N25
3863B43j24J45l00Q9r8L1J23k38K37k46L89l44j78Q8L39k32j7mK31j66J48j29
$$ plain form
3696 -126 -214 159 -137 60 123 8 -91 -42 18 -18 -67 -108 -22 -96 -43 -11 -87 19 -131 -35 334 -6 -149 154 87
3721 87 -149 158 238 87 8 -74 -125 -317 -113 -225 181 37 -131 141 -50 3 -14 -51 -46 107 50 -115 177 1
3745 1 -29 82 -46 23 22 110 -102 -8 -51 -163 56 -68 -69 116 231 -83 -121 92 -49 212 -75 -8 27 57 -6
3770 -6 147 253 68 -60 52 6 -190 30 16 167 156 159 240 39 -294 217 27 32 -176 81 35 -25 -171 -152
3794 -152 -112 41 217 118 20 -98 107 19 -154 75 191 -221 -31 -2 -118 -123 88 -149 98 -61 229 198 18
3817 18 106 -110 -63 -190 32 135 -212 118 118 133 -46 -127 -80 -40 68 -127 -228 186 -20 -231 -223 -237 -61 -20
3841 -20 -105 138 -5 220 -187 194 -68 107 -132 101 -8 44 -99 204 -42 -92 96 56 16 -20 -282 243
3863 243 119 264 -36 53 -45 -14 109 -129 108 -138 251 -93 -271 -183 156 -76 -93 -97 134 -32 116 -13
3885a3k87J65L2P6j00K01k21K38L7j61J95j19K09k03l55L92k10J34k2j91M25j76
3907D6k64L85j47j02J08N7J9j37q1J01K18j92q8M7j45R6J6l07N04o04M15K14k17
3930e8M1j67K04J77j41q2l05K61J8L4J29j22l9Q8j56K63r6j62K31k32J47j2j42
3953a21J36j70K16j38J31m3j41J43R1l19K99j10j24R0O0J62j99K40j39j33j62
3974b31K69lp1J09J83l50K54k68O9j77L04m9j44J36N1M3q8q7o9J24p9Q8l8k16
3998b40M13o9j54JJ12M6j24Q3j64K03j49J33m4L2j06j79K11N0J01r6j31r1J56
4021fj01L75k00k14K34l26K96k17O1J8L22l64J68J26m02K31L0j46j98K26QJ86
4043A07q3Jj20M8J22n9j57K55j53o2M17l33J39k64L5K50j84O8r5p3L07k95K16
$$ plain form
3885 -13 -300 -135 -103 -27 -127 74 -147 91 128 -33 162 43 252 49 -306 86 -124 10 -12 -203 222 46
3907 46 -218 167 20 -82 26 83 102 -35 -116 -15 203 11 -77 -30 -175 -79 -63 -370 134 -470 -55 159 -58
3930 -58 -17 -184 20 197 56 -26 -331 -70 -52 -18 111 -11 -50 38 -118 145 49 -113 118 -114 33 21 -121
3953 -121 15 -155 61 -77 54 11 -130 13 104 -215 84 -26 -150 -60 0 162 -37 203 64 -69 -231
3974 -231 38 35 -36 73 256 -94 160 -108 -39 -216 88 39 -105 31 82 125 37 -50 -119 5 -74 14 -24 -240
3998 -240 173 104 -50 -49 63 109 -15 68 -96 107 -42 91 47 79 -27 -206 5 55 156 60 -71 -162 -6
4021 -6 -107 268 68 -146 88 -238 58 -159 -98 -80 242 -122 46 172 -230 1 31 -115 -313 -87 -79 107
4043 107 24 25 -95 -47 75 16 -141 114 -39 -101 316 -17 122 -142 -107 143 -41 27 -68 -141 166 -129 87
4066H7k3k91K09O9J58j72k37J20N9K4j24R3K19p1j55K98qp9K5j91n3l01L12J38
4090A06oO3N6k82K56m14J26j2K00p2j2n2K51j20J27k09P2N9k41J98M2R3j82j09
4114f2K57o5J08j7j64K34m14M3l3q1J49j01J92m6R4j09L8J3k3L0q0OJ49k02K52
4139A68K3j93qR9k30J69q3J82k23Q7O9j12r4J72o5J78j52K2Pk46K63P7k32K9J12
4164A9M8j05L6L7r7n1K00j48k8J33P1or5k06K02k8k18L6J83o1J60k14l8L80k79
4189f9M6P3j05j16K41o8k21J61P4J32j41k42J20L03k18R6r7J61q5k0q6L4J12O7
4213A52k51J17o4k29K28k7p7pL72j49m16L67K02l11K00j75RJ13l40J23L3K23j94
4236a01R6kJ64k33q7J31mL08q2N3k06l49K42Q6k2Po6J60l4O5j02l9j34K97l22
$$ plain form
4066 87 64 -227 -18 51 209 37 -200 -80 -21 3 -121 -28 191 120 -35 263 255 176 201 10 -43 -344 -32 106
4090 106 100 163 219 -63 193 -221 -95 -107 93 21 9 -43 208 88 215 6 78 137 -104 94 136 229 47 -62
4114 -62 195 130 238 221 57 291 -123 -80 -113 -194 -45 -146 46 0 94 -15 23 36 13 43 -37 -31 118 -84 168
4139 168 191 -2 -10 89 -141 28 -55 127 -96 -9 60 -52 -146 26 -39 139 -13 9 16 -230 33 110 -122 -93 19
4164 19 67 -38 -2 35 -62 -113 87 -61 -89 44 115 109 14 -192 10 -18 -236 -200 -17 -78 82 -132 -170 210 -69
4189 -69 -23 50 -55 -171 70 2 -219 -58 16 148 7 -235 -115 188 -30 66 -31 130 45 25 -61 -27 85 152
4213 152 -99 18 -46 -275 -47 -74 -151 -158 214 65 -351 16 218 -93 107 -68 -59 54 -286 -163 -130 93 -101
4236 -101 -5 -7 157 -76 -163 -32 -36 272 190 243 37 -312 -70 16 -6 1 -65 95 61 126 24 -15 -149 148 -174
4261a74K6J12O5j27K82p1j04k54J73J4K85k68K83k97K21m61J94r3M3K17O3j71
4283d2O2L9j72J45j88N6j05K53K2Q3m0m28L58k55J36K38l17J03j7K3K73k35j74
4306a82K94j50N3k08J07j76K81p9%L2j56K21j31l6J59j67j25L11m5j51O0M2K9
4329a7J5r8K34pj98J49N7l14J77N5k27K69j26O6j76J59j49L19m73K50j56K34j75
4352a32J45rj89J66k69J60P6L5K4K25j1l14j83M14j37Om1j88L25j94J94k38O1
4375g4K80k61J5o3L6J66j33K70j71j14j42K48j6k10P7NJ34Q0k93J3K05k24K8K09
4399F5k57K95q2j85Q1L10m68M04k59R7j76J83J0L5K74m05Q0r8R1j82Q8J89r4O4
4423F0N7j37j26N7K92k27j59K24q7K95k6m79K10J82R8j55L2j62J84j39J02Q3j12
$$ plain form
4261 -174 -148 -36 29 -98 184 113 9 -245 -72 -58 227 -41 242 -55 166 -295 -101 -194 -151 66 129 -42
4283 -42 20 59 -113 32 -156 -100 -205 48 70 153 113 -315 43 -212 -76 162 -155 -52 -69 -46 227 -8 -182
4306 -182 112 -38 15 -193 -86 -262 19 -60 -60 -28 -184 37 -94 -130 29 -138 -263 48 3 -148 -88 -46 -17
4329 -17 -2 -100 134 127 -71 78 135 -179 -2 53 -174 95 -31 35 -141 18 -131 188 -285 -35 -191 43 -132
4352 -132 13 4 -185 -19 -288 -128 -52 -17 7 232 221 -93 -276 138 1 7 -34 -222 103 -91 103 -135 -74
4375 -74 206 -55 -40 -103 -67 99 -34 236 65 -49 -191 57 41 -169 -92 -87 47 127 -166 -153 52 -172 -144 65
4399 65 -192 103 21 -164 -83 227 -241 163 -96 1 -175 8 18 53 327 -78 2 -96 -5 -187 -99 90 -4 60
4423 60 117 -20 -146 -89 203 -24 -183 41 -46 249 223 -256 -46 136 234 79 111 -51 133 -6 96 179 67
4446F7J23j97j60M53k11J96l31N0J81M5k34J19O2l21M8j42J5L9L01j90J16j5K67
4469B81k69k77J41K87NJ1r7OJ08l1n5j43J06j93R4N8o9j00K74j05Q9k03KQ1J72
4494A73k43J58p7r4J54j08R0R8l06K03m8m07M55Q8R0m27K95m4k55J54j10N5k8
4517a34J30J85j96p5k7L2M56k43J30k04o8j78L55l27L07r5l55K19J57jK39m40
4539a33n6K8J18P9j52J97k83J73M7K8J36m65J36K85j26J89k78QjJ94k99Q0J74
4562G9l55K22kk2Q9j22K77j75M6j7J68o5Kl10K53r1K7K00j40K7Kk28K52j60K5
4587a8J08m88N63l50K36K41k40j5J14j07KJ26p8k5l88M11l57J58J85k05J90O9
4609A32j88k29L97j37l5L17m55J21N0Q9j42J20j50o0K38QJ63l24j4L26j53j02
$$ plain form
4446 67 190 -7 -167 286 75 271 -60 -10 171 216 -18 101 163 -158 -110 -252 -237 -198 103 -87 29 14 281
4469 281 12 -265 -124 163 168 179 82 88 196 165 110 -33 73 -120 -26 32 -37 -137 137 32 121 -82 -80 1 173
4494 173 -70 88 11 -83 71 -37 53 151 -155 48 0 -407 48 136 226 -201 94 50 -205 -51 -161 -106 -134
4517 -134 -4 181 -15 -90 -117 -85 371 128 258 54 -14 -192 163 -164 143 48 -307 -88 69 68 307 -133
4539 -133 -189 -161 -43 36 -116 81 -202 -29 18 46 182 -283 -147 138 12 201 -77 -69 -70 124 -175 -95 79
4562 79 -276 -54 -56 -78 11 -111 166 -9 37 20 188 123 125 -185 68 -23 4 204 64 91 93 -135 117 -43 -18
4587 -18 90 -398 165 -185 51 292 52 37 151 44 46 172 94 69 -319 92 -265 -107 78 -127 63 132
4609 132 -56 -285 112 -25 -60 257 -198 -77 -27 62 -80 40 -110 -170 68 76 239 -85 -99 227 74 -28
4631b8L2j18J94j39K73k22j68K64L3k08K75k37j85P2J26j03O2JM4p8P5l0M1p7
4655a01J83j19K32j08n8J93k06k3p5L4k11M37N4k81O9k08K25o0Rj9K69m8j03m6
4679C9j20R2P9q3m0p2M9m6K88k47P0j69K41j40%j4q8M01k90j07K40K8R2K1m26
4704b02J81J98l26k0K31K40r7l54M6J77J58m69K01L8k75K87O7j36R6l3j32K63
4726A39j65O0n5J12l3RQ3j86J86l11J50Pj71K80k79N45n85K84N7q9L18o04L51
4749A03j51J05Q7j88j14K48J69j28k23K74k75J11j38J63nJ35J06j37l13K82j42
4770c1R8k67K64J24j91r5Q4Q0J35j10k17K06j31j1k62K0J79K67j3M5k81m9K96
4793A40k26J78L0j7qK8l43M42n6k5k53K20m10J60qJ91K4kr1k33J11J48M9j53J42
$$ plain form
4631 -28 4 -114 80 -59 214 -8 -176 88 121 -87 188 -49 -234 -162 -36 -139 -77 -76 -32 -110 -35 -65 -24 -101
4655 -101 82 -37 195 87 29 222 16 -7 -82 -48 -259 178 232 -49 20 -188 37 -23 -14 -33 236 188 85 39
4679 39 -81 11 90 7 -33 -105 -56 -102 186 -61 9 -160 81 -59 -59 -73 -161 240 -50 -157 83 111 203 224 -202
4704 -202 -21 177 -149 -169 62 302 205 -149 -103 74 232 -237 -36 2 -273 14 81 -55 41 8 -124 139
4726 139 -26 34 -21 91 58 67 150 -36 150 -161 -11 -4 -175 105 -174 371 -214 70 127 38 356 -248 103
4749 103 -48 57 144 -44 -158 90 259 131 -92 182 -93 18 -120 43 38 173 279 142 -171 111 -31
4770 -31 67 -200 64 188 -3 -98 -14 66 201 91 -126 80 -51 -62 -324 -304 -125 142 129 174 -107 -156 140
4793 140 -86 92 122 105 97 125 -218 224 168 143 -110 110 -300 -140 -148 43 67 65 -26 -259 -148 0 49 -104 38
4818C8K87L4m32r1K9K49p5Qj95J38j45M12j63r9k04J36K12k10oJ04j9J26k41J60
4842E3p0m3J02p6k0K32j43o4J45j81Jj12K87p2j31O3k1J1R7J8k08J35R3o4K19
4867B51l70R3l7J10j11l43L59R5j22Q2k12P9J02J54J28l45K21m8k05K74J23k73
4889EJ59K06m16J01r8k0Q8j3M0j00j5j15j61K41K08o2n4J07j14O6n5j56J15j02
4913a45K06k41J59l3K17n5j97j8L9l4J58j49K20m93M67k40j9J16P1K22l58k8L83
4936B48j23j61J56r6qo5j5K44k93K15Pk47J10jJ5P9J36l3k05L98k79nJ7k32P1
4961f7P8K05m10J04N5K38l58L24j08J41O1m20K05K5j38k65L27P3jk69J31J09K31
4984B71j84k85L10j92J17M4J29m17K39mJ40j5J84j58l06Rp4J71l1J01k62J86J37
$$ plain form
4818 38 325 359 -73 -164 -135 114 39 47 -148 -10 -155 257 94 -5 -209 -73 139 -71 -77 27 8 134 -107 53
4842 53 -17 -60 42 -34 -54 178 35 -29 116 -65 -64 -176 111 39 -92 -29 -50 -39 58 76 -132 3 96 32 251
4867 251 -119 -26 -63 47 -64 -407 -48 47 -75 7 -205 -126 -24 130 258 -87 134 86 -119 155 278 5
4889 5 164 370 -46 55 -43 -63 25 12 52 -48 -63 -178 -339 -98 110 48 -6 101 -13 53 -2 -158 -43 -145
4913 -145 61 -180 -21 -54 163 108 -89 -107 -68 -102 56 -93 127 -366 101 -139 -158 -42 29 251 -107 -135 248
4936 248 125 -36 120 24 16 -49 -64 180 -113 102 109 -138 -28 -29 -14 65 201 168 -37 361 82 77 94 -138 -67
4961 -67 11 216 -194 -90 -35 203 -155 169 61 202 263 -157 48 73 -65 -330 -3 70 69 -200 -69 40 271
4984 271 87 -198 112 -80 37 81 210 -207 32 28 168 153 337 179 -127 -118 -192 -21 -52 49 -213 -27 110
5007A10p5O1j3r8N7j38J58k7o8K6j13K25j07P6p8p0J06M8m4j85Q9J44k36N9J93
5032A00N5p1l1l72J28K67J5L5j65J22j62N2M2m5K66l37J42J78l62K82O9k09n6
5055e7R6K8LR5k44J55n6j48O8Q3o7K90k90N2r5K59k56K27j28n5J08r7k57N39j60
5080I3j64J73%j35J50L0j51j56L89j08l9N9k09k30N23k80J91J06k28J8l30L08
5102A0J09J91k71q5P4j70K98l62N1J40k09k7J59Q6K6J05k49K8K01n0k18K23k05
5125a45J50j58K49n4R1j21j54K1l9P5L1J03jK5l17L21Q1m67K15n1K14L1p6L20
5149C44k79l6q7j1J36j72J68K1p9j32K13K53l78P1nk4q5k1O2M59m82K23J54j52
5173A61m03L63j06J66l34Q1kK80k38M3pP1j58Q1K5q5K87p57N57j8R9O0l54J41
$$ plain form
5007 110 35 96 83 -15 42 -96 62 35 -33 -7 -120 105 -2 74 -4 -74 32 80 36 -149 -60 84 -152 -93 100
5032 100 155 84 53 -319 -191 76 91 126 -39 83 -79 -27 15 -30 236 -101 41 219 -143 139 208 -1 -57
5055 -57 39 67 70 165 -79 76 20 -128 -60 23 -44 246 -44 8 -87 172 -84 143 15 -40 68 -29 -286 253 93
5080 93 -71 102 102 -33 117 147 -4 -160 229 121 82 141 -68 -298 225 -55 136 242 14 32 -298 10
5102 10 119 310 39 -46 28 -142 156 -206 -155 -15 -224 -251 -92 -6 20 125 -124 -96 105 55 -163 60 -145
5125 -145 5 -153 96 42 133 12 -142 -121 -160 -85 -54 49 48 73 -244 77 158 -309 -94 -145 69 100 24 344
5149 344 65 29 -58 -69 67 -105 63 84 5 -127 86 339 -39 32 27 3 -82 -103 -41 418 -64 159 313 161
5173 161 -242 121 15 181 -153 -72 -74 206 -32 11 4 75 -83 -2 23 -62 225 -532 25 7 106 166 -188 -47
5197d7O8p9K55r2o1J25q7j6l22QL34qJ2J5k48K08j80K20j24O3J45k11K3K34n10
5222b75K31k69K43r9J69k09O7K4Q1k69J97O9j29L2P2K52k22Q1J09O4j70k89Q8
5245a52J29QL3K83k36k6MM5j07j54k6K91J0J80m58j7K98o0q7r6K96m79L72m7M92
5270D96o11K40l73K26j76J64R0j05K31k49R0j4K77n69K4K37j5r4K4J29J5k53j2
5293b28J69K22k68Q6J09k57J08P3K02j35j52M8q0L42j42j6j93O2K94m37N13k98
5315B2j33l4J3K42k62J83j79N0Q4M1j05j96K60M6p3L50n39K42m5J20j17p7M6M8
5339a3J78k08J09j06J76j19K47k62R5n7nj64L69l4k18r5J68LL2k47j1o8J79L4
5363a7j43L22j16o5j03O0J17j9j39q7K19j11J73r3k5mq6J14k8O6J7Q8lj64o7J9
$$ plain form
5197 -47 21 -58 197 105 44 169 82 66 -256 -248 86 78 90 105 -143 65 -115 105 -19 44 189 -22 1 235 -275
5222 -275 -44 -313 -70 -169 0 -209 -142 -118 -37 -306 -109 -40 -169 -137 -65 187 -35 46 155 219 49 -240 -152
5245 -152 -23 -15 18 301 65 39 43 88 -19 -173 -199 92 102 282 -176 -193 105 45 -42 -138 158 -321 51 4 496
5270 496 -115 125 -248 -22 -198 -34 56 -49 182 -67 23 9 286 -283 -259 -22 -37 -131 -107 22 37 -216 -228
5293 -228 -59 163 -105 -19 90 -167 -59 14 216 81 -71 -23 -103 239 97 81 -112 -50 244 -193 320 22
5315 22 -111 -145 -132 110 -152 31 -148 -98 -14 27 -78 -274 -14 32 -41 309 -230 12 -33 87 -30 -107 -61 -13
5339 -13 165 -43 66 -40 136 17 264 2 97 40 35 -129 240 206 -12 -107 61 64 96 -151 -162 -230 -51 -17
5363 -17 -160 162 46 -19 -122 -62 55 36 -103 -190 29 -82 91 -2 -27 -31 -117 -3 -31 35 52 140 137 -27 -94 -75
5389g5p3K65l51L41k66K46P3l45K26p6J55o5m9J87k93L34k35J8J00l26P1K01R1
5412A54q5j71M57j83k38j81J06M41k70j37K20j11km7jJ2Q3k11J52oj19K44k37
5435a30J30k3j53O0j31K07P7j24K81l18L41k4m02m1M26m04KJ23J30j13L7Ml2q0
5459a57k3Np6M43l09L33m12Q5K07O7o7j06j96K82m0j38m3j04K05L7j21J18J24
5482A14o0j09q6K77k09J84k73L0L10j91j11L5L32k27Q5o1l4p1M8NM2p3N7LJ09
5507A26j02k33J56L72k81j68j9K70K6k8l52R3J53j78m7L41j45j30K73j00J95j74
5529D8j95J62R7k45M7K05j48J97k61K56N5J7k04o3K9j14L19k11J26j04O6j20J67
5552A26j10L29n62J46K8K29k72K51P6m24K17Mk2j11N4K17r7N6L2M1jj76q7O4p
$$ plain form
5389 -75 -148 117 -234 107 -159 87 160 -185 41 -35 120 55 6 193 -100 234 -1 17 117 -209 -138 63 154
5412 154 69 -102 355 172 -66 -247 -141 300 30 -107 113 2 0 -47 -48 -36 47 -164 -12 -18 -137 107 -130
5435 -130 0 -23 -176 -116 -247 -40 37 -87 194 -124 217 193 -209 -250 176 -228 -226 -103 27 -86 -49 -45 -77 -157
5459 -157 -180 -175 -251 192 -117 216 -196 -111 96 163 96 -10 -206 76 36 -102 -145 -249 -44 -7 -128 -10 114
5482 114 54 -55 -141 136 -73 111 -162 -132 178 -13 -124 -89 243 16 101 40 6 -65 -17 -12 30 -43 14 17 126
5507 126 24 -209 -53 319 38 -130 -149 121 147 119 -233 -140 13 -165 -212 129 -16 -146 127 27 222 48
5529 48 -147 15 112 -133 -86 119 -29 168 -93 163 218 235 31 -32 -3 -117 202 -9 117 13 79 -41 126
5552 126 16 345 -217 -71 -43 186 -86 165 241 -183 34 38 16 -95 -41 176 79 135 167 208 207 31 -56 8 1
5577AN3j25J12M1J47k91L6r0L23l7l80J78P7K29l73n2o8L41j42j53L26j43R4j53
5601d9r2K56j55P9M3o7j1N6j43N0M1o9L67k32j49J21k45M68j49O2k84L32k83K01
5625A48kj13J34m05K46n7Q5M7O7l19K28p6K4l04M20k8k61J12k63M01j24p2L26
5648B14j36qN9j54J97k31J98k2j18J53R9k21k85L36j60k73R4L53p8p5J96l86L21
5671G3k84M49j94K7J9j66R2l5j4M2L8kk20R7L18j36j4o1J05M3k09K41m3J3j85
5696fO0j6j6Q0l37M10J48k92l6k39K93j12R1ml7j84q0M64j94K21k34J73j18J20
5720A55l13P1J37j77K12k49J60Q6k12P0j48K47j89n0J75j02L68j26j50J48R7k47
5742c7P1R7k30j4J89N7L8j96j05J99L8p4j3Q5j38J77j24l77L82J25K8j34R1j39
$$ plain form
5577 1 54 -71 41 82 229 -62 -26 -116 207 170 -210 -32 45 274 -99 -151 -219 122 -20 -173 153 10 104 -49
5601 -49 -141 115 -40 39 82 15 4 60 -83 -33 8 -61 306 74 -75 46 -199 269 120 182 -102 230 -53 148
5625 148 146 33 167 -238 8 -49 36 83 150 -169 59 -17 7 -297 123 95 -166 -54 -317 84 -40 -112 214
5648 214 78 70 129 -25 172 -59 139 117 -1 152 251 30 -255 81 -79 -352 -258 95 17 -58 138 -248 73
5671 73 -211 238 44 71 90 -76 16 -19 -33 9 47 45 -175 -78 240 104 90 29 134 177 -32 209 166 179 -6
5696 -6 54 38 22 102 -235 175 323 31 -5 -244 49 -63 28 24 -13 -197 -277 187 -7 214 -20 153 35 155
5720 155 -158 -87 50 -127 85 -164 -4 82 -130 -60 -208 39 -150 -200 -25 -127 241 115 -35 113 210 -37
5742 -37 34 131 -99 -113 76 133 171 -25 -130 69 107 33 20 105 -33 144 20 -357 25 150 178 44 135 -4
5766dJ8L0j1Q1k54L27l88N0L01J0k55P9q1J19r7J10J0p4o6J88j99K18n4L5l5o2
5792dp8L59k81J91m18O4K30j79L8L23k87k6k6J24m1p7J07J17o8j19k5O3J34J43
5816B64l33J99j92K3K2j9K1K12n6k11k21J01K42Pk26K46o9O7k6j19K69l9l7k7
5840I8n1o2L2N0m4l6o4J04j12j20M68j82j03P0J10j17j12J01J92j58j44K00k42
5863a22o3O8k6J7k4J9K92o8K95m77J64j17R1q3m0J80Q9j85NL2n8l5J96L7j76j63
5889a52J5k8K98l92K87L46p0q3j97j26K9R7J36k97J41k8R1Q4k70L4J30j52J40
5912C3P0j69Ln6jJ25M3J44l68J07L1P4j16J3R4J19k6j99J01p8J9K11j85j15J24
5937bP8j52J3Q5j08K00j83J22QM7q6k05J69J55j14JJ94k67R8J65l21L2K30M8k25
$$ plain form
5766 -4 14 44 33 114 -140 187 -201 -151 150 160 -95 -16 -97 22 -75 35 45 -29 -95 93 -106 112 58 93 58 -4
5792 -4 -82 277 -4 187 -231 -167 63 -116 -78 245 -42 -68 -94 30 -11 -88 19 136 68 -51 -76 -13 121 264
5816 264 -69 130 -62 -39 -17 -36 -15 197 141 -70 -291 -190 52 59 -167 79 10 77 51 -68 201 162 125 98
5840 98 47 -15 17 67 23 -13 -77 27 -85 -205 263 81 -22 48 158 41 -71 30 222 64 -80 120 -122
5863 -122 -185 -117 -143 -126 -150 -131 161 93 388 -89 75 -42 49 -34 -74 106 195 10 15 47 -11 -46 150 187 11 -152
5889 -152 -137 -165 133 -259 28 374 304 221 24 -102 -73 24 160 -137 4 -24 67 151 -119 -85 45 -107 33
5912 33 103 -66 -63 -119 -120 5 48 192 -176 -69 -38 36 -80 -67 27 146 120 -79 22 -56 -37 174 -11 -126 -2
5937 -2 76 -76 -63 22 -86 114 -69 53 61 108 22 -183 -14 141 27 28 222 -45 53 218 -103 -71 159 207 -18
5962a8j26J31J41k0k98K60K63o01L72j05k42R7J83N0rN8k61J33m8j7J29L03m02
5985b7K33j95K1J6j45R2m9J66l69K95J8L8l4n1J04l7j28K20l18q9M11l46J85J37
6009A48r4j33L54k36J20j74q2J12q0K29m38L16k13K32k99J70K11j20j2J94m92
6030b87K19J10K1k5n6J92j80k05K86k14K53k85K19k59L08j88N3J10Q1o0j27M0
6052FN0q3J44j5n8pml0j29Q7l6K17l67L81k12j1J23M6k03L47k70J18k37J57J55
6077A69k16k07L01l08K66k08L13k60O5O9j5j03M3P5O5j88J56q3k0J2k35L21J89
6100B01k62J60l4j95J4J10K28j48o3k2K04j61J00p9j55P5o8J39m4j7N3o1j9J9
6124b5J34j19kJK7P6k38J11mnJ20J07l64K94j58K16n8j92L2r4P3Q4p5J34K7m4
$$ plain form
5962 -18 -144 -13 128 108 -190 70 333 -268 104 -1 -243 -146 37 87 78 136 -125 8 -40 -57 72 375 -27
5985 -27 206 11 32 48 -97 -5 -54 112 -257 38 56 94 60 9 113 76 -52 168 -150 -239 172 -174 11 148
6009 148 54 -79 275 39 159 -15 -97 15 -65 164 -274 42 -171 61 -238 -68 143 23 11 205 -287
6030 -287 -68 42 63 38 -18 174 -6 -211 75 -139 114 -171 48 -211 97 -91 -38 72 153 93 -34 6
6052 6 56 -27 117 102 44 37 33 3 -126 -39 -75 142 -225 156 -56 -67 56 102 -101 246 -24 94 -143 14 169
6077 169 -47 -254 47 -261 5 -203 110 -150 -85 -16 -31 -134 -91 -16 49 -139 17 -66 -86 -74 -309 12 201
6100 201 -61 99 65 -130 -116 -6 222 74 11 -11 193 32 132 53 -102 -27 -95 44 0 -17 36 -25 -44 -25
6124 -25 109 -10 -12 -11 16 92 -146 -35 -39 -44 76 183 -181 113 -45 171 113 -79 -47 -141 -68 16 -59 75 102 58
6150E8j2R4j9p5R4j64qR3ok22K45q5L83k39k7j23J22q7m4n3L6N4L3k71J63j68
6176b28K33K73m46L25j97K04l82Q3L78l26P7J65r6k86K28J36m1k12K2r1q8K89
6198B0J93j99M6l3L58l38J06j17l26L67j22n5J12m0o0K23k02J90Q8k04P0p7j21
6221a21J94M2n9o2j18L4K34k50O9qJ45j35M0Q5N9k24K33j58J6p5J29k91K71M9
6245I9J8o4k38P1k7R9j56J14O9K52l33L16k80o6R4j87j5P3K14K33m49L57l51J71
6269A4J25j26L4j76J08k65K34O8o0O0l7lJ06l02K32k02J76k3m7j1J65m7m8J67
6293A42k62J73J01j57J60j3m55K60M0M4K3k79K64j18q0J16j4J89n11K47M1q8L85
6316B08j16p1J3j57J04j35J1K31l28L45p6J30L4k59l6K50j09k20R2j4k4K04L9
$$ plain form
6150 58 46 140 121 46 140 -24 -32 61 55 -167 78 -7 376 137 110 -13 109 22 -22 -75 -39 15 48 -223 -60 -228
6176 -228 5 278 -168 157 -40 164 -218 -135 243 -83 -6 159 63 -223 5 141 100 -112 -90 -181 -269 20
6198 20 213 14 60 27 385 47 153 36 -290 77 -45 -100 12 -28 -88 135 -67 123 211 7 77 0 -121
6221 -121 73 115 56 -6 -124 -90 144 -106 -37 -45 100 -35 5 90 149 -75 158 0 16 -59 70 -221 50 99
6245 99 117 53 -185 -114 -141 -42 -198 -84 -15 237 -96 220 -60 -126 -32 -219 -234 -161 53 286 -163 194 -157 14
6269 14 139 13 47 -129 -21 -286 -52 16 -44 16 -21 -24 82 -220 12 -190 -14 -37 -84 -95 70 23 -25 142
6293 142 -120 53 154 -3 157 144 -311 -51 -11 33 56 -223 41 -77 -157 -41 -55 134 -377 -130 -89 -177 208
6316 208 92 21 34 -123 -19 -154 -143 88 -240 105 29 159 193 -66 -102 148 39 -181 -89 -103 -127 77 116
6339A16j17K42J38l25Q9j94j34J41Mj2Q8n9K97m65J67K59m68K56j65J73J61j39
6361E3p3J19j42M7J00J78j11j43q6Q0j2j92J63J00k12J22k70Q1J02k1m4J07P0
6384A6J72m4k99J97k07K35r4J1r3m5J87k55N3L23k09J65J44j87K28j17q7N1j22
6407B3M3L2r5j42J8K67l91L90R8k46k5K22l20L33k23K3p0J09j7k3M6K72k79j62
6431a17K6l3J38o6K56l27L8L1K03k59J52R0MK00m87J69m3j25K02m4J27L8Q4k16
6455D1K10j60q2L8N1R7j73N6k2m2j35o5N4N3K53l70K03J4K65l13N3j30K26K6j01
6480D7l43K73o6N5k7N3j37K99k99N1R4Q0J68k4j61j65L4K9K5J0P4j09J96j58K3
6505B2k71K95k73M49j83jqJ27J79j41j16j24M9l9j47K95l38K12J53j11j79OJ16
$$ plain form
6339 116 -1 241 379 54 143 -51 -185 -44 -40 -52 36 -23 274 -191 -24 235 -233 23 -142 31 192 53
6361 53 -20 99 -43 4 104 282 171 28 -58 22 10 -182 -19 81 -131 -9 -279 -198 -96 -117 -161 -54 16
6384 16 188 144 -155 42 -165 70 -24 -13 -106 -151 36 -219 -166 157 -52 113 257 70 298 181 94 145 23
6407 23 66 98 3 -139 -121 146 -245 145 243 -3 -28 194 -126 207 -16 7 -63 46 29 6 52 324 45 -117
6431 -117 -91 -124 14 -52 204 -123 -85 -54 149 -110 42 132 136 336 -151 18 -25 -150 52 8 135 173 257 41
6455 41 251 91 9 47 98 195 22 78 56 14 -121 -186 -132 -79 174 -196 7 21 286 -27 26 -104 122 148 47
6480 47 -296 -23 -89 -34 -61 -8 -145 154 -145 -94 0 80 248 224 63 -102 -68 -39 -14 -4 70 -39 157 -1 22
6505 22 -249 46 -227 222 39 38 30 157 336 195 79 -45 4 -35 -182 113 -225 -13 140 29 -150 -144 -28
6528b8N6J2O3k40N9M35k68J04j15K7l12J38j4K20k30J16R1N5j42j33PO2K22j56
$$ plain form
6528 -28 28 40 103 -137 -78 357 89 193 78 105 -207 -69 -83 137 -93 23 114 169 27 -106 -99 -37 185 29
$$ [...]
8191d6
##END NTUPLES=NMR FID
##END=
