##TITLE=1H_SL31-DAU(B3)
 CDCl3
 8 sc, 
 13.3.2024
##JCAMPDX= 6.0         $$ Bruker NMR JCAMP-DX V2.0
##DATA TYPE= NMR FID
##DATA CLASS= NTUPLES
##ORIGIN= UXNMR, Bruker Analytische Messtechnik GmbH
##OWNER= root
$$ XWIN-NMR		Version 3.5
$$ Wed Mar 13 15:50:06 2024 Russian Standard Time (UT+4h)  she@DPX200
##.OBSERVE FREQUENCY= 200.1313
##.OBSERVE NUCLEUS= ^1H
##.DELAY= (6, 6)
##.ACQUISITION MODE= SIMULTANEOUS
##.ACQUISITION SCHEME= undefined
##.AVERAGES= 8
##.DIGITISER RES= 18
##SPECTROMETER/DATA SYSTEM= spect
##.PULSE SEQUENCE= zg30
##.SOLVENT NAME= CDCl3
##.SHIFT REFERENCE= (INTERNAL, CDCl3, 0, 15.7039)
##AUDIT TRAIL= $$ (NUMBER, WHEN, WHO, WHERE, WHAT)
$$ ##TITLE= Audit trail, XWIN-NMR		Version 3.5
$$ ##JCAMPDX= 5.01
$$ ##ORIGIN= Bruker BioSpin GmbH
$$ ##OWNER= she
$$ F:/spectra/data/she/nmr/H-F/1/audita.txt
$$ ##AUDIT TRAIL=  $$ (NUMBER, WHEN, WHO, WHERE, WHAT)
(   1,<2024-03-13 15:48:39.18 +0400>,<she>,<DPX200>,
      <created by zg, POWCHK disabled, PULCHK disabled
       configuration hash MD5:
       00 E9 B6 7A A2 85 ED C7 34 08 36 98 17 FE 4E 26
       data hash MD5: 16K
       F5 46 77 55 BC ED DB 98 C4 00 94 F1 DA B2 FA 1F>)
$$ ##END=
$$ 
$$ hash MD5
$$ DD 1A 5C C3 EC 7E E2 E7 53 64 02 45 CA D9 FA D3
##$RELAX= 
##$RELAX= 
##$RELAX= 
##$RELAX= 
##$RELAX= 
##$RELAX= 
$$ Bruker specific parameters
$$ --------------------------
##$DU= <F:/spectra>
##$EXPNO= 1
##$NAME= <H-F>
##$PROCNO= 1
##$TYPE= <nmr>
##$USER= <she>
##$AMP= (0..31)
100 100 100 100 100 100 100 100 100 100 100 100 100 100 100 100 100 100 
100 100 100 100 100 100 100 100 100 100 100 100 100 100 
##$AQSEQ= 0
##$AQ_mod= 1
##$AUNM= <au_zg>
##$AUTOPOS= <>
##$BF1= 200.13
##$BF2= 200.13
##$BF3= 200.13
##$BF4= 200.13
##$BF5= 200.13
##$BF6= 200.13
##$BF7= 200.13
##$BF8= 200.13
##$BYTORDA= 1
##$CFDGTYP= 0
##$CFRGTYP= 5
##$CHEMSTR= <none>
##$CNST= (0..31)
1 1 145 1 1 1 1 1 1 1 1 1 1 1 1 1 1 1 1 1 1 1 1 1 1 1 1 1 1 1 1 1 
##$CPDPRG= <>
##$CPDPRG1= <>
##$CPDPRG2= <>
##$CPDPRG3= <>
##$CPDPRG4= <mlev>
##$CPDPRG5= <mlev>
##$CPDPRG6= <mlev>
##$CPDPRG7= <mlev>
##$CPDPRG8= <mlev>
##$CPDPRGB= <>
##$CPDPRGT= <>
##$D= (0..31)
0 1.2 0 0 0 0 0 0 0 0.06 0 0.03 0 0 0 0 0.0002 0 0 0 0 0 0 0 0 0 0 0 0 
0 0 0 
##$DATE= 1710330518
##$DBL= (0..7)
120 120 120 120 120 120 120 120 
##$DBP= (0..7)
150 150 150 150 150 150 150 150 
##$DBP07= 0
##$DBPNAM0= <>
##$DBPNAM1= <>
##$DBPNAM2= <>
##$DBPNAM3= <>
##$DBPNAM4= <>
##$DBPNAM5= <>
##$DBPNAM6= <>
##$DBPNAM7= <>
##$DBPOAL= (0..7)
0.5 0.5 0.5 0.5 0.5 0.5 0.5 0.5 
##$DBPOFFS= (0..7)
0 0 0 0 0 0 0 0 
##$DE= 6
##$DECBNUC= <off>
##$DECIM= 32
##$DECNUC= <off>
##$DECSTAT= 4
##$DIGMOD= 1
##$DIGTYP= 9
##$DL= (0..7)
0 120 120 120 120 120 120 120 
##$DP= (0..7)
150 150 150 150 150 150 150 150 
##$DP07= 0
##$DPNAME0= <>
##$DPNAME1= <>
##$DPNAME2= <>
##$DPNAME3= <>
##$DPNAME4= <>
##$DPNAME5= <>
##$DPNAME6= <>
##$DPNAME7= <>
##$DPOAL= (0..7)
0.5 0.5 0.5 0.5 0.5 0.5 0.5 0.5 
##$DPOFFS= (0..7)
0 0 0 0 0 0 0 0 
##$DQDMODE= 0
##$DR= 18
##$DS= 0
##$DSLIST= <SSSSSSSSSSSSSSS>
$$ [...]
##$SUBNAM2= <"">
##$SUBNAM3= <"">
##$SUBNAM4= <"">
##$SUBNAM5= <"">
##$SUBNAM6= <"">
##$SUBNAM7= <"">
##$SUBNAM8= <"">
##$SUBNAM9= <"">
##$SW= 18.0517328524113
##$SWIBOX= (0..15)
0 0 2 0 0 0 0 0 0 0 0 0 0 0 0 0 
##$SW_h= 3612.71676300578
##$TD= 16384
##$TD0= 1
##$TE= 0
##$TE2= 300
##$TE3= 300
##$TEG= 300
##$TL= (0..7)
0 120 120 120 120 120 120 120 
##$TP= (0..7)
150 150 150 150 150 150 150 150 
##$TP07= 0
##$TPNAME0= <>
##$TPNAME1= <>
##$TPNAME2= <>
##$TPNAME3= <>
##$TPNAME4= <>
##$TPNAME5= <>
##$TPNAME6= <>
##$TPNAME7= <>
##$TPOAL= (0..7)
0.5 0.5 0.5 0.5 0.5 0.5 0.5 0.5 
##$TPOFFS= (0..7)
0 0 0 0 0 0 0 0 
##$TUNHIN= 0
##$TUNHOUT= 0
##$TUNXOUT= 0
##$USERA1= <user>
##$USERA2= <user>
##$USERA3= <user>
##$USERA4= <user>
##$USERA5= <user>
##$V9= 5
##$VALIST= <valist>
##$VCLIST= <CCCCCCCCCCCCCCC>
##$VD= 0
##$VDLIST= <DDDDDDDDDDDDDDD>
##$VPLIST= <PPPPPPPPPPPPPPP>
##$VTLIST= <TTTTTTTTTTTTTTT>
##$WBST= 1024
##$WBSW= 4
##$XGAIN= (0..3)
0 0 0 0 
##$XL= 0
##$YL= 0
##$YMAX_a= 108243
##$YMIN_a= -126271
##$ZGOPTNS= <>
##$ZL1= 120
##$ZL2= 120
##$ZL3= 120
##$ZL4= 120
##$ABSF1= 10
##$ABSF2= 0
##$ABSG= 5
##$ABSL= 3
##$ALPHA= 0
##$AQORDER= 0
##$ASSFAC= 0
##$ASSFACI= 0
##$ASSFACX= 0
##$ASSWID= 0
##$AUNMP= <proc_1d>
##$AZFE= 0.1
##$AZFW= 0.1
##$BCFW= 1
##$BC_mod= 2
##$BYTORDP= 1
##$COROFFS= 0
##$CY= 11.3945322036743
##$DATMOD= 1
##$DC= 2
##$DFILT= <>
##$DTYPP= 0
##$F1P= 15.7292609196834
##$F2P= 12.9074282941183
##$FCOR= 0.5
##$FTSIZE= 0
##$FT_mod= 4
##$GAMMA= 1
##$GB= 0.15
##$INTBC= 1
##$INTSCL= 1
##$ISEN= 128
##$LB= 0.24
##$LEV0= 0
##$LPBIN= 0
##$MAXI= 10000
##$MC2= 0
##$MEAN= 0
##$ME_mod= 0
##$MI= 1.114404
##$NCOEF= 0
##$NC_proc= 0
##$NLEV= 6
##$NOISF1= 3.799351
##$NOISF2= 2.8
##$NSP= 1
##$NTH_PI= 0
##$NZP= 0
##$OFFSET= 15.70392
##$PC= 1
##$PHC0= -25305.25
##$PHC1= 15.98731
##$PH_mod= 1
##$PKNL= yes
##$PPARMOD= 0
##$PSCAL= 0
##$PSIGN= 0
##$REVERSE= no
##$SF= 200.130013532006
##$SI= 16384
##$SIGF1= 3
##$SIGF2= 2
##$SINO= 400
##$SIOLD= 16384
##$SREGLST= <1H.CDCl3>
##$SSB= 0
##$STSI= 0
##$STSR= 0
##$SW_p= 3612.71676300578
##$SYMM= 0
##$S_DEV= 0
##$TDeff= 0
##$TDoff= 0
##$TI= <>
##$TILT= no
##$TM1= 0
##$TM2= 0
##$TOPLEV= 0
##$USERP1= <user>
##$USERP2= <user>
##$USERP3= <user>
##$USERP4= <user>
##$USERP5= <user>
##$WDW= 1
##$XDIM= 8192
##$YMAX_p= 0
##$YMIN_p= 0
$$ End of Bruker specific parameters
$$ ---------------------------------
##NTUPLES= NMR FID
##VAR_NAME=  TIME,          FID/REAL,        FID/IMAG
##SYMBOL=    X,             R,               I
##VAR_TYPE=  INDEPENDENT,   DEPENDENT,       DEPENDENT
##VAR_FORM=  AFFN,          ASDF,            ASDF
##VAR_DIM=   8192,          8192,            8192
##UNITS=     SECONDS,       ARBITRARY UNITS, ARBITRARY UNITS
##FACTOR=    0.0002768,     1,               1
##FIRST=     0,             0,               0
##LAST=      2.2672688,     0,               0
##MIN=       0,             -126271,         0
##MAX=       2.2672688,     108243,          0
$$ Real data points
##PAGE= N=1
##DATA TABLE= (X++(R..R)), XYDATA
0@%%%%%%%%%%%%%%%%%%%%%%%%%jLnPrJ1j3J5j6J6j7J9k0K1k3K5k9L2l4L8m1M5
47B4n1N5n8O4p2Q0r0J00j12J27j47J70j97K35k88L61m63O22q91J389k467N602
69C993k7492j02772J45261O7768j39855L1197J10920q4507o0588Q3518m513p0074
81d7144M5587M0082n9032m936M8427j8198l4581K8499J4676k2883L541J3903k187
94E754j0671N467J5351j6824q751K7297Q63l6880M280L7432k5013k8005M1491
107A1791Q170m8358J4704L9709l9252j2884N3494j1625m6003K9832L2282m0716
119h856l673M0683k3535k6713K7700M857k5632J3191K0815k5719r669K4552m866
132C135k0459J3703J6511j6226n371J4189m38j0769N394J4857j1991r390J9126
$$ plain form
0 0 0 0 0 0 0 0 0 0 0 0 0 0 0 0 0 0 0 0 0 0 0 0 0 0 0 -1 2 -3 4 -5 6 -7 8 -8 8 -9 10 -10 11 -12 13 -16 16 -18 20 -21 24
47 24 -27 28 -30 34 -38 42 -48 52 -60 67 -80 90 -107 128 -160 201 -262 360 -531 858 -1609 3993
69 3993 -23499 -126271 18990 86758 -53097 -21900 89020 4513 -56075 27443 22930 -47144
81 -47144 -1557 38525 -20507 -25443 22984 4786 -29795 -1296 13380 -9503 -5962 7941 5754
94 5754 -4917 550 15901 -923 -9674 17623 18486 -18394 -14114 23318 -1695 -29700 11791
107 11791 19961 -28397 -13693 26016 -13236 -26120 27374 15749 -30254 -422 31860 -8856
119 -8856 -12529 28154 4619 -22094 5606 10463 -15169 -1978 18837 -6882 -16551 8001 3135
132 3135 -17324 -3621 12890 -3336 -8707 5482 5044 -5725 -331 14526 2535 -6855 12271
145A2271n48k4904J781K2726j1076j6832K1651N639k4893M150K0478j4012p438
158a1007K5935m899k3660J3511J4955k0634m926K4120o624j6378J3175L639j4381
171g174L195J3156j1362j0528J6445L266j5434J408J3663o508j0652J0887P374
184G736q604j400J1071m080j0970J2361N159j7466M08J6176q684j5314J3499O493
198F385j7315K724J3915p926o414J6659j110j6677J0303J1305j3720l371J6553
211A1311l773j5097P491N894r984n96R117n209q301R490L627j0985Q43J0773k183
226B418q950P273P357p897k119P108j134p220N873N104j2008r37J0783n804j0573
241a0726R577P681j1847j113J0114l539p245Q983M026j0944M639J0461r423n422
$$ plain form
145 12271 11723 -13181 -11400 11326 250 -16582 5069 10708 -14185 -10035 10443 -3569 -11007
158 -11007 14928 10029 -13631 -120 14835 -5799 -10725 13395 6771 -9607 3568 7207 -7174
171 -7174 -3979 9177 -2185 -12713 3732 6998 -8436 -7028 6635 127 -10525 362 7736
184 7736 -868 -2268 8803 4723 -6247 6114 11273 -6193 -5785 10391 1707 -13607 -108 6385
198 6385 -10930 -8206 5709 -2217 -8631 8028 6918 -9759 544 11849 -1871 -5242 11311
211 11311 7538 -7559 -68 5826 -4158 -4754 4363 -846 -9147 343 3970 -7015 -6172 4601 2418
226 2418 -6532 741 8098 201 -1918 5190 4056 -3164 2709 7813 -4195 -5132 5651 -153 -10726
241 -10726 -1149 6532 -5315 -6428 3686 147 -7098 1885 5911 -5033 -394 10067 644 -4778
255d778J0513J985j1648J297Q502o524m630O764j728p692N176O360p818j806J0035
270D008q28r108N825Q959p068l370P110j810o952L518N366q500j889R193m955
285e01q209P470N806q337j710Q457j432o179N689M239p207J280P686n608n442
300c998P535K251q541q3P995m719o122N465J043o343J414O631l731l705P718Q93
316C703q349L405Q632n304m567N982O47o619J836N330n171l473P270l358p960
331g996N984N452o302k276P565J0o783L507N248n001m40O440l276m750N143K688
347E213p014j670P096k096o801M267K688n479k43N793j407m999N759K516p017
362c394J432P998k954m928N145J276o602J73N638l443m082N600m97p726L449N627
$$ plain form
255 -4778 5735 7720 -3928 -2631 5871 -653 -5283 1481 -247 -7939 -2763 3597 -4221 -6027 4008
270 4008 3180 -5928 -103 8856 1788 -1582 5528 3718 -3234 284 5650 -2850 -4739 4454 -501
285 -501 -8710 -1240 4566 -3771 -5481 2976 1544 -4635 1054 5293 -1914 -634 7052 1444 -3998
300 -3998 3537 5788 -2753 -2836 5159 440 -5682 -217 826 -5517 -4103 2528 -1203 -4908 2810 3703
316 3703 -4646 -1241 7391 2087 -2480 3502 4149 -2470 -634 4696 -475 -3948 3322 -36 -7996
331 -7996 -2012 3440 -2862 -5138 2427 2437 -4346 -839 4409 -592 -1032 5408 2132 -2618 2525 5213
347 5213 -1801 -3471 3625 1529 -5272 -1005 1683 -3796 -4039 1754 347 -4652 1107 3623 -3394
362 -3394 -1962 6036 3082 -1846 3299 4575 -2027 -1854 3784 341 -3741 1859 1362 -6364 -2915 2712
378B712m797k879O312J086o363K764N688m002j515N764j136n528L232K928o074
393a808j286N959j230o210L054L082m938j018M681Jl432L651L068n482O86O136
409D914j863m292L724K625n956k241N207j083m469L090J724n685N70N754k889
424h70m101N730K995o101M70O512k691l399M442J457n826J787M206n130l302N732
440A911n88o663K610M396m016j928N307K7m018L452L284m836p9O194k167m314
456a428L211J778m871j513M400p62l264J859J137l551J42L313r51k247L401K106
472B760l349r41L691k78k494K367K220l511r50L393k981l531L532J593m693L44
488b828N276k891m759M824K961m973J126N659l948k920N851R9n997K503N464n317
$$ plain form
378 2712 -2085 -4964 1348 2434 -3929 -1165 4523 521 -994 4770 3634 -1894 1338 4266 -1808
393 -1808 -3094 2865 1635 -4575 -1521 1561 -3377 -4395 286 287 -3145 506 3574 -1908 -1222 4914
409 4914 3051 -1241 2483 5108 -848 -3089 2118 1035 -3434 -344 1380 -4305 -3735 2019 -870
424 -870 -4971 759 3754 -2347 -1877 4635 1944 -1455 2987 4444 -1382 405 4611 -519 -3821 1911
440 1911 1323 -5340 -2730 1666 -2350 -4278 1029 1056 -2962 490 3774 -1062 -1141 5053 2886 -1428
456 -1428 1783 3561 -1310 -2823 1577 815 -2449 -590 547 -3004 -2862 451 -500 -2747 654 2760
472 2760 -589 -1530 2161 1883 -611 1756 3976 465 -485 2908 -73 -3604 -72 1521 -3172 -2828
488 -2828 2448 -443 -5202 -378 2583 -2390 -1264 4395 447 -2473 3378 3477 -2520 -17 5447 130
504A30l471N645n63n757K502K730l955j76M677k309l408M650J417m185J493M259
520C679j355k341K120N37l053n3K050j806j736K125L32k392r25K511N45l343J249
537a856M332j875k207K907R93l509J493L645k575k042M173j812n038K555K635
552A819m153k68M538k456l285M035N4m285L856L910m758k3N687k583m615L651
568A124K552m979J113M053l805l253L412p14l318J929L073j970j343K136N28j990
584a452O32K393R0l42M51P97j714j325J831m91k565J574K028l450j429K882j01
601a91l386K829K824l732P50M165k594l373M731J444m663J283M703l426l367K884
617H81l2m115J681K500k385j207L251k59l325J837K732j487m70K578j50j988R20
$$ plain form
504 130 -3341 2304 1741 -4016 -1514 1216 -2739 -2915 1762 -547 -3955 695 2112 -2073 -580 3679
520 3679 2324 -17 2103 2640 -413 -466 1584 -222 -1958 167 499 -1893 -2818 -307 238 -3105 -1856
537 -1856 2476 601 -1606 1301 2294 -1215 278 3923 1348 -694 3479 1667 -3371 -816 1819
552 1819 -2334 -2602 1936 -520 -3805 230 284 -4001 -145 3765 -993 -1016 4671 2088 -2527 1124
568 1124 3676 -1303 -190 3863 58 -3195 217 -497 -3815 -1886 1187 -783 -2126 10 538 -1452
584 -1452 -820 1573 1663 1321 1772 2569 855 -470 1361 870 -1695 -121 1907 -1543 -2972 -90 -191
601 -191 -3577 -748 2076 -1656 -906 3259 665 -2708 2023 3467 -1196 87 4790 1364 -2003 881
617 881 849 -3266 -1585 915 -1470 -2677 574 315 -3010 -1173 1559 72 -398 2180 2030 42 962
634I62R34k254k5K712j167k833J448P13l026n80L192j88k311K429J360l121L39
651a416L189j536p08L334J91l020J39J877k090j646K019M83j953L19N05j243q56
668b412J203P18o60O95K435j378j494J628J732k165l34K937j504k186J938k83
684H70l426J243K440k505j757L718P5l785J913K786l107K92M403j874k318L380
700B348J91l884J123K880k242j848K373l41k670P99R03j425J45J959j18j226R42
717i1P44n32p17J360J205r07j168J927n47k060R25J149k123l79K228j520k459
734b965J664J661k984Q28L606j621j668L127m4k861K283J859k780j91K746j706
750I54k832J466J035k347k80K285r07j384J763N5j274R95J427n20o60J491N71
$$ plain form
634 962 1896 -358 -383 2329 1162 -1671 -223 490 -2536 -3116 76 -112 -2423 6 1366 -1755 -1416
651 -1416 1773 237 -471 2863 3054 34 173 2050 -40 -1686 333 816 -1137 -818 -313 -1556 -2412
668 -2412 -1209 -491 -1151 -456 1979 601 -893 735 2467 302 -32 2905 1401 -785 1153 870
684 870 -2556 -1313 1127 -1378 -3135 583 658 -3127 -1214 1572 -1535 -1243 3160 1286 -1032 2348
700 2348 2539 -1345 -222 2658 416 -1432 941 600 -2070 -1271 -368 -1793 -1648 311 193 -1033 -91
717 -91 653 121 -596 764 1969 1062 -106 1821 1274 -786 139 1288 -835 -1214 1014 -506 -2965
734 -2965 -1301 360 -2624 -1796 1810 189 -1479 1648 1604 -1257 1026 2885 105 -86 2660 954
750 954 -1878 -412 623 -1724 -2004 281 -626 -2010 -247 -192 -1466 -471 956 436 -224 1267 1838
767A838j168m52J099m32j268Q35K09j603k67J039j058j106J712J093k152L54K448
784A121q58j032J704O48j492Q68J437j671p49J559q42k396J337J041j649q79J612
801b41o81j245J450O08r98O65J717n77r08J328J157j727j25J321q23j425O68L40
819E04j563n22J504r10r60J301R05j551K78K065n12m91J179P05j747N48Q98j158
837D73r88J317k43j647J45J421j041j288J209M87j257O09J309q43k50J376L20
854A109j604J196J342j382q87J750l60j737K29J030j543o56J123l65j054J339
870d70P14j320J20J807l41r47J091J371j664k22J506r14j139J277k57j536J79
887g45Q72p69j515J334Q29j323N04J239l99l66J343Rq39O85R98r25j246J194Q8
$$ plain form
767 1838 670 218 1317 885 -383 452 661 -942 -1209 -170 -1228 -2334 -622 471 -1681 -1327 1121
784 1121 263 -769 935 1583 91 959 2396 725 -24 1535 693 -1703 -366 675 -974 -1853 -241
801 -241 -922 -2167 -717 -109 -1107 -442 1275 698 -210 1118 2275 548 423 1744 921 -504 164 504
819 504 -1059 -1581 -77 -987 -1947 -646 259 -1292 -1014 1051 539 48 1227 1932 185 733 1631 473
837 473 -515 802 559 -1088 -943 478 -563 -1851 -642 -155 -1412 -803 506 -337 -587 789 1109
854 1109 -495 701 2043 661 -226 1524 1164 -573 -344 686 -857 -1513 -390 -755 -1809 -470
870 -470 244 -1076 -956 851 510 -437 654 2025 361 139 1645 731 -408 869 612 -924 -745
887 -745 127 -642 -2157 -823 6 -1317 -813 426 27 -339 1004 1013 174 859 1857 932 -314 880 968
906I68j450K6M46o67r66J123K47r51L82J047o16m51J367N23j635Q35J449j252
924D25n21J463k77j441P90K73j390l50J566j207j156J106P48j563N51J557n70
941Dl52J357K9p59O88P65j338m79J210m69j115j53P30q37l56L38j08k91N68K73
961b95L8j05O25Q29q12rR77q7j099L52R00j238m53J119j020j146Q46N73j859N84
981a280J603p50j172K076L50j369J005J113j524L55J524j008j396J153J36j761
997i45K88J205j593n14J378o71o52J087K79n25R03R00o53n19J112j34n18L12M59
1016A199o48l86p4l32m18l36K51P1j82L18M39n03l61R31P03r25O75R70n13r59
1036h0J092K27j545O23Q04j366j082J678l05k021Q32J202j105L24J161m22q67
$$ plain form
906 968 -482 -456 -10 -677 -1643 -520 -273 -1224 -842 205 -411 -862 505 1028 -607 228 1677 425
924 425 -96 1367 1090 -351 439 712 -678 -1028 538 -669 -1825 -719 29 -1534 -983 574 4
941 4 -348 1009 1038 279 967 1732 394 -85 1125 656 -459 -612 118 -719 -1075 -737 -845 -1136 -568 -295
961 -295 -257 -362 263 1092 280 271 1248 1161 62 414 1314 76 -377 742 -278 -1424 -578 -5 -1864 -1280
981 -1280 323 -427 -1599 477 827 -542 463 1576 52 407 1931 923 -473 680 816 -945
997 -945 -657 548 -1045 -1559 -181 -852 -1504 -417 -138 -663 240 1140 487 -32 1080 946 428 740 1199
1016 1199 551 165 91 -241 -659 -995 -744 -673 -855 -537 -98 -601 -962 -31 672 -253 422 1392 879 -80
1036 -80 1012 1239 -306 317 1121 -245 -1327 351 46 -1975 -1143 59 -1046 -722 439 17 -850
1053h50J372M21j341O66J389j198l41Q68l13j478O16K59p67j7P81k80j123L97
1071i39O11l77O1J027P27p26J44K82k68j64L81%k71J9k25m69o82J25M63k09p7
1092e67N05l58k76M37K72o27M15J204l12l28O21j34p30M0J037j135n02R52l64
1111A50j454L64K84q90N64J275k59r44J234N71j315N76J226l28m31M22j87j186
1129c28K30K53r32J91J011j011r56J224q2o29N62M00P3M03K79j22m70N97j83J23
1149F33j85PN8l37o40j84L75n85K99L4L21m54M56mj95L95Q08L4o63J210m12j197
1171b26M27L42r03M02Q70p16j291O94P2j250L55J300m60k95R49K13p48M42N52
1190G29j04L81L82j44p78J18n79r23K41J93l5k8J45k63j79J17K18O04M9K02N34
$$ plain form
1053 -850 522 943 -398 268 1657 459 118 986 673 -805 -189 70 -697 -714 67 -213 -1336 -939
1071 -939 -328 -705 -644 383 1110 384 528 810 542 378 759 759 488 507 282 -187 -869 -744 -281 -490 -567
1092 -567 -62 -420 -696 -259 13 -614 -199 1005 693 365 986 852 122 162 1199 64 -438 514 150
1111 150 -1304 -940 -656 -1546 -982 293 34 -910 324 895 -420 156 1382 1054 623 1045 858 -328
1129 -328 -98 155 -777 -586 425 -586 -1542 -318 -400 -1029 -467 -67 6 409 688 566 96 693 510 633
1149 633 448 455 513 176 -464 -648 -273 -858 -559 -525 -204 -658 -202 -206 -401 -6 802 836 173 1383 971 -226
1171 -226 201 543 -360 42 912 196 -1095 -401 -329 -1579 -1224 76 -384 -679 270 483 -265 177 729
1190 729 625 1006 1388 1244 466 584 5 -918 -677 -484 -519 -547 -402 -665 -844 -727 -509 95 144 346 880
1211H80j09o12M19r9k41j31P50m71o08M87l90o99K31M16m89M3Q27k33j255J135
1231a49N26o46N44N47k45O9K11k62p56K00N58o40l49M47m74r67O32J86k5J7M75
1252a01L25n20M21O43o36N2Q23j00n53k65L69n30k66L27q7l41q7J90n40pP11j55
1274c27k10P65O96p41K38M66o63Q3M32k54m89J74K3m25n08L58P9o58O00M57j81
1295h5l69M21n8l66L91M78j08k8N37Q8m78o5L91n44m01K65op04K3J48k82k65O39
1318c78Q4j55N95M78l27l09J073l06l78J03J30n48j53K64m18n95K94J84l98j46
1338i06N36K53m50K08O58k21J56L19j33q1J24K07m41j78M90n60k33J41j95m46
1358g52n4L76j1m21P60J43m07M02N12m76L16N33l7p72L96R2m54l57Q27p78n46
$$ plain form
1211 880 771 159 578 479 238 107 857 386 -222 265 -125 -824 -593 -177 -666 -623 204 -29 -1284 -149
1231 -149 377 -269 275 822 577 646 857 595 -161 39 597 -43 -392 55 -419 -1386 -754 -568 -593 -576 -101
1252 -101 224 -296 125 768 132 184 1007 907 354 89 458 -72 -338 -11 -98 -439 -526 -336 -876 -883 -172 -327
1274 -327 -537 228 924 183 421 887 224 307 739 485 -4 170 193 -232 -740 -382 -303 -961 -361 96 -85
1295 -85 -454 -33 -91 -457 -66 412 304 276 813 901 423 358 749 205 -196 69 63 -641 -618 -470 -752 -1017 -378
1318 -378 -294 -449 146 624 297 -12 1061 755 377 480 610 62 -91 173 -245 -840 -546 -362 -760 -906
1338 -906 -370 -117 -567 -359 299 78 234 553 420 339 463 670 229 51 541 -19 -252 -111 -306 -752
1358 -752 -806 -430 -441 -862 -102 41 -366 36 548 72 388 921 884 112 508 600 146 -211 616 -162 -708
1379g08M84l09k95J38M66k64k38N00L20m8J64M57k65J14J05K60o98J64J61m59
1399D9o88Q0L78m49j46L20K52j75J78P33p13L16O46k87l54L39J79p16K63J18j30
1420A93p46J083l34p42N6M47m77j70O39j75j24L78J39r3K24M03l79J08J57j5n92
1441b0K22l6m74P5j74J61n27K14J79K3q0K49K16J26j39M21j19K6K66j31j59k85
1463C4N16m01l39j26K05m00n8M48k26l51M47K06l84K36P79l70m50J225j75p57
1483E9L51L74r02O6N96q61m36Q49l44m98L58K83n0j68L23j34J18K79J48k98K76
1504C89K83k56j01l2j49p6k2k32j74k68K12j44Q7j27L94j11J63L20J73L33l08
1525C54J04R9J78o27O46m92o18L01J32q20J29M32j41l57N38J6l58M18M10l39k2
$$ plain form
1379 -708 -224 -533 -828 -690 -224 -488 -726 -226 94 46 210 667 402 516 621 881 183 347 508 49
1399 49 -639 -559 -181 -630 -776 -456 -204 -379 -201 532 -181 135 781 494 140 479 658 -58 205 323 193
1420 193 -553 530 196 -546 -490 -43 -520 -690 -51 -226 -350 28 167 74 298 701 322 430 587 572 -20
1441 -20 202 166 -308 -233 -407 -246 -773 -559 -380 -357 -437 -188 28 154 15 436 317 343 609 478 319 34
1463 34 550 149 -190 -316 -111 -511 -569 -121 -347 -698 -251 -45 -429 -193 586 216 -234 991 816 59
1483 59 410 784 -118 -52 544 -317 -753 96 -248 -746 -388 -105 -155 -323 0 -134 -16 263 411 113 389
1504 389 672 416 315 283 134 58 36 -196 -370 -638 -426 -570 -483 -610 -216 -327 -164 156 329 662 354
1525 354 458 557 735 108 754 262 -356 -55 77 -743 -614 -182 -323 -680 -142 -126 -484 -66 344 5 -17
1546a7P16j47m77M90Q8o07J35M21n97n86L48N9o51L38J27k71Q6N32j45NM18P2
1568C37k81K49N39j73l28l9k49N0m2L1m12Q8k68Q2J39k80J31K5K55j05L93K06
1590C48k20m3K90PJ5P4K29m95m4r2l79l47P02k04l07M51l25m72L49N73m63M47
1612I4O38n42k50O33m11m75O56K4l45J43j84j31n31J81K12j96K61n5J66n0K54
1633I2k26L44J90J67l63M72l77j15J59k08l56K77K3n35O97o12k00K40L19L5k34
1654b11K24J79k90P5L46k36J07N82k85m64K94J49p96L98j37n04K57N55n44m01
1674g02P38m02j09M36M91r9p1O7J4l00J64R0q8j74M01m83m93M20l13l00L64q3
1696d32j32K08K17J61K53l18N09l5j68P4K10p9p40J37K89j18l49L21Qn51J95j95
$$ plain form
1546 -17 699 552 75 565 653 46 181 602 5 -581 -233 -174 -825 -487 -360 -631 -545 -13 -158 -153 265 337
1568 337 56 305 844 671 343 304 55 105 63 94 -318 -230 -498 -416 -277 -557 -426 -401 -146 -251 142 348
1590 348 128 85 375 382 397 471 700 205 161 69 -310 -657 45 -159 -466 -15 -340 -812 -463 110 -353 94
1612 94 732 190 -60 573 162 -313 343 367 22 165 -19 -150 -681 -500 -288 -484 -223 -278 -112 -162 92
1633 92 -134 210 400 567 204 676 299 184 343 135 -221 56 79 -456 241 -371 -571 -331 -12 23 -211
1654 -211 13 192 -98 -23 323 87 194 776 491 27 321 470 -326 72 -65 -569 -312 243 -301 -702
1674 -702 36 -366 -475 -39 452 353 282 349 363 63 227 317 229 55 456 -27 -520 -100 -413 -713 -349 -432
1696 -432 -564 -356 -139 22 275 -43 466 431 263 337 547 468 -272 -135 154 36 -313 8 16 -535 -340 -535
1718e35l7M24J75j09K55R0j58K20p0K94k99J86O2L6m01q4j25k40J16j51O6k29
1740e14n5K63j19o5M56l6M66J32k24j71J09Q8p3l50N63o89qj75J20m13K37J67
1762b91j06K67kJ71j46K00J44j37K16j75N19j37k07k56P7j97R2j60k54J04J09
1783a69k33m3o8L50Q2j65L43K4M2JL20m13L08Q5k12k88M5q0p7k65L42j65j58P8
1807c16J82k20J48N2j9J51M72L8j79J88p1k21p5k4M0q2k28Rk53J7r9K58j09K32
1831a09r8K60j96l9M48l03O78n33L29Jj0j25k71j94L3L4j79L48j07m96J08K97
1853a24j34K55%j38K41J11nN3rM36k69k93K09k21j77NO3k80k18L93j54j94L14
1876a36n7J72P4N7J63l6Q1K43j92l02K43j86l20K72L3k35p1jo4j37j4K64j02L6
$$ plain form
1718 -535 -572 -148 27 -82 173 263 105 325 255 549 250 436 498 534 133 49 -76 -316 -200 -351 -285 -514
1740 -514 -569 -306 -425 -490 -34 -70 396 528 304 133 242 330 257 -93 470 -219 -227 -402 -282 -695 -458 -291
1762 -291 -397 -130 -132 39 -107 93 237 100 316 141 660 523 316 60 137 -60 32 -128 -382 -278 -169
1783 -169 -402 -445 -513 -163 -81 -246 97 121 163 164 484 71 379 464 252 -36 9 -71 -148 -413 -71 -236 -394 -316
1807 -316 -134 -354 -206 -154 -173 -22 450 488 309 497 426 205 130 106 146 64 -164 -155 -408 -391 -490 -232 -341 -109
1831 -109 -207 53 -143 -182 266 -37 641 108 437 438 428 303 32 -162 -129 -95 -274 74 -33 -529 -421 -124
1853 -124 -258 -3 -3 -141 100 211 206 259 250 686 417 124 333 112 -65 -60 3 -277 -495 -102 -256 -450 -136
1876 -136 -193 -21 53 110 273 237 318 561 369 67 310 124 -196 76 109 -126 -197 -198 -262 -399 -413 -149 -251 -215
1900b15J79L28l01j4L66k81L61k69K1j67J80p7j89l28M70l07k80K19M3j65L44
1921h2j17K83l4J60J54m7R6jk21j79k03M29m10J77j85k43K88jl3l51K44J13j18
1944b81K00P1m2K53J52J63k03J0j23j56J24m81N01k76k67K43k53Q6j85P7J32P1
1966a84J31J43k31J18J68j68J48K29j99j4q7M73n65J72Pm27j47J01J34k84L29
1987a53k53J12J90n6J18J56J82R1j63J31k50K42k66m7k0k55K45k19o1J74k59j39
2009e00K25K71m7J18j7K07J9j47j48N50j47k26M8j54p9J54j00k10m47J20K65n5
2031c00J03l8J21j0L53k2j15j33M55k76J82q9j02J25j10J88n48j46L42M4m49K2
2053d03J89P2r3L64p7k16N92k34j37L82j9j37j46J17j98r6M9M0l66L4n4j07L6
$$ plain form
1900 -215 -36 292 -9 -23 343 62 423 154 175 8 188 111 -78 -406 64 -243 -523 -304 -261 -426 -82
1921 -82 -199 84 50 210 364 317 413 412 191 12 -191 238 -172 5 -180 -423 -135 -136 -169 -520 -276 -163 -281
1944 -281 -81 -10 -52 201 353 516 313 323 200 44 168 -313 188 -88 -355 -112 -365 -279 -464 -387 -255 -184
1966 -184 -53 90 -141 -23 145 -23 125 354 155 141 54 527 -38 134 141 -286 -433 -332 -198 -482 -153
1987 -153 -406 -294 -104 -160 -42 114 296 387 224 355 105 347 81 34 14 -241 4 -215 -276 -102 -361 -500
2009 -500 -275 -4 -51 67 50 257 276 129 -19 531 384 158 206 52 -27 127 27 -183 -630 -510 -245 -300
2031 -300 -197 -235 -114 -124 229 207 92 -41 414 138 320 231 129 254 144 332 -216 -362 -20 24 -425 -403
2053 -403 -214 -142 -235 129 52 -164 428 194 57 439 420 283 137 254 56 -40 9 49 -317 -283 -337 -444 -408
2076d08L32m2M3J16oJ12j77K45L21l19j03q0K02j83l12L94o2l92J05L30m74J26
2098b32N3J06l8O2N9J73j23K32K15j49P3l58k6P5J99k19l33Q0k66Q2J93k98R1
2121c49J7K40K06j72QK41r9P0L0j23L27n0m0l09r8J49j88j51k19K53Q3p7q8K93
2145d6N0n7K03q3M10N5k03l79L85j80k6q3N3o8k75K8J13k40j2J62O6n7Q5J87k75
2170a87J58J51J46P4n6K10k86r5j5%j86J85j25j42R4k05j05J44K24J15k63K73
2192A09j9m8L59m16N3J41J58o4m2j88J07r1k34M7j70K46m0M8k01qO9J95J3M5M34
2217E03k84q6J47J68p4k72J40r5Qp8o6k67J58l60J85k00K59K17J59J9j94L5M1
2240F3J97Q7j23K50m42j8J69j18m5r5J31l47K11j23o9J64k3l0J78j36K39J00r1
$$ plain form
2076 -408 -76 -118 -75 41 35 147 -30 215 536 217 114 34 236 53 -259 135 73 -319 -214 116 -358 -232
2098 -232 -179 -73 -111 -49 10 183 60 292 507 358 431 73 47 122 321 102 -231 -151 -417 -335 -142 -440 -349
2121 -349 -332 -92 114 -58 -50 191 92 162 192 69 396 346 306 -3 -101 48 -140 -291 -510 -257 -174 -251 -339 -46
2145 -46 4 -53 150 67 477 532 329 -50 335 155 129 46 99 31 -244 -216 -103 -343 -355 -193 -127 -184 -99 88 -187
2170 -187 -29 122 268 342 286 496 210 115 100 100 -86 99 -26 -168 -74 -279 -384 -240 -16 99 -164 109
2192 109 90 42 401 -15 38 179 337 273 231 43 150 59 -175 -128 -298 -52 -92 -44 -245 -253 -184 11 24 69 503
2217 503 219 133 280 448 374 102 242 147 155 77 11 -256 -98 -458 -273 -473 -214 3 162 181 -13 22 63
2240 63 260 347 224 474 32 14 183 65 20 -75 56 -291 -80 -203 -272 -108 -131 -161 17 -119 120 220 129
2263A29K13k96L45j84J65l47J47l16j27j3K10k19P7P9q0J84k8j60K05J82K29k44
2285A51K56k95j31K25K6p7o6j70k30J00J11k72K19j90L64l13L93j74J6J79N3J41
2307C16l54J64L1M38l45p7k04k79J40j69Q0J91J13n5j72j65J51K43j76J10kq5
2329a06R0N78k50J70l82l8M9k62n4O5r8j18J89o2J24K81m50L99k06J07J99j44
2351H1K31k28q3M58j16k84L0J29k42k7J06k13k7j34K44j59Q0J13J30m0k10K65
2373A04J29K20k68J17O3l07O2j92j47M7k9M53k55o4m9j39J9rj0L06L8J56k52J44
2397A37k30O8q9L12l9j82j0j39K28l6j01k43J38J04m2Q3K39o2r9j94K90L22k20
2420B35J16k96J64j41r3p2m0J74j62o2l54L86n0K9N6j78N5O20m1m20K50J64k58
$$ plain form
2263 129 342 46 391 207 372 25 172 -144 -271 -284 -74 -293 -216 -137 -217 -33 -61 -221 -16 166 395 151
2285 151 407 112 -19 206 232 155 89 -81 -311 -211 -100 -372 -153 -343 21 -292 101 -73 -57 122 175 316
2307 316 -38 126 157 595 250 173 -31 -310 -170 -339 -259 -68 45 -10 -182 -347 -196 47 -129 -19 -21 -106
2329 -106 -16 562 312 482 100 62 111 -151 -205 -140 -238 -356 -167 -229 -105 176 -274 125 -81 26 225 81
2351 81 312 84 1 459 343 59 89 218 -24 -51 55 -158 -185 -319 -75 -234 -154 -41 89 49 -161 104
2373 104 233 453 185 302 365 58 120 -72 -219 -172 -201 252 -3 -67 -116 -255 -236 -245 -255 51 89 245 -7 137
2397 137 -93 -25 -114 198 159 -23 -33 -172 56 20 -81 -324 -186 -82 -124 -41 198 136 37 -157 133 455 235
2420 235 351 55 219 78 -15 -87 -127 47 -115 -177 -531 -145 -195 -166 -110 -288 -233 387 346 -74 176 340 82
2443H2P6K71k70J70m34j36K57k34k40L21R0j81J88J9J26k27L50j78J54k8R3J44
2465D13l01K47k97q0K46Qk84K64n28L6J57J59j17m8j42M13j72j05J99j10K00K50
2487D08l51j11M76j85r9k30J09j58p6J36J09k08j18K63L6o3O6J07q9R1n4J5J33
2510B07k18L85k83r9k22J29J2o1m2J82o7r6Q7O4oJ32l44M74o7j53O7J33J28l74
2534c2o8K8J78j83K48l65l5j7K5n1N9K01l08J97K43k03O5j01J75J02Mj2K0m8l5
2559H7J2J19k53M0j56j60K26r6L15k63n7J01L11q5k02M71p7j25k1k50L66k01j87
2582h5L4J02k07J19j61L5K45j26O9l48R7M38k51K22p3J45o1R7j25n8o8n7j03M17
2606B97l67o0m6l1L2J02k19J17M19j43j66j30K20Q3J42nj05nj58J00j88K81m04
$$ plain form
2443 82 158 429 159 329 -105 -241 16 -218 -458 -137 -47 -228 -40 -21 105 -122 228 50 204 176 269 413
2465 413 112 359 62 -18 228 236 -48 216 -312 -276 -119 40 -77 -125 -267 146 -26 -131 68 -42 158 408
2487 408 57 -54 422 237 138 -92 17 -141 -217 -81 28 -180 -298 -35 1 -62 4 111 22 113 59 74 207
2510 207 -11 374 91 -8 -230 -101 -89 -150 -192 -10 -77 -173 -86 -22 -28 104 -240 234 167 14 81 214 342 -32
2534 -32 -100 -72 106 -77 171 -194 -229 -246 -221 -272 -213 -12 -320 -123 120 -83 -18 -119 56 158 162 150 170 122 87
2559 87 99 218 -35 5 -151 -311 -85 -181 134 -129 -186 -85 226 141 -61 410 333 208 187 -63 303 102 -85
2582 -85 -51 51 -156 -37 -198 -163 82 -44 25 -323 -226 212 -39 183 110 255 194 291 166 108 40 -17 -120 297
2606 297 -70 -130 -176 -207 -175 -73 -292 -175 244 101 -65 -195 25 108 250 245 140 135 -23 77 -111 170 -234
2629b34J91K9l66M99l47K6k7K61J1k58L07o0J13l1Q2RJ37k59JJ6k57k26J32R7
2653a54K03j53K80m05P9n01O51k5j86M19k51M16j35J0q7l63M65l07J79o8O9m28
2675b92m2jN9K79j54K49j60N6Ko5K08kK8n3j5p7J56l8k84j47K23l4k0k64K27N5
2701a06j19Q3J28j04N29k68J44j29k60K22J61j54q4k32M20l57m3O4J50j41n6J08
2723d4p2M7j91L04q5r3M38k04J9J50k90N6M1q6j3K20l69K97j81m7k33N4Q2J88
2747a2m9l5Q8R0j62J34N7J39j25K08k58K9j74J2j41L13k20K1j02k32N51j26j16
2770a10r9M91k17M1j77K07n1P2j91q8M73l40l5j6J00j28o3o2L08K4k13Mk63J32
2794b01K04J86p3J73o8O0j3r8j2j68K82j21j05k25j28J36j51Q2m4K24n2K9L47
$$ plain form
2629 -234 -43 -14 -380 119 -228 -202 -229 32 43 -215 92 32 145 114 196 205 342 83 84 100 -157 -383 -251 -154
2653 -154 49 -104 176 -229 -150 -651 0 -25 -211 208 -43 373 238 248 161 -202 263 -44 135 67 136 -292
2675 -292 -334 -335 -276 3 -151 98 -62 -6 -4 -69 139 137 165 112 97 20 176 138 -146 -293 -70 -104 -124 -388 -161 -106
2701 -106 -225 -142 -14 -118 411 143 287 158 -102 120 281 127 43 -189 231 -126 -169 -105 45 -96 -152 -44
2723 -44 -116 -69 -260 44 -41 -134 304 100 119 269 -21 35 76 -10 -23 197 -172 125 -56 -103 -336 -282 -200 -12
2747 -12 -61 -96 -8 82 -80 54 111 250 125 333 75 104 -70 -58 -199 114 -106 -85 -187 -419 132 6 -110
2770 -110 -209 282 65 106 -71 136 85 157 -34 -122 351 11 -24 -40 60 -68 -131 -193 115 139 -74 -70 -333 -201
2794 -201 3 189 116 289 221 281 268 170 158 -10 272 151 46 -179 -307 -171 -322 -240 -284 -60 -112 -83 264
2817B64l61L08j52J48qP1j39L27l45K59n47N0J35j15J00j1j29m7j14M28k45J60
2839C7k00K74J86o76L91R5j26J46Kk71j5P3J97J05m19o3J76j26J98j65j9J51K67
2862B18k22K81M4k89j3J35m6q6l4j3J19k61k6K22j78J34k19K49N1k14M7J07r6
2885i0L8R8J66J02R3j72p5j70L5N6r4j21J1k15M81k54j17J95J52j31n0Q8L3J16
2909A75K7j9k56M02j22j43J48j92j83N9q1K30k95J14j3Q0j33J47J80q6n7J63j48
2932cj1J34N7r5p4J81k24j64L28m6k52K42k77pR5N4O8M2j02N1K14j14O8j67N6
2957E4J19l2j49M5j40M4N1k32N33o90J68J85m3k2k09K07K04k22J89On1K74l09
2980b0R5L13n2j4k14j81R8k61L84j46p7j46J60J70p3J10o7K12j9j04p2qK1j66
$$ plain form
2817 264 -97 211 59 207 199 270 131 458 113 372 -175 -125 10 -105 -5 -16 -145 -192 -306 122 -123 37
2839 37 -163 111 297 -379 12 107 -19 127 129 -142 -157 -84 113 218 -201 -264 -88 -214 -16 -181 -200 -49 218
2862 218 -4 277 321 32 19 154 108 22 -12 -25 94 -167 -193 29 -149 -15 -234 15 66 -148 -101 6 -90
2885 -90 -52 46 212 314 407 235 160 -10 25 81 -13 -134 -123 -338 143 -111 -228 -33 119 -12 -62 26 59 175
2909 175 202 183 -73 329 207 64 212 20 -163 -104 -185 45 -250 -136 -149 -69 -202 -55 125 39 -18 145 -3
2932 -3 -14 120 177 82 8 189 -35 -199 129 83 -169 73 -204 -211 -116 -62 6 48 -54 -3 211 97 165 -2 54
2957 54 173 141 -8 37 -103 -59 -8 -240 293 -397 -229 -44 -87 -109 -318 -111 93 -129 60 66 15 289 -20
2980 -20 75 388 336 322 108 -73 25 -236 148 2 -75 -221 -61 109 36 146 79 291 272 168 96 88 109 -57
3004e7J88k89J43M4l5R1j06k59M7l7L45j36m5Qj19M28j5j0q5K11k9k31l7J43k32
3029g4r0K02j27r8j58M25k00L11k57k01L83N7j34j32K52j49P3K37j82J04j26j34
3051a8Q3n5m1m9j11Q4K19k54N3J32o6l1o9m1N60l62Q5j66p6K26k51M05n7m05Q0
3076a25Q9m6J13j43L4o6o0J58K8J13o9o2l5m1J44J38l5K5l07L63l96L25j85j40
3100a80j7k20K36J20R2M0l44K71l0J97J07k31rJ34k76K8K18j51Q3j33J47l92J93
3123a17O9L69k50j94P9j77K66k7J20p7P1J1r8p5o7j7JK24k50K18r5j73K24l50
3147c15L62r4j01K28rk74J99K69j56j12M45m92J04M0O7j49J04j55j72L62j65j86
3169b00J79j97M13j98j06J34K10l56K34K60l01p8p8L4pL02l62R1p0l3mJ13n2L16
$$ plain form
3004 -57 131 -158 -15 29 -6 85 -21 -280 -233 -270 75 -61 -106 -98 -217 211 196 186 101 312 283 52 15 158 -74
3029 -74 -164 38 -89 -187 -345 80 -120 191 -66 -267 116 173 39 -93 159 10 83 320 138 242 116 -18
3051 -18 65 10 -31 -80 -191 -107 112 -142 -89 43 -23 -54 -123 -164 396 34 119 -47 -123 103 -148 257 200 -205 -125
3076 -125 -36 -82 31 -112 -78 -144 -204 -46 -18 95 26 -36 -71 -112 32 170 135 160 -147 216 -180 145 -40 -180
3100 -180 -197 -417 -181 -61 31 71 -273 -2 -32 165 272 41 32 166 -110 -82 136 -15 68 -65 82 -310 -117
3123 -117 -48 321 71 -123 -44 -221 45 18 138 61 132 143 45 -30 -97 -114 -113 111 -139 79 -16 -189 35 -315
3147 -315 47 -47 -148 80 71 -203 -4 265 109 -3 442 -50 54 94 161 12 116 -39 -211 151 -14 -200
3169 -200 -21 -218 195 -3 -109 25 235 -121 113 373 72 -6 -84 -50 -57 245 -117 -26 -96 -129 -133 -20 -72 244
3193B44m86M6R0J92J15j52j5l4j6J25j11J80l11jK02m1K4p2j33J05j79J10J42
3216B4k90M18j51j8M7j37R5j87K56J23j45j55P2J0L4l6J11J30l06O8l10L46p7
3239g8k23K49J71Q5J63j03j21k07K39o4j24PK94k00j64O9j64OJ80J0j60J42J75
3262A82j21l06K32J26m1k3J40j26p4J38k1r8m3m3J20l11J25K53j64J26j13J81
3284A39l22K27P5J7O3k48K05r6M2j63J47k30R5J69o3j37R2J38j48K4j88K85K1
3307A44j46j29L39k63Q3k7K59j69k34M16k37P4k61K23j01k66K26K1j32J62K38
3328B20N5k11j12R4n3L02j06o9j61K88k40q1o0J53j91L7O9l6j82K05j06J61L6
3351A2m3N8J25J05Qj80n6J76k58R7j36M7n6q2K11J1m6k53M13j32k52J81j05K53
$$ plain form
3193 244 -242 -196 -106 86 201 49 34 0 -16 109 -2 178 -133 -134 68 27 51 -21 -154 -49 -228 -118 24
3216 24 -266 152 1 -17 30 -107 -12 -199 57 180 35 -120 -48 -38 -4 -40 71 201 -105 -37 -347 -1 -78
3239 -78 -301 -52 119 204 367 264 143 -64 175 111 -13 -6 288 88 -76 -7 -171 -165 15 25 -135 7 182
3262 182 61 -245 -13 113 72 49 189 63 -11 127 106 8 -35 -78 42 -269 -144 109 -55 71 -42 139
3284 139 -183 44 119 136 199 -49 156 60 102 -61 86 -144 -49 120 57 -80 12 150 2 26 -162 123 144
3307 144 -2 -131 208 -55 28 1 260 91 -143 273 36 110 -151 72 -29 -295 -69 -48 -180 -18 220
3328 220 275 64 -48 46 -7 295 189 120 -41 247 7 -74 -134 19 -172 -135 -66 -102 -284 -79 -185 -24 12
3351 12 -31 27 152 257 265 85 29 205 -53 44 -92 -45 -101 -183 28 39 -7 -260 153 21 -231 -50 -155 98
3375I8qj27L11j15m2k31N8K3K0J92k93L29k80Kj96K21l43M57k20J25Rp6J27J20
3399A61ro2J26l6q6j01J05Pl77R6J33j44NO5J72j47N5Q9l1j79J43L8J05j40o1
3424g3L85j99N4j01q2J74j79L4q8N3l4k43J05j02j3K30J98Nq8K15p9j76J39k56
3448a21J15j6L0J46k95J92l1l63Q5M40l12J27k75K86j24J54J3j63K07L4L9o2k20
3471a14O3L00m02K51j60P9k6k0q4K1L8k22J25L9K42k78L56k34J96j97K77j40j5
3494I5J14j40k3m6J28j00P8j80j10N1K00j05r5J08r4J62n8R7q8j6J70p6n1K45
3518B66k40j40J59j15K9N4p6q7K74j76m7J16J71k72J50k76L39o9p8P6j86K51k1
3541A02k6j15O8k35L01k63m8J88M0j56K19p0k17L33rk46P7J40J03j55M6k08P4
$$ plain form
3375 98 90 -37 274 159 117 -114 -56 -33 -13 179 -114 215 -65 -63 -259 -38 -381 76 -144 -19 -10 -86 41 161
3399 161 152 90 216 180 94 -7 98 105 -272 -176 -43 -187 -182 -117 55 -92 -37 52 21 -158 -15 23 128 -12 -73
3424 -73 312 113 167 66 -16 158 -21 13 -75 -22 -56 -299 -194 -296 -309 -79 119 124 36 251 172 -4 135 -121
3448 -121 -6 -22 8 154 -141 51 20 -343 -258 182 -130 -3 -278 8 -116 38 51 -112 95 129 168 106 -114
3471 -114 -51 249 -153 98 -62 17 -9 -29 -113 -92 -54 -276 -151 -112 130 -148 208 -26 170 -27 250 110 95
3494 95 209 69 46 0 128 28 106 -74 -184 -133 67 -38 -133 -25 -119 43 -15 82 -6 -22 148 72 21 266
3518 266 26 -114 45 -70 -41 13 -63 -150 124 -52 -99 17 188 -84 66 -210 129 60 -18 58 -128 123 102
3541 102 76 -39 29 -206 95 -168 -216 -28 12 -144 75 5 -212 121 112 -134 -57 83 186 31 77 -131 -57
3564e7N5j39K28j98o0K8j61J52P3o4O9J31j20J91n4J80l38Q9k54N11l04M5Lk37
3588b31Q0r1L03j88J13J3n5j46L89j44p5o2K07j54K66Q2k34o0k46J91K55J17m65
3611a35K55k68J52j75j7j67K40J21k51L22k31L60j28K41l6l64J03K13m11J04J37
3632F5N8k89J48K22j97j48K48o7J40k67M05n64K21K17j32P4j09J64k46p7j60P7
3654b17RM48l22p5kJ57l1l6p5Q6k7l1K01k26L34k07R3k3j35J37K58o32J17J79
3678b0j14J33k52N1N8j35J87L10m76OJ87J83J25j86P2j32K27j11l71L87k61Q5
3700d7J2O7k99J6K2n8J44K55j30L42k28r6k05J11K32k03K13j49J83j64J75k39
3722d6L2p2n0K17J7j24nJ27j09l3M5j01PJ48j15K77l21QK65j06K14m18m2M1q6
$$ plain form
3564 -57 -2 -141 87 -111 -171 -143 -304 -152 -79 -143 -74 57 -63 128 74 254 -84 5 -249 262 -42 3 6 -231
3588 -231 -151 -242 61 -127 -14 -1 -56 -202 187 43 -32 -94 113 -41 225 307 73 13 -233 -42 213 330 -135
3611 -135 120 -148 4 -171 -188 -355 -115 6 -245 77 -154 206 78 319 283 -81 22 235 -176 -72 65
3632 65 123 -166 -18 204 7 -141 107 40 180 -87 318 -246 -25 192 60 134 25 189 -57 -134 -294 -217
3654 -217 -208 240 -82 -157 -159 -2 -33 -69 -144 -58 -85 -116 85 -141 193 -14 79 56 -79 58 316 -316 -199 -20
3678 -20 -134 -1 -253 -202 -144 -279 -92 218 -258 -252 -65 118 243 57 129 -3 224 113 -258 129 -132 -47
3700 -47 -35 32 -267 -251 -229 -287 -143 112 -18 324 96 0 -205 -94 138 -65 148 -1 182 18 193 -46
3722 -46 -14 -86 -136 81 98 -26 -31 96 -13 -46 -1 -102 -95 53 -62 215 -106 -98 167 61 275 -143 -185 -144 -230
3747b30J52K74j15l71N2L08r3k8p8m5K72k93O17l94J11r1j18K1KJ18n1p0k49K86
3771a3o6o2M8L3J62p6o8j44K05J9J13k2r5J72j58n9J57l70J05M4j67K05oM3r4
3796i4q8K66j65J88j18q7K3j22M99l43J08P6j35j70Q8M6j34J43J54k41j45Q0J26
3819d5j69K10q6J68j30L3j29O0O2P5Q5k0j62j13K74k92K12N9l46K16n6J33j24
3842h5J27Q4j70n6rK15L5J86m26J18o4J78j00R2Q4l92k0P4j0j90L63J81l65j00
3866b50M84l33K00j0J76k22J30l55K27M8n1q3J5j08j48K85R1k37K74k26m7J36
3888dq9r7K01R8n2k35L58r2j3M1l31J5q0L13j43K9R6j78J61k03m3L00o5R8j49
3913f4J41O2j93J81j50j69j21K81M0j90K10q7q9K41k48J1%P1j34J55k91K66j88
$$ plain form
3747 -230 -78 196 81 -290 -238 70 -23 -51 -129 -174 98 -195 422 28 139 48 -70 -49 -47 71 20 -50 -299 -13
3771 -13 -79 -141 -93 -60 102 26 -42 -186 19 38 151 129 34 206 48 -11 146 -224 -119 -75 -242 -37 -43 0 -94
3796 -94 -182 84 -81 107 -11 -98 -75 -197 302 -41 67 143 8 -162 -74 -28 -162 -19 135 -106 -251 -171 -45
3819 -45 -214 -4 -90 78 -52 -19 -148 -88 -26 49 134 114 -48 -161 113 -179 33 92 -254 -38 -94 39 -85
3842 -85 42 126 -44 -100 -109 106 141 327 -99 19 -45 133 33 125 209 -183 -203 -129 -139 -329 34 215 -150 -250
3866 -250 234 -99 101 91 267 45 175 -180 47 95 44 -39 -24 -132 -280 5 96 -141 133 -93 -140 -4
3888 -4 -93 -190 11 109 57 -178 180 88 75 116 -215 -200 -280 33 -110 -81 15 -163 -2 -205 -248 52 -13 85 -64
3913 -64 77 139 -54 127 -23 -192 -313 -32 8 -182 28 -59 -148 93 -155 -144 -144 -73 -207 -52 -343 -77 -265
3936b65N95l49k2J01k13L38n2j15r8J33P6k41K18k84L15k32J92j2j18K12j25j76
3958a22m7M5N3J80k04J00P8N2l22o7L17m6l8lj3o1O0l6j83M62j22P2j28j0k08
3983a91J62J05j22n7k7J05j5J81k54n4j01K17k2L2K7j36L00k43R8K12m1j95J07
4006H8j50J11p2j24K1m8K32J2Kp0O3r7M9qj35m2K06l9l1M36l04j07K26m85K37
4031b9K0j35J38j55J77M5j50Rj21L12q2L9J45l75K86o9J58q3p6k3j03o1K56k43
4055a20J47J15m11K54M6P8l21P1k39K57R3m9J79J15k2o5j83j65N67k81j43J3J5
4078d9j6k22L72m34K71J18j05N9p9M69l66Llp1o0Q6O3j41L0J96j94L1J2n5K18
4103A33m98L37n8J02K09j79r2L52l13M2M2J07j08kJ55r7k11J84o1Q7K5j28j8K9
$$ plain form
3936 -265 330 -19 -41 60 -153 185 133 18 -80 53 129 -112 106 -178 137 -95 97 85 -33 179 54 -122
3958 -122 -169 -124 -71 109 -95 5 83 135 -187 -254 63 17 -21 -24 -37 -98 -38 -74 -257 205 83 155 27 17 -191
3983 -191 -29 76 -46 -103 -130 -25 -40 141 -113 -167 -268 -51 -73 -41 -14 -150 150 -93 5 217 176 -19 88
4006 88 -62 49 -23 -147 -126 -174 58 70 72 2 65 -32 17 9 -126 -168 38 -1 -32 404 100 -7 219 -266 -29
4031 -29 -9 -144 -6 -161 16 61 -89 -80 -201 111 29 68 213 -162 124 55 213 130 54 31 -72 -133 123 -120
4055 -120 27 142 -269 -15 31 109 -212 -141 -380 -123 -30 -79 100 215 193 128 -55 -220 347 66 -77 -64 -49
4078 -49 -65 -287 85 -349 -78 40 -65 -6 -85 384 18 21 18 -53 -113 -27 36 -105 -75 121 -73 -42 -30 -85 133
4103 133 -365 -28 -86 16 225 46 -46 306 -7 35 77 184 76 74 229 132 -79 105 44 131 156 28 10 39
4127C9j01%p5J57j02K67j39p5J81j2j81M2J5k1P8L2o6K06m93K64J1k58L16k55
4151a70J58j12L06k80oK6J53J77j27j06K46j79P0j17j24J37l2r9J27L6k75kK6
4174a67K07j41P2MJ10Pj51K48j29m4J45l38K31j08l9jp6lL14m23K92J47J1j38
4198C0k18N4O0M2r5N8J04o7J96l7r1l4j24K59j02j55Q1k16L51k7k86J94r1q0J78
4223a6J0J4J06K9P6l10m8L03o6j8j41M4k38Q9J24J25pl35L19O2o3k38J61mJ23
4248A01Q1J0r2j87J62o4j38j3P7l2J30k80J81O7K8r4m9J24oL2j81J35q5j02O0
4273a35J86j29k17M27k56J89p6J11k16J43q7k5J30k70N0n6J30J27j1j08L4j25
4295a84M30l40J25l3J96k51m1K39l88L82j34l8J65J05m70J52j06J20J76l36L32
$$ plain form
4127 39 -62 -62 -137 20 -82 185 46 -29 152 140 -41 1 16 -5 73 105 39 245 -248 16 27 -231 85 -170
4151 -170 -12 -124 182 -98 -104 -78 75 252 125 19 265 86 156 39 -85 52 20 -79 48 84 -191 -193 -167
4174 -167 40 -101 -29 -25 85 92 -59 189 60 16 161 -177 54 -54 -93 -94 -170 -173 141 -282 10 157 168 30
4198 30 -188 -134 -74 -32 -127 -69 35 -32 164 127 36 2 -122 137 35 -120 -39 -255 96 69 -217 -23 -114 -194 -16
4223 -16 -6 8 114 143 219 -91 -139 164 98 80 -61 -17 -255 -166 -42 83 76 -259 60 122 59 -179 -18 -22 101
4248 101 182 192 100 -87 75 11 -127 -140 -63 -95 35 -245 -64 3 31 -63 -112 12 6 38 -143 -8 -93 -195 -135
4273 -135 51 -78 -295 132 -124 65 -11 100 -116 27 -60 -85 45 -225 -175 -231 -101 26 15 -93 -59 -184
4295 -184 246 -94 31 -2 194 -57 -98 141 -247 135 1 -37 128 233 -237 -85 -191 -71 105 -231 101
4316A01k14K19j69o9K91j10Q7r5j09L5k18J9Q5P6l8L20k76L9l1j05J31P9j32J40
4340E6L2J75j38k69J84K0j18P8m2j91l9J31L41l81J51q2J67J53m11J10J21k5r7
4363g4J17P4j47K6k05J31j90M00k56J03j22K73j93K36l50j15M32j36J3j34L20
4384B03k30L09l48M2j85J54J26N0j48m7J36j04n8J47K6J92j22M1j22K07m9k85
4406f5mJ53r1J6P6R0j73P1p8k54K6L36j37J58k4q2r%j73Q5j3K60l00J83n8j04
4432a11Q8j58K28k00J34j78J52J00P4k17l1L25j71o2P0j67K84j66j59k8K82L6
4454A25l84L00j78J43j87Kk5K91j67m7J82j2Q5k7j05j62P9O9R5p0m7j41K95j86
4478g2n1K06J22k86R6K32k77m5j11L17k26K09k73k4J62p6O7J02n7L9J43pk42j12
$$ plain form
4316 101 -113 106 -63 -132 159 49 136 41 -68 -33 -251 -232 -147 -71 -109 211 -65 -26 -57 -162 -31 48 -84 56
4340 56 88 263 125 -144 40 60 -58 20 -22 -213 -252 -121 220 -161 -10 -92 75 228 -183 -73 48 23 -74
4363 -74 43 117 -30 -4 -209 -78 -268 132 -124 -21 -143 130 -63 173 -177 -292 140 4 17 -117 203
4384 203 -27 282 -66 -24 -209 -55 71 121 -27 -74 62 -42 -100 47 73 265 143 184 62 269 220 -65
4406 -65 -69 84 -7 9 85 175 2 73 -5 -259 -233 103 -34 124 100 18 9 9 -164 -79 -92 168 -132 51 -7 -111
4432 -111 -23 -181 47 -153 -19 -197 -45 55 129 -88 -119 206 35 -27 43 -124 160 -6 -165 -193 89 125
4454 125 -259 41 -137 6 -181 -179 -204 87 -80 -127 55 43 128 101 -4 -166 -87 -18 77 7 -40 -181 114 -72
4478 -72 -123 83 205 -81 15 247 -30 -75 -186 131 -95 114 -159 -183 -21 -97 -30 72 15 54 197 190 -52 -164
4502a64J73p2j40j51K26J79k33K94j95J41j84j61K84M9J67J4j44M1k84J34j82
4523b08K95k82N1n6J11k09K88j99N6N8mJ37On9J53k23K7K02l42J93O7p5K15k74
4547g2O5N6o6M9J53r6j84J60j78L95m04J80j26J61q1k15P5K62R5j50lO0p0J60
4571B26l02K76k65J94j56k1j22q3L13j06K4L47l9K5m17k18J42P7J79k78J33j01
4593a72J61l49M28k97L80j61N1K80m41N3J95j79J87q0Q8q3N4J49k76M0m7L4q0
4616f5J53k63K31l38O16o16M53l65R4L6m9J68M4oj49J32j55m7P3J17o0J9J82m44
4640b39J73J56k36K33k19K54J36j95j81KK69k0j53M7Q2j19J02k14PJ25q5q6J89
4663B8L2m7o9L06m57L48J14l02J61j13L4j9k37K68m5n2j02R9j7MK7j35%K00Q3
$$ plain form
4502 -164 9 -63 -203 -354 -128 51 -182 112 -83 58 -126 -287 -3 46 213 227 83 124 -160 -26 -208
4523 -208 87 -195 -144 -200 -89 -298 -10 -209 -153 -95 -99 38 44 -15 138 -85 -58 144 -198 -5 62 -13 202 -72
4547 -72 -7 49 -17 32 185 89 -95 65 -113 282 -122 58 -68 93 12 -203 -128 134 229 79 76 136 66 226
4571 226 -76 200 -65 129 -27 -48 -170 -253 60 -46 -22 325 286 311 -106 -324 -182 -105 74 -204 -71 -172
4593 -172 -11 -360 68 -229 151 -10 41 321 -120 -67 128 -51 136 56 144 61 115 264 -12 28 -19 15 -65
4616 -65 88 -175 56 -282 334 -282 171 -194 -100 -64 -113 55 99 93 -56 76 -79 -126 -53 64 4 23 205 -239
4640 -239 -66 90 -146 87 -132 122 258 63 -118 -116 153 133 -20 27 109 -10 92 -122 -115 10 -75 -161 28
4663 28 60 13 -56 250 -207 141 255 -47 114 1 35 16 -221 47 2 -50 -152 -53 -70 -66 -39 -174 -174 26 109
4688A09j46K0J60n0j71J8J8L9l2K85j00j71n2k4N2j3O0k22L76m13K92L5j59j01
4712a90k5J09K6M8J70P0j12j69K33k72q4K76l08J88j84K24M3j87K56j76K88q0
4734A44k01k4j42K63J04j81l5J04p7R8P7k86o9J71j92M14k2l81N0J60k02J52K35
4757A60k96J66j01O6L5K9j07K59j76L2n8j02L56j92N7l11J5K33j30k3J10O4j78
4780i2j66M82j45Q3m14J95j5P5K77l18J17j43J99q3j27J98q1j95M6J21r5q0N9
4803a02K18J2q4Q8j64K80m4J15n74K08j15m3M1K21p1o0J30l6J86r1J50m50M4O4
4827g7O7k2J16k62J93o1k7L05l23o5L16j74j01K57n9l05K92j50N9r1J59rm4N2
4851D6M0M0j50J41k43P3J71o5j20R2j34k8J57r8J07Q6j62p0n0J16J78l05l9J46
$$ plain form
4688 109 -37 -17 143 93 -78 -60 -42 -3 -35 250 150 -21 -73 -97 -45 -58 2 -220 156 -257 35 70 -89 -190
4712 -190 -215 -106 -80 -32 138 208 96 -73 160 -112 -196 80 -228 -40 -224 0 43 -144 112 -64 224 144
4734 144 -57 -81 -223 40 144 -37 -72 32 -45 53 130 -156 -225 -54 -246 168 146 -235 -185 -25 -227 -75 160
4757 160 -136 30 -71 -5 30 59 -48 211 35 67 9 -93 263 71 128 -183 -168 65 -65 -88 22 86 -92
4780 -92 -258 224 79 162 -252 -57 -72 3 280 -38 79 -64 135 52 -75 123 42 -153 -107 14 -81 -161 -102
4803 -102 116 128 44 132 -32 248 204 319 -255 -47 -162 -205 -164 57 -14 -74 56 20 206 115 265 -185 -141 -77
4827 -77 -10 -32 84 -178 15 -46 -73 232 -91 -156 160 -14 -115 142 83 -222 70 -80 -21 -112 47 38 -6 46
4851 46 86 126 -24 117 -126 -53 118 53 -67 25 -109 -137 20 -78 29 115 -47 -117 -167 -51 127 -178 -217 -71
4875g1r1M4N5o0r6K09J11k92K83k40K9P1J20n7L7l1O6q1J6j18n5L15Or6j14j7
4901e7K26o1q5P0J33l83J10J66k3o8Q4K9j28J91l6k77j05n8K17j63K90M7J7j72
4925c6J70k91K71q6j42n0J51J2Q1J67k27K17j95P8j93J33j39l6qL25k68K60j32
4948F2j99J96M9lk45J66j15J16O6q8k93M03j56L87k62j81J65q7P6j31k8j04L37
4971A31j47K6j61K43k04L19k05j01j92K08L05l4l05N9pj74L16J64j03j57j13J57
4993B5K0k04Q8j11M1J85mq4J1J58j21J38j9k15k5R4L8j7o1J07j22R1j53L27m92
5018c05J97M2M1k75K54j3Q6J00m82L84j11J78j10L4L9J4l00K59J15k11K27j60
5040CO4k42J27j07L71q3o2m9J61j84O1j34L26j18k02lJ91j10k9N1J08k75K8q1
$$ plain form
4875 -71 -162 -118 -63 -123 -219 -10 101 -191 92 -148 -119 -48 72 15 52 21 87 6 22 -96 -151 164 170 74 -40 -57
4901 -57 169 108 23 93 226 -157 -47 119 96 28 112 141 13 204 168 -109 -214 -272 -55 -218 72 119 136 -36
4925 -36 134 -157 114 28 -114 -164 -13 -1 80 247 20 237 42 120 -73 60 -79 -115 -123 202 -66 194 62
4948 62 -137 59 108 105 -140 26 -89 27 93 5 -288 115 -41 346 84 -97 68 -19 57 -74 -102 -206 131
4971 131 -16 10 -151 92 -112 207 2 -99 -291 -83 222 188 -117 -58 -65 -239 77 241 138 -19 -132 25
4993 25 45 -159 -71 -182 -141 44 40 -44 -33 125 4 142 123 -92 -117 -23 15 -2 -63 44 -78 13 -140 187 -305
5018 -305 -108 -66 -25 -300 -46 -59 27 127 -355 29 -82 96 -14 20 59 73 -227 32 147 -64 163 3
5040 3 67 -175 -48 -155 216 133 71 22 183 -1 60 -74 252 134 -68 -71 120 10 -19 32 140 -135 -107 -188
5064a88K39j1J9J52k66j55Q4J41q7J5j31p9L23L7k78J0L0pK40P9j42J29j36j69
5088a51Q6K6o9J98JJ1K7j43lJ09p4J38k00J55N6j64j4j53j26K58k9J14J21l30
5112a56L21O8p2M0k11p2jkk88O03k15K17k51K1J04j93J92n4o9K65r4j79j00J96
5136G0j83L6j2J43P3j45O3J79j72O8j17R2n4j38K22j16n0N2O5J18o2oO2l47J76
5161A7l10L20K22k07k04K02M7j01J36p5l6k8k52L82k19P8j30J23m4K24l2k1r8
5184fJ76j14j61J05k3m1K16N2k25O8K5o5J30l12K45j6N2j56j81K97J43Ml63J19
5208c1k0n6K8J87k19J45J6p2J9l7j55J54K15k23o5R7j81K94k05K41j2J00j72j99
5232a51K74P7j0j06j6j32K68k53M8j47J14j70J19o8J19J5J88r7q3j17J58k2j29
$$ plain form
5064 -188 51 40 59 211 -55 -210 -126 15 -72 -57 -188 -267 56 93 -185 -175 -145 -152 88 167 25 154 18 -151
5088 -151 -65 -39 -108 90 91 102 129 -14 -17 92 18 156 -44 111 167 3 -11 -164 -290 -32 -61 53 174 -156
5112 -156 165 233 161 201 -10 -82 -83 -85 -373 230 15 232 -19 2 106 -87 105 51 -18 247 153 -26 -126 70
5136 70 -113 -77 -89 54 127 -18 45 224 52 120 3 95 41 -97 125 9 -41 11 76 194 132 126 188 -159 17
5161 17 -293 27 249 42 -162 40 87 -14 122 47 11 -17 -269 113 -106 -28 -158 -35 -79 145 113 92 -6
5184 -6 170 56 -105 0 -23 -64 152 204 -21 47 72 7 137 -175 70 54 106 -50 -231 66 209 213 -150 -31
5208 -31 -51 -107 -79 108 -111 34 50 -22 -3 -40 -195 -41 174 -49 -114 -17 -198 96 -109 132 120 220 48 -151
5232 -151 123 200 190 84 68 -64 204 -49 -1 -148 -34 -204 -85 -153 -34 -19 169 72 -11 -128 30 8 -121
5255a21J46p8J5P8l32L24QQ3k29J77m0j94K22N6k80K13l85K87L1K02j7k29j52
5278b15M26m44L20j3PR1l34L25k88L5J01J38j34k5q9L3N3J10KQ4k40N9L7q3J37
5303I3l6J26l86J04M2o6J32j09Q9J82j98J54j98K86k30J27K1r8j48Q1k0j3J70
5326A05K1l42K54L71m04l8j7j89J61N4q3J30j61k7J65M0J51N1j80j18J05r2J43
5349A00j25j52M7qM9J7j30J9K08O9n3R2k04K80o0j55j52J10N3j35R0r4K99k65
5373a00J43k46J62m4J37j12k14K98j05J33k9k12J34R4j93M6L2N9q7K24L3k83p4
5396b04M45k52r8j19L99k66K00K2n8k54L28j25J4K41l38m7K14j35m1m5nR0m3J71
5420I4l15r1K81p1N3J52j90J91k85K65l7P6k15M1N9k37K01n4L24k30k79K41j18
$$ plain form
5255 -121 25 -53 -38 40 -292 32 40 123 -106 71 31 -163 59 115 -165 48 -337 -50 -19 183 166 -63 -215
5278 -215 211 -233 87 74 81 172 -162 163 -125 -90 11 149 15 -10 -99 -66 -13 97 99 183 -57 2 39 -44 93
5303 93 57 183 -203 -99 -57 -123 9 -100 -11 171 -27 127 -71 215 -15 112 133 35 -113 -32 -52 -65 105
5326 105 126 -216 38 409 5 -33 -50 -239 -78 -24 -107 23 -138 -165 0 40 191 242 62 -56 49 -43 100
5349 100 -25 -177 -130 -138 -89 -72 -202 -183 25 94 41 133 -71 209 149 -6 -158 -48 5 -130 -40 -134 165 -100
5373 -100 43 -203 -41 -85 52 -60 -274 24 -81 52 23 -189 -55 39 -154 -108 -76 -17 -104 120 153 -130 -204
5396 -204 241 -11 -109 -228 171 -95 105 127 69 -185 143 18 32 273 -65 -112 102 -33 -74 -119 -124 -34 -77 94
5420 94 -221 -312 -31 -102 -49 103 -87 104 -181 84 47 123 -92 -51 8 -229 -28 -82 242 12 -267 -26 -144
5443a44K62k9kJ85j66J72j57l55K63j27Q5M4M1m9J04l87L16j35j47K83L5k39J67
5466B0QP8K4k8r2j63M17j83q5N3m2J68k10r3L3J01k7J39J41l17k0J95j28r4OJ5
5492h4J06m9lP1K70k69j14L37J9j52j07k08l6K14k24L01l72M76j61J68K3n35K63
5515f6p2J4J69J3J90k64J76j59J12r7R5j26J57j73k4K11k04j01J28j50Q7P5Q8
5538G9n9m0L11l05J3l5K44j78n4o1k0j74L77j95K15k12K3P5m8j21J61PO7j0Q6
5563A46k15Q4J63k40J64K9j68rk8K24j81n6r5J49K3n4n5J69j16N5J52J03k73K36
5587B07m22L27j12mK2o7j39O2oJ13j23J74j15k17J73M3j36J90N7r7P5R0J13r6
5611A12J31k9j64M0m7k04J70j23J66j29j89L59j86J55j32J63J15j01L15n52k5
$$ plain form
5443 -144 118 89 87 272 106 278 121 -234 29 -98 -13 31 72 23 127 -260 56 -79 -226 57 92 -147 20
5466 20 28 106 130 102 10 -153 264 81 -4 49 7 175 -35 -128 -95 6 -21 118 259 -58 -78 117 -11 -105 -99 -84
5492 -84 22 -27 -30 41 311 42 -72 265 284 132 25 -183 -219 -5 -229 72 -300 176 15 183 206 -329 -66
5515 -66 -138 -124 45 58 248 -16 160 1 113 16 111 -15 142 -31 -55 156 -48 -149 -21 -171 -84 -9 79
5538 79 20 -20 291 -14 -1 -36 208 30 -24 -85 -105 -279 98 -97 118 -94 -71 4 -44 -165 -4 3 70 60 146
5563 146 -69 15 178 -62 102 131 -37 -46 -74 150 -31 -87 -182 -33 -10 -64 -119 50 -66 -11 141 244 -29 207
5587 207 -215 112 0 -4 18 -49 -188 -126 -132 -19 -142 32 -83 -300 -127 -84 -220 -30 27 -70 5 95 208 112
5611 112 243 214 50 90 43 -161 9 -114 52 -77 -266 93 -93 62 -70 93 208 107 422 -130 -155
5632a55K99j34j17N4K7J23k12K01k01K5J41j90j57L33k34K72j6j73q0j59L95k06
5654a64O8L16P9o05K06K2R3R2l00N2K95m4J20k34rJ17k99K71j44J31j01K21o8
5677A15j67J29k92M29r2k33J05j40J8J28J2j45l0J27K66k75J33N5J65m43J84J54
5699B03k13rR6k21Op9K28Q5q4O1p2J36l60J08K35j60J01k33M9J23q7P1M2k85J32
5724a27j3M8l2J12J6k36K79j02O2q2Q6j13J23K3R6j44J41r8J00k11J88j02J24
5747A38k72R9J6J0l2J76J7k45q6q7L50l3l5k85M33l85K12o0j81K02j1N2L52l03
5771D2N3j37PM0M9J83n1k49O3N4N2l4p6N6l03K43J52q3j84J9K06L1j57J43j75
5796e6L0R5k63Pk83J94L60J16k36N6J27o6k38K79k81M23k92J1L1J91k33K99k44
$$ plain form
5632 -155 144 10 -107 -53 -26 97 -115 86 -115 -90 51 -139 -296 37 -197 75 59 -114 -194 -353 42 -164
5654 -164 -96 220 299 -306 -100 -78 15 107 -193 -141 154 110 230 -4 -13 104 -195 76 -68 63 -38 183 115
5677 115 -52 77 -215 214 122 -111 -6 -146 -128 0 12 -133 -163 -36 230 -45 88 143 308 -135 49 203
5699 203 -10 -19 77 -144 -138 -217 11 96 12 73 1 137 -223 -115 120 -40 61 -172 -123 0 -87 -16 26 -259 -127
5724 -127 -140 -92 -124 -12 4 -232 47 -55 7 -75 11 -102 21 44 140 -4 137 39 139 -72 116 14 138
5747 138 -134 -35 -19 -9 -41 135 152 -93 -179 -266 84 51 16 -269 164 -221 -9 -69 -250 -48 -59 -7 345 42
5771 42 95 -42 -35 5 54 237 186 -63 0 54 106 72 -4 52 -251 -8 144 61 -123 -104 102 133 -24 119 -56
5796 -56 -26 69 -194 -187 -470 -276 84 200 -36 20 147 81 -157 122 -159 264 -28 -17 14 205 -28 271 27
5819B7l6K7J27j92P7N8jM9l5j6p8k60M27j58M7q4j4m5K61k04n0J13r1j20L38j96
5845b9k4J0r2J72q0N5K16j12m29O7L38J01k20P3K8n5N3K8k3j33J50k63K27j26
5869f8J72m9RL8k26qJ25q7j9K56j66j11K37k48q8L88l85K45o5j8J03J06k11k10
5893b80J71K39p0o7J25j67M9M2j07R9J86k97J64k38J07K21k62J91j05J31j93O1
5915@j27K2J8L12j23P9j23k1K84l26K2L9M2k22J73r2m1O2p4j0M90m49L12j99p9
5940c1j6p4P0N1J47r8k20Q6J03j51K52j48P9K1j12J49m09K11R3mK24m52L00j87
5964a16K1j9K24Oq9j96K73k13Q6J41l73K00K5m0k4J2K05j52L9n2QK73jk22k55
5989b39M52l17P1m2J97l07Q8k07K30K68k30R2J83k98j00J53j68K27j88R9K41k52
$$ plain form
5819 27 -9 18 145 -47 30 88 87 136 101 85 7 -253 174 16 63 -21 -35 -80 181 -23 -73 40 -51 -171 167 -29
5845 -29 -53 -43 -135 37 -43 12 228 116 -313 -246 92 193 -27 46 74 19 72 100 77 -56 94 -169 58 -68
5869 -68 104 55 64 102 -124 -132 -7 -94 -113 143 -23 -134 103 -145 -233 155 -230 15 -50 -68 35 141 -70 -280
5893 -280 -109 130 60 -7 118 -49 0 42 -65 34 220 -77 87 -151 -44 177 -85 106 1 132 -61 0
5915 0 -127 -105 -87 225 102 181 58 37 321 -5 17 56 98 -124 49 -43 -84 -22 -96 -106 384 -65 247 48 -31
5940 -31 -47 -121 -51 0 147 49 -171 -85 18 -133 119 -29 50 71 -41 108 -301 -90 3 -1 223 -229 71 -116
5964 -116 -95 -114 110 116 27 -169 104 -109 -23 118 -255 -55 -30 -70 -94 -82 123 -29 10 -42 -34 239 238 16 -239
5989 -239 213 -104 -33 -75 122 -185 -97 -304 -74 194 -36 56 239 -59 -159 -6 -174 53 -135 -36 205 -47
6011d7p5J88l8m1M0j54J69pJ75j80J15j84L21l37M3q4j52L63j36L6Q3k11Qk53
6035c58L98j63J87k14J27p2K37L3k77L9K98l33K70l5n21K09L52l66J44J09oj07
6057d9N4k2R2K31l50J58m8J50m87L03k40L23O3j26k47P6L28L3k93O5J4j18P0K21
6081B01j70K2k48K32M0l56L93R7k20m6N2K20l5l91K41p9nJ50j28NK5K6l4lM1M2
6107G2q3K8K90l18j85K61l3j0J13m9n1R8k39N7n2OJ10l21L56N7J20j10j63j87
6131b33P4k4K16j12J52Q2k1k39l0j7K4R4m9q2j48J66P6J90j33n4J11k8j49J37
6155COj40K8J98j98J98K78l31j13O4J06o0mL95k59k55P2J18l08R9L7K6KO6J87
6180B15j60o4pK17j87J8k92K40q6J39j12J3K23j27j72j33K55m6j26K13P4k07M5
$$ plain form
6011 -47 -122 66 28 -13 27 -127 42 35 210 30 145 -39 282 -55 -12 -96 -248 115 -21 15 98 -113 -105 -358
6035 -358 40 -123 64 -150 -23 -95 142 175 -102 -63 235 -98 172 137 -384 -175 177 -189 -45 64 58 -49
6057 -49 5 -17 75 306 -44 114 66 216 -271 32 -208 115 178 52 -195 -119 209 242 -51 14 28 -90 -20 201
6081 201 31 53 -195 37 77 -279 114 211 -9 -55 -3 217 182 -209 32 -47 -52 98 -30 -25 0 26 -8 -11 30 72
6107 72 -11 17 307 -11 -196 65 32 22 135 86 35 133 -106 -49 -101 -95 15 -306 50 107 227 117 -46 -233
6131 -233 -159 -183 33 -79 73 155 134 -105 -135 -152 -128 -34 -83 -165 -313 -147 -71 119 -14 -68 43 15 -134 3
6155 3 9 -131 -103 95 -103 95 373 42 -71 -7 99 39 35 430 171 -84 -12 106 -202 -103 -66 -40 -38 28 215
6180 215 55 -9 -16 201 14 32 -260 -20 -106 33 -79 -66 157 30 -142 -275 -20 -66 -192 21 95 -112 -67
6203f7O1o4L3k5Jl9J47j46k3L81n21L35l3Rk05lJ90K05k47n2j39K30j30M8J47
6228I3j55Q2J85k76k7M5Q0J78k76kp3K79P3l50L23j11j77J77o0o7J83J6p7J40
6252B03j21q7Q8j17n1K40k22K06j21p6l0M1j23R8j22K13k59K28L1r8K65l28q1
6275b23L19m01J28K33N7k0j10L9j40K32o7r6J08L0m9N4j41Q3J40m05J52L7M0n1
6299e1j5L29p8q3j53L8j59K51k02K83L7k24j44j2L9l0M8P5L16l35J43k02K11m8
6323C4pk33L07K91m40M50j06j83j88R3k14L06j50J24K4k42J37j56K6k22K93R6
6345D0j91L95j03r0n5J33r7rp2r2J15J39j62R9j08MN2k37N22l28m6J01o1J30j21
6370d2%qJ33K51k58j90K51j61J44l18J88N6J35l35L77m99L7M73l11K01J5j15j98
$$ plain form
6203 -67 -6 -70 -37 -62 -61 -100 47 -99 -122 259 -262 73 40 49 -156 -159 31 236 -11 -63 -202 28 -102 -54 93
6228 93 -62 20 205 -71 -98 -53 27 205 -71 -73 -146 133 206 -144 179 68 -109 68 8 -59 124 140 63 203
6252 203 82 -5 83 -34 -85 155 -67 139 18 -58 -88 -47 -170 -72 -194 19 -240 -12 19 -79 186 -142 -223
6275 -223 96 -305 -177 56 113 93 -17 22 -118 114 47 -49 59 89 40 94 -47 36 176 -229 -77 -40 0 -51
6299 -51 -66 263 185 102 -51 -13 -172 79 -123 160 197 -27 -171 -183 -144 -174 -126 -51 265 -70 73 -129 82 34
6323 34 27 -206 101 392 -48 402 296 113 -75 18 -196 110 -40 84 108 -134 3 -153 -127 -349 -56 40
6345 40 -151 244 141 51 -4 129 32 23 -49 -141 -26 113 -49 50 -58 -54 -2 -239 283 -45 -91 10 -51 79 -42
6370 -42 -42 -50 83 334 76 -114 137 -24 120 -198 -10 46 181 -154 223 -276 -239 234 -77 124 139 24 -174
6393a74K7K1J18m7k60M31j08j6J54j05j29j30L10l7J22j11k40K61j97l0k3L43
6415A80j32k26m9K08K57m99K08J41j8j30R7k8j1k55K03J55m8r1k51M48p0j56l6
6438a03K71k41k2j4J76ro7j45K74Rj21J21n3J97j86o5M9j90J58n4k6R5L3m9k7
6463A1m6M3m0q9K92k02N9O4k4J25l71N1M7N9km0J66J6k16k0j35M17j01j03m9K9
6489e9j11J14j64J76K10j06J31pq3k31K45l35J58J13k27L14j81J36J92k70r3J52
6511G4J68k88J6o3K6R7k16K16q5J74k44R1J2j46J25R1K6K0n2j97K76j41K0M4J62
6536B06k66O1L05l06J08O0p5k19L41n78M85l15K36j15j39J49l8K2K34k91j53K72
6558a6K48l37o5J53o7J5J1k4K09l53N08m03J12j61N00j27j78pj50K46j38P6o6
$$ plain form
6393 -174 -147 -126 -8 -55 -315 116 8 -8 146 41 -88 -218 92 55 177 66 -174 87 -110 -140 -163 180
6415 180 48 -178 -227 -19 238 -261 -53 88 70 -60 37 9 -2 -257 -54 101 53 -38 -289 159 89 -67 -103
6438 -103 168 -73 -95 -109 67 58 -9 -154 120 129 8 129 76 273 87 22 71 -119 39 -15 -41 54 87 38 11
6463 11 -35 8 -32 -121 171 -31 28 92 68 193 -178 -127 -80 -21 -23 -63 103 119 -97 -117 -252 165 64 -39 -88 -59
6489 -59 -170 -56 -220 -44 166 60 191 184 101 -130 115 -220 -62 51 -176 138 -43 93 285 15 -78 74
6511 74 242 -46 -30 -93 -67 30 -186 30 -55 119 -125 -34 -22 -168 -43 48 74 94 42 -155 121 -20 0 44 206
6536 206 -60 1 306 0 108 168 93 -126 215 -363 122 -193 43 -72 -211 -62 -100 -78 156 -135 -288 -16
6558 -16 232 -105 -170 -17 -84 -69 -58 -82 127 -226 282 -121 -9 -170 330 203 25 18 -132 114 -24 52 -14
6581a4j01J30K0L1o1j75J26p0m9J62N3J2P4k11L78k54J85l51J90P1o2o3j92K57
6605H6j97N09m08j16J70j09j33L68l13J20%J01m6l28M31j36m0j40K45P7l56P7
6627a38J67O5k86K09k7o9K68k74J50K31l74m5O6j62J26O1q3j63L00m8N1j23N5
6650d3M28m04j19J99O4M9M0k82K11O1k77m2J33j08P1J13l28K76L1J4j83j70K45
6673b1J8q0J87k2j68K30Ro9k41K58k76O3K58k20j74R5L66k05j18K75o1k54J97
6696D7J13q3m4L03l38j75j80K31K27j30M4J87j48L8j98L54l13rK33k17P5j37K17
6719I7O1j87K3J46j25l3Q0O5J11l88j11N8J51o4J12L3J03m49J63J84n0K83j91
6742G2j46Q6J44k29J92o7p8l5kq7K64j62O0P6q8J05j67J54o7j43J93l06K58o4
$$ plain form
6581 -14 -115 15 35 66 5 -170 -44 -114 -163 -1 52 64 138 -73 305 51 236 -115 75 146 84 21 -171 86
6605 86 -111 398 -10 -126 44 -65 -198 170 -143 -23 -23 78 32 -296 135 -1 -41 -181 64 141 -215 -138
6627 -138 29 94 -192 17 -10 -79 189 -85 65 296 -78 -123 -57 -219 -93 -32 -115 -278 22 -26 25 -98 -43
6650 -43 385 -19 -138 61 125 174 214 -68 143 204 -73 -115 18 -90 -19 94 -234 42 73 87 -96 -266 -21
6673 -21 -3 -83 104 82 -86 144 153 84 -157 101 -175 -112 146 -74 -248 -153 213 8 -110 165 104 -150 47
6696 47 160 77 33 336 -2 -177 -357 -126 101 -29 15 202 54 92 -106 248 -65 -74 159 -58 17 -120 97
6719 97 158 -29 -6 140 15 -18 62 127 238 -150 -261 -203 -52 -116 -4 29 132 -317 -154 30 -20 263 72
6742 72 -74 12 156 -73 119 52 -26 -61 -63 -150 114 -48 12 88 0 105 -62 92 25 -118 75 -231 27 -37
6766c7J05r4j19J94O2k3K03k07P0L6l26K23k68L04k24J83Q4j04L8l7P0n9L9l25
6790b12K22m7j30mK27j37p4J80J73j21j55j7j2p9k6K30N3k81M5J64pL7K2k09M64
6815C06k81j3j89K77j23j29K08k15J31J63L5k29J53o0Q9o5k0K3%K0j47L5N8l4
6839gM5L9p5k7L4L3j67k00K46J26k29L76l30L00N0k66l3k8L5l5K05r3k49K28K92
6864B70l78L47k17k8J73j34J15J48l81K13j94j00J24R8q3J28j29P3J16k00p2K60
6886A49L6l40K93k52M0r0NJ48J55L6j30j09n3J1j01L28j74J50j71R6Q1r1J30k66
6910a19P8J55k26L1L06j84j71N4O3j75J39O9O9k71K47O5j25J29j13J55o6l04J62
6933c2r6o7P2J31P6o3q3K1l5J62L1j9m63K24J80j61J2l7K22q2R3j12J04k3j20
$$ plain form
6766 -37 68 -26 -145 49 111 88 291 84 154 190 -136 87 -181 123 -101 82 166 62 100 63 133 74 113 -212
6790 -212 10 -37 -167 -171 56 -81 -155 25 198 77 -78 -95 -107 -186 -212 18 71 -210 -165 -1 -8 29 51 -158 306
6815 306 25 12 -177 100 -23 -152 56 -159 -28 135 170 -59 94 34 123 58 38 61 61 81 -66 -31 27 -7
6839 -7 38 77 2 -25 9 42 -125 -325 -79 47 -182 194 -136 164 214 -52 -85 -113 -78 -113 92 -1 -250 -22 270
6864 270 -108 239 22 -6 167 33 148 296 -85 128 -66 -166 -42 56 -27 101 -28 45 161 -39 -111 149
6886 149 185 -155 138 -114 -74 -164 -159 -11 144 180 50 -59 -112 -101 -202 126 -48 102 -69 27 108 17 147 -119
6910 -119 -41 114 -112 -81 225 41 -130 -76 -13 -188 -49 20 89 -182 65 130 5 134 21 176 110 -194 -32
6933 -32 -128 -195 -123 8 84 21 -62 -41 -76 86 117 98 -365 -141 39 -122 -110 -147 75 -7 86 -26 78 55 -65
6958f5j41m8K72k2j26Q9R6Q5j72J27J45l12l8J50j88K02k82J80J01o9Q9j68J76
6981H1J23l01Q2J41l06K46L0k09J95J17l66K39q9o3kK65k27j1Q9k06j5L22l7k97
7005a99N3n5J58o4L12M2l94L24R3k46Q7K09m89K68M2k55J93l67K81r8J90k17K18
7028H6j4j28j0J31j72L37l0k23O7q9K44k72R2k91L81r9k40L75j19R6q6k28Q9K1
7052h2L16m76K59l5O6j69M62l91k2M8J07k06K10rJ6j34r7R3J59K0j31R3jj69Q4
7077A1P3J8l2Qj35Q2j18J54o6j2J58j4k27K83l11p4J76j28J60l0j92J35O5p0R9
7102A3Q0P4k77RJ13J43k03j36L27k99K51k63j79M77j66j30j1K42q9J14k8k12O7
7125h3k7J28K30l97J30L7kJ4l9J57k02K0J06k8k93L04j28j26K30k9K32r7o6m2
$$ plain form
6958 -65 -206 -254 18 -4 -130 -41 55 140 -32 95 240 -72 -110 40 -148 54 -228 -48 53 -16 73 -95 81
6981 81 204 -97 -15 126 -180 66 96 -113 82 199 -167 72 -17 -80 -82 183 -44 -55 34 -172 -187 135 98 -199
7005 -199 -146 -201 -43 -107 205 247 -147 177 270 24 111 320 -169 99 141 -114 79 -288 -7 -105 85 -132 86
7028 86 72 -56 -66 65 -107 230 200 -23 44 -45 199 -73 19 -272 109 10 -230 145 26 122 36 -192 -103 -82
7052 -82 234 -242 17 -18 48 -121 341 -50 -72 -24 83 -123 87 78 94 -40 -137 -44 115 135 4 97 96 -73 11
7077 11 84 102 70 78 -57 25 -93 61 -5 -17 141 127 -100 183 -128 -202 -26 -154 6 -24 -216 -81 -16 -86 13
7102 13 93 167 -110 -101 12 155 -48 -184 143 -156 95 -168 -347 130 -36 -166 -177 65 -24 90 62 -150 -83
7125 -83 -110 18 248 -149 -19 18 16 30 -9 148 -54 -34 72 44 -249 55 -73 -199 31 2 234 137 71 29
7149B9p9K75j5l30K93n9Qk03q6M7N53p43M46k92J37j13O3K63j50m2K56l46J60
7172G2j92m4K54j3j73K0j17J91j04K3j44M34j16k70J80J59k64J79j57k0Q2J02
7194H2O9l4O8j55l7N3j87k9K2K16J2J9j44n2P9J62j30J13l1j01L28k50P1K8k1
7219A51p8k10n6J96j85K23P7j62o1L5J51J1j54K79q3j47R1k44K82k77K00j23r4
7242a78L2K87l00K1L26m03N83l62J19l6Ok18L00l08l7R2r0K07K24k15k33J18j2
7265g7L57l2o51J99R6K07m27L58k06M01l09jR4j16j05Q1K29r2K7j23R0l9j04K29
7289H6Ok69J27J22QL5P5k46J40j55J64J9j38J69N6k18J73p9j99K73j88j39J58
7312b0k28J98Jj53J63Q0J04rj73J05j38K8M8j91K87k07K35L5k22K70p4k35K90
$$ plain form
7149 29 -50 225 210 -120 173 114 122 -81 -167 -120 433 -310 136 -156 -19 -132 -69 194 44 2 258 -88 72
7172 72 -120 -164 90 77 -96 -76 -193 -2 -106 -83 -227 207 91 -179 1 160 -104 75 -82 -102 -20 82
7194 82 151 117 185 30 -7 46 -141 -170 -148 68 80 99 -45 -97 -18 144 14 127 96 -5 323 73 144 172 151
7219 151 73 -137 -193 3 -182 41 118 -44 -105 -70 81 92 -62 217 134 -13 78 -166 116 -161 39 -84 -178
7242 -178 -146 141 -159 -138 188 -215 368 6 125 89 95 -123 177 -131 -168 -76 -166 41 265 50 -183 -65 -77
7265 -77 280 248 -403 -204 -108 99 -328 30 -176 225 -84 -85 9 -107 -212 -131 98 6 33 -90 0 -39 -143 86
7289 86 92 -177 -50 72 80 115 190 -56 84 -71 93 112 -26 143 199 -19 154 75 -124 149 -39 -178 -20
7312 -20 -248 -50 -49 -202 -39 41 145 136 -37 68 -70 -42 6 -185 102 -105 130 165 -57 213 139 -96 194
7335A94k06L4j06J88l08J48O7J61J27k36L4N0k30R9J35j21J57j57QJ09r4p0j37
7358a54J76l50M78k4k71K73j62j54J70n3j7M9L70j2m70L53l95K71J2k00N1o0K1
7381i8K17k26M6k38M45k39m2Q0j41K90p5L5l7p5K8l3m3J46j48%J55n22O27j81
7405b9l1O5n2J7m7l5k75L74l8j10N5J0M0j63L27q1K80l36J51l89K84o7N4K35m50
7430b11L03j21j68m4K30L9k6J09k1k45K3M0j02O8N2J42k79K07K84k68L54l29N1
7453H8k94J91m7J56l31J49l9k19K24l3L33k69n4J48J59m34P9K59j54M3K11k71
7475a05K6P7p9O3O9K7K01j54J46n09M87O0l82K55m63M40k65R4K76n52L90l1k15
7498a44J85p6q4j59J92Q1j38J66q5J46K7k39N1L93j78k23K99p1p6m9j31J3K8j09
$$ plain form
7335 194 -12 22 -84 104 -204 -56 11 172 299 63 97 147 -83 16 151 30 187 30 38 147 53 -17 -154
7358 -154 22 -328 150 126 -145 128 -34 -188 -18 -71 -88 -39 331 319 -151 202 -193 78 90 -110 -59 -119 -98
7381 -98 119 -107 -61 -299 146 -93 -135 -55 -196 94 19 54 17 -58 -30 -63 -106 40 -108 -108 47 -475 152 -29
7405 -29 -60 5 -47 -30 -77 -112 -387 -13 -51 -161 -106 -96 -56 -219 108 27 307 -29 122 -267 17 -50 4 239 -211
7430 -211 92 -29 -197 -241 -11 28 2 111 90 -155 -132 -92 -194 -126 -74 68 -211 -4 280 12 366 37 88
7453 88 -206 -15 -62 94 -237 -88 -127 -346 -122 -155 178 -91 -145 3 162 -272 -193 66 -88 -45 166 -105
7475 -105 -79 -2 -81 -18 51 78 279 125 271 -238 249 309 -73 182 -281 159 -106 -12 264 -288 102 71 -144
7498 -144 41 -35 -119 -278 -86 -5 -143 23 -62 84 111 -128 -77 316 138 -85 214 143 67 18 -113 -100 -72 -181
7522a81J15K2n9j85L67j90qL53m47J43l6L9J5J62K4l7rj51L38k95j79P6J34Q9
7546A00k59M35k63j85L05L2j81n0k2K88l08O7J3K21n91L88l7L6K1j60m0J69J84
7569A63p3J9k94K55k64J22L5k1k6J74q8j05N7J82j53J35m6j02Ko8R9o1J59q2j01
7594h2P1k29L74j32M7j2Q2j21K21k72L2j36K62J54j58n7j01m7JQ7q4J8q6M68k63
7619C7j31J5K41qk19l59K77j9L59k39J17r6J01r2L61l13J77Jm48K61q3J39P1q1
7643F9k12j30M33l68j14J73J04J21j51P1J75k04jK68k07M6k56J85j30K62k23J75
7665H6O9j20N7R2k91J08R7q4J1q8n1J76j96J47Po1j27L81l32L1M3J74j07j71K24
7690G5k49J46l63M06K6k18J53O0R2j03L30k38j04L6pJ06j13l27L23q6J65n0m3
$$ plain form
7522 -181 -66 -44 -103 -288 79 -111 -119 234 -213 -70 -106 -67 -52 110 134 97 88 -63 275 -20 -199 -123 11 100
7546 100 -159 276 13 -172 133 165 -16 -66 -88 200 -108 -41 -28 193 -398 -10 -47 -11 10 -150 -190 -21 163
7569 163 90 109 -185 70 -194 -72 -37 -58 -84 90 2 -103 -46 136 -17 118 72 -30 -28 -96 3 -58 101 19 -82
7594 -82 -11 -240 134 2 49 37 119 -2 219 -53 -21 -157 105 259 101 44 -57 -104 -103 -16 -100 -82 -168 300 37
7619 37 -94 -79 162 154 -65 -424 -147 -166 193 -46 71 -25 76 -16 345 32 209 210 -238 23 -60 79 150 69
7643 69 -143 -273 160 -208 -322 -149 -45 76 -75 -4 171 -33 -34 234 27 73 -183 2 -128 134 -89 86
7665 86 155 35 92 184 -107 1 98 14 25 -63 -114 62 -134 13 20 -41 -168 213 -119 -88 -45 129 22 -149 75
7690 75 -174 -28 -391 15 41 -177 -24 36 128 25 355 117 13 49 42 148 35 -292 31 -55 110 60 17
7713A7J87n98L93j1JK13j34o0oj37O6jJ90j69M5l3j05J88o0kP9n4N3q4j36J53
7739ejn9M0m7j18K97m3k35K48J9K03m64K67k03M8J55k05O0J23j32J71k00M3K15
7763A77j74J21j6l2p3n8L23l46J06k1k6K43k34j16k4L87l24J23k22L0J06N4j39
7786a35L44K6l41L31l66K42j86N5rk9j02qJ52M3L69n01QL05l15K0P0r5K6J43l78
7811c31K22K2m7N4R3J62o9k46J79O1k17K67k13L18l35J13j42K40Pj62k63L08j63
7834a42n4N7O4k5K42k53j32J97j37K29O4k1J34k45j49J88N5j14K10l48o3M0L96
7857A93J5j25k86P6J81j01K33j89j49K4J93k09k7Q6K66j59K73l04Q7m9n1L92m61
7880i1K09k67K19K41k37J76l13J16k29K07k27L31j06J0m40L40k9R5q5L5K24l47
$$ plain form
7713 17 204 -394 -1 -12 -11 202 68 8 2 -135 -69 -70 120 -49 -4 -37 -142 46 -14 -16 63 9 62 -22 -158 -5
7739 -5 -6 -65 -25 -72 -190 107 64 -171 77 96 299 -165 102 -101 -53 102 -103 -43 80 -52 119 -81 -38 177
7763 177 3 124 108 76 3 -55 268 -78 28 7 -19 224 -10 -126 -150 237 -87 36 -186 -156 -50 4 -135
7786 -135 209 235 -106 225 -141 101 -85 -30 -39 -68 -170 -178 -26 17 386 -115 -107 198 -117 -97 -27 -122 -96 47 -331
7811 -331 -109 -87 -134 -80 13 175 106 -140 39 100 -117 150 -63 255 -80 33 -109 131 138 -24 -287 21 -142
7834 -142 -196 -139 -75 -100 142 -111 -243 -46 -183 46 110 89 223 -22 -171 17 72 -42 168 -180 -243 -203 193
7857 193 208 83 -203 -127 54 -47 186 -3 -152 -128 65 -144 -171 -85 181 22 295 -9 78 29 -22 370 -91
7880 -91 118 -149 70 311 74 250 -63 53 -176 31 -196 135 29 39 -401 -61 -90 5 -80 -45 179 -168
7902a68K80j78pk19K95J37K16m86K89l84J6K93j13K57k06jk5O3j06N9n7oj1L30
7926B68m12J1K24k09J08j24R3j52J34p9J69nk2J08p2l8j12K6M48l55L5r4Rj01
7950a42K42r4R8N3k05J48j02J04m8r7o2L4J57J0j33j6R0j15j1m5N8P8O8Rk11J12
7976b0K0n5j0J79NJ07m08L58r9k81R7J89n5m7rJ35j40j35J02J9K9O7n5k18J14
8001a11M02l88Q2R2M11l63j25kJ32j09J27l81K92k72K48n5R0j89O8J56Ol1k6j17
8025f3o3J11p9m7K05k51K58Q9q0K7l9j76J65Nk63J62k80L21p4Kl1j35J46J15Q6
8050A11p8j47K13j95m1j7M5J18J01j62m3k08K10K37k48L76l01K38o3k90OK3j25
8073b40J98J13K5l39M02j35m4j27L20k90M21k33j11L18l17P1j82J27Lk54K79J70
$$ plain form
7902 -168 112 -66 -73 -292 3 140 356 -130 159 -225 -209 84 -29 228 22 21 -4 59 -47 12 -45 -51 -62 268
7926 268 -144 -133 91 -118 -10 -134 -41 -193 -59 -138 31 26 4 112 40 2 -110 -84 364 9 44 -50 -41 -142
7950 -142 100 6 104 157 -48 100 -2 102 54 -43 -105 -71 86 96 -37 -53 37 -78 -89 -134 -76 2 70 79 -132 -20
7976 -20 0 -55 -65 114 119 226 -182 176 77 -204 -107 82 27 -20 -29 106 -34 -169 -67 -48 -19 48 -7 -225 -111
8001 -111 291 -97 -15 77 488 125 0 -2 130 21 148 -233 59 -213 35 -20 70 -119 -51 105 111 80 54 -63
8025 -63 -126 -15 -94 -141 64 -187 71 160 80 107 68 -108 57 62 -201 -39 -319 2 -72 -70 -101 -236 -90 25 111
8050 111 33 -114 99 -96 -137 -154 -109 9 110 -52 -95 -303 -93 144 -104 272 -29 209 146 -144 -138 -115 -240
8073 -240 -42 71 96 -243 159 24 -20 -147 173 -117 304 71 -40 278 -39 32 -150 -23 -20 -274 5 175
8095A75m7m4l25K68L9M5k25L97m61M16j50N0j22M2l28J75L39k55r3m0J21j8L7
8118do4K12lq9J1j05k5M6J57j06J10j67J85q4j04O2Q1j54N8L4Kj62J19k19J90
8143a9K38k85J14m4j63p4L79j62L92l86J67jJ4j69j32Q6j92M41k82p7J21R2m3
8166A5ok38N1K52J48j21l28M50k59K77j10k39O4J68m72M83j65m5K00J10j62j03
8188c0J07j31L9
$$ plain form
8095 175 128 84 -241 27 66 111 -114 283 -178 238 88 138 16 58 -270 -95 244 -11 -104 -144 -23 -41 -4
8118 -4 -68 144 141 52 63 -42 -67 -21 136 30 140 -27 158 74 -30 32 113 -41 17 51 53 -109 10 -209 -19
8143 -19 219 -66 48 4 -159 -233 146 -16 376 -10 157 156 170 1 -131 -45 -237 204 -78 -155 -34 58 15
8166 15 9 -229 -178 74 222 101 -227 223 -36 241 131 -108 -44 124 -348 135 -30 -75 125 235 73 -30
8188 -30 77 -54 -15
8191a5
$$ Imaginary data points
##PAGE= N=2
##DATA TABLE= (X++(I..I)), XYDATA
0@%%%%%%%%%%%%%qJ6j6J6j6K4l2M0m8N6o4P2q8J04j20J36j53J77k04K29k60K97
35A58l35L76m22M72n26N86o53P26q04Q90r84J087j199J320j454J602j765J944
53A019k144K369k621K905l229L605m045M568n202N991p004Q355j0261J3173j8217
68a0738K9364r9536N2404J36749j60047P472J16157m7453r4046R4446K3681p7882
80b9429K3877N8192o1356k2721N2444r412m3307K8602J8648k0709j0142K0200
92D887k273j5877Q564J1797r294p046J8554J1020l4277J458L9757j5862l4040
105b2632L3316J7056m8591K137M3354k7961k7183M4883L981n5184K4498M4014
117C1688l8701j2627M0261r471l2786K4483J8787l0180M463K4298k3070j4806
$$ plain form
0 0 0 0 0 0 0 0 0 0 0 0 0 0 0 -8 8 -8 8 -8 16 -16 24 -24 32 -32 40 -48 56 -64 72 -81 96 -108 121 -139 158
35 158 -177 199 -223 249 -277 309 -344 382 -422 468 -516 571 -628 692 -762 840 -925 1019
53 1019 -1125 1244 -1377 1528 -1701 1904 -2141 2427 -2775 3216 -3788 4567 -5694 7479 -10738
68 -10738 18626 -80910 -28506 108243 -51804 -44332 71825 24372 -69674 24772 48453 -29429
80 -29429 -5552 52640 -8716 -31437 21007 11595 -31712 -3110 15538 -5171 -15313 4887
92 4887 2614 -13263 -4699 7098 -2196 -9242 9312 20332 -13945 -12487 27270 11408 -22632
105 -22632 10684 27740 -20851 -18714 24640 -3321 -30504 14379 18360 -36824 -12326 31688
117 31688 -7013 -19640 20621 11150 -21636 2847 21634 -8546 -4083 20215 -2855 -17661
129a7661K5292K470k3023J0528J6649j6306j1597J2937M257j4650N145J4696q660
142G7p849J3914P190k1406k38K6686q894k0720J4680R345k4750k584K4737r275
156I13j3200K0207J892k5948Q666K2064j9034q390K3222j885j8687Q448J1890
169A0158j4110n89J5962q941j0755J3233O287j6456k074J4151n910j2026P836
182c234R068r446n103J1839j979r193R600Q801j3032l379J9153n382j6678J1109
196B144R266j6256l592J6339o367j2084J3231J291j6586N555J5746j1022p451
209i786J7249m64j5078O444J1179q179l752J0439l511r403O660M536j0563l170
223g399J0930k460j0239N353P456n598n241R073J841p450N664N995q346l268J1018
$$ plain form
129 -17661 7631 10101 -12922 -2394 14255 -2051 -13648 -711 3546 -11104 -5959 8737 77
142 77 -7772 6142 13332 -8074 -8312 18374 9480 -11240 3440 12785 -11965 -14549 10188 913
156 913 -12287 7920 9812 -16136 -7470 14594 -4440 -12830 10392 8507 -10180 -1732 10158
169 10158 -3952 -4541 11421 2480 -8275 4958 11245 -5211 -7285 6866 956 -11070 -3234
182 -3234 5834 -3612 -8715 3124 1145 -8048 1552 10353 -2679 -6058 13095 7713 -8965 2144
196 2144 11410 -4846 -8438 7901 1534 -10550 2681 3972 -12614 -7059 8687 -2335 -9786
209 -9786 7463 6999 -8079 -1635 9544 1365 -2387 8052 4541 -4862 1798 6334 -4229 -7399
223 -7399 3531 1071 -9168 -3815 3641 -1957 -7198 1875 3716 -3734 1930 7925 -421 -3689 7329
238G329k013j1987P961Q162j1465n548J0923j714j0307P676M609r570P80J0386
252E222n410q613J1608N111j1993K066R731l725o396N819J501q436K442O683p366
267a756n756R128J16j0412M559Q578n103n503P099L091p610M428O867p067k327
282a668P592j753r471N588O886r230m604Q796n15q159M707M903o620o03P080k063
298H66o317O983N186q881M16Q528l011o656L650M134o856q58O762l710o027N809
314A8J665q202K046R058m002o302N836M288o820J326P577m889l239N971q04p583
330d056L062Q040o927n535P183m4p668K412N533l642k193N581M4n656M467N148
346E749o892j358P820j379o343K295M758m856l033N865j527o072L852K438o162
$$ plain form
238 7329 5316 -6671 1290 9452 -2013 -7561 3362 1648 -8659 -983 3626 -5944 -5164 5222
252 5222 -188 -8801 2807 7918 -4075 -2009 7722 3997 -2399 3420 4921 -3515 -1073 5610 -1756
267 -1756 -7512 1616 1732 -8680 -4121 4457 -646 -6149 950 4041 -3569 859 7726 659 -1668
282 -1668 5924 4171 -5300 288 7174 -2056 -6660 2136 1621 -6538 -1831 3072 -3548 -4151 2929 866
298 866 -5451 1532 6718 -2163 -1747 6781 3770 -2886 764 4898 -1958 -2816 3946 236 -5791 18
314 18 1683 -6519 -4473 4585 583 -5719 117 4405 -2415 -1089 6488 1599 -1640 4331 3527 -4056
330 -4056 -994 7046 119 -5416 1767 1723 -5945 -3533 2000 -1642 -3835 1746 1790 -3866 601 5749
346 5749 -1143 -2501 5319 3940 -2403 -108 4650 -206 -3239 2626 1099 -4973 -1121 1317 -4845
361d845L03P811j613o270M211M423n918m99P524k042m696M961N43o489J099P072
377E575n022n834O124Q94p045J246N925k871l139N306J058n462K469N383m580
392B7j640O639o33o224J434M210l632l720N053k66n162K249K507m798o48O488
408A884p71n075M104M380m634j891O076N90n365J902K464m889j223N496j980o316
424e248M805K821o351q11N856o85m821L932L857n188J027N790l572l711O174P99
440D674o607R68M919l825m105M478P25n568J752L454l748p99N645O3m978K887
456f5L916m046j127M679J20m000R66J714l049j002L484j041l168J918J733l382
472b350j717L627P87k245J389L423k717j441M033o97l312L019K737m851j279N059
$$ plain form
361 -4845 -4542 3269 1656 -4614 -403 4020 -1898 -2397 5127 3085 -1611 3350 3893 -2596 -1497 5575
377 5575 553 -5281 843 1737 -5308 -4062 1863 -1008 -4147 1159 2217 -3245 -776 4607 27
392 27 -1613 5026 4393 -1831 -397 3813 181 -3539 1514 1248 -3914 -1665 842 -3956 -4604 1884
408 1884 1113 -3962 142 4522 -112 -2003 4073 4663 -702 1200 3664 -1225 -2448 3048 1068 -5248
424 -5248 -443 2378 -3973 -4784 1072 387 -4434 -502 3355 -1833 -806 4984 1412 -2299 3875 4674
440 4674 -1933 -965 3954 129 -3976 502 1227 -4341 -2589 865 -2883 -3682 1963 2026 -2952 -65
456 -65 3851 -195 -1322 3357 3477 -523 443 2157 -892 -1894 1590 549 -2619 -701 1032 -2350
472 -2350 -4067 -440 347 -1898 -509 2914 197 -1244 2789 2092 -1220 1799 4536 -315 -1594 3465
488C465k654n496L473L676n154o21N202k344m439N330K015n759K272O161l897
503A230m350N912J509n905R37M793m015k094M301j912m624K797K517m526J48M804
519A522j079l136K381K156k416N46K419l66j369J228P51k880j564K735K65l331
535b138L16L075j171l785K141K098l388Q12M352j855k086L888M95m373J820M334
551D535l595j975M029j684m736K886J442m243J962L804m508j851N476j305m849
566d612M213M257m082J5M590k141l978K957J551m161J028L337k531k695J418J93
582f41j621O8J583Q55j342M38J150j001LJ888N35j440Q66K094k397k983K987L79
600A421l565J419K642l335j891L898j407l940M387K841m615M12N344k076l595
$$ plain form
488 3465 811 -4685 -1212 2464 -2690 -3311 1891 -453 -4892 438 2453 -3306 -1034 5127 1230
503 1230 -3120 2792 4301 -1604 -667 4126 111 -1983 2318 406 -4218 -1421 1096 -3430 -3282 1522
519 1522 443 -2693 -312 1844 -572 -26 2393 2027 658 1886 2637 -243 -1807 928 1193 -2138
535 -2138 -1822 1253 82 -3703 -1562 536 -2852 -2040 2312 457 -1629 2259 2754 -1619 201 4535
551 4535 940 -1035 2994 1310 -3426 -540 902 -3341 -1379 2425 -2083 -3934 1542 237 -4612
566 -4612 -399 3858 -224 -209 4381 2240 -1738 1219 2770 -1391 -363 2974 443 -2252 -834 -641
582 -641 -2262 -2194 -611 244 -1098 -660 490 -511 -508 1380 1915 475 1341 3435 1038 -1945 1042 1421
600 1421 -2144 -725 1917 -1418 -3309 589 -818 -4758 -371 2470 -2145 -1733 3611 1535 -2060
615b060L182K353l619P01L179k836k517K628l72l608R62K541j286j403J922N77
631C44k226N23K193j182N95K542m59k747J045J935k231j355L132p59l174J006
647h18J374l187m27L142q29j515K649J314l378K77L321r87j187K148R10j867n82
664C58J230j854j088J543R3j395j18J313j057k043J564K132j584j65K924l68k547
681a062K033J559k841L73L144k019k766K991K80m580P91L104k439j253L594r48
697c9l127K888J862l173O63L922j440k104K224O44k813L50J600j317p68J348m14
714C06j951J87J058o72n92R25J586j028j006J465N80j313P55J936j261j004J996
731A967o07k861J546J487k712o54L049j726k706K605O83k614J680K981k385p41
$$ plain form
615 -2060 1122 3475 -144 557 3736 900 -1617 1011 639 -2969 -2007 534 -752 -2155 -233 344
631 344 -1882 -1359 834 -348 247 2789 2330 -417 628 2563 332 -1023 2109 1350 -1824 -818
647 -818 556 -2631 -3058 84 -745 -2260 389 1703 -1675 -1398 1923 936 -251 1897 2807 940 358
664 358 1588 -266 -1354 189 282 -1113 -1231 82 -975 -3018 -1454 678 -906 -1071 1853 1485 -1062
681 -1062 971 2530 -311 62 3206 1187 -1579 1412 1692 -2888 -2097 1007 -1432 -2685 909 -39
697 -39 -3166 -278 1584 -1589 -926 2996 1556 -548 1676 2320 -493 -143 1457 140 -628 720 306
714 306 -1645 -1458 -400 -1072 -1664 -739 847 -181 -1187 278 858 -455 300 2236 975 -29 1967
731 1967 1360 -1501 45 1532 -1180 -1834 1215 -511 -3217 -612 71 -2543 -863 2118 -267 -1008
747a008L101k17k851J715K147k207r70J870q81j731O18K83j657K36J683r31q99
764a699J379N56j341K45J710J76o31L03J128j175n66J426r00j318J055J063k604
781a193r38K169n94j973J768J146j908P87K001j160o36K003L16k061J151J683
797B561j792j335J350j27j740P44L58j357m49J485m66j264J200J194r86j45J645
814H76O03j208P80P55q86p32J234k90j821N36N23j625q85K067l05j641J139J541
832F61j586L61J573l94p20J355N48j499r6J303r39j522J193L82j512N8J131j017
850g20p84R95K12j454P79J591r60m21J684P37j365N4J608j232p88J553q56j383
868g50N48P05j536p20J980l89k059J390J534j171l52J653n1p58J182K39j086j15
$$ plain form
747 -1008 2093 1876 -975 740 2887 680 -290 1580 699 -1032 -414 -131 -1788 -1552 131 -800 -1699
764 -1699 -320 236 -1105 -860 850 1026 395 698 1826 651 85 1511 611 -707 348 1411 -1193
781 -1193 -2131 38 -556 -2529 -761 385 -1523 -736 1265 105 -531 1472 1788 -273 878 2561
797 2561 769 -566 784 657 -1083 -339 19 -1338 -1787 -302 -768 -2032 -832 362 -624 -769 876
814 876 1479 271 1051 1806 920 188 1422 1132 -689 -153 370 -1255 -2140 -73 -378 -2019 -880 661
832 661 -925 -564 1009 615 -105 1250 1798 299 203 1506 567 -955 238 620 -892 -834 297 -720
850 -720 -1504 -509 -297 -1751 -972 619 -341 -762 922 1659 294 348 1956 724 -64 1489 633 -750
868 -750 -202 503 -1033 -1753 227 -162 -2221 -831 703 -468 -820 833 782 24 1206 1445 359 244
886B44J247m60j467P13L03j239l55P11m03p64O64O54r42L00J241j73o84J001Q50
905A441j108N7R00k33j196M78L16r27l73J006r11r91J256M50j586J40J840r16
923c57r21J659M28j138O91J306q67n65J521p88j549P44Q75k017j88J342p59j344
941a927J177K81j081J301P89n61l13J478L64j220J12J192q18o75O90k08j007l
959d29Q3m11l04M92J20o35L11Q92M34j185O13J014m81k88R09J24j529Q37O81j662
979d14j89J730j306j685J323P17k226R18J596j301k04J721m52o98J271J043j719
996A25J20J709j052j467J554o77j203O05L40j233K21P88o52l79O30O08l31K06
1014h8J156j85k48K34M6j60j40o0q7l42m65K83o89m98M62P13q28k73J401m37q11
$$ plain form
886 244 1491 1031 -436 277 580 -659 -1014 -303 -706 -1470 -806 -152 -1094 -794 447 274 -410 591 1441
905 1441 333 390 1290 1057 -139 339 655 -272 -645 361 -550 -1541 -285 165 -1421 -1281 559 -357
923 -357 -1278 381 809 -329 362 1668 801 236 1757 969 -580 164 1039 -978 -1166 176 -583 -1927
941 -1927 -750 -469 -1550 -249 540 -21 -334 1144 1508 288 400 1592 774 99 789 581 -426 -429
959 -429 -346 -757 -1061 -569 -449 -1084 -773 119 553 -632 -19 995 514 226 1135 1259 -270 567 1248 -414
979 -414 -603 1127 -179 -1864 -541 176 -2050 -1132 464 -837 -1041 680 228 -470 801 1844 125
996 125 245 1954 902 -565 989 312 -891 -286 54 -1179 -958 -170 -822 -1201 -571 37 -294 -88
1014 -88 1068 883 635 869 915 755 615 555 468 126 -339 -56 -745 -1243 -781 -68 -896 -1169 232 -205 -1016
1035a016J188Q10j424Q34J201p51r96J233K70j958O55J000j401q46J392o75j421
1052a905J144Q95j495Q08J474n30j073J033N59j002L23J431r17l34P51m33j395
1069f66K63M75m84m95N67K08j011N0O88K89k66N85M29J32l37L20m18p7K14L06
1089G72j80l88Q4n12o62K62K59n49N87M76n01l68N35J03n33O55J135l52o95J190
1109A318l10p35l35R26p11p03R14k77j561O47N29j065J99J575j36n74R07J76p44
1128D0P15N36j194N86O75r11j180M66K28n27j2P60p74r7J23j04n3K77M56J05M97
1149F12lJ05j10j52NK23J65m01K17l43p97q8J58q12M19Q30m42o40J105L08j085
1170g26N59R88n62N3J414j007r74M41M22q02k40J390q76r19K56N9j091O38M95
$$ plain form
1035 -1016 172 982 -442 392 1593 842 -154 1079 1349 -609 46 1046 -355 -1201 191 -484 -1905
1052 -1905 -761 134 -1361 -553 921 391 -682 351 910 -92 231 1662 745 411 1162 729 -666
1069 -666 -403 72 -412 -907 -340 -132 -1143 -1093 -405 -116 -382 203 632 764 427 747 329 252 466 772
1089 772 592 204 288 -224 -886 -624 -365 -914 -327 149 -352 -720 -185 -82 -615 40 1175 823 128 1318
1109 1318 1008 273 -62 864 153 -550 364 87 -1474 -827 -298 -1363 -1164 411 275 -299 608 784 40
1128 40 755 1291 97 683 1358 447 -733 -267 -39 -566 -578 182 -592 -689 -566 -670 -723 -446 10 115 612
1149 612 609 714 604 452 457 680 845 444 661 318 -479 -567 -409 -1221 -802 28 -414 -1054 51 359 -726
1170 -726 -167 821 259 312 1726 719 -255 186 608 -194 -434 956 80 -839 -583 -524 -1615 -977 -482
1189d82j25K65R37j42o37P39J75k38L10L16P2j022j78n45j05k80K25N99l30J14
1209c32J87k72j50O26O56o56L21P29k67r36L10P15r53K32Q73o97p99M94n3r81
1229i53M40L41o03M5K45K23l22L52K82o4M32J115j068r5N37n5r88k17P17m01k37
1250b74K23l06p95L97L39k64J47O84M91o26k1N77k38k7L68j07k31K25K30o87o01
1271d96M81l99k14k21P27n67k87M98J86k19R48J71j50p3N65o04m71M14N80r63
1291i4M5O23l40o68p9M39l83j23M80k52j18J04M02l39L3R49oL2J38M14q14L2j20
1314C55l96l27M32m55o34K17K05l48J02N54K12j97M66N33m55K34L08j82m72K25
1334C77K86n32l61M28m18m10N7L3J00l96N01J59m36P51J40j50K5M56n5l40J99
$$ plain form
1189 -482 -607 -342 595 453 -184 555 730 492 802 1118 1190 168 -10 -555 -660 -940 -715 -116 -446 -332
1209 -332 -145 -417 -567 59 715 59 380 1109 842 -94 216 931 -22 210 1083 386 -413 81 28 -953
1229 -953 -513 -172 -775 -730 -485 -262 -584 -232 50 -14 418 1533 465 370 907 852 -136 -353 364 -37 -274
1250 -274 -51 -357 -1152 -755 -416 -680 -533 151 642 16 -5 572 334 307 675 568 337 562 792 105 -496
1271 -496 -15 -414 -628 -849 -122 -689 -976 -478 -292 -511 437 608 458 385 950 346 -125 289 869 -94
1291 -94 -49 574 234 -434 -513 -74 -457 -580 -100 -352 -470 -366 36 -303 -270 679 673 705 843 1257 443 475 355
1314 355 -41 -368 64 -391 -1025 -808 -603 -951 -849 -295 -83 -280 186 719 264 498 806 624 152 377
1334 377 663 131 -230 198 -220 -630 -573 -540 -440 -836 -335 -176 -612 139 279 129 154 610 555 215 414
1355D14L74p17K42K19m15o12Q3L69r87J87R97o24l31N76L46m65M54L17j04j76
1375A47N34k2j93J65M5n81m33N94l64n25K01K18m06k48K57J46K2M69M52k42kN66
1397H00N1o28O3M19m42l83L47m50k57j2J64l84o7M11J27l96O82J06j83K30M69
1418F67l04k90N35j64k38J20L76r29j46O02J8r18J81L05m83J03J35K7ON67J43
1439C13l83M28M19l29l31N22k85o9j74J16l47k16j78R5j53M9O2J73k58M10L98
1460B62k41j00M44M77l57K6M37l69n87N78l24p22O40J27j059l3Q89m57m80P19
1480a30K30m89M07K15J19l31P18l64j88Q1M04n92j05L14n65j72J45K81p38L37
1500d23J66n0p0K94K72j29J51J28J07K0lj13L92n19k24n9Kj42j88M5m68J65J98
$$ plain form
1355 414 788 71 313 532 117 -495 -412 -43 -1030 -843 154 -470 -801 -225 121 -344 110 427 323 147
1375 147 681 659 466 631 676 95 -338 256 -108 -633 -432 -214 -620 -868 -611 -465 -443 26 478 236 234 800
1397 800 851 223 286 705 263 -120 227 -223 -480 -492 -328 -712 -779 -368 -241 -637 45 151 -32 198 667
1418 667 363 73 608 444 206 326 702 -227 -373 229 247 -671 -490 -185 -668 -565 -430 -403 -397 170 313
1439 313 -70 358 777 448 117 639 354 285 111 227 -120 -336 -514 -419 -572 -523 -461 -288 -546 -136 262
1460 262 21 -79 365 842 485 511 948 579 -8 570 246 -476 164 291 -768 -801 88 -369 -849 -130
1480 -130 100 -389 18 233 352 21 739 375 187 268 672 80 -25 289 -276 -448 -303 -22 -760 -423
1500 -423 -257 -307 -377 -83 189 60 211 339 446 466 463 350 742 223 -1 -60 -58 -200 -388 -343 -811 -646 -448
1523d48o9K88R2M57k22L25O9j27jL00m19R6J51k36o00L20l65m07NQ02k37p39O58
1546c07m2k13M50M25j94m33J123l24p43P97k3n00R9N02o40q1k7m25l29N32L48
1567en32J75L47j04J33J84j0K07K87j6l28L82n93L9L4m89M8Oj8k90j22L05k60
1590f20k5O26j35K1O19m8o07M13L45l50p6O63n16j68j72P2n40L00J81n77O2N87
1612E5l25l91N09L46m12L04M36j80j19L23j86n13J25N16p29J03J32l06k99K58
1632c53j38k19N19J90k31L1oL28J1K99N3n1k6K19l25j6m26K7L3o4k95K76j4o36
1656h14K75K62j31kQ42l2m43K56J57j14k48P20P1n60K18j75o19Q0K63m81J17M41
1678H3n39k21M94M8k48J93M67K3O1M46l59k53K93l16r3J4K17j79l17j46l16P7
$$ plain form
1523 -448 -517 -229 -137 320 98 423 492 365 364 664 245 341 492 256 -344 -24 -389 -796 -791 11 -226 -965 -307
1546 -307 -349 -562 -112 313 119 -314 809 485 -258 539 516 16 115 617 -23 -104 -131 -556 -885 -353 -5
1567 -5 -537 -362 -15 -119 14 198 188 395 682 666 338 720 127 166 200 -289 -241 -235 -253 -543 -665 -360 -620
1590 -620 -645 -19 -154 -133 486 438 -169 244 589 239 163 826 310 142 -30 42 -498 -198 -17 -594 -532 55
1612 55 -270 -661 -152 194 -218 86 522 342 223 546 360 -153 -28 488 -241 -138 -6 -312 -611 -353
1632 -353 -491 -710 -191 -1 -232 -201 -207 121 132 431 484 433 407 626 301 285 -141 -114 -81 -145 -440 -164 -178 -814
1656 -814 -539 -277 -408 -410 432 400 -43 213 370 256 8 728 799 239 457 282 -337 -257 6 -475 -358 83
1678 83 -456 -677 -183 -135 -383 -190 277 300 361 807 448 195 488 172 79 93 310 131 -186 -332 -648 -571
1700e71l1K88J22j16J95K09L6l2J46L54l1l24K08l05j57P2k7l72J53J42l23J03
1722b61L17p36r4K36N57J04m30P33j31j06J38J96%k40J30k29m00J93k88q8M3q5
1744d41J87j33J34p9j81L82L78j77L60K28k17p6n6N3J11m56K29k22l83K67k78
1765c70j49K2K33j35J4K03K42r1j6rK57K30j98K48j70k61R2j98l70L82k97L51
1787A0k89Q8j0l57L28Q2l35N97K34j07j21L30J73m98j00M53J41o52K90k01k07
1808a51k82L10k0k45J84j25j61J08K96j51M27K83O1m88K75R2k79J32j57P3k40
1829e8m9k55K00l27j1K39k78J3M96K82k41R0j5K57M6j06J08j40K00l62L3k51J48
1852A9k92j3P9j80l5K02P2l93K0P09l1k39M27o0j79Q6M73j42m58L26k48k10j32
$$ plain form
1700 -571 -602 -314 -192 -308 -113 96 132 100 246 600 569 245 453 148 -9 63 36 -336 -183 -41 -364 -261
1722 -261 56 -680 -774 -538 19 123 -307 426 295 189 327 523 523 283 413 184 -216 -23 -311 -399 -356 -441
1744 -441 -254 -387 -253 -332 -513 -131 247 70 430 658 441 365 309 362 473 17 246 24 -359 -92 -370
1765 -370 -519 -497 -264 -399 -385 -182 60 -31 -47 -56 201 431 233 481 311 50 142 -56 -426 -44 -341 10
1787 10 -279 -191 -201 -558 -230 -148 -483 114 348 241 120 450 623 125 25 478 619 -33 257 56 -151
1808 -151 -433 -123 -143 -388 -204 -329 -490 -382 -86 -237 190 473 534 46 321 413 134 266 109 182 -58
1829 -58 -107 -362 -162 -489 -500 -261 -539 -526 -30 252 11 101 86 343 389 283 391 251 451 89 122 -129 19
1852 19 -273 -286 -207 -387 -422 -220 -148 -541 -521 188 157 -82 345 285 106 192 665 523 65 391 143 -67 -199
1875a99L01p03K63q6K98J31j66R0J90l88K88L17k40l0L29r2k24J70j71M0j13M6
1897E1j17k65PL7L1j9R9L6J53p3L27j71M6K05l8k94M52j92j99R5pk71l48O14n32
1922c73j30L79j2k75R9M15r8k7J84k8n6J88l9R1j81O6J23l82J67n04K68k47J19
1945b53l1j4K0j11N43l63L61p1J42R7L07m05p0J35j25k00K62q2j26j51k26L50
1967a1l94K90oj5j27L10P1n8j56R3L38m77N92k22L7n5j8k22j21K45n65j29L73
1990b27k62K89QL31n60K56M14L1k36L26j5k26L20j27k81j09P7m1j93J06j57l9
2012c15J50K83l29J22j04Q1L15l07J48Q3l7O5J76M8n7l26K29k77k44N45m26m85
2034f62N17j6o0q1K09L5J18M93m50p6J46L20j09l39K90k02k11K34pl08k73L67
$$ plain form
1875 -199 102 -601 -338 -424 -126 5 -161 -71 119 -269 19 336 96 66 395 303 79 249 78 118 5 51
1897 51 -66 -331 -324 -287 -256 -275 -176 -140 13 -60 267 96 142 347 309 15 467 275 76 171 164 -107 -455 159 -373
1922 -373 -503 -124 -136 -411 -312 103 5 -22 162 134 78 266 227 318 137 203 326 -56 111 -393 -125 -372 -253
1945 -253 -284 -298 -278 -389 154 -209 152 81 223 320 627 222 152 287 162 -38 224 142 16 -135 -361 -11
1967 -11 -405 -115 -121 -136 -263 47 118 60 -96 -3 335 -142 450 228 265 210 192 -30 -151 94 -471 -600 -227
1990 -227 -489 -200 -192 139 -421 -165 249 280 44 370 355 129 449 322 41 -68 9 -32 -225 -119 -276 -315
2012 -315 -165 118 -211 -89 -193 -112 203 -104 44 127 90 155 331 379 322 -4 225 -52 -296 249 -177 -662
2034 -662 -145 -161 -221 -302 -93 -58 60 553 103 27 173 493 384 45 335 133 -78 156 149 -159 -432 -65
2056f5r0k46R0J4k15M26L53k66K27k23K38J68K01j86j09O7l36k3J96m30j31J70
2078a70k29M0o6J94pK24J70l18R7M17p6j39L23k13k33K13n1l76K41M7k64l01L65
2101a12r2k41K05R2k25M77M6j12j54M61j56J27Q6l23l6K5K43k77l16KJ77l26P9
2124c50K31O7j77L27p8k78N24j00q7M27j87j21n7K52j61j02k42n5j58J36k1n7
2146b67J48Qj10K24k44P6l8M38k29L19n7N9n0k1J00n10J38N7j21j71K06l3k34
2169c12mL76j05j69N2J76k2n7O9K6L3K71q8j58J01k60J95k50j53J23j58N59m91
2192b46p1nM1J67LJ59k8K17n1J57r3K6N9k24Pk61J90j03k02J94j86J72m36K14
2216c00L03j58R4K51m3q9M21j67j59K99j68R6k65k80K70l7l2j48j41L26l06k71
$$ plain form
2056 -65 -155 -401 -311 -297 -512 -86 267 1 228 5 243 411 612 426 317 384 48 25 221 -209 -340 -170
2078 -170 -399 -359 -425 -231 -238 -14 156 -162 -65 352 276 137 460 247 14 227 176 -200 41 88 -176 -477 -112
2101 -112 -204 -445 -240 -148 -373 104 150 38 -116 345 189 316 402 79 43 68 311 34 -282 -280 -103 -429 -350
2124 -350 -119 -52 -229 98 20 -258 266 166 79 506 319 198 141 393 232 130 -112 -167 -325 -189 -210 -267
2146 -267 -119 -111 -221 3 -241 -165 -203 235 6 325 268 327 277 256 356 -154 -16 41 -80 -251 -45 -78 -312
2169 -312 -316 60 -45 -214 -162 14 -8 -65 4 30 63 334 246 88 189 -71 124 -126 -279 -156 -314 245 -246
2192 -246 -317 -322 -281 -114 -111 48 20 237 186 343 250 276 335 111 118 -143 47 -56 -258 -64 -250 -78 -514 -300
2216 -300 3 -155 -61 190 147 58 479 312 153 452 284 380 115 -165 105 68 36 -112 -253 73 -233 -504
2238e04M03j88K42J65o5J61j08J78J8j69K64k52J30k83j02K0j50K14l73J93J13
2259i3L0k58q9L13O8L56k00O9M79m88l05M11l26L10k7rj13o0k71m0J14m7J84j68
2283a60J01j19O5J6N4J41K02j19J12K68l48j01K02o60J94J83r2j49j03P4kP4Q0
2306h7J71l9J10L9j61K61l98M29j35m8J67j09j53k62K91j36j79Q3j83o6K55P3
2328g7k3k34K04L8O5K62Pr9j4j4j43LK44K10m94k68K82q7k79J64r1Q5K86k34M3
2353a64N09k75p9O8l2R4P1j36J2J1j7l5m0k0nj84J78k75J23k1J78k30M62l38L02
2378A57K0O2l13Q0L98k17k11LR1l17M03m09J56J58l73J94m5K45k72L0K34q9p5
2401i0K35K53l13J19o3O9j93M3M9l57K6L42n48k5K85j56Q0J35j8J29K4J66j08
$$ plain form
2238 -504 -101 -289 -47 118 53 214 106 284 302 133 397 145 275 -8 -110 -90 -240 -26 -399 -206 -93
2259 -93 -63 -321 -410 -97 -29 327 127 196 675 187 -118 293 -33 277 250 241 128 68 -203 -243 -129 -176 8 -160
2283 -160 -59 -178 -113 -97 -43 98 300 181 293 561 213 112 314 -346 -152 31 -61 -210 -313 -239 -241 -167 -87
2306 -87 84 45 155 194 33 294 -104 325 190 142 309 200 47 -215 76 -60 -239 -156 -339 -405 -150 -77
2328 -77 -100 -334 -130 -92 -27 235 242 143 129 115 -28 -25 219 429 -65 -333 -51 -138 -417 -253 -344 -259 27 -207 -164
2353 -164 345 70 -9 59 27 121 192 56 68 79 62 27 -13 -33 -38 -222 -44 -319 -196 -217 -39 -269 193 -145 157
2378 157 177 239 -74 6 404 187 -24 -21 70 -247 156 -253 -97 61 -312 -118 -163 82 -190 -160 74 -15 -90
2401 -90 145 398 85 204 141 210 17 60 109 -248 -222 120 -428 -453 -168 -324 -244 -109 -127 2 26 192 84
2424H4k7J58N2R0k79j07K17om83m2J41J50l0k40J07mJ23J07J08k52R7O9J39j05
2448F7K49j61k82J00j60M7K0J72O4m59K47j6l0K8J10j8j0J09J13M2j0k6j09J46
2472B33k7J09m06J13j96K01j31j25p9K39K3j73j15K81k9J55l5K77m40L45j12R2
2494B00l52J41K64j66J9m42J19J23k9j25Q7KK46j02j25J55J0K98MM0j91J77n15
2517a62K97J07n96M07J0k52p5J94k77R0K39j19K16l04O07l10J49j8M7l0O0P4l96
2540d2J34O6r0J08j71q3K92k4l97J86n5k57L93l02K82Ok3l5J9K21R5o1l49K44
2564A57m8q5j22J76k88j58K82j87J64r0J18Q3K00j07L0J91L3j52p3J21m8j57K5
2587F5j46j91J70M8j63J60K15m76K20k7oq5J10K64J27k37J5J65P9J38n15J79j69
$$ plain form
2424 84 57 215 267 357 78 -29 188 182 -301 -343 -202 -52 -82 -322 -215 -219 -96 11 119 -133 -36 33 172 67
2448 67 316 155 -127 -27 -187 -140 -120 52 116 -343 -96 -112 -142 -114 -4 -22 -32 77 190 232 222 196 87 233
2472 233 206 315 -91 22 -174 27 -104 -229 -308 -69 -46 -219 -334 -53 -82 73 38 315 -125 220 108 200
2494 200 -152 -11 253 87 106 -336 -217 -94 -123 -248 -161 -159 87 -15 -140 15 25 323 327 367 176 353 -162
2517 -162 135 242 -354 53 63 -189 -264 -70 -347 -257 -18 -137 79 -225 382 72 221 203 250 220 280 354 -42
2540 -42 92 158 68 176 5 -78 214 190 -207 -21 -76 -333 60 -242 40 46 23 -12 7 228 323 262 -87 157
2564 157 109 24 -98 78 -210 -368 -86 -273 -109 -199 -81 2 202 95 125 316 349 197 124 245 197 40 65
2587 65 -81 -272 -102 -54 -217 -57 158 -318 -98 -125 -131 -216 -106 158 285 48 63 228 307 445 -70 109 -60
2610f0N8q4J4q7j32j04RL56k85J86K43q3Q7Q0k28K19o9m0j26J15J46l16J36k90
2634b55K98r0j83R3J03j68L1j22K20L7J09p0K52k70K32N4l43L27j77J17k28j8
2656e1J16Q3l92K88Lk83J91K18k55N5K42Nm8J77m75M15j85J25k80n7L64k04l35
2679b83Rm0Q9n8L4J70K4Q3j71j7L64K6P5K2j53oO2q0k58K01j14j33L0j3j1J08
2705d0k67K26j31J20J45j33J47j44K2K08k57O2J56r5j5kO6m40J40J84j08k03J73
2728a86Q2K03l55K43l2j71L56PJ21k09M2N48n08j96O7k3j91j46P0J42j30J50Q6
2751c0p1N7P0m4K1L21j77k40K35J07q7k99K15k92J09J03p8J18n7j23P0K6j07K02
2775D9J26j90R3k24L21L6Mr9q8P3j8M2k20J18j16M6j39J12j08NJ00P3J6j7o5K18
$$ plain form
2610 -60 -2 -86 -72 -159 -291 -395 -386 -30 -315 -129 114 31 118 198 -30 189 120 80 -46 69 215 -101 35 -255
2634 -255 43 -47 -230 -137 -34 -202 -171 -293 -73 -36 73 3 255 -15 217 271 -72 255 78 195 -33 -51
2656 -51 65 148 -244 44 47 -236 -45 173 -82 -27 215 220 172 349 -126 289 104 229 -51 -108 256 52 -283
2679 -283 -274 -314 -225 -283 -249 -79 -55 28 -143 -160 204 230 305 327 174 168 230 150 -108 93 -21 -154 -124 -137 -148 -40
2705 -40 -307 -81 -212 -92 53 -80 67 -77 -55 153 -104 -42 114 19 4 2 68 -372 -232 -48 -156 -359 -186
2728 -186 -104 99 -256 -13 -45 -216 140 147 268 59 101 649 141 -55 12 -11 -202 -348 -278 -136 -266 -116 -30
2751 -30 -101 -44 26 -18 3 324 147 -93 142 249 162 -137 78 -214 -105 -2 -80 38 -19 -142 -72 -46 -153 49
2775 49 175 -15 78 -146 175 211 215 116 28 101 83 125 -95 23 -93 -47 -186 -74 -182 -177 -77 -4 12 -5 -70 148
2801A48j49K53k6k81J80J75k82N6k34k6L38k19J7l32L78j31J43N7j11j35K08K70
2823B97l07R4j91K68r2J69j01k21J3L6J53l83K62r8OP0j79L96m04j03L90j70Q8
2846gL03J96m05Q3l28J54K16m8l13L84j37k30K76k61j20K17r4j8M7j22NK31M4
2869G3Q8j21r3j11J82K73k79J91l51R0r9K69k01K66l37k4L8J85J05k34J36q1L
2892c2N6J14o0J49r2j0J2m54L74j85J33r1K1K9k25J08J27k52L48j7j73K91j95
2915b4j24O6K17R7j14K6j69J24l13j2J54k17J21n9l8K94j62P4q0K26J5J51J48
2938D01m30P0J13lm2l58l6J89k09J64n2J14J9k88J09K45J24k26J69k57j54M53
2960A15Pj86K05k07K53n5j00j76L9N0Q0q3l10P6J81j32j01N82o4k42JK9k3l9K73
$$ plain form
2801 148 -1 252 226 -55 125 300 18 74 -160 -186 152 -67 -50 -382 -4 -135 8 65 -46 -181 27 297
2823 297 -10 84 -107 161 69 238 137 -84 -71 -35 118 -265 -3 -101 -95 -25 -204 192 -212 -315 75 -95 -7
2846 -7 296 492 87 170 -158 -4 212 164 -149 235 98 -132 144 -117 -237 -20 -114 -132 -85 -207 -202 29 73
2869 73 161 40 -53 -164 18 291 12 203 -148 -58 -157 112 -89 177 -160 -184 -146 39 144 -90 46 -35 -32
2892 -32 24 138 78 227 135 125 137 -317 57 -128 5 -86 -65 -36 -261 -153 -26 -278 70 53 -120 171 -24
2915 -24 -148 -82 135 232 118 144 -25 99 -214 -226 -72 -289 -168 -227 -265 29 -133 -59 -139 87 102 253 401
2938 401 -29 41 154 151 109 -249 -285 -96 -305 -141 -193 -79 -60 -348 -239 6 130 -96 73 -184 -338 115
2960 115 122 -64 141 -66 187 132 32 -144 -105 -55 25 -58 -368 -292 -111 -243 -344 238 174 -68 -67 -38 -61 -100 173
2985A73j15M2Q2j06j78pJ43j08q4L1q0R8p6J73q5K66l5j71Q7lJ74Q2j48j6k16
3010g7j42K18J55l01jJ84j97J08k2LN2j04J16n3K5L48l98K31r0J49J51k73R0k14
3034d2j76J28o0P7j49J76rj76K69O8j63R3J52j01J89j21k30J95j94M96j69m56
3056b03L0m9J60j06r0J23J9J0l5j9K9K00L6j81K82k37p0k7J22J95j70p5K16j17
3080D3j29K37l01J37m22J50L11kl17L34K24j02j43P3l4j8J3J80k69J38L3nL4j62
3104Co9Nj85J95k2j57LL85k36j22K38r7J09K5L40l99J09j04n5J63l78R4J26j13
3128a42J40N5p6j69J99q3l3J16M8j76m5L04j33J02r3J20L7nj19J50N0l66p1J80
3152a0l33J77J32k02L04j28%J86j49l0J96j14J30j06J00n2k7k29K32k68O9M3L8
$$ plain form
2985 173 58 100 182 76 -102 -109 34 -74 -158 -127 -207 -109 -185 -12 -97 169 134 -37 50 47 221 303 155 139 -77
3010 -77 -219 -1 154 -147 -148 36 -161 -53 -75 -72 -20 -124 -8 -61 -36 312 -86 145 55 204 355 82 172 -42
3034 -42 -218 -90 -150 -73 -222 -46 -55 -231 38 106 -57 36 188 87 276 155 -75 120 -74 422 253 -203
3056 -203 -173 -222 -62 -168 -258 -135 -116 -106 -141 -160 -131 69 105 -76 206 -31 -101 -128 -6 189 19 -56 160 43
3080 43 -86 151 -150 -13 -435 -285 26 24 -293 41 265 163 20 93 59 41 54 234 -35 103 136 131 165 3
3104 3 -66 -61 -246 -51 -73 -230 -227 158 -78 -200 38 -59 50 75 415 16 125 21 -34 129 -249 -155 -29 -142
3128 -142 -2 53 -23 -192 7 -76 -109 7 55 -121 -166 138 5 107 14 134 171 166 47 197 247 -119 -190 -10
3152 -10 -343 -166 -34 -236 68 -60 -60 126 -23 -53 143 29 159 53 153 101 74 -155 77 -191 -122 -79 -41
3175d1J8k6j27J61K53n27L85J50n8l50K71j89K49k47OO9O7r1m3j6N6j12K24k87
3199b05R0L15j03jj24j67J27P0K23p7k5j75J49K8p1L3r6N5l61L72j19J22k43L91
3223B08j09k34M3mJ11L3O7j56K68Q4j78l41K49o3P6r7j53k37J87j30L21J11m3
3246A3k72M82k15o4M92m20J46pO7l58J03q1J10Q9l63L86l47K85k23Q4j8J62M6
3269I7R0k16J47J27k47P0M2o7J8k18L0K49k52j7J44J53m29J74r6J0L22j70l3P1
3293aK65k12k1P4l86N63k24J18k09j35k19N55k55O3nL3J6l8q2L16j81J70k51j51
3317a97L77j71L19k50M8j35J47n7O7j22l62L82j29r0K06J55m41M28n64J98M06
3338B15j92J80j41J56o3p9l2J9k46L41k98j1M9J61j90Q5j40J01J38m8j73L39J53
$$ plain form
3175 -41 -23 -49 -176 -15 238 -289 96 246 188 -162 109 -80 169 -78 -72 -3 64 -27 -70 -86 -30 -142 82 -205
3199 -205 -115 200 97 96 -28 -195 -68 2 225 148 123 -52 97 125 54 87 -9 46 -315 57 -62 60 -183 208
3223 208 99 -135 -92 -96 15 48 115 -41 227 311 133 -208 41 -22 54 -43 -196 -433 -246 -376 -55 56 13
3246 13 -259 223 8 -56 436 16 162 155 222 -136 -33 -114 -4 85 -278 108 -239 46 -177 -93 -111 51 97
3269 97 187 -29 118 245 -2 68 110 43 61 -157 -127 122 -130 -147 -3 150 -279 -105 -201 -191 131 -39 -72 -1
3293 -1 264 52 31 105 -281 282 58 176 -33 -168 -387 168 -87 -24 -29 4 20 -18 -100 216 35 205 -46 -197
3317 -197 180 9 328 78 126 -9 138 81 148 26 -336 46 -83 -173 33 188 -253 175 -389 -191 215
3338 215 23 203 62 218 155 76 44 63 -183 158 -140 -151 -102 59 -131 -46 -186 -85 53 5 -168 171 324
3361C24k25j54MJ64O3k87L33l69P6p2rJ67k8j35p6J17o9J83j7K39j59q6J36q4
3385C6o5J26l2KK0N0j21j3l4j11r9N2M15j79L5k93L47O5k14q5M2J42m6N0O0j86
3411c6Q4j52Q8j32jK69l68Q0Q9n9L4M8R9j54J52j34j13M54m2l1l0K78l22M7j26
3436B2j98l7K79m25L98j23P2J06k85J22L8J18k13J73N6K28m09L20m31K47L36m07
3458a3j58K01kj30o2L3j6J41qMJ46k66O1L50k26K09l5N9k44j0k03N9J09o8J24
3483E5j34L3O9M7L2k85J61j7n8j7k7M33j59J2j86J75j09L00q8n86M21j05L3n0
3507e0j29K11k30M1J89q3k46K27J44j59L53k70M03l68J33K5r5l20N61l30L7Q8
3529A32p2k30l6K61L3j51j9J01R3k66J97k03K07O6k01J29K02j69j63K48n21N10
$$ plain form
3361 324 99 -55 -51 113 176 -111 222 -147 -71 -143 -152 15 -13 -148 -224 -107 -176 7 -10 229 70 -16 120 36
3385 36 -29 97 65 67 87 137 16 3 -31 -142 -241 -189 226 47 82 -211 136 201 -13 -98 -56 86 40 90 150 -36
3411 -36 48 -104 -16 -148 -149 120 -248 -168 -79 -138 -104 -56 43 -111 41 -93 -206 248 206 175 145 423 101 148 22
3436 22 -176 -213 66 -359 39 -84 -12 94 -191 -69 -31 87 -126 47 103 331 -78 242 -189 58 394 -13
3458 -13 -171 30 28 -102 -164 -131 -147 -6 -14 -10 136 -130 -69 281 55 264 229 288 44 34 -169 -110 -1 -69 55
3483 55 -79 -46 23 70 102 -183 -22 -39 -97 -114 -141 292 133 145 -41 134 25 325 237 -349 72 -33 0 -50
3507 -50 -179 32 -198 -157 32 -51 -297 -70 74 -85 268 -2 401 33 166 191 96 -224 337 7 44 132
3529 132 60 -170 -206 55 88 -63 -82 19 112 -154 43 -160 47 113 -88 41 243 74 -89 159 -362 148
3551A48r1o3R5j21J24J60l85N0o4K45j40Q3k4J09R9m47K75J68l13k02L64Q5m46
3574b91M29j86m1N8m2R8q4n2K66j49J61R7K9J2l39J98k22Q0K42k84m1J13r6k5
3598f9j33K99j18M8R2l88K79m0r1J78r6Q6q0q0Q3r9J9k32L9J11n1K40k79P3KK83
3624G6j48J97k47P4J40k53J36K73j65k01R1K5M9k74M21j50r2j34K92j16k28K33
3646aJ39Q6j53L3j81M64l48P6K08m46M0P3m5MJ08l03K37j24J79j27N4j33J82J86
3670B08j37J06j07j0j0Q4l61M26k10p1L23k42m9r0K33l37P8L60k57J37r9J08M
3693H7k96L57j35K2J77j43R5k14M9j84n5J11J42M2J4n4p5j92J76J49R3k83J95
3716G8j22P0K30k99j1K82k74J42j83%K04k29J37k14J93j86L9Rp5J50j07K51j25
$$ plain form
3551 148 57 -6 89 -32 92 252 -133 -83 -147 98 -42 41 17 126 225 -222 53 221 -92 -294 70 155 -291
3574 -291 138 -48 -89 -31 -73 25 -59 -111 155 6 167 264 293 305 -34 164 -58 22 264 -20 -61 52 -44 -69
3598 -69 -202 97 -21 27 119 -269 10 -30 -121 57 -39 47 -33 -113 -30 -129 -110 -342 -303 -192 -243 -3 -282 -209 -207 76
3624 76 -72 125 -122 -48 92 -161 -25 248 83 -118 -27 -2 47 -227 194 44 -48 -182 110 -6 -234 -1
3646 -1 138 224 71 104 -77 387 39 115 323 -123 -83 -10 -55 -51 57 -246 -9 -133 46 -81 -27 -160 22 208
3670 208 71 177 70 60 50 134 -227 199 -11 -82 241 -1 -50 -140 93 -244 -166 194 -63 74 -25 83 87
3693 87 -209 148 13 35 212 69 164 -50 -1 -185 -240 -129 13 55 69 15 -60 -252 -76 73 166 -117 78
3716 78 -44 26 256 -43 -54 228 -46 96 -87 -87 117 -112 25 -189 4 -182 -143 -134 -209 -59 -166 85 -40
3739d0J19J5m9l4n7K44l18O4j14J71j46J77j22j83M20k57P2J57o1J71k20L8m9
3762bm7L30m58J92mm9R3k4J6J26k49j07J08K28j45O6k63O9L6r9Q9M5R2P5j49L2
3788AL0n4J19L2q8K43q6l52J97j50m8J36n7l7PQ2L4r4J27J16j13q3M1J87k63K5
3814d8q4j7M4L01k12PL5j74K1O7J74r3J83l56J45L53k74R5j71qJ28r1M9j37J09
$$ plain form
3739 -40 79 94 45 11 -46 198 -120 -56 -170 1 -145 32 -90 -273 147 -110 -38 119 58 229 9 47 -2
3762 -2 -49 281 -177 15 11 -38 55 31 47 173 -76 -183 -75 153 8 74 -189 -120 -84 -183 -94 -49 43 118 -31 1
3788 1 31 -23 96 128 40 283 197 -155 42 -108 -156 -20 -77 -114 -107 -25 9 -85 42 158 45 -38 3 190 -73 -48
3814 -48 -132 -149 -105 196 -16 -9 26 -148 -127 -60 114 21 204 -152 -7 346 72 167 -4 -12 116 25 74 -63 46
$$ [...]
8191H5
##END NTUPLES=NMR FID
##END=
