##TITLE=1H_SL31-DAU(B2)
 CDCl3
 8 sc, 
 6.3.2024
##JCAMPDX= 6.0         $$ Bruker NMR JCAMP-DX V2.0
##DATA TYPE= NMR FID
##DATA CLASS= NTUPLES
##ORIGIN= UXNMR, Bruker Analytische Messtechnik GmbH
##OWNER= root
$$ XWIN-NMR		Version 3.5
$$ Wed Mar  6 18:49:43 2024 Russian Standard Time (UT+4h)  she@DPX200
##.OBSERVE FREQUENCY= 200.1313
##.OBSERVE NUCLEUS= ^1H
##.DELAY= (6, 6)
##.ACQUISITION MODE= SIMULTANEOUS
##.ACQUISITION SCHEME= undefined
##.AVERAGES= 8
##.DIGITISER RES= 18
##SPECTROMETER/DATA SYSTEM= spect
##.PULSE SEQUENCE= zg30
##.SOLVENT NAME= CDCl3
##.SHIFT REFERENCE= (INTERNAL, CDCl3, 0, 15.7039)
##AUDIT TRAIL= $$ (NUMBER, WHEN, WHO, WHERE, WHAT)
$$ ##TITLE= Audit trail, XWIN-NMR		Version 3.5
$$ ##JCAMPDX= 5.01
$$ ##ORIGIN= Bruker BioSpin GmbH
$$ ##OWNER= she
$$ F:/spectra/data/she/nmr/H-F/1/audita.txt
$$ ##AUDIT TRAIL=  $$ (NUMBER, WHEN, WHO, WHERE, WHAT)
(   1,<2024-03-06 18:48:41.71 +0400>,<she>,<DPX200>,
      <created by zg, POWCHK disabled, PULCHK disabled
       configuration hash MD5:
       00 E9 B6 7A A2 85 ED C7 34 08 36 98 17 FE 4E 26
       data hash MD5: 16K
       45 4F 2A E3 E0 02 81 A5 ED CA 3D 92 C7 47 37 83>)
$$ ##END=
$$ 
$$ hash MD5
$$ BA 4B 11 03 8D 67 6E 2B C9 2E CF 57 BB 47 CC 44
##$RELAX= 
##$RELAX= 
##$RELAX= 
##$RELAX= 
##$RELAX= 
##$RELAX= 
$$ Bruker specific parameters
$$ --------------------------
##$DU= <F:/spectra>
##$EXPNO= 1
##$NAME= <H-F>
##$PROCNO= 1
##$TYPE= <nmr>
##$USER= <she>
##$AMP= (0..31)
100 100 100 100 100 100 100 100 100 100 100 100 100 100 100 100 100 100 
100 100 100 100 100 100 100 100 100 100 100 100 100 100 
##$AQSEQ= 0
##$AQ_mod= 1
##$AUNM= <au_zg>
##$AUTOPOS= <>
##$BF1= 200.13
##$BF2= 200.13
##$BF3= 200.13
##$BF4= 200.13
##$BF5= 200.13
##$BF6= 200.13
##$BF7= 200.13
##$BF8= 200.13
##$BYTORDA= 1
##$CFDGTYP= 0
##$CFRGTYP= 5
##$CHEMSTR= <none>
##$CNST= (0..31)
1 1 145 1 1 1 1 1 1 1 1 1 1 1 1 1 1 1 1 1 1 1 1 1 1 1 1 1 1 1 1 1 
##$CPDPRG= <>
##$CPDPRG1= <>
##$CPDPRG2= <>
##$CPDPRG3= <>
##$CPDPRG4= <mlev>
##$CPDPRG5= <mlev>
##$CPDPRG6= <mlev>
##$CPDPRG7= <mlev>
##$CPDPRG8= <mlev>
##$CPDPRGB= <>
##$CPDPRGT= <>
##$D= (0..31)
0 1.2 0 0 0 0 0 0 0 0.06 0 0.03 0 0 0 0 0.0002 0 0 0 0 0 0 0 0 0 0 0 0 
0 0 0 
##$DATE= 1709736521
##$DBL= (0..7)
120 120 120 120 120 120 120 120 
##$DBP= (0..7)
150 150 150 150 150 150 150 150 
##$DBP07= 0
##$DBPNAM0= <>
##$DBPNAM1= <>
##$DBPNAM2= <>
##$DBPNAM3= <>
##$DBPNAM4= <>
##$DBPNAM5= <>
##$DBPNAM6= <>
##$DBPNAM7= <>
##$DBPOAL= (0..7)
0.5 0.5 0.5 0.5 0.5 0.5 0.5 0.5 
##$DBPOFFS= (0..7)
0 0 0 0 0 0 0 0 
##$DE= 6
##$DECBNUC= <off>
##$DECIM= 32
##$DECNUC= <off>
##$DECSTAT= 4
##$DIGMOD= 1
##$DIGTYP= 9
##$DL= (0..7)
0 120 120 120 120 120 120 120 
##$DP= (0..7)
150 150 150 150 150 150 150 150 
##$DP07= 0
##$DPNAME0= <>
##$DPNAME1= <>
##$DPNAME2= <>
##$DPNAME3= <>
##$DPNAME4= <>
##$DPNAME5= <>
##$DPNAME6= <>
##$DPNAME7= <>
##$DPOAL= (0..7)
0.5 0.5 0.5 0.5 0.5 0.5 0.5 0.5 
##$DPOFFS= (0..7)
0 0 0 0 0 0 0 0 
##$DQDMODE= 0
##$DR= 18
##$DS= 0
##$DSLIST= <SSSSSSSSSSSSSSS>
$$ [...]
##$SUBNAM2= <"">
##$SUBNAM3= <"">
##$SUBNAM4= <"">
##$SUBNAM5= <"">
##$SUBNAM6= <"">
##$SUBNAM7= <"">
##$SUBNAM8= <"">
##$SUBNAM9= <"">
##$SW= 18.0517328524113
##$SWIBOX= (0..15)
0 0 2 0 0 0 0 0 0 0 0 0 0 0 0 0 
##$SW_h= 3612.71676300578
##$TD= 16384
##$TD0= 1
##$TE= 0
##$TE2= 300
##$TE3= 300
##$TEG= 300
##$TL= (0..7)
0 120 120 120 120 120 120 120 
##$TP= (0..7)
150 150 150 150 150 150 150 150 
##$TP07= 0
##$TPNAME0= <>
##$TPNAME1= <>
##$TPNAME2= <>
##$TPNAME3= <>
##$TPNAME4= <>
##$TPNAME5= <>
##$TPNAME6= <>
##$TPNAME7= <>
##$TPOAL= (0..7)
0.5 0.5 0.5 0.5 0.5 0.5 0.5 0.5 
##$TPOFFS= (0..7)
0 0 0 0 0 0 0 0 
##$TUNHIN= 0
##$TUNHOUT= 0
##$TUNXOUT= 0
##$USERA1= <user>
##$USERA2= <user>
##$USERA3= <user>
##$USERA4= <user>
##$USERA5= <user>
##$V9= 5
##$VALIST= <valist>
##$VCLIST= <CCCCCCCCCCCCCCC>
##$VD= 0
##$VDLIST= <DDDDDDDDDDDDDDD>
##$VPLIST= <PPPPPPPPPPPPPPP>
##$VTLIST= <TTTTTTTTTTTTTTT>
##$WBST= 1024
##$WBSW= 4
##$XGAIN= (0..3)
0 0 0 0 
##$XL= 0
##$YL= 0
##$YMAX_a= 131615
##$YMIN_a= -161218
##$ZGOPTNS= <>
##$ZL1= 120
##$ZL2= 120
##$ZL3= 120
##$ZL4= 120
##$ABSF1= 10
##$ABSF2= 0
##$ABSG= 5
##$ABSL= 3
##$ALPHA= 0
##$AQORDER= 0
##$ASSFAC= 0
##$ASSFACI= 0
##$ASSFACX= 0
##$ASSWID= 0
##$AUNMP= <proc_1d>
##$AZFE= 0.1
##$AZFW= 0.1
##$BCFW= 1
##$BC_mod= 2
##$BYTORDP= 1
##$COROFFS= 0
##$CY= 11.3945322036743
##$DATMOD= 1
##$DC= 2
##$DFILT= <>
##$DTYPP= 0
##$F1P= 15.7292609196834
##$F2P= 12.9074282941183
##$FCOR= 0.5
##$FTSIZE= 0
##$FT_mod= 4
##$GAMMA= 1
##$GB= 0.15
##$INTBC= 1
##$INTSCL= 1
##$ISEN= 128
##$LB= 0.24
##$LEV0= 0
##$LPBIN= 0
##$MAXI= 10000
##$MC2= 0
##$MEAN= 0
##$ME_mod= 0
##$MI= 1.114404
##$NCOEF= 0
##$NC_proc= 0
##$NLEV= 6
##$NOISF1= 3.799351
##$NOISF2= 2.8
##$NSP= 1
##$NTH_PI= 0
##$NZP= 0
##$OFFSET= 15.70392
##$PC= 1
##$PHC0= -24948.63
##$PHC1= 19.18731
##$PH_mod= 1
##$PKNL= yes
##$PPARMOD= 0
##$PSCAL= 0
##$PSIGN= 0
##$REVERSE= no
##$SF= 200.130013532006
##$SI= 16384
##$SIGF1= 3
##$SIGF2= 2
##$SINO= 400
##$SIOLD= 16384
##$SREGLST= <1H.CDCl3>
##$SSB= 0
##$STSI= 0
##$STSR= 0
##$SW_p= 3612.71676300578
##$SYMM= 0
##$S_DEV= 0
##$TDeff= 0
##$TDoff= 0
##$TI= <>
##$TILT= no
##$TM1= 0
##$TM2= 0
##$TOPLEV= 0
##$USERP1= <user>
##$USERP2= <user>
##$USERP3= <user>
##$USERP4= <user>
##$USERP5= <user>
##$WDW= 1
##$XDIM= 8192
##$YMAX_p= 0
##$YMIN_p= 0
$$ End of Bruker specific parameters
$$ ---------------------------------
##NTUPLES= NMR FID
##VAR_NAME=  TIME,          FID/REAL,        FID/IMAG
##SYMBOL=    X,             R,               I
##VAR_TYPE=  INDEPENDENT,   DEPENDENT,       DEPENDENT
##VAR_FORM=  AFFN,          ASDF,            ASDF
##VAR_DIM=   8192,          8192,            8192
##UNITS=     SECONDS,       ARBITRARY UNITS, ARBITRARY UNITS
##FACTOR=    0.0002768,     1,               1
##FIRST=     0,             0,               0
##LAST=      2.2672688,     0,               0
##MIN=       0,             -161218,         0
##MAX=       2.2672688,     131615,          0
$$ Real data points
##PAGE= N=1
##DATA TABLE= (X++(R..R)), XYDATA
0 0 0 0 0 0 0 0 0 0 0 0 0 0 0 0 0 0 0 0 0 0 0 0 0 0 3 -5 5 -5 8 -8 8 -8 8 -11 12 -13 13 -15 17 -20 21 -24 25 -27 32
45 32 -35 36 -41 44 -49 53 -59 66 -74 81 -91 103 -117 135 -157 186 -223 277 -355 475 -677 1063
67 1063 -1947 4768 -28498 -161218 -7780 103980 -33090 -22042 87156 4271 -58092 25471
79 25471 27837 -52374 -12532 44101 -8051 -22654 20310 936 -41377 716 30705 -10083
91 -10083 -16644 153 9 -9585 7359 34214 3148 -11257 20320 16819 -26965 -29317 20621
104 20621 9733 -25957 3460 21802 -13533 -20183 7446 -11742 -12774 31693 15400 -28223
116 -28223 -6823 30563 -737 -15157 24366 7862 -21261 -2230 6074 -14571 -7883 22390
128 22390 5075 -13849 4709 1559 -20408 -11667 17993 10183 -7443 -2230 120 -2252 612
141 612 11487 4406 -1182 14802 4568 -19573 -15757 7498 5727 -11292 2785 8083 -7825
154 -7825 -6752 5094 1574 -2032 14107 6642 -16404 -7906 7112 -909 -8523 9963 13175 -3696
168 -3696 -3134 -518 -1316 2571 7937 -2126 -12275 4561 6487 -12609 -10257 9349 6959 -11463
182 -11463 -3285 5388 -3530 -281 10534 3990 -4200 12108 10024 -13506 -4331 12676 -599 -14779
196 -14779 1613 5712 -11646 -3970 4638 -5812 -2012 12256 564 -14648 4834 11829 -7855
209 -7855 -4045 15941 10620 -6830 -1149 2489 -5185 99 4812 -4081 -8776 1800 2611 -11231
223 -11231 -5934 7679 5618 -4216 -892 5900 -1283 -2092 5835 5989 1021 3039 2503 -8634 -3294
238 -3294 9351 -358 -10902 -390 6845 -6578 -8469 3150 300 -1243 5303 1452 -8440 819
252 819 11348 -1302 -5637 7517 7419 -5613 -4044 5753 1884 -2175 830 -3073 -7506 -2246 2017
267 2017 -5984 -6245 5778 4819 -4360 -1514 8498 3964 -3689 3339 5447 -694 -496 2954 -2488
282 -2488 -5369 4884 1680 -9756 -3799 6635 -1551 -10611 165 5029 -1577 868 4399 -2059
296 -2059 -2643 6826 3595 -4031 4200 7132 -4571 -6189 4146 2401 -6072 -585 1274 -5218 -3344
311 -3344 1705 -3294 -4082 7102 4008 -7568 -1986 7532 2651 -3090 3920 4670 -1448 225 1232
326 1232 -3373 -1036 5277 -1097 -8791 -172 4070 -4285 -6060 2986 3458 -2928 -986 1535 -1076
341 -1076 991 5470 2119 -1541 4154 5262 -4501 -3904 4294 2401 -5032 -2256 1156 -3913 -3049 881
357 881 -1491 -2588 3811 3036 -6159 -1611 7930 3327 -2284 3239 5749 -1590 -1457 1774 -1993 -2308
373 -2308 1940 47 -5793 -1687 2429 -3549 -4222 2482 3722 -1473 -1376 2431 1083 -148 2637 2932
389 2932 751 1846 2671 -2475 -3710 2531 2915 -3354 -3371 692 -2439 -5255 -157 1718 -328 2453
405 2453 3664 -2611 -3010 5605 3308 -3425 1574 5824 -1724 -4355 2404 2110 -2406 1375 1365 -5219
421 -5219 -3738 1753 -3240 -5596 3370 4979 -2514 -2215 3939 1361 -1209 2908 2139 -1305 2307 3062
437 3062 -2878 -3131 3361 1341 -4105 -2024 638 -2625 -3580 339 383 -899 2052 1186 -2187 -249
453 -249 4163 1286 -1556 2722 3532 -572 -2023 1108 421 -1732 -102 -514 -3057 -1950 -174 -2300
469 -2300 -2905 1744 2451 -1127 -203 2482 657 -471 2643 3144 87 868 1150 -2645 -2731 1890 1395
486 1395 -2028 -153 1063 -2858 -4447 -762 312 -1571 629 1913 -836 393 4077 2551 -309
501 -309 2093 3601 -975 -2903 366 712 -2052 -1525 -68 -1614 -1468 165 -1327 -2446 50 1441
517 1441 -893 -503 3253 2775 284 756 2526 689 144 1572 -596 -2263 319 896 -2861 -2899 788
534 788 -1185 -4703 -980 2504 -107 -748 2864 1591 -1033 2273 3955 -166 254 3714 -226 -4182
550 -4182 -303 1301 -2211 -1726 1249 -1652 -3087 105 265 -1748 310 2097 -678 212 3346 708
566 708 -1043 2134 3217 171 87 1967 -12 -2762 -1523 -1153 -2699 -1590 910 192 -1418 -256
582 -256 855 77 -254 1326 1119 153 1073 1631 380 136 1683 174 -1574 158 532 -2350 -2205 165
600 165 -1356 -2276 375 850 -1191 171 1523 -766 -1025 1767 1788 -56 1626 2806 318 -1343 266
617 266 158 -1506 -1081 -150 -1215 -2207 -117 683 -1552 -1672 506 717 -472 993 2236 451 88
634 88 1677 618 -701 1745 2325 -948 -1130 -150 -2335 -2647 -152 -183 -2179 -448 692 -2281 -1422
651 -1422 2153 1671 11 2273 2451 -15 341 1298 -453 -1103 1289 1532 -1456 -1672 -556 -1932 -2686
668 -2686 -951 -138 -860 -40 1126 28 -283 1727 1641 79 1291 2665 -326 -1276 1253 1222 -1097
685 -1097 -421 -89 -2661 -2557 -89 -878 -2392 34 862 -1281 -315 2261 1365 383 2490 1658 -318
702 -318 201 935 -313 356 1176 -759 -2045 -1042 -949 -1914 -1280 388 391 -159 -322 -11 288 388 902 1462
722 1462 1634 1377 931 -176 -981 252 1140 -142 -853 -440 -1053 -1892 -1187 -501 -206 801 405 -874
740 -874 -882 792 787 498 1341 1922 1087 -28 -355 -309 35 -36 -612 -1445 -1050 -356 -930 -1272 -792 438 -29
761 -29 -797 -591 874 658 692 1694 1466 617 831 5 -914 225 728 -813 -864 -3 -591 -1840 -1115 -669
781 -669 -772 559 439 -1257 -499 1741 1427 406 1451 2041 147 -28 93 -449 -204 1105 -116 -1352
799 -1352 -621 -887 -2266 -1815 578 465 -975 -299 795 593 287 703 951 1248 1002 829 211 -18 1340
818 1340 772 -1051 -1162 -239 -1385 -2254 -1754 -846 -426 535 366 -572 114 1739 1022 -12 1401 1810
836 1810 431 -328 53 92 -102 -416 -1000 -1388 -895 -897 -1494 -868 280 344 -339 -407 -174 868 933 767 1030
857 1030 1394 1421 430 -93 -37 210 68 -901 -1688 -1125 -527 -1268 -1442 6 203 -17 -134 350 571 1218
877 1218 1481 745 923 1407 641 -650 -330 501 -60 -1118 -672 -573 -774 -1127 -1229 -1031 -376 70 -514 -806
897 -806 653 1729 1348 814 1631 1567 237 -730 -556 -173 3 -305 -1168 -1379 -155 -262 -1627 -1110 1039
916 1039 615 -518 -557 286 546 1105 1331 475 729 1286 -140 -885 161 1137 -6 -960 -819 -975 -951
935 -951 -796 -1129 -955 558 1101 -703 -416 1329 1257 397 1054 1034 695 543 -304 -417 26 422 -238 -1062
955 -1062 -770 -788 -873 -842 -431 25 328 -482 -921 210 847 584 896 1483 745 601 429 -263 -165 587 -272
976 -272 -1426 -1405 -529 -1271 -871 -155 332 -67 361 -349 -808 548 1242 521 851 1770 1378 106 -364 199
996 199 557 452 -476 -1101 -1027 -965 -1516 -1226 -91 432 519 -363 -801 90 1268 738 594 1375 1432 330 -437
1017 -437 -131 108 192 229 -1381 -1300 15 -473 -1849 -850 338 191 -360 -97 22 637 1264 851 525 1347
1037 1347 1216 -196 -401 341 500 -278 -523 -1299 -1589 -880 -1386 -1268 431 1132 275 -375 169 419 806
1056 806 1029 1099 1024 991 -56 -980 -356 861 268 -502 -563 -921 -1764 -1712 -1369 -690 626 944 60 105 811
1077 811 881 594 567 1131 735 558 146 -686 -152 194 -477 -1154 -315 -95 -1283 -1609 -699 -118 697 776 145
1098 145 0 624 902 57 436 1217 514 -193 -410 -221 277 607 -100 -1345 -851 -361 -1188 -1316 432
1117 432 836 56 -303 -2 326 673 1212 826 642 1200 695 -725 -787 95 184 -310 -533 -329 -726 -719 -948
1138 -948 -435 317 334 580 210 94 283 372 331 819 1616 743 -704 -165 62 -819 -296 337 -374 -486 -27
1159 -27 -872 -1671 47 856 -511 -297 1203 704 -160 839 965 155 710 515 -740 -360 971 -97
1177 -97 -768 -266 -21 -1048 -998 -193 -352 -241 274 -33 -480 418 794 393 310 955 1119 462 -312 -499 45
1198 45 115 -252 -627 -714 -605 -1070 -983 -864 24 646 445 140 522 467 360 790 970 887 685 162 -297 -1086
1220 -1086 -295 48 -835 -864 7 -858 -1060 -281 -316 -380 44 514 -89 661 852 550 242 769 715 289 -207
1241 -207 275 -289 -336 -622 -886 -1017 -398 -650 -695 -233 471 138 -255 383 541 332 795 786 869 630 316 -113
1263 -113 -590 -159 88 -763 -715 -248 -279 -838 -830 -213 -112 107 535 123 175 815 916 202 258 1072 695 -224
1285 -224 -145 -51 -850 -432 -516 -619 -1035 -47 -530 -859 -330 684 382 -46 582 660 391 773 656 -40 99
1306 99 671 34 -551 155 319 -555 -818 -149 -517 -878 -454 -119 -573 23 509 340 -162 993 1019 142
1326 142 848 862 39 -194 301 82 -516 -319 -193 -709 -711 -381 -447 -621 13 569 163 24 355 642 172
1347 172 348 704 365 283 442 -268 -268 -276 -230 -869 -878 -352 -619 -900 -226 66 -233 -139 116 335 -55 647 657
1370 657 117 858 1028 61 -391 -121 -78 -512 -188 -304 -416 -862 -301 -584 -729 -30 73 -143 -69 335 517
1391 517 455 617 662 464 147 498 140 -669 -510 -290 -574 -777 -521 -759 -919 -320 153 -258 -50 740 491
1412 491 132 632 967 119 245 935 -45 -419 -135 -401 -795 -371 202 -759 -1045 -177 -89 -547 66 207
1432 207 160 309 583 306 149 933 660 33 8 345 -198 -326 -10 -444 -676 -680 -364 -589 -621 -153 -18 56
1454 56 155 488 332 465 341 497 349 399 553 250 -319 -477 -136 -530 -470 -208 -612 -886 -474 -131 -366
1475 -366 -91 597 475 91 461 491 442 508 950 339 -86 310 -98 -787 -428 93 -547 -837 -579 -280 -202
1496 -202 1 111 75 122 554 -62 411 509 761 304 45 249 107 112 -326 -656 -656 -388 -233 -596 -528 -501 -41
1519 -41 -269 -356 309 525 408 327 445 490 427 579 339 -307 99 238 -476 -583 251 -165 -725 -461 -167 -517
1541 -517 -366 672 100 -240 464 444 198 606 1056 25 19 495 442 -301 -219 -183 -487 -429 -158 -666 -466 -10
1563 -10 -333 -686 -371 515 357 64 488 717 162 -84 394 220 182 -68 -148 -325 -259 -117 -559 -875 -478
1584 -478 78 -420 -385 151 637 108 228 370 262 349 963 154 -101 235 121 -538 -393 60 -385 -768 -380
1605 -380 -911 -798 74 501 -388 -215 525 428 51 360 708 168 399 540 321 75 165 -70 -900 -571 -237
1626 -237 -267 -568 -1 -174 -143 -170 -181 179 342 593 297 171 491 513 247 148 281 207 -483 -815 -299 -531
1648 -531 -846 -531 -309 -251 19 377 -201 96 317 300 -103 225 1151 363 -308 132 -187 -478 -107 -272 -706
1669 -706 -244 -111 -675 -705 -20 86 -384 -262 162 331 231 372 201 30 684 483 -105 -196 447 140 -890
1690 -890 -575 -243 -255 -526 -445 -427 -359 -82 -115 -211 184 769 561 120 404 768 301 -115 -47 -12 -44 93 -101
1713 -101 -508 -460 -284 -517 -593 -89 518 117 22 51 63 211 472 533 410 582 410 -194 1 429 -48 -497
1735 -497 -340 -103 -522 -203 -748 -252 -262 -127 -161 113 156 389 137 -44 212 616 384 -101 270 274 -72 -466
1757 -466 -289 -239 -197 -260 -705 -460 -84 40 -4 -294 91 765 178 186 464 568 262 29 -219 123 251 87
1779 87 -183 -646 -182 -376 -869 -782 -144 147 -137 -193 193 85 281 348 375 462 619 505 -94 -99 316 -68 -385
1802 -385 -257 -98 -460 -514 -505 -352 -83 185 -231 -46 498 514 256 255 512 332 368 223 160 -82 43 -217 -355
1825 -355 -441 -97 -533 -632 -273 -273 -75 -255 -289 112 445 171 279 404 514 504 -73 -287 107 300 -204 -607
1847 -607 -355 -107 -655 -557 -424 -173 -15 93 -132 -66 411 369 -141 158 468 619 110 -281 53 -28 339
1868 339 -104 -500 -132 -185 -413 -485 -581 53 189 -221 -174 335 103 404 430 164 346 427 409 -66 -132 250 -114
1891 -114 -762 -611 -221 -255 -391 -110 -12 -68 -94 -32 12 314 446 82 251 641 440 -85 -106 53 -42 -210 -93
1914 -93 -392 -502 162 -361 -640 -165 92 -176 -134 106 289 120 325 482 508 543 576 -40 -170 195 106 -544
1936 -544 -304 45 -175 -303 -424 -373 -76 -41 -12 -288 55 245 378 -127 390 716 198 -22 -124 179 28
1957 28 -172 -162 -296 -181 -377 -182 -468 -132 72 -15 -287 117 449 515 166 448 114 325 269 -55 -82 55
1979 55 299 -268 -459 -25 -10 -641 -449 117 -64 -199 128 -66 88 713 83 -159 222 471 9 -152 430
2000 430 211 70 -286 -475 -348 -351 -327 -461 -595 164 -123 -121 103 569 589 164 74 315 483 320 240 -181 -111
2023 -111 189 -132 -530 -453 -45 -303 -543 -382 72 -55 -51 10 6 278 393 107 174 428 573 -66 -533 -129
2045 -129 31 -60 -274 -130 -266 -325 173 -129 -585 58 254 -237 -172 142 308 134 402 281 0 157 170
2066 170 28 -103 229 -201 -454 67 121 -373 -374 -296 -41 -182 62 334 216 131 392 117 -29 659 176 249
2088 249 -17 -13 -8 -350 -271 -247 -153 -390 -497 -263 -25 132 89 -177 -129 289 131 125 312 437 38 -133 101 -12
2112 -12 225 -69 -398 -464 -332 109 -307 -526 -84 56 -46 -156 231 102 168 267 136 242 155 377 -155 199
2134 199 141 -87 -292 -133 -102 -130 37 -366 -310 -271 314 30 -180 74 280 188 12 556 506 394 6 -93 -158
2157 -158 -49 53 42 -506 -428 -1 -139 -69 14 82 -234 45 337 399 328 244 269 206 120 435 146 -200 -93 -14
2181 -14 -141 -170 -24 -75 -153 -488 -66 -46 -79 7 -274 -93 235 81 291 322 412 255 47 23 58 -283 -414 -110
2205 -110 -326 -156 -163 -324 -529 -13 303 -176 -200 93 -56 247 320 -90 116 505 343 -35 -239 -23 -14 -778
2227 -778 -553 -42 -188 -411 7 39 -176 -4 195 -52 99 405 294 33 559 -112 13 -121 128 92 -124
2248 -124 -189 -43 -178 -456 -312 -363 -213 -25 1 -56 151 226 159 73 235 243 267 138 57 -34 -164 111 -30 -99
2272 -99 -164 -82 -167 -348 -351 -72 119 22 114 168 99 424 241 308 267 303 42 -198 -79 -79 -314 -239 -212 -418 -125 -11
2298 -11 -230 -53 341 83 -177 6 386 101 301 428 21 23 15 114 -177 -203 -82 -74 -148 -120 -308 -280 -129 -330
2322 -330 -92 98 -86 318 -103 -44 220 -75 32 134 474 215 -59 100 -86 -286 25 -159 -296 -257 20
2343 20 -279 -63 -7 123 70 191 359 223 362 65 -247 -60 22 -12 262 34 -259 -118 -404 -277 -157 -215
2365 -215 -185 -137 -15 -71 -72 145 74 300 154 106 259 127 -56 260 -114 42 -157 -282 -169 -161 -426 -368 -467 -117
2389 -117 -207 77 -116 257 346 54 58 239 276 208 204 113 50 -319 -339 -177 -268 -40 -241 -306 -282 -190 -89 -160 -117 149
2415 149 9 182 356 319 303 15 151 145 58 24 -17 -234 -90 -76 -199 -207 -83 -123 -102 -41 -220 350 312 181 229
2440 229 63 210 278 146 56 -135 -169 -258 -182 -46 44 -90 54 -9 -65 -14 24 -213 -293 248 113 73 -30 123
2464 123 252 374 5 -47 158 -149 -478 -233 -372 55 -114 -75 -193 -194 -302 162 45 -53 240 158 384 39
2486 39 233 65 -117 -30 -183 -160 -62 -77 -35 -115 -26 73 -206 -351 -51 -197 -196 271 49 254 93 204 190 114
2510 114 -42 129 103 79 190 -84 -318 -308 -100 -442 -296 -101 88 -147 -144 4 152 307 111 -2 430 296
2532 296 -63 115 -163 158 -145 -533 -236 -352 -158 -142 -372 -76 -257 78 -25 99 140 106 293 241 203 46
2554 46 124 -8 295 -77 -58 -116 -288 -93 -282 -44 -124 -229 -10 -48 40 -131 -126 122 389 189 147 246 280 351
2578 351 159 -10 102 0 -196 -57 7 -9 -141 -98 -389 -9 45 208 202 77 63 32 392 113 206 219 41
2601 41 248 8 -23 -78 -140 -242 -57 -145 -280 -2 -48 24 -3 -234 154 160 59 -137 -207 74 58 108 187 94 226
2626 226 -227 -63 -288 -77 -157 -260 -384 -167 -28 -18 -1 268 283 123 3 48 187 66 127 -20 -113 386
2648 386 -90 -28 -197 -183 -175 -43 -46 20 -7 179 32 -174 198 148 170 54 231 173 185 -51 215 -141 -11 -181
2672 -181 36 -485 -311 -185 -245 -262 18 88 -124 30 292 259 359 -81 112 70 71 34 218 -37 199 14 -134
2695 -134 -139 -174 -213 -117 -136 18 13 -45 -77 85 117 157 -49 -18 144 185 75 0 37 43 40 43 208 -201 15 -508 -283
2722 -283 -112 -415 86 75 342 216 212 -89 28 22 347 66 291 -98 35 -119 117 -252 -126 10 -341 -159
2744 -159 -165 11 -146 -36 -124 -70 188 416 275 27 18 119 76 103 -42 -80 -44 42 -228 -141 -37 -187 33 -331
2768 -331 -147 -102 -72 94 133 -47 156 97 126 142 88 -234 169 298 -118 -105 -251 -240 55 -314 -210 -112 -186 -112
2792 -112 -30 -5 154 195 -26 -35 150 57 264 -81 17 383 26 4 -264 -94 -77 67 -44 -335 -344 -154 -110 130
2816 130 111 251 222 224 36 218 45 -241 194 97 -195 0 -193 -236 -96 -132 -61 -355 -120 73 -180 -225 33
2839 33 267 -167 -43 142 58 -68 -163 -41 -237 53 -35 -179 -180 -112 -102 -220 55 -427 -206 -192 92 85 -77 137
2863 137 15 35 -110 61 170 -12 -49 -11 -39 -100 -260 -282 56 125 -148 -232 -56 -210 -111 -31 38 52 549 148
2887 148 294 350 40 -14 -13 -161 -69 113 -128 -27 -51 -2 -199 -32 -28 -52 149 135 45 262 129 157 126 107 235
2912 235 316 21 36 239 28 -287 -372 -17 -140 130 -171 -132 -101 -116 91 6 -49 42 210 93 -9 92 7
2935 7 62 -147 -109 87 -71 -136 -336 -63 -131 -217 -71 -113 -260 -147 184 38 279 -77 100 67 87 -96 29
2958 29 59 -92 16 -65 18 -210 41 -200 -181 -7 -70 72 57 -116 -157 186 154 203 74 69 -87 34 -45 131
2982 131 -209 213 -16 -294 -8 -250 27 -324 -42 -322 34 34 7 -76 330 107 14 233 176 137 -139 -46 186
3005 186 -170 -22 43 -296 -170 -66 -139 -163 -167 -161 61 -93 -66 18 249 -4 149 333 72 297 102 104 -153 69
3029 69 -211 -512 -403 -123 -284 -113 -140 -285 2 4 70 -5 202 218 348 -85 -48 138 -102 115 47 -52 -282
3052 -282 236 123 -81 -270 -253 -118 150 87 -88 57 179 211 -42 264 98 315 96 54 -22 -28 93 138 -116
3075 -116 -64 -148 -79 -195 14 -263 90 74 141 -39 -33 -115 -29 132 151 145 -330 -4 -180 9 -69 5 50 -241 50
3100 50 -78 -174 -32 -294 99 39 139 -16 89 33 1 -70 122 150 -316 -173 -58 140 40 -183 -107 -50 -166
3123 -166 75 -48 -25 -78 214 25 140 -87 275 -141 -24 305 156 8 113 -86 -233 253 15 8 -222
3144 -222 145 -283 -358 -54 19 118 3 190 38 95 -33 -28 33 -34 70 120 -2 -5 140 16 15 124 -190 76
3168 76 -52 -37 -29 151 236 -118 47 130 286 -83 145 22 91 17 73 -50 -10 54 -164 17 52 23 -490 -103
3192 -103 -97 77 -161 44 -9 125 -120 87 345 -111 -4 -31 146 24 -290 -104 -116 -91 -310 -313 63 28 41
3215 41 -19 124 -264 35 83 -25 49 109 -166 45 181 167 -51 23 -40 -117 -3 -129 -277 -113 -259 -125 7
3238 7 87 214 123 167 110 -49 83 121 26 -53 50 46 99 65 87 43 -98 38 22 -140 9 -164 200 -264 39
3263 39 -56 143 -8 301 224 53 77 -118 149 46 145 -66 -30 -277 86 -156 -205 -54 -129 83 51 27 5 141
3287 141 -13 -151 302 -25 -186 13 -125 168 -26 229 256 26 -121 -193 -242 63 -84 80 -160 236 53
3308 53 253 -192 67 -78 -26 50 323 26 202 37 -132 -169 45 -4 -66 -12 -237 15 -36 84 -8 288 149
3331 149 132 29 53 148 57 -64 -107 34 -4 106 21 -153 16 -203 -194 -86 -384 -54 -52 -98 123 202 185 -57 -12
3356 -12 246 12 115 57 83 -185 -29 -21 -138 -141 -37 -96 -22 130 -436 52 -59 90 123 -89 -2 102 -267 -137
3380 -137 169 84 -43 205 -202 -95 104 3 32 -36 -98 -19 127 -71 99 0 10 -37 -26 -91 -45 -10 347 239
3404 239 207 29 135 139 -105 53 -22 -92 94 -157 -56 143 48 -74 229 -193 226 -94 47 -32 0 46 276
3427 276 65 70 -112 -58 67 36 123 -272 126 47 -115 -41 72 270 111 -145 111 51 42 35 181 67 220 -204
3451 -204 39 78 -25 -115 -108 -199 -143 -56 247 -102 -11 -42 122 -20 42 72 29 181 115 -10 144 -127 8 81 -44
3476 -44 28 -68 -284 -149 22 -82 -194 14 -108 -111 30 -152 58 148 63 130 -11 -191 -123 -66 45 35 250 37
3500 37 41 74 -33 140 203 -61 -85 61 127 -94 28 160 109 -19 141 131 -177 213 176 38 -1 78 -1 157
3524 157 -115 -161 -137 -112 92 -2 8 37 146 228 157 357 173 -3 21 65 5 12 56 40 14 -151 36 18 -106 56
3550 56 -92 -1 103 -6 27 533 365 109 -268 -253 107 -141 22 2 50 55 -155 -61 -151 25 -44 9 -92 -111
3574 -111 -258 159 119 139 -164 26 125 95 -2 88 -102 -195 -77 10 -103 42 105 112 -207 -193 -21 -128 107 263
3598 263 -157 6 72 20 183 -33 -30 42 85 -60 202 60 12 -72 55 -47 114 -190 -251 8 47 226 -64
3621 -64 27 188 41 118 39 60 17 114 86 -244 6 40 60 -237 -50 -91 -114 -77 -34 -85 127 113 116 5 -10 52 92
3648 92 303 158 -58 120 43 -210 -47 -36 -226 -197 -98 -36 -44 -84 141 -107 -191 11 131 -233 54 120 -99 -100
3672 -100 -76 172 81 -191 -104 57 106 -221 -95 -9 -50 -50 20 7 208 81 -79 9 208 -149 17 248 221 -147
3696 -147 -10 2 -204 -34 -243 -103 -82 -54 168 -174 16 18 57 2 3 308 -39 49 174 -119 -76 71 105 147
3720 147 -120 16 -185 -122 -23 -142 26 1 0 -85 84 -148 -74 94 205 89 82 206 19 -7 -165 166 -121
3743 -121 30 18 126 -148 173 -24 64 -119 10 -136 76 156 61 195 110 -59 -126 139 -251 89 -65 39
3765 39 -371 -120 -61 -119 -167 -108 44 120 -98 -5 136 117 81 215 97 120 60 -54 4 276 -35 -112 -220 -80
3789 -80 49 326 -148 186 254 -39 -126 115 86 -93 -44 28 -30 42 20 75 -16 -72 23 94 31 -35 -192 51 -180
3814 -180 47 -141 127 -38 105 93 81 151 -191 -126 -92 -26 38 156 -56 -31 -86 56 -88 92 54 70 -105 -17
3838 -17 -27 167 83 -188 -101 -28 81 41 -213 20 239 -120 -61 103 -65 55 148 273 401 161 134 82 -3 -63
3862 -63 120 3 -1 94 -250 29 -26 -215 259 110 14 -125 218 57 39 74 -41 -114 -35 -69 70 -324 -216 122
3886 122 -33 -84 -9 -355 9 2 158 47 -174 -24 -351 -156 26 -169 -43 -130 8 -41 119 -306 -5 -123
3908 -123 193 153 -104 -169 123 98 -30 30 -5 16 42 -215 -17 78 -17 81 -250 43 -50 -4 180 130 -63 -198
3932 -198 -171 60 193 54 47 -113 -53 215 -114 -190 346 10 -126 129 74 -196 -203 10 -171 -147 113 -45 -82
3955 -82 -154 23 191 98 -12 -314 29 108 -191 -65 -49 -114 -51 -109 9 -8 -117 -131 118 -134 -196 -222 84 -156
3979 -156 -49 33 -161 62 -59 55 -102 9 -98 7 -248 -195 -248 -35 -55 -92 2 -90 -46 17 131 80 19 72
4003 72 67 122 -28 20 31 207 -273 192 -118 -105 -184 -198 -121 -25 -37 7 -83 -175 -51 112 -2 23 141 -274 58
4028 58 -10 149 -207 -15 -10 86 -29 -66 117 68 -194 110 129 114 40 -121 -214 -169 26 140 7 -138 204 -43
4052 -43 84 16 262 -106 81 77 -168 -188 61 -91 -82 -85 76 -18 69 85 36 249 163 79 -60 198 -154 -157 64 8
4078 8 12 148 -172 14 -141 -94 -66 -140 42 10 -16 -162 25 22 -20 50 8 -62 -213 269 -155 -166 162 5 -107
4103 -107 -108 -57 60 22 156 5 38 166 248 132 133 -126 231 -33 -27 -44 4 -126 -222 -128 -129 53 157 47 -182
4128 -182 -1 50 3 83 -231 -53 -165 -78 261 98 -137 -27 114 -147 116 -129 -94 235 -17 -72 16 -110
4150 -110 45 -306 214 -16 5 72 -66 295 -94 91 262 -132 1 87 -157 313 -12 -12 -3 275 -35 40 216
4173 216 -104 140 8 -5 -42 154 8 119 -106 -24 12 60 -124 -196 169 178 11 -79 -54 -191 -55 70 198
4196 198 -27 -46 106 38 246 -110 150 -1 -210 253 308 172 33 -307 80 4 114 140 -2 136 191 -33
4218 -33 -161 37 -127 41 103 218 144 -38 22 -275 27 186 -75 -194 97 -9 -70 -4 -41 -87 -140 40 160
4241 160 129 -260 -43 263 107 -180 51 58 -213 -67 77 -40 -8 -144 151 49 -43 -11 40 -99 45 82 -109
4264 -109 -45 -143 59 74 80 102 -254 170 56 10 44 213 -199 37 -31 -50 131 -45 -185 100 -52 -77 213 -132
4288 -132 -123 250 98 -15 -52 -32 -170 57 -79 165 -284 106 89 31 -23 -165 -276 13 -139 -62 35 -49 2 -262
4312 -262 -109 131 194 149 -29 121 -71 -26 148 -2 -61 -71 91 152 -107 -190 -63 -147 -7 -81 343 -191 38
4335 38 232 25 -40 117 -26 158 -34 -46 176 -38 -69 138 79 35 148 -135 -89 50 53 -67 -4 59 10 -346
4359 -346 56 73 16 210 -235 157 -101 77 -124 -25 -193 -37 -16 117 -16 59 -33 -32 77 82 20 -60 -41 -286
4383 -286 300 -127 27 -127 138 7 247 -171 -9 -16 -59 8 -160 192 -46 -166 -37 -98 22 62 -223 180
4405 180 205 -198 67 -253 88 220 -89 -58 61 29 -283 -145 102 -221 -82 28 -105 71 154 28 -111
4426 -111 -118 132 4 -118 178 -111 89 214 -111 -82 1 -176 -110 47 -69 -85 84 -103 -2 -46 -181 51
4448 51 144 -192 -156 59 2 14 -211 -112 -171 28 46 -36 12 115 -22 216 -88 -243 159 216 36 -19 -59 -87 125
4473 125 -77 -135 -123 137 45 -75 -17 -158 -20 198 6 74 30 -30 -139 -94 -94 -364 -109 72 -7 72 49 79 103
4498 103 75 -3 -83 47 24 154 22 190 -45 51 -2 -106 95 -155 67 99 -12 32 -247 -210 145 -205 -103
4521 -103 111 62 -59 -62 311 213 -12 -84 32 140 -164 77 41 149 -70 124 144 157 153 22 26 114 320 133
4545 133 -26 37 -164 154 187 -2 -72 -130 222 -303 -16 44 -88 2 -103 107 28 78 -84 -35 274 73 -77
4568 -77 64 -207 -132 36 -79 -149 91 98 153 -49 -97 -27 -184 304 -225 -39 262 -13 45 13 174 48 8 53
4592 53 141 -67 -213 127 68 -160 157 -163 -54 121 42 114 41 -170 -37 26 248 -94 -19 -232 4 -29 162
4615 162 12 111 271 -87 30 -123 -70 -179 -50 270 36 25 -42 113 197 170 7 134 216 -65 -100 103 -85
4638 -85 23 44 -19 -84 226 -45 256 -56 -152 120 169 -31 -120 31 134 -180 4 35 289 80 -12 -59 117
4661 117 -142 -72 137 -106 -135 -205 209 -22 279 13 1 -86 138 141 -152 149 -81 62 92 23 -28 -61 -26 171
4685 171 66 31 133 -48 91 -66 24 32 50 72 64 -20 208 26 49 -44 198 -28 -49 60 -21 11 -148 -37 72
4710 72 -90 -52 14 -198 43 -146 67 109 -3 58 -57 230 -131 41 -88 -5 -54 -93 -73 -4 115 54 -12 -76
4734 -76 313 39 170 51 124 -107 -217 37 18 -343 26 136 -12 133 171 -93 -24 240 147 -157 165 21
4756 21 -219 14 38 67 235 18 28 148 72 -328 96 -73 -76 -195 107 -90 -111 -135 118 58 32 3 192 0
4780 0 98 -20 -177 193 48 52 43 -217 -64 32 -3 100 198 71 135 27 -42 1 -109 -131 65 -49 43 -13 91
4805 91 -47 -113 78 -121 -142 -142 157 97 160 -137 27 127 206 -268 -24 -67 -173 -116 -186 -282 15 173 49 35
4829 35 242 -59 209 100 148 -154 31 196 20 47 6 1 115 95 18 -18 -169 -19 271 -111 14 33 2 158
4853 158 -132 13 -187 81 -8 -84 -160 -99 -91 -102 -292 -75 -336 49 -17 249 153 -69 160 11 276 -92 49
4876 49 120 178 178 95 52 -398 -107 170 -12 -12 -45 236 -158 -116 109 -143 -23 152 344 -17 179 -84 48 78
4900 78 39 244 44 128 -59 -124 50 -140 60 94 16 66 34 71 103 33 97 119 48 -34 -215 -73 -50 49 5 -28
4926 -28 -93 80 15 -199 12 -136 114 -98 -137 -95 -156 103 70 227 54 67 186 20 102 150 310 -146 -40
4949 -40 -106 30 233 -258 67 -63 65 72 -161 85 334 116 -44 -57 214 15 57 227 141 62 372 -151 157
4972 157 -46 -144 -143 149 170 71 268 -45 -190 -32 212 -100 -179 -25 -138 106 -3 152 -17 189 48 -21
4994 -21 -8 -54 -72 -11 53 90 47 236 -227 -79 -39 -29 47 -137 25 -217 173 93 -25 185 -100 17 -13 155
5018 155 133 35 72 21 171 -63 41 150 47 75 87 148 186 249 153 11 99 142 47 -130 -170 -74 -277 -19 -133
5043 -133 -161 -42 -33 -1 -99 89 224 -67 -159 54 115 160 138 -70 37 -187 8 241 80 -40 252 -53 -121
5066 -121 -169 31 76 133 14 -71 52 -133 114 172 269 87 321 -133 -114 -10 -63 58 -163 -5 64 -100 -96 -25
5090 -25 -51 -43 212 -110 -152 -152 177 224 13 16 44 343 21 -95 -2 29 -40 218 62 25 253 -3 -26 83 -273
5115 -273 -43 -158 -247 68 161 3 -111 -117 -32 -65 31 245 -2 46 -183 46 149 266 45 84 -10 -441 170
5138 170 -93 -34 198 90 -11 116 -151 -132 134 -329 71 24 -53 150 91 136 -80 -97 -89 153 64 111 -74 -5
5162 -5 21 227 -183 -13 139 107 67 -90 -73 52 85 -13 -95 -200 -181 -119 -135 -245 87 -33 -78 -103 -2 -12 -28
5187 -28 -59 -225 -96 49 -43 -61 138 6 -32 101 52 -83 27 -79 -94 23 -45 39 99 60 -23 34 -15 278 24
5212 24 249 101 -51 24 -99 -92 78 52 96 -17 -59 -212 -289 -66 -202 330 -6 109 57 66 401 -4 202 149
5236 149 67 -120 185 -3 21 -211 -227 -68 -201 7 34 -134 2 -9 -22 141 232 43 62 -82 -35 -42 94 33
5260 33 160 -102 130 -14 84 -109 166 -86 -209 33 -97 135 -57 283 21 77 -278 215 -38 150 -92
5281 -92 -103 -264 -118 -134 22 -142 -124 8 -121 108 -26 97 41 37 226 -9 -144 129 -43 60 31 174 -83
5304 -83 112 420 -344 -2 -91 -159 12 -142 -15 179 116 -134 -49 5 103 185 349 -102 -35 157 53 -32 -180
5327 -180 327 65 -74 -115 -317 -21 199 -80 75 -159 -45 162 185 17 -178 93 -57 -25 246 186 -308
5348 -308 24 48 -296 -20 69 4 -5 -20 -191 -97 -115 0 -5 -30 135 127 -136 53 160 44 57 87 -126 92 227
5373 227 -40 124 -51 -11 82 -238 -138 -48 199 61 152 -128 4 -79 8 -13 -128 -87 -114 -78 -411 59 -84
5396 -84 126 128 -86 -187 -26 -71 -37 31 94 148 -109 -76 2 88 64 28 72 -31 29 -127 -143 149 85 -107 -117 -189
5422 -189 19 102 -206 -181 156 -99 85 -233 -91 -177 107 -125 -79 -195 175 -32 117 162 -70 69 -5 -180
5444 -180 -157 -7 12 36 -33 -18 8 48 2 210 -3 -31 40 150 82 39 -71 91 53 35 -259 -140 -260 148 -66
5469 -66 136 -68 92 -65 16 -14 54 9 -14 -51 117 181 -71 -44 -61 -278 8 31 -34 -52 -223 -235 -43 119 -289
5494 -289 -153 -120 97 59 22 33 -57 -36 -133 98 206 25 133 -94 8 -144 92 6 284 11 -51 28 -203
5517 -203 -190 113 107 -81 189 84 -124 -45 -64 28 -7 16 -16 0 -123 30 -44 71 143 -4 -6 22 -118 -72 76
5542 76 126 15 192 290 102 -72 101 46 -50 9 44 142 -73 -55 -72 -56 -55 -35 -284 -87 83 -127 102 105 174 -154
5568 -154 -159 51 212 215 -111 45 -23 6 -172 110 78 48 30 18 64 48 -117 -54 -130 -148 58 -282 165 -21 106
5593 106 -90 -81 -85 -42 223 6 79 -200 -47 -90 -155 6 -13 -213 -187 -14 -230 33 186 72 -111 36 -220
5616 -220 38 181 -147 -62 -27 16 -34 128 27 -102 69 59 91 -81 -61 -5 -203 -93 166 12 -267 -22 1
5639 1 -84 37 59 -18 -43 -92 71 -99 73 -230 141 239 61 -136 -57 77 -44 -55 28 121 92 164 48 180 -38
5664 -38 -9 57 188 -283 91 20 -7 16 -83 121 -141 -222 30 174 -192 -134 41 156 218 -171 46 3 -222 31
5688 31 -5 205 73 61 -6 8 38 159 -28 -74 271 194 90 170 52 241 141 -120 -325 141 59 -88 -50 -230
5712 -230 -55 -72 200 162 251 -89 77 -118 -223 -54 -74 12 -131 56 -104 -58 -178 118 -115 58 -2 26 142
5735 142 -61 -293 -167 -22 -155 11 -3 32 110 205 108 -47 9 16 -203 45 -3 91 -62 435 187 -83 -100 -70
5759 -70 -177 -58 -1 96 -120 -133 16 -82 293 73 -30 -50 32 138 343 86 -79 2 -43 112 75 -44 -24 138
5783 138 31 215 91 -98 47 -119 -32 -115 124 65 80 12 6 216 -301 69 -303 -9 -88 -90 -58 13 36 -96
5807 -96 -143 12 -153 -75 112 -121 -19 52 -85 7 51 -128 -255 -189 -193 55 -126 188 180 53 -5 -57 22 -50 -128
5832 -128 6 -36 -142 88 -90 -51 200 171 134 173 -59 -31 -235 35 -22 -122 158 -147 59 183 -14 -4 -51
5855 -51 -75 86 -38 143 -99 46 119 -283 -50 -72 23 -21 -145 4 -28 -319 80 -182 -34 57 -189 -85 93
5878 93 45 -245 -295 219 177 1 272 -62 155 6 -94 41 -79 27 83 132 -16 -140 -140 -199 -32 -57 71
5901 71 141 -185 166 89 98 179 -21 51 34 70 -112 46 22 139 -79 -44 -24 -207 74 240 149 6 1 -87 160
5926 160 -82 -61 -50 -183 46 106 162 -6 111 -94 -170 152 -197 20 -65 48 44 93 6 -85 57 162 -51 -125
5950 -125 -16 -29 -35 -237 61 -178 -143 -67 -95 -106 131 54 -229 -3 -50 313 -24 -168 69 -158 323 249 -213
5973 -213 -126 198 -132 -29 39 69 98 161 -24 260 -151 -118 0 -165 194 -128 6 1 7 -30 -212 103 -149 195
5997 195 -76 29 26 16 -138 79 192 -6 215 -29 -41 -38 -137 -36 117 174 318 41 22 110 128 28 -247 69
6021 69 -78 -135 -7 -91 85 133 19 212 42 142 148 -206 -10 -76 62 87 272 -140 79 100 109 -76 -12 97
6045 97 110 202 -209 240 -177 -75 44 15 107 109 56 109 -290 14 -15 -132 -16 2 -10 163 127 -109 36 -112
6069 -112 -221 -9 -25 -75 -45 53 -130 183 68 -25 186 -63 206 -152 28 201 42 130 -29 -50 3 -40 -65
6092 -65 136 -281 -87 -239 255 154 -171 30 48 -316 10 -132 129 81 47 98 201 62 -135 181 -7 -65
6114 -65 8 -132 36 21 31 121 168 160 241 -25 46 -44 61 -88 185 -102 73 273 32 -135 99 26 -36 110
6138 110 17 -140 -238 128 10 67 209 -197 -24 -32 165 39 -104 51 22 -114 160 62 -29 -46 100 125 124 -265
6162 -265 7 -24 -156 -53 -184 -24 -52 43 143 -38 -120 263 -22 -41 138 -228 -161 -132 -295 -61 132 215 -247
6185 -247 25 147 158 -236 -241 36 114 48 6 20 -130 22 11 223 8 104 149 75 -8 -22 -28 -116 -91 176 80 48
6211 48 -196 10 27 -54 127 166 18 85 138 128 185 99 104 207 237 181 -125 -101 71 131 -22 43 19 -89 26 -142
6237 -142 82 -30 -21 229 -6 -153 -68 10 40 15 31 160 128 43 93 -77 -35 -26 28 -81 -188 6 -36 124 177
6262 177 19 72 319 37 -173 4 -51 -126 -100 -84 80 -21 -167 114 -27 -32 -278 23 215 -18 -32 -9 174
6285 174 -273 -56 -178 -178 -138 -97 152 52 228 -31 -76 213 -36 189 11 -49 -166 -119 125 108 -147 29 -40
6308 -40 136 155 -65 -242 -86 233 69 60 -10 -151 -8 -80 -76 50 39 -91 -188 -43 -203 -1 -27 68 81 236
6332 236 171 -9 -91 97 -79 235 86 152 138 -7 49 105 144 -170 -27 -164 -66 -30 53 -137 174 -97 149
6355 149 -22 72 15 -155 176 208 -23 -183 -286 53 -9 -56 225 171 45 51 -141 -420 101 -8 167 -211 163
6378 163 -51 -270 -62 -213 9 -56 -35 -186 65 43 172 -50 -107 -173 -4 77 81 -64 243 -18 171 -84 -70
6401 -70 163 -285 -78 64 198 -184 -4 274 42 47 220 -184 -21 -111 98 -90 -77 240 23 -60 77 61
6423 61 -175 -54 -128 10 -124 -220 -48 171 180 75 -94 -128 73 76 7 124 -55 13 -149 72 54 37 -137 -164
6447 -164 108 32 120 184 -286 -1 51 162 206 57 -193 79 -2 111 209 -62 14 -70 -193 -20 -6 -324 25
6470 25 -52 -45 -45 -268 -7 89 87 2 -124 28 -122 -136 -115 203 40 96 103 61 -93 -196 -27 19 3 133 -53 -40
6496 -40 -85 -72 28 -157 -69 16 69 26 12 -175 97 34 168 106 -141 -80 39 -29 30 75 -83 39 -49 47 -37 -22
6522 -22 250 -96 122 16 -87 -27 -13 88 -136 -28 -208 153 -431 -257 -199 49 65 130 -12 103 75 268
6544 268 -24 163 -257 111 -19 -79 -260 86 1 -450 92 180 -153 177 -25 88 39 52 131 -39 -62 -109 -30
6567 -30 -32 41 -43 166 53 70 226 147 -56 -158 -330 33 75 312 -19 -63 40 -71 177 -76 254 -188 -67
6590 -67 141 -18 67 132 167 -207 3 -265 -88 174 6 145 -191 -169 -205 -49 -116 -239 195 59 -272 -6
6612 -6 -149 -71 -60 -98 160 281 208 108 -108 -80 47 170 9 98 -41 -184 -306 -154 -120 -272 -151 20 -27
6635 -27 -98 -58 -71 156 -8 -106 341 146 272 99 50 -20 98 12 11 -173 102 213 -103 38 -238 15 186
6658 186 -2 178 127 -39 16 -103 -123 -121 -3 -169 49 -129 10 29 87 52 -210 -31 6 4 100 -11 -58 -16 101
6683 101 74 -147 262 117 188 183 79 -123 100 -379 -112 94 -33 98 79 4 -116 63 -62 -9 -58 -47 -47 191
6707 191 190 -71 -129 -163 106 22 -104 30 10 163 -14 -53 -53 -37 -52 255 -36 137 -120 -124 -26 15 73 95 -53 142
6733 142 248 97 -66 50 22 -74 123 60 1 9 -53 71 48 -14 -200 18 -129 22 112 -111 -62 105 88 -84
6757 -84 -11 -52 -315 -27 -85 24 6 -34 7 -91 116 59 105 41 190 -178 -37 102 -56 -262 159 -193 146 -178
6781 -178 -280 132 165 -349 53 -37 -222 120 121 107 136 -8 -55 305 -20 -34 40 57 -47 -87 277 90 1 156
6805 156 64 -5 -20 -60 -144 70 -63 -61 116 -54 -18 6 37 -14 -139 338 -72 13 -154 23 -70 -43 66 82 20
6830 20 127 -138 -173 289 94 -177 -196 172 -336 100 122 157 2 -107 160 -230 -145 124 49 -56 112 -5
6852 -5 55 -228 -25 -35 -30 -161 53 197 13 15 -27 55 327 -178 -239 -280 95 48 121 -37 -10 195 -44 -229 -111
6877 -111 -19 -129 -201 37 45 35 -38 53 234 -40 102 200 -256 -212 104 10 130 -163 110 -44 228 63 360
6900 360 -154 -247 -17 199 304 20 62 197 -144 -2 192 127 -54 106 67 -34 334 33 182 -170 66
6921 66 -202 -49 111 105 -16 -243 31 47 -64 137 -121 135 -150 49 26 155 -302 -89 -194 -133 -148 -113 96
6944 96 -36 -180 59 113 111 98 11 191 0 -14 271 -226 -274 -36 20 -165 -99 158 -33 -23 -91 -76 128 64 50
6969 50 -121 69 85 -116 -109 7 32 -102 -182 -78 35 -240 73 -122 41 100 25 -26 86 -24 134 -112 49
6992 49 166 148 -133 88 53 -68 22 38 18 -8 -24 163 -271 -121 -90 -135 -322 66 189 164 119 -114 226 -39
7016 -39 168 50 118 -86 -65 -39 278 132 221 -64 -56 148 119 -34 11 -161 -208 96 103 -101 65 -83 -18 71 147
7041 147 133 93 8 -26 -34 77 -3 86 36 -38 60 86 -18 -157 47 2 262 -192 -163 -99 97 -144 34 -33 167
7066 167 -9 34 96 365 -76 -119 49 -51 25 -203 285 198 46 245 -5 -58 -97 180 103 89 29 -16 21 -215
7090 -215 -33 -40 -126 67 142 24 -211 6 -167 -54 -106 -28 -66 -96 -190 -115 301 -103 94 152 161 186 94 4 -34 130
7116 130 19 249 34 -186 77 -67 94 -255 9 0 110 -256 -112 -6 121 44 -105 111 13 39 -165 -150
7138 -150 123 249 -135 -176 -5 -18 324 -196 168 -7 203 71 -82 3 80 276 -19 208 72 219 -84
7159 -84 -174 -3 14 -24 31 -127 -71 25 -377 -281 -45 197 -138 -117 95 -20 -181 79 -208 118 86 19 101 94 156
7184 156 -106 9 250 29 -136 -54 123 52 4 111 -16 16 -162 -195 -59 -67 286 185 102 241 0 -222 -153
7207 -153 -45 118 59 -48 4 -92 -60 18 55 -80 -94 -151 -117 31 50 -4 113 39 75 200 -85 -190 -8 -66 100
7232 100 69 -99 -226 12 -30 41 153 59 -85 24 -30 -110 48 -96 -180 110 111 165 -78 114 26 -103 -45 -215
7256 -215 -121 -98 -195 -119 4 -158 -136 62 -39 -143 -122 -99 -39 197 -77 9 78 110 47 -49 -19 84 -121 -14 -24
7281 -24 98 172 -16 -192 -45 8 10 179 -7 13 54 -54 -21 -42 193 -182 -26 -255 43 -49 6 -99 -156 64
7305 64 -77 -48 67 2 -193 -60 23 83 15 -458 -232 -97 -41 90 -102 -133 -21 -84 41 -93 -20 24 124 -83
7329 -83 19 -92 128 199 259 245 -217 -125 19 -75 41 -4 58 -295 -12 -208 26 9 -119 21 -15 31 117 -11
7353 -11 32 208 -92 35 157 -202 262 -60 -3 88 34 16 -127 227 -74 266 14 -103 83 -117 99 280
7375 280 234 206 -51 -34 -75 -16 -215 -44 -29 -132 155 134 -329 -162 -191 95 42 1 -242 -92 130 80 143 145 11
7400 11 -156 49 -226 19 140 -58 22 -124 177 242 -193 -28 46 56 101 51 147 -68 237 154 180 -94 82
7423 82 -64 52 -6 -99 146 24 83 16 148 40 -25 -100 17 42 -175 -117 99 25 0 -180 114 39 170 -119
7447 -119 -265 -23 93 188 -172 -91 -47 15 320 103 -29 67 -77 -190 -239 -5 93 140 287 67 124 36 204
7470 204 59 127 -64 -38 -213 267 -204 0 -176 -238 69 105 48 -62 218 172 90 -101 163 76 -51 -15 -41
7493 -41 -85 -135 -15 20 -9 -202 192 -41 66 29 276 47 73 -191 -19 239 49 -167 66 -152 41 12 181
7516 181 -85 -32 142 112 -11 -29 -50 102 -172 -112 152 -59 -120 82 151 205 -22 -81 55 -313 36 -17 43 -138
7540 -138 146 90 180 -125 193 -158 46 7 -47 142 -15 229 190 114 -49 -170 -13 -66 -21 67 218 24 142
7563 142 -299 122 89 -48 111 -99 -48 -353 101 -1 -167 94 114 99 -58 110 125 72 239 -55 -189 180
7585 180 42 -152 -42 -23 23 83 -16 -20 -61 87 -62 146 -17 -64 -16 160 64 -56 165 64 -45 -263 -89
7608 -89 -24 -165 170 -8 -162 -103 218 -62 155 424 20 300 164 78 36 140 26 231 -14 -186 274 75
7630 75 -82 8 -11 64 -78 -202 224 -135 -6 140 -112 67 -78 -15 -256 -78 105 -38 166 -4 30 -77
7652 -77 -121 111 -85 57 -3 -157 -96 -57 -9 -240 -272 -179 52 -165 275 -99 44 72 74 115 -29 -55 -10 24 -69
7677 -69 218 -99 -230 -20 152 -207 100 2 -166 -117 79 -135 137 38 13 193 -4 33 7 34 -348 -195 31
7700 31 53 -108 -27 170 104 -22 56 86 38 328 -162 -30 -108 -29 103 -114 63 -160 -10 -275 -84 -118 75
7723 75 -90 327 151 0 -62 18 69 -27 -121 154 91 73 -171 241 94 -107 159 -4 63 96 214 -172 -70
7746 -70 88 10 150 -30 -148 176 194 -15 97 277 103 187 -92 220 -87 -166 108 73 140 237 -9 74 -165
7769 -165 133 69 -119 -289 77 -103 -25 98 191 17 115 -40 123 -82 274 -11 8 -82 58 -134 288 281 135
7792 135 112 -21 44 71 90 -19 221 206 99 39 -62 242 60 -133 29 -151 -72 -53 44 -83 90 -80 61
7815 61 -46 178 135 114 -12 -167 57 107 136 122 -121 -76 -13 5 111 -89 149 -128 439 272 73 92 118 167
7839 167 71 -157 -146 94 166 -144 246 -64 29 -73 -86 -19 175 7 -88 -91 -120 -67 32 193 -216 76 -137 -27
7863 -27 -162 -82 -16 19 -23 225 39 -17 -77 -147 28 -37 194 54 67 155 180 33 17 -12 -147 -129 139 427 69
7888 69 -41 -153 -196 -42 180 -2 9 -118 -23 7 -36 72 56 17 292 62 5 -239 94 62 -134 -43 92 -141
7912 -141 67 -41 164 -32 56 -82 -47 73 -139 -49 126 -32 36 7 -76 -27 -248 84 -115 -359 -155 154
7934 154 -77 96 -159 11 10 142 -92 -84 -115 210 120 61 -99 51 -199 13 -7 77 47 27 -148 -62 166 -160
7958 -160 81 94 213 -32 -126 -11 -157 -3 26 -154 -19 203 62 -59 -62 -135 159 114 -128 103 -59 70
7980 70 259 -83 -411 -134 46 -134 247 111 -79 46 -273 42 146 59 -239 -56 54 193 1 -11 286
8001 286 -8 -19 68 -129 -369 -90 -49 -159 -16 -128 -50 -35 9 -33 -32 20 127 0 -144 -63 226 -52 -87 -78 5
8026 5 91 53 -105 -90 -22 68 -70 41 -80 -157 -120 -335 94 -56 179 -52 -35 81 29 69 -54 132 -82 -151
8050 -151 62 -244 128 212 -248 -144 -30 158 -26 -27 -85 -241 -271 -88 -94 -15 -5 -59 60 17 -137 28 247 -2
8074 -2 260 -99 -205 8 49 92 19 54 88 -246 -174 -73 153 215 495 50 -123 58 15 62 14 -34 -99 116 76
8099 76 378 37 -23 -302 -2 -27 -87 -104 161 202 -146 204 -129 65 42 64 14 31 7 198 31 37 154 -142
8123 -142 -135 12 -152 16 -61 -84 244 164 -2 115 164 -82 34 -202 -105 53 63 -36 12 -293 -80 -41 -99 -18
8147 -18 54 -147 141 104 83 -28 516 -36 87 164 217 -32 -216 160 223 45 62 213 87 -65 154 149 -200
8170 -200 153 101 -208 129 45 95 55 115 -25 -249 -163 -109 19 -3 11 -22 99 175 249 133 -47
8191d7
$$ Imaginary data points
##PAGE= N=2
##DATA TABLE= (X++(I..I)), XYDATA
0 0 0 0 0 0 0 0 0 0 0 0 0 0 8 -8 8 -8 8 -16 16 -24 24 -32 40 -40 48 -56 71 -80 89 -104 120 -136 155 -176
34 -176 200 -224 251 -280 315 -351 391 -435 483 -531 588 -651 719 -794 874 -962 1060 -1168
52 -1168 1285 -1421 1569 -1737 1927 -2148 2402 -2704 3062 -3502 4058 -4782 5766 -7194 9450
67 9450 -13591 23662 -104051 -51087 131615 -33511 -44693 59860 32102 -65415 27233 57531
79 57531 -29012 -12971 57328 976 -35765 12148 7803 -36981 3545 28183 -5434 -33831
91 -33831 -4335 3801 -16648 4668 19797 -3752 -15452 6832 23976 -18004 -15771 35475 26007
104 26007 -16244 -1267 24191 -12956 -27159 5007 -2516 -14585 13329 10629 -39344 -16758
116 -16758 32527 1735 -14040 18488 18354 -14611 -3239 21142 -6234 -6780 18848 795 -21189
129 -21189 -5847 5770 -13097 -3974 23355 12028 -12543 -12364 -262 -6370 -4123 7867 579
142 579 -135 8352 8194 -10539 -7861 20706 11451 -9880 -4306 2917 -9845 -13500 6445 5567 -1052
157 -1052 9916 5409 -14124 -9765 11980 2159 -9264 5908 8082 -6101 -9505 3010 4203
170 4203 2361 9201 -2280 -9345 3686 8300 -7082 -9154 12852 8698 -11150 -5901 5690 -1551
184 -1551 -6389 5205 -418 -9591 3923 5772 -10863 -6091 17088 6206 -12119 5545 10761
197 10761 -5467 -3987 8438 777 -5050 8608 -1662 -17716 -1736 8607 -9377 -11749 11104
210 11104 6386 -11803 -3533 7289 3846 3355 10713 2024 -5941 4882 3739 -7895 -6193 7112
224 7112 4283 -9926 -5384 1837 -2730 -5974 1456 3739 -3869 -900 1384 -4083 1407 13347 7413
239 7413 -6599 3035 10888 -4044 -8483 1757 1972 -6090 -1668 -1226 -10931 -1907 8670 -1573
253 -1573 -8574 4539 8770 -5389 -3036 9076 6202 -491 1647 1834 -4406 205 4084 -4212 -6055
268 -6055 2369 2902 -8524 -6423 5159 656 -5911 -67 6208 -27 -1797 5066 957 -1449 6282
283 6282 5552 -5567 -2615 8827 -81 -10269 -1025 5586 -2645 -4982 1173 -3874 -5372 4724
297 4724 3155 -4111 1381 7309 -2543 -5612 7098 6281 -2992 -155 4501 -1748 -2990 3757 -1027
312 -1027 -4185 3593 1469 -9533 -6022 6163 1391 -6100 1385 4211 -1227 -832 3781 701 883
327 883 6706 818 -6303 503 6616 -2096 -6406 2932 3250 -4768 -4288 175 -1249 -2013 2831 526
343 526 -3779 1845 4406 -2312 -2395 6670 5718 -3192 -510 3688 -583 -2739 1735 -13 -3826 1468
359 1468 859 -7090 -3727 5765 2024 -5756 -58 4057 -2129 -2097 2948 2217 103 4269 2968 -3130
375 -3130 -3 3538 -1493 -4367 1544 2454 -4184 -4270 371 -506 -2518 -75 1061 -1554 170 2134
391 2134 -546 -307 5219 6555 -429 -1827 2504 -247 -4127 -756 1872 -2434 -2070 140 -4221 -4154
407 -4154 3552 2945 -4339 -796 5330 -1215 -4252 3906 5285 96 1676 4067 -2292 -2212 2865 -763
423 -763 -5309 1168 3105 -5981 -6369 1511 193 -3073 1250 2774 -730 1259 3822 -1519 -1563 5386
439 5386 3748 -2581 -1141 2797 -530 -2686 933 565 -2476 -1556 -795 -3843 -2352 2317 445 -2650
455 -2650 1023 3336 -911 -1766 2853 2897 476 1557 2178 -358 -643 1450 -995 -2894 103 410 -3796
472 -3796 -3782 193 -190 -1556 2004 3177 47 -97 1356 -1172 -1433 3460 3451 -507 306 2504 -689
489 -689 -3018 1019 1412 -1964 -2067 -1143 -3228 -3014 1539 524 -1848 1258 3862 461 -1198 2714
505 2714 3554 216 -126 1633 175 -566 290 -644 -2507 -527 568 -2233 -2397 445 269 -2673 -1237
522 -1237 1623 809 375 2093 1877 130 2368 3523 -313 -1569 1475 482 -3439 -1162 2096 -1245
538 -1245 -3775 -875 -842 -3659 -372 2806 -429 -281 3685 1815 -1830 1711 4335 -74 -1066 1805
554 1805 -207 -2977 -102 756 -1915 -717 849 -2366 -2865 13 -701 -2925 508 2701 364 431
570 431 3457 2242 -349 752 1834 -271 -372 1117 -355 -2672 -1855 -620 -1559 -1793 -146 211 -1281
587 -1281 -632 910 -63 -201 2038 1361 -434 1603 2511 -18 -635 1834 189 -1756 15 563 -1807
604 -1807 -1663 264 -1548 -2474 349 1041 -1224 87 1933 149 -1016 1663 2572 796 961 1843 780
621 780 -955 -107 374 -2024 -2308 -245 249 -1253 -746 597 -721 -2184 45 357 -802 1407 2813
638 2813 459 -150 2016 890 -184 1975 1251 -1777 -1450 92 -2518 -2937 745 575 -2002 -302
654 -302 804 -1177 -1125 1270 684 141 2647 3061 377 72 1506 274 -944 141 433 -1323 -1752
671 -1752 -629 -1641 -2106 -244 428 -974 -93 1642 -161 -1038 2047 3209 580 636 1717 201 -634
688 -634 1846 576 -2153 -597 -80 -2765 -2348 198 -405 -1866 270 387 -1055 423 1906 1460 1198
705 1198 2122 850 -738 490 893 -208 -469 443 -65 -1612 -2117 -1711 -1171 -892 -193 223 770 247
723 247 329 94 185 1254 2278 839 -101 394 269 -605 -121 355 132 -108 -835 -2433 -2214 -385 -62
742 -62 -643 162 950 178 -535 130 1024 1408 1590 904 270 344 810 93 -591 -370 -29 -763 -1694 -1499 -429
763 -429 -363 -820 -137 137 -396 183 472 -153 1125 2039 928 263 1037 555 -625 -373 168 -456 -399 -245
783 -245 -2171 -1890 417 -51 -1124 -248 519 -530 -689 710 1138 1264 2038 1160 -273 504 511 -519 -727
802 -727 737 238 -1437 -1550 -315 -679 -1253 -1063 -394 -88 118 192 -153 447 1951 1571 425 329 1702
821 1702 933 -424 -124 214 -174 -665 -1119 -2270 -1707 -161 -282 -1146 271 1338 545 -154 1012 1264
839 1264 1199 1123 508 240 546 636 -84 -546 289 -202 -1632 -2053 -1115 -395 -564 -767 -438 562 769 208
859 208 166 872 1576 1562 813 429 680 1133 -137 -662 -499 -339 -1735 -1688 -1396 -808 -563 -206 18 145 917
880 917 435 276 511 1527 1271 298 836 804 240 115 -74 -355 -472 -761 -1872 -1992 -802 -90 -829 -880
900 -880 199 1098 684 385 1041 1401 1766 1135 101 -414 452 352 -1231 -691 944 44 -1514 -1600 -440
919 -440 -326 -347 -121 -803 -58 809 147 -589 1272 2377 860 -268 572 108 -99 -189 -396 -557 137 -231
939 -231 -2109 -1669 231 73 -677 -241 437 636 294 483 675 1222 1571 431 -648 34 495 -1 -86
958 -86 130 313 10 -967 -1757 -773 -250 -935 -579 22 66 -58 837 776 983 2004 1068 -314 -150 788 95
979 95 -714 28 196 -750 -815 -1123 -981 -266 364 -304 -755 522 311 -795 -147 870 1893 1406 559 195
999 195 702 381 -446 -559 43 72 -899 -1669 -1828 -999 390 -233 -610 422 745 -295 -135 556 1348 1342
1019 1342 1187 198 -129 864 339 -1133 -568 594 -594 -1348 -1104 -700 -442 170 -473 -932 325 700
1037 700 -300 -38 1683 1798 1255 759 411 -51 -18 -408 -728 -346 127 -1224 -1863 -1026 -268 -100 521
1056 521 237 82 327 -126 -233 995 2132 1649 601 394 436 -448 -398 -384 109 274 -294 -1389 -1632 -653
1076 -653 -281 -512 -37 797 741 518 475 67 743 1537 873 162 313 458 -646 -1109 -388 -136 -278 -727
1096 -727 -1127 -1461 -163 319 -257 155 1256 656 -278 275 685 562 1222 652 -652 104 777 -190 -701
1115 -701 466 250 -1369 -1763 -832 -595 11 528 43 -129 492 44 -196 553 1380 1043 399 273 235 137
1135 137 -361 -617 -508 -151 -281 -907 -1182 -1366 -150 -200 -294 437 1335 607 -413 244 577 401 425 1160
1155 1160 459 -131 208 -442 -1317 4 595 -1191 -1363 72 -336 -1110 -76 543 -273 159 488 -108
1173 -108 250 1545 880 -649 449 753 -438 -403 -51 -154 -627 -311 -884 -1203 -725 145 -765 -607 17
1192 17 615 220 -20 696 1143 1152 654 463 203 95 -316 -577 -410 -253 -27 -596 -1612 -805 -507 -799 -290
1213 -290 468 596 653 764 261 249 1057 1062 374 -7 480 -87 -659 -439 34 -455 -586 -408 -1015 -691 63
1234 63 -296 -376 352 599 482 157 960 906 611 554 -18 202 279 205 -613 -544 -145 -1014 -1270 -938 -269 -360 -324
1257 -324 206 433 207 358 260 350 809 1153 456 195 787 128 -508 -783 -98 -486 -454 -562 -887 -727 -287
1278 -287 44 -594 162 853 353 -317 555 986 635 565 809 267 -206 -38 -109 -962 -933 298 -422 -1098 -295
1299 -295 220 -459 -198 378 6 79 595 370 16 782 1072 221 135 382 256 -486 -44 150 -669 -514 -536
1320 -536 -905 -1014 -332 -12 -624 -113 811 305 170 1020 947 341 528 622 127 -370 41 -63 -832 -466 -235
1341 -235 -529 -1032 -465 -444 -635 -38 156 222 49 285 335 406 672 687 199 7 566 206 -369 -437 173 -531
1363 -531 -705 -501 -870 -724 -109 -172 -620 311 885 237 -56 950 802 213 551 459 -222 -78 324 -120
1383 -120 -478 -306 -118 -763 -1020 -392 -449 -17 28 594 -40 158 746 631 416 648 947 543 127 488 85
1404 85 -799 -527 -498 -886 -792 -427 -75 -597 -297 298 -68 151 770 460 30 444 603 201 781 917 192
1425 192 -776 32 -118 -721 -304 -111 -649 -638 -106 -387 -369 348 309 1 359 540 605 387 737 523 83
1446 83 -215 139 -154 -351 -453 -633 -523 -590 -441 -649 -584 -113 -22 92 380 109 640 338 449 1002 399
1467 399 401 429 69 -343 -206 -227 -509 -527 -311 -278 -970 -476 -21 -205 83 639 239 256 683 652 -76 576 899
1490 899 -32 -315 42 -243 -516 -415 -488 -586 -357 -425 -252 -280 41 221 135 285 211 607 226 166 456 292
1512 292 398 262 232 172 -243 -234 -415 -858 -414 -107 -456 -592 34 105 -119 267 603 192 526 1022 540 333
1534 333 724 301 -330 -233 385 -330 -309 -200 -245 -752 -480 -105 -487 -125 860 -68 -132 891 403 -61 189
1555 189 563 -1 82 190 274 -370 -230 -241 -993 -491 287 -59 -593 -208 -201 -182 -239 639 443 430 718 598 179
1578 179 3 715 255 -290 -122 23 -158 -653 -308 -46 -579 -497 -328 -358 308 658 228 -290 297 1082 546
1599 546 88 711 517 -348 146 16 -371 49 53 -727 -724 -156 -302 -879 -335 379 104 -171 453 427 83 576
1621 576 483 -40 202 724 291 -48 126 -106 -651 -668 -537 -318 -388 -492 -97 -295 133 339 94 -4 603
1642 603 782 292 87 626 441 -89 -204 131 -135 -322 -243 -820 -692 -17 -70 -579 -110 818 99 -359 196
1663 196 607 210 284 487 293 174 437 -232 -532 104 138 -481 -837 -9 -315 -379 -210 -57 -491 177 220
1684 220 -92 267 870 596 21 41 699 272 89 38 -145 -234 -535 -353 -626 -338 6 -303 -602 -425 174
1705 174 -52 -209 182 524 497 671 510 19 20 240 149 -262 257 110 -290 -662 -362 -356 -376 28 -16 87 -118
1728 -118 163 5 301 803 546 177 279 453 250 45 -186 -100 -189 -220 -627 -460 -154 4 -476 -505 39
1749 39 537 136 8 255 409 757 11 202 300 332 226 -12 -234 102 -238 -359 -795 -281 -154 -375 -439
1770 -439 -81 172 266 110 232 284 731 478 276 339 255 411 -167 -281 -257 -153 -455 -780 -425 -30 -117 -362
1792 -362 -124 -24 4 205 21 44 546 359 255 347 223 323 -72 -196 -295 1 -202 -735 -488 -312 18
1813 18 -277 -393 -91 132 185 354 198 424 491 269 222 461 245 114 8 -260 -129 -427 -584 -682 -308 -97
1835 -97 -325 -307 25 180 214 -35 -85 562 946 363 -142 10 284 55 -375 -173 -120 -118 86 -531 -568 -44 -274
1858 -274 -489 -294 80 311 -109 53 661 400 431 456 47 190 317 225 -201 -365 79 -120 -479 -342 -117
1879 -117 -161 -205 -264 -272 12 378 131 232 394 826 235 43 226 389 13 -100 -2 -95 -311 -495 -364 -310 -68
1902 -68 167 -74 -244 311 175 -205 99 482 591 255 406 211 -27 160 79 20 -113 196 -156 -760 -128
1923 -128 -177 -32 -308 -32 -60 -78 135 64 150 750 976 -7 167 237 234 -320 -73 -159 -202 -85 -343 -654 -374
1946 -374 127 -165 -601 -5 226 -15 -258 117 603 519 454 282 288 109 54 -313 -461 -307 274 -481 -681 -13
1968 -13 -50 -383 -465 69 -106 103 339 26 12 404 669 -89 55 177 140 -260 -100 67 73 -354 27 -397
1990 -397 -447 -114 -220 -329 -81 337 125 -63 289 508 329 432 322 254 241 125 -107 -87 106 -73 -401
2011 -401 -256 -220 -404 -331 -361 -210 358 321 256 10 277 387 202 26 388 321 42 -44 -130 26 -76 -481 -543
2034 -543 -248 -305 -117 -64 -439 95 331 55 -63 429 640 611 251 186 -19 -207 92 -21 -208 -113 78 -592
2056 -592 -677 60 186 -211 -320 71 -136 169 235 15 139 533 414 -262 418 383 106 -134 -215 -94 -201
2077 -201 -496 -159 -414 -595 -80 -387 -106 250 367 354 -27 292 279 133 253 60 -9 3 36 -23 -121 -127 -176
2100 -176 -536 -549 -31 98 -287 -162 219 -119 -100 344 410 270 379 309 -39 31 330 -2 -199 -63 -37 -246
2122 -246 -547 -222 35 -438 -180 -294 -294 291 334 99 -47 481 211 423 387 639 -138 -39 -54 -160 -136 31
2144 31 20 -614 -422 -325 -154 -169 -126 96 52 99 168 307 387 436 409 164 26 276 96 -177 -180 -231 -604 -412 -380
2169 -380 -160 -9 -190 116 -157 83 360 78 199 142 255 -44 45 269 284 -64 -244 -145 -205 -203 -151 -212 -487
2192 -487 -231 -168 -151 -7 355 270 -64 65 105 259 500 263 281 -63 -16 -235 -150 85 53 -58 -258 -327 58
2215 58 -165 -42 104 11 -71 213 187 332 272 385 95 23 19 131 186 63 -255 -562 -452 -106 -196 -384 -101
2238 -101 4 -219 -4 377 25 22 442 343 289 178 121 58 -267 95 -229 -189 -282 94 -202 -186 -87 -256 148
2261 148 258 11 -54 197 343 209 227 400 514 120 219 245 145 -358 -208 -191 -361 -204 -151 -382 -401 -293
2283 -293 -98 -420 152 313 159 314 352 208 260 62 149 74 -130 5 135 -173 -285 33 -571 -258 169
2304 169 95 -206 54 211 -78 256 245 184 113 266 298 84 -144 176 -60 -311 -97 -201 -108 -179 -8 -392
2326 -392 -18 11 29 -22 40 265 -37 95 270 211 37 343 81 136 -146 -189 -184 -387 -224 -116 -73 -64 58 -14
2350 -14 -174 -177 -218 142 155 264 -41 37 289 229 53 -21 -20 -33 -35 -106 -260 -256 -109 -113 -162 -132 -237 -166 106 -172 151
2377 151 -35 297 437 221 243 414 -252 -8 47 -173 -165 16 -188 -271 -361 -354 -180 -131 -132 283 209 205 285 120 114 302
2403 302 66 182 86 34 89 -296 -125 -53 -190 -141 -421 -109 -101 -247 -314 -35 38 -83 251 127 231 46 312
2426 312 45 354 182 -193 390 33 -293 -352 -299 -309 -203 -125 -101 -140 -120 158 183 238 185 391 244 326 -134 165
2450 165 -10 320 -110 -104 -209 -267 -196 -412 -257 -240 30 -33 32 64 36 -107 314 204 123 113 -81 227 353 -111
2474 -111 -151 -175 -346 -281 -213 -232 -73 -14 126 -201 -46 94 272 110 171 82 206 459 122 109 -63 -150 -188 60
2498 60 -201 -129 -100 -165 -311 -158 -297 -115 -412 -41 71 238 386 150 226 101 181 67 216 201 -143 -185 87
2521 87 90 31 -34 -167 -99 -251 -1 -182 -17 -55 -154 250 -21 234 51 186 137 377 -162 54 88 22 -84 -256
2545 -256 -298 36 -20 -319 119 -275 -2 70 84 117 255 316 329 244 128 417 261 213 25 -57 12 -86 -258 -188
2569 -188 -184 -174 -95 -34 -39 202 -64 53 109 -93 12 186 123 283 172 274 -8 -209 -132 24 53 11 -45 -90 -40
2594 -40 -36 2 -16 55 93 -8 566 264 100 287 -53 175 -5 116 61 260 -199 17 -288 -263 -326 150 -100
2617 -100 -268 -407 -63 155 -18 229 144 192 21 -26 174 110 205 -96 -133 124 -283 152 -123 -278 -350 205
2639 205 -253 -90 27 -59 2 119 68 173 264 161 9 146 165 -216 -196 75 -102 -47 -25 -184 -78 -297 23
2662 23 -85 -134 -14 274 25 -221 299 132 -68 100 -112 120 59 -161 137 -107 52 -107 -326 -245 -332 -267
2684 -267 -22 -194 43 160 315 -3 131 323 12 23 86 -69 63 -70 -26 -108 12 -169 -311 -96 -28 -239
2706 -239 -129 50 222 -16 -29 6 -235 128 183 314 47 224 34 28 -140 -249 168 -348 155 -2 -77 17
2728 17 -131 -116 -36 260 187 43 -2 135 275 94 238 -34 291 85 -46 94 -234 -228 -85 -201 -219 40 -73
2751 -73 -219 -160 174 -59 0 -23 13 126 -5 -88 370 393 105 -191 -191 -79 -26 -64 -344 -391 -146 -121 0 -178
2775 -178 48 212 -133 -159 171 149 335 229 -1 122 50 82 93 92 40 -143 -51 -199 -84 -227 -57 -431 -78
2798 -78 -1 206 142 -8 7 204 29 191 -64 193 -103 -336 -90 -152 -29 -194 -434 -106 -25 193 261 -136
2820 -136 97 228 141 -137 152 296 23 68 129 -49 -191 -136 -49 18 -79 -215 -124 -167 -263 -76 -173 -138 -54 77
2844 77 16 -74 100 136 470 181 -11 368 -176 108 137 140 23 135 120 -11 -245 158 -130 -81 -19 -41 -238 35
2868 35 189 284 287 96 199 176 -221 190 -61 -144 -58 -44 -295 -145 -132 -158 -172 -11 -60 125 -50 40 -6 -35 141
2893 141 27 -22 94 -53 149 -225 160 70 10 -6 -72 -121 -166 17 91 -200 -36 200 170 26 202 255 136
2916 136 175 -89 119 -14 268 -82 -170 -398 107 -101 -177 -131 -238 -31 -188 138 -40 -359 -57 299 -113
2937 -113 173 178 108 -90 -31 -10 -254 22 -155 -176 29 -255 39 -235 -27 -7 -9 -157 42 176 92 -69 154
2960 154 196 309 204 168 54 -36 -33 55 37 -26 1 -153 85 99 -127 -48 182 -332 99 -157 -111 203 191 125 192
2985 192 1 132 30 -155 -5 -52 -5 -131 -140 -82 33 -116 11 -45 -76 171 109 -10 322 66 54 23 21 -123
3009 -123 37 -153 -188 -49 201 -90 -256 84 119 -133 96 -11 86 107 10 250 -55 307 123 148 -2 419
3031 419 44 -154 72 23 -26 -205 30 -110 -419 -104 217 39 154 57 5 112 162 58 -77 443 66 89
3053 89 146 167 -47 -238 -141 -62 -100 -150 -61 76 -202 -27 -44 114 29 -44 -56 -2 126 -52 102 -24 92 73 -242
3078 -242 -143 10 -246 -50 -166 -230 -182 26 128 -24 -8 -28 -225 52 245 98 183 31 -118 -80 -84 162 25
3101 25 -98 -7 -290 -43 34 -145 49 -84 138 -76 63 138 219 2 59 179 183 105 135 -42 30 7 -17 30 -332
3126 -332 38 -259 -137 -132 25 -120 -218 71 63 -56 109 250 53 2 -23 -16 341 -97 116 -181 -132 186 -107
3149 -107 -114 -54 5 -44 -49 43 -11 -122 -74 162 221 164 74 -68 -14 178 112 -177 57 21 -70 -81 -166 -207 91 -260 -228
3176 -228 -29 63 121 255 -161 -75 -86 149 64 140 -35 85 277 -62 -199 50 197 132 -105 -314 -128 10
3198 10 33 -15 -259 46 -121 165 -36 227 177 96 145 178 -211 -108 -98 261 -55 77 -33 -8 -19 21 53 -494
3222 -494 112 278 124 184 307 -149 -206 77 191 19 6 -76 93 -362 -110 -74 -219 162 -421 -152 54 -66
3244 -66 -2 -32 -14 67 -107 160 44 138 141 -97 167 -21 -253 -196 -196 -27 -150 -2 91 -337 -181 58 -43 212
3268 212 193 -9 160 90 412 -82 -42 55 207 65 -108 -213 -72 -71 -276 -138 -208 -182 -5 -379 37 -151 -23
3291 -23 -52 107 79 93 59 -76 172 -242 -54 398 -130 91 -92 -28 308 -50 -201 -31 -73 -25 -44 46 48 163
3315 163 88 2 -30 283 163 -4 118 100 -20 -65 -194 -227 51 -24 -66 41 80 -70 -50 -159 61 -124 191
3338 191 117 -208 179 108 -194 -59 127 81 -58 -191 -52 -100 -275 -48 147 27 -95 100 40 -238 -135 272
3360 272 -79 105 296 112 -82 -123 118 -20 128 37 -89 -88 -100 -35 127 153 -77 -38 -173 -121 129 -107 -105 -208
3384 -208 127 -34 40 86 -55 -199 -183 21 -76 6 -151 -88 -197 -30 59 -19 111 16 66 -170 28 -68 125 83
3408 83 -49 25 129 92 -59 214 -228 -59 -161 34 -110 209 -20 -96 -155 -230 -8 33 241 140 119 -12 213
3431 213 95 86 169 -70 -21 54 -62 -26 -75 71 -106 -27 0 4 -145 135 170 165 28 -98 -85 238 8 -71 276
3456 276 261 -88 -171 162 296 -117 12 73 -22 -38 92 -45 36 -30 -18 199 17 54 -11 66 -271 51 -57 -204
3480 -204 332 159 122 -96 -80 -241 37 -81 -5 -104 -34 121 88 278 81 -57 138 192 14 -46 -23 154 -62
3503 -62 77 -273 61 -59 47 -44 -210 240 83 44 42 -20 -77 27 -101 -2 -39 -35 289 -361 19 -144 64 -141
3527 -141 9 -58 60 -209 293 195 -22 215 26 -142 124 13 174 -10 104 -153 166 198 -264 -89 70
3548 70 269 -18 -83 152 351 144 -83 23 100 -85 79 -114 225 43 126 44 -50 118 199 -22 200 134 -25
3571 -25 -191 -200 -300 -78 56 -27 3 -35 194 -94 -109 -97 -13 -17 -123 189 91 -135 -21 -56 -346 16 -63 -147 35
3596 35 -72 -121 -137 -20 -6 -63 -31 -5 -142 56 37 -177 -107 92 -227 -8 191 348 105 17 -188 158 -61
3619 -61 -182 175 -175 -162 -16 1 24 -64 -23 278 -46 106 143 135 -189 -87 -120 -144 169 86 -120 -130 -30 -53 213
3644 213 -75 -235 -81 44 -1 353 -59 26 5 -79 -34 -175 -272 92 51 -300 -81 -6 -291 152 -2 112 -266
3667 -266 -160 -146 69 -91 -70 -21 -91 141 104 126 15 219 -50 -53 -152 172 -285 -177 -162 272 -17 242 91
3690 91 196 72 41 25 207 -36 136 61 60 -23 196 16 -236 -258 -146 -260 -212 19 131 -140 -102 212 -283
3713 -283 -225 137 -46 65 25 88 174 -108 54 -112 48 -30 -2 -305 -153 -68 23 110 -56 -77 12 -27 73 64 -149
3738 -149 -140 -172 -35 247 64 200 -139 -240 -41 -26 61 -38 -109 97 -247 -46 130 -106 -63 144 -32 236 -2
3761 -2 -78 114 -75 -32 -78 95 91 -23 -145 117 104 -28 -111 -52 -204 -30 -201 -30 -75 157 229 108 -1 280
3785 280 157 226 156 -54 80 -185 8 -87 54 122 100 -23 -192 38 -106 -220 185 49 147 -1 286 313
3807 313 91 -215 -46 192 -23 304 -232 115 -102 25 55 -238 69 59 -250 59 80 100 41 29 85 50 4
3830 4 -180 82 176 -95 27 -202 127 -42 -133 -47 65 -227 105 244 -32 -21 -111 -284 22 119 81 149 -90
3853 -90 -86 419 -185 0 44 -150 47 -148 9 -89 -182 -256 68 -78 140 -200 -82 -57 211 103 145 185 -57
3876 -57 -66 80 25 80 -115 118 -76 -200 107 -104 -103 -23 -19 -179 58 -50 96 85 143 213 0 141 -251 166
3900 166 -44 -193 -138 -188 -133 40 36 -30 -95 100 82 -50 75 194 45 197 294 89 -88 78 -40 -222 120
3923 120 -98 199 160 -54 46 -140 8 -305 -61 224 -131 -64 -248 -170 -64 21 -187 12 86 -252 24 -131
3945 -131 -105 197 197 -164 -143 -52 155 101 -48 49 -66 -88 78 99 171 -98 23 -294 10 -24 -101 -107 163 -23 -21
3970 -21 -32 -97 1 -41 -169 -15 -64 -213 -185 -11 14 150 100 81 177 -23 32 -52 211 132 81 56 151 107 14 118
3996 118 23 -245 156 72 -11 -12 -46 -53 311 -6 -177 101 181 -78 246 -224 184 68 -25 -241 106 74 -133 -183
4020 -183 138 134 81 -49 4 176 -25 198 36 93 270 131 -72 50 31 69 -33 56 -161 -193 138 118 -84
4043 -84 -77 68 28 -63 -37 43 -55 -152 146 -59 171 53 94 -286 166 194 -21 44 -270 51 -210 108 -78 36
4067 36 155 0 98 -42 195 186 -63 15 -70 322 339 263 93 21 -221 95 -160 -192 -157 174 33 -72 -95 0
4091 0 -68 -95 -34 201 132 211 -191 -73 57 -14 131 128 28 136 8 -65 -157 87 -62 -121 51 -214 -152 -230 37
4116 37 43 -201 141 0 44 156 30 25 164 199 201 114 182 -193 141 -100 -253 -93 229 77 314 -101 0 -111
4140 -111 -34 -87 7 84 -100 93 -268 -37 135 32 -23 -2 61 -174 -86 -99 225 -96 -70 3 226 -98 339 -129
4164 -129 206 -291 -163 -40 11 289 202 -163 -115 117 -65 101 135 -373 81 68 -40 -334 -125 -46 -132 70
4186 70 -96 -50 -91 16 -199 160 -69 -69 -11 1 -150 -339 51 -34 -172 166 48 193 -15 59 120 148 -31 -92
4210 -92 9 -146 109 74 196 -125 -38 9 -34 79 -212 -133 79 -133 -61 -130 179 -228 197 66 72 77 75 177 -93
4235 -93 172 -74 14 -83 32 25 -5 -170 -117 5 134 156 -130 0 -16 -11 167 65 183 -106 9 -72 -57 148
4259 148 -127 -139 -200 23 -311 -24 61 -157 31 -39 144 -133 -31 -37 24 262 502 323 -155 18 40 -123 -103
4282 -103 1 -144 -75 -42 -138 143 231 66 -258 -187 80 110 1 266 38 -78 -219 -64 4 41 -26 -98 -14 -201
4306 -201 -97 31 -122 -127 -117 90 184 161 255 148 106 214 -126 -39 -127 -240 2 48 69 -141 61 -195 -53 -1
4330 -1 104 -142 -159 -28 -27 -88 -193 105 201 119 -90 -18 -137 -40 63 35 -95 -175 174 -173 -104 179 -156 -61 -350
4355 -350 -166 -44 -163 -12 22 -4 22 55 -176 -32 92 -90 61 135 107 -120 78 -87 -112 -57 20 137 -375
4378 -375 -107 -1 -66 88 127 -228 -8 -31 -261 -51 -20 15 282 -77 52 59 307 -91 -68 198 -68 171 184
4401 184 3 231 -315 -38 -7 231 -15 11 253 -87 235 77 256 54 206 -43 -80 -145 -294 -453 -94
4422 -94 6 -40 85 106 190 149 -10 16 183 -19 40 160 125 136 -89 -136 -49 -144 110 -16 -41 28 -54 -123 -60 -106
4448 -106 187 -85 -58 -89 249 121 35 93 85 135 -100 -168 -47 204 18 -13 -32 -11 29 -46 -148 94 74 -161 105
4473 105 -182 334 -11 -90 382 71 210 86 -86 -35 -45 -97 -158 78 -96 -109 -15 -41 55 32 129 -193 26 -42
4497 -42 75 124 9 -40 122 76 -124 -71 124 63 -13 -172 -180 -200 205 -171 -167 17 11 27 65 -177 -118 139 58 -29
4523 -29 -168 18 -24 38 47 -105 154 -124 60 85 19 2 107 -370 -84 6 142 -15 59 -278 -208 152 -191 -161
4547 -161 12 293 59 24 -157 -10 22 255 -114 43 -144 -25 2 -275 -64 63 102 -72 -53 147 40 -53
4569 -53 -1 134 -112 -39 6 -242 187 -62 58 -156 159 -112 -101 185 -116 -28 122 64 -229 251 109 132 76
4592 76 86 -80 190 -100 -75 72 -195 81 44 -102 129 -96 -156 113 191 161 149 -140 14 -113 -7 17 82
4615 82 57 -129 149 -33 -37 -229 190 68 183 -168 11 93 -172 141 28 35 -45 -60 26 43 -82 35 -6 20
4639 20 -34 -50 -281 90 -242 -104 -120 241 -314 -118 174 37 -47 -142 -253 -320 -131 -64 126 192 102 1 -23 144
4663 144 31 129 43 -265 -78 243 -114 -340 -122 81 -181 58 -56 -14 156 69 -141 57 -162 -149 -76 -63
4685 -63 -255 -141 -30 45 10 -78 60 -56 -77 122 33 -139 -1 2 153 34 27 -209 52 -48 -68 -284 -195 -198 -34
4710 -34 155 34 -277 -61 13 8 32 141 61 69 48 19 -24 -27 -23 -127 167 32 31 176 66 -5 138 -134 -47 -43 -68
4737 -68 -237 8 40 -59 -30 -169 277 83 -79 -100 -164 64 19 135 -213 28 4 222 -301 -18 -132 77 5
4760 5 -91 277 205 -41 58 -127 -39 53 -45 109 -6 75 31 12 143 -28 -159 -134 140 -73 -153 -155 -262 162 196
4785 196 -176 16 -99 -60 253 -247 142 111 -60 2 110 -39 -83 42 -182 170 -115 -63 -195 38 143 41
4807 41 -126 -324 -44 -200 92 -23 147 -102 88 31 -58 -22 162 94 99 -113 132 37 31 82 -84 -278 -144 133
4831 133 83 -96 -108 166 183 -274 -89 82 18 -148 9 46 -348 60 -180 234 152 -55 280 9 -224 -80
4853 -80 104 42 195 130 -64 145 -181 70 387 54 175 26 203 133 -201 -15 42 -127 106 3 129 -177
4875 -177 -4 133 179 -169 -119 -73 128 231 -65 27 -138 207 -66 -246 -95 -41 -155 -208 -313 -39 188 101
4897 101 212 -70 119 -34 -32 158 -97 8 205 131 -57 -50 44 -197 31 29 248 -100 -57 55 97 53 -95 77
4921 77 135 2 282 71 -95 138 -93 -167 -127 -141 29 -23 24 -48 -76 -142 -37 259 23 -270 31 -57 111 97
4945 97 186 14 70 -130 -129 -74 138 -68 195 241 -60 -8 118 3 25 337 27 23 -268 -152 -67 -373 66 -201
4969 -201 21 -104 114 66 33 3 -207 -133 -128 -74 -265 -32 293 50 87 -34 -181 49 -127 216 -85 175 201
4992 201 -93 385 294 83 -41 -158 0 -203 86 43 40 -232 -86 99 -143 -27 19 207 149 205 58 -225
5014 -225 193 -25 91 20 -198 -102 151 -21 -23 1 -231 158 6 52 21 -189 -110 -52 -124 -263 -11 42 -27 20
5038 20 -82 -54 12 -77 -66 -224 87 -92 -18 -18 186 -12 -281 -84 -19 43 -11 119 -170 2 122 4 -112 63
5062 63 146 -61 -40 -76 92 -185 -314 -136 -119 132 -208 -85 -136 184 33 -154 26 -18 113 67 -100 29 -164
5085 -164 30 181 171 40 -53 103 -174 -76 3 -32 13 78 -16 8 87 -7 25 -46 217 -207 -14 198 243 17 -181
5110 -181 150 68 184 119 80 -99 -71 187 102 -74 -95 -61 35 45 -45 -70 -272 10 64 -4 -71 238 53 62 -215
5135 -215 -8 131 -93 61 -61 -42 -96 -10 -21 126 -104 174 33 -29 168 55 27 -105 178 -26 9 138
5157 138 -85 127 169 -98 -5 133 80 -55 339 81 -53 -78 148 110 87 -41 -107 46 -118 -81 -75 18 -224 -84
5181 -84 60 135 -211 -64 37 -32 1 -133 170 185 -186 221 149 42 26 -22 -175 -122 -143 -43 -33 -57 2 66 225
5206 225 -170 -240 24 17 37 173 -190 114 125 -40 131 -87 162 -287 -72 1 2 -86 -11 59 187 -252 55 94
5230 94 -67 -109 54 -20 -212 97 -148 132 -90 132 -66 79 -83 62 63 269 21 25 252 -199 -47 309
5252 309 35 275 -57 16 -115 101 23 103 -4 214 104 -100 -19 -102 57 164 -155 -36 390 133 103 221
5274 221 -289 68 107 187 14 -27 -72 15 -55 -54 -92 -114 -169 66 152 127 -55 50 223 134 149 318 -71 41 41 -118
5300 -118 -89 -99 -94 31 -19 -232 129 164 27 207 24 42 -41 69 124 -51 12 -69 31 -117 -22 -49 -272 5
5324 5 -166 161 -52 114 64 297 -24 -7 91 -109 94 25 -59 -52 71 -6 -86 59 -8 -109 -32 -140 268 259 133
5349 133 -38 -126 -60 -87 6 25 84 22 81 192 314 -13 184 67 -139 -21 -11 -73 15 -183 -197 125 -232 127
5373 127 -34 -59 -107 -144 -201 -246 62 -48 174 -228 136 181 -130 -121 54 -59 155 -8 155 -23 -80 -43 85
5396 85 -53 220 29 -92 97 49 -19 87 19 223 201 117 -306 -72 -242 3 301 -15 -138 -15 65 -65
5418 -65 -166 -3 226 9 191 -94 -135 210 9 269 171 113 32 108 272 134 -160 48 127 13 104 163 -82
5441 -82 226 78 -28 154 -279 103 175 -63 -79 -239 -236 80 -22 37 -55 -153 62 -26 110 20 46 6 -18 -61 -9
5466 -9 12 -175 -106 24 -263 202 125 -150 75 45 44 25 79 -77 56 0 -163 -189 44 55 204 -204 245 218 -156
5491 -156 8 -18 -98 11 100 252 -100 172 -58 -109 205 -35 -26 19 97 -350 138 -37 137 -9 4 -71 4 -11
5515 -11 89 97 11 62 144 178 178 151 -54 127 -53 -30 -57 230 -151 160 48 -144 -214 223 -27 54 -96 32 -13
5540 -13 -74 13 23 -131 -25 187 -78 2 -66 101 118 46 -75 216 143 -124 133 35 -21 -3 -125 -40 -167 211
5564 211 -19 -71 -159 76 -14 206 36 -13 118 -10 330 119 23 244 -111 90 -105 185 -38 -13 -33 70
5586 70 -56 -367 221 -248 196 215 22 259 -113 47 -128 124 -101 233 61 -166 91 161 -133 -305 -118
5607 -118 120 -135 -285 40 -288 65 15 18 128 6 258 24 31 -106 -201 241 -60 245 91 -37 -117 -84 -104
5630 -104 48 -25 -81 75 -114 -66 164 -184 -59 268 -27 52 79 42 141 158 -4 30 -282 -14 -104 194 132 59
5654 59 50 -309 -268 -138 34 86 111 22 144 168 136 -30 15 -21 70 -28 -131 -192 -137 -139 20 -38 -264 45 1 -185
5680 -185 188 74 33 56 254 -129 -45 -103 262 128 -49 -213 219 154 60 -60 -59 -6 12 -14 -105 9 104 -233
5704 -233 73 115 161 261 54 -20 -114 29 204 33 -54 20 56 -184 77 -62 -227 96 52 -265 132 -55 -204
5727 -204 17 52 16 38 118 -39 120 229 -59 -65 260 -181 -46 -53 191 95 49 52 52 -261 58 -207 9 -93 -76
5752 -76 36 34 228 55 38 50 37 61 97 -6 -4 -147 36 -107 -39 -158 -6 -190 -21 164 -9 8 -86 -212
5776 -212 122 -67 74 3 -44 -66 -91 -137 -236 25 -122 65 65 101 38 81 152 170 -87 54 86 -31 86 90 119 -138
5802 -138 -215 74 289 -50 -162 62 229 18 -17 -143 -115 82 147 146 104 99 -111 129 -181 253 124 30 -5 281
5826 281 -122 45 -209 -77 -20 -167 158 9 40 115 50 -13 -270 -10 -7 53 8 -65 71 21 102 324 -1 -123
5850 -123 -45 63 -71 126 -68 -89 -136 48 -87 -226 105 193 -119 456 -107 -231 -233 -163 132 -93 -247 32
5872 32 -79 -72 162 21 -199 -206 -38 22 -138 15 -37 454 73 53 104 131 60 77 158 89 106 122 -184 137 -184
5897 -184 -23 -72 19 -101 -209 -142 28 -88 -12 132 14 43 -51 70 -253 -73 -164 67 -1 -63 -140 -71 -186 -185
5921 -185 155 129 -98 17 -107 -78 213 188 -85 27 321 141 -69 -254 177 150 -61 110 -20 72 -92 -37
5943 -37 131 8 -174 88 -283 170 139 169 -6 31 148 -98 12 16 -174 114 51 -331 88 170 50 -109 5
5966 5 84 -22 -61 109 -154 -45 50 145 -287 49 327 149 -48 134 41 -42 -36 260 -219 68 -10 2 -144 42
5990 42 269 96 116 70 28 -132 -20 128 16 -161 79 137 97 76 74 -22 31 142 199 -144 129 94 236 88
6014 88 221 -134 13 102 -280 -101 -2 225 -143 -130 -118 9 -35 -112 295 38 53 31 -366 -170 125 -5 113
6037 113 -209 -196 49 241 246 12 67 -70 -118 -2 -11 -22 35 36 -68 58 53 -45 91 -302 182 83 145 -63 -308
6062 -308 259 54 123 -11 145 17 34 -4 -146 7 -146 -48 36 -163 -158 259 54 85 94 76 22 -229 183 -116
6086 -116 7 74 39 67 -25 -157 -175 -14 -81 86 7 -159 79 115 -288 49 286 220 -96 127 -24 158 113
6109 113 159 14 -57 266 44 96 -129 -165 237 -43 124 58 -44 -97 54 -13 -189 43 17 -265 41 -71 -75
6132 -75 -224 -190 -99 -42 -148 -46 87 95 -190 68 -249 125 -79 -14 7 -46 56 -254 -17 -235 52 -10 38 -48
6156 -48 39 2 -56 24 185 -300 -248 -130 -115 -33 -95 -264 165 22 -19 -241 -85 119 32 81 -33 -45 144 121 -152
6181 -152 69 121 -74 -149 -345 114 53 71 -78 139 67 -53 -5 29 29 96 30 -289 166 10 -216 132 23 135
6205 135 -78 139 259 -81 -241 0 -94 79 161 -17 62 81 -138 120 113 -189 55 81 -107 -131 -145 -41 21
6228 21 152 -315 -241 83 -80 -186 30 101 226 -35 -18 -143 -2 3 -16 75 45 90 -38 223 83 198 23
6251 23 -78 99 -125 -125 168 -15 -135 -210 43 24 263 35 142 -30 -8 -67 -26 90 238 -145 41 -89 98
6274 98 -80 181 -59 -53 -42 -201 174 55 -106 93 -29 -94 -226 289 55 -194 -328 64 151 -13 177 -46
6296 -46 30 -88 179 -72 -123 31 -254 -3 -22 -87 196 132 -56 -276 -173 170 -204 -58 -149 209 -82 -145 -79
6319 -79 52 -324 -42 -267 227 52 57 -193 25 21 42 60 -92 183 -81 237 -64 254 97 31 -189 -69 54
6342 54 7 -329 280 -169 141 -71 160 88 42 128 26 74 105 -17 126 108 57 -48 -126 40 381 -165 -99 -99
6366 -99 -120 48 99 -122 79 -142 -119 -40 -139 18 -90 -4 265 8 -109 -128 -55 -120 -351 20 59 15 73 -111
6390 -111 304 -64 -17 -195 69 77 73 211 39 59 -37 -204 80 -19 -187 -189 117 149 -18 110 14 18 17 -58 88 -109
6416 -109 -6 129 -45 -204 -222 270 296 105 26 161 98 90 -137 -179 -136 184 142 -107 134 52 59 -219 -280 191
6440 191 123 -107 -182 24 290 -85 156 10 78 -144 -2 15 -110 -5 269 146 35 23 -39 58 -5 -18 187
6463 187 -86 -74 -79 -144 -67 -182 -201 70 73 -46 -102 -50 65 -6 -318 -60 -68 209 55 93 -217 20 -51 -123 32
6488 32 106 65 -86 19 128 -204 5 -10 63 156 114 -11 -151 -201 -32 103 25 67 65 145 -131 -214 87 105 -112
6513 -112 -206 -62 180 94 10 21 69 -349 -117 -62 16 -38 266 -94 -159 156 95 -136 -161 -246 -49 -113 59 138 0
6538 0 135 -214 19 19 -82 52 5 129 145 -97 -82 111 -18 -76 5 156 33 130 0 45 173 -113 174 -84
6562 -84 -90 -193 -31 -122 75 -295 -144 -195 43 65 -139 -82 -142 83 101 124 153 291 130 21 -167 166 -13 89
6586 89 -281 30 42 -118 74 -58 105 -357 -21 81 180 117 -56 -97 232 115 152 -58 33 -123 -137 -53 19
6609 19 340 54 16 4 112 -49 -40 -127 -67 -70 134 138 -294 130 -70 15 -73 -222 49 1 -9 219 -33 -96 -207
6634 -207 -120 -203 61 5 69 8 -105 -45 344 -5 -13 -41 88 116 78 12 -53 -66 -117 64 -32 83 86 38 101 -120 22
6661 22 -227 -104 112 -177 32 81 -190 18 4 49 -131 -264 -9 -111 -149 44 117 -93 39 -191 14 176
6683 176 -16 113 -92 81 -125 -86 -100 -18 146 -185 105 100 -55 47 139 147 -9 -129 -45 -141 -139 -201 -53 -299
6707 -299 -133 219 -38 311 -51 -27 28 -102 98 -107 61 28 249 87 210 2 -210 12 112 59 -136
6728 -136 120 -141 -26 188 174 86 16 204 147 112 -343 32 20 71 -24 -195 79 -229 16 14 140 40 -186
6751 -186 -97 -95 145 -163 -174 120 -207 214 -146 -9 -55 -48 138 25 85 -60 295 75 96 -30 9 51 -163 152
6775 152 -70 -112 -181 136 -100 139 -237 105 -28 27 52 314 167 -108 -82 264 75 144 -156 128 67 -246
6797 -246 -4 61 -53 127 285 -111 -131 110 -37 -33 219 -44 -160 -131 -120 205 16 116 -168 8 -93 183
6819 183 8 216 214 -128 166 92 67 44 -151 103 -13 137 16 189 160 -83 -86 110 142 -134 118 21 49 -94
6843 -94 197 204 -83 -52 163 -224 14 151 146 -8 -93 -143 48 -208 -202 -150 189 -123 0 46 76 122 27 67 75 134
6869 134 -162 109 -17 -3 95 22 2 105 -27 -38 2 -96 -237 34 -8 188 89 42 50 -120 -202 -13 -145 -20
6893 -20 -120 -37 -181 56 -29 105 -52 -160 -14 -127 84 42 83 172 -37 183 -57 -119 145 -59 247 -13
6915 -13 64 22 56 -157 -11 73 -108 -13 -161 -114 14 -48 58 -109 63 -110 179 -114 -82 97 129 25 -28 123
6939 123 179 158 39 29 9 -98 -65 -219 -19 -297 -103 52 139 107 46 -79 151 -46 -4 10 121 261 -195
6962 -195 -172 -66 24 121 -48 203 -224 108 -60 -219 181 16 43 92 95 -341 195 -35 111 81 -40 -29 23
6985 23 81 -78 36 -88 -40 -258 -110 72 -108 -220 -109 -128 -65 -18 150 16 -228 107 111 -98 50 99 206
7008 206 -90 -114 -85 44 293 -126 -128 -113 3 -9 -9 -318 38 -17 -108 6 271 239 128 49 30 -157 -363 -267 176
7033 176 -75 108 -135 237 119 -203 177 -105 -59 127 53 22 57 -24 -8 77 224 220 55 -143 -31 5 -33 78
7057 78 -28 70 -5 -39 -36 -40 23 117 -79 49 107 -158 146 92 32 110 112 176 -17 -20 -57 -81 60 -148 -117 48 237
7084 237 -98 -130 32 48 -47 -162 42 42 -128 -31 -31 57 4 -244 -17 -96 -161 91 71 92 19 -146 109 -171 -57
7109 -57 162 -111 205 -85 -80 262 -75 71 86 7 -188 -128 68 173 -133 -22 -88 52 -16 -115 -193 277 113
7132 113 -104 -172 -47 -85 -92 -40 -36 -30 162 57 102 -4 187 -10 -39 97 72 -121 6 150 110 40 105 -84 7
7157 7 -64 81 -32 -256 74 -114 3 -53 79 -86 -7 -116 -144 18 -143 -203 86 208 15 99 -137 -27 -141
7180 -141 -50 82 -113 257 22 45 34 164 -136 -10 -220 -117 109 -115 -311 -48 -14 -125 215 -87 -121 100
7202 100 -107 326 156 -139 -117 -109 87 36 -159 -4 -43 -144 67 -3 -188 -113 -175 24 -21 205 -111 69 -167
7225 -167 20 68 133 33 -145 40 39 21 -143 106 11 -107 89 -50 249 -92 -153 64 70 164 239 -275 121 -149
7249 -149 -75 250 98 213 -101 -274 -25 -271 18 -116 -152 -1 -160 -49 -153 -20 -125 37 176 -3 137
7270 137 -44 -26 -29 -70 -181 119 -85 90 -166 155 -207 -111 40 135 113 42 -105 14 -103 36 8 -108 104
7293 104 -11 92 121 -81 -9 -57 -114 120 -25 30 -6 -63 15 10 -34 -90 51 -12 121 -204 63 -165 -194 75 -51
7318 -51 -176 -5 -4 -67 57 206 -70 -122 159 17 -211 69 -58 70 139 -56 7 -44 -15 206 27 222 -26
7341 -26 59 -50 69 103 30 -150 -150 -267 -76 -63 300 103 200 115 72 121 -270 -168 -35 67 6 120 288 94
7365 94 81 -110 -94 211 82 259 121 129 49 -129 43 124 57 -131 -62 39 106 129 -13 16 15 162 224 151 63 110
7391 110 -113 -59 -317 8 12 -39 21 170 121 -58 150 153 -23 42 198 -371 21 -33 184 -131 -145 -355 -6 141
7415 141 -86 -33 209 66 47 -17 -91 -83 252 -101 70 155 101 32 181 -33 15 96 -60 -76 69 -157 -331 -259
7439 -259 -158 -49 -6 -236 67 22 -145 195 -10 267 -246 149 86 -122 -247 58 -116 170 -12 81 -15 2
7461 2 40 18 114 -153 61 -7 -58 219 -152 220 -133 57 134 -54 64 124 106 114 235 -162 -8 -262 -126 -95
7485 -95 -9 163 -16 -68 33 23 225 35 -23 21 223 73 37 336 -121 -178 -43 64 -16 92 182 244 -51 -334
7509 -334 19 121 11 -87 98 -210 146 -37 -74 -9 22 122 181 1 69 103 38 -179 83 15 -14 -34 -145 -94
7533 -94 -156 59 84 -37 39 -88 -12 48 -36 77 46 246 -51 11 -171 47 -34 -14 82 -194 115 -6 117 -70
7557 -70 1 -72 -72 73 16 102 270 -122 64 23 7 -33 135 -35 -38 -103 -8 189 -84 -11 -269 12 37 114 82 18
7583 18 -26 22 35 -13 -21 -86 85 53 248 -16 -147 -99 99 -188 37 43 -88 -1 16 -175 -14 279 -83 -226 -95
7608 -95 -83 -21 136 -162 -87 285 150 -423 -26 -52 -184 222 304 -33 42 -181 233 58 3 92 -8 -81 63
7631 63 134 242 -149 88 291 -193 11 -76 -66 60 69 -321 -231 48 -180 -49 28 -140 -103 -102 -105 97 10 93 -97
7656 -97 86 103 -94 7 -50 -37 -113 -33 -229 -206 -96 158 -178 163 -74 -49 -104 -22 -55 -187 84 67 35 -337
7680 -337 70 -31 -140 109 -14 91 87 43 -22 -45 52 -106 -133 5 -152 56 66 -40 96 122 -249 174 -198
7703 -198 17 79 160 -181 -72 184 44 34 -229 -227 -86 108 -98 36 44 -76 102 -44 -92 -303 -108 105 124
7726 124 -342 -136 -77 -197 102 56 -54 5 92 -110 127 -130 106 177 -200 4 -61 -225 40 -29 214 63
7748 63 -54 -29 -67 -13 109 28 49 -22 -101 145 -28 130 -177 -31 324 302 -97 205 -20 -174 11 -53 -204
7771 -204 40 -62 11 155 105 43 248 123 49 118 -173 63 14 7 37 -82 -29 112 13 -161 62 130 36 130 114
7796 114 -149 -77 169 38 24 -56 -181 -130 -20 -107 -173 135 25 15 -34 186 -176 62 -268 139 37 -98 -102
7819 -102 -66 -27 34 134 73 -173 112 70 -158 72 -68 127 -53 183 -145 205 -83 -30 356 129 93 -13
7841 -13 103 -97 -241 65 142 -191 -64 73 53 36 290 231 -75 -71 191 2 72 200 101 23 161 -34 -37 147
7865 147 12 -67 42 -87 -89 -308 18 -173 35 -87 80 218 -57 11 96 99 33 -108 25 -70 -48 8 22 151
7889 151 213 215 -176 42 144 208 -185 -141 138 225 187 -21 222 48 -70 -83 -46 49 70 -162 -48 22 -175 79
7913 79 48 -3 -6 -207 148 0 -144 271 10 5 -78 -91 -71 133 48 136 -272 -41 22 -41 -109 -14 -151 12 74 -88
7939 -88 206 77 -47 -21 -77 1 -7 2 -87 153 -31 186 -45 54 177 -125 -23 68 55 -131 -409 -42 -150 257
7963 257 -140 -66 51 -96 266 -56 144 4 179 93 189 -212 -138 -41 68 -42 63 81 329 -68 -6 -56 96
7986 96 -50 -169 -98 40 27 -128 167 -143 -38 144 -130 -47 58 21 38 -62 91 130 86 -82 -24 -61 -71 -211
8010 -211 240 -8 52 40 -127 -26 55 -75 -28 100 -67 175 -143 45 -77 -3 -21 -104 -139 16 170 169 -43
8033 -43 -45 53 203 -53 -125 -101 -190 -96 -77 -236 -10 -139 -49 45 -172 235 -20 279 -192 -84 31 -111 -93 -131
8057 -131 73 -59 124 -6 281 59 204 -37 -100 272 59 48 -68 -204 37 28 81 44 196 -156 322 107
8079 107 -40 -54 33 47 -3 27 79 -37 -185 37 -191 -88 190 -10 -97 84 195 73 38 -26 152 160 -12 -67
8103 -67 -74 249 -131 -182 91 216 -58 71 219 105 -43 16 278 133 -33 23 407 18 -101 -131 106 -49
8125 -49 -103 120 -32 64 122 -311 -56 32 38 -133 -170 61 215 -41 -68 -38 121 90 -41 278 -23 7 -22 -88 -16
8150 -16 93 41 57 43 -41 -123 -154 -17 -31 217 -154 56 -58 9 75 181 -197 -205 53 110 46 -150 -58 161 -86
8175 -86 67 22 -24 -55 -46 31 -203 22 17 -97 -36 -237 5 -74 -72 -106
8191a06
##END NTUPLES=NMR FID
##END=
