##TITLE=1H_SL31-DAU(B1)
 CDCl3
 64 sc, 
 6.3.2024
##JCAMPDX= 6.0         $$ Bruker NMR JCAMP-DX V2.0
##DATA TYPE= NMR FID
##DATA CLASS= NTUPLES
##ORIGIN= UXNMR, Bruker Analytische Messtechnik GmbH
##OWNER= root
$$ XWIN-NMR		Version 3.5
$$ Wed Mar  6 18:38:09 2024 Russian Standard Time (UT+4h)  she@DPX200
##.OBSERVE FREQUENCY= 200.1313
##.OBSERVE NUCLEUS= ^1H
##.DELAY= (6, 6)
##.ACQUISITION MODE= SIMULTANEOUS
##.ACQUISITION SCHEME= undefined
##.AVERAGES= 64
##.DIGITISER RES= 18
##SPECTROMETER/DATA SYSTEM= spect
##.PULSE SEQUENCE= zg30
##.SOLVENT NAME= CDCl3
##.SHIFT REFERENCE= (INTERNAL, CDCl3, 0, 15.7039)
##AUDIT TRAIL= $$ (NUMBER, WHEN, WHO, WHERE, WHAT)
$$ ##TITLE= Audit trail, XWIN-NMR		Version 3.5
$$ ##JCAMPDX= 5.01
$$ ##ORIGIN= Bruker BioSpin GmbH
$$ ##OWNER= she
$$ F:/spectra/data/she/nmr/H-F/1/audita.txt
$$ ##AUDIT TRAIL=  $$ (NUMBER, WHEN, WHO, WHERE, WHAT)
(   1,<2024-03-06 18:36:46.84 +0400>,<she>,<DPX200>,
      <continue with go, POWCHK disabled, PULCHK disabled
       configuration hash MD5:
       00 E9 B6 7A A2 85 ED C7 34 08 36 98 17 FE 4E 26
       data hash MD5: 16K
       35 50 5F EA 02 A4 8A 50 75 F3 18 29 33 17 32 99>)
$$ ##END=
$$ 
$$ hash MD5
$$ 93 84 53 B9 CE FE E6 43 CC E9 A0 22 BD F1 9C 8A
##$RELAX= 
##$RELAX= 
##$RELAX= 
##$RELAX= 
##$RELAX= 
##$RELAX= 
$$ Bruker specific parameters
$$ --------------------------
##$DU= <F:/spectra>
##$EXPNO= 1
##$NAME= <H-F>
##$PROCNO= 1
##$TYPE= <nmr>
##$USER= <she>
##$AMP= (0..31)
100 100 100 100 100 100 100 100 100 100 100 100 100 100 100 100 100 100 
100 100 100 100 100 100 100 100 100 100 100 100 100 100 
##$AQSEQ= 0
##$AQ_mod= 1
##$AUNM= <au_zg>
##$AUTOPOS= <>
##$BF1= 200.13
##$BF2= 200.13
##$BF3= 200.13
##$BF4= 200.13
##$BF5= 200.13
##$BF6= 200.13
##$BF7= 200.13
##$BF8= 200.13
##$BYTORDA= 1
##$CFDGTYP= 0
##$CFRGTYP= 5
##$CHEMSTR= <none>
##$CNST= (0..31)
1 1 145 1 1 1 1 1 1 1 1 1 1 1 1 1 1 1 1 1 1 1 1 1 1 1 1 1 1 1 1 1 
##$CPDPRG= <>
##$CPDPRG1= <>
##$CPDPRG2= <>
##$CPDPRG3= <>
##$CPDPRG4= <mlev>
##$CPDPRG5= <mlev>
##$CPDPRG6= <mlev>
##$CPDPRG7= <mlev>
##$CPDPRG8= <mlev>
##$CPDPRGB= <>
##$CPDPRGT= <>
##$D= (0..31)
0 1.2 0 0 0 0 0 0 0 0.06 0 0.03 0 0 0 0 0.0002 0 0 0 0 0 0 0 0 0 0 0 0 
0 0 0 
##$DATE= 1709735557
##$DBL= (0..7)
120 120 120 120 120 120 120 120 
##$DBP= (0..7)
150 150 150 150 150 150 150 150 
##$DBP07= 0
##$DBPNAM0= <>
##$DBPNAM1= <>
##$DBPNAM2= <>
##$DBPNAM3= <>
##$DBPNAM4= <>
##$DBPNAM5= <>
##$DBPNAM6= <>
##$DBPNAM7= <>
##$DBPOAL= (0..7)
0.5 0.5 0.5 0.5 0.5 0.5 0.5 0.5 
##$DBPOFFS= (0..7)
0 0 0 0 0 0 0 0 
##$DE= 6
##$DECBNUC= <off>
##$DECIM= 32
##$DECNUC= <off>
##$DECSTAT= 4
##$DIGMOD= 1
##$DIGTYP= 9
##$DL= (0..7)
0 120 120 120 120 120 120 120 
##$DP= (0..7)
150 150 150 150 150 150 150 150 
##$DP07= 0
##$DPNAME0= <>
##$DPNAME1= <>
##$DPNAME2= <>
##$DPNAME3= <>
##$DPNAME4= <>
##$DPNAME5= <>
##$DPNAME6= <>
##$DPNAME7= <>
##$DPOAL= (0..7)
0.5 0.5 0.5 0.5 0.5 0.5 0.5 0.5 
##$DPOFFS= (0..7)
0 0 0 0 0 0 0 0 
##$DQDMODE= 0
##$DR= 18
##$DS= 0
##$DSLIST= <SSSSSSSSSSSSSSS>
$$ [...]
##$SUBNAM2= <"">
##$SUBNAM3= <"">
##$SUBNAM4= <"">
##$SUBNAM5= <"">
##$SUBNAM6= <"">
##$SUBNAM7= <"">
##$SUBNAM8= <"">
##$SUBNAM9= <"">
##$SW= 18.0517328524113
##$SWIBOX= (0..15)
0 0 2 0 0 0 0 0 0 0 0 0 0 0 0 0 
##$SW_h= 3612.71676300578
##$TD= 16384
##$TD0= 1
##$TE= 0
##$TE2= 300
##$TE3= 300
##$TEG= 300
##$TL= (0..7)
0 120 120 120 120 120 120 120 
##$TP= (0..7)
150 150 150 150 150 150 150 150 
##$TP07= 0
##$TPNAME0= <>
##$TPNAME1= <>
##$TPNAME2= <>
##$TPNAME3= <>
##$TPNAME4= <>
##$TPNAME5= <>
##$TPNAME6= <>
##$TPNAME7= <>
##$TPOAL= (0..7)
0.5 0.5 0.5 0.5 0.5 0.5 0.5 0.5 
##$TPOFFS= (0..7)
0 0 0 0 0 0 0 0 
##$TUNHIN= 0
##$TUNHOUT= 0
##$TUNXOUT= 0
##$USERA1= <user>
##$USERA2= <user>
##$USERA3= <user>
##$USERA4= <user>
##$USERA5= <user>
##$V9= 5
##$VALIST= <valist>
##$VCLIST= <CCCCCCCCCCCCCCC>
##$VD= 0
##$VDLIST= <DDDDDDDDDDDDDDD>
##$VPLIST= <PPPPPPPPPPPPPPP>
##$VTLIST= <TTTTTTTTTTTTTTT>
##$WBST= 1024
##$WBSW= 4
##$XGAIN= (0..3)
0 0 0 0 
##$XL= 0
##$YL= 0
##$YMAX_a= 575749
##$YMIN_a= -722829
##$ZGOPTNS= <>
##$ZL1= 120
##$ZL2= 120
##$ZL3= 120
##$ZL4= 120
##$ABSF1= 10
##$ABSF2= 0
##$ABSG= 5
##$ABSL= 3
##$ALPHA= 0
##$AQORDER= 0
##$ASSFAC= 0
##$ASSFACI= 0
##$ASSFACX= 0
##$ASSWID= 0
##$AUNMP= <proc_1d>
##$AZFE= 0.1
##$AZFW= 0.1
##$BCFW= 1
##$BC_mod= 2
##$BYTORDP= 1
##$COROFFS= 0
##$CY= 11.3945322036743
##$DATMOD= 1
##$DC= 2
##$DFILT= <>
##$DTYPP= 0
##$F1P= 15.7292609196834
##$F2P= 12.9074282941183
##$FCOR= 0.5
##$FTSIZE= 0
##$FT_mod= 4
##$GAMMA= 1
##$GB= 0.15
##$INTBC= 1
##$INTSCL= 1
##$ISEN= 128
##$LB= 0.24
##$LEV0= 0
##$LPBIN= 0
##$MAXI= 10000
##$MC2= 0
##$MEAN= 0
##$ME_mod= 0
##$MI= 1.114404
##$NCOEF= 0
##$NC_proc= 0
##$NLEV= 6
##$NOISF1= 3.799351
##$NOISF2= 2.8
##$NSP= 1
##$NTH_PI= 0
##$NZP= 0
##$OFFSET= 15.70392
##$PC= 1
##$PHC0= -24949.93
##$PHC1= 18.58731
##$PH_mod= 1
##$PKNL= yes
##$PPARMOD= 0
##$PSCAL= 0
##$PSIGN= 0
##$REVERSE= no
##$SF= 200.130013532006
##$SI= 16384
##$SIGF1= 3
##$SIGF2= 2
##$SINO= 400
##$SIOLD= 16384
##$SREGLST= <1H.CDCl3>
##$SSB= 0
##$STSI= 0
##$STSR= 0
##$SW_p= 3612.71676300578
##$SYMM= 0
##$S_DEV= 0
##$TDeff= 0
##$TDoff= 0
##$TI= <>
##$TILT= no
##$TM1= 0
##$TM2= 0
##$TOPLEV= 0
##$USERP1= <user>
##$USERP2= <user>
##$USERP3= <user>
##$USERP4= <user>
##$USERP5= <user>
##$WDW= 1
##$XDIM= 8192
##$YMAX_p= 0
##$YMIN_p= 0
$$ End of Bruker specific parameters
$$ ---------------------------------
##NTUPLES= NMR FID
##VAR_NAME=  TIME,          FID/REAL,        FID/IMAG
##SYMBOL=    X,             R,               I
##VAR_TYPE=  INDEPENDENT,   DEPENDENT,       DEPENDENT
##VAR_FORM=  AFFN,          ASDF,            ASDF
##VAR_DIM=   8192,          8192,            8192
##UNITS=     SECONDS,       ARBITRARY UNITS, ARBITRARY UNITS
##FACTOR=    0.0002768,     1,               1
##FIRST=     0,             0,               0
##LAST=      2.2672688,     0,               0
##MIN=       0,             -722829,         0
##MAX=       2.2672688,     575749,          0
$$ Real data points
##PAGE= N=1
##DATA TABLE= (X++(R..R)), XYDATA
$$ [...]
2482b56J90Q87J23r6q1J13J66j80k12m71J0k47j19n84m22R46o16J60o14Q46M12
$$ -256 -66 821 944 848 767 880 1046 866 654 183 193 -54 -173 -757 -1179 -233 -849 -689 -1303 -457 -45
2503d5q7M41K83L06j83k41N64n61J53J68j52j048K27j146P37n10J85L3P20p77
$$ -45 -132 309 592 898 715 474 1038 477 630 798 646 -402 -175 -1321 -584 -1094 -909 -876 -156 -933
2523i33L59O66j72K71R5K50J694j173l69L1k40K05l47m67p4l89K63j010K25Q71
$$ -933 -574 92 -80 191 286 536 2230 1057 688 719 479 684 337 -130 -204 -593 -330 -1340 -1115 -244
2543b44p46p4L66Q24l61n16N57O23O84j23J287j478K5j31j83q98J018r03l51k58
$$ -244 -990 -1064 -698 126 -235 -751 -194 429 1113 990 2277 799 824 693 510 -388 630 -273 -624 -882
2563h82l21L51K4K74m8k20Q37J00j49J039o17O96l87N2L54j97P9j157j66J10O5
$$ -882 -1203 -852 -828 -554 -602 -822 15 115 -34 1005 388 1084 697 749 1103 906 985 -172 -338 -228 -163
2584a63p07L24r05R14L99m02O0N34O10j15M07m58N82n98O75L85k02p23j36o64
$$ -163 -870 -546 -1451 -537 -138 -540 -480 54 664 549 956 498 1080 482 1157 1542 1340 617 481 -183
2604a83j42j92M69o20p77M18j87N93K46L29l65j45Q99L24M30m62O54n65l26N41
$$ -183 -325 -517 -48 -668 -1445 -1027 -1214 -621 -375 -46 -411 -556 343 667 1097 635 1289 724 398 939
2624I39o67l91K63m39K9k40q36L77L39m09P68n59N91n08Q04J14J70L1K26K21n8
$$ 939 272 -119 144 -295 -266 -506 -1342 -965 -626 -1035 -267 -826 -235 -743 61 175 345 376 602 823 765
2645G65m69K31j30m41N11j200P85o20L0R0L86q36N89j60N92R3m14J080q67R00
$$ 765 296 527 397 -44 467 -733 52 -568 -538 -448 -62 -898 -309 -469 123 216 -198 882 15 915
2665I15k03L17l61m48L90q80m74J96K22m38m85Q4Q26j95K2J55k08N1N92O07LN53
$$ 915 712 1029 668 220 610 -270 -744 -548 -326 -764 -1249 -1165 -339 -534 -512 -357 -565 -514 78 685 688 1241
2687A241n82j22l3K1j24k7p11J33o4l73J86j13J29m87M34j75N85O85m30J45K13
$$ 1241 659 537 504 525 401 374 -337 -204 -268 -641 -455 -568 -439 -926 -492 -667 -82 603 173 318 531
2708E31m23J083P9j204L27O4k11j507J211m33J46k8P3n41M23m08P2L65K55J39
$$ 531 108 1191 1270 66 393 457 246 -1261 -50 -483 -337 -365 -292 -833 -410 -818 -746 -381 -126 13
2728A3R07r17J19L73n47J309m10j049L38l50j04Pn33L12k86O96p57RO99n97R32
$$ 13 920 3 122 495 -52 1257 847 -202 136 -214 -318 -311 -844 -532 -818 -122 -879 -870 -171 -768 164
2749A64%J79K63J39k55J80M44r25P68j117J158j180j04P10r45q23J237l02k10
$$ 164 164 343 606 745 490 670 1114 189 957 -160 998 -182 -286 424 -521 -1344 -107 -409 -619
2768f19K76k72M27L83N67j13o19N78L73p88J387j218K07L67r48o47L81o2j35l92
$$ -619 -343 -615 -188 195 762 649 30 608 981 193 1580 362 569 936 -12 -659 -278 -340 -475 -867
2788h67O58q66R2M73K94O48k1N9r4O3L45K6m20J72L72o50n26n20N99p61n91P30
$$ -867 -209 -1075 -983 -510 -216 432 411 470 376 439 784 810 390 562 934 284 -242 -762 -163 -924 -1515 -785
2810g85M39m25j2j15R63K7o3N41n49N49O5m38J26J1l40O84o39j2P37q80p69k9
$$ -785 -346 -771 -783 -898 65 92 29 570 21 570 635 197 323 334 -6 678 39 27 764 -116 -885 -914
2832i14j48Q18M6j32K6K83k35N03N99n03M08k14j068J095j011Q85l11m31L54K99
$$ -914 -1062 -244 -198 -330 -304 -21 -256 247 846 343 751 537 -531 564 -447 438 127 -304 50 349
2852C49p04l20L33k16l10N3J123o65J323q09L93J80n67O23M01q12k78l1j6m4k13
$$ 349 -355 -675 -342 -558 -868 -815 308 -357 966 157 550 730 163 786 1187 375 97 66 50 6 -207
2873b07l80l70K11p3M07Q8K2N74n72N80m73LL09M62K64q52K66p2K8o85K30K47
$$ -207 -587 -957 -746 -819 -412 -324 -302 272 -300 280 -193 -190 119 581 845 -7 259 187 215 -470 -240 7
2895Gm04p3m97K72k46O82n27N49N59j61m0J84O50m00o4j95k2j02K5K30p42Q6l77
$$ 7 -397 -470 -967 -695 -941 -259 -786 -237 322 161 121 305 955 555 491 296 274 172 197 427 -315 -229 -606
2918f06Mj69m12J002j18m96N80kN57n6L87l91k72O65or5M03k55o08O51p40n25
$$ -606 -602 -771 -1183 -181 -299 -795 -215 -217 340 284 671 280 8 673 667 572 975 720 112 763 23 -502
2940e02M63Q95j578M6l55M80k75R72k47k26J011o91O98r12R99j16L14j92L36j229
$$ -502 -39 856 -722 -676 -1031 -551 -826 146 -101 -327 684 -7 691 -221 778 662 976 784 1120 -109
2960a09K93n61J41j51K02P06j948J708l73p87O57L27L22l28j21Q20l52Q18n23
$$ -109 184 -377 -236 -387 -185 521 -1427 281 -92 -879 -222 105 427 99 -22 798 446 1264 741
2979G41m54J93L04k57p01Q4j72r62N83L62%M5O2j29J36O55m06M1K66M02p56N80
$$ 741 287 480 784 527 -174 -90 -262 -1224 -641 -279 -279 -234 -172 -301 -165 490 84 125 391 793 37 617
3001F17l81M17l51M25m51K26p64p31M60N10l72M34mk96J79O94L16p83L33k23P41
$$ 617 236 653 302 727 276 502 -262 -993 -533 -23 -395 39 35 -261 -82 612 928 145 478 255 996
3022I96k81m24m58P27m94n86J065p45n17J74J21J06j23k85J062r8M76q40O66n30
$$ 996 715 291 -167 560 66 -520 545 -200 -717 -543 -422 -316 -439 -724 338 240 716 -124 542 12
3042A2K94N10q3j05r50N96M12M3q12p82R56k54p7K5k15l09M9O20l96P98m10K24
$$ 12 306 816 733 628 -322 274 686 729 -83 -865 91 -163 -240 -215 -430 -739 -690 -70 -466 332 -78 146
3064A46L74n05PQ79n80j80j01n52O54j80o0n39l5J70q8m16J051m70P46N07o28
$$ 146 520 15 22 901 321 141 40 -512 142 -38 -98 -637 -672 -502 -590 -1006 45 -425 321 828 200
3085B00j28O36O6l72m2O47n62q52L6O65p84J92L18m65J87r1p11K64R01j62k17
$$ 200 72 708 774 402 360 1007 445 -407 -371 294 -490 -298 20 -445 -258 -349 -1060 -796 105 -57 -274
3106b74L69M82k49N37j36p40L53m97J211n59J023j688j45J50o61P56l85k24qQ44
$$ -274 95 577 328 865 729 -11 342 -155 1056 497 1520 -168 -313 -163 -824 -68 -453 -677 -685 159
3126A59l49L62N18j9K41k81j49p4J42J41m99P07j462J98N93o60K25N39p01k01
$$ 159 -190 172 690 671 912 631 482 408 550 691 192 899 -563 -365 228 -432 -207 332 -369 -570
3146e70L72J7m90K24K9Q20k43K83M15k24R3l71j19k59J69m28j62M45p30O79j071
$$ -570 -198 -181 -671 -447 -418 402 159 442 857 633 726 355 236 -23 146 -282 -444 1 -729 -50 -1121
3167a121q2J421m92J46J98M68M3j5k16m64M25J3O21N3m58l15n84K26M51j110O71
$$ -1121 -1203 218 -274 -128 70 538 581 566 350 -114 311 324 945 998 540 225 -359 -133 318 -792 -121
3188a21k46K8k56%K6O28N73l03l6J03m58O12l49J53M79j264Q36j264J082r53P13
$$ -121 -367 -339 -595 -595 -569 59 632 329 293 396 -62 550 201 354 833 -431 405 -859 223 -730 -17
3209a7j001N42k69J34R55n62L10l88J077m33l10J014l1k56o16J04l18k88k51J085
$$ -17 -1018 -476 -745 -611 344 -218 92 -296 781 348 38 1052 1021 765 149 253 -65 -353 -604 481
3229D81m37k66j9K85m11N2j09m45N4J80M69N9J409r78j24L34L35k51P0n34m66
$$ 481 44 -222 -241 44 -367 -315 -424 -869 -815 -635 -166 -107 1302 324 200 534 869 618 688 154 -312
3250c12L68m86K07k85j40O52p74O41l78Q6J17N27p4O22m73M20r39P54J51l90p0
$$ -312 56 -430 -223 -508 -648 4 -770 -129 -507 -421 -304 223 149 771 298 718 -221 533 684 294 224
3271B24l09K23o8P6n84K6Q19q77k1M08r66J939j144l52N71O25k24K01l77k81n1
$$ 224 -85 138 70 146 -438 -412 407 -470 -491 -83 -1049 890 -254 -606 -35 590 366 567 190 -91 -142
3292a42M21o01o79O94o8K82j50N40o34k55k95k69R25k66Q08n66O11k90P33q92
$$ -142 279 -322 -1001 -307 -375 -93 -243 297 -337 -592 -887 -1156 -231 -497 311 -255 356 66 799 -93
3312i3O08l63M76l74K45n12n4k05O48o47o3k53P42o64k29R05m30m4M94%O38n96
$$ -93 515 152 628 254 499 -13 -67 -272 376 -271 -334 -587 155 -509 -738 167 -263 -307 187 187 825 229
3334B29M22m81m37p4P4Q18j20n98p4J66l70p26P33N31p16Q01k49p36O66M47j39
$$ 229 651 170 -267 -341 -267 551 431 -167 -241 -75 -445 -1171 -438 93 -623 178 -71 -807 -141 306 167
3355A67M50n70N65k59j87k89N44p05l86L93n09M83M12m33j88P32J74l9k59l11
$$ 167 617 47 612 353 166 -123 421 -284 -670 -277 -786 -303 109 -324 -512 220 394 355 96 -215
3375b15L31J43L1M95o36M15J54p96n07N75N70p21RN8l64j49j41N71l9j43K11O11
$$ -215 116 259 290 785 149 564 718 -78 -585 -10 560 -161 -152 -94 -458 -607 -748 -177 -216 -359 -148 463
3397D63j60N40j107Q11n62K51J124j854O7O80o58P57j015R09m09j021J265l03
$$ 463 303 843 -264 547 -15 236 1360 -494 -427 253 -405 352 -663 246 -163 -1184 81 -222
3415b22j04J127n16K48K4k50J72j53J32l70j81N48n3k79J88p75O74l63n20Q79
$$ -222 -326 801 285 533 557 307 479 326 458 88 -93 455 402 123 311 -464 210 -153 -673 206
3435B06m63q7K95K56k18J20P24m68j01K58k2m02j61Q7K20o31K15k54J22m15R23
$$ 206 -257 -344 -49 207 -11 109 833 365 264 522 500 98 -63 24 244 -387 -172 -426 -304 -719 204
3456B04J6q32O68k82r9l03P56J44L31L87r04J46K96J66j85l53J03n11P90m84m95
$$ 204 220 -612 56 -226 -325 -628 128 272 603 990 86 232 528 694 509 156 259 -252 538 54 -441
3477d41J22j37o4q85J410m26P08j17l25K47j2O56l12q7n94K65M93k82K61M21j375
$$ -441 -319 -456 -520 -1405 5 -421 287 170 -155 92 80 736 424 337 -257 8 501 219 480 901 -474
3498d74N78L14j019L70p13J370k72p51P31K05L87n38j76o2Q91j252Q28j17k11
$$ -474 104 418 -601 -231 -944 426 154 -597 134 339 726 188 12 -50 841 -411 417 300 89
3517H9n04O58J06q43Q74r21J67r8o78Q38N68j234P60M20k62k21Q60J31m86M86
$$ 89 -415 243 349 -494 380 -541 -374 -472 -1150 -312 256 -978 -218 202 -60 -281 579 710 224 710
3537G10l00m10L5j37O39n68l76j78J70O10n68P42l41k54L02m46N82L17l97m8p1
$$ 710 410 0 35 -102 537 -31 -407 -585 -415 195 -373 369 28 -226 76 -370 212 529 132 84 13
3558A3K77m15P12m39k0o7j09L9K58j53r12J005j77n15J083k13j90r6k47l06O82
$$ 13 290 -125 587 148 128 61 -48 -9 249 96 -816 189 12 -503 580 367 177 81 -166 -472 210
3579B10k9k88M88k07l25P31n97K73o53o1M63j86J46o07J312q55K55p35J042j90
$$ 210 181 -107 381 174 -151 580 -17 256 -397 -458 5 -181 -35 -642 670 -185 70 -665 377 187
3599A87P06k42j51K66j7n45L08j94m44R9j70k70P15p62l47L64Q19p17O01p3m00
$$ 187 893 651 500 766 749 204 512 318 -126 -27 -197 -467 248 -514 -861 -497 322 -395 206 133 -267
3620b67K42O58p22N45k54k7j83M85p80K15L69o44l01N60n68Q33n97P17n66L13
$$ -267 -25 633 -89 456 202 175 -8 477 -303 -88 281 -363 -664 -104 -672 161 -436 281 -285 28
3640B8L87l70N93k21K46n63N74j144R10j32m70OM22k07p9k52L07m62k07N92L99
$$ 28 415 45 638 417 663 100 674 -470 440 308 -162 -156 266 59 -20 -272 35 -427 -634 -42 357
3661C57o56K81J30l93L70N98k70l21R3L1L65l35l32M0k54m8K01K62m98j22N38
$$ 357 -299 -18 112 -281 89 687 417 96 189 220 585 250 -82 -42 -296 -344 -143 119 -379 -501 37
3682C7m36N44n25K04R49o83O05p58Q65r69L7L12J2j11k7J60j260J261m40K53Q2
$$ 37 -399 145 -380 -176 773 90 695 -63 802 -167 -130 182 194 83 56 216 -1044 217 -223 30 112
3703A12N8o46J45j27P6R72j71k57M7j01k53r3O48l30J63J72o67J03Nk95M89j5
$$ 112 170 -476 -331 -458 -382 590 419 162 209 108 -145 -238 410 80 243 415 -252 -149 -144 -439 50 35
3725C5k20O23q33J15J122m34j33L5L60o18L26m74L38o11M63j96O94p72R21r58
$$ 35 -185 438 -395 -280 842 408 275 310 670 52 378 -96 242 -369 94 -102 592 -180 741 -217
3745b17j52M71o97M13m33L78N64j09n68O29p8p04P56j12J27p62L03L34o08J131
$$ -217 -369 102 -595 -182 -615 -237 327 218 -350 279 201 -503 253 141 268 -494 -191 143 -465 666
3765F66k77p63k97P24J49l17M0m35O39J67K4LJ48J81J71p08M87K09j683J442J5
$$ 666 389 -374 -671 53 202 -115 -75 -510 129 296 320 323 471 652 823 115 602 811 -872 570 585
3786E85m64K29p37J70l19j24K45O18L3L29r23P26J5r91J276l46p57Q79o17N27
$$ 585 121 350 -387 -217 -536 -660 -415 203 236 565 -358 368 383 -608 668 322 -435 444 -173 354
3806C54pj2o47K44K13m06M00n84M29o4k83n4M60J66M6K13n23L48L55J61K60j116
$$ 354 347 335 -312 -68 145 -261 139 -445 -16 -80 -363 -417 43 209 255 468 -55 293 648 809 1069 -47
3828d7j81P9k43K73L43j377Q08j78L70m56J48J004n1k74j59K42L60l04l38k76
$$ -47 -228 -149 -392 -119 224 -1153 -345 -523 -153 -609 -461 543 492 218 59 301 661 357 19 -257
3848b57J64N88m62o3j19P62o93m09L31R0n1K97m1m65L64j20M97J02k37N74L82
$$ -257 -93 495 33 -30 -149 613 -80 -489 -158 -68 -119 178 137 -328 36 -84 413 515 278 852 1234
3869A234p80m14l6k11K07k25p6m1J67K32j32m49O7J27N26M6o64M68L56J18l40
$$ 1234 454 40 4 -207 0 -225 -301 -342 -175 57 -75 -524 -457 -330 196 242 -422 46 402 520 180
3890A80L82n41j47p14J124j15r9r3Oo03J48K84N30R6l54r1K71K6o73q4M55R62
$$ 180 562 21 -126 -840 284 169 70 -23 -17 -620 -472 -188 342 438 84 -7 264 290 -383 -467 -12 950
3912I50n43m29K52K92J98j003m17O64n57K8K5N4q8R3L97j42p1N08j12L36q27K65
$$ 950 407 -22 230 522 720 -283 -700 -36 -593 -565 -540 -486 -574 -481 -84 -226 -297 211 99 435 -392 -127
3934a27K51k2J84j00p00N67P2K75L89q13j71O0P2J44M02r03O12op68J152m77j22
$$ -127 124 102 286 186 -514 53 125 400 789 -24 -195 -135 -63 81 483 -420 192 186 -582 570 93 -29
3956b9n12Q19j18o34L42K02K07Q6r95L72J43n31K01R09o64L22m49o16J132m17
$$ -29 -541 278 160 -474 -132 70 277 363 -632 -260 -117 -648 -447 462 -202 120 -329 -945 187 -230
3976b30R29o62n17Q75k0P5R2l03M84j501P51j038J357q08O1J6R80n25K86m91l65
$$ -230 699 37 -480 395 375 450 542 239 723 -778 -27 -1065 292 -516 -455 -439 541 16 302 -189 -554
3997e54J039q08O60l42K80k54P08k72m64k0M99q07k5O37n60j43L17M11k3o68n6
$$ -554 485 -323 337 -5 275 21 729 457 -7 -27 472 -335 -360 277 -283 -426 -109 302 279 -389 -445
4018d45K0J197j544J196j55n7M08j715J447j55k82O4o43Q83k26p0K02l61k05M75
$$ -445 -425 772 -772 424 269 212 620 -1095 352 197 -85 -21 -664 219 -7 -77 125 -236 -441 34
4038C4k94Q35j373Q93m56P03k23k54P30K93r23K29M53r40o53L82Q78n95k21J68
$$ 34 -260 575 -798 95 -361 342 119 -135 595 888 -35 194 647 -293 -946 -564 314 -281 -502 -334
4058c34k22N23p09R32j43r8n10K59p8P1l23J325J95o94N4j52L10o05J12p43P70
$$ -334 -556 -33 -742 190 47 -51 -561 -302 -380 -309 -632 693 888 194 248 96 406 -199 -87 -830 -60
4079f0M71r21K36p4J4N70l20K46j93M22j052R05N9J27j25n01N78J4l10J38k50
$$ -60 411 -510 -274 -348 -334 236 -84 162 -31 391 -661 244 303 430 305 -196 382 396 86 224 -26
4100b6J43m85M22J51m10m8L21L36q32N56N0q5J04O1o82q0M24Q8J15O2m02Q8K28
$$ -26 117 -368 54 205 -205 -253 68 404 -428 128 178 93 197 258 -424 -504 -80 8 123 185 -217 -129 99
4123I9J0q49O90j25M81j59n81N32K33p76R29r14J84P46m95O46j117J809j626J2
$$ 99 109 -740 -50 -175 306 147 -434 98 331 -445 484 -430 -246 500 5 651 -466 1343 -283 -271
4143b71O84o8l94k75O66k79n50Q97k0k66L85q50K29j84K83k57K72L21m53l25M74
$$ -271 413 345 -49 -324 342 63 -487 410 390 124 509 -341 -112 -296 -13 -270 2 323 -130 -455 19
4164A9o29L21L40l7M0j71j10l86J3Q52J04l55M9m1K51m13L9K65L81M2j9j098J015
$$ 19 -610 -289 51 14 54 -117 -227 -613 -600 252 356 1 50 9 260 -153 -114 151 532 574 555 -543 472
4187D72j54k43l11K25q91J262r46J90J45k35L76j17J228j022J03K92L2p81O13
$$ 472 318 75 -236 -11 -902 360 -586 -396 -251 -486 -110 -227 1001 -21 82 374 406 -375 238
4206B38M2k5n77Rk55k42Q71j50o8L24M1m82o1Q41m41J60l88j57R81m49l64K62
$$ 238 280 255 -322 -313 -568 -810 61 -89 -157 167 208 -274 -335 506 65 225 -163 -320 661 212 -152 110
4228A10j9K57j95r9k79K01K81p87N51J45j71J87m24N62k32L81j33J10K84j094
$$ 110 91 348 153 54 -225 -24 257 -530 21 166 -5 182 -242 320 88 469 336 446 730 -364
4248c64J96J304r20L59M7n86L4o2L34k25n59K59R4m35K04K21K29j1MK48j422J708
$$ -364 -168 1136 216 575 622 36 70 8 342 117 -442 -183 -89 -524 -320 -99 130 119 123 371 -1051 657
4270F57j07k5m38P50n71j113M57M30n10P26n07Q57n56M61m68o69J323l90l44L7
$$ 657 550 525 87 837 266 -847 -390 40 -470 256 -251 606 50 511 43 -626 697 307 -37 0
4290@L62J20n26N59J12j167P02N26k40n49l12M27K29n15j2J44r8m79J080n0K41
$$ 0 362 482 -44 515 627 -540 162 688 448 -101 -413 14 243 -272 -284 -140 -238 -717 363 313 554
4311E54k25O3n08K91J58J17j74j132L66M84n48L15J10P35r45n7Q10o23L35m16
$$ 554 329 392 -116 175 333 450 276 -856 -490 -6 -554 -239 -129 606 -339 -396 414 -209 126 -290
4331b90L90l07M45Q08p93M45j175P52n68M59q3K5p8N96r89L31k89N69l03K8p67
$$ -290 100 -207 238 1046 253 698 -477 275 -293 166 83 108 30 626 -363 -32 -321 248 -55 -27 -794
4352g94O90K52R9L18l18l46O33o2n36M95K90m64R6j00p46M85K88J20k35J37l31
$$ -794 -104 148 247 565 247 -99 534 472 -64 431 721 257 353 253 -493 -8 280 400 165 302 -29
4373b9o06L99Q29n29N94j117M04J33j82N59K49p07k91K35N01l87R6Q6p84N12K28
$$ -29 -635 -236 593 64 658 -459 -55 78 -104 455 704 -3 -294 -59 442 55 151 237 -547 -35 193
4394A93k39p81R69n77R83n54K6k55j73O43j95R6l36L8k57j01M13J32K25j123J135
$$ 193 -46 -827 142 -435 548 -6 20 -235 -408 235 40 136 -200 -162 -419 -520 -107 25 250 -873 262
4415B62j77j89L99n49L65j31k65j75K65P66l01l25l2m24Q71q50P35l80L65m48
$$ 262 85 -104 295 -254 111 -20 -285 -460 -195 571 270 -55 -87 -511 360 -490 245 -135 230 -218
4435b18O79q99k02J48P35p07K87n67N02L06J32l58K5N86p45O05M60p85m20O03
$$ -218 461 -438 -640 -492 243 -464 -177 -744 -242 64 196 -162 -137 449 -296 309 769 -16 -436 167
4455A67p13R73p13k30Q64j079K79K09Q39J6k36l25o47J26O62J01m63L61J3l63
$$ 167 -546 427 -286 -516 348 -731 -452 -243 596 612 376 51 -596 -470 192 293 -170 191 204 -159
4475a59Q4N6K40N13o46K01L03r86J37K93K98j118J440o32K81k58Q1N35j98J40
$$ -159 -75 -19 221 734 88 289 592 -394 -257 36 334 -784 656 24 305 47 128 663 465 605
4495F05j031r6N82O74q01j13l9M21m19m51J147q51K54j63J23m4L98L12p73N62
$$ 605 -426 -522 60 734 -67 -180 -219 202 -217 -668 479 -372 -118 -281 -158 -202 196 508 -265 297
4515B97O19r13l32K33j50L36n8m05L23J67o63P0n2O20p27N89J76M02J47R5l31
$$ 297 916 3 -329 -96 -246 90 32 -373 -50 117 -546 -476 -528 92 -635 -46 130 532 679 774 443
4536D43j136J488o34m87J01J95j23P60q24K67l76L26J06J58n28K8L46l26o14Q47
$$ 443 -693 795 161 -326 -225 -30 -153 607 -217 50 -326 0 106 264 -264 -236 110 -216 -830 17
4556A7J6M06q77N26lR76j472J15O93o26lq0J08P97p48o1K33j50O46j17m60J64
$$ 17 33 439 -438 88 85 1061 -411 -296 397 -229 -232 -312 -204 593 -155 -216 17 -133 513 396 -64 100
4578A00K94q3n63m05J224l57k4N64q60j94L95l4k15J91q3M49j092k1L39K28j24
$$ 100 394 311 -252 -657 567 210 186 750 -110 -304 91 57 -158 33 -50 399 -693 -714 -375 -147 -271
4599b71k33J106l24k42m6L24p78L53n3J28L08m11L83j87On15L33m38P51m34l21
$$ -271 -504 602 278 36 -10 314 -464 -111 -164 -36 272 -139 244 57 63 -452 -119 -557 194 -240 -561
4620e61Q83n73P8O54m78N4q3q9L46m17Q89j59l1n77o58L66k26J56l3j42M49L65
$$ -561 322 -251 -173 481 3 57 -26 -115 231 -186 703 544 513 -64 -722 -356 -582 -426 -459 -601 -152 213
4642B13k83j43O5j87M67O6Q6L04r58L67j30p5n0L25j37p5n3j89K28J88k68J85
$$ 213 -70 -213 -148 -335 132 198 284 588 -370 -3 -133 -208 -258 67 -70 -145 -198 -387 -159 29 -239 -54
4664e4m49M53M14M3l5k84P06r00N3M78p9J81l37l12M60m05p4J39K27n66K76l72
$$ -54 -503 -50 364 407 372 88 794 -106 -53 425 346 527 190 -122 338 -67 -141 -2 225 -341 -65 -437
4686d37L72n66J82L49K5j30j72M3O49K23o40M9m0P53p54R17j365K36L69k03K71
$$ -437 -65 -631 -449 -100 -75 -205 -377 -334 315 538 -102 -53 -93 660 -94 823 -542 -306 63 -140 131
4707A31N11r56J90K46m03J37K6O04o09M97k3j80K13k35m91J21Q74j383M54M70
$$ 131 642 -314 -124 122 -281 -144 -118 486 -123 374 351 171 384 149 -342 -221 653 -730 -276 194
4727A94o4l65L28j66J17L24M72r70P7K60o3p06O47R79j343k26L54o9P15j82r11
$$ 194 130 -235 93 -73 44 368 840 -130 -53 207 144 -562 85 1064 -279 -505 -151 -220 495 313 -598
4748e98N73J065j145L55k23oM89N05p90J85m54k48R96o96k70O72q28M06P01k80
$$ -598 -25 1040 -105 250 27 21 510 1015 225 410 -44 -292 704 8 -262 410 -418 -12 689 409
4768D09l43o38K42M42k77M29L81q79N70k68k38J55m79L5l6O72J31N38n22K55n74
$$ 409 66 -572 -330 112 -165 264 645 -234 336 68 -170 -15 -494 -459 -495 177 308 846 324 579 5
4789EJ51m48m84l0O64O3j9J29j97n9m47Q35l5l16J0l13N18J68k34Q6K08j23p75
$$ 5 156 -292 -776 -806 -142 -79 -98 31 -166 -225 -672 163 128 -188 -178 -491 27 195 -39 47 255 132 -643
4812f43J36o11P44M90p56P15J70o83N23m11N52o3n70P36o12N88P7J53m56o83R05
$$ -643 -507 -1118 -374 116 -640 75 245 -438 85 -326 226 163 -407 329 -283 305 382 535 79 -604 301
4833C01K07n53K48k04l51j58J88L73PkO8n75O32m3j03J75j1q44R86m54n98O43
$$ 301 508 -45 203 -1 -352 -510 -322 51 58 56 124 -451 181 138 35 210 199 -645 341 -113 -711 -68
4855f8n68J149o26K15j80L23k81P1m26J141q59N10o72L93N34j024M86L03Rk8M01
$$ -68 -636 513 -113 102 -78 245 -36 35 -391 750 -109 401 -271 122 656 -368 118 421 430 402 803
4876H03j343L78N41l63j48o0m05L69K22L7m14k06J094k88l09O54p26L08l58N05
$$ 803 -540 -162 379 16 -132 -192 -597 -228 -6 31 -383 -589 505 217 -92 562 -164 144 -214 291
4896B91M57k31l97R09j614M44M18r3n36p7O11l74j23O50OO1K78p93k10k96M86
$$ 291 748 517 120 1029 -585 -141 277 184 -352 -429 182 -192 -315 335 341 402 680 -113 -323 -619 -133
4917a33N8R5P20r24L97k86P8L5LM5J51r2k00N8r09P50j20M03k65R0J11k33L37
$$ -133 -75 20 740 -184 213 -73 5 40 43 88 239 147 -53 5 -904 -154 -274 129 -136 -46 65 -168 169
4940A69n91k08N59r00J276l95K27p35L54P84p43N3J58J80r72J314j059k96P16
$$ 169 -422 -630 -71 -971 305 -90 137 -598 -244 540 -203 -150 8 188 -784 530 -529 -825 -109
4959a09j15J73K48R9kj21M00r58O85J94p37J00M11n20K24L84m12L52K02n92K12
$$ -109 -224 -51 197 296 294 173 573 -385 300 494 -243 -143 268 -252 -28 356 -56 296 498 -94 118
4980A18L17q7J40p8p10N81j44o95L83L02m30n79J405r40K84O95n03pJ65j48O08
$$ 118 435 348 488 410 -300 281 137 -558 -175 127 -303 -882 523 -417 -133 562 59 52 217 69 677
5001F77j031M93k34oJ30P16j069n1N76n17M52L31j16o33L22l05L17m47j96P73
$$ 677 -354 139 -95 -101 29 745 -324 -375 201 -316 136 467 351 -282 40 -265 52 -395 -591 182
5021A82k09L57p32j81N06k7J2N94r9p0N25l77k98J23j7K77n88p16L96j25O87m51
$$ 182 -27 330 -402 -583 -77 -104 -92 502 403 333 858 481 183 306 289 566 -22 -738 -342 -467 220 -231
5043b31Q16n76KN89J94n51o39K66M72m21K04P2J95M49j005M77p31M14k63k41j87
$$ -231 585 9 11 600 794 243 -396 -130 342 -79 125 197 392 841 -164 313 -418 -4 -267 -508 -695
5064f95K51M28K41k08p4Q6Pm3N57q29J050p12n02P59K66l82J2L7j73k57k3p8p2
$$ -695 -444 -16 225 17 -57 29 36 -7 550 -279 771 59 -443 316 582 200 212 249 76 -181 -204 -282 -354
5087c54K55j31M92l86J025o91QK13p32P78Mm73m33O75m94M85l58o4k36J27j67
$$ -354 -99 -230 262 -124 901 210 218 431 -301 477 481 8 -425 250 -244 241 -117 -181 -417 -290 -457
5108d57m5J669j604L99j81K85O1j50K47o1J66p28Q85l43m64j6P51n07j51M01n57
$$ -457 -502 1167 -437 -38 -219 66 127 -23 224 163 329 -399 486 143 -321 -337 414 -93 -244 157 -400
5129d00J32n66J340j037k17J685o91l41O29m74n74Q13j41M68r2p72MQ26m45q40
$$ -400 -268 -834 506 -531 -748 937 246 -95 534 60 -514 299 158 626 534 -238 -234 592 147 -693
5149f93O96j23L38q63Q10j082J238O8j8m62l44P16n80J261l70j32m42N32K81m78
$$ -693 3 -120 218 -645 165 -917 321 389 371 -91 -435 281 -299 962 592 460 18 550 831 353
5169C53j49j53K79n96L15j28q38N67J55n6J201j043J90qk51N27j41k4l40N28M79
$$ 353 204 51 330 -266 49 -79 -917 -350 -195 -251 950 -93 97 89 -162 365 224 200 -140 388 867
5190H67j077L79j32N3K80p82M90p99R11j83J96l96J66K92m98n17Q26j73K80O6
$$ 867 -210 169 37 90 370 -412 78 -721 190 7 203 -193 -27 265 -233 -750 76 -97 183 249
5210B49K23m66M46q34K60J66L86j12j35j55K19o16P07k32j22K89L85j037L46L69
$$ 249 472 6 452 -382 -122 44 430 318 183 28 247 -369 338 106 -16 273 658 -379 -33 336
5230C36j6l9m86R30j082j11Q08n75M75j22k49L56o77J132n97q33N35K36k16J45
$$ 336 320 281 -205 725 -357 -468 340 -235 240 118 -131 225 -452 680 83 -750 -215 21 -195 -50
5250e0O85q36K78K5J24m15Q98l07j71k98m27N48J39l31J37l92N18o70P55p93P39
$$ -50 635 -201 77 102 226 -189 709 402 231 -67 -494 54 193 -138 -1 -393 125 -545 210 -583 156
5271A56j66l50K26L18m53J111p27k50L09N94j67r32M69m8k9j54j06j5k27J005
$$ 156 -10 -360 -134 184 -269 842 115 -135 174 768 601 -331 138 90 61 -93 -199 -214 -441 564
5291E64n76jm60L22P8j94k14K65p2N74J82o13pJ27N61q11k7Q42n27l48P58o91
$$ 564 -12 -13 -473 -151 -73 -267 -481 -216 -288 286 468 -145 -152 -25 536 -275 -302 540 13 -335 423 -268
5313b68M38l25JJ47O2m4K50k6Q5n86N87m8J11m28M96j53l94K26k58m23J73K47
$$ -268 170 -155 -154 -7 55 11 261 235 320 -266 321 273 384 -44 452 299 -95 131 -127 -550 -377 -130
5335a30O1j89K72J1K97q55L07J92j17P64J31p04O77j236L61O60n06n31k33R69
$$ -130 -69 -258 14 25 322 -533 -226 -34 -151 613 744 40 717 -519 -158 502 -4 -535 -768 201
5355B01o62O72j271J123J23l65o2j99R05K01q00k13P77p55M55L29p09l68J445
$$ 201 -461 211 -1060 63 186 -179 -241 -440 465 666 -134 -347 430 -325 130 459 -250 -618 827
5374H27p32m98Q95n15n1n39N86K96r96J597m02p74j15K84K13j90M04l6N63o68
$$ 827 95 -403 492 -23 -74 -613 -27 269 -727 870 468 -306 -421 -137 76 -114 290 254 817 149
5394A49J96Q6l7n82J1K24P28j205K24K74k21N31l83M35k63K97p73o0K52k00M73
$$ 149 345 431 394 -188 -177 47 775 -430 -206 68 -153 378 -5 430 167 464 -309 -369 -117 -317 156
5415A56M11j228l6O28L62q05J001q38r1J025q11j44l3M86K5m74M28k23N70K6J54
$$ 156 567 -661 -697 -69 293 -512 489 -349 -440 585 -226 -370 -403 83 108 -366 62 -161 409 435 589
5436E89j56J22o63P2N33q40j07R74l99o51J19Q98m42K4L94l66k32L18q91M35K86
$$ 589 433 555 -108 -36 497 -343 -450 524 125 -526 -407 491 49 73 467 101 -131 187 -704 -269 17
5457A7n22P45o66O05N34r38R27r05O41p39K10K58m96N71n84j44m3N91n06P91j31
$$ 17 -505 240 -426 179 713 -225 702 -203 438 -301 -91 167 -329 242 -342 -486 -529 62 -444 347 216
5478B16L01m6p77J104j368O77L2R8J48l87K3k3M6j40K34N07o39J33K74l91K19
$$ 216 517 471 -306 798 -570 107 139 237 385 -2 21 -2 44 -96 138 645 6 139 413 22 241
5499B41j10j56n69J250k05l49o83L10N90k04M27q41P51n64k67L20L3l70K46M9
$$ 241 131 -25 -594 656 451 102 -581 -271 319 115 542 -299 452 -112 -379 -59 -26 -396 -150 -101
5519a01K08k16k44n5M81k40N03l47J81l07M66q3Q9m78L3M00n66J14L27j41q68
$$ -101 107 -109 -353 -408 73 -167 336 -11 170 -137 329 246 335 -143 -110 290 -276 -162 165 24 -844
5540h44R95N35q00r8L49L42n75K6L03R8l03o33N23k11M94j55O49n51k41K30q77
$$ -844 151 686 -114 -212 137 479 -96 -70 233 331 28 -605 -82 -293 201 46 695 144 -97 133 -744
5561g44J295n33m37N36l95O57j41l27p4P71j040J110k52K34j26k89o16N14M01
$$ -744 551 18 -419 117 -278 379 238 -89 -163 608 -432 678 426 660 534 245 -371 143 544
5580E44j064M55J88l41k06J171m04j38J16p14M08J96J4K73Ql93k25k21K87J74
$$ 544 -520 -65 123 -218 -424 747 343 205 321 -393 15 211 225 498 506 113 -112 -333 -46 128
5600A28j68J27l5O0n93Q61m16%J02j36M30p07L2M48M58o33k21J37N52j029o6J053
$$ 128 -40 87 52 112 -481 380 -36 -36 66 -70 360 -347 -315 133 591 -42 -263 -126 426 -603 -669 384
5622C84p55O79L92r08L81j16k86n15M28L06M14k54m60J031l44l04L74n89R07j009
$$ 384 -371 308 700 -208 173 57 -229 -744 -316 -10 404 150 -310 721 377 73 447 -142 765 -244
5642b44L66j16m25J0J148p78p23M87J59j31M0K86M63n02J44l21K37m92N33j38
$$ -244 122 6 -419 -409 739 -39 -762 -275 -116 -247 -207 79 542 40 184 -137 100 -392 141 3
5662Cj82k40K36m3j86Q99m77J76j5j26k43J47j2M46m64O11r37L53Q0O77o62J2
$$ 3 -179 -419 -183 -226 -412 487 10 186 171 45 -198 -51 -63 383 -81 530 -407 -54 26 703 41 53
5684E3pK06p47M27J26k2K91o20L53m82M93o27R42m83L00j13L15o91K40M91k73
$$ 53 46 252 -495 -68 58 36 327 -293 60 -422 71 -556 386 -97 203 90 405 -286 -46 445 172
5705A72j21j89L17M40o17M59r99j30L60K81L80k03m19O86m85l33L21J18l0k03
$$ 172 51 -138 179 619 2 461 -538 -668 -308 -27 353 150 -269 417 -68 -401 -80 38 8 -195
5725a95K65k75J73L07m43r1J46Q4L21j32k41N18m43j53L82j180R54K37j76m97
$$ -195 70 -205 -32 275 -168 -259 -113 -29 292 160 -81 437 -6 -159 223 -957 -3 234 58 -439
5745d39K9J11J74L8k67N20J28l55k7L03k39o28Q34j94M5J47J50l0n1j89k1N10
$$ -439 -410 -299 -125 -87 -354 166 294 -61 -88 215 -24 -652 182 -12 33 180 330 300 249 60 39 549
5767E49l09J64o08R0M60J32k92q9J15J36kj114J234k96n86P02pk67k85L63k11
$$ 549 240 404 -204 -114 346 478 186 97 212 348 346 -768 466 170 -416 286 279 12 -273 90 -121
5788a21J58J28o4J66q62P16p51Q32M05p02J0m20R5M17J80j5k23K76l48r6k28k27
$$ -121 37 165 101 267 -595 121 -630 202 607 -95 -85 -505 -410 7 187 172 -51 225 -123 -219 -447 -674
5810f74R52k51K18k32k16L7N19PM9r4qk14N85j108M10m29N62N13j485R81p37Q8
$$ -674 278 27 245 13 -203 -166 353 360 409 315 307 93 678 -430 -20 -449 113 626 -859 122 -615 -527
5832e27M28K84n06k39l9L68K74J99p0p09M35k56L17M53o66M69p19Q73R0m51J86
$$ -527 -99 185 -321 -560 -599 -231 43 242 172 -537 -102 -358 -41 412 -254 215 -504 369 459 8 194
5853A94l30n7M86q00O68P37j279P3R39r0l55k32k58K75j43l87l72R77l35n4j45
$$ 194 -136 -193 293 -507 161 898 -381 -308 631 541 186 -46 -304 -29 -172 -559 -931 46 -289 -343 -488
5874d88M92l81K95k36O06k93M22p7M66j73q43P1J78pk26n0j46O23n81L08j89n13
$$ -488 4 -377 -82 -318 288 -5 417 340 806 633 -210 -139 39 32 -194 -244 -390 233 -348 -40 -229 -742
5896g42P41p85J105n25N85k0R5n41L68J34m48M2P49q87k93M29L51q27O62l96M05
$$ -742 -1 -786 319 -206 379 359 454 -87 281 415 -33 9 758 -129 -422 7 358 -469 193 -203 202
5917B02n91j17J010r27L63J81k79J088k57k40p52L27N92l7o80m0M81l4j001K85
$$ 202 -389 -506 504 -423 -60 121 -158 930 673 433 -319 8 600 563 -117 -157 324 290 -711 -426
5937d26M73Q0j6J51m35k0N99o49Q04o99P85m38l38J38K11J33n39J3k08K87N94
$$ -426 47 127 111 262 -173 -193 406 -243 561 -138 647 209 -129 9 220 353 -186 -173 -381 -94 500
5958E00j077k82J035l45J59L38l57n28j78L37K32J69Q63p63j81Qr4j18J19J14
$$ 500 -577 -859 176 -169 -10 328 -29 -557 -735 -398 -166 3 866 103 -78 -70 -164 -282 -163 -49
5978d9O33q17M32J86o63K8Q5L44j16j24N0K88m71L0K55L26n46j48J42k56J151
$$ -49 584 -233 199 385 -278 -250 -165 179 63 -61 -11 277 -194 -164 91 417 -129 -277 -135 -391 760
5999G60k15j081P53M56m04k85L91q25P84p73N14m94J151l47q43P55n84J42k17
$$ 760 545 -536 217 673 269 -16 375 -450 334 -439 75 -419 732 385 -458 297 -287 -145 -362
6018c62R92k51l05L06K67j404R97J67p60n42J203k37l65j5N37k39J2j65K65O95
$$ -362 630 379 74 380 647 -757 240 407 -353 -895 308 71 -294 -309 228 -11 1 -164 101 796
6038G96J14j442J087k15m00l54N73K83j329J459k88K29l60q33L07M85o20L94J39
$$ 796 910 -532 555 340 -60 -414 159 442 -887 572 284 513 153 -680 -373 112 -508 -114 25
6057B5k2p3L07p78M37K45l16j9L69m32J45K78n43N62K44o77J37j57L21j2O84j229
$$ 25 3 -70 237 -541 -104 141 -175 -194 175 -257 -112 166 -377 185 429 -248 -111 -268 53 41 725 -504
6079e04P99k43p05J057l47K81o88P46o51m08L03R65r84K02L42k61M6m34M40M3
$$ -504 295 52 -653 404 57 338 -350 396 -255 -663 -360 605 -379 -177 165 -96 -50 -484 -44 -1
6099aL86m31j86N65N9m55K72N3l81J78q5J24j58p54J083P0r13O18K38q79P08N76
$$ -1 385 -46 -232 333 392 -63 209 262 -119 59 -26 98 -60 -814 269 339 -574 44 282 -597 111 687
6121F87j343J542n20m57J70K69j35L47q5l93j68O60m94o2j04J139n00m40j079
$$ 687 -656 886 366 -91 79 348 213 560 475 82 -86 574 80 18 -86 1053 553 113 -966
6140i66O20N3n00R24N6l74P11o25j98J08M19j14k57n17L75J056n99p3M44r05P68
$$ -966 -346 -293 -793 131 187 -187 524 -101 -299 -191 228 114 -143 -660 -285 771 172 99 543 -362 406
6161D06q24P16O96j434L70k02N2j96P29n15j72J14O51K48n59j21K52k51k17R32
$$ 406 -418 298 994 -440 -70 -272 -220 -416 313 -202 -374 -260 391 639 80 -41 211 -40 -257 675
6181F75j594J127l24l12P80m70K88m1l95J86L85l1O6m61n6K95l29MM68j47p98
$$ 675 -919 208 -116 -428 352 -118 170 129 -266 -80 305 274 340 -121 -177 118 -211 -207 261 114 -684
6202f84R26J41L06j033Q45j129P00k57j58R44j054P55k13K35o85N91K71l5j53
$$ -684 242 383 689 -344 501 -628 72 -185 -343 601 -453 302 89 324 -361 230 501 466 313
6221C13o95N74K13l19Q65o54N1o33m9n11Q40J89o5k0O14j060N76j23jO51j29k49
$$ 313 -382 192 405 86 951 297 348 -285 -334 -845 -5 184 119 99 713 -347 229 106 105 756 627 378
6243C78m96L25l93N72j75j90M16p86N09K51q01J48n38J296r69M97j11l18M37N8
$$ 378 -118 207 -186 386 211 21 437 -349 160 411 -390 -242 -780 516 -453 44 -67 -385 52 110
6263A10n23J17j02j51O35k1n62L41j14K44k60%k43J27M80m60J25J0Q3N78J34k35
$$ 110 -413 -296 -398 -549 86 65 -497 -156 -270 -26 -286 -286 -529 -402 78 -382 -257 -247 -164 414 548 313
6285C13K38q60N29k43P3K96q71L42l81M52k43J111Lj011k19J59k22J77M49l35
$$ 313 551 -309 220 -23 50 346 -525 -183 -564 -112 -355 756 759 -252 -471 -312 -534 -357 92 -243
6305b43j14J03l63M57N77Q3q83J108p79L30p79Q29q95M33l89J01O98p2J56K42
$$ -243 -357 -254 -617 -160 417 500 -383 725 -54 276 -503 326 -569 -136 -525 -424 274 202 358 600
6325F00p59J64O47q30O04l86L87M3r67N86K11r65O97J94r36J019m40L18o05N19
$$ 600 -159 5 652 -178 426 40 427 470 -497 89 300 -665 32 226 -710 309 -131 187 -418 101
6345A01O5j23L81r35J4L18J07n4M2K74J59K41r50L4LR49o70p39O27j6l2J3l4l02
$$ 101 166 43 424 -511 -497 -179 -72 -126 -84 190 349 590 -360 -326 -323 626 -44 -783 -156 -172 -204 -191 -225 -527
6369e27Q77l98P21o65k75M29q6K72l31K39K1l3P2J36o10M73P43j052j77K69l13
$$ -527 350 -48 673 8 -267 162 76 348 17 256 277 244 316 452 -158 315 1058 6 -171 98 -215
6390b15L39L13l58m14R90m75k0R64r12Q0J21K94o77j62J77k17n31K99P47q92M51
$$ -215 124 437 79 -335 655 180 160 1124 212 292 413 707 30 -132 45 -172 -703 -404 343 -549 -98
6411i8k05J46j13l99L84N40m30n6n9O96J39o01J00L50q74L21J02K28q8Q5n52L30
$$ -98 -303 -157 -270 -669 -285 255 -175 -231 -290 406 545 -56 44 394 -480 -159 -57 171 83 168 -384 -54
6433e4M03k49l22K25k09J67K16n9m53L71M06k35j20l07J143j498L12J03K21j95
$$ -54 349 100 -222 3 -206 -39 177 118 -335 36 442 207 87 -220 923 -575 -263 -160 61 -134
6453a34K49K1K10m78L68K6p3l74k87L09Q12o86J81J31J47q22R8M36n86M26K82
$$ -134 115 136 346 -132 236 262 189 -185 -472 -163 649 -37 144 275 422 -400 -302 134 -452 -26 256
6474B56q54L76R7j07l06l36Q00n34N85K41J55q86M1Q38o11O24J01q38M51j7k68
$$ 256 -598 -222 -125 -232 -538 -874 -74 -608 -23 218 373 -513 -472 366 -245 379 480 -358 93 76 -192
6495a92n05R02j5n70O92J13j263J06R2P97N2M31q90O7l82O34o16k99Q74N34q02
$$ -192 -697 205 190 -380 312 425 -838 -732 -640 157 209 640 -250 -183 -565 69 -547 -846 28 562 -240
6516b40K74o28Q27k78k32L0P54m49o79M57m24N66J60l31M75o39O54k11J88k64
$$ -240 34 -594 233 -45 -277 -247 507 58 -621 -164 -588 -22 138 -193 282 -357 297 86 274 10
6536A0m47m0P89r18M71k57lL32O9m33l24Q86o37L18M26o74J029p89L55M09j443
$$ 10 -437 -477 312 -606 -135 -392 -395 -63 6 -427 -751 135 -502 -184 242 -432 597 -192 163 572 -871
6557h71J073n18p0O80k16k73J75Qk00L15n21J007q98l55J068q10N36N28q48l00
$$ -871 202 -316 -386 294 78 -195 -20 -12 -212 103 -418 589 -309 -664 404 -406 130 658 -190 -490
6577d90P51l30mm33N43l50o7m34Q10m93J69O07p17L05P23m09L60m34J00J39J35
$$ -490 261 -69 -73 -506 37 -313 -380 -814 -4 -497 -328 279 -438 -133 590 181 541 107 207 346 481
6598D81n0j99O8m33K6K40j071K88K21L95O38j037K97NJ60j89l12K21J33R95j422
$$ 481 431 232 300 -133 -107 133 -938 -650 -429 -34 604 -433 -136 -131 29 -160 -472 -251 -118 877 -545
6619e45j11K41K04k62Q12l86m0L44k27M8n61R65j125Q02j008R41k87m55Q6Q73
$$ -545 -656 -415 -211 -473 339 -47 -87 257 30 78 -483 482 -643 159 -849 92 -195 -650 -564 309
6639C09l91O82n83K0L74J34K23p93O0L70n23j92j98K02n92L51M55L00M9m11M04
$$ 309 -82 600 17 37 411 545 768 -25 35 405 -118 -310 -508 -306 -898 -547 -92 208 257 -154 250
6660B50J09l76P98o83J10q0K85n68K96p1j69M98k40l59O85l64k30J20o18O58o06
$$ 250 359 -17 781 98 208 128 413 -155 141 70 -99 399 159 -200 485 121 -109 11 -607 51 -555
6681e55K54j57qN14N28n3O36j040J03Jj95n28L16N13n64L35o4j24J88j98k54J16
$$ -555 -301 -458 -466 48 576 523 1159 119 222 223 28 -500 -184 329 -235 100 36 -88 100 -98 -352 -236
6703b36L62o15J022r43J69R41j012j93K55P22k71l6j42j20L76l01n33O10J34l4
$$ -236 126 -489 533 -410 -241 700 -312 -505 -250 472 201 165 23 -97 279 -22 -555 55 189 155
6723A55k3k29J1l21L93k3O35n11O9J19m9K08k55m23l04N51N25n75M8K3J95o53
$$ 155 132 -97 -86 -407 -14 -37 598 87 156 275 226 434 179 -244 -548 3 528 -47 1 24 219 -434
6745d34M01J90l5M66k94K1q37J328n39Q0J36l21J99o11L81m16n02J421p84M6L03
$$ -434 -33 157 122 588 294 315 -522 806 267 347 483 162 361 -250 131 -285 -787 634 -150 -104 199
6766A99k96P88j115K43m05K61O17r49R83l79o63P91M09l01K87k19L38M9j48p57
$$ 199 -97 691 -424 -181 -586 -325 292 -657 326 -53 -716 75 484 183 470 251 589 638 490 -267
6786b67O03q91O49l50o0o02Q49J63m76R80q73R4J92j28N5K82o63N54n08J80n14
$$ -267 336 -555 94 -256 -316 -918 -69 94 -382 598 -275 -181 11 -117 -62 220 -443 111 -397 -217 -731
6807g31L85K79O5jj9L95p01O40l14j84M77l32j01M97m37m88P55L54l96R2K60j200
$$ -731 -346 -67 -2 -3 -22 373 -328 312 -2 -186 291 -41 -142 355 -82 -570 185 539 143 235 495 -705
6829g05O01L55N21r04n3N85j014N16R4o73P14o4L02L44k72K38j119P32n1L43m87
$$ -705 -104 251 772 -132 -185 400 -614 -98 -4 -677 37 -27 275 619 347 585 -534 198 147 490 3
6850CN96p83k11K30Q42p1o89j10M3K47l12K46L90m78L5K46o19L42Q20j059L18
$$ 3 599 -184 -395 -165 677 606 -83 -193 -150 97 -215 31 421 -57 -22 224 -395 -53 767 -292 26
6871B6n53J096p71j17j16K91NK09J61L32n47N1K95k91o5k11Q11m44r3r7N58q40
$$ 26 -527 569 -202 -319 -435 -144 -139 70 231 563 16 67 362 71 6 -205 606 162 69 -28 530 -310
6893c10Q23n04K06j2p95K84j59O14k58K26J51l65K60P7k63J86l63m09J315j212
$$ -310 513 9 215 203 -592 -308 -467 147 -111 115 266 -99 161 238 -25 161 -202 -611 704 -508
6913e08P50l64k4j31J43M19k12j42K4J09n52K52J037o88o5j62N77q63L70N2j01
$$ -508 242 -122 -146 -277 -134 285 73 -69 -45 64 -488 -236 801 113 48 -114 463 -400 -30 22 -79
6934g9L86j007P85l0K53l90N09p32Q72n94N03k00P6o36L30j24J03K6j86mK84o2
$$ -79 307 -700 85 55 308 -82 427 -305 567 -27 476 276 352 -284 46 -78 25 51 -135 -139 145 83
6956H3QJ015n79p30R4j92R22m60n25J204q82k5L19m50m08l89J139L98k45K10o70
$$ 83 91 1106 527 -203 -109 -301 621 161 -364 840 -42 -67 252 -198 -606 -995 144 542 297 507 -163
6977a63M46j02O31j072O70K95p00p8k52K6N78o91N55k64P90k51k25k30l32M05
$$ -163 283 181 812 -260 410 705 5 -73 -325 -299 279 -412 143 -121 669 418 193 -37 -369 36
6997C6q87N05L23N21j39o39M96j455J298j48jJ60J7m87K71q6o4k98K53Qn32R84
$$ 36 -851 -346 -23 498 359 -280 216 -1239 59 -89 -90 70 87 -400 -129 -215 -279 -577 -324 -316 -848 136
7019A36P5j57j79N25q15J099m20k53j40K84j76M9R9l26L26l44q2K36n66J3M01
$$ 136 211 54 -125 400 -415 684 264 11 -129 155 -21 28 127 -199 127 -217 -299 -63 -629 -616 -215
7040b15L53j59P3M89p13j67J097k86j144J021l46m9R8p06R30j54p5j16j1N09r33
$$ -215 138 -21 52 541 -172 -339 758 472 -672 349 3 -46 52 -654 276 122 47 -69 -80 429 -504
7061e04K38l07J69m55P59J97j78J33K22m26M12j65M0O9k11M07n78k25O9N20o43
$$ -504 -266 -573 -404 -859 -100 97 -81 52 274 -152 260 95 135 204 -7 400 -178 -403 -334 186 -457
7082d57P43j18J6n78L80J88k35L33n88L63Q4J48k03k82L71k51jL66k64o75J290
$$ -457 286 168 184 -394 -14 174 -61 272 -316 47 131 279 76 -206 165 -86 -87 279 15 -660 630
7103F30o87o57N52K88m97O31q02M81l7K45N1j8n72K47M24l43P58j44n35M70j96
$$ 630 -57 -714 -162 126 -371 260 -542 -61 -98 147 198 180 -392 -145 279 -64 694 550 15 485 289
7124B89m44J86j24m05p5P28k39k67J111j204M54l60J263j022l31P28k51K36k08
$$ 289 -155 31 -93 -498 -573 155 -84 -351 760 -444 10 -350 913 -109 -440 288 37 273 65
7143F5J28J90o10K50K13l40L4l8K52l14P16n00J98j77M03m97k72l4K36P3N54o95
$$ 65 193 383 -227 23 236 -104 -70 -108 144 -170 546 46 244 67 470 -27 -299 -333 -97 -24 530 -165
7165a65k76N02k5N86n79l75O92l85j009J61J119q4J5L76O9m73j46r94R08p92M91
$$ -165 -441 61 36 622 43 -332 360 -25 -1034 -873 246 162 177 553 622 149 3 -991 -83 -875 -384
7186c84N76q9o27o9O67N40q64J033j67r36j34L06j59j2M66k18L63j36N2n74O02
$$ -384 192 103 -524 -593 74 614 -250 783 616 -320 -454 -148 -307 -319 147 -71 292 156 208 -366 236
7207B36m26n4K41m44K49N03r45K71K46K9n31P11O47l67m13J33L94m33K73j3m73
$$ 236 -190 -244 -3 -447 -198 305 -640 -369 -123 -94 -625 86 733 366 -47 86 480 47 320 307 -166
7228a66k98j68J090j230J258j007J073l8o79l32Q35J79r94P27o63Q67O9o11M04
$$ -166 -464 -632 458 -772 486 -521 552 514 -165 -497 338 517 -477 250 -413 454 523 -88 316
7247C16N02j173J95P52k53n93L99L74l37j63o59R65n02m06M67L20j90M07j49o06
$$ 316 818 -355 -160 592 339 -254 145 519 182 19 -640 325 -177 -583 -116 204 14 421 272 -334
7267c34L89l33J19K74j40R4o13L03M8k3K5P05n38l2p98Q70R2J15p9R1p62L25M
$$ -334 55 -278 -159 115 -25 69 -544 -241 -193 -216 -191 514 -24 -56 -854 16 108 223 144 235 -527 -202 -198
7290a98Q42o36L17K01m05k00Q86q42n95O83R7M44q05K75rk80j48L57mr6L2J253
$$ -198 644 8 325 526 121 -79 807 -35 -630 53 150 594 -211 64 55 -225 -373 -16 -20 -116 -84 1169
7312A169l00o90P3J67p10Q43j36p35P4L68L38p34R36q19l78J080J47k46l62K01
$$ 1169 869 179 252 419 -291 552 416 -319 -245 123 461 -273 663 -156 -534 546 693 447 85 286
7332B86l23L79m73k73L4P00o42m4l33K66k18K81P68l44m87L07q1N29k49l59M92
$$ 286 -37 342 -131 -404 -370 330 -312 -356 -689 -423 -641 -360 408 64 -423 -116 -197 332 83 -276 216
7353B16p16K71O01m42K14j88j06O70o45k78R01l58o63J640j266m6O2K28L13l5
$$ 216 -500 -229 372 -70 144 -44 -150 520 -125 -403 498 140 -523 1117 -149 -195 -133 95 408 373
7373C73o36M54j49n37L37J88j77R66r03N61M77r33N8J01K5M31o51K12l48j53p3
$$ 373 -263 191 42 -495 -158 30 -147 819 -84 477 954 21 79 180 205 636 -15 197 -151 -304 -377
7394c77K74M04n32N18m22J61J11R13q75j08K20N80o11n02O31n50J31k09k09L32
$$ -377 -103 301 -231 287 -135 26 137 1050 175 67 287 867 256 -246 385 -165 -34 -243 -452 -120
7414a20p74Q12j1m32L64m71Q91p01R9j36J087l68p29K53J64O82k5j468J078m90
$$ -120 -894 -82 -93 -525 -161 -632 259 -442 -343 -479 608 240 -489 -236 -72 610 585 -883 195 -295
7434b95M61m77Q58p10n87N94k03m92O20k33M54l33N23K17p62k62M77N7J78j62
$$ -295 166 -311 547 -163 -750 -156 -359 -851 -231 -464 -10 -343 180 397 -365 -627 -150 -93 85 -77
7454g7n28R74l68K54q38L49o55J049N5m42p4j98L18N27n87j9K30L87P4M5n14O7
$$ -77 -605 369 1 255 -583 -234 -889 160 215 -227 -301 -499 -181 346 -241 -260 -30 357 431 476 -38 29
7476B9K43n7l97JL91j86k54k53M50pL34m66L82l71J53K73r4k16j4K84l28L69l73
$$ 29 272 215 -182 -181 210 24 -230 -483 -33 -40 294 -172 210 -161 -8 265 171 -45 -59 225 -103 266 -107
7499a07J52l61L98J40J99m21k5N87k80n26K06%l62L30l50P87m81j02M16j87k30
$$ -107 45 -316 82 222 421 0 -25 562 282 -244 -38 -38 -400 -70 -420 367 -114 -216 200 13 -217
7520b17j84K90O9m59J44P84k46j4K16j43k1p48O78j55L07J23k68K84l92R30q78
$$ -217 -401 -111 -42 -501 -357 427 181 167 383 240 219 -529 149 -6 301 424 156 440 48 978 100
7541A00K23m08l14J99L52K3k63k6M50j093P96l0Q3n41O06l22K96l01k69P11N6
$$ 100 323 -85 -399 -200 152 175 -88 -114 336 -757 39 9 92 -449 157 -165 131 -170 -439 272 328
7562C28j93p76J160k40J67r35O67o96L50J60O65j264R34o47K43L5k93k1N01l13
$$ 328 135 -641 519 279 446 -489 178 -518 -168 -8 657 -607 327 -320 -77 -42 -335 -356 145 -168
7582a68j2M24J78l28L09m25p42O96K77R2k46M81k88o17j33O58L32o02J34p93L12
$$ -168 -180 244 422 94 403 -22 -764 -68 209 301 55 536 248 -369 -502 156 488 -114 20 -773 -461
7603d61N78O53n88L45p87J115r37O04n12L48Oq04LM60J79l94K87P23o53J84k36
$$ -461 117 770 182 527 -260 855 -82 522 10 358 364 -440 -437 23 202 -192 95 818 165 349 113
7624A13l42L18k02L09j48P75m76q9j46p54J150r71Q55l51M4K6k31L17m33K68p89
$$ 113 -229 89 -113 196 48 823 347 258 112 -642 508 -463 392 41 85 111 -120 197 -236 32 -757
7645g57N57l26L49k5j34M70M1l87M50K96m43k68K07K00m79J00k89j55M67L27k05
$$ -757 -200 -526 -177 -202 -336 134 175 -212 238 534 91 -177 30 230 -249 -149 -438 -593 -126 201 -4
7666dn62P17r06O06M70o72N49J27j05J51j239O12J053l31m27L00n37q0m4L55o01
$$ -4 -566 151 -755 -149 321 -351 198 325 220 371 -868 -256 797 466 39 339 -198 -278 -322 33 -568
7687e68q4M93O64k15O18j250M66j41P36k60p29K37n05P83l72J98k06K83J68n26
$$ -568 -652 -159 505 290 908 -342 124 -17 719 459 -270 -33 -538 245 -127 71 -135 148 316 -210
7707b10Q0o8l54Q23m64K96m90L28n03M80L92p20P65j49K05n14R18q48l23M01j077
$$ -210 -130 -198 -552 271 -193 103 -387 -59 -562 -82 310 -410 355 206 411 -103 815 -33 -356 45 -1032
7728a032N97M70O63m19k91p6l02m32J724j078J95R85j475L88m19J430p80N03k82
$$ -1032 -435 35 698 279 -12 -88 -390 -822 902 -176 19 1004 -471 -83 -502 928 148 651 369
7747C69l11k66J214j297R22q87O9J42N51p67J29L02l33L91k93J96l1N86o89M22
$$ 369 58 -208 1006 -291 631 -256 -187 -45 506 -261 -132 170 -163 228 -65 131 100 686 -3 419
7767D19Kk83j31j69N87j53n85O01l96M24n76k22M60K99Q48r02J51m77J30N39r85
$$ 419 421 138 7 -162 425 272 -313 288 -108 316 -260 -482 -22 277 1125 223 374 -103 27 566 -419
7788d19P05n82L9R0J1l51J44M32l15k85M56o33K39K95k93P73n33M49Oo66P14k43
$$ -419 286 -296 -257 -167 -156 -507 -363 69 -246 -531 -75 -708 -469 -174 -467 306 -227 222 228 -438 276 33
7810C3l01L71o23L23o0j62n8N29l62J61L05l86O1N9L04l12P39p88P1K63q61J205
$$ 33 -268 103 -520 -197 -257 -419 -477 52 -310 -149 156 -230 -169 -110 194 -118 621 -167 -96 167 -694 511
7832E11m8n4o37P21q13K44O8N7j39P31o88j2l10K15j38K93K5R8k06N33m49J16
$$ 511 463 409 -228 493 -320 -76 -8 49 -90 641 -47 -59 -369 -154 -292 1 26 124 -82 451 2 118
7854A18Ok11L50M26j629J044K56q37L41N91o67L94N12p18o1K76j92k79j38M22
$$ 118 124 -87 263 689 -940 104 360 -477 -136 455 -212 182 694 -24 -85 191 -1 -280 -418 4
7874DN30l01k50L24rp38O75j015O74p8R9P8n1N16k30j40M47r76L55L48J31o72
$$ 4 534 233 -17 307 298 -440 235 -780 -106 -184 -85 -7 -58 458 228 88 535 -441 -86 262 393 -279
7896b79N26p15Q72j32m4q5k83P44k57n66J19K79%J69l19m53N23O1Jk7N19j217
$$ -279 247 -468 404 272 228 143 -140 604 347 -219 -100 179 179 348 29 -424 99 160 161 134 653 -564
7918e64K67O21j19o34J111n90m01Q68n86J92L37j51nOk94k38K86j43j73Q84j99
$$ -564 -297 324 205 -429 682 92 -309 559 -27 165 502 351 346 352 58 -180 106 -37 -210 674 475
7939D75P4o38K12M06L51J29m20k85J47N33j381L44J2m71N47j2l46l44J96L80l2
$$ 475 549 -89 123 529 880 1009 589 304 451 984 -397 -53 -41 -512 35 23 -323 -667 -471 -91 -123
7960a23n06M20K17l82P13K13R7p79l5J74l5L58l00P2M76r18N0M29J32n99L17l49
$$ -123 -629 -209 8 -374 339 552 649 -130 -165 9 -26 332 32 104 580 -338 -288 141 273 -326 -9 -358
7982c58K90J55j28k97m46R03L03O4k38o26K16P39j17o44r3k52L21Q46q13j48N74
$$ -358 -68 87 -41 -338 -784 119 422 486 248 -378 -162 577 460 -184 -277 -529 -208 638 -175 -323 251
8003B51p58M98l27K23M33J04j529J384m35O6R22j240J095p62L05m55J19l13J093
$$ 251 -507 -9 -336 -113 320 424 -1105 279 -156 -90 832 -408 687 -75 230 -225 -106 -419 674
8022F74j036Q36n32N9L24K55l57K83l48q37P12j74l50M79K74n51P4L0m46J02L52
$$ 674 -362 474 -58 1 325 580 223 506 158 -679 33 -141 -491 -12 262 -289 -215 -185 -631 -529 -177
8043a77M99p4j95L44p53J22J66L05r37N47J62J57L47o23L33L67l01p77M29m1L01
$$ -177 322 248 53 397 -356 -234 -68 237 -700 -153 9 166 513 -110 223 590 289 -488 -59 -100 201
8064B01j70O00l76m81j70L89O7l67L17J73K98m97N21j22n67M63n65K07L98o45
$$ 201 31 631 255 -226 -396 -7 60 -307 10 183 481 -16 505 383 -184 279 -286 -79 319 -326
8084c26L46j90J19J58J81p07L70l84R8O63o17j97M27P67l3r51L14k50k1M89m80
$$ -326 20 -170 -51 107 288 -419 -49 -433 -335 328 -289 -486 -59 708 675 -276 38 -212 -233 256 -224
8105b24J42L25n21l07J015l31L64o19m75R50k55k20n46M35L46J03j44k53P97k60
$$ -224 -82 243 -278 -585 430 99 463 -156 -631 319 64 -156 -702 -267 79 182 38 -215 582 322
8125C22J33l0p48j25O28K48p9l79j16M57K91r8k47o80P69o91J119p30P3n90J76
$$ 322 455 425 -323 -448 180 428 349 -30 -146 311 602 504 257 -423 346 -345 774 44 117 -473 -297
8146b97r6P87j72L75q05J6L61j23J20p11P31K41l03j42r8j36Q46k47J08j024M17
$$ -297 -393 394 222 597 -208 -192 169 46 166 -545 186 427 124 -18 -116 -252 594 347 455 -569 -152
8167a52P82o98M31p7L3m68r9L89k87J02J60m1o17J507p10J80p63O87n31N26k79
$$ -152 630 -68 363 286 319 -149 -248 141 -146 -44 116 75 -542 965 255 435 -328 359 -172 354 75
8188G5J52m36J18
$$ 75 227 -209 -91
8191i1
$$ Imaginary data points
##PAGE= N=2
##DATA TABLE= (X++(I..I)), XYDATA
0@%%%%%%%%%%%%%%O4j28J28j28J28j92K56k56L20l84M48n20N84p04Q32r60J088
$$ 0 0 0 0 0 0 0 0 0 0 0 0 0 0 0 64 -64 64 -64 64 -128 128 -128 192 -192 256 -264 320 -384 448 -512 576
31E76j218J402j595J795k042K294k563K865l198L559l960M394m871N395n967O589
$$ 576 -642 760 -835 960 -1082 1212 -1351 1514 -1684 1875 -2085 2309 -2562 2833 -3134 3455
47C455p261Q002q821R715j0700J1793j3004J4364j5890J7614j9586K1863k4532
$$ 3455 -3806 4196 -4625 5090 -5610 6183 -6821 7543 -8347 9267 -10319 11544 -12988
60a2988K7707l1557L6350m2498N0712o2320Q0089j11012J80031o31285K23963
$$ -12988 14719 -16838 19512 -22986 27726 -34594 45495 -65517 114514 -516771 -292808
71b92808Q68557o95068q5807M24297k4840m26217K94268J40868k56789N9662K25845
$$ -292808 575749 -119319 -205126 219171 194331 -231886 62382 203250 -53539 6123 231968
82B31968k34741j21360J78993k9168j71970J52231Q5927j03480j28612Q4317M1520
$$ 231968 -2773 -124133 54860 25692 -146278 5953 91880 -11600 -140212 -55895 -14375
93a4375o7351P0988N8415l3635l6469K7903P4869j24102M422K00937k1759k03613
$$ -14375 -81726 -10738 47677 14042 -22427 5476 80345 -43757 -39335 161602 139843 -63770
105f3770L2116J43189j23102r6622J01235m569o2605R9594K1628k26963O6916
$$ -63770 -31654 111535 -11567 -108189 -6954 -11523 -74128 25466 47094 -179869 -112953
116a12953K36358r1586q5486J16787K9221j47861K3992J30788r8149j2873J08907
$$ -112953 123405 31819 -53667 63120 92341 -55520 -31528 99260 1111 -11762 97145
127I7145q2065j16194R2421P7076j14243m778J07308l0577j06554K6647Q1873
$$ 97145 15080 -101114 -8693 68383 -45860 -50638 56670 26093 -80461 -53814 28059
138B8059n3777n956N6925j5642j2301K0312K1407n8967P257J09678l4148r7222
$$ 28059 -25718 -31674 25251 9609 -2692 17620 39027 -19940 -12683 96995 62847 -34375
150c4375K440N2957l2001m1623M5331J3645k59K6609j0754p0132J2075P9553o0198
$$ -34375 -31935 21022 -10979 -52602 -7271 6374 6115 32724 21970 -48162 -36087 43466 -16732
163a6732n3559O6014M8593l8538k9825N4836l081k3297L2436j5091l2084J6549
$$ -16732 -70291 -4277 44316 5778 -24047 30789 27708 4411 36847 21756 -10328 6221
175F221K4124m3027j8216N0935j7789n4349K0039N6108l1887l8231M1987M005
$$ 6221 30345 -12682 -30898 20037 2248 -52101 -32062 24046 -7841 -46072 -4085 -80
187h0m807L0175Q765m7017n580P6787k1771o7217L2230M4087k8259l7240J6955
$$ -80 -4887 25288 34053 -12964 -18544 58243 36472 -30745 1485 45572 17313 -19927 -2972
200b972j0836r150L4671j5470m4678J5471N1124l6654l1483O3809K3409l2638
$$ -2972 -13808 -22958 11713 -3757 -48435 -32964 18160 -18494 -49977 13832 37241 4603
212D603o756L0509l936k2922K1270o101j4404J7658k904m6114j7733N1652J231
$$ 4603 -2153 28356 24420 1498 22768 16667 2263 19921 17017 -29097 -46830 4822 6053
225F053m1238Q646L5228q655l8914J9734K7800P816J1917j2325k2485n23L2471
$$ 6053 -35185 -26539 8689 34 -38880 -19146 8654 16470 28387 16062 -6423 -6946 25525
238B5525n033l2248K7744K6238k9739m2196J854J1335n205J7171P98j3093N037
$$ 25525 20492 -11756 15988 42226 12487 -29709 -27855 -16520 -21725 -4554 -3756 -16849 -11812
251a1812J6183j4408k6787M3298L0311k8069j3095J8124O767k0377J1880J0448
$$ -11812 4371 -10037 -36824 6474 36785 8716 -4379 13745 20512 135 12015 22463
263B2463k0652O560N048l3170k1580M0619J0927m0337J3022K8803k0668k9553
$$ 22463 1811 8371 13419 -19751 -41331 -712 10215 -30122 -17100 11703 -8965 -38518
275c8518K4690K2982o545K8213P3l6794Q749K7692j9961l0584L6280K0113m1990
$$ -38518 -13828 9154 2609 30822 30895 -5899 2850 30542 10581 -20003 16277 36390 -5600
288e600k0513Q092N817N840J1421j5881j5948K5072M041j8701l3K9204J5228j8750
$$ -5600 -26113 -18021 -12204 -6364 5057 -10824 -26772 -1700 2341 -16360 -16393 12811 28039 9289
302I289j261K289m61o81j385P603n190o538n037j3011m442J1170N544k1044L708
$$ 9289 8028 10317 9856 9175 7790 15393 10203 3665 -1372 -14383 -18825 -7655 -2111 -23155 -19447
317a9447L2237j0445l0161J4197L5624q774n610J3954j6716k718K2520j2242l3365
$$ -19447 12790 2345 -27816 -13619 22005 13231 7621 21575 4859 2141 24661 12419 -20946
330b0946K1601L8015l7951l2037K6684M800j7763P494N970j9094J3374K7746k1821
$$ -20946 655 38670 719 -31318 -4634 166 -17597 -10103 -4133 -23227 -9853 17893 -3928
343c928j3232L0579J2583k9274J699K1614j0308m638R178n798r777K958K169j5966
$$ -3928 -17160 13419 26002 -3272 -1573 20041 9733 5095 14273 8475 -1302 1656 3825 -12141
357a2141J868J1569j4502j4804J5440K4141p744j8981N972J8858m32j2145M180
$$ -12141 -10273 1296 -13206 -28010 -12570 11571 3827 -15154 -9182 9676 9244 -2901 1279
370A279Q047Q528P972j6118k2829R803K6910j6187l1443J5552J3888j8483p970
$$ 1279 9326 17854 25826 9708 -13121 -3318 23592 7405 -24038 -8486 5402 -13081 -21051
383b1051J1125m086K080K1134p233k0145J9577J9293j9534l276K9828n085k4986
$$ -21051 -9926 -14012 -11932 9202 1969 -18176 1401 20694 1160 -2116 27712 22627 -2359
396b359P049O011j5163q63J5626j0366j1420Q682j4009k1054J8241K8886j0434
$$ -2359 4690 10701 -4462 -5325 10301 -65 -11485 -2803 -16812 -37866 -19625 9261 -1173
409a173j5334J5602J2898o297l434M745R280J0215Jk5577j7624J4127J6646j1591
$$ -1173 -16507 -905 11993 5696 2262 7007 16287 26502 26503 926 -16698 -2571 14075 2484
423B484j9748R719J2330j4683j7451K525J2559O911J0380j477j1188Q283J6078
$$ 2484 -17264 -7545 4785 -9898 -27349 -24824 -12265 -5354 5026 3549 -7639 644 16722
436A6722n912k595J9143j141k7753k284J3158r085j1838Q613M314j2204J131q009
$$ 16722 10810 8215 27358 26217 -1536 -3820 9338 253 -11585 -2972 1342 -10862 -9731 -17740
450a7740j6993J5082L2775m476k0865J3067J8769j1453q156J0016R154K454l390
$$ -17740 -34733 -19651 13124 8648 -12217 850 19619 8166 10 10026 19180 21634 18244
463A8244k0328j7064J9158J6325j5534j8696J1502Q588j7015q409P132O595O160
$$ 18244 -2084 -19148 10 16335 801 -17895 -6393 2195 -14820 -23229 -16097 -9502 -3342
476c342O939L554l561K254K239k962Q368J4820n259k6581j497J1418q869j2310
$$ -3342 3597 7151 3590 5844 8083 5121 13489 28309 23050 -3531 -5028 6390 -2479 -14789
490a4789N557J0143o923k158j257j0716J0675K0314o415k1293J3412K3519j0384
$$ -14789 -9232 911 -6012 -8170 -9427 -20143 -9468 10846 4431 -16862 -3450 20069 9685
503I685j4798J1140J4236j11n788r971j0152R106M770j7461r856J1815O740j8869
$$ 9685 -5113 6027 20263 20152 14364 4393 -5759 3347 8117 -9344 -19200 -7385 -645 -19514
517a9514K00J9529K769q789j301Q714M906J974M575m280K843N901l807j4932p14
$$ -19514 -19314 215 2984 -5805 -7106 1608 6514 8488 13063 8783 11626 17527 13720 -1212 -1926
532a926J1156j0007j6429N674J6935n760j5834J178M056M234J0149l322j2320
$$ -1926 9230 -777 -17206 -11532 5403 -357 -16191 -15013 -10957 -6723 3426 104 -12216
545a2216N533K3793q90j5493P246J2856l903j1160k626k787p34q46j3038m584
$$ -12216 -6683 17110 16220 727 7973 20829 16926 5766 3140 353 -381 -1227 -14265 -18849
559a8849J2907N321r994j266J0690l677l412Q161O150R42j265K335j95L236j293
$$ -18849 -5942 -621 -10615 -11881 -1191 -4868 -8280 -119 6031 6973 5708 8043 7848 11084 9791
574I791r116p15R819M866j3207j5912j931N145P298n641l024M760K902L739j740
$$ 9791 675 -40 9779 14645 1438 -14474 -16405 -11260 -3962 -9603 -12627 -7867 -4965 -1226 -2966
589b966L5P179J2583q17j5356K965R393l373j0001R33K263j606K011r021j0983
$$ -2966 -2931 4248 16831 16014 658 3623 13016 9643 -358 575 2838 1232 3243 -5778 -16761
604a6761O170M701l971R20J1782o365j0517J1638J3670j086m832K87n13L714N660
$$ -16761 -10591 -5890 -9861 -8941 2841 -3524 -14041 -2403 11267 10181 5349 5636 5123 8837 14497
619A4497q778m340N417J196j0959r786K48J134N218q19l561L427O467O70o596
$$ 14497 5719 1379 6796 7992 -2967 -12753 -12505 -11371 -6153 -6972 -10533 -7106 -639 31 -6565
634f565K023J2833R044l484j2751l41P958L3l561O08p41o377j985m391p457M669
$$ -6565 -4542 8291 17335 13851 1100 759 8717 8750 5189 5797 5056 -1321 -3306 -7697 -15154 -10485
650a0485N029k880j18Q215j102q772P731J0276l40J106L936q21m827J122n859
$$ -10485 -5456 -8336 -8454 -239 -1341 -10113 -2382 7894 7554 8660 12596 11775 6948 8070 2211
665B211n005P298J916j1563j0431O689O537k398n243r10M364O320L317m190k385
$$ 2211 -2794 4504 6420 -5143 -15574 -8885 -2348 -4746 -9989 -10899 -6535 -215 3102 -1088 -3473
680c473R162R627l866r108M499O352q186l773R08j110o918K94o26n633M362M747
$$ -3473 5689 15316 11450 2342 6841 13193 5007 1234 2142 1032 -5886 -5592 -6218 -11851 -7489 -2742
696b742n194r02O842O51n809J0280R929o193l368K012M561r77k137o377n250P754
$$ -2742 -7936 -8838 -1996 -1345 -7154 3126 13055 6862 3494 5506 10067 9090 6953 576 -4674 3080
712C080J095q314q327L375O200j010m505k398P316N664r70q07n33M860M751j131
$$ 3080 4175 -4139 -12466 -9091 -2891 -3901 -8406 -10804 -3488 2176 1206 399 -134 4726 9477 8346
728H346n252K075P453n332q925J420J20l167j028L518n842m805L857j512K072
$$ 8346 3094 5169 12622 7290 -1635 -215 -95 -3262 -4290 -772 -6614 -11419 -7562 -9074 -7002
743g002N635L439l608L809P677m639m553M120M634K005l044m917o105L813L70
$$ -7002 -1367 2072 -1536 2273 9950 5311 758 4878 9512 11517 8473 3556 -2549 1264 1634
758A634q125k837M650L498o977k542J763K863Q064Q46k268K48M798J735k438Q95
$$ 1634 -6491 -9328 -4678 -1180 -8157 -10699 -8936 -6073 1991 2837 569 817 5615 7350 4912 5807
774E807K529J621l419n145k752k153j798j30K018k252m847K127K96K661N158J882
$$ 5807 8336 9957 6538 1393 -1359 -3512 -5310 -5440 -3422 -5674 -10521 -8394 -8098 -5437 -279 1603
790A603j934J934P642l289m086N629N513j540n801m309m720J321K860m462o323
$$ 1603 -331 1603 9245 5956 1870 7499 13012 11472 5671 1362 -3358 -2037 823 -3639 -9962
805i962L927M158n034o361M306N504M018K453j882j65M632M808l507j458L841
$$ -9962 -6035 -1877 -6911 -13272 -8966 -3462 556 3009 1127 962 5594 10402 6895 5437 9278
820I278N61n925m529k068k824k46J931N7k902j565m10N56L399M949N07L22K842
$$ 9278 9839 3914 -615 -2683 -5507 -5753 -3822 -3765 -6667 -8232 -8642 -8086 -4687 262 769 1091 3933
837C933O241k020n214K538M588j57p562l667q31K85R25k313n325O61N132k382
$$ 3933 10174 8154 2940 5478 10066 9909 2347 -1320 -2151 -1866 -941 -3254 -8579 -7918 -2786 -5168
853e168p067L475Q578K558o43J936R47j242N460j63m167M48K601m433m723K972
$$ -5168 -12235 -8760 -182 2376 1733 3669 4616 3374 8834 8671 4504 4952 7553 3120 -1603 1369
869A369l521o061O29L029l325j819L491K062J372M674o38k243M694O656m365m882
$$ 1369 -2152 -8213 -7584 -4555 -7880 -9699 -6208 -4146 -2774 1900 1262 -981 3713 10369 6004 1122
885A122L979L801m70m909l395j071J01j038o382k674L880L294j347k808L721N604
$$ 1122 5101 8902 8432 3523 128 -943 -842 -1880 -8262 -10936 -7056 -3762 -5109 -7917 -4196 1408
901A408Q10k37J111K574P9L40J356j350k756J011o3m895j201J81n392k067M765
$$ 1408 2218 1981 3092 5666 5745 6085 7441 6091 3335 4346 4283 -612 -1813 -1632 -7024 -9091 -4326
918d326K1m257K755O541k111L18K002p3J767O372P77o867J249N729n082m964J3
$$ -4326 -4305 -8562 -5807 734 -1377 -1059 943 870 2637 9009 9786 2919 4168 9897 4815 -149 -136
935a36M57k111r3l686n845M924N653k005m773L556M315j908K971K427J918J193
$$ -136 321 -1790 -1883 -5569 -11414 -6490 -837 -2842 -7615 -4059 256 -1652 1319 3746 5664 6857
951F857N39K00l083r68j364j138j09j185l163l522J51N75J101k751J039O269J038
$$ 6857 7396 7596 4513 3545 2181 1043 934 -251 -3414 -6936 -6785 -6210 -5109 -7860 -6821 -552 486
968D86l951J488O357L004Q13P18m825l670N113m87o148r02L960l452l214L03l544
$$ 486 -3465 -1977 4380 7384 8197 8915 4090 420 5533 5046 -1102 -2004 1956 -1496 -4710 -4407 -7951
985g951j883O054K490m432N78O383p47j217O148L070r85J51J93m509k005P63o77
$$ -7951 -9834 -3780 -1290 -5722 -5144 1239 492 -725 5423 8493 7508 7659 7852 3343 1338 2101 1424
1002A424l123L03l191m367K271L287k952j312K936M741J646r41Q0J010M605J642
$$ 1424 -1699 -1396 -4587 -8954 -6683 -3396 -6348 -7660 -4724 17 1663 722 802 1812 6417 8059
1018H059k444j522p69N89p11j722k633l59p99m738j006Q17P42L447J619j583r67
$$ 8059 5615 4093 3324 3913 3202 1480 -1153 -1512 -2311 -7049 -8055 -7238 -6496 -3049 -1430 -3013 -3980
1035c980O383K436k182R89K609l24q61K675l612n483K005P17k957j924k77l813
$$ -3980 2403 4839 2657 3646 6255 5931 5070 7745 4133 -1350 655 1372 -1585 -3509 -3786 -7599
1051g599j234N114J745l008J916N086j684k157L914J501K02K971m49j687o27L247
$$ -7599 -8833 -3719 -1974 -4982 -3066 2020 336 -1821 2093 3594 3796 6767 6318 4631 4004 7251
1067G251m985o209J92K356n70k366o43j247n00M470J314j737P52M038J776n05
$$ 7251 2266 -3943 -3751 -1395 -1965 -4331 -4974 -6221 -6721 -2251 -937 -2674 -1922 2116 3892 3387
1083C387J488o53j106Q71J782q27k294k762r06j831o40R01M94j911Q2k90o58k34
$$ 3387 4875 4222 3116 3987 5769 4942 2648 -114 -1020 -2851 -3491 -2590 -2096 -4007 -3925 -4215 -4873 -5107
1101e107N173K413k781j47O125J213j840l10q85j904K131K852p502l322K076L62
$$ -5107 66 2479 -302 -449 5676 6889 5049 4739 3854 1950 4081 6933 -569 -3891 -1815 -1453
1117a453l192l05P93l273J140M590p4N65L982J646j375O29J533o61P87J074l166
$$ -1453 -4645 -4950 -4157 -7430 -6290 -1700 -1774 -1209 2773 4419 3044 3673 5206 4545 5332 6406 3240
1134C240k412l09k40l228k89pj698P74Q07k378j652L038N351K569N9p99p06K293
$$ 3240 828 519 279 -2949 -3238 -3245 -4943 -4169 -3362 -5740 -7392 -4354 997 3566 3625 2826 2120 4413
1152D413p26M40L42P10j209j009m236l074Q00m04j422o88K324Lj552K674L44n7
$$ 4413 3687 4127 4469 5179 3970 2961 -1275 -4349 -3549 -3953 -5375 -6063 -3739 -3736 -5288 -2614 -2270 -2327
1170b327M481L106r54j969J638P45m94J617j202m992j368J760k587l395J338N6
$$ -2327 2154 5260 4306 2337 3975 4720 4226 5843 4641 -351 -1719 41 -2546 -5941 -4603 -4547
1186d547k420L061Q59j836P89M987J130j103J798K391O51n07J97j277j297Q13
$$ -4547 -6967 -3906 -3047 -4883 -4094 893 2023 920 2718 5109 5760 5253 5450 4173 2876 3689
1202C689l095m546j547J247K075k214n76j30K04J738J921J295r40L205L501j628
$$ 3689 594 -3952 -5499 -4252 -2177 -4391 -4967 -5097 -4893 -3155 -1234 61 -879 2326 5827 4199
1218D199q17J22Q59j282J440m89m167j298K00j385j887Q03J124j426q96J882m19
$$ 4199 3382 3504 4363 3081 4521 4032 -135 -1433 -1233 -2618 -4505 -3702 -2578 -4004 -4900 -3018 -3437
1235c437q67M315L569j551J449K365r17n91m61n68k295P59Q60l813k576J225l5
$$ -3437 -4304 11 3580 2029 3478 5843 4926 4335 3874 3306 1011 1770 2630 -1183 -3759 -2534 -2569
1252b569l824J536J201o02Q57L397N78j130K248K748k34p72J435m42j499M72l65
$$ -2569 -6393 -4857 -3656 -4258 -3401 -4 574 -556 1692 4440 4206 3434 4869 4427 2928 3400 3035
1269C035l119j505J765k777k138K10L21r53K197J871k657K179L555J831j815J265
$$ 3035 -84 -1589 176 -2601 -4739 -4529 -4208 -5161 -2964 -1093 -3750 -1571 1984 3815 2000 3265
1285C265J497q30J145j907r65r42J40O89l414k404M51R6j907J35L503n31N01J415
$$ 3265 4762 3932 5077 3170 2205 1263 1403 2092 -1322 -3726 -3275 -3179 -5086 -4951 -1448 -1979 -1478 -63
1303f3q27q8J339M168p95m52K497j803p91j404R09j922j443J22k286k196L9N30
$$ -63 -890 -978 361 4529 3734 3282 5779 3976 3185 1781 2690 768 -675 -553 -2839 -5035 -4996 -4466
1321d466m86J189L243k585M56M211J040j416J075L513p59j146R9j253l357j1J981
$$ -4466 -4952 -3763 -520 -3105 -2649 1562 2602 1186 2261 5774 5015 3869 3968 2715 -642 -653 1328
1338A328l173j922J191o75j665k66K697n4k68K453q44j0L082L095j523m91K502
$$ 1328 -1845 -3767 -2576 -3251 -4916 -5182 -2485 -2539 -2807 -354 -1198 -1208 1874 4969 3446 2955 5457
1355E457j581k507O59o25j858j196J512j504l344j78M86R36Q54K156j603JL582
$$ 5457 3876 1369 2028 1403 -455 -1651 -139 -1643 -4987 -5165 -4679 -3743 -2889 -733 -2336 -2335 1247
1372A247J182r0M90K839n37k380j7r34k041K25J431k943l086K662l30l576k9L138
$$ 1247 2429 2339 2829 5668 5131 2751 2734 1800 -241 -16 1415 -1528 -4614 -1952 -2282 -5858 -5887 -2749
1390b749J534l88K043M7k1J285K461k31j155K636p11l898K25K08k405j838J281
$$ -2749 -1215 -1603 440 487 466 1751 4212 3981 2826 5462 4751 853 1078 1286 -1119 -2957 -1676
1407a676j65l270N35J451l61J850K120L09j692L651J378j971k22J887k99j585
$$ -1676 -1841 -5111 -4576 -3125 -3486 -1636 484 793 -899 2752 4130 2159 1937 3824 3525 1940
1423A940J067j218k596Q90J89j731l283J987L91j532Q15Q77J382Q6J507J496r04
$$ 1940 3007 1789 -807 83 272 -1459 -4742 -2755 -2364 -3896 -3081 -2204 -822 -736 771 2267 1363
1440A363P89J174n82Q70N18l13j939k32j399k380k48o00J674k377k80J012N92
$$ 1363 2152 3326 2744 3614 4132 3819 1880 1648 249 -2131 -2379 -2979 -1305 -3682 -3962 -2950 -2358
1457b358J153k6J573k19K196J319j507j203K900Q33k064p86N9k290M01o52j968
$$ -2358 -1205 -1231 342 123 2319 3638 2131 928 3828 4661 2597 1811 1870 -420 -19 -671 -2639
1474b639j557J784J262k528o98K754J64OK646R69p01J684Q4j185L05J340j249
$$ -2639 -4196 -2412 -1150 -3678 -4376 -1622 -1458 -1452 1194 2163 1462 3146 3230 2045 2350 3690 2441
1491B441k419J356p84k267j368M99M14r29j160J313L21j02J420P14R93J904J388
$$ 2441 22 1378 594 -1673 -3041 -2542 -2128 -3057 -4217 -2904 -2583 -2685 -1265 -551 442 2346 3734
1508C734j604L3N70J317j073j143q82j201m03p53j684q36J503j71j197q00L198
$$ 3734 2130 2163 2733 4050 2977 1834 952 -249 -652 -1405 -3089 -3925 -2422 -2593 -3790 -4590 -1392
1525a392L50k71J575K823m93j62J147o47j403Q03L21j528j455Q62l261j458J847
$$ -1392 -1042 -1313 262 3085 2592 2430 3577 2930 1527 2330 2651 1123 -332 530 -2731 -4189 -2342
1542b342K68j470j202K218K22J04J414J357K01K240J170k005o41J713j23j386
$$ -2342 -2074 -3544 -4746 -2528 -2306 -2202 -788 569 770 3010 4180 2175 1534 3247 3124 1738
1558A738Q53j190j588q96j038j779l2J642j01j073Q83J043Q82J041P73J634K35
$$ 1738 2591 1401 -187 -1083 -2121 -3900 -3932 -2290 -2391 -3464 -2581 -1538 -656 385 1158 2792 3027
1575C027m19J78O36q7j501o13jo56l42j930k000j93K337j418r41J457J523jO30
$$ 3027 2608 2786 3422 3335 1834 1221 1220 564 222 -1708 -3708 -3901 -1564 -2982 -3923 -2466 -943 -944 -314
1594c14J368k57J967L73k97l60R95L00j953r39Q3k134r74M80j252j286K566K1
$$ -314 1054 797 2764 3137 2840 2480 3475 3775 1822 883 966 -1168 -2142 -1662 -2914 -4200 -1634 -1613
1612a613j507Q28O10J232q71L323J048j317Q05K90Q8k80J78j310q94%l33k462
$$ -1613 -3120 -2292 -1682 -450 -1321 2002 3050 1733 2538 2828 2916 2636 2814 1504 610 610 277 -2185
1630b185m63P15o72m9k76Q80J296M58p51J479K210P90J78l53j635P60k18p89j947
$$ -2185 -2648 -1933 -2605 -2654 -2930 -2050 -754 -296 -1047 432 2642 3432 3610 3257 1622 2382 2164 1375 -572
1649e72Q68p16j671P03m56j335p06J622q66J475K341m05j541J759K745j349k91
$$ -572 296 -420 -2091 -1388 -1844 -3179 -3885 -2263 -3129 -1654 687 282 -1259 500 3245 1896 1605
1666A605J836p75q44L49o45j753L43j73k865j078J609R35k677L26K094M52Q46
$$ 1605 3441 2666 1822 2171 1526 -227 116 -57 -2922 -4000 -2391 -1456 -4133 -3807 -1713 -1261 -415
1683d15N43M07P60J567J05p40l18J319j554l70k67o37j037j314o41m73l39j72
$$ -415 128 535 1295 2862 2967 2227 1909 3228 1674 1304 1037 400 -637 -1951 -2592 -3065 -3404 -3576
1701c576J438K50M68J334N10m48M56J680M94l89J553R4k356m71j71j104R7l01
$$ -3576 -2138 -1888 -1420 -86 424 -24 432 2112 2606 2217 3770 3864 1508 1037 866 -238 -141 -442
1719d42j690j841N63P23m42J96K830L86p60Q18M02P92L23Q38j64j39R11j221k389
$$ -442 -2132 -3973 -3410 -2687 -3129 -2933 -103 283 -477 341 743 1535 1858 2696 2532 2393 3304 2083 -306
1738c06n33P89q65j223N20p87k72j22K13P1J568R57O23p14K100J048r45K1P87
$$ -306 -839 -50 -915 -2138 -1618 -2405 -2677 -2799 -2586 -2515 -947 10 633 -81 2019 3067 2122 2143 2930
1757B930L62j226o94j327l05q33m91j545L06P12m37J50l47J948J039j200K095
$$ 2930 3292 2066 1372 45 -260 -1093 -1584 -3129 -2823 -2111 -2548 -2398 -2745 -797 242 -958 1137
1774A137k38N72J083N4q9m0r58J24k007P5L82o65j403K81o67q36O99J69P76Q85
$$ 1137 899 1471 2554 2608 2519 2479 1521 1645 -362 -287 95 -570 -1973 -1692 -2359 -3195 -2496 -2327 -1551 -666
1794f66K015n17o16J161J158j53j231J839K30j736o81q14j193M9j95j134J24J724
$$ -666 1349 832 216 1377 2535 2382 1151 2990 3220 1484 803 -11 -1204 -1155 -1350 -2484 -2360 -636
1812f36j159j298R19J655K88o0J380O45M21j05q2l30M98N60j133j361n50J57j918
$$ -636 -1795 -3093 -2174 -519 -231 -291 1089 1734 2155 2050 1968 1638 2136 2696 1563 202 -348 -191 -2109
1831b109k67N83k73L67n17P65Q08J22O87n6O83J313K91O3r74Q86Q3j551m66j27
$$ -2109 -2376 -1793 -2066 -1699 -2216 -1451 -643 -521 166 110 793 2106 2397 2460 1486 2372 2455 904 438 311
1851C11o87r53o97K74j21J5Q37j429M24J461N74l59K83R13N29L78lj71j28L29
$$ 311 -376 -1329 -2026 -1752 -1873 -1858 -1021 -2450 -2026 -565 9 -350 -67 846 1375 1753 1750 1579 1451 1780
1871A780o25j923Q25j272q13k90K76P77n38q6L69m2K072p56J359O92O95j11m11
$$ 1780 1155 -768 57 -1215 -2028 -2318 -2042 -1265 -1803 -1889 -1520 -1562 510 -246 1113 1805 2500 2389 1978
1890A978L3P0l09r63m20p22P60j601j461N96J07J00LL43J34K63J679J05L76J452
$$ 1978 2011 2081 1772 809 389 -333 427 -1174 -2635 -2039 -1932 -1832 -1829 -1486 -1352 -1089 590 695 1071 2523
1910B523K96j165p8o5P7n51K80j764r6l90j115j41L87Q84j109n11J242J207j94
$$ 2523 2819 1654 1576 1511 1588 1037 1317 -447 -543 -933 -2048 -2189 -1802 -918 -2027 -2538 -1296 -89 -283
1929b83J435j178J340R59K8j409L61J620j059r40r10K4m64j008p42m48P41M32
$$ -283 1152 -26 1314 2273 2301 892 1253 2873 1814 874 -36 -12 -476 -1484 -2226 -2674 -1933 -1501
1947a501K52p76R77J370k71J188Q57R4L6P55j363K03r30j67m56p57J5q02o20l62
$$ -1501 -1249 -2025 -1048 322 51 1239 2096 2190 2226 2981 1618 1821 891 724 268 -489 -474 -1276 -1896 -2258
1967b258q6J507o26r9J031J091k01j9M86Q36J267j005n0j18j41j00j178N2o26
$$ -2258 -2344 -837 -1463 -1562 -531 560 359 340 826 1662 2929 1924 1874 1756 1615 1515 337 389 -237
1986b37n71j335L79O0p04J29R93K1N06J079l06N02J481k21j02N27p90M96m85q82
$$ -237 -808 -2143 -1764 -1704 -2408 -2279 -1286 -1265 -759 320 14 516 1997 1776 1674 2201 1411 1907 1422 540
2006E40r73l89j07K93k328N60L48J07J57N49J120L48J65M8q3J177O05J66r74L05
$$ 540 -433 -822 -929 -636 -2964 -2404 -2056 -1949 -1792 -1243 -123 225 390 438 355 1532 2137 2303 1329 1634
2026A634n52n19j042o3M79n03j411L18p23P61M06l04N43J093l5J020l88m86K607
$$ 1634 1082 563 -479 -542 -63 -566 -1977 -1659 -2382 -1621 -1215 -1519 -976 117 82 1102 714 228 2835
2045B835q64r56J153p82l33k84j363J67r46O81j122j592J862N54n16L85J200J83
$$ 2835 1971 1015 2168 1386 1053 769 -594 -427 -1373 -692 -1814 -3406 -1544 -990 -1506 -1121 79 262
2063B62K71j0J063N4L96J28p22k13N96r67j098O21o75p52j042N37l62M95O76j206
$$ 262 533 523 1586 1640 2036 2164 1442 1229 1825 858 -240 381 -294 -1046 -2088 -1551 -1913 -1418 -742 -1948
2083a948J534P99M5N04K18N26N74q78n97J090j45j054m69n61M83r37j378R02j94
$$ -1948 -414 385 430 934 1152 1678 2252 1374 777 1867 1722 668 199 -362 121 -816 -2194 -1292 -1486
2102a486l77Q85r1j2J698j07j013P94J311P32r4J96j663M29N71j144r00l09K36
$$ -1486 -1863 -978 -1069 -1081 617 510 -503 291 1602 2334 2240 2436 773 1202 1773 629 -271 -580 -344
2121c44p90p85N43L28o12O39j0Q48K66P59m61pJ515M57p99l64N28j23r90n53m04
$$ -344 -1134 -1919 -1376 -1048 -1660 -1021 -1031 -183 83 842 381 374 1889 2346 1547 1183 1711 1588 598 45 -359
2142c59r30k65L86l29k85N07l35J72J88J154J145M2j7L78M78J92q99j24l06r6
$$ -359 -1289 -1554 -1168 -1497 -1782 -1275 -1610 -1438 -1250 -96 1049 1091 1074 1452 1930 2122 1223 1099 793 697
2162F97n59n09l59l48m34Kl12M77N81J40l72M96J080M9L08L9K58M70n65l14O61
$$ 697 138 -371 -730 -1078 -1512 -1510 -1822 -1345 -764 -624 -996 -500 580 629 937 976 1234 1704 1139 825 1486
2183A486r67o26j74K75j194M6l33j47M59J34j92L58M69N63J193q92L82R61o99
$$ 1486 519 -107 -281 -6 -1200 -1154 -1487 -1634 -1175 -1041 -1233 -875 -406 157 1350 458 840 1801 1102
2202A102Q52p12k17J55n94j70j079l80q7K50o16k34NR46k23k66J002R11N9L99
$$ 1102 1954 1242 1025 1180 586 416 -663 -1043 -1130 -880 -1496 -1730 -1725 -779 -1002 -1268 -266 645 704 1103
2222A103j77J261o35p26j87j97N68m04n04n53p0l05j039l33P82M33J81j09j40
$$ 1103 926 2187 1552 826 639 442 1010 606 102 -451 -521 -826 -1865 -2198 -1416 -983 -802 -911 -1051
2241a051P42L70j70J424O3K11K75j149K70l8k56o93j359J165k20q10l30N30n59
$$ -1051 -309 61 -109 1315 1378 1589 1864 715 985 947 691 -2 -1361 -196 -416 -1226 -1556 -1026 -1585
2260a585K08K22P63K09P62K06n24J212l07L50o29M89k75j5q03m33n23J49j54q20
$$ -1585 -1377 -1155 -392 -183 579 785 261 1473 1166 1516 887 1376 1101 1086 283 -150 -673 -524 -678 -1498
2280a498K57mO38k63k33J239K20L90k48K88N46j74q33M59J92m39l22n79n41N16
$$ -1498 -1241 -1245 -607 -870 -1103 136 356 746 498 786 1332 1158 325 784 976 537 215 -364 -905 -389
2300c89o8j992Q62K50K8Q20l55J22J426M59j398J389J33Q07r32K03o96j60L26
$$ -389 -457 -2449 -1587 -1337 -1309 -489 -844 -722 704 1163 -235 1154 1287 2094 1162 1365 669 509 835
2319H35p19r46n9M98n74o02N33P0j23L94l8N23J068r40J092L67l39R85q44m8m46
$$ 835 116 -830 -889 -391 -965 -1567 -1034 -964 -1087 -693 -731 -208 860 -80 1012 1379 1040 2025 1181 1133 687
2340F87m04k74q78l34n2O17m27n03L73j60J46P88M11N68j44l52K53P56l67J029
$$ 687 283 9 -869 -1203 -1255 -638 -1065 -1568 -1195 -1355 -1209 -421 -10 558 414 62 315 1071 704 1733
2360A733r56m12O78o79m09o08k01k27o01m8J84J06O29o19J296K48J097o02M04
$$ 1733 777 365 1043 364 -45 -653 -854 -1081 -1682 -1730 -1546 -1440 -811 -1430 -134 114 1211 609 1013
2379A013Q45q99O23q01L04q52j47o59K88k74J5r07Q0O12K19p22K75Q78p1L78K34
$$ 1013 1858 959 1582 781 1085 233 86 -573 -285 -559 -544 -1451 -1371 -759 -540 -1262 -987 -109 -180 198 432
2400D32M92O30m16k4l39m48P47n15o41j70j21j156P3L85M1RJ20j92R29n06O70
$$ 432 924 1554 1138 1114 775 327 1074 559 -82 -252 -373 -1529 -1456 -1071 -1030 -1021 -901 -1093 -164 -670 0
2421@Q34o81M67O02n1Q3K83j32m27r65j48n40m95K66N53j355J077J12n5k19Q11
$$ 0 834 153 620 1222 1171 1254 1537 1405 978 13 -135 -675 -1170 -904 -351 -1706 -629 -517 -572 -791 20
2442B0K68J61J93l96P89J31J29n32R9p70M2p70k87P68m17o80J87L4M28M37p23
$$ 20 288 449 642 246 1035 1166 1295 763 862 92 134 -636 -923 -155 -572 -1252 -1065 -1031 -603 -166 -889
2463h89J41P59J083n67J3N45M6n16N14p44J80o1j003k9J20K70m2q24k28L15M23
$$ -889 -748 11 1094 527 540 1085 1131 615 1129 385 565 504 -499 -528 -408 -138 -180 -1004 -1232 -917 -494
2484d94n5j26J056K62O39m73k5J34Q27o38p66M0k21J9j4j100j10J417j003o90
$$ -494 -549 -675 381 643 1282 809 784 918 1745 1107 341 381 160 179 165 -935 -1045 372 -631 -1321
2504a321K54O1R50p17lM70P22P70K19q16O5R25j273L77J78k42m17r62j67m28L55
$$ -1321 -1067 -1006 -56 -773 -776 -306 416 1186 1405 589 654 1579 306 683 861 619 202 -760 -927 -1355 -1000
2525a000r2k38K80R25k26j84Q27M78l66Q87r00N59J091j083p9n12L93m89j34j110
$$ -1000 -1092 -1330 -1050 -125 -351 -535 292 770 404 1291 391 950 2041 958 879 367 760 271 137 -973
2545i73J85j74n86R46N06p61Q69m77K22J83M55j96O64j44R4N5M23k56n02k22l20
$$ -973 -788 -962 -1548 -602 -96 -857 12 -465 -243 -60 395 199 863 719 813 868 1291 1035 533 311 -9
2566im89N6m80N02j235R91K26k41J46L20K05J26J762j043k08M21l25J57k12l62
$$ -9 -498 -442 -922 -420 -1655 -664 -438 -679 -533 -213 -8 118 1880 837 629 1050 725 882 670 308
2586C08L23k60n81o24m21P21l66J93J74J23P72o14R65q63N83J46O11o02O62q20
$$ 308 631 371 -210 -834 -1255 -534 -900 -707 -533 -410 362 -252 713 -150 433 579 1190 588 1250 430
2606D30k39M49m19p62P96n21l99l10m17N58M82j82J19j17m4M69L89L24n59P87
$$ 430 191 640 221 -541 255 -266 -665 -975 -1392 -834 -352 -534 -415 -532 -576 -107 282 606 47 834
2626H34m30J259p15l16n72K33n22N88j467M73n17J78m22L52N71M14J51R1k55Q60
$$ 834 404 1663 948 632 60 293 -229 359 -1108 -635 -1152 -974 -1396 -1044 -473 -59 92 183 -72 788
2646G88n11l3K82O18n88m89J06K50n65Q46j078j34M02j131K78J45Q8P06j74N66
$$ 788 277 244 526 1144 556 67 173 423 -142 704 -374 -508 -106 -1237 -959 -814 -726 -20 -194 372
2666C72Nm48Q0L23P4P75K91j417k99J04O3M29j026k9l57O09l70n8N87K02L34l28
$$ 372 377 -71 9 332 406 1181 1472 55 -244 -140 -77 352 -674 -703 -1060 -451 -821 -879 -292 -90 244 -84
2688h4R16j042Q07j43n5J087j34k00o21m67K22j595R28m50M35l79o03J11O35K39
$$ -84 832 -210 597 454 399 1486 1352 1152 531 64 286 -1309 -381 -831 -396 -775 -1378 -1267 -632 -393
2708c93r5N20K65K51Q7k12m2P46l06L6l53l49l14N79n63l60P4L2n29k70N39L64
$$ -393 -488 32 297 548 635 423 381 1127 821 857 504 155 -159 420 -143 -503 -429 -397 -926 -1196 -657 -293
2730b93J41o4m1Q08j56J302j411O85L80n95k2p36K33o34j75n72J026p47M25L5
$$ -293 -152 -216 -257 551 395 1697 286 971 1351 756 734 -2 231 -403 -578 -1150 -124 -871 -446 -411
2750d11Lq88P34P33m28N34l18P60j90L74k02o7j35j41p8l96K23l45m22m54P24
$$ -411 -408 -1296 -562 171 -257 277 -41 719 529 903 701 634 499 358 280 -116 107 -238 -660 -1114 -390
2771c90k9l61k02L46L88k10J196N20n79n31K93m43P9J79M91k33l28j360M76j37
$$ -390 -419 -780 -982 -636 -248 -458 738 1258 679 148 441 -2 77 256 747 514 186 -1174 -698 -835
2791h35o7J51j28P3l32N21K30J66M62J89M33l3q26L73j10O64r29K33l92Jn76k82
$$ -835 -902 -751 -879 -806 -1138 -617 -387 -221 241 430 863 830 4 377 267 931 2 235 -157 -156 -732 -1014
2813a014N80m15j79j05M65L73J04Km06J27O90P20m02K56n93N19l14M0n15J54m83
$$ -1014 -434 -849 -1028 -1133 -668 -295 -191 -189 -595 -468 222 942 540 796 203 722 408 448 -67 87 -396
2834c96k19j84N64oq40R25k50k57P06p2j65Q74m21N94n72L93N21m98l53p27m15
$$ -396 -615 -799 -235 -241 -1081 -156 -406 -663 43 -29 -194 680 259 853 281 674 1195 697 344 -383 -798
2855g98J114k47j43o99L75q18J282o41P82j75l21L1L83O51p91L15J11m4l06J47
$$ -798 316 69 -74 -773 -398 -1216 66 -575 207 32 -289 -258 125 776 -15 300 411 367 61 208
2875B08j0K94n06r8j00p12j17P99n24M69mO30q41O80J60L8O55j108P58n38M25
$$ 208 198 492 -14 -112 -212 -924 -1041 -242 -766 -297 -301 329 -512 168 328 366 1021 -87 671 133 558
2896E58m22j22K14l73K61j110k09J65n7J173j329N06R5Q83k09J0k87O57KL43r24
$$ 558 136 14 228 -145 116 -994 -1203 -1038 -1095 78 -1251 -745 -650 233 24 34 -253 404 406 749 -175
2917a75O6Q26l31Q2N54j043M27j059M9K06n15P35o96Q49K8l6M6J97L99J40J24
$$ -175 -109 717 386 468 1022 -21 406 -653 -604 -398 -913 -178 -874 -25 3 -33 13 210 609 749 873
2938H73l76O42l39n78o5m56N58o35n3l39N1k69L17l89L13M58Q28m50M23m37m62
$$ 873 497 1139 800 222 157 -299 259 -376 -429 -768 -717 -986 -669 -1058 -745 -287 541 91 514 77 -385
2959c85Q90o75L80K47J10p84k05O80J79j366jP62p79k72J267p8P1n76PP40o4N7
$$ -385 505 -170 210 457 567 -217 -422 258 437 -929 -930 -168 -947 -1219 48 -30 41 -535 -528 212 148 205
2981B05J33l70Q47J60K97j132J53m39j3K13o87N21k27O18j393L83K85J79o01M93
$$ 205 338 -32 815 975 1272 140 293 -146 -159 54 -633 -112 -339 279 -1114 -731 -446 -267 -868 -375
3001c75P6J021o19P24j053J210p53K76p85L43R6j59j074L64PO79m38n68O87N2
$$ -375 -299 722 103 827 -226 984 231 507 -278 65 161 2 -1072 -708 -701 -22 -460 -1028 -341 -289
3021b89j1P14K2M7j51J91j14N97q85N1k56l79O32o04L72r88P23o64J52k36R76
$$ -289 -300 414 436 483 332 523 409 1006 121 172 -84 -463 169 -435 -63 -1051 -328 -992 -840 -1076 -100
3042a00K50j90k3N78n11O77R0M72q76j36Q1n3n24J24r5Q0ol4l93J85M48R6k84
$$ -100 150 -40 -63 515 4 681 771 1243 367 231 312 259 -265 -141 -236 -156 -162 -196 -589 -404 44 140 -144
3065a44J34k4l4P4R81m64m41K94L27n59j68M7q4m00j93l13J85L4k20M88K7O53
$$ -144 -10 -34 -68 6 987 523 82 376 703 144 -24 23 -61 -461 -654 -967 -782 -748 -968 -480 -453 200
3087B00r16J001m55j7J053q07O65k88r9n28N26p25N0J97M07j204Q36l28J31M10
$$ 200 -716 285 -170 -187 866 59 724 436 337 -191 335 -390 -340 -143 264 -940 -104 -432 -301 109
3107A09k83o45Q85J66R4K95l40K99k24J96o49j23K56k03J77n31K14K73k80k75
$$ 109 -174 -819 66 232 326 621 281 580 356 552 -97 -220 36 -167 10 -521 -307 -34 -314 -589
3127e89q16J264L18m82k37J141l92j91l22Q37K30l39q29N12M94k28l89k28L37
$$ -589 -1405 -141 177 -305 -542 599 207 16 -306 531 761 422 -407 105 599 371 -18 -246 91
3146I1k8M9k95k57J06k69P25o44O52m95L67M2P93j55m9m2J8rn45O16m12q95K26
$$ 91 63 112 -183 -440 -334 -603 122 -522 130 -365 2 44 837 682 633 591 609 600 55 671 259 -636 -410
3169d10q9N87l43l09o60P69L56r0p3l4R29K5K67j55o00n6O1J06j2k88j99L73m95
$$ -410 -499 88 -255 -564 -1224 -455 -99 -189 -262 -296 633 658 925 770 170 114 175 281 269 -19 -218 155 -340
3192c40o72Q15l04l32Q9K08R1J99r4K39N56p8n24L31p8L20N8o17J7j76j49L43
$$ -340 -1012 -197 -501 -833 -744 -536 -445 -246 -340 -101 455 377 -147 184 106 426 484 -133 -116 -292 -441 -98
3214i8j19l60k4k06M5M90l25N88P2p21O98M49l84J21J40O9M28o37l13k57P37q59
$$ -98 -217 -577 -601 -807 -762 -272 -597 -9 63 -658 40 489 105 226 366 435 863 226 -87 -344 393 -466
3236d66N86p10Q01k42j77J106j019J67p42P45J62L29M42n89m91P97j033L93j62
$$ -466 120 -590 211 -31 -208 898 -121 46 -696 49 211 540 982 393 -98 699 -334 59 -103
3255a03l72l72Q44j66o89K75L11N23n60J162o56j4m65M58n1L05j25k46J066o26
$$ -103 -475 -847 -3 -169 -858 -583 -272 251 -309 853 197 183 -282 176 125 430 305 59 1125 499
3275D99J57r55K72O15p36r3J0q58N81k56j4L13P68Kl71K58j71j6p14J644l07l96
$$ 499 656 -299 -27 588 -148 -241 -231 -1089 -508 -764 -778 -465 303 305 -66 192 21 5 -709 935 628 232
3297B32j085O76M18J56l59L50m20n2l26L87j6r85R76J20p84M20Q68m8r8j56n5
$$ 232 -853 -177 241 397 38 388 -32 -84 -410 -23 -39 -1024 -48 72 -712 -292 576 528 430 274 219
3318B19N72p78K86k14j04q0l06O84n83l74L78p63J062k49J98J7o90J529j08j196
$$ 219 791 13 299 85 -19 -99 -405 279 -304 -678 -300 -1063 -1 -250 -52 -35 -725 804 696 -500
3338e00R56j77j40K94p20L54J004q46r0k19j36J39k35J57J60k69oN75m94j89J024
$$ -500 456 279 139 433 -287 67 1071 225 135 -84 -220 -81 -316 -159 1 -268 -274 301 -193 -382 642
3359F42m44M87l34n32Q52q40m13Q86j27j190R89q40N14o31O35J92l42M12L92p62
$$ 642 198 685 351 -181 671 -169 -582 304 177 -1013 -24 -864 -350 -981 -346 -154 -496 -84 308 -454
3379d54J82N79j09P96p10P1q3j72P56j46o53l28l54M6J31J34n84P37O52p48J48
$$ -454 -272 307 198 994 284 355 272 100 856 710 57 -271 -625 -579 -448 -314 -898 -161 491 -257 -109
3400a09l9O47n94J71O62n92M48l62N80r02Q5K95l98o15L60R8L76l44r6j27q9O95
$$ -109 -148 499 -95 76 738 146 594 232 812 -90 -5 290 -108 -723 -363 -265 111 -233 -329 -456 -545 150
3422A50L10n11M70k0k45J65L77n17m60Q18o92Q4P3l3M18k1p55m4K94N67n13M93
$$ 150 460 -51 419 399 154 319 696 179 -281 537 -155 -71 2 -31 387 366 -389 -433 -139 428 -85 408
3444D08k25m88N0O91j8K93k80LL14m67k17J13o23J7L51m18n2k37jR00n43M17M6
$$ 408 183 -305 -255 436 418 711 431 434 748 281 64 177 -446 -429 -78 -496 -548 -785 -786 114 -429 -12 34
3467C4m07O42l35q43J287J66n11O57l31m40R05q49J38m2O2m48J02m66O20j29M41
$$ 34 -373 269 -66 -909 378 544 33 690 359 -81 824 -25 113 71 133 -315 -213 -679 -59 -188 253
3488B53o0K76p39K59N51k07O2o13Q65p46M01n37Mk61J350j214l54L34l18R79k62
$$ 253 193 469 -270 -11 540 333 395 -218 647 -99 302 -235 -231 -492 858 -356 -710 -376 -694 285 23
3509B3j92k65L17L67o19Q20l23J76k34j63J96L64k58P2p90R62J74r81rQ0j45M76
$$ 23 -169 -434 -117 250 -369 451 128 304 70 -93 103 467 209 281 -509 453 627 -354 -363 -283 -428 48
3531D8p93K67N39jo08Q01L66n56M84l72P44p07l80k20L79R72o68j1m11O03q95
$$ 48 -745 -478 61 60 -548 253 619 63 547 175 919 212 -168 -388 -9 963 295 284 -127 476 -419
3552d19J27k47k9K95L66l9j84J01l18K59N14K62k59p1k27J82j28o22P95p11L5
$$ -419 -292 -539 -568 -273 93 54 -130 -29 -347 -88 426 688 429 358 131 313 185 -437 358 -353 -318
3573c18Q5j48J58l93k85P12N38pq9l42j82L63J68N32n37l30k83P45l07r91m9O71
$$ -318 -233 -381 -223 -616 -901 -189 349 342 253 -89 -271 92 260 792 255 -75 -358 387 80 -911 -960 -289
3595b89j45J34l05L39J75m06L9Q19l09q6K61L99o82N53p43P16n84L09j43l42O55
$$ -289 -434 -300 -605 -266 -91 -497 -458 361 52 -34 227 626 -56 497 -246 470 -114 195 52 -290 365
3616C65o69J002j380M41l94M86j65Q8K49j24M73L2n94P42p05P16m92j14j28k71
$$ 365 -304 698 -682 -241 -635 -149 -314 -226 23 -101 372 404 -190 552 -153 563 71 -43 -171 -442
3636d42N67l56j27J21kj00O02l58L6o73K02Q79L01q07M42P10l36q50P28m94l07
$$ -442 125 -231 -358 -237 -239 -339 263 -95 -59 -732 -530 349 650 -157 285 995 659 -191 537 43 -264
3657b64m46P48j151J011L80q79P1K60p8N42m1M3L68p64N77l53O69j128Q37j39
$$ -264 -710 38 -1113 -102 278 -601 -530 -270 -348 194 153 196 564 -200 377 24 693 -435 402 263
3677B63k32M63M97k040J341l73J12l25m85L49L3N08o5M74r19N1K29L1j49N08k0
$$ 263 31 494 991 -1049 292 -81 31 -294 -779 -430 -397 111 46 520 -399 -348 -119 -88 -237 271 251
3698B51j20L47q59P97m47P11p77k8J41j69l48j09O31m72Q13o2N5q1L61l3p35J82
$$ 251 131 478 -381 416 -31 680 -97 -125 16 -153 -501 -610 21 -451 362 300 355 274 635 602 -133 49
3720D9j31K06L79m63k44o12J097k95L83m25J17m2q3L48r00J32J269r88J90L70
$$ 49 -82 124 503 40 -204 -816 281 -14 369 -56 61 19 -64 284 -616 -484 785 -203 -13 357
3740C57M67q43N58j099O17K90m96K2N0l23k11N24k46j88O12m53m95J698k41j20
$$ 357 824 -19 539 -560 57 347 -149 -127 -77 -400 -611 -87 -333 -521 91 -362 -857 841 600 480
3760D80p07O02j35l47J74l11m39Q83o71Q47m10j21j37J58j53P9N90l21n64P65
$$ 480 -227 375 240 -107 67 -244 -683 200 -471 376 -34 -155 -292 -134 -287 -208 382 61 -503 262
3780B62N8M50l51p6K5M04K36n69l96J08J00m59J10k43k16p98J153L23k94J60l47
$$ 262 320 770 419 343 368 772 1008 439 43 151 251 -208 -98 -341 -557 -1355 -202 121 -173 -13 -360
3801c60M52m98Q23L60o49N8K54j10o3k21n36M69m05Q62o93J85j34l69M63J85m52
$$ -360 92 -406 417 777 128 186 440 330 267 46 -490 -21 -426 436 -257 -72 -206 -575 -112 73 -379
3822c79L45l17Q35k70M76j54M04j037N06K63n80J70P42p70K50l60k66k90K17K56
$$ -379 -34 -351 484 214 690 536 940 -97 409 672 92 262 1004 234 484 124 -142 -432 -215 41
3842D1L7n22N27J3N1j15J35Q8k86J219q79l12j13O75rk66o82M80m25K19p07J265
$$ 41 78 -444 83 96 147 32 167 255 -31 1188 309 -3 -116 559 550 284 -398 82 -343 -124 -831 434
3864D34j233J096p21P7N89k64K26l31L80p50R77n64n95M08N98m18J93K81P4m42
$$ 434 -799 297 -424 -347 242 -22 204 -127 253 -497 480 -84 -679 -271 327 -91 102 383 457 15
3884A5q51j1O71L54l39L25l20N17j25k34J83l38L80N3j48l78K49J66k15m66L10
$$ 15 -836 -847 -176 178 -161 164 -156 361 236 2 185 -153 227 280 132 -246 3 169 -46 -512 -202
3905b02n84Q50l99L94J46k82J27n45P86j66K60r5k7l15J75o72q9Q79p8m65K66
$$ -202 -786 64 -335 59 205 -77 50 -495 291 125 385 290 263 -52 123 -549 -638 241 163 -302 -36
3926c6M35r26P03k19j4J50J81j07m18M18n76L78Q7K62k76K66l55M13k13J12k1
$$ -36 399 -527 176 -43 -57 93 274 167 -251 167 -409 -31 56 318 42 308 -47 366 153 265 244
3947B44o32Q56k51K04j25k4p91L95l40M93nk49K32k97k1P8M87M8R1J00m16k41
$$ 244 -388 468 217 421 296 272 -519 -124 -464 29 24 -225 7 -290 -311 -233 254 302 393 493 77 -164
3969a64M50Op54K25j48N6J6O18n55j12L54j63R11p98l7R11q96M31n79O79o28J42
$$ -164 286 292 -462 -237 -385 -329 -313 305 -250 -362 -8 -171 740 -58 -95 816 -80 351 -228 451 -177 -35
3991c5K46j47m45P7MJ70j21j26K78k55K91m4J6N80j97L3K30o6q02K85Jj61J76
$$ -35 211 64 -381 -304 -300 -130 -251 -377 -99 -354 -63 -107 -91 489 292 325 555 489 -313 -28 -27 -188 -12
4014a2k1L57m48m24L94K8m21M46l91J064j176M94Q77q09N15k1l77N31r48Q79L84
$$ -12 -33 324 -124 -548 -154 -126 -547 -101 -492 572 -604 -110 767 -42 473 452 75 606 -342 537 921
4035I21j098J36K6k77K35l10K62p10N34N60m17M14K74k44p17O21m36J000o91k
$$ 921 -177 -41 -15 -292 -57 -367 -105 -815 -281 279 -138 276 550 306 -411 210 -226 774 83 81
4055H1l06N25J0m18O13j138O01m97L48L89q07J91k09J187m52k63n24Q57n37J5
$$ 81 -225 300 310 -108 505 -633 -32 -529 -181 208 -599 -408 -617 570 118 -145 -669 188 -349 -334
4075c34P15n09P43r57k5O69r03RP10m53M42r59P30L35l50M27p2k99L69K23n44
$$ -334 381 -128 615 -342 -367 302 -601 -592 118 -335 107 -852 -122 213 -137 290 218 -81 288 511 -33
4096c3J09m7j30k28Q23r23J369n61n90j9J62k64P06k31l53j58M39l75N07J10J99
$$ -33 76 29 -101 -329 494 -429 940 379 -211 -230 -68 -332 374 143 -210 -368 71 -304 203 313 512
4117E12k08p76O76o88R78k61m67J012n2m49o81K88n36K90J12N51j414J286l37
$$ 512 304 -472 204 -484 494 233 -234 778 726 277 -404 -116 -652 -362 -250 301 -1113 173 -164
4136a64O22n7m53K51M17qm69k0O45l55k38M83j256M99k45Q64j007k18O72j59K59
$$ -164 458 401 -52 199 616 608 139 119 764 409 171 654 -602 -103 -348 516 -491 -709 -37 -196 63
4157F3K27p31O48N8Jj6J46K45j08M93o77o8R8p60O63j259R04n71j25r5R78m45
$$ 63 290 -441 207 265 266 250 396 641 533 1026 349 281 379 -381 282 -977 -73 -644 -769 -864 114 -331
4179c31M83k43o6k56L03j26M41m25M85j54J62p10Q47p3p71K56N50j105O18l5o4
$$ -331 152 -91 -157 -413 -110 -236 205 -220 265 111 273 -437 410 337 -434 -178 372 -733 -115 -150 -214
4200b14K65J63j56j6K54o20P77q94L10L85j54Q2J21k11j84J73P59l93l34j41N50
$$ -214 51 214 58 42 296 -324 453 -441 -131 254 100 182 303 92 -92 81 840 447 113 -28 522
4221E22r46K71O82m02k53O6P00r89R71n32J5O72n13l5k06l05J48j73O96n66m87
$$ 522 -424 -153 529 127 -126 -60 640 -349 622 90 105 777 264 229 23 -282 -134 -307 389 -177 -664
4242f64J099o14l03L76L61k71k94J019n36J16L7K24k01Q0J29m92Lk36j09J45l58
$$ -664 435 -179 -482 -106 255 -16 -310 709 173 289 326 550 349 429 558 66 69 -167 -276 -131 -489
4263d89K66K68l31o5oK65K43J28o95M89J39j73k75M11J69l36l48N22J47n34P95
$$ -489 -223 45 -286 -351 -357 -92 151 279 -416 73 212 39 -236 175 344 8 -340 182 329 -205 590
4284E90n55m26j39M3Q8J74L08r7q9Q1o08L21L86j11l89M54m54L61k1l26P21k26
$$ 590 35 -391 -530 -487 -399 -225 83 -14 -103 -22 -630 -309 77 -34 -423 31 -423 -62 -83 -409 312 86
4306H6k27p2K66m63N66j79K39m3k48O69J73j179P87o2k50m6O8M77m21j046J417
$$ 86 -141 -213 53 -410 156 -23 216 173 -75 594 767 -412 375 313 63 17 85 562 141 -905 512
4327E12r72R80q8p75L08k34l93O60r6k4M9P72j494J200L28p56j72K53L26o81L24
$$ 512 -460 520 432 -343 -35 -269 -662 -2 -98 -122 -73 699 -795 405 733 -23 -195 58 384 -297 27
4348B7l29N02j64K43K5j90J50j7l99L24%k52n67J296l70J57j08r35N41P58p50
$$ 27 -302 200 36 279 304 114 264 247 -152 172 172 -80 -647 649 279 436 328 -607 -66 692 -58
4369e8m10L1Q01l23m5k10L96m43K14m41R58r68M68P06m25K94q09P62n97K59l5
$$ -58 -468 -437 364 41 -4 -214 182 -261 -47 -488 470 -498 -30 676 251 545 -264 498 -99 160 125
4390A25Q3J04l04j80l32M39J11j58k48J81j50L52L9J81l72L75q31M91M5j25K20
$$ 125 208 312 8 -172 -504 -65 46 -112 -360 -179 -329 23 62 243 -129 246 -585 -94 -49 -174 46
4411D6k00L03o0n92Q68j440R12j11J42K11l61L62J21j40k80Q46j52n44O38r75
$$ 46 -154 149 89 -503 365 -1075 -163 -274 -132 79 -282 80 201 61 -219 627 475 -69 569 -406
4431d06N73M00j584J663J37m16K38j96l28O2k42k3M5J1n80N38P5O09m59m1j90
$$ -406 167 567 -1017 646 783 367 605 409 81 143 -99 -122 -77 -66 -646 -108 -33 576 117 76 -114
4452a14K87j05O74q94j7K32m12O91j041O03J03j03l0n41J207o64l53M60N59k08
$$ -114 173 68 742 -152 -169 63 -349 342 -699 -96 7 -96 -126 -667 540 -124 -477 -17 542 334
4472C34o9L48j98L0L9j203R13n0m51L80J86M7n7r45K43O94q84l75J165k01K56
$$ 334 265 613 415 445 484 -719 194 144 -307 73 259 306 249 -696 -453 241 -643 -1018 147 -54 202
4493B02m30O33p91L15J84K50j92Q15m19q68M65j45k81m99Q67m45k74O15n33N25
$$ 202 -228 405 -386 -71 113 363 171 986 567 -301 164 19 -262 -761 106 -339 -613 2 -531 -6
4513fJ06p55N59j84M43R3L56j130O85L80Lm16k58L73o74n38L27J064m21j47N8
$$ -6 100 -655 -96 -280 163 256 612 -518 167 547 550 134 -124 249 -425 -963 -636 428 7 -140 -82
4534h2J63n72M54p2J91m92P43l53r7k3R97j156J29P97n40q18Q91l75P30p26j27
$$ -82 81 -491 -37 -109 82 -410 333 -20 -117 -140 857 -299 -170 627 87 -731 160 -215 515 -211 -338
4555c38J147l92j85j33J10j81L28j67J85J20r19M32J83J74r94L28L95K75l14l59
$$ -338 809 417 232 99 209 28 356 189 374 494 -425 7 190 364 -630 -302 93 368 54 -305
4575c05K09M33n26k05J016m30J20m24n80O05L96k05j93J57k1k48N62j56o17M40
$$ -305 -96 337 -189 -394 622 192 312 -112 -692 -87 309 104 -89 68 47 -201 361 205 -412 28
4595B8Q55j119K29k57K08p64R55O30j041L29J51q10K14R98j224J512l38j14Q0
$$ 28 883 -236 -7 -264 -56 -820 135 765 -276 53 204 -606 -392 606 -618 894 556 442 522
4614E22o09o16N68k74%K66l65N08O62m39p4p8j94q07L95L44L83m6m3M82p83K11
$$ 522 -87 -703 -135 -409 -409 -143 -508 0 662 223 149 71 -123 -930 -535 -191 192 146 103 585 -198 13
4636A3J07m41K52k71L5N4n62O81N9j02k61m36P72j19L35K25l48k21R58r88N51
$$ 13 120 -321 -69 -340 -305 -251 -813 -132 -73 -175 -436 -872 -100 -219 116 341 -7 -228 730 -258 293
4657B93l94J02P96j95l02L46o99m61P46r94P5J059j061N24M85j05K52o7l48L80
$$ 293 -101 1 797 602 300 646 -53 -514 232 -762 -687 372 -689 -165 320 215 467 400 52 432
4677D32N59j396p4Q59o3j00k18j31K01n29K92l37L55N50l78J16K2M9j35N09o06
$$ 432 991 -405 -479 380 317 217 -1 -132 69 -460 -168 -505 -150 400 22 138 160 209 74 583 -23
4698b3N77L02j148K98j44P58k77n01J08l67N06K07o87L73o37O43j26J04q8K0Q37
$$ -23 554 856 -292 6 -138 620 343 -158 -50 -417 89 296 -391 -18 -655 -12 -138 -34 -122 -102 735
4719G35K36p04K07m2k10l66L76L4p47P34j158Q99m59Q55Q2q70L14L62q78L39P30
$$ 735 971 267 474 432 222 -144 232 266 -481 253 -905 -6 -465 390 472 -398 -84 278 -600 -261 469
4740D69l06l30K52K57p15Q50j37k04l48k38Q49q76M18j26N99p60O3J46M3L85q33
$$ 469 163 -167 85 342 -373 477 340 136 -212 -450 399 -477 -59 -185 414 -346 -283 -137 -94 291 -542
4761e42K45P73p26P73o78L62K90O4l75l90K64K90m87J56K47n73R2J69o89O85l11
$$ -542 -297 476 -250 523 -155 207 497 561 186 -204 60 350 -137 19 266 -307 -215 -46 -735 -50 -361
4782c61K66K01l7J94j28j19N9M43J7o19O23k12n52r9N18o45M68l31k45K45MN31
$$ -361 -95 106 69 263 135 16 75 518 535 -84 539 327 -225 -324 194 -451 17 -314 -559 -314 -310 221
4804B21q27K67M60n87N76q2J07l46J80p03M78J054j342O17m17L46l56KJ65l97
$$ 221 -606 -339 121 -466 110 28 135 -211 -31 -734 -256 798 -544 73 -344 2 -354 -352 -187 -584
4824e84Ro4P45j98k89M15r08J141l40M47k63m78K49r1O7n95N80O28n93l20p8j0
$$ -584 -575 -639 106 -92 -381 34 -874 267 -73 374 111 -367 -118 -209 -142 -737 -157 471 -122 -442 -520 -530
4846e30M56J10n73O79j63k02N83k42m85M98J62M02n38n15Q54l93L77j65q61L44
$$ -530 -74 36 -537 142 -21 -223 360 118 -367 131 293 695 157 -358 496 103 480 315 -546 -202
4866b02M21j60N88j002N44m04m76K60k81N06Q9m11N70j74O61o07M80l91q31J144
$$ -202 219 59 647 -355 189 -215 -691 -431 -712 -206 -117 -528 42 -132 529 -78 402 11 -820 324
4886C24K51p48N20r62R73j98m00N0k61K77Q43L01r75j45L93l4o8n0O3L62q19K78
$$ 324 575 -173 347 -615 358 160 -240 -190 -451 -174 669 970 -5 -150 243 209 141 91 154 516 -303 -25
4908b5o27N96N24q37M40p20K50P25o59o9N13k20N21l89J69J97o61J50L69r9L85
$$ -25 -652 -56 468 -369 71 -649 -399 326 -333 -402 111 -109 412 23 192 389 -272 -122 247 148 533
4929E33p63L65n41K37Q2k51k90O25J76k36j1m26P04n19J388m45m78n37N62J35
$$ 533 -230 135 -406 -169 -87 -338 -628 -3 173 -63 -74 -500 204 -315 1073 628 150 -387 175 310
4949C10o11J84j51lP9J0L77j15m07L2n89J137k85J12o06J285p59K13l90l9j59
$$ 310 -301 -117 -268 -271 -192 -182 195 80 -327 -295 -884 253 -32 80 -526 759 0 213 -177 -216 -375
4970c75J51P52n43p32R70k44m53N56l27M29l93L76k28Q65r9r40j43Q7N64k60j84
$$ -375 -224 528 -15 -747 223 -21 -474 82 -245 184 -209 167 -61 804 705 -235 -378 -291 273 13 -171
4991a71l47J220j48l0k00k26O06j031N55p37O22p87P57l21P59j09o31k88N4J042
$$ -171 -518 702 554 524 324 98 704 -327 228 -509 113 -674 83 -238 521 412 -219 -507 -453 589
5011E89o82O8M04J90o06K46j012J003o50J181r81M1k16L86n20n1J136k50n24j17
$$ 589 -93 -25 379 569 -37 209 -803 200 -450 731 -250 -209 -425 -39 -559 -610 526 276 -248 -365
5031c65R51o49M16j19J50k74K11r11L39J51N15k12j185R11o79J022r6m52Q03k49
$$ -365 586 -63 353 234 384 110 321 -590 -251 -100 415 203 -982 -71 -750 272 176 -276 527 278
5051B78K04K09o35J28k65L41Q73j189L15N6q6J68k33k07j0j29L40o53L53n23O43
$$ 278 482 691 56 184 -81 260 1133 -56 259 315 229 397 164 -43 -53 -182 158 -495 -142 -665 -22
5072b2N16J08k01o02N22q82J171q05M98r13Q27J5R7K30n02J1j39K53o7R3n10J19
$$ -22 494 602 401 -201 321 -561 610 -195 303 -610 217 232 329 559 57 68 -71 182 115 208 -302 -183
5094a83N55N52j256J47OK41L0m32M58m85M90K44Q3l78M50l58q4q6P8j71N8l44
$$ -183 372 924 -332 -185 -179 62 92 -340 118 -367 123 367 450 72 522 164 80 -6 72 -99 -41 -385
5116c85N94l31k8oj5M09L94n43M1k61M49o73K7R29k67n32l87M80j1kk27j10M81
$$ -385 209 -122 -150 -156 -171 238 632 89 130 -131 318 -355 -328 601 334 -198 -585 -105 -116 -118 -345 -455 26
5139B6j06P16n31K4k91J326l39j233M10N22l16j63l68k07J074m67k73Q64j590
$$ 26 -80 636 105 129 -162 1164 825 -408 2 524 208 45 -323 -530 544 77 -196 668 -922
5158i22J025m21M83P9p68R49j048O03J01m00q63J013N89L38o32k40M51k57q02
$$ -922 103 -318 165 244 -524 425 -623 -20 81 -319 -1182 -169 420 758 126 -114 337 80 -722
5177g22P50k9L51p95L29j16j81R2J62K81n7R4p92R27k99N46L94o17q02K60K77
$$ -722 28 -1 350 -445 -116 -232 -413 -321 -159 122 65 159 -633 294 -5 541 935 318 -484 -224 53
5198E3l10L04M93p45P79l62l7J79m71l59p35J844p76J1K44O33r40q4K19K96K1
$$ 53 -257 47 540 -205 574 212 175 354 -117 -476 -1211 633 -143 -132 112 745 -195 -279 -60 236 257
5219B57K07l17m68L00k26M70Ln57M78l91M63j05M8M6K45j055J359p39n81J145
$$ 257 464 147 -321 -21 -247 223 226 -331 147 -244 219 114 162 208 453 -602 757 18 -563 582
5239E82l6m33l09k02N38m29R40j178M78J72j77O32o50J63L35M85j015j86o2K17
$$ 582 546 113 -196 -398 140 -289 651 -527 -49 123 -54 578 -72 91 426 911 -104 -290 -352 -135
5259a35J2K23k14k6K63k79k25K54J79l89R38j268P00k52K03o1O21n96J04m7l12
$$ -135 -123 100 -114 -140 123 -156 -381 -127 52 -337 601 -667 33 -219 -16 -77 544 -52 52 5 -307
5280c07k87R13J52Q0k78M87q62N2m09L55N07m06k65m13R9Q97n01M66r1o72M77
$$ -307 -594 319 471 551 273 760 -102 -50 -459 -104 403 -3 -268 -681 -582 315 -186 280 189 -483 -6
5301fm57j52M03L06K51m91k05N47Jk21J60n81R6n3K89N8L48L07j32m93j44J32
$$ -6 -463 -615 -212 94 345 -146 -351 196 197 -24 136 -445 -349 -402 -113 -55 293 600 468 -25 -169 -37
5323c7o22J076l55M6j64N3NL7k98kj16m24J067p59O59o63J49M02j35J31q1K49
$$ -37 -659 417 62 108 -56 -3 2 39 -259 -261 -377 -801 266 -493 166 -497 -348 54 -81 50 -31 218
$$ [...]
8191c73
##END NTUPLES=NMR FID
##END=
