##TITLE=1H_SL31-DAU(B)
 CDCl3
 8 sc, 
 21.1.2022
##JCAMPDX= 6.0         $$ Bruker NMR JCAMP-DX V2.0
##DATA TYPE= NMR FID
##DATA CLASS= NTUPLES
##ORIGIN= UXNMR, Bruker Analytische Messtechnik GmbH
##OWNER= root
$$ XWIN-NMR		Version 3.5
$$ Fri Jan 21 13:03:36 2022 Russian Standard Time (UT+4h)  she@DPX200
##.OBSERVE FREQUENCY= 200.131346
##.OBSERVE NUCLEUS= ^1H
##.DELAY= (6, 6)
##.ACQUISITION MODE= SIMULTANEOUS
##.ACQUISITION SCHEME= undefined
##.AVERAGES= 8
##.DIGITISER RES= 18
##SPECTROMETER/DATA SYSTEM= spect
##.PULSE SEQUENCE= zg30
##.SOLVENT NAME= CDCl3
##.SHIFT REFERENCE= (INTERNAL, CDCl3, 0, 15.7039)
##AUDIT TRAIL= $$ (NUMBER, WHEN, WHO, WHERE, WHAT)
$$ ##TITLE= Audit trail, XWIN-NMR		Version 3.5
$$ ##JCAMPDX= 5.01
$$ ##ORIGIN= Bruker BioSpin GmbH
$$ ##OWNER= she
$$ F:/spectra/data/she/nmr/H-F/1/audita.txt
$$ ##AUDIT TRAIL=  $$ (NUMBER, WHEN, WHO, WHERE, WHAT)
(   1,<2022-01-21 13:02:32.95 +0400>,<she>,<DPX200>,
      <created by zg, POWCHK disabled, PULCHK disabled
       configuration hash MD5:
       00 E9 B6 7A A2 85 ED C7 34 08 36 98 17 FE 4E 26
       data hash MD5: 16K
       89 91 3B B7 88 F2 42 C0 50 87 6D 99 53 47 FE D0>)
$$ ##END=
$$ 
$$ hash MD5
$$ A7 D4 BA 9D F8 47 2B 5C CE D7 64 6A 47 56 59 E2
##$RELAX= 
##$RELAX= 
##$RELAX= 
##$RELAX= 
##$RELAX= 
##$RELAX= 
$$ Bruker specific parameters
$$ --------------------------
##$DU= <F:/spectra>
##$EXPNO= 1
##$NAME= <H-F>
##$PROCNO= 1
##$TYPE= <nmr>
##$USER= <she>
##$AMP= (0..31)
100 100 100 100 100 100 100 100 100 100 100 100 100 100 100 100 100 100 
100 100 100 100 100 100 100 100 100 100 100 100 100 100 
##$AQSEQ= 0
##$AQ_mod= 1
##$AUNM= <au_zg>
##$AUTOPOS= <>
##$BF1= 200.13
##$BF2= 200.13
##$BF3= 200.13
##$BF4= 200.13
##$BF5= 200.13
##$BF6= 200.13
##$BF7= 200.13
##$BF8= 200.13
##$BYTORDA= 1
##$CFDGTYP= 0
##$CFRGTYP= 5
##$CHEMSTR= <none>
##$CNST= (0..31)
1 1 145 1 1 1 1 1 1 1 1 1 1 1 1 1 1 1 1 1 1 1 1 1 1 1 1 1 1 1 1 1 
##$CPDPRG= <>
##$CPDPRG1= <>
##$CPDPRG2= <>
##$CPDPRG3= <>
##$CPDPRG4= <mlev>
##$CPDPRG5= <mlev>
##$CPDPRG6= <mlev>
##$CPDPRG7= <mlev>
##$CPDPRG8= <mlev>
##$CPDPRGB= <>
##$CPDPRGT= <>
##$D= (0..31)
0 1.2 0 0 0 0 0 0 0 0.06 0 0.03 0 0 0 0 0.0002 0 0 0 0 0 0 0 0 0 0 0 0 
0 0 0 
##$DATE= 1642755752
##$DBL= (0..7)
120 120 120 120 120 120 120 120 
##$DBP= (0..7)
150 150 150 150 150 150 150 150 
##$DBP07= 0
##$DBPNAM0= <>
##$DBPNAM1= <>
##$DBPNAM2= <>
##$DBPNAM3= <>
##$DBPNAM4= <>
##$DBPNAM5= <>
##$DBPNAM6= <>
##$DBPNAM7= <>
##$DBPOAL= (0..7)
0.5 0.5 0.5 0.5 0.5 0.5 0.5 0.5 
##$DBPOFFS= (0..7)
0 0 0 0 0 0 0 0 
##$DE= 6
##$DECBNUC= <off>
##$DECIM= 32
##$DECNUC= <off>
##$DECSTAT= 4
##$DIGMOD= 1
##$DIGTYP= 9
##$DL= (0..7)
0 120 120 120 120 120 120 120 
##$DP= (0..7)
150 150 150 150 150 150 150 150 
##$DP07= 0
##$DPNAME0= <>
##$DPNAME1= <>
##$DPNAME2= <>
##$DPNAME3= <>
##$DPNAME4= <>
##$DPNAME5= <>
##$DPNAME6= <>
##$DPNAME7= <>
##$DPOAL= (0..7)
0.5 0.5 0.5 0.5 0.5 0.5 0.5 0.5 
##$DPOFFS= (0..7)
0 0 0 0 0 0 0 0 
##$DQDMODE= 0
##$DR= 18
##$DS= 0
##$DSLIST= <SSSSSSSSSSSSSSS>
$$ [...]
##$SUBNAM2= <"">
##$SUBNAM3= <"">
##$SUBNAM4= <"">
##$SUBNAM5= <"">
##$SUBNAM6= <"">
##$SUBNAM7= <"">
##$SUBNAM8= <"">
##$SUBNAM9= <"">
##$SW= 18.0517287032376
##$SWIBOX= (0..15)
0 0 2 0 0 0 0 0 0 0 0 0 0 0 0 0 
##$SW_h= 3612.71676300578
##$TD= 16384
##$TD0= 1
##$TE= 0
##$TE2= 300
##$TE3= 300
##$TEG= 300
##$TL= (0..7)
0 120 120 120 120 120 120 120 
##$TP= (0..7)
150 150 150 150 150 150 150 150 
##$TP07= 0
##$TPNAME0= <>
##$TPNAME1= <>
##$TPNAME2= <>
##$TPNAME3= <>
##$TPNAME4= <>
##$TPNAME5= <>
##$TPNAME6= <>
##$TPNAME7= <>
##$TPOAL= (0..7)
0.5 0.5 0.5 0.5 0.5 0.5 0.5 0.5 
##$TPOFFS= (0..7)
0 0 0 0 0 0 0 0 
##$TUNHIN= 0
##$TUNHOUT= 0
##$TUNXOUT= 0
##$USERA1= <user>
##$USERA2= <user>
##$USERA3= <user>
##$USERA4= <user>
##$USERA5= <user>
##$V9= 5
##$VALIST= <valist>
##$VCLIST= <CCCCCCCCCCCCCCC>
##$VD= 0
##$VDLIST= <DDDDDDDDDDDDDDD>
##$VPLIST= <PPPPPPPPPPPPPPP>
##$VTLIST= <TTTTTTTTTTTTTTT>
##$WBST= 1024
##$WBSW= 4
##$XGAIN= (0..3)
0 0 0 0 
##$XL= 0
##$YL= 0
##$YMAX_a= 148580
##$YMIN_a= -276430
##$ZGOPTNS= <>
##$ZL1= 120
##$ZL2= 120
##$ZL3= 120
##$ZL4= 120
##$ABSF1= 10
##$ABSF2= 0
##$ABSG= 5
##$ABSL= 3
##$ALPHA= 0
##$AQORDER= 0
##$ASSFAC= 0
##$ASSFACI= 0
##$ASSFACX= 0
##$ASSWID= 0
##$AUNMP= <proc_1d>
##$AZFE= 0.1
##$AZFW= 0.1
##$BCFW= 1
##$BC_mod= 2
##$BYTORDP= 1
##$COROFFS= 0
##$CY= 11.3945322036743
##$DATMOD= 1
##$DC= 2
##$DFILT= <>
##$DTYPP= 0
##$F1P= 2.36226072786647
##$F2P= -0.459571619588291
##$FCOR= 0.5
##$FTSIZE= 0
##$FT_mod= 4
##$GAMMA= 1
##$GB= 0.15
##$INTBC= 1
##$INTSCL= 1
##$ISEN= 128
##$LB= 0.24
##$LEV0= 0
##$LPBIN= 0
##$MAXI= 10000
##$MC2= 0
##$MEAN= 0
##$ME_mod= 0
##$MI= 1.114404
##$NCOEF= 0
##$NC_proc= 0
##$NLEV= 6
##$NOISF1= 3.799351
##$NOISF2= 2.8
##$NSP= 1
##$NTH_PI= 0
##$NZP= 0
##$OFFSET= 15.70392
##$PC= 1
##$PHC0= -15870.02
##$PHC1= 13.40078
##$PH_mod= 1
##$PKNL= yes
##$PPARMOD= 0
##$PSCAL= 0
##$PSIGN= 0
##$REVERSE= no
##$SF= 200.130013532006
##$SI= 16384
##$SIGF1= 3
##$SIGF2= 2
##$SINO= 400
##$SIOLD= 16384
##$SREGLST= <1H.CDCl3>
##$SSB= 0
##$STSI= 0
##$STSR= 0
##$SW_p= 3612.71676300578
##$SYMM= 0
##$S_DEV= 0
##$TDeff= 0
##$TDoff= 0
##$TI= <>
##$TILT= no
##$TM1= 0
##$TM2= 0
##$TOPLEV= 0
##$USERP1= <user>
##$USERP2= <user>
##$USERP3= <user>
##$USERP4= <user>
##$USERP5= <user>
##$WDW= 1
##$XDIM= 8192
##$YMAX_p= 0
##$YMIN_p= 0
$$ End of Bruker specific parameters
$$ ---------------------------------
##NTUPLES= NMR FID
##VAR_NAME=  TIME,          FID/REAL,        FID/IMAG
##SYMBOL=    X,             R,               I
##VAR_TYPE=  INDEPENDENT,   DEPENDENT,       DEPENDENT
##VAR_FORM=  AFFN,          ASDF,            ASDF
##VAR_DIM=   8192,          8192,            8192
##UNITS=     SECONDS,       ARBITRARY UNITS, ARBITRARY UNITS
##FACTOR=    0.0002768,     1,               1
##FIRST=     0,             0,               0
##LAST=      2.2672688,     0,               0
##MIN=       0,             -276430,         0
##MAX=       2.2672688,     148580,          0
$$ Real data points
##PAGE= N=1
##DATA TABLE= (X++(R..R)), XYDATA
$$ [...]
1885A44J35R0M4k63L81K29j84k86J78m69j10L68j82l90j73K5m4j43r8L73K79N7
1907c9m48j91J070k14m14N20K82m28n16L20R41j08p60L55K34k32o37R3P60k65
1927C23q53R0N02j44n29J29P36K26j046n5J059k8m06r8J99J52k72mN46M46p09
1948B64j08R3K52k88m88L36M08p22l40O38j87l1R6J03m91JL82j0o5K20N0m12L77
1971G8k6k66M92K0n91K80L88k83k77L43L24n86Q4j09L12j27k18q3Q28m45j105
1992i67M06J308J39j434K82P53o06k48Q95l55k46o7j70K63L69m27q49R40O54j023
2012c83K4Q30j92m96O79J9n31k29M58K4M63r0q40m45R64n7n08L84M3r53M74P24
2034C62o70l09N79k54l84J018ko36J56P42m93N1O57j409L64J337l81j020M42M59
$$ plain form
1885 144 279 369 413 150 531 760 576 290 468 -1 -111 257 75 -315 -488 -463 -507 -650 -748 -375 -96 -39
1907 -39 -487 -678 392 178 -236 284 566 138 -378 -58 883 775 15 370 604 372 -265 -172 588 323
1927 323 -530 -440 62 -82 -611 -482 254 480 -566 -621 438 410 4 -94 105 257 -15 -19 527 973 264
1948 264 156 249 501 213 -275 61 469 -253 -593 45 -142 -173 -77 26 -465 -464 -82 -92 -157 63 113 -299 78
1971 78 52 -214 278 298 -293 -13 375 92 -185 158 482 -104 -20 -129 183 56 -162 -245 583 138 -967
1992 -967 -561 747 886 -548 -266 487 -119 -367 528 173 -73 -140 -310 -47 322 -105 -954 -14 640 -383
2012 -383 -359 471 279 -217 462 481 -50 -279 179 203 666 576 -264 -709 255 198 -310 74 117 -836 -362 362
2034 362 -308 -617 -38 -292 -676 342 340 -296 -140 602 109 160 817 -592 -228 1109 728 -292 150 609
2054F09j072L67J515j135j027J93M97j23M01o51o99Q32R30j364L72J041j127q26
2072a267K249R2j288j68Q10K2L72J96j430J00J008n35m89J360q48j899J295J212
2090G92q12j053P10j27R7P68l78j030P24P00p49R43L12j304K07J356j52j213L38
2109A29K33r33R36R75j480o98R44l50j03Q15m67j198R11O05q79K65Q53j611j6
2128a069J677L49j609K84R71m86P2O81j049k16R26m57l53J276r03j706J416J615
2146A419j722n78Q22l72l76Q79P7p35J99L57n40J139K93j582M8J797l34j128L31
2165fJ21m92N20O31q36m36L28M0O4Q26o77j122R38O20p75J71K90r16n6J524j18
2186F39j263R17O4n37O3P39p75k26N59l32K95K73q53n44Q72R80j475K26J133p80
$$ plain form
2054 609 -463 -96 1419 284 -743 -550 -53 -176 225 -426 -1125 -293 637 -727 -355 686 -441 -1267
2072 -1267 982 1074 -214 -382 428 450 822 1018 -412 -312 696 161 -328 1032 184 -1715 -420 792
2090 792 -20 -1073 -363 -490 -393 375 -3 -1033 -309 391 -358 585 897 -407 -200 1156 1004 -209 129
2109 129 362 -571 365 1340 -140 -838 106 -244 -347 468 1 -1197 -286 319 -560 -295 558 -1053 -1069
2128 -1069 608 957 -652 -368 603 117 189 870 -179 -395 531 74 -279 997 94 -1612 -196 1419
2146 1419 -303 -881 -59 -431 -807 72 149 -586 -387 -30 -570 569 862 -720 -672 1125 791 -337 -6
2165 -6 115 -377 143 774 -62 -498 -170 -130 -66 760 83 -1039 -101 519 -256 -85 205 -711 -767 757 639
2186 639 -624 293 357 -180 -117 622 -153 -379 180 -152 143 416 -437 -981 -109 871 -604 -378 755 -25
2206b5p6O07K89q46qm4k16J066oj512M22J229p35r47R54J27q12K38O11n53j22
2227c59L13l81N02N97o17n54N58L86o56O17L05q16k76R02l3n95R2K8l75L56L55
2248C49r01K50M40m32j52M97l76k86N67J22n18J04Q03m78q2P42j64n60M0M01r9
2269B67O08m72o97O57k6n10j73O53k16j021M86R00q35k27n2M76L70m50o3l9Q61
2290D97k90n05P50L19q31j61Q60j58k37J06j89o6r7J95l29K77k59n16J53N46m03
2311c38k02K50Q0p4j15L91j31J42L8R3k40L04k8k1L73J68l62j99J52m18O5N52
2333D80o06j46J94K01m70j79K62L45k32n7J24M80m12k56m8N34J10o90L12M48q
2354C86l75N1L41k58j56PL20l2m59l34N34L03m04l07K22N48q73k3P11K26p71J71
$$ plain form
2206 -25 -101 506 795 -51 -59 -103 -319 747 741 -771 -349 880 145 -802 152 279 -533 -295 316 -237 -359
2227 -359 -46 -427 75 672 55 -499 59 445 -211 406 711 -105 -381 521 488 -107 -15 13 -362 -6 349
2248 349 -552 -302 138 -294 -446 51 -325 -611 -44 78 -440 -336 467 -11 -93 649 485 -75 -35 366 267
2269 267 875 403 -294 363 337 -173 -346 307 91 -930 -444 456 -379 -606 -658 -182 188 -262 -325 -364 497
2290 497 207 -298 452 771 -60 -221 639 481 244 350 161 95 -2 193 -136 141 -118 -634 -481 65 -338
2311 -338 -540 -290 -210 -284 -399 -8 -139 3 41 134 -106 198 170 149 522 690 328 129 281 -137 -72 480
2333 480 -126 -272 -78 123 -347 -526 -264 81 -151 -208 -84 396 -16 -272 -320 214 324 -366 -54 394 386
2354 386 11 62 403 145 -11 -4 316 284 -175 -509 25 328 -76 -383 -161 387 -486 -509 202 428 -343 -172
2376a72K7K19m2j4q6L70m04R0k51J79J72k46M19l02j54j61L76J33k82J87n6R6
2398I8j82M64j53l18J49J79k34Q3j94J82O1l81r0M62p5m60L56J16J83m98J81m4
2420a15L10r6l15NJ86M63p58L32N55l27m99K64J13n7j93K26n3J36n05J6L46K58
2442B92o31j19M35r0j76J00L27pP1j71J00j4O3j03j07J87j6k61R8M06l26p4L3
2465A7l9l61J68M82n13j53J78k65J55J9Q1J54J6J8J51PQ5l53L28N31l95l38M22
2488C95p4j86k8J17Pl59k22L78J81k18o45N90L21k45n10K94L78l40j92N71j67
2509D6J45j62j85L24K99j96m69K37L75n14K48J17k84j11L48l26J44j04m85K49
2529c04K50j52m97L92M74l75O3M37l92j65L42K70k69J15J28m12J04M68Lp02J99
$$ plain form
2376 -172 -145 74 32 18 -68 302 -102 -12 -263 -84 88 -158 261 -41 -195 -356 20 153 -129 58 2 98
2398 98 -84 380 227 -91 58 237 3 86 -108 74 135 -246 -336 126 51 -409 -53 63 246 -252 -71 -115
2420 -115 195 99 -216 -211 -25 438 -320 12 567 240 -259 5 118 61 -132 94 41 177 -328 -312 34 292
2442 292 -339 -458 -23 -113 -289 -189 138 131 202 31 131 117 180 77 -30 157 141 -120 -22 384 58 -16 17
2465 17 -22 -383 -215 267 -246 -399 -221 -486 -331 -312 -231 -77 -61 -43 108 115 200 -153 175 706 311 -27 395
2488 395 321 135 107 224 231 -128 -350 28 209 -9 -654 -64 257 12 -498 -204 174 -166 -358 213 46
2509 46 191 29 -156 168 467 271 -198 39 414 -100 148 265 -19 -130 218 -108 36 -68 -553 -304
2529 -304 -54 -206 -703 -311 163 -212 -149 288 -104 -269 73 343 74 189 317 -95 9 477 480 -222 -23
2550b3O3j90M91k74m12J53J92p8k12M60J35p14M03M31n12J55J37k67J46L97m82
2571ak29P41k97m75K79M46o92m90R49J43l25k78m7n6N61K18j070O91K85r28L12
2592b63P12k99o88M90M54m56L01l51j56m5O40k92J7Q6m87j72P57K30q70J22M02
2613A32k3j14J56m36r6O72J72l86J79J28n97L76L41n78n36M98j44k20O95j20o38
2634e39K34Q48m56o4K0k68j10N74N5m90M56r2m70O54O10j016n18N75N77p03J71
2655D8J39n88K65M61n90M7J76n74J4J101k45o40N7L68o7P1L99k86m01N63J42k84
2677A76K56k84m03L92M81p53l05M84oj74K27j09n54K85M78j40k55J11m88K92M13
2698A24J59j27M0Om56M84L02o37l32Q03K9o52L58N5n86K92J87L7k67K25m17k9
$$ plain form
2550 -23 40 -150 341 67 -345 -192 0 -78 -290 170 305 -409 -6 425 -87 68 205 -62 84 481 -1
2571 -1 -230 511 214 -261 18 464 -228 -718 231 374 49 -229 -276 -332 229 447 -623 68 353 -575 -263
2592 -263 449 150 -538 -48 406 -50 251 -100 -256 -301 339 47 64 150 -337 -509 248 478 -392 -270 132
2613 132 109 -5 151 -285 -381 291 463 77 256 384 -213 163 504 -74 -610 -112 -256 -476 219 99 -539
2634 -539 -305 543 87 23 43 -225 -335 239 294 -196 260 168 -302 352 962 -54 -572 3 580 -123 48
2655 48 187 -401 -136 325 -265 -218 -42 -616 -602 499 254 -386 -329 39 -28 43 442 156 -245 318 460 176
2677 176 432 148 -255 137 618 -135 -440 44 38 -136 91 -18 -572 -287 191 51 -204 -93 -581 -289 124
2698 124 283 156 196 202 -254 230 532 -105 -437 366 395 -257 101 156 -430 -138 49 86 -181 44 -373 -402
2720d02Q58o35j93L45K58m62K08M56j68m22L09J50J6o5q6l89N31K99q08P7N66
2741D43n18m00O98J18p99M74J10k51kK63o75L58L52j75R2Nr9l07L78M29n34k07
2763b47M66m55M01K20l06k10J51K10j44m3K46m24k35L45j81k23M37k4j74L47p
2784A50k54O2J26j1M2j67j30J13L66k73r3J78r5k10o4N86kp30K42J41K55j87J2
2807E7j51O6j06kO4L94l03m8K31l56j62K40M71k22l77R0rp4L4L18k98L19l3j52
2831iK66O3l10N5j32O6k0J73L8k22J78J5n0j48J74m55K73J0o9q8O4j45K4P9K43
2856G3n4l23K50J53k18J19%L52j54k32J49J62j73K22m71N52l09k55J84k08O7p4
2878a88J72j00J11j72r8K04L32k33k39J36K71j78q8K26J41k06J23k6k3j4o0o9
$$ plain form
2720 -402 456 -179 -372 -27 231 -231 -23 433 265 -157 152 302 318 253 167 -222 309 608 -200 -123 443
2741 443 -75 -475 223 341 -458 16 126 -125 -127 136 -539 -181 171 -4 88 93 -6 -313 65 494 -40 -247
2763 -247 219 -236 165 385 79 -131 20 230 86 43 289 -135 -370 -25 -206 -429 8 -16 -190 157 150
2784 150 -104 -42 84 73 115 -52 -182 -69 297 24 -69 109 14 -196 -260 326 324 -406 -164 -23 232 45 57
2807 57 -94 -28 -134 -136 -72 322 19 -29 202 -154 -316 -76 395 173 -204 -114 -123 -197 -163 155 -143 176 143 -9
2831 -9 257 320 10 65 -67 -1 -21 152 190 -32 146 161 111 -37 137 -318 -45 -35 -104 -192 -128 -273 -249 -170 73
2856 73 19 -304 -54 99 -119 0 0 352 198 -34 115 277 104 326 -145 407 98 -157 27 -181 -114 -188
2878 -188 -16 -116 -5 -177 -275 -71 261 28 -211 -75 196 18 -70 156 297 91 214 188 165 151 91 22
2900B2K5N6m9j20J14k40j28OJ89r7rL98o8r8j05Q2K1m0R8L68m51n8L69j58j0k64
2926a47K51j27Q2q3P8J67l95L0J08o0J02k04l9L89R2k54j70J29K6k86J56L60j20
2949H5l21K14J75l8j14J25p4j74J63n3J29L7k32l46M22o9r2k1L98k24j11J99J9
2972I7k56L2K71q9j2k00J33J61k09J38o7K45m18K98Q6j68j34j97J66R5k11N19
2994B80m12Q5j86J64Q4R1O5j70k23L89L3o67O15K02o21L10K5j86J20R1K9j28K38
3017B28n13p4M79K10o37K17M70n67K46j5J25k17M4M1mJ90l34N5K2j08l7J17k01
3040b63L52j50P9j42o4j91L39j52K18J55k35O7J4K55l00J83J46l18K34Ok64j49
3062a80N05l96k3L40J5o12K67o5N4j8j23K24k01N04R6p01L92P5k67j79M85j49
$$ plain form
2900 22 47 103 54 -66 48 -192 -320 -314 -125 -222 -231 167 99 1 -104 -22 -1 -41 57 425 -26 -84 285 127 117 -147
2926 -147 104 -23 59 -24 54 221 -174 -144 -36 -96 6 -198 -237 152 244 -10 -180 -51 -25 -311 -155 205 85
2949 85 -236 -22 153 115 1 126 52 -122 41 -12 117 154 -78 -424 -2 -71 -163 -184 214 -10 -121 78 97
2972 97 -159 -127 144 55 43 -157 -24 137 -72 66 -1 244 -174 124 210 42 -92 -289 -123 -28 -239 280
2994 280 -132 -47 -233 -69 15 106 171 1 -222 167 200 -467 148 350 -271 39 64 -122 -2 89 118 -10 228
3017 228 -285 -359 120 330 -307 -90 380 -187 59 44 169 -48 -4 37 33 223 -111 -56 -34 -142 -179 -62 -263
3040 -263 89 -61 18 -124 -188 -379 -40 -192 26 181 -54 13 27 282 -18 165 311 -7 227 233 -31 -180
3062 -180 325 -71 -94 246 261 -351 -84 -149 -95 -113 -236 -12 -213 291 387 -314 78 153 -114 -293 192 43
3084D3k33M43k17J49l14L14l23L64o2l56J11J47j27m56O01N1m25RL36j69J15l2
3106c1j30L6J13J55l69O10P2q57K89M52k50Q2J36j57j54L69l4m50L6J27j72O2
3128f5J45l10k60O30j5n60L46K68n17M65J06j07r7M9l1k08J97K08m61K48K72j79
3150A24m4K8l43p7L75L71p08K70K92m50J00pn3p8O07n73kM14k62l4N0L87m62j26
3174b01M37On62N31r8l94J83K74j31j04M72k65l27L34n5l19N10J8p50M15K86k88
3196b8kR5N0n8J37j35m50M19J29k91J73J31l63o5M24N0k08N5m0j97J60K40k29
3219co4n0J74J23n9o8m44J96M00l47J00j40J67j65L91j74m9p3j45K58J47q0o08
3242e13N41K51k55m1M76n42p3J46Q0k7k8kP4j94Q9j4L7k13M9l6P1j7L3K64k4L1
$$ plain form
3084 43 -190 253 36 185 -129 185 -138 226 164 -192 -81 66 -61 -517 84 135 -290 -281 55 -114 1 -31
3106 -31 -161 -125 -12 143 -226 384 456 -401 -112 340 90 172 308 151 -3 366 332 -118 -82 45 -127 -65
3128 -65 80 -230 -490 140 125 -435 -89 179 -338 127 233 126 29 78 47 -161 36 244 -217 31 303 124
3150 124 80 108 -235 -312 63 434 -274 -4 288 -162 -62 -69 -122 -200 407 -166 -168 246 -16 -50 0 387 -75 -201
3174 -201 236 242 -320 211 113 -281 -98 176 45 -59 413 148 -179 155 100 -219 291 309 -441 -26 260 -28
3196 -28 -30 65 115 57 194 59 -391 28 157 -134 39 170 -193 -258 166 216 8 63 23 -174 -14 226 -3
3219 -3 -67 -117 57 180 121 53 -391 -195 205 -142 -42 -182 -15 -180 211 37 -12 -85 -230 28 175 95 -513
3242 -513 28 279 24 -17 459 -83 -156 -10 70 43 15 13 87 -107 -18 -32 5 -208 -159 -195 -124 -141 -108 156 132 163
3268A63l79J06J3L56l85K91q2J93j79p9P2J59k26j89J68j25j81M21J06n64pL23
3290b5J88l25l6M69k15J19j75m9J51nj60P0K97l25j52M17p9n6P9L2j73j9K9p0
3314a3j1Q9M3kM7j50k27K58j08J14r7M8K66l23P9k5K73j82J47n2j80M57m00j67
3338a16L32qj66k0j33K69j11K4k36L36j47J0O9k50K9JJ7o9p8J91K7OJ06O0j56
3363a3P0o1p7K46q4m16L11J29j17k3j46J49j7j78K19Q0j29O3j16J23j30q0J38
3386e9L5K9j61O2J38J22l37J8K52r2l16K11j38L41k03K17J07j46q0j91J59q2L9
3409g5o6K96l45R2K17J77k03j90l0J14j54r0K15N7L2J24j56K58M0l76L9J51j79
3432e2l7J58p0J31m0j1m3r1K25KP0k7p0j7k06m8J96k20J16k1l6k3M19k86k56M95
$$ plain form
3268 163 -216 -110 -97 259 -126 165 83 276 97 18 90 249 23 -166 2 -123 -304 117 223 -341 -348 -25
3290 -25 163 -162 -198 271 56 175 0 -49 102 97 -63 7 304 -21 -173 244 165 109 188 220 47 28 57 -13
3314 -13 -24 65 108 106 153 3 -224 34 -74 40 -57 -9 257 -66 13 -12 261 79 226 174 -6 451 51 -116
3338 -116 216 208 42 22 -111 158 47 71 -165 171 24 34 103 -147 -118 -117 -100 -169 -247 -56 -29 -23 83 143 -13
3363 -13 57 -4 -81 165 81 -335 -24 105 -12 -35 -181 -32 -49 -227 -8 72 -57 6 -110 13 -117 -197 -59
3386 -59 -24 5 -156 -94 44 166 -171 -153 99 7 -309 -98 -236 105 -98 119 226 80 0 -191 -32 -114 -75
3409 -75 -141 155 -190 -98 119 296 93 -97 -127 -13 -167 -257 -42 15 47 171 15 273 313 -63 -24 127 -52
3432 -52 -89 69 -1 130 90 79 36 -55 170 172 242 215 145 128 -78 -126 70 -150 -34 -55 -91 -114 305 19 -237 258
3458B58k85r9L12l73L77O3k37J09j72J32l34L51J45m32J18K10j44j38n9K68k15
3479a45J82k42L05k14j67J44MJ06j64p7L49J67j80k10L67m5k63K06j33j02K59
3500A47J47l52L16l11o9k64L63K7r5M7R8j53j06L20l66J73k4K98k06J5k49K13
3522c1q5J92O9o3L69m56P7p8K94l59J34j03j20J84o5K6n1j6j24L0K40k17p3L55
3546A29M6l21J00M52n04J09n2J11n8j93J88o0N6J67N0l98J78o0j18J19n7K18j84
3569h2R5n0K69m5l72K19j35J05j62M36j46k22K36j35j84r9P09m83n03P66j49J68
3591B36k32K81o2m05L24k40k63M04r2Mj18L21l65L85o5J37m25q0L19k00Q0K9Q1
3614E4J7j63N6J31K1k41N1Q2J25l85L42q7j80k4M98q6l17K47j76k36L02k1j15
$$ plain form
3458 258 -27 -126 186 -187 190 253 16 125 -47 85 -249 102 247 -185 -67 143 -1 -139 -198 70 -145
3479 -145 37 -205 100 -114 -281 -137 -133 -27 -191 -268 81 248 68 -142 225 180 -83 123 -10 -112 147
3500 147 294 -58 258 -53 -122 -386 -23 4 -91 -44 54 -99 -205 115 -251 -78 -102 196 -10 5 -244 -31
3522 -31 -116 76 145 82 451 -5 72 -6 288 -71 63 -40 -160 24 -41 -15 -66 -82 -206 -176 64 -153 -226 129
3546 129 175 -146 -46 406 -98 11 -41 70 12 -181 7 -53 3 170 220 -178 0 -60 -178 -59 -116 102 -82
3569 -82 13 -37 232 187 -185 34 -101 4 -158 278 132 -90 146 11 -173 -272 437 -46 -549 217 68 236
3591 236 4 285 223 -182 142 -98 -361 43 -49 -45 -163 158 -207 178 113 250 -175 -255 64 -136 -56 -27 54
3614 54 71 -92 -36 95 116 -125 -74 8 133 -252 90 3 -177 -201 297 211 -106 141 -35 -271 31 10 -105
3637a05J06J16r7j32N15m77j59K28m3Q1J07q3q9P0K61l27mN40o56n3N20j76k67
3660a24J52J73mk86J91l09J32K28k11r2L43k02k05K69m4k47k38Q15k18k06L58
3681B75j50l03L71J03k12j0J88m80K65R2J03l90M4P3j53o5L99k93k41L05J70l67
3703b76J47K08o0J82m7l47K29o8O8Q1M40l84l79L24L9k12j47L99k14p7K60l27
3725a61P3J53j23j17K60N9l19R4Q9J67j79K31J10m95P3J66K1o3L2l32L27J3J11
3748A90j17rN6m49K24L93k85k38N62m53J47K5J16k18JJ11k13Q5O3j22K22pK1J05
3772B10j49K58l99k3L3Q4j94K04j0q0J25q1M4j00J34l09M00j90J17m44L56K93
3794B79m84j17N32j68K21l23j69J46K15j93P7j56K19k87M08Q9l94k16M49M0l75
$$ plain form
3637 -105 1 117 20 -112 403 -74 -233 -5 -48 33 140 57 -32 38 299 -28 -32 508 -148 -201 319 143 -124
3660 -124 28 201 197 -89 102 -207 -75 153 -58 -150 193 -9 -214 55 11 -236 -474 341 123 -83 275
3681 275 125 -178 193 296 84 74 262 -218 47 139 242 -148 -104 -31 -184 -249 150 -143 -384 -79 91 -276
3703 -276 -129 79 19 201 154 -193 36 -32 36 117 557 173 -206 118 157 -55 -202 197 -17 -94 166 -161
3725 -161 -88 65 -58 -175 85 144 -175 -81 8 175 -4 227 337 -158 -85 81 102 39 71 -261 66 79 190
3748 190 73 64 120 -329 -105 288 3 -235 327 -126 21 46 162 -56 -55 56 -157 -72 -9 -131 91 84 105 210
3772 210 61 319 -80 -103 -70 14 -180 24 14 -66 59 -22 22 -78 56 -253 147 -43 74 -370 -14 279
3794 279 -205 -322 210 42 263 -60 -229 -83 132 -61 16 -140 79 -208 200 289 -105 -321 128 168 -207
3815b07M10p1j70L73k64k60NK77L9l87L08P1m14K36L16o11J63Q3Q7R4q2n6J30
3838G0J8j23J4M3l0q1M05l97j81J2M66p8k01k6K27j0k68J01J2J23k17j46K17J14
3862F4No5n1j9j96K55J44m6rl52K3K78K8m9j53J74P4m34L08N0j10m0j6N5K58l39
3888a63K13N0k10P9l6O9R8r6m4J69k17q3K75J61l36k10L42Lq6J22p6L74m54m9
3912a05R5m3J30k68J57j5k13K88j88k39M18j4LJ38j48P3Q6J94k36MO3q1K32l02
3936B9J72r5l06K5K52J84l34k16M22L0j30j17P3j8l42N70k3j72k1j48J02R7o2
3959b8K25K4k40j6k88M15n9k26M32k19M9k5j23l8j66L62j59Q3J10k36P6P1n1M4
3983A7n4r3K02Lp0J48j23j00nK57j90lJ67Q9j95j50J53r2M9J48L3m02K8P6K61
$$ plain form
3815 -207 203 132 -38 335 71 -189 -184 93 132 -255 53 124 -290 -54 262 -349 -186 -103 -16 78 -4 -60 70
3838 70 88 -35 -21 22 -8 -89 316 -81 -262 -250 216 138 -63 -89 138 128 -140 -39 -27 96 -121 -267 -50 64
3862 64 69 4 -47 -66 -262 -7 137 91 82 -270 -247 31 59 10 -143 31 105 -329 -21 29 -81 -121 -137 -82 176 -163
3888 -163 50 100 -110 -31 -67 2 100 4 -40 129 -88 -171 104 265 -71 -281 61 64 -22 100 24 398 -56 -105
3912 -105 -10 -53 77 -191 -34 -49 -262 26 -162 -401 17 3 6 144 -4 69 155 349 113 117 180 99 331 29
3936 29 201 106 -200 -175 77 261 -73 -289 133 163 33 -84 -11 -29 -371 199 176 4 -17 -165 -63 34 -28
3959 -28 197 221 -19 -35 -323 92 33 -193 239 20 69 44 -79 -117 -283 79 -80 3 113 -123 -47 24 -27 17
3983 17 -37 -130 72 75 5 153 30 -70 -75 182 -8 -11 156 245 50 -100 53 -39 10 158 191 -211 -183 -107 154
4008A54j37J7M7m43M71j61J76j23j84K70k40Q7J35j85K58j2j76m5K62j16p1K60
4030B44n59L96J23j37M9L68m91R1R1j38R8K5j05q9K02o5q4P0l49J80J11j41J04
4053fj06Q4J04K1k13Q6J45j11J31j0l33L55J36m89O4J97j13P3j30k9J53k38K44
4076A5k06K22j72k45M03k4j26j35K22K32j95K1m7o8j56J27M54k98K09k39m1K97
4098B50j93P8l85K37J62l06N43k62k46j9L18j60j86Q4J56l07K3K19J28n4O1l70
4120b29K47K75j53j35j9J70j24k09L89m88M10q1j45L8j40K44l39L16k52J03K95
4141A73l2k61N0J35j23m1L03K57n37J91j09J39r9J20l20Q8N00l47j68L08k64j52
4163a89J71J38k29J0J34k90J14L42N8m07L75j97p3J72l0j12k18L30R4k64K39k36
$$ plain form
4008 154 17 34 81 -362 109 -52 124 1 -183 87 -153 -66 69 -116 142 130 -46 -91 171 55 -16 244
4030 244 -315 81 204 67 116 484 -7 84 175 37 135 160 55 -34 168 103 19 89 -260 -80 31 -110 -6
4053 -6 -112 -28 76 97 -116 -30 115 4 135 125 -208 147 283 -206 -142 55 -58 15 -115 -144 9 -229 15
4076 15 -191 31 -141 -386 17 -7 -133 -268 -46 186 -9 12 -35 -103 -259 -132 322 24 233 -6 -47 250
4098 250 57 135 -250 -13 149 -157 386 124 -122 -141 177 17 -169 -85 71 -236 -213 6 134 80 141 -229
4120 -229 18 293 140 5 -14 156 32 -177 212 -276 134 53 -92 -54 -194 50 -289 27 -225 -122 173
4141 173 141 -120 -70 65 -58 -99 204 461 -76 115 6 145 46 166 -154 -66 434 87 -81 227 -37 -189
4163 -189 -18 120 -109 -99 35 -255 -141 201 259 -148 227 30 -43 129 99 -13 -231 99 193 -71 168 -68
4185f8j26J85K22l64O1J19nk47M59p0l45J44J86k06lR3nj94j7K39K3j79p9L23
4209A46k28J74n5n5n2J86k42K42L4n12L65J00j8k22jJ14K19r3j37K45O8k87p4
4232h3K63p6l05Q1K15J46m07K39K06m48R0m2J19j20K56r3k60K76O9j17K11p5q1
4255F4K76k01n5k66N02l33ll6J49k49J5L24p0l52M5oJ04K75l04l32L59J74j8m0
4279B2J9j10K62L1J97m42m1J83j64J72L0k75j45N15j24m34L88o1k12Q4j7K9k2
4302a15O3q1J05K44j88n7j34L59r0J99q8k91J31j04K91m24J54J56j81k9Pk92K17
4325a48l0K7j36L46j43k28L19j66j5L25j34L58l44n2M6k11K36J24J1j64J64o8
4347A17k73L35K22m88K75j74m4J21N1m63L15k47J67J52p4j45K04Pq1j67J98K06
$$ plain form
4185 -68 -194 -9 213 -151 -90 29 24 -223 236 166 -179 -35 151 -55 -58 35 30 -164 -181 58 81 -98 -177 146
4209 146 -82 92 37 -18 -70 116 -126 116 150 -362 3 103 85 -137 -138 -24 195 102 -35 210 278 -9 -83
4232 -83 180 104 -201 -120 95 241 -166 73 279 -169 -79 -121 -2 -122 134 41 -219 57 126 9 220 145 64
4255 64 340 139 84 -182 320 -13 -16 -52 97 -152 -137 187 117 -235 -190 -196 -92 183 -121 -453 -94 80 62 22
4279 22 41 -69 193 224 421 -21 -62 121 -43 129 159 -116 -261 254 130 -304 84 23 -189 -105 -122 -93 -115
4302 -115 -52 -133 -28 216 28 -29 -163 196 106 305 217 -74 57 -47 244 -180 -26 130 -51 -80 -73 -365 -148
4325 -148 -178 -151 -287 59 -84 -312 7 -159 -174 151 17 375 31 -21 25 -186 50 174 185 21 185 117
4347 117 -156 179 401 -87 188 14 -30 91 142 -321 -6 -253 -86 66 -8 -153 51 58 -23 -190 8 214
4369B14L3m92L57o1q7o9K00J78k74K39n10N6J8J25J86l83K81J86j87j76O8J42
4391D4J45rm57M07k81K39l37NNK36J5o4J54j70Q4Q8r6j9M6n9K04n4k40K47j79
4416d6L01n16L84j8j98MP2j8P9k08J21J52k85L92k62j2R7l21P8RK93KLk77K38
4441F4m3o5N8j16K72k5Ok16J89Oj14K3n5M0k4m6j4j6k6pQ6J40j06j30P3k85O09
4468B78j22l3j28J37O1J23o36M18P7j52o5J34r2k80K86j1J90k09K16K0k30j23
4490a41Q2J69j67J2j47J33k5R8J33p6J81l10j29K46J30j40k34J25L67k13j29N0
4512A5jj0m32K70l1j63K60L83l90n3J19O3O2j6k37L72o7j97K26O4j09k25j0K30
4536A23k77P6K36k69M5N3j92j5K35j67J03j22J70N0j0J69j12j49J36M1r5n8L72
$$ plain form
4369 214 247 -245 112 51 -36 -105 95 273 -1 238 -272 -216 -198 -73 113 -270 11 197 10 -166 -98 44
4391 44 189 180 -277 130 -151 88 -249 -244 -239 -3 12 -52 102 -68 16 104 8 -11 35 -24 180 126 -114 133 -46
4416 -46 255 -261 123 105 -93 -89 -17 -35 44 -164 -43 109 -176 216 -46 -58 39 -282 -204 -195 98 100 103 -174 64
4441 64 21 -44 14 -102 170 145 151 -65 124 130 16 39 -16 24 0 -46 -60 -76 -102 -109 -23 117 11 -119 -46 -331 278
4468 278 156 123 -5 132 193 316 -320 98 175 23 -42 92 0 -280 6 -5 185 -24 192 212 -18 -141
4490 -141 -59 110 -57 -45 -192 -59 -84 14 147 71 252 -58 -187 59 189 49 -185 -60 307 94 -35 15
4512 15 14 4 -428 -158 -189 -352 -92 291 -99 -152 -33 30 92 76 -161 211 144 -53 173 237 128 -97 -107 123
4536 123 -154 -78 158 -111 -66 -13 -205 -220 15 -152 -49 -171 -1 49 39 208 96 -53 83 124 29 -29 343
4559C43R3k29j86O0o7P2m3J26k39l18L00K24k5k24r5K06L7Kj90LL21j63j03L89
4583B94k84K78k97k38R2L38q8n7R1j87r9L66p2q8l9P9l4j17K85k06P2o4k43O6
4607a52Q3K64k35J0J57P9o23M92J02k71L51k82j55J95K21l40J66j41J37p8M12
4628C92l81j45J77p2nJ82j9j83L0r8M10l00j00j01J60M3M48n47J75k15j93K8J97
4651a17J78k93K29j16K06k39LJ55oL28l94K7J98j78N4N2j3j72j36J01L15M1l3
4674A90j32n41K67M11k88P4J96l74n4N35k05j23M3J04j01J53m4k59J4L83k51L3
4696C1K09j16k52j8J22j31m6j02K57J1K36j92k88K32J1q5l5L0O8K62m3r3l62P34
4720D40m44J04j48J77j58k50M18p6o2j91Q5O9j4P9p5K70k44q1J0K87j64n71M45
$$ plain form
4559 343 436 207 21 81 14 86 43 169 -70 -388 -88 136 111 -113 -208 -2 35 37 -153 -150 171 8 -95 294
4583 294 10 288 -9 -247 -155 183 95 38 129 -58 -157 209 137 49 10 89 55 -62 223 17 89 25 -218 -152
4607 -152 -69 195 -40 -30 127 206 -417 75 177 -94 257 -25 -180 15 236 -104 62 -79 58 -20 392
4628 392 11 -134 43 -29 -34 148 129 -54 -24 -122 288 -12 -112 -213 -53 -10 438 -109 66 -149 -342 -314 -117
4651 -117 61 -232 -3 -119 87 -152 -149 6 0 328 -66 -39 159 -19 35 87 74 -98 -234 -133 182 223 190
4674 190 58 -483 -216 195 -93 -19 177 -197 -251 284 79 -44 -1 103 2 155 111 -148 -134 249 -2 31
4696 31 240 124 -128 -146 -24 -155 -201 -303 -46 -35 201 9 -279 -47 -36 -121 -156 -126 -58 204 161 68 -294 440
4720 440 -4 100 -48 129 -29 -279 139 63 1 -190 -105 -36 -50 29 -46 224 -20 -101 -91 196 32 -539 -94
4743i4Q1K7M4PO6k43L9K25j81J40j54l69N61J52m10J9K48j51K2l18K30l57K56
4766a60K05l4k09K41k8m3J71m34J79N7J56J3j73J54k40J85r2L54k79p1J50k92
4788a90K34Q1j27R6m2p7L9o9J16j43K98j40l49M35j12q8O0J52j45kk2J27j31J64
4812A65N5l08j06L15j42q5L57j1j70q2l5m7J83k29j24J99m0J25j15J57l35K09
4834f4K29k90o0K70q0q0J8M8j47J96m6jj06P4K10j89K47j20k15K73j98O9k22L19
4858A35M5j14J06r7k06J97n4k78J64m6R8j03Q7L21m21r0L56j04j92J55P5J62j7
4881A79k65K62or3m39N69r0r7K4M27m67q1Q6N6k14p8Q7K8J98j3P0k01J29R3j92
4906b8K67l18jk18K30L46j44m0j49J57j44J68j11o5K9j3J38j86j69K55J56m1j59
$$ plain form
4743 -94 -13 14 58 65 131 -112 -73 152 -29 111 -43 -412 149 301 -109 -90 158 7 29 -289 -59 -416 -160
4766 -160 45 11 -198 43 15 -28 143 -291 -112 -55 101 114 -59 95 -145 40 -52 302 23 -48 102 -190
4788 -190 44 125 -2 94 52 -25 14 -55 61 -82 216 76 -273 162 50 -38 22 174 29 27 5 132 1 165
4812 165 220 -88 -194 121 -21 -106 251 240 70 -12 -47 -94 89 -140 -264 -65 -105 20 -95 62 -273 -64
4834 -64 165 -125 -185 85 5 -75 -57 -9 -156 40 -6 -7 -113 -39 171 -18 229 109 -106 167 -31 38 -184 135
4858 135 180 66 172 75 -131 66 12 -266 -102 -148 -50 -153 -66 255 -166 -256 100 -4 -196 -41 34 196 179
4881 179 -86 176 170 77 -362 207 117 20 44 471 4 -77 9 65 -149 -227 -140 -112 86 73 143 -58 71 164 -28
4906 -28 239 -79 -80 -298 -68 278 134 94 -55 102 -42 126 15 -50 -21 -34 104 -82 -251 4 160 119 -40
4929d0j66K59J58k24nJ16K85m67p2K71j87l7q2O24k71k63k75N66k42M8j01J82
4951G7jl00l7J37n3m1N0J29j85J32J08m4k9j37K56J62k57J27o2j39j7L9J41j45
4975h9M22m19P7j52K15j48j14L04m7k84J59J68r9j96L76l47J41J07j42J74R0j86
4997A0o4Q5j19NN3K98l98j54M21q7j64m2L59k69l4J12J02L4o8N1l30K72n6J5J6
5022D8P7k02j10K78J23j19j89q3R0J32l04K38OJ56N4j82j17K93j85k4j08o4M36
5045B44m63K71J70l57l9J29J1k8K98j83j14R0J5J41m00q1K72J04k43J42j00K65
5067A44P2Oj31n5P7j63N8J14k78J61k13M65l43j89L98k80J5J73l6k02K8K64o7
5090A8j24J97j63j16J07Mj49M14j87K58j24k0K22j93j79R4Q7Qk69r0L67k9j69
$$ plain form
4929 -40 -206 53 211 -13 -18 98 383 -84 -156 115 -72 -109 -191 433 162 -101 -376 190 -52 -4 -105 77
4951 77 76 -224 -261 -124 -177 -218 -168 -39 -224 -92 16 -28 -57 -194 62 224 -33 94 32 -107 -124 -85 56 -89
4975 -89 333 -86 -9 -161 54 -94 -208 96 49 -235 -76 92 -7 -203 173 -174 -33 74 -68 106 196 10
4997 10 -54 31 -88 -83 -30 268 -130 -284 137 50 -114 -156 203 -66 -100 12 114 148 80 131 -199 73 17 32 48
5022 48 125 -77 -187 91 214 95 -94 -177 -87 45 -259 -21 -15 141 195 13 -104 189 4 -20 -128 -192 244
5045 244 -219 52 222 -135 -174 -45 -34 -62 236 53 -61 29 44 185 -215 -296 -24 80 -163 -21 -121 144
5067 144 216 222 91 36 113 -50 8 122 -156 5 -208 257 -86 -275 123 -157 -142 31 -5 -207 -179 85 18
5090 18 -106 91 -72 -188 -81 -77 -226 188 1 259 135 115 337 144 -35 59 146 154 -115 -205 162 133 -36
5113c6N7j51J41n6J25j29j18k6K06j28J40J84j59K8j2J53k10p4m4N1M6m5j61L13
5137I5o4Q5j35j42K30k45O1J59J17k58O3l04j85M56K0j29J06o4K4J82p8L77k96
5160G5R6J2k07J25k01J6m5K57j00k80N30l07j30J84R7k29o7J05J72l9j10j56J85
5183a7L8R1K1J63k04j19k34M64k40OJ11k96M7K42J12n69K54M21l89l5L94m28O7
5206a00K2J06k02L97j32r5j21K66j94Q3R4r4J05k52J82j34R6Rm5k19L10l20k13
5229d51L40K42k07J6K16j90K0j03M2O1r8k71L08PK94o17K12K10Nk03R9J42k76
5252b02K60L06o97J51L06j22O7J3o9K5K39K03m37J60l01K7O2j43Q2k53L04O1L9
5275H1K7oj93J10J18k22J91q5j10M7J45O5k14J81k79L10L1j81p7oJ47k4k30J44
$$ plain form
5113 -36 21 -130 11 -45 80 -49 -167 -193 13 -115 25 209 50 78 66 219 9 -65 -109 -58 -12 -57 -218 95
5137 95 31 116 -19 -161 69 -176 -115 44 161 -97 -34 -338 -523 -67 -47 -176 -70 -134 -110 72 -6 371 75
5160 75 171 183 -24 101 -100 -84 -129 128 28 -252 278 -29 -159 25 122 -107 -174 -69 103 64 -46 -202 -17
5183 -17 21 112 133 296 92 -27 -261 203 -37 -31 80 -216 -169 73 185 -384 -130 291 -98 -133 261 -167 -100
5206 -100 -78 28 -174 223 91 -4 -125 141 -53 30 124 30 135 -117 65 -69 27 36 -9 -228 82 -238 -451
5229 -451 -111 131 -76 -60 156 -34 -14 -117 -75 -14 -112 -383 -75 -68 226 -391 -179 31 36 -167 -68 74 -202
5252 -202 58 364 -333 -182 124 2 69 82 13 38 277 480 43 203 -98 -71 -9 -152 -70 -323 -19 42 81
5275 81 108 102 -91 19 137 -85 106 21 -89 -42 103 168 -46 135 -144 166 197 16 -61 -67 80 56 -174 -30
5299c0K00k67J32L33k45k34l4M0K59k23J94k75L1p6J16k1K71j60J58j30L32l66
5321ElN6K47k20j80l7j07K21M1m5J79r1p6Kq0j43R3L42k30J2m4P4j96J77J06j82
5347g9K12J27k03J12j24L2j89O9j61R5J39O3k51m5J70k37K05J46L2m5j08L4K79
5370B73j49K3p4O7p7j22N7Q5P1k78j84L33Q5o8j54J02J40k29L8r9K75o9j33J06
5394A9o3q8K24K21r3l88L21j52J60j15jj59M91l49R7J02l78K81j78k34J96j90
5416b76J76K51j56j67P6L89k60j55L08k95r1J82o5j11J88K8n3J94k15p6j10M16
5438A78k93K18m45M67Kl43M16j96l00k05N88j72J42P0r9K2l90M60j66J79l03K10
5460D0o1J81j34K5k08J13J28N1kj5l4p5n2K28m23M67m0k36%M1K1jj20m7K07N7
$$ plain form
5299 -30 170 -97 35 368 123 -111 -145 -105 154 -69 125 -150 -119 -195 -79 -100 171 11 169 39 371 5
5321 5 2 58 305 85 -95 -132 -239 -18 23 -22 157 66 -10 -8 -88 -231 -138 204 -26 -14 -58 16 -180 -3 103 -79
5347 -79 133 260 57 169 45 77 -112 -43 -204 -109 30 93 -158 -203 -33 -270 -65 81 113 68 -40 -6 273
5370 273 124 147 73 140 63 -59 -2 83 154 -124 -308 25 110 42 -112 -10 130 -99 -61 -160 115 46 -87 19
5394 19 -44 -132 92 313 220 -168 153 1 161 46 45 -114 377 28 125 227 -151 130 -48 -282 -86 -276
5416 -276 -100 151 -5 -172 -96 293 33 -122 186 -109 -200 -18 -83 -194 -6 22 -31 163 -52 -128 -238 178
5438 178 -115 103 -342 125 127 -216 200 4 -296 -501 87 -85 57 127 28 50 -340 120 -46 133 -170 40
5460 40 -21 160 26 51 -157 -44 84 135 133 118 84 9 -43 185 -238 229 189 -47 -47 -6 15 14 -106 -153 54 111
5486A11n7k57J17Q1k27K37J54l26J05J04j97J38K02m04J73K70j99J51j26p8K70
5507B42m03M89j89j39j39M01k65o1qJ74J83j79k23P6J12j59K32l15M52m89o4K14
5529e8R8j14o4L5Q0K06j85J45J88l81r4K11n2K36l23J68Q9k14J84j70Mq4n2L02
5553A55r6j11K9J46J23K09l72q8J67k7l72K25M3M2m0p7J09j67J4kN2K03j67N8
5577E6j59K86rj78J7k3m98K99L15l17L31M6j32L17j65Pl05J82J93p6n8j72j53
5600a96J54R5L9n06O08k49r9J86M8J89k59j76J59O2K20k58rJ76j6p4m0l4j42J69
5624D7R9L3j59M9j03n0J76l25L29n0j06m4j2K06J67n55N78m4k89L48l55j31R6
5647i5J79K6k38L0j02l7K64J82m34j1K74j85l28K66K27k17P3nL70l06L54k26J20
$$ plain form
5486 111 54 -203 -86 -5 -232 5 159 -167 -62 42 -155 -17 185 -219 -46 224 25 176 50 -28 242
5507 242 -161 328 139 0 -139 262 -3 -64 -72 102 285 106 -117 -41 71 -88 144 -171 281 -208 -272 -58
5529 -58 40 -74 -138 -103 -23 183 -2 143 331 -50 -144 67 15 251 -72 96 185 -29 155 -15 -11 -95 -147 155
5553 155 59 -52 -23 123 246 455 83 -5 162 135 -237 -12 31 73 33 -44 65 -102 -88 -90 -38 165 -2 56
5577 56 -103 183 174 -4 13 -10 -508 -209 106 -211 120 166 34 351 186 193 -112 70 263 187 129 -43 -196
5600 -196 -42 53 92 -414 194 -55 -154 32 80 269 10 -166 -7 55 275 17 8 184 168 94 54 20 -122 47
5624 47 146 179 20 69 -34 -84 92 -233 96 46 -60 -104 -116 90 257 -298 280 236 -53 295 -60 -191 -95
5647 -95 84 110 -128 -98 -200 -237 27 209 -225 -236 38 -147 -475 -209 18 -199 -126 -131 239 -67 287 61 181
5670A81j87R9O2o3k26m3K12J78j66l27K76j19m4L54k76J90k60K90j9m19L49o3
5692b1K70j60rj76L4J75p5OJ71j61j57K73M6n25K10r5R0K99Q9m41k5J87k00k04
5716c99N23k6k73J42M27m34l2J22o4L5J41j41J49M5j34O2j79M8O7k38J33p3K5
5739g4l91M07kR8Q1k92L13N4l80J68Q6P1m04M54J03k25J4Q5j0k25P0J69M5l92
5763a77K18k60L31j45k8k0J23k27J34K9J1r1p2O9K10j95J52k1N3P3k44Q4R9r2
5787A4k43K19J42k77j03L90j98p1M0J28k07L26j04N5l6m63J73J72Q3J15l89J80
5809e4MP2r9K25j32j32J82j98J81L07l76NJ01R9l12J98K09j50k26K70l80J61j24
5832a69L81p6O2l8k87pR7J78m41M29k04O9k0m3J91j36J8n4j8q7R4R1k14K39J37
$$ plain form
5670 181 -6 93 155 92 -134 -177 35 213 47 -280 -4 -123 -167 187 -89 101 -159 131 112 -307 42 -21
5692 -21 249 89 80 -96 -62 113 38 44 215 54 -103 170 216 -309 -99 -194 -104 195 284 -157 -182 5 -195 -399
5716 -399 124 98 -175 -33 394 -40 -72 50 -14 21 162 21 170 215 81 143 -36 12 79 -159 -26 -99 -74
5739 -74 -465 -58 -60 38 119 -173 140 194 -186 -18 68 139 -265 189 292 67 81 166 156 -69 1 170 215 -177
5763 -177 41 -219 112 -33 -61 -81 42 -185 -51 -22 -11 -102 -174 -105 105 -90 62 41 94 167 -77 7 106 14
5787 14 -229 -10 132 -145 -248 142 -56 -127 -87 41 -166 160 56 111 75 -388 -215 -43 40 155 -234 -54
5809 -54 -50 22 -77 148 16 -116 66 -132 49 356 -20 -15 86 185 -127 71 280 130 -96 174 -206 -45 -169
5832 -169 212 136 198 160 -127 -134 -37 141 -300 129 -75 -6 -26 -69 122 -14 4 -50 -68 -155 -61 30 -184 55 192
5857A92k62k23L47J20j01j29k22K22J37j25Q1j37j28N2K11K9j23P9k46O1P8k55
5879c42L53J8k5Nk19L26p7k35j27M63j7j29o5P4J77j02k89K1K33j96K49j71J25
5902E0k39J07R4j49J38K00m06L87Q0k39J44j65J2p7J98P8j79j53M03n69L01J15
5924A31r2J70l35n5J48J13o7j00K42l15L32l05J78OJ75M0l0K2m12J47J97k33K54
5947B11m4n02O52k30j78k0J46k40pO3%J56j03J52p6j79L1K60m14J78N2J55o7k13
5971b17L34j2k35Q8K82k06N0J4j17J6O8r7P6J09j21k17L83j79l7K29k32Jj38r4
5995b52O5K12N7j86K98m43K98L01l27M5k79J81R7k62l9K37k5k21J05K08r5j21
6017a46J52J56q3K50m13j7J43k2L0m7q9L5NR7j47J36j32R3Q6n7k51K13J91n2R3
$$ plain form
5857 192 -70 -293 54 174 73 -56 -278 -56 81 -44 37 -100 -228 -176 35 64 -59 20 -226 -165 -87 -342
5879 -342 11 29 4 9 -210 116 39 -196 -323 140 123 -6 -71 3 180 78 -211 -190 43 -153 96 -75 50
5902 50 -189 -82 12 -137 1 201 -205 182 262 23 167 2 14 -63 135 213 34 -119 284 -285 16 131
5924 131 39 209 -126 -181 -33 80 13 -87 155 -160 172 -133 45 51 226 266 236 258 -154 -7 190 -43 211
5947 211 167 -335 317 87 -91 -111 35 -205 -212 -149 -149 7 -96 56 -20 -199 -168 92 -322 -144 -92 63 -4 -217
5971 -217 117 105 -130 -42 240 34 84 98 -19 -3 65 -32 44 153 32 -185 198 19 -18 211 -21 -20 -158 -252
5995 -252 -187 25 82 -104 194 -249 49 350 23 68 -211 -30 67 -195 -234 3 -22 -243 -138 70 -25 -146
6017 -146 6 162 79 329 -84 -101 42 20 50 3 -86 -51 -46 51 -96 40 -92 1 87 30 -221 -8 183 131 224
6042B24k58K79j47j63P2jK2P7j84k16M16k29j34L77P1j99N3n2k44K1J84k3o2J10
6066fM8rJ0j42N4R8j06J63o2j01K30j64Q6J8J03k74pK06N8j55j68J78j07J36j17
6091c0P7L7n8J81n05L07j30Q8J38k41J81j93J47K37k47k03L04Q9k58K54l21J49
6113Cn4l15Q9L43k06k2J58L0k90J73J3K36j81L1p2L39L1l98M52l02rj53J86k25
6137a43K03j76J94q6j22n6J13l4Q9m0R5l10M41m07M93l37j12Q0J99J46k54J05
6159H1%J26k27J73J05j65k2nK04l19J33j75J25l4Pm4j31J00j62k9J58K74l56K17
6183C4Q1k35j03J17J75q0k38K69J01O2K1m2k26K08j9l50J81M9K22k34K09k57J62
6206A07j87J65k11L16j42k41K00K52k52j16K80l29n6L81k48k52K57P6j58J1J94
$$ plain form
6042 224 -34 245 98 -65 7 6 28 105 -79 -295 121 -108 -242 135 206 7 60 8 -236 -215 -31 -54 -116 -6
6066 -6 42 33 43 -99 -45 53 -53 110 48 -53 177 13 99 117 220 -54 -61 145 203 48 -120 58 -49 87 -30
6091 -30 47 84 26 207 -298 9 -121 -33 105 -136 45 -148 -1 236 -11 -214 90 179 -79 175 -146 3
6113 3 -51 -366 -277 66 -140 -162 -4 26 -264 -91 -78 158 -23 8 -64 275 306 -92 360 58 49 -104 82 -143
6137 -143 60 -116 78 -8 -130 -186 -73 -107 -18 -58 37 -273 168 -239 254 -83 -195 -115 84 230 -24 81
6159 81 81 207 -20 153 258 93 71 66 270 -49 84 -91 34 0 7 -37 -168 -68 -230 -259 -101 173 -183 34
6183 34 115 -120 -223 -106 69 -11 -249 20 121 183 204 162 -64 144 125 -225 -44 5 227 -7 202 -55 107
6206 107 -80 85 -126 190 48 -193 7 259 7 -109 171 -158 -214 167 -81 -333 -76 0 -158 -147 47
6227D7k34J23J81j84o3L36k89J24k12K90k35N1k3j3N7j2R6p8j38J8J84n1jn4P5
6252eq8J47j04p5K35j19j1m8J83o4l00M27m77L29O7q3l6J30O9l26O9nN6L7j1k55
6278b58N2J28J39k25J02O6O1Q0j91K4J90m69L53l7J96j69j21K07j30J02Rk07j09
6301b07l0L17j69J49j51K5J46O0j83j90n7M39j47j4j90K45p1J38j6j99J83k27
6323a49K15m4mm3o1K43j64j90N0n9M45L2n72L72j7r1M4j61K70m16K9L14k09K03
6347C7j64J45j05P1J21j5K1j3L9j16N0nr4J04RK16m04m4J30M5L61l68R0j36r1
6372a16n4J33K1L03k20r5j2J42K9o3K6k8k4k78K8M23k22p2jL0K39m22M38l61m9
6397b05K20Q0j31j9q4P9j53R6P1J16j68J05J79k98J40j96L2PJ89n6n5j9J38L00
$$ plain form
6227 47 -187 -64 117 -67 -130 206 -83 41 -171 119 -116 -65 -88 -101 -44 -56 40 -38 -176 -158 26 -25 -26 -80 -5
6252 -5 -93 54 -50 -125 110 -9 -20 -68 115 51 -249 178 -299 30 97 14 -22 108 177 -149 -80 -85 -29 8 -3 -258
6278 -258 -206 -78 61 -164 -62 4 65 145 -46 -22 168 -301 52 15 211 42 -79 128 -2 100 109 -98 -207
6301 -207 -237 80 -89 60 -91 -66 80 140 -43 -233 -290 149 2 -12 -202 43 -28 110 94 -105 78 -149
6323 -149 66 22 18 -25 -86 157 -7 -197 -147 -206 239 271 -301 71 54 -37 7 -154 116 -300 -271 43 -166 37
6347 37 -127 18 -87 -16 105 90 111 98 137 21 71 66 -28 76 85 301 -103 -147 -17 28 389 21 111 -25 -116
6372 -116 -170 -37 -16 287 67 -28 -40 102 131 68 94 66 42 -236 -208 215 -7 -79 -80 -50 189 -233 205 -156 -205
6397 -205 15 95 -36 -55 -139 -60 -213 -117 -46 70 -98 7 186 -112 28 -168 -136 -129 60 4 -51 -70 68 368
6421C68k67kjj96M4M4j27K04j20K91l39j11M0M03p2m3L7j78n1j94J93L3k49L8
6445b55M1M0K39m8p4K25m1qJ27k78M88p25K98j02L68k14j03o9K52r4k15J28k59
6468b79%J96jj45K83Rj00J08j77J61j08K61l60J14K50j81N9o2R8j51K52q1l06
6491a60J13O4j87K88l88K84j94J23K19m4j44j83K42j5P6k09R7j37r2K16K28lk1
6514A73k84J86K12j84k33K02o4j50pK76l48M4L3j15L16k78K77q1J41k91L77K2
6536B24j42l50K65J18k72K26j08L24l29J01J37l63Q4P6j14K02J50n66J60L91j01
6557A13k15J31J64p1nk19Q6j9L25j54R9j98J58J39o6J47j15l13K19k9j46M6K29
6580C06m46K76m2k44J80J96l04oJ50o3r8P5n8j0J02R1k23J8K45k94L87k76J6J74
$$ plain form
6421 368 101 99 98 -98 -54 -10 -137 67 -53 238 -101 -212 -172 231 159 116 153 -25 -76 -270 -77 -44 -293 -255
6445 -255 -214 -174 65 17 -57 168 127 119 246 -32 456 -269 29 -73 295 81 -22 -91 161 67 -148 -20 -279
6468 -279 -279 -83 -84 -229 54 63 -37 71 -106 55 -53 208 -152 -38 212 31 90 28 126 -25 227 146 -160
6491 -160 -47 17 -170 118 -270 14 -180 -57 162 118 -26 -209 33 18 94 -115 -18 -155 -247 -31 197 194 173
6514 173 -111 75 287 103 -130 72 8 -142 -149 127 -221 -177 -144 -259 57 -221 56 -25 116 -175 202 224
6536 224 82 -268 -3 115 -157 69 -39 285 -44 57 194 -169 -85 -9 -123 79 229 -337 -177 214 113
6557 113 -102 29 193 122 117 -102 -16 -35 290 136 235 37 195 334 268 415 300 -13 206 177 31 77 306
6580 306 -140 136 94 -150 30 226 -78 -84 66 3 -95 -20 -78 -88 14 105 -118 -100 145 -149 238 -38 -22 152
6604A52j36k46J78L49l76J75n8No8K83j84Pr6j68K12N9j80J07k20N59k04l08J50
6627hr9J78j75K83q3L8k91J12qK50o9j16J72k97K69j75q3R3J71j03k08J97n8k9
6651c9p2K64l40J38J21l23J45j28K6M06k43j58K20O3l1k09K27j5j83K15J40k47
6673b3O6l2q7K67l6k45L08j87l03L24n2Q6J3m7j99K15j02J17j49J40k64K20j22
6696i2R8n4k5nP2K7K50k29P1l19L07M2j88J67k03J25n6J20J7j11L3l42K04J99
6720A08k00K0J09On8KJ80M6k04Mm8m9J83o8J01J43j56j28Q7P5m18K91J65k07r1
6745a07M6n6K42k8l3k22j58L98j48J46L1j12l13L21K50k02J8j03P7o3J04l4k20
6768a66J96k31L34j28N0l71K94l5k66J36J14j98Q9K60J94o4l33K3J72kj23j8R3
$$ plain form
6604 152 16 -230 -52 297 -79 96 38 43 -25 258 74 81 -15 -183 29 88 -92 15 -205 354 150 -158 -8
6627 -8 -107 71 -104 179 96 134 -157 -45 -53 197 128 12 184 -113 156 -19 -102 -9 162 59 -149 48 -10 -39
6651 -39 -111 153 -187 -49 72 -251 -106 -234 -208 198 -45 -203 17 80 49 -160 67 52 -131 84 224 -23
6673 -23 43 11 -76 191 155 -90 218 31 -272 52 0 86 99 52 -147 68 -34 83 -66 74 -190 30 -92
6696 -92 6 -48 -73 -78 -6 21 271 42 113 -206 101 143 -45 122 -81 44 -12 108 125 14 47 -295 -91 108
6720 108 -92 -72 37 43 -15 -13 167 213 9 13 -35 -84 99 31 132 275 119 -9 78 153 -265 26 191 -16 -107
6745 -107 -61 -117 125 97 64 -158 -316 82 -66 80 111 -1 -314 7 257 55 73 -30 47 -16 88 54 -166
6768 -166 30 -201 133 5 55 -316 -22 -57 -323 -187 -73 -271 -182 78 272 208 -125 -102 70 68 -55 -73 20
6791B0J18j5j20j76K36k03J1L31j61l39K23R1Kj90J63J13p2J16rm09J97J19j4
6814C2j56L07m09K81k39M35n0k76K12j04k3P6k18P9P8Mp0k9L75m01N1Q5P7j57
6838d0K00j39O4M6R0l44N1N0J16J36j22pk44L31j76k03J98o7l39J43K39j23N6
6861h4PQ7J87r6q8K59j95j03Q1P3k78k5l7J86N5p2j03J05j2J32J9J54m15J63R4
6886I4j19o8Or1K86j87RJ34l0o1NL84k08j98m5P7J60k77QK31j58K25k16l11L43
6911gq7L3N8O0j93J43j83J70J62j94m2L2K56k87J6J8l2n1J03J41j33j87J75j04
6935a33R8Q6j50k7j9L25j33j39L00j84J79l37lP8N7j0J34l79M43l14J74L4K39
6958C19n44J37N7J37j94J69j68M0j7O8q2J19M2N6j27l2J68k0q3o2O8L13l45J1
$$ plain form
6791 20 138 123 3 -173 63 -140 -129 202 41 -298 -75 16 18 -172 -9 104 32 148 139 -270 -73 46 32
6814 32 -124 183 -226 55 -184 251 201 -75 137 33 10 86 -132 -53 25 29 -41 -70 305 -96 -45 40 117 -40
6838 -40 160 21 85 131 221 -123 -72 -22 94 230 108 101 -143 188 12 -191 7 -60 -399 -256 -17 -140 -84
6861 -84 -77 10 197 101 13 272 77 -26 55 128 -150 -175 -212 -26 29 -43 -146 -41 -53 79 98 252 -163 0 94
6886 94 -25 -93 -87 -178 108 -79 -70 64 34 -27 -22 362 154 -44 -89 -12 148 -129 -121 110 -48 177 -39 -350 -7
6911 -7 -94 -61 -3 57 -136 7 -176 -6 156 -38 -80 -48 208 -79 -63 -45 -77 -128 -25 116 -17 -204 -29 -133
6935 -133 -35 51 -99 -126 -145 180 47 -92 208 24 203 -134 -137 -59 -2 -12 122 -257 186 -128 46 80 319
6958 319 -225 -88 -31 106 -88 81 -87 -47 -64 4 -78 41 83 139 12 -20 148 128 45 -17 51 364 19 30
6982C0m6r7J14q4J30m4k00J85k73N23j15M2j66J67j50j68J95r6L4k69J31J80r2
7005f9J86K16n30R7J80j38n2K90n0o1k4q7o8K74k27J56O4m06K02o1L8q0K74j99
7029g5n8m8L0jML47m6q5o0NK12l58K21K27n40K47N0l1M8k69R9l0L08k03O1q8p0
7056a03R9o8M0N4J11j43k9j04P6J50k34K80p9K55k61l52L14k96J77P9m9O0m9L33
7080B61j21j24k8m5J04q7N6j29J25J70k73k30L43j70K58l18K58j59K22j15r2L00
7102B06n8k93K47K5M7o4j31J19o8J75j57p2j45K70k88L18k72K57o7J37j0l03M73
7125C46n09J02Mj55J15K44j54P2l64K52J87l20K96m0R5j86J7j81K37l25L97p0
7147F0r3m4R4L7Kn4j27M40l21K8n6j85K22jK3N8l30J45n4M5N3Q1jm1rK20l3L79
$$ plain form
6982 30 -16 -113 1 -83 47 3 -197 -12 -285 238 123 165 -1 166 16 -152 43 -53 -19 -288 -157 23 -69
7005 -69 117 333 -197 -100 80 -58 -110 180 130 69 45 -42 -110 164 -63 93 157 -249 -47 -108 -70 -150 124 -75
7029 -75 -133 -181 -151 -152 -148 199 153 68 8 13 225 -133 88 315 -225 22 72 41 89 -180 -81 -111 197 -6 55 -33 -103
7056 -103 -4 -72 -32 22 133 -10 -39 -143 -67 83 -151 129 50 305 44 -308 6 -290 -113 -34 -83 -23 -72 261
7080 261 140 16 -12 -57 47 -40 16 -113 12 182 -91 -321 22 -148 110 -208 50 -109 113 -2 -94 206
7102 206 148 -145 102 127 174 110 -21 98 30 205 48 -24 -169 101 -187 131 -141 116 49 186 176 -127 346
7125 346 -163 -61 -57 -212 -97 147 -7 65 -299 -47 140 -180 116 76 171 -15 2 -179 58 -267 130 60
7147 60 -33 -77 17 54 56 2 -125 315 -6 22 -34 -219 3 2 25 83 -247 -102 -156 -111 -58 23 22 -19 -28 192 159 538
7175E38n62q7j74L52k57K18j52j35J44Q9j14L40j2k17K64k36k67K60j70K49Q2
7196A53k23K00m4J17l64L73k02L05m04k18J53J49J45m4j66R2j73L96m51J89K08
7217A91j43J64k34J77j04k39K75p2j04J05J32m3J27k26J8N6J59j65J80k01r5J04
7239F2J02l4k33q6K33j11J4J8p1K26j25J07K2r1j59K89k0k03j6j11K60n2J85q1
7263A25m0Qr9l6J52J02j50Q0j52J69m5q1o3P7n6J93k74J48O0j68j04K04Q9k59
7287a20J10J51j86L4L5m7J62N5j77J83l49J95q8K81j63k1L6j01P9j14J89q7j1
7310D6k43O24m51p7R0J25O7k80m8K88l83M67k37j3J86k37L0Nk1K86j04k7N5M1
7334A89l03K99j61J5Q5k21rJ07j02O9lMJ74k59j06J86J56l50K99k56M61rk48J10
$$ plain form
7175 538 -24 -111 -285 67 -190 28 -124 -259 -115 -26 -140 200 188 -29 235 -1 -268 -8 -178 71 153
7196 153 -70 130 86 203 -161 212 10 315 -89 -307 -154 -5 140 96 -70 22 -151 245 -206 -17 191
7217 191 48 212 -22 155 51 -188 87 15 -89 16 148 105 232 6 24 80 239 74 254 53 -42 62
7239 62 164 130 -103 -189 44 -67 -53 -35 -106 120 -5 102 124 33 -126 163 143 -60 -76 -187 73 21 206 125
7263 125 85 93 -6 -42 110 212 62 142 -10 159 114 33 -30 47 -9 184 -90 58 118 -50 -154 50 139 -120
7287 -120 -10 141 -45 -11 24 -23 139 194 17 200 -149 46 -42 239 76 55 91 -10 69 -45 144 57 46
7310 46 -197 427 -24 -101 -11 114 181 -99 -147 141 -242 225 -12 -25 161 -76 -46 -41 -62 224 120 93 148 189
7334 189 -114 185 24 39 124 -97 -106 1 -101 -32 -35 -31 143 -116 -222 -36 120 -230 69 -187 274 265 17 127
7358A27K48m16L54j69j30n3OL2n1N3P0%l4q4j8L6J71j98J12O0k61J47k20L26J42
7383B50k17K4q1J3P6j31p7L49k02j37J69j91j0K52K3j79O6jN0j3J0j65K82r5p6
7408a1K9J58N6k49j47L90p9r6j27j53K47J88k33J48nl10K83m4o6L89k57j93K95
7431B13k82Rk7J8o9J72r5m2J84m8q9J39q9K43l12k63N28j80oL4o3M5M1L2n09M23
7457GR9J06j66J06k39j34J56K24o2l3j34L98j59l23Q4J2n7r6K26N1j98K82K9M8
7481B27j48RR0p1k25L12k07L14j94j47P9j95J72k17j6L68J11k51k99K74j23K02
7503F5l0j11J30J22j50j51M04m04O7l2J10N7j12J95o1k11J65l9j99N5M3J39j1
7526D1j8l7N3r5J20l75J66L04m0m10K58J17k15P7J48J4k4j93K69l2m40M84k38
$$ plain form
7358 127 375 -41 313 144 14 -39 -33 -1 -52 1 71 71 37 -47 -65 -29 142 -56 56 116 -145 2 -218 108 250
7383 250 33 57 -24 -11 65 -66 -143 206 4 -133 36 -155 -165 87 110 -69 -3 -4 46 33 43 -122 160 65 -11
7408 -11 18 176 232 -17 -164 226 147 51 -76 -229 18 206 -27 121 116 -194 89 45 -21 368 111 -82 213
7431 213 -69 -60 -87 -69 -138 34 -61 -103 81 33 -56 83 -6 237 -75 -338 190 10 4 38 -25 20 61 93 -416 7
7457 7 106 212 46 152 -87 -221 -65 159 97 64 -70 328 169 -154 -70 -58 -115 -211 15 66 -132 150 179 227
7481 227 79 88 178 107 -118 194 -13 301 107 -40 39 -156 16 -201 -217 151 262 11 -288 -14 -137 65
7503 65 35 -76 54 176 26 -125 279 -125 -58 -90 20 77 -35 160 99 -112 53 14 -185 -130 -87 52 41
7526 41 23 -14 39 -56 64 -311 -145 159 119 -291 -33 84 -131 -54 94 108 84 -109 160 128 -312 172 -66
7549f6J40l3K16k05K7k27N1LJ5J20j35k1J24j4J26M7n2k40L0J12j49N3O7K99q8
7574B00n4k11n8M05l75L8lJ24j27k22K20k0J28p6P6Q5j23L0j12K25k77L6L69j85
7598I3p7j38m6l3J95l5k65N00j40J7j41J97l93L64k1j17L30m91J83J30q6J83j54
7621E5r4Q1J44n7K5l65K47J85o5k10k32L60L9J22k35q9M16m21j0R0l9J33k80J86
7645a4R1j12K48j16k10L11k54p8j11K77L7j64K61o0k3j01K5M4j1mj33M41q3l12
7669e1M0J66j27jj52M6L16k19J40n8J1N0k41O3J04k32m5K21j42O2qJ00n3r9O7
7694d2K14j91L6k19J51J2j31J28n4J66J74j38K37l46Q2p0l5J06k65K91k49Q4J63
7717A04J9j31kq6O6j05L68k27j20P3m2o6L72j99K15k04M2nLK2j43J99l87L83J01
$$ plain form
7549 -66 74 41 257 52 79 -148 -97 -94 -79 41 -94 -115 9 -5 121 168 116 -124 -94 18 -131 -78 -11 288 200
7574 200 146 -65 -123 282 -93 -55 -58 66 -61 -283 -63 -83 45 -31 45 130 7 37 -75 150 -127 -91 278 93
7598 93 16 -122 -168 -201 -6 -41 -306 194 54 71 -70 127 -266 98 77 -40 290 -201 -18 112 26 209 55
7621 55 -39 42 186 129 154 -211 36 221 156 -54 -286 74 113 235 0 -89 327 -94 -104 -14 -53 80 -200 -14
7645 -14 77 -35 213 97 -113 198 -56 -134 -245 32 69 -95 166 106 83 -18 7 51 40 36 -97 344 261 -51
7669 -51 -11 155 28 27 -125 -79 237 18 158 100 111 161 -80 -17 87 -145 -190 31 -111 -49 -57 43 -10 -109 -42
7694 -42 172 -19 17 -202 -51 -39 -170 -42 -96 70 244 106 343 -3 79 9 -26 80 -185 106 -143 -59 104
7717 104 123 -8 -10 -96 -30 -135 233 6 -114 -41 -83 -149 223 24 239 35 77 72 75 97 -46 153 -234 149 250
7742B50K62o81k13K95J11l11R0K07o9j24J61m6J40l37K76l05J75L31l36j11K75
7763D0j65j3K06J45l93R2K08J08r4j38p3oJ80j2o9J02K7J59l77Kj7L52j74k76
7787a86R6J30O7l82J77j6L5l7p1K17l1j9n1m5J40J3n6j40N6J93k96J98J84l33
7811a57K4K01m4l06L11m6j32J73J6J01m06Q2K65k69K12j92Q4O7NK07j88m8P0n1
7835b1L2j17l5K99k9k11J78l15K30j5K07o1k23L85j17k25m0J02k19J35K31j63
7857Hj57L67k03N0J39l32m3J93J56K8k90p4K73j17K81k97K06m9j01Kl64L40j10
7880i4j51P7o1L48r3k15K14j75J77K6J63j58k07O1J47K1k30J32K08m9j5r9j00
7903g3J81J5k13L52m06J34J48l36L24j37q4J64np5K07j24J38k07k0M8m3R1k3j57
$$ plain form
7742 250 512 -169 -382 -87 24 -287 -197 10 -59 -183 -22 -68 72 -265 11 -294 -119 212 -124 -235 40
7763 40 -125 -138 68 213 -180 -88 120 228 134 -4 -77 -83 97 85 16 118 145 304 -73 -71 -88 264 90 -186
7787 -186 -90 40 107 -275 -98 -114 -79 -116 -187 30 -1 -20 -71 -116 24 37 -19 -159 -103 90 -206 -8 176 -157
7811 -157 -133 68 24 -282 29 -17 -149 24 40 141 -265 -183 82 -187 25 -167 -83 -16 -11 196 8 -40 30 -21
7835 -21 11 -106 -141 158 129 -82 96 -219 11 -4 203 142 -81 304 187 -38 -78 24 -195 -60 171 8
7857 8 -149 218 15 65 204 -128 -171 22 178 206 -84 -158 115 -2 279 -18 188 139 38 40 -324 16 -94
7880 -94 -245 -168 -229 119 26 -189 25 -150 27 53 216 58 -149 -88 59 80 -150 -18 190 141 126 27 -73
7903 -73 108 123 -90 262 -144 -10 138 -198 126 -11 -95 69 64 -11 196 72 210 3 -17 31 -12 79 56 -101
7927a01P5J07l1N9j18n3O6K1o2n6p4L03k3j91J42k35J40N8o0j74K79m27K70J14
7951B9j12J79k92K62q7J55j3j82J13j26K54k83K81L9k78M1J03k35J58J6j2n2j85
7974b27K21l3J95K6k23l9J04K5J48k35J84k12j1j01R9J24j42j50Q7L54r1j18r2
7997a07J96j30K1R6k14R2J47l00L46m29R3K11M4o8K07k72j14K77j12m2q3K54K48
8020C61k80r0j69K33N0n2j38n5J62J3j36L21n1p8p8j18L01k44n9M3J45k00m3K80
8044A18J78m5k47j29K76j76J13k42R5R6J04K2j62j07P2l9l45N05J46l30M70k82
8066I1J13j36k29J78K34k89M20n21K56j29O0L3Oj6k30r2R3J41J77j9j23J25k76
8089a33j30L39j17l3J9J15r1J44j97m9J47P0J62j32k10L8L77l90K6p2J49o5N6
$$ plain form
7927 -101 -26 81 50 109 -9 -62 4 25 -37 -93 -167 136 113 -78 64 -171 -31 27 -33 -207 72 -355 -85 29
7951 29 -83 96 -196 66 -21 134 121 -61 52 -74 180 -103 178 217 -61 -20 83 -152 6 22 10 -42 -227
7974 -227 -6 -39 156 182 -41 -80 24 49 197 -38 146 -66 -77 -178 -79 45 -97 -247 -160 194 103 -15 -107
7997 -107 89 -41 -20 76 -138 -46 101 -199 147 -282 -189 22 66 -2 205 -67 -181 96 -16 -58 -141 113 361
8020 361 81 -9 -178 55 105 53 -85 -140 22 35 -101 220 169 91 13 -105 196 -48 -107 -64 81 -119 -162 118
8044 118 296 251 4 -125 151 -25 88 -154 -59 37 141 163 1 -106 -34 -73 -418 87 233 -97 373 91
8066 91 204 68 -161 17 251 -38 382 -139 117 -12 48 81 87 71 -159 -251 -158 -17 160 141 18 143 -133
8089 -133 -263 76 -41 -74 -55 60 -31 113 -84 -133 14 84 246 114 -96 -58 319 -71 -45 -117 32 -33 23
8112B3J60j33j24q7K72o9j7K4J53r5k30J35j46J46j51k4J51l62L48l00M84l12
8134a54N05j78l89m9K81Qj53O8J59o8n0J17n7R2j63j60J49K9k0j4J02j28Ml0Q
8159i1K42m53N14m37K17j28K4K28j31j8k36Q3K76j74N4J68q3J7k06K36o0M2j27
8182d3J23k38J95k99K74Kp8J35l26
$$ plain form
8112 23 183 50 -74 -161 111 42 25 49 202 107 -123 12 -134 12 -139 -163 -12 -374 -26 -326 158 -154
8134 -154 351 173 -216 -265 16 24 -129 -61 98 30 -20 97 40 132 -31 -191 -42 -13 -33 -47 55 -73 -69 -99 -91
8159 -91 151 -302 212 -225 -8 -136 -112 116 -15 -33 -269 -186 90 -84 -30 138 55 72 -134 102 42 84 -43
8182 -43 80 -158 37 -262 12 14 -64 71 -255
8191b55
$$ Imaginary data points
##PAGE= N=2
##DATA TABLE= (X++(I..I)), XYDATA
0@%%%%%%%%%%%%%%Qj6J6j6J6j7K5l2L7m5M8n6O9p7Q8j04J20j36J52j72J93k17
36a16K48k78L07l42L81m24M71n19N72o32O98p67Q42r29J024j126J243j374J519
55G98j684J872k089K341k641L006l458M034m794N853p424R981j4828K7024j09365
70i1374j85056L37812Q7198k22678P2180J25361j61841J4513J10412r8775l0709
81d2957J17480n1644r6635Q4045K1090q6914N5681M1719p3898k108N9722l3270
93g689m0608O7098J1754n8556K2908l344n0809M9452R2280l8899q7087M1411L2596
106C0507n0825K5083M1308m2557j4513L9156l7187m3511Q0483K0639q4864R897
118b6384M1794m0154j6080M5274m19j3343L2298k7556l4223O0879J9774m2140
$$ plain form
0 0 0 0 0 0 0 0 0 0 0 0 0 0 0 0 8 -8 8 -8 8 -9 16 -16 21 -24 24 -32 37 -40 48 -56 64 -72 80 -92 101 -116
36 -116 132 -146 161 -181 200 -224 247 -272 300 -332 366 -401 441 -488 536 -590 653 -721 798
55 798 -886 986 -1103 1238 -1403 1603 -1855 2179 -2615 3238 -4186 5795 -9033 17991 -91374
70 -91374 -276430 61382 148580 -74098 -1918 123443 -38398 -23885 86527 -12248 -42957
81 -42957 74523 22879 -73756 10289 31379 -55535 146 41865 -32033 -34141 25581 -7689
93 -7689 -48297 18801 30555 -28001 -5093 -8437 -59246 -9794 82486 43587 -43500 -2089 30507
106 30507 -20318 4765 46073 3516 -10997 28159 -9028 -52539 27944 48583 -36281 -26384
118 -26384 15410 -24744 -40824 4450 4031 -9312 22986 -4570 -38793 22086 41860 -280
130b80J5092J7786n9544k1678O2604R449l1353M330p013M485L1191j1948l1832
143a8711L1296L0546n6442k8525L9539m789j8280K9498J3784k6281m321J3539
155H53m933K4518K6456l7243k8694J6393j834j4558K3348J6151l3823j0785K0755
168c396P45R669J5271k1360j9612K2516Q087l0587R325L2185j6064j4921J6427
181H285p832k1642K4654K4230k6784k021J7705l4545j6674M9660J4874m3028M63
194a2655K2085k4717j484K9225j1056q641J7263k1215k0216M7411J8079m6359
206a2280R369L6171l6405k4077L9190R871k4404N379Q06j9805J2918R586j9214
219a2895J2173K5151k6627l0265K5329K1673k0039n893J6485l865j4038M013J3910
$$ plain form
130 -280 14812 32598 -26946 -48624 13980 23429 -7924 -3594 -10607 -6122 25069 13121 -18711
143 -18711 12585 43131 -13311 -41836 -2297 -7086 -25366 4132 17916 -8365 -12686 853
155 853 -4080 20438 46894 9651 -19043 -2650 -4484 -19042 4306 20457 -13366 -24151 -3396
168 -3396 -2651 7018 22289 929 -18683 3833 11920 -18667 -9342 22843 6779 -8142 8285
181 8285 453 -21189 3465 27695 911 -1110 16595 -17950 -34624 15036 29910 -13118 -12655
194 -12655 9430 -15287 -16771 12454 1398 -7243 10020 -11195 -31411 16000 34079 -12280
206 -12280 -2911 33260 -3145 -27222 11968 21839 -2565 2814 3620 -16185 -3267 6319 -12895
219 -12895 -722 24429 -2198 -32463 -7134 14539 -5500 -11393 5092 1227 -12811 -8798 5112
232E112N005L223m005j6261K825J4732q936o541K1686K959l0420n485J6356j756
246a506N279R792j9796j1922J7901j425j2877K0229P481k8144Q38K0222p859l615
260e402J3200m333n098J0355j0395j1338K7563J2964k6162q929J4235l738j0852
273g930N447P103J076n247j3797j694J6409M461q833L292O332j2775j3309J1968
287g497J8040k762j4209j951Q765K722j98L664M533J763q177j2764M971J4509
301A1409o874j3314J0223N518j7678j846J5358K073l386j6j0166k918J3639k316
315b94r605J5297N488k1505j090J7490k256j772J3104p563j4034Q902J226r218
329e830J3477R075k1146r199J3439O42l786P467m499p497P131j077j0377J1938
$$ plain form
232 5112 10117 13340 9335 -6926 -4101 10631 1695 -4846 16840 19799 -10621 -16106 250 -1506
246 -1506 3773 13565 -6231 -18153 -252 -1677 -14554 5675 13156 -14988 -14150 6072 -1787 -5402
260 -5402 7798 3465 -1633 8722 -1673 -13011 14552 27516 1354 -7575 6660 2922 -7930
273 -7930 -2483 4620 5696 449 -13348 -15042 1367 5828 -3005 287 6619 -6156 -19465 -7497
287 -7497 10543 7781 -6428 -8379 386 3108 2910 6574 11107 12870 4693 -8071 -3100 11409
301 11409 4535 -8779 1444 6962 -10716 -12562 2796 4869 1483 1467 -8699 -11617 2022 -294
315 -294 -9899 5398 10886 -10619 -11709 5781 3525 1753 14857 7294 -6740 2162 3388 -5830
329 -5830 7647 16722 -4424 -13623 -184 458 -3328 4139 -360 -7857 -726 -1803 -12180 -242
343b42J5083j3751j2287J0874M121q306L755R250k872o429k387j082N221P819
357H767m908o079P215N9j7732P42K2301k56j8554P34P774l809J712O444k119J374
373C665K237j3972j387J9874j452j4397P814M245j6282P33J5383k912m043L151
387B657r231k502J3395k995q434J2514M331j6242Q0J0757l465J146P257r573p464
402g769R907J058q519Q058J0015r627j1059L784M859l25oj595l823r34n94k278
418h848O570J2238m235j4177N590J3149o670o241J2400J821j5367k165Q445N78
432C088P15j004p106N449P301j6015q397K1109O154k0026k469R758o195J4J3004
447E380j087o472L995l228l165J3155L271j4502K763J0150j0386n867J3822K326
$$ plain form
343 -242 14841 1090 -11197 -323 3798 -4508 -753 8497 5625 -804 -3191 -4273 948 8767
357 8767 3859 -2220 4995 5054 -12678 -11936 10365 10109 -8445 -7711 63 -3746 -2034 4410 2291 3665
373 3665 5902 -8070 -9457 10417 8965 -5432 2382 6627 -9655 -8922 6461 3549 -494 2657
387 2657 -6574 -9076 4319 1324 -7110 5404 9735 -6507 -6427 4330 865 2011 9268 -305 -7769
402 -7769 2138 3196 -5323 2735 12750 3123 -7936 -4152 707 382 376 -1219 -5042 -5976 -6570 -8848
418 -8848 -2278 9960 5725 -8452 -2862 10287 3617 -2624 9776 11597 -3770 -5935 2510 3088
432 3088 3803 2799 -4307 1142 8443 -7572 -15969 5140 11294 -8732 -11201 -1443 -7638 -7624 5380
447 5380 4293 -2179 1816 -1412 -4577 8578 11849 -2653 110 10260 -126 -5993 7829 10155
461A0155j0045J737M63r259K642O057p167j766Q976n917j1720R207J1318l006
475A675oK779p187j685J1409r16p050O637N64j4630L726J6006n497q960P501J210
491E576p004K353k132o698R545L810j6776p26J4957r060p594K1122N623k0001
505g005j500J0445R80O156J315j5645M34J4363r956n740J7378l605j8679R922
519a137J0017j3608m08R134p109l92R770j0514q553J5806K668j0357Q133L549
533F999j7032Q39J7280k652o557M674o398p305J4785Q712j3017l379P800n825
547a076l758Q526j753q950N729L597q021L307O898r369K30J8332l457k0089M916
562d938J0896o188P41N780j1014n354J0294j025j884J3032m923j9629J1112J6412
$$ plain form
461 10155 110 1847 2310 -6949 -4307 1750 -5417 -7183 1793 -4124 -15844 -6637 4681 1675
475 1675 1669 4448 -2739 -4424 6985 6069 -981 5656 6220 -8410 -4684 11322 5825 -3135 4366 5576
491 5576 -1428 925 -1207 -7905 1640 5450 -11326 -12052 2905 -6155 -13749 7373 12996 -7005
505 -7005 -8505 1940 2920 9076 10391 -5254 -4820 9543 -413 -6153 11225 7620 -11059 -1137
519 -1137 8880 -4728 -5136 3998 -3111 -3503 6267 -4247 -12800 3006 5674 -4683 3450 6999
533 6999 -10033 -9194 8086 5434 -1123 3551 -2847 -10152 4633 13345 328 -3051 4749 -1076
547 -1076 -4834 3692 1939 -7011 -1282 2315 -5706 -2399 4499 -4870 -4640 13692 10235 -9854 -4938
562 -4938 5958 -230 511 6291 -4723 -10077 217 -808 -2692 10340 5417 -14212 -3100 13312
576A3312j3566p357J2591k911q732P677P08o687O866K922o714O133M017j5369
590g110j264J8191j57j3811L80N33k866P147N471p520k443K036n148K810J1364
605G613m393j0993N344O258l985M21L893m569L59P700l717q200K788L220j735
620DL130J477q702l646O267L590J669K30q084n603Q804N100p205m94N463m486
636b486m463P385M568l175j13p6n36M406j198r006L482J0450o161q710N708J599
652A674p636M561Q682n318o719m08q66N800P234q450q663Q910M114q204M468Q501
668G680p126l468O929o63l782L520p34k670N271o66r623J613P714j523k234J670
684A908m146n397N126M540k930p74N98m370r2O747K675l814j471K660L56o93J1
$$ plain form
576 13312 -254 -7611 4980 2069 -6663 1014 1722 -4965 1901 4823 -1891 4242 8259 -7110
590 -7110 -8374 9817 9660 -4151 -3771 -3238 -6104 1043 6514 -1006 -3449 -1413 -6561 -3751 7613
605 7613 3220 -7773 -2429 3829 -156 265 4158 -411 -52 7648 3931 -4269 -1481 1739 4
620 4 3134 4611 -4091 -7737 -1470 2120 3789 4019 -4065 -9668 -864 4236 -2969 -3463 2000 -2486
636 -2486 -6949 436 5004 1829 1716 1640 1104 5510 4312 -4694 -1212 9238 3077 -5633 75 1674
652 1674 -5962 -1401 7281 1963 -4756 -5164 -6030 -230 7004 -1446 -10109 -1199 2915 -5289 -821 7680
668 7680 554 -2914 4015 3352 -430 3090 2356 -314 4957 4291 -5332 -3719 3995 2472 238 1908
684 1908 -2238 -7635 -2509 2031 -899 -1673 -1075 -5445 -5537 1210 3885 71 -1400 1260 1616 923 934
701I34K93J949J595m332l191M646J429n238K026N488m745o768K025L184J601M65
717A361l786k603L768o51l125P030M147q293k527O979J09k820J769Q34j16Q90
733B966l931k350O935J359p273J778L971n472l730O065J875k261o27k728j229
748d652N687Q19l523K693K282n773j336N624L84j635K067j385m233J818L444k240
764D1p16L129q03l715o4J926P96J082j215k694R94J622j768O49N068j633o293
781c594J190M911j722k272K882J280l240k511k3K910K791k376l275K649K065m124
797b459j073O725J721n878j901L124J021j89k57N04J266r89l967M73N441o58m487
814a583P46J698l923j160L817J244j681q36j032L37K233R88j49Q75P1j964p0Q81
$$ plain form
701 934 1227 3176 4771 439 -2752 1894 3323 -1915 111 5599 854 -5914 -3889 -705 896 1361
717 1361 -2425 -5028 -1260 -1911 -5036 1994 6141 -2152 -4679 2300 2409 -411 1358 2192 2076 2966
733 2966 -965 -3315 3620 4979 -2294 -516 3455 -2017 -5747 318 2193 -68 -695 -3423 -4652
748 -4652 1035 1854 -1669 1024 3306 -2467 -3803 1821 2205 570 2637 1252 -2981 -1163 2281 41
764 41 -675 2454 1651 -2064 -2128 -202 594 1676 461 -2233 -1239 383 -1385 -736 4332 2699 -3594
781 -3594 -2404 2507 785 -1487 1395 2675 -565 -3076 -3099 -189 2602 226 -3049 -400 1665 -2459
797 -2459 -3532 3193 4914 -964 -2865 259 1280 1091 834 1338 2604 1615 -2352 -1879 3562 2904 -1583
814 -1583 -837 861 -3062 -4222 -405 839 -842 -1678 -2710 -2373 -140 848 699 1574 1645 -319 -389 492
832D92J082J343L45k646j844J857J341p57q98R47m24l043j898K460K140j218k061
849b782k7M84M36l99J235L647L49m725p17N346K29l413K871K782m106k561J762
866D11J276J174q76l966L88K566l313k706N445J941n733o97L464k28o91K167N2
883F74j081K04j703L14M468O18k813Q87J794k880n41L211L35k285p94j222k364
900c178J481J678j264q25J564q67j553J893J978o08M43l20l056P05L952o55k366
917i98K699Q87m276M24M373k65j406qj716j16J213k196j230N017m35o230J061
934c202M706k492j192L842L14l106P9m47P28L944r96m493J870L218m251j2N051
951C561j133m947J202J708j049N41P40r41J337K83l334M31L640q77j836J593j185
$$ plain form
832 492 1574 2917 3262 616 -1228 629 1970 1213 315 1262 838 -2205 -4103 -1643 497 -721 -2782
849 -2782 -2809 -2325 -1889 -2288 -1053 2594 2943 -1782 -2499 2847 3076 -337 2534 5316 1210 -1351 411
866 411 1687 2861 1985 -1981 -1593 973 -2340 -5046 399 2340 -3393 -4090 -626 -854 -1545 622 674
883 674 -407 -203 -1906 -1592 2876 3494 681 1568 3362 482 -59 3152 3487 1202 408 -814 -3178
900 -3178 -1697 -19 -1283 -2108 -544 -1411 -2964 -1071 907 299 742 422 -2634 -1929 2023 1368 -998
917 -998 1701 2588 -1688 -1264 3109 2844 1438 1430 -286 -402 811 -1385 -2615 2402 1967 -4263 -3202
934 -3202 1504 -988 -2180 1662 1976 -1130 -1051 -1498 -770 3174 2178 -2315 -445 2773 -1478 -1490 3561
951 3561 2428 -2519 -1317 391 -658 -117 623 -318 1019 1302 -2032 -1601 2039 1162 -674 919 -266
968b66l405J712K996n74K5J96j844p46L359P81j128p62j215r18J188Q61j761Q23
986f78J807j338j066K213Q15k421J077K845r68l723j139J684K099J048k643k038
1002b426J967J7j618K767K597l858l662K894K192m62m46p42l23K104%k645K230
1019E86K572l546m43M746k391m928K910L818j294j258o42l230J615L688j820j589
1035a206Q30k290k020N047K106m074PK112j304O72K853k022j856K536Q45k003
1051B33K76k91j391K723K429l061k159R92n76J08M142j004o566q26M128J115j405
1068a133O79r42r44K099P07o41J764l7l208J988M141l418l881L322L309k204q61
1085G40k17k342J093K575q30o26m25m277o45P300N79o243K90K843j663J034L336
$$ plain form
968 -266 -3671 -1959 1037 463 488 684 -1160 -1906 1453 2234 1106 344 -871 -1789 -601 260 -1501 -678
986 -678 1129 -209 -1275 938 1753 -668 409 3254 2286 -1437 -2576 -892 1207 2255 -388 -2426
1002 -2426 -459 -442 -2060 707 3304 -554 -4216 -1322 870 408 -38 -780 -1103 1001 1001 -1644 586
1019 586 3158 -388 -831 3915 1524 -3404 -494 3324 2030 772 130 -3100 -1485 2203 383 -1206
1035 -1206 -376 -2666 -4686 361 2467 -1607 -1600 512 -792 -120 2733 711 -1145 1391 2236 233
1051 233 509 218 -1173 1550 3979 918 -1241 -249 -825 -717 3425 2421 -4145 -4971 -843 272 -1133
1068 -1133 -454 -1396 -2340 -241 466 -175 1589 1552 -1656 332 4473 1055 -2826 496 3805 1601 740
1085 740 523 -1819 -726 1849 1019 393 -32 -4309 -4954 2346 2925 -3318 -3028 -185 -1848 -814 2522
1102B522k672j738L173k62j689L028o85l947L909L451m659k040L162j984m94M767
1118C842j680o863J887L319j820J643J771m922j596N180n9j328K514j496m164
1133c772L932M024m861j441M743o26l044K413K93l726J437K868j484p64M70m040
1149c578N82O540j278n502J817K514l517J378M774l018l748K636J012j491K886
1164B007j030m005L729K889m899r24M859k138k653M077k77n216K186K660j621
1179c56J446J543n000n75N322q39k314K429q67m159L455K481l554J09K412k303
1195g70j379L909j065l261K708J178k066O11M22k845J720M244k238l424K947O42
1211A333k989K520L167l409k696K284M4n33J854j375k300K111N60l381J763L438
$$ plain form
1102 2522 -150 -1888 1285 1023 -666 2362 1677 -2270 1639 5090 431 -1609 1553 -431 -925 3842
1118 3842 2162 -4701 -2814 505 -1315 328 2099 -2823 -4419 761 702 -626 1888 392 -3772
1133 -3772 160 4184 -677 -2118 2625 1999 -1045 1368 1661 -2065 -628 2240 756 -8 462 -3578
1149 -3578 -2996 3544 2266 -3236 -1419 1095 -2422 -1044 3730 712 -3036 -400 612 -879 2007
1164 2007 977 -3028 701 3590 -1309 -2233 2626 488 -2165 1912 1635 -3581 -1395 1265 -356
1179 -356 1090 2633 -2367 -2942 2380 1541 -773 1656 789 -3370 85 2566 -988 -879 1533 -770
1195 -770 -2149 1760 695 -2566 142 1320 -746 -135 287 -2558 -838 3406 1168 -2256 691 1333
1211 1333 -1656 864 4031 622 -2074 210 254 -279 1575 200 -2100 11 571 -2810 -1047 2391
1227B391l598k180M436n8l841J692K768j531J07J108k374N57L610j800j655K704
1243B336n13m258J973L557l222j446K583j266k370K666L03k457J759O86k716N27
1259a858K575j290n42K708j183j651J523J096j504J241K063k601j729K157N98
1274A603j138J11J32j141j07J67q64O69J277j936j379J795J106k271M29K482k50
1291F85k010Q02J273L63J34P3m79L10n12j255Q93K169j439k067R52Q96k101K79
1309a034J841o06j531K98n8p8J077k65o77J320K4k019J357J737p14l21R38n30
1327G59j306J204P36r39J41m0r86k17N98k86N59J04j320o64J176P51j095O30R15
1346G20r39j133P21J352n12l85P71j11o36m80N71Q69P05j222j360J110J279k196
$$ plain form
1227 2391 -1207 -3387 1049 991 -2850 -1158 1610 79 186 1294 -1080 -523 3087 1287 -368 2336
1243 2336 1823 -2435 -462 3095 -127 -1573 1010 -256 -2626 40 343 -2114 -355 331 -2385 -1858
1259 -1858 717 -573 -1115 1593 410 -1241 282 1378 -126 1115 3178 577 -1152 1005 1603
1274 1603 465 576 708 -433 -540 -373 -1237 -568 709 -1227 -2606 -811 295 -1976 -1547 935 685
1291 685 -1325 -523 750 1113 1247 1320 841 1151 639 -616 277 2446 1007 -1060 -108 788 -1313 -1034
1309 -1034 807 201 -1330 -1032 -1090 -1168 -91 -356 -1033 287 311 -1708 -351 1386 672 351 1289 759
1327 759 -547 657 1393 454 595 555 -431 -648 -50 -336 223 327 -993 -1657 -481 270 -825 -195 720
1346 720 -219 -1352 -631 721 209 -176 595 484 -152 -632 -61 808 1513 291 -1069 41 1320 -876
1364h76n4K358m95k433R25N89o9M7J28n47N91l3j339R83J962j438j513J660o4
1383C82j769R19J223n69p40R1k47M80O06r0o9M87o74q90R38J014q26j99L62o79
1403b50n21O57J172n10p10M47l17l48JN75J51m74j150M01L29L73m88L58R28o95
1423g1j177Q58J664n33m94M99J64n05p80K04J424K74j724o82R93Q1q81L86O51
1442C51l99j176p9J010K20j66m30K50P43p82K4Q28N67l72n14N45j9n40O70O99
1462A430j89m47j086q4M55j52k40O84j034j189M12J207j1m47N38m15j57O35J18
1481B8J41L82m04k43J151j82j464J226J639q71j697R30Kj065O57N93o42j342l11
1500a472J48J265O75j553r82J861J45j087Q65J438j316r53J787L81j146K85L29
$$ plain form
1364 -876 -930 1428 933 -1500 -575 14 -55 -8 120 -427 164 131 -1208 -225 1737 299 -1214 446 382
1383 382 -1387 -468 755 186 -554 -463 -710 -230 376 286 217 704 30 -860 78 1092 266 67 429 -250
1403 -250 -771 -114 1058 548 -162 285 -32 -380 -379 196 347 -127 -1277 -876 -547 -174 -662 -304 624 -71
1423 -71 -1248 -390 1274 741 247 746 910 405 -375 -171 1253 1527 -197 -879 114 195 -686 -300 351
1442 351 -48 -1224 -1303 -293 -73 -239 -669 -419 324 -458 -434 394 961 589 75 620 601 61 731 1430
1462 1430 1241 794 -292 -376 79 -73 -313 371 -663 -1852 -1440 -233 -244 -691 -153 -568 -725 -90 28
1481 28 169 551 147 -96 1055 873 -591 635 2274 1403 -294 636 638 -427 230 823 181 -1161 -1472
1500 -1472 -1324 -59 616 -937 -1919 -58 87 -1000 -135 1303 -13 -966 821 1202 56 341 670
1517F70QR44m32j878M30J494q38q20J411p84k588J553K062j334q59Q03j019k20
1535a397K297j69j748Q97O91j385J355J098k292R8K266q43j516J671o92j592J698
1552D37J474k304q18J176l28K72J546j586k201K440M03j642J486J596l246n47
1568a842L041J70k253R25R6m53J091M24k289M09J811j580N6K192j669k947K741
1585g7K289j850q62M75r84L56K265p24j892J499q18j229K678J164l712r9K888
1602A367r62j638J808n16k538K617J665k913j79J839j024QK958k182k586K687
1618D11O84j775K137R07m061j27M002j149j937J515k80k228J963Q97k511J25K074
1635F47j838K04K965k174l248L646K365l162K0J734j766q2K889q24j799Q60j85
$$ plain form
1517 670 678 1622 1190 -688 -258 1236 398 -422 989 205 -2383 -830 1232 -102 -961 -158 -1177 -1397
1535 -1397 900 731 -1017 -120 571 -814 541 1639 -653 -555 1711 868 -648 1023 331 -1261 437
1552 437 1911 -393 -1211 -35 -363 -91 1455 -131 -2332 108 511 -1131 355 1951 -1295 -1842
1568 -1842 1199 1369 -884 41 137 -316 775 1199 -1090 -681 1130 -450 -394 1798 129 -2818 -77
1585 -77 2212 362 -500 -25 -1009 -653 1612 888 -1004 495 -323 -1552 1126 2290 -1422 -1521 1367
1602 1367 405 -1233 575 59 -2479 138 1803 -1110 -1289 550 -474 -466 2492 310 -2276 411
1618 411 1095 -680 1457 2364 -1697 -1824 2178 1029 -908 607 327 -1901 62 959 -1552 -1427 647
1635 647 -1191 -987 1978 -196 -3444 202 2567 -595 -575 1159 -607 -689 2200 1376 -423 437 252
1652B52j041K354P06m031R2L163j476j943K211k58k171J411J799k045k64J355
1668A14j067M47K597j887j936K047J218j781J219Q72k874k5K854n96j569J038
1684F71o22j428J493J026k451K87J092j144R9J593j291j534K795M71k053M55J572
1701A031j421j35K209n70j088M44n78j4J899j48k608N44J536j372p96J837o82
1718H8j884Q20J531j112k99N51m53O40R76j365p01J880M01j304P78N95j354n56
1736g68J925K35j444K80op56M68Q56j143k86R18q02n19J506k66j298Q34P13j023
1755e76J10J157q99l97J498k86q63L91J15l52N80k7r00M76L50p92k82J566j78
1774F91j634K02J401o83o90P01K30k68l92J12N7P69k48r39O07P83j181j60R20
$$ plain form
1652 252 -789 1565 2271 -1760 -1668 1495 19 -1924 287 29 -2142 -731 1068 -977 -1241 114
1668 114 -953 -506 2091 204 -1732 315 1533 -248 971 1843 -1031 -1056 1798 1202 -367 671
1684 671 49 -1379 114 1140 -1311 -1024 68 -1076 -977 616 -675 -2209 586 1057 -996 -541 1031
1701 1031 -390 -525 1684 1114 26 470 -108 -122 1777 1629 -979 -435 1101 -271 -1067 770 88
1718 88 -1796 -976 555 -557 -856 -305 -758 -118 858 -507 -1208 672 1073 -231 547 1142 -212 -768
1736 -768 1157 1392 -52 228 222 -534 -66 790 -353 -639 279 -523 -1042 464 198 -1100 -266 447 -576
1755 -576 -466 691 -208 -605 893 607 -256 135 250 -102 478 451 -449 27 377 -415 -697 869 691
1774 691 -943 -741 660 -23 -713 -12 218 -50 -442 -330 -273 496 248 -691 -84 699 -482 -642 278
1793B78L05q77m59Q49j30J9l3P5L11j57n81J37J099l82p86L31K82J69o82N49L14
1814F31m47L6k81n3j45J83l05J99k08r6J03J95R2l17N33j59j40J03N36j22j66
1835A72J03J63j27l00K99M89j86o72k3L23o0q74M1Q64k98q78J70O85j23n71K73
1856e30P50l08m43K28M69L20k58j80P3Q89p28m74P02N43r81n08O29O9m79k23N54
1877A14j3o34jm5K91K17m69K44K86l23j28P30M8j71P9K38j95k6L09L15m83k50
1899A33o7nJ25Qp5k72j43m83LO27J21m97l94R54p06J16M53L86P0p11M16L38j6
1922C81n49L13N76j35n96J19M12L9p27R8N19l58r26r7J370mj163J37M34j13r4
1943c64J28L94k9m77JN00K57l52l01O50N9m36j60L93J67N7m04K57n38l44N30J69
$$ plain form
1793 278 583 -294 -753 96 -34 -15 -48 27 338 181 -400 -263 836 454 -332 -1 281 450 -232 317 631
1814 631 184 220 -61 -114 -259 -76 -381 -182 -390 -486 -383 -188 -96 -413 120 -39 -179 -76 460 338 172
1835 172 275 438 311 11 310 799 613 -59 -82 241 181 -693 -652 212 -86 -964 -794 -109 -232 -803 -530
1856 -530 220 -88 -531 -303 166 486 228 48 121 1010 282 -192 510 1053 72 -436 193 262 -217 -440 114
1877 114 101 -533 -534 -579 -288 -71 -540 -296 -10 -333 -461 269 317 146 225 463 268 242 551 866 383 133
1899 133 66 61 186 194 119 -153 -296 -779 -776 -149 -28 -525 -919 35 -671 -555 -102 284 354 -357 59 397 381
1922 381 -168 145 721 586 -10 109 521 560 -167 -69 450 92 -834 -931 439 435 -728 -591 -157 -270 -364
1943 -364 -236 158 129 -348 -347 153 410 58 -243 407 466 30 -130 263 430 487 83 340 -198 -542 -12 157
1965A57j44j88J26l86L43R2k37L20M0n96J11Q59l87q03Q68L07m89l63M14J6j19
1986e9L9J85j92J75n02k48J462k93j633M81J052j25l32L10J34o09k72M45J22N20
2006F60p48p05P19Q69j101o78J435j22q51K18P39r34m9Q32j77J57J64q59j09J261
2026G21j34o92K13M78q59L92P22n74j014P50J73p52P83N5j186J06J120k34o98
2045f30L54j97j99J378n2j345L17J111n04k25J327o52j710J119R27p20Q9j68r29
2064g09R10N15j466q3J101n67j230J596N34j629NJ237k32M8N07j076r1J540L4
2083I44q79L01N38j566Q15J489j001j365R41K6m79P61l35j055K93P92o53j06P65
2102B26p88n13J695K02j717M66Q98p43M80J110q28j534J338P66q11L84j2j480
$$ plain form
1965 157 13 -175 -49 -435 -92 0 -237 83 123 -473 -362 497 110 -693 175 482 -7 -370 44 60 -59
1986 -59 -20 165 -27 148 -354 -602 860 567 -1066 -585 467 342 10 320 454 -155 -427 18 140 660
2006 660 -88 -793 -74 795 -306 -984 451 329 -522 -304 435 -499 -548 284 107 264 428 -431 -540 721
2026 721 587 -105 108 586 -273 119 841 267 -747 3 176 -576 207 262 -924 -818 302 68 -630
2045 -630 -276 -473 -672 706 654 -691 -374 737 233 8 1335 683 -1027 92 1019 299 388 220 -709
2064 -709 201 716 -750 -833 268 -299 -1529 67 601 -1028 -1023 214 -18 30 537 -539 -630 910 944
2083 944 65 366 904 -662 153 1642 641 -724 217 243 -236 525 190 -865 -572 220 -433 -539 226
2102 226 -562 -1075 620 822 -895 -429 469 -274 206 1316 488 -1046 292 1058 247 631 619 -861
2120h61R17J083j459j50P16j017n68J921K31k038K37J538m70l66N25n41n69J423
2138E52r0n31P91k53j795J446J740j999o84Q39L11n45M31P9r46K44N73l31K27
2157E9N12j200l66J832k49j515O98N70m41qQ88n27j044R97J53m08O48m18j141
2176i60Q78R95q88l81O21o05l10J149K86j424M10R02q28L52K98q84P3M95K6l99
2196a94Q06q72m77R78P05j575L0J159n06m19O67J78r58L9O40k39M04M66j270L93
2216d5J097p01q54M53O90j048L02P04o99m82M98O3j97M36o09n89R94M28r33jQ08
2237C15m93k36O91K40q08M17N3j15L99M21o11m47P12l11m00L41j53n52Q3R10r42
2258d86n7N53o82J43M39M15q95J45N82KJ46q6n12L88M15k92k53N88j00p22K86
$$ plain form
2120 -861 56 1139 -320 -470 246 -771 -1339 582 813 -1225 -988 550 80 -286 239 -302 -871 552
2138 552 462 -69 722 469 -1326 120 1860 -139 -823 16 327 -218 213 292 -654 -410 163 -168 59
2157 59 571 -629 -995 837 588 -927 -229 341 -100 -108 780 253 -791 206 359 -49 599 181 -960
2176 -960 -82 913 25 -356 265 -340 -650 499 785 -639 -229 673 -155 197 495 -389 -316 179 205 -194
2196 -194 612 -260 -737 241 946 -629 -599 560 54 -365 302 480 -478 -439 201 -38 366 832 -438 -45
2216 -45 1052 351 -503 -50 640 -408 -106 598 -101 -583 -85 -22 -219 217 -392 -981 13 441 -492 -493 315
2237 315 -178 -414 277 517 -291 126 179 64 463 884 273 -174 538 227 -173 168 15 -537 -454 456 -486
2258 -486 -543 10 -672 -529 -90 325 -570 -425 157 159 305 219 -293 95 510 218 -35 553 453 -269 17
2279A7O41n26m18J96L07k71q5l40j98Q67k96n27M51M49r06O3R35j03m84OM30J73
2301C81n9j45K6K21J62o80J36O35o59m39K85L23n74j52K64M60n33L43m13J69J53
2322i6r2L6J14J60k73l6K86NO0K94N2o74J44M90l45k96K79p7l55Q2j56M37Q4k74
2346a51q1J62n3m09J97N55k26l65J37N81j39l72K47M69l09l11J93O5OK02o86L47
2368E9L57p67O2N17J8k12k9L9L2j09j71J78Q5k97m7L80M9p3k36K49l6k35K25O5
2392A03j25J25k11L53j18k78J53%J90j02j85J11J15n2m9K60k65j16J29RJ50n39
2414c42M22K10m02l25K67L46J18k26n47M39J76m21J31M64l15k01P5N43r5n31L00
2435H6L16m10j0J89n1P3k94m9N1K13n89N4O39l76K9l31J90J06J76j58J72K15p1
$$ plain form
2279 17 658 132 -286 -90 217 -54 -139 -479 -677 190 -106 -633 -182 267 -639 -576 359 256 -228 -222 208 381
2301 381 322 177 203 424 586 -94 42 677 18 -421 -136 187 -387 -539 -275 185 -348 -5 -418 -249 -96
2322 -96 -188 -152 -38 122 -151 -187 99 104 164 458 510 -164 -20 470 125 -171 108 31 -324 -242 -398 39 123 -151
2346 -151 -232 -70 -123 -532 -335 220 -6 -371 -234 347 208 -164 83 552 243 -68 125 190 196 398 -288 59
2368 59 416 -351 -289 228 246 34 5 44 76 -33 -204 -26 59 -238 -285 95 144 71 -165 84 48 -187 38 103
2392 103 -22 103 -108 245 127 -151 2 2 192 90 -95 16 131 79 30 290 25 -91 38 47 197 -342
2414 -342 80 290 -112 -437 -170 176 294 68 -479 -40 136 -285 -154 310 -5 -206 -131 412 317 -214 86
2435 86 402 -8 -18 171 120 193 -101 -150 -99 114 -475 -421 218 -158 -129 -460 -270 -164 12 -146 26 241 170
2458A70j37K48P3L0k64J96J5m39L65q3k25J21K18j05k84K25k56l68K77p7n2K14
2480a38j32k1pO23j72n39M80Ok96L19L01m08J29m9r6N39l6n94M0M53k78m41L9
2503b78L42j10l06K68j19k80J01J84J98L87n53j72M32K43k48k00N23k52k72L40
2523B28L74n21O2j06j3K7K73o42R1K24k38n0K77r3m94M03M23l68J35j15k5J00
2545d8M02O0l82N6r4m5M73o6k74PJ91k74l61O55j34m83j92Q93k90l04L0K47k46
2568a79N04n12k21N22r0m65L76K57m14o4O81K16n68o8Q3q7L03kl91j48J79k14
2590c02L96N74n08p53L53P41p08J97J57l64L59R3k26l55M08P3l75M12J18q77K10
2611c77L52M3O2O6j71n79O85J92r5j42J6m16M82N94n41n20P72j27p85R23j80p78
$$ plain form
2458 170 33 281 354 384 120 316 331 -108 257 174 -51 70 288 183 -101 124 -132 -500 -223 -300 -352 -138
2480 -138 -270 -291 -298 325 153 -386 94 100 -196 123 424 16 145 96 0 539 503 -91 -51 402 124 -317 -278
2503 -278 64 -46 -352 -84 -203 -483 -382 -198 0 387 -166 -338 94 337 89 -111 412 160 -112 228
2523 228 602 81 143 37 24 51 324 -318 -227 -3 -241 -291 -14 -107 -601 -198 225 -143 -8 -123 -148 -48
2545 -48 354 414 32 88 -6 -51 422 356 82 89 280 6 -355 300 166 -317 -509 384 94 -210 -180 67 -179
2568 -179 325 -187 -408 114 24 -441 -65 192 -222 -286 395 611 43 -25 58 -29 274 272 -119 -267 -88 -302
2590 -302 94 668 160 -593 -240 501 -207 -10 147 -217 142 235 9 -346 62 135 -240 172 290 -587 -377
2611 -377 -25 18 80 146 -25 -604 81 273 178 36 52 -364 118 712 171 -349 423 296 -489 434 254 -524
2633e24n2J097j98m13k31K70j36K18K41o57K43K69m29M36K42m21n92J001L97j012
2653b51L49J72l34K33L31l68L9j21j49n0M37k15o94J80L43m2l05O10l66l83Q30
2674B46J7n80M7J95k74N90L46o36j15M07j72k32P45l51o60M39M83n69r5K66k28
2695a31k51L89M3n91L60J41j26J5N18p67r3N27L90o72L39M82o06L37j04P0L8l56
2717d8j43o3Q74n56p10Q41m3k00l63P56n20o27O66L13m0j30j98k03N95M37o30
2738HK6N42m05l10J55M76o52L23L4l00l6K48k18k17K96K44m79K52j11j34L31L52
2760D25p28R0K30N1j10J43J38l02n6L50J3l03K05j47J23n6j34J4J67l0m90M65
2782E8O1j29m41L84K55r1k2l9m4L36n27q3M43j76j90j16M86J72p85L60L52k04
$$ plain form
2633 -524 -576 521 323 -90 -321 -51 -187 31 272 -385 -142 127 -302 134 376 -45 -637 364 761 -251
2653 -251 98 270 -64 169 500 132 171 50 -99 -149 288 73 -621 -441 -98 -140 -445 165 -201 -584 246
2674 246 263 -317 -270 -75 -349 241 587 -49 -164 243 71 -161 584 233 -427 12 495 -74 -169 97 -131
2695 -131 -382 7 50 -541 -181 -40 -166 -151 367 -400 -493 34 424 -248 91 573 -33 304 200 270 308 -48
2717 -48 -191 -254 620 64 -646 195 152 -48 -411 345 -175 -802 -136 177 137 7 -191 -394 201 638 8
2738 8 34 576 171 -139 16 492 -160 163 197 -103 -139 109 -109 -326 -30 214 -265 -13 -124 -258 73 425
2760 425 -303 -213 17 68 -42 101 239 -63 -119 231 244 -59 146 -1 122 66 -68 -54 113 83 -407 58
2782 58 119 -10 -451 -67 188 97 75 36 -8 328 -199 -282 161 -15 -205 -321 165 337 -448 -88 264 60
2804F0O7j70J19j77J7N8k77M49q4j55K8L64j95m87M06L32l10L7R5k55k7k91N05
2827A09j45k49K35J45k15o3k35L39K55k40n7J85m7k8j55L76J36k11p6j30K08m4
2849I3n3J9j63J00p4QK36o43J69L94o4l17L53k05J79m20P1L16J64j93l1J77K17
2872C33o19N39j40k15Q6P7L04l52k98L12j83K5j23k6J66J71j88j14K07r4j6j76
2894c24L53L9m0l5J87K18k20K11p9K1j62o4m7L4r3j34J26K91n01J35J41q5k26
2917b54j5K35kR3j73N1K3J86k28K06j9k71k2P67k91l13J77j29r3l6J49Q0J04m10
2941a85K07L8k15j69J98K07P6m52L69P9j27J33l34j00J13K85k18K14j69j38L93
2962B05p7m1j14j2K20j95j09M24l09J75q5k28J94oJ98l47M3K89k56k22L22n1j38
$$ plain form
2804 60 127 -43 76 -101 -84 -26 -303 146 62 -93 -65 299 104 -383 23 355 45 82 177 -78 -105 -396 109
2827 109 -36 -285 -50 95 -120 -183 -418 -79 176 -64 -121 64 17 -11 -166 210 346 135 59 -71 137 93
2849 93 40 59 -104 -4 -78 -70 166 -477 -308 86 22 -295 58 -147 32 -388 -317 -1 163 -30 -61 116 333
2872 333 -286 253 113 -102 -16 61 365 13 -285 27 -156 -131 -254 -280 -114 57 -131 -245 -38 -132 -148 -324
2894 -324 29 68 28 -7 180 398 178 389 310 331 169 105 58 92 -1 -135 -9 282 -219 -84 57 -28 -254
2917 -254 -269 -34 -36 57 -116 -65 -42 144 -84 122 103 -168 -190 577 286 -27 150 21 -72 -108 41 121 225 -185
2941 -185 22 60 -155 -324 -126 81 157 -295 74 153 26 159 -175 -275 -162 123 -95 119 -50 -188 205
2962 205 128 87 -27 -39 181 -14 -123 301 -8 167 82 -146 48 42 240 -107 -64 225 -31 -253 69 18 -120
2985a20K35K4k9k37K09J28m62J06J0L26l56J68oL89j43j68j49K94l10O9l04M60
3007A34l72K21K92j4n04K80K4J08q5k98r0K06J14n8k13J58J81k09K20P2k04j44
3029a81N4K15K58l87r3J01L23j72o8o1j76N8L19O0l21j08K60j75j36J40P2j95
3051b13J18O9R6J59k32j3l8L95l17l63P12j31l41L12K9n0m90K88l7m6K76l49j40
3074c06N70k26m86K50R4j12o9O58j41n05K20L69m24K38p2k09J53K15j62K16k47
3095B4Lj64K27L20n18M2K7q5J84J64k49n77L10M24k53r0L54n02J68N19m18k53
3117c43J94M16n26M03L69q24K76L61l95Q9J29j54n60M11L34m73L14k7m98K01O29
3138C26j89n97L10J48j58Q5p6R7k26P00l04k8J83m8l94N22O1m05j39L94l04k05
$$ plain form
2985 -120 115 139 110 -127 82 210 -252 -146 -136 190 -166 2 -4 385 242 74 -75 219 -91 -22 -326 134
3007 134 -238 -17 275 261 -243 37 61 169 84 -214 -304 -98 16 -42 -255 -97 84 -125 95 167 -37 -181
3029 -181 -127 88 346 -41 -134 -33 290 118 50 -11 -187 -129 190 250 -71 -179 81 -94 -230 -90 -18 -213
3051 -213 -95 -26 70 229 -3 -16 -54 341 24 -339 373 242 -99 213 242 192 -298 -10 -47 -93 183 -166 -306
3074 -306 264 38 -448 -198 -104 -216 -285 373 232 -273 -53 316 -108 130 58 -151 2 217 55 271 24
3095 24 27 -137 90 410 -108 -66 -39 -124 60 224 -25 -602 -292 132 -121 -211 143 -359 -191 328 -90 -343
3117 -343 -149 267 -259 144 513 -311 -35 326 -69 20 149 -5 -565 -154 180 -293 21 -6 -504 -303 326
3138 326 137 -460 -150 -2 -160 -75 -151 -54 -280 420 116 88 271 223 -171 351 412 7 -132 262 -42 -247
3160b47L93k19jJ51K4k41L03j16k64J19M87j76n53K52M3M1M17j74k20o3J25j66
3182h5J72J46j72j17J30M7l27J43m5j4k52Q95l98l92J91J82K5k27O5k95O2N25
3204B59n14L74J76m92rK27K29m60L12L4j77j87K50j35j92K47J14J1L09m66q6K85
3226A09M45m14l04K06p7j35L19j77m1j34J40K78k65J33l14K93J25r4n81P02P3
3247B87n01O5K83j11j64L31j04Q4R1l71k28N09j46NQ1L1p3k87J70J22l76L07j49
3270a44K7kl1j03K37j22R4K07m9J6j37pL95l54j04J33M3l49K96m8l2L3l7J58j56
3295c6P2k75K94j37m2j99L56N4l11J57n1M3K60r0j83K07P1j66L9j63K09k13j03
3318b07K18l01P5K70J0l28J02K29k81K31j40J48J39j25l2J59j58M3J92l9j46q7
$$ plain form
3160 -247 146 -73 -74 77 101 -140 163 47 -217 -98 389 213 -340 -88 -45 -4 413 239 19 -44 81 -85
3182 -85 87 233 61 -56 74 121 -206 -63 -108 -122 -374 521 123 -269 -78 104 129 -98 -33 -328 -266 259
3204 259 -255 119 295 -197 -206 21 250 -210 102 136 -41 -228 22 -113 -305 -58 56 67 376 -90 -176 109
3226 109 554 140 -164 42 -35 -170 149 -28 -69 -203 -63 215 -50 83 -231 62 187 93 -488 214 287
3247 287 -214 -149 134 23 -141 190 86 170 261 -110 -338 171 25 30 111 142 69 -218 -48 74 -302 5 -144
3270 -144 -117 -119 -150 -253 -16 -138 -44 163 114 130 -7 -14 381 27 -77 56 99 -250 46 -2 -34 -1 -38 120 -36
3295 -36 36 -239 55 -82 -124 -323 33 87 -224 -67 -118 -75 185 95 -88 119 190 24 63 -100 109 -104 -207
3318 -207 11 -290 -215 55 65 -263 -161 68 -213 18 -122 26 165 40 8 167 9 52 244 205 59 -28
3340b8m9oK03j65R0N2k58N4K5K14l14K61j01n8M04n40K98P7k61K11rk72J6J26
3364c0K42j82j12k6J03J46j33n6Q5p1J22j93j06L27k93K55j20J03N0J18o13L11
3386g3J15k14L6L22J66m81K04LQ7n87M63J64n06L32O8j54J19k87K61j35J26j58
3408a29L27j71l5k3JK17n1m32L81N8j98J03k6r9J1pK9J10k82J31M6M2Jj8J12K2
3434A20p0J9j83L03k00J03J44m0m2j00K03j30J20k99j42K47r1o9L48l07O0r6j57
3457b59K13J53J03l81QK22q3O7k3M4k95L22K8j00k7L10N2o13L27j86L3N5O7l3
3481DQ0j00J71m00p1K75l26K68J97l41n3K89j59K03L1J04o2k88M90k10k7J22j44
3504E3p0J48K2k46l9L14k11k02J85J10j5L3l75L77K7k53L0o9K47N1l02L26l7Q3
$$ plain form
3340 -28 -77 -83 120 -45 45 97 -161 -107 -82 132 -182 79 -22 -80 324 -216 82 159 -102 109 100 -172 -156 -30
3364 -30 212 30 -82 -108 -5 141 8 -48 37 -34 88 -105 -211 116 -177 78 -42 61 111 229 -384 -73
3386 -73 42 -172 -136 186 352 -129 75 78 165 -422 41 205 -301 31 99 -55 64 -223 38 -97 29 -129
3408 -129 198 27 -8 -31 -30 187 136 -296 85 143 -55 48 22 -77 -66 -73 -44 66 -216 -85 -39 3 4 -14 98 120
3434 120 50 69 -114 189 -11 92 236 196 154 54 257 127 247 -52 -194 53 -38 -107 241 -66 -6 -102 -259
3457 -259 -46 107 210 -171 -163 59 -24 43 20 64 -231 91 119 19 -8 302 354 -259 68 -118 -85 -30 37 4
3481 4 84 -16 155 -245 -316 -41 -367 -99 98 -243 -296 -7 -166 37 68 172 110 -178 312 102 75 197 53
3504 53 -17 131 153 -93 -132 182 -29 -231 -46 64 49 82 -293 84 111 -142 -112 -181 66 117 -185 141 104 187
3528A87j6J33r2j54J86k58q5M5j9j15P4K00k20k9K88k45lP2j57r9K72ll05L30
3552a3p3m5K82k01l3J66k9l3m3o9j0j45J25L43j25j37L4k4l3K83j51k85R5K78
3576A57P0j13j49J19j75J97n9j95O81m42k27J40K56m06J45j01j05p1L07j37J00
3597hj59K30m05M15l7k65j07N01N3l65l7L74k55Q4o7L6m3M0j10j4L35k34k21K91
3621C2J89n31P18l26j93K5K25q5N5j09J0q7L25l09j06K61K55l00n1K68m13n1K70
3644G2l3k0j23K1j15m0J55o2m6K88k72r2K64P0k76l5M31j00k79M15k58J15P0K69
3668D19n36j28K74j48K66k82K28k87K94k83R1K28M9m21MJ92J10j39J24M2k35N51
3690D13j99m66J26N6J68L0J06k69l63O77J04m98j76O0J54m0J63k53j99J95P5j45
$$ plain form
3528 187 171 304 212 58 244 -14 -99 -54 -73 -188 -114 86 -134 -163 125 -120 -123 -51 -208 -307 -35 -38 -343 -13
3552 -13 -86 -131 151 -50 -83 83 54 21 -22 -91 -101 -246 -121 222 97 -40 -6 -30 -63 220 69 -216 -121 157
3576 157 227 114 -35 84 -91 106 47 -148 533 91 -136 4 260 -146 -1 -102 -207 -278 29 -108 -8
3597 -8 -167 63 -342 73 36 -229 -336 165 218 -147 -184 190 -65 19 -48 -12 -55 -15 -125 -139 196 -38 -259 32
3621 32 221 -310 408 82 -111 -86 139 54 109 0 10 -77 248 -61 -167 94 349 49 -2 266 -147 -198 72
3644 72 39 19 -104 -83 -198 -238 -83 -145 -191 97 -175 -267 -3 67 -209 -244 187 87 -192 223 -35 80 150 419
3668 419 -117 -245 29 -119 147 -135 93 -194 100 -183 -92 136 185 -236 -232 -40 70 -69 55 97 -138 413
3690 413 214 -252 -126 -70 98 128 234 -35 -398 279 383 -115 -291 -231 -77 -117 46 -207 -406 -211 -136 -281
3712b81M87j79k12J8M18j36LJ68j82l12N79k52k62O4J21k22N02O2o15O3J66k93
3734b95M4K61k75J64J5l2K6j15J45q6K74J07j60J56l61L05k68J35J74Mj31K33
3756C20n15J22l3N8K84r0q9O3N9j47l38J37L69j37k25J61J19r9J83M6j84k28K42
3779G8p5Q4j99j1n2M02j74j06p4L30j77k68P95o21l4NR9n6J8l12N05J33j70m7
3803G3k23J73n0j43K07K95n70J42k1l4Q1L99l57j75L54O5m1k05K72n35N00q0k10
3826h3kM2J60p6m0j33l35M64n8N3L9k20j20N19k48R4k13j04L77j64m1L59k35j31
3850i6qR1k97M00J1r5M0j45J2O8L95l28J9k31k2O4M7J63K10p6j24m07J75J61k08
3875a81K17q5J29j18J82j08J36r9Q2O6k02M2j34n8k1J58M2j60jR0l6J89k86K40
$$ plain form
3712 -281 206 27 -185 -167 251 115 118 286 104 -208 371 119 -143 -79 42 -180 322 384 -231 -168 -2 -295
3734 -295 -251 10 -265 -101 -86 -118 -92 -207 -62 -148 126 233 73 229 -132 173 -95 40 214 218 87 320
3756 320 -195 -73 -106 -48 236 146 57 120 179 32 -306 -169 200 63 -162 -1 118 19 202 248 64 -164 78
3779 78 3 87 -112 -123 -175 227 53 -53 -127 203 26 -242 553 -68 -102 -97 2 -54 -36 -348 157 290 120 73
3803 73 -150 23 -27 -170 37 332 -238 -96 -117 -151 -70 329 -28 -203 151 216 175 -30 242 -293 207 127 -83
3826 -83 -85 -43 117 41 1 -132 -467 -3 -61 -8 31 -189 -309 210 -38 56 -157 -261 116 -48 -89 270 35 -96
3850 -96 -104 -13 -310 90 101 6 46 -99 -87 -19 376 48 67 -164 -186 -122 -75 88 298 222 98 -309 -134 27 -181
3875 -181 36 -49 80 -38 144 36 172 73 155 221 19 61 -73 -131 -152 6 48 -112 -113 -23 -59 130 -156 84
3899H4k43l5j01R5K52J77l37R0j07J22K66o4nj75J12P5m63J38M2J2K6K84l13q0
3923a48J5j26m2n2K64kL5m2L13j97Ml6J75J46l71K36K05j53j21l6l4P7j6o2O5
3948I7J21k19r3J81k97k2p0M08k87n0K24M3r9nL4K13k5l15J37l1K07K3j87l7l9
3973h8L39m95L28J89n72K73Q1k15K8K16m6P8j70L8N4M9r0%J41j72N66m83QN6n7
3998E6l0P4m9j34J21k08J46R2J14m82K62J95J56k92K69k99q6L33p9j64J89k36
4020e2j0j0K14j27q8k4k18L36k8j65J4pJ35Q7l6L5M4j68j23J22L8j31K32l07M20
4045A83j53j33K84r7j14Q3o3J62l81Q5J79j6p8l6K77L9k50m4j4j4Lk19M22L1l55
4070b19K01R4K64k05k94L48m26K83O0J12m3Ql59J0J14l28K02L02j51l31L27K11
$$ plain form
3899 84 -159 -194 -295 -200 52 229 -108 -18 -125 -3 263 199 194 19 131 206 -257 -119 -77 -65 -39 245 -68 -148
3923 -148 -133 -259 -301 -353 -89 -91 -56 -98 215 18 22 -14 161 307 -64 172 377 224 103 67 33 110 94 32 97
3948 97 218 -1 -94 87 -210 -232 -302 106 -181 -231 -7 36 -63 -68 -34 179 154 -161 -24 -55 152 175 -12 -49 -88
3973 -88 251 -244 84 273 -299 -26 55 -160 -132 84 38 116 -54 -16 38 87 -3 -3 138 -34 532 49 57 113 56
3998 56 26 100 51 -83 38 -170 -24 68 182 -300 -38 157 313 21 290 -9 -95 238 159 -5 184 -52
4020 -52 -62 -72 142 15 -73 -97 -315 21 -7 -172 -158 -165 -30 57 21 56 100 -68 -191 -69 -31 -162 70 -237 183
4045 183 30 -103 181 84 -30 53 -10 152 -229 -144 35 19 -59 -95 182 221 -29 -73 -87 -101 -98 -317 105 136 -219
4070 -219 -18 76 340 135 -159 189 -237 46 106 218 175 183 -176 -166 -52 -380 -178 124 -27 -358 -31 180
4092A80n13K72rj51L38o7r3L6J11Nj31L47k93j68OL65m25K9K78j10j45p5L19p6
4116C0k72M21o8p5j11j04j40M11j29P2r2Oj47L24q1q1j20J72L9n1j27j19K09k3
4140e6M5r9J5K7k3j86K66O7k16k24L18O6LK26j10j79J01J77j91JM9m5J52J34m89
4165a71j16L76k17L57j0j52l04M8L28j59J08j20k20K13q4P4N8r7nL50l65M20l96
4188h4k89L60j00K31k11M1r2P6K47k16j42R8J54m55L54J75k82n0K26n8J31l22
4210b08J59k1K85j93j17M1J3k00J52M58m13j19L8J93j18J62j25J01j35M4L69m09
4232d3K50l57LL90n6l03n3J11p1J16J7j72M1n3L21L6J4p06J63M69k38J38k81M14
4256A50k24j96L81o4J11k13j1P6n0K00k58j6J0K16j22Q2J20m25K35J0N6j19J07
$$ plain form
4092 180 -333 -61 -70 -221 117 50 -43 -7 104 109 -22 325 32 -136 -130 235 -190 -161 117 7 -138 -213 106 30
4116 30 -242 179 111 36 -75 -179 -319 92 -37 35 -57 -51 -198 126 45 -36 -156 16 55 4 -123 -242 -33 -56
4140 -56 -11 -110 -95 -68 -91 -277 -11 56 -160 -384 -66 0 3 229 119 -60 41 218 27 28 77 32 184 318 -171
4165 -171 -287 89 -128 229 219 67 -237 -189 139 -20 88 -32 -252 -39 -123 -49 9 -88 -93 257 -108 312 -84
4188 -84 -373 -13 -113 118 -93 -52 -144 -68 179 -37 -179 -81 73 -382 -28 147 -135 -185 41 -17 114 -208
4210 -208 -49 -70 215 22 -95 -54 -41 -241 -89 369 -44 -163 -125 68 -50 112 -13 88 -47 -3 366 -43
4232 -43 207 -150 -147 243 187 -116 -169 -58 -129 -13 4 -168 -127 -180 141 177 191 -515 -352 117 -121 17 -264 150
4256 150 -74 -270 111 47 158 -55 -66 10 -40 160 -98 -114 -104 112 -10 72 192 -233 2 12 68 -51 56
4279E6m1k39K73j65K82j17K70m45J41n3k04M39Q4o9k58R4j52J2p3J62O5k7O1k41
4303a45K63P2l49j17R1K11j26J93j17O6Q6j94J50o9j4J90j72K42j89r2k37M29
4325A72j54K87k10l13J0M2K19p1l98L22K46n7q7j18J08Rj18J37K13j77J39j3j27
4348F1j39J05N5q9j17L0m1K01r5k4l9J37n1o6j39j97J59K65q1J92j89j50L04J11
4372B03l68L93oj58j14O7K93l65J03p1J9J15j82j8J79j70J72k2R9j68k63J23J09
4395c0KQ7l3j3J11j43k66K68qJ5N9k49L36k32N4J99j85j45L24r0k47J07Q6l0m3
4420f6K24J58j04rM9k01L5k9j50J66o9J33j51K0j13M14l12J6R0k03K97j85J7N0
4444G7j2k06K10j43m4J8L3M21k66K5K22k07o6j41O4ro6K21r3l6k35J70j10J21
$$ plain form
4279 56 15 -224 49 -116 166 49 319 -126 15 -38 -242 197 281 212 -46 48 -104 -92 -165 -3 62 35 96 -145
4303 -145 118 190 -159 -276 -185 26 -100 93 -24 42 128 -66 84 15 1 191 19 261 72 -20 -257 172
4325 172 18 305 95 -218 -208 -166 53 -18 -416 -94 152 95 8 -110 -2 7 -111 26 239 62 201 188 61
4348 61 -78 27 82 -7 -124 -94 -135 66 -29 -53 -92 45 -6 -72 -211 -408 -249 16 -65 127 -62 -212 92 203
4372 203 -165 228 222 64 -50 17 310 -55 48 -23 -4 111 -71 -89 90 -80 92 70 169 1 -262 -139 -30
4395 -30 -28 59 26 13 124 -19 -285 -17 -25 -10 49 -200 136 -96 -42 157 -28 -173 151 61 -186 -79 7 -23 -66
4420 -66 158 316 212 203 252 51 86 57 -93 73 4 137 -14 6 -107 307 -5 11 101 -102 195 10 27 77
4444 77 65 -141 69 -74 -118 -100 -67 354 88 113 335 128 62 -79 -15 -24 -90 131 38 2 -233 -63 -173 -52
4468e2K58l80K10M1k17K44m5r2J38m9L12l87R3J57k21k48M02k04K97l67k5p3N0
4491a58J04l7k20j6K48n0K5l8L25l91L68j7j38o1p6K77k52J22k6K05J21k89j18
4514i2PL41l76KP1%n2J80J59n29J56J9K67k93R2P7J71J43m24K14J62l45N8K52
4538B60k96KK28l0j38n8k5J24J16l02q2K36j93K93p7j86J65j71J15Oj75L04n1
4561F5o9L65k47j38k15L55K10l99K1P2O8k27L05j30j41j18O7J97M1m47L81R7j29
4584a6j6k96L73O2j79p5M07n2k39P2N1k41K2L42q8J39l42J49l2J20k6l88L29k3
4608E3l05q2K85K94n80L99K13k26l30O43n73J18J13K48n11L55l62J71Q4L4n00
4629d59L13L48j09k13J05ok09M85l08k7J19N4p3L02j87L9m09L53j50l95L62K33
$$ plain form
4468 -52 206 -174 36 77 -140 104 59 -33 105 56 368 -19 74 231 10 -238 164 -40 257 -110 -135 -208 -158
4491 -158 -54 -91 -311 -327 -79 -129 -104 -142 183 -208 160 143 5 -56 -132 145 -107 15 -11 194 315 26 -92
4514 -92 -85 256 -120 -118 -47 -47 -99 81 240 -289 -133 -114 153 -140 -48 29 200 343 -81 133 295 -50 8 260
4538 260 -36 -34 194 164 26 -32 -57 67 183 -119 -201 35 -158 135 58 -128 37 -134 -19 -13 -188 116 65
4561 65 -4 361 114 -24 -239 116 326 -73 -52 20 88 -139 166 36 -105 -223 -156 41 82 -365 16 113 -16
4584 -16 -32 -328 45 107 -72 -147 260 208 -31 41 92 -149 -127 215 127 266 -76 73 41 161 135 -253 76 53
4608 53 -252 -334 -49 245 -335 64 277 51 -279 364 -209 -91 22 270 -241 114 -248 -77 7 41 -459
4629 -459 -146 202 93 -120 -15 -21 -230 255 -53 -80 39 93 20 322 135 174 -235 118 -32 -427 -65 168
4651A68j10l43L39Q5l18j16K12j54K86J48k39L81j57j76j49M23o6l35J76K41n39
4672b43K72p7k18L01J10n05O9J31K9k3K67j1k75M1K40j32q3J57J19m19M50p3k17
4695i0K36o5j44M2P9O4k67K69J96k89p5L66m07l4m0K54Nj07l18K92J6j35r1L25
4719H2j50j55J40J33L4r3L4n4k5k41M18J2p5J63k05PJ70k49J8K86k58k48j52M88
4743H0m26J20N37l20p9q4l2K35j06J85R0o7m2j67j21N3K58j55L00m5k65j30M36
4766B55l51P3r4k5L0L26m5l08L40l87J35K70K9k69J1K02l2j41k62K53Q6k47M29
4789B78m61K80l31K91j59J48k26j44K64j13J23j92J99j33J9P4P7K68j24k5k28
4810a15K39k94O0k77K05K60lj77K55j24K0O9R9k3k50O1J1R7j47P3nL0J9j8m6K03
$$ plain form
4651 168 58 -285 54 139 -179 -295 -83 -237 49 197 -42 339 182 6 -143 280 214 -121 55 296 -243
4672 -243 29 -48 -266 35 145 -360 -291 -160 -131 -154 113 102 -173 -132 108 -24 -107 50 169 -250 200 127 -90
4695 -90 146 81 -63 -21 58 122 -145 124 320 31 -44 322 -85 -119 -159 95 100 -7 -325 -33 -17 -152 -243 82
4719 82 -68 -223 -83 50 84 -9 25 -29 -54 -295 123 135 60 223 18 25 195 -54 -36 250 -8 -256 -408 80
4743 80 -346 -226 311 -9 -88 -172 -204 31 -75 110 200 133 91 -76 -197 -144 114 -41 259 214 -51 -181 255
4766 255 -96 -23 -117 -142 -112 214 169 -139 201 -186 -51 219 248 -21 -10 192 160 19 -243 10 96 -151 278
4789 278 -183 97 -234 57 -102 46 -180 -324 -60 -173 -50 -242 -43 -176 -157 -83 -6 262 138 113 -115
4810 -115 124 -170 -110 -387 -182 78 75 -102 153 29 49 118 217 194 -56 5 16 113 -34 39 34 64 83 65 19 222
4836B22k43J54K7j80j40L90j97k05K57P9k81J41k93L27j48rJ22J18m1j12J29Q1
4858A98N7l56J61K38l99J50J6l27L95r7j96o7J61J04j29J41J92l84L1Pj13Q2p1
4881b06K15K76k84j30K07j59L74l41q4L46j36r7j15l5O7J97j74q2J94J21j79R5
4903G0j80J97j85j62K14K1J05J6J59j01J6j74p4J60J11M9j74K6o1J20k70J07j48
4926a58J17k71K16M7n8o3J53J6j23J18r1K50k32k3J68P3m25J05J67j27L29p6J4
4949A26j39M40m91J41j84J00j31L02l69L29l19J89O5j07l7J92j38j8o6j4J8K02
4971I1j14j1R7Jk44Q1J46J6j3j42K81j67M1R5o2m9Q1k55K64k35J2K79j47r4M6
4996bk10J71qL4P4k3K22j49K38j09k65j31K51j05j98J70l51N70j41k79K70k09
$$ plain form
4836 222 -21 133 160 -20 -160 230 33 -172 85 164 -117 24 -269 58 -90 -99 23 141 100 -12 117 198
4858 198 255 -101 60 298 -101 49 65 -262 133 36 -160 -227 -66 38 -91 50 242 -142 -111 -104 -217 -135 -206
4881 -206 9 285 1 -129 78 -81 293 -48 -132 214 78 -19 -134 -169 -102 95 -79 -161 33 154 -25 70
4903 70 -110 87 -98 -260 -46 -25 80 96 255 154 170 -4 -78 82 193 242 68 94 33 153 -117 -10 -158
4926 -158 -41 -312 -96 -49 -107 -170 -17 -1 -124 -6 -97 153 -79 -102 66 139 -286 -181 -14 -141 188 112 126
4949 126 -13 427 -64 77 -107 -7 -138 164 -205 124 -195 -6 59 -48 -85 107 -31 -49 -115 -129 -111 91
4971 91 -23 -34 63 64 -180 -99 47 63 50 -92 189 22 63 158 96 47 128 -127 137 -98 -86 193 46 -48 -2
4996 -2 -212 -41 -49 -15 59 36 258 109 347 238 -27 -158 93 -12 -210 -40 -391 179 38 -241 29 -180
5018a80R9l8J09r1K12k00q3M28l25n5K38l8j07J02R8q9o9N1l22q0L51k69J43L13
5042A98j93r6r8J73j1K19l72J86M0m77L68J62p7j83J1R4K61j05j34J91k20K4J20
5065H1k03j67M4j6L99k52l3K95j26R3j30J7K61j37n83N35L51k28p5j77o6K38k35
5088a14J0P7R7k40J00J27k19J31J08k83O2O7N5k7J36J17j43oj70K73L9k25J35
5111A07J16k46o8K42k11Nl5L1j29K45j9n9J07k20j54L46k2j80K30mk45K02J0q3
5135c4n6K53k07M8K5J00o9k53K21J59j44n2ok09K33R2k67K7K31l28J86L20k23
5158D7l00L21k3l43RM12j23J90n8j18j16K07n2j45O3M35n18l0p9J53K51l95M40
5181B28m91K47L48l28J1J96l90R8J3m0j60L06J87k55K7j6j02J62j6j09J80j57
$$ plain form
5018 -180 -81 -119 -10 -101 111 -89 -172 256 -69 -124 114 76 -31 71 169 80 11 62 -260 -340 11 -258 -115 198
5042 198 5 -91 -189 -16 -27 192 -180 6 46 -431 -63 99 22 -161 -150 -56 205 100 -34 157 -63 -39 81
5065 81 -122 -289 -245 -261 138 -114 -147 148 22 115 -15 2 263 126 -457 78 429 201 126 -51 -117 121 -114
5088 -114 -104 -27 70 -170 -70 57 -162 -31 77 -206 -144 -77 -22 -49 87 204 61 55 -115 158 197 -28 107
5111 107 223 -23 -91 151 -60 -55 -90 -59 -188 57 38 -21 86 -134 -288 58 36 -144 86 82 -163 39 49 -34
5135 -34 -90 163 -44 4 29 129 60 -193 28 187 43 -9 -15 -224 9 101 -166 -139 92 -236 -50 270 47
5158 47 -253 68 45 -298 -289 123 0 190 132 14 -102 105 53 -92 -29 406 -112 -142 -221 -68 183 -212 228
5181 228 -263 -16 332 4 15 211 -179 -81 -68 -108 -268 38 225 -30 -3 -19 -121 41 25 -84 96 -61
5203f1Q4O3l0K2K42k32j9q5J67o5j70M1k10L19mj23J91J94l63J55r4j86N7K06
5227I9k46K8J04j62J60jM43m99J60O2k4j49J96j36J06K04m26J56J94l69J13K5
5249C8K36l67L51l37j8m70N43K76j56P1l57L15l94J62K97l88L58j89J07K14k02
5270I0N4p0P8l7j07J44k10RJ32l26J85o8K50l14Q1L40n08L25K46j82l5r8K58n31
5294b94K64J71rL8j99p3L52M6l28k4J85j48L10l88K66m22M1K36ol4p5Q2j09J61
5318D3k9m1k4L1j29J26J20J67n2j2P4j03r0L8k33P3j00J34O9j78j97L07k21K95
5342F8l19K29J22j19O7p8p6M1m8P6J41j58Q5j74M54j41k63j30N9R8l4J34K66m87
5366a87J76j92K30M6k06J25k4N4k25J09J30N5j29oJ08q0R7n1J70m46J40K65J59
$$ plain form
5203 -61 23 86 56 78 320 88 69 -16 151 86 -84 -43 -253 66 62 -61 130 324 -39 116 22 -164 -107 99
5227 99 -147 -119 -15 -177 -17 -18 425 -74 86 148 124 -25 171 35 141 345 -81 75 269 -100 13 38
5249 38 274 -93 258 -79 -97 -567 -24 252 96 167 -190 125 -269 -107 190 -198 160 -29 78 292 90
5270 90 144 74 152 115 8 152 -58 -49 83 -243 -58 -126 124 -190 -109 231 -277 48 294 112 77 -21 237 -294
5294 -294 -30 141 132 170 -29 -102 250 296 -32 -56 129 -19 291 -97 169 -253 -212 24 18 -16 -91 -9 -118 43
5318 43 14 -27 -51 -20 -149 -23 97 264 212 200 274 171 81 119 -114 -41 -141 -7 62 -116 -313 -6 -227 68
5342 68 -251 -22 100 -19 48 -30 -106 -65 -113 -37 104 -54 31 -143 311 170 -93 -223 -164 -66 -100 34 300 -187
5366 -187 -11 -203 27 73 -133 -8 -32 22 -203 -94 36 91 -38 -44 64 -16 81 30 200 -246 -106 159 318
5389C18l49l1np0L02j47L7M9j10L2K46k24n8j00J28r8M4O6j60J08L1j6J24p4q8
5414d5j27J89q5J66J61J4j38n5j62L09j97q6R2k76L43j41J44k8l20L95jq6J8k00
5438a16qK81r0J56l46K88j13p5J5n0o7L84m10J99J64n7J27m36J93M9K4m0k5o1
5462a4j20N4M4J92Jm31L63o5J22l25K89j77Q9k64q9J94K00p8n6J05J75k17m3j50
5486b01J00O8J00k03K88k4q2p4j30J54J1K44k97K19j90k44J00P3P4l3K9j49K35
5509F8j09J40p6J16K44k60o8N0j94J34J04k86J74k12J37j19L05l08l6K4M57m18
5531a33j5K15j08o8j03K96n2j96K08L4J75k03k16N75k38qk21K1j53%K30J9k96
5554b37R4j14K24J02J1j16R3j38J09q5K55j58j45K78k46L6K37l07L50n30K71q3
$$ plain form
5389 318 -31 -62 -67 -137 165 18 55 104 -6 26 272 48 -10 -110 18 -80 -36 30 -130 -22 9 -7 117 43 -45
5414 -45 -172 17 -68 98 259 273 135 80 -82 227 30 -56 36 -240 103 -38 106 78 -242 153 152 66 84 -116
5438 -116 -124 157 67 223 -123 165 52 -23 -8 -58 -125 259 -151 48 212 155 282 -154 39 88 112 72 47 -14
5462 -14 -134 -80 -36 156 157 -274 89 24 146 -179 110 -67 22 -242 -331 -137 63 -15 -71 34 209 -8 -51 -201
5486 -201 -101 -33 67 -136 152 128 46 -28 -158 -4 7 251 -46 173 -17 -261 -161 -88 -14 -47 -18 -167 68
5509 68 -41 99 23 139 383 123 55 105 -89 45 149 -137 37 -175 -38 -157 148 -160 -196 -172 285 -133
5531 -133 -148 67 -41 -109 -212 84 32 -164 44 78 253 50 -166 409 171 163 -58 -37 -190 -190 40 59 -237
5554 -237 -143 -257 -33 69 80 -36 57 -81 28 -57 198 40 -105 173 -73 -37 200 -107 243 -287 -16 -99
5576i9l03M05l9K17j76J39j20j5K34k82J9P1j76M00m38J79l9PJ94j83q0J96k78
5599a67RK98k10J47jj67j06J87P7k2j18J25O2ln2k4j90L16j34q2j13K44k57J67
5623a4P2Qj64j06J70r7M6pk5K68j87J60l19L20k0j08P2k89L57k41K93P2m17J89
5647C3J77k49K92j67j87Q0P6K7m05J91L65m47K9J23jj0J53J32k46J47j87m8J31
5670IJ39k41R8K5J51J2K95l69k67J86K14n01K01K49l00J34M1j34k27J33j52k5
5692c29M66k9l37K11n3k7K4L55k66J0K47K55l01m00R3J48K74j76p7j31J49j03
5714Ck60K62J28k74J17P7j04j45%kJ67k2J29O7l4j02j11J98J61m70j24M91j36
5737A6O0r9j68J45K37K0j95j12n2K83k00O7K12l30K78j91J92k83J17rp7J03KJ07
$$ plain form
5576 -99 -402 3 -36 181 5 144 24 9 243 -39 -20 51 -125 275 -163 16 -23 -16 178 -5 -85 111 -167
5599 -167 -158 140 -70 77 76 -91 -197 -10 67 45 -73 52 114 111 59 35 -155 161 27 -55 -168 76 -181 -14
5623 -14 58 66 -98 -204 -34 -131 -85 -92 -117 151 -36 124 -195 125 105 -3 69 -220 137 -104 189 261 -156 33
5647 33 210 -39 253 86 -101 -21 55 82 -323 -132 233 -214 -185 -62 -63 -73 80 212 -34 113 -74 -122 9
5670 9 148 -93 5 30 181 193 488 119 -148 38 252 -249 -48 201 -99 35 76 -58 -285 -152 -304 -329
5692 -329 137 108 -229 -18 -71 -98 -74 281 15 25 272 527 226 -174 -81 67 341 165 88 -43 106 3
5714 3 -257 5 133 -141 -24 53 -51 -196 -196 -198 -31 -53 76 143 109 7 -104 94 255 -215 -339 152 16
5737 16 76 -23 -191 -46 191 211 16 -96 -148 135 -65 2 214 -116 162 -29 163 -120 -3 -12 -89 14 16 123
$$ [...]
8191A
##END NTUPLES=NMR FID
##END=
