##TITLE=1H_SL31-DAU(A)
 CDCl3
 8 sc, 
 20.1.2022
##JCAMPDX= 6.0         $$ Bruker NMR JCAMP-DX V2.0
##DATA TYPE= NMR FID
##DATA CLASS= NTUPLES
##ORIGIN= UXNMR, Bruker Analytische Messtechnik GmbH
##OWNER= root
$$ XWIN-NMR		Version 3.5
$$ Thu Jan 20 12:27:56 2022 Russian Standard Time (UT+4h)  she@DPX200
##.OBSERVE FREQUENCY= 200.131346
##.OBSERVE NUCLEUS= ^1H
##.DELAY= (6, 6)
##.ACQUISITION MODE= SIMULTANEOUS
##.ACQUISITION SCHEME= undefined
##.AVERAGES= 8
##.DIGITISER RES= 18
##SPECTROMETER/DATA SYSTEM= spect
##.PULSE SEQUENCE= zg30
##.SOLVENT NAME= CDCl3
##.SHIFT REFERENCE= (INTERNAL, CDCl3, 0, 15.7039)
##AUDIT TRAIL= $$ (NUMBER, WHEN, WHO, WHERE, WHAT)
$$ ##TITLE= Audit trail, XWIN-NMR		Version 3.5
$$ ##JCAMPDX= 5.01
$$ ##ORIGIN= Bruker BioSpin GmbH
$$ ##OWNER= she
$$ F:/spectra/data/she/nmr/H-F/1/audita.txt
$$ ##AUDIT TRAIL=  $$ (NUMBER, WHEN, WHO, WHERE, WHAT)
(   1,<2022-01-20 12:26:50.71 +0400>,<she>,<DPX200>,
      <created by zg, POWCHK disabled, PULCHK disabled
       configuration hash MD5:
       00 E9 B6 7A A2 85 ED C7 34 08 36 98 17 FE 4E 26
       data hash MD5: 16K
       33 9E 2B 14 00 97 54 6A 71 39 8B 53 EC 0C BD 7F>)
$$ ##END=
$$ 
$$ hash MD5
$$ F9 B6 86 00 42 2A 2C F3 BA 45 71 EF 5E 2C 16 E0
##$RELAX= 
##$RELAX= 
##$RELAX= 
##$RELAX= 
##$RELAX= 
##$RELAX= 
$$ Bruker specific parameters
$$ --------------------------
##$DU= <F:/spectra>
##$EXPNO= 1
##$NAME= <H-F>
##$PROCNO= 1
##$TYPE= <nmr>
##$USER= <she>
##$AMP= (0..31)
100 100 100 100 100 100 100 100 100 100 100 100 100 100 100 100 100 100 
100 100 100 100 100 100 100 100 100 100 100 100 100 100 
##$AQSEQ= 0
##$AQ_mod= 1
##$AUNM= <au_zg>
##$AUTOPOS= <>
##$BF1= 200.13
##$BF2= 200.13
##$BF3= 200.13
##$BF4= 200.13
##$BF5= 200.13
##$BF6= 200.13
##$BF7= 200.13
##$BF8= 200.13
##$BYTORDA= 1
##$CFDGTYP= 0
##$CFRGTYP= 5
##$CHEMSTR= <none>
##$CNST= (0..31)
1 1 145 1 1 1 1 1 1 1 1 1 1 1 1 1 1 1 1 1 1 1 1 1 1 1 1 1 1 1 1 1 
##$CPDPRG= <>
##$CPDPRG1= <>
##$CPDPRG2= <>
##$CPDPRG3= <>
##$CPDPRG4= <mlev>
##$CPDPRG5= <mlev>
##$CPDPRG6= <mlev>
##$CPDPRG7= <mlev>
##$CPDPRG8= <mlev>
##$CPDPRGB= <>
##$CPDPRGT= <>
##$D= (0..31)
0 1.2 0 0 0 0 0 0 0 0.06 0 0.03 0 0 0 0 0.0002 0 0 0 0 0 0 0 0 0 0 0 0 
0 0 0 
##$DATE= 1642667210
##$DBL= (0..7)
120 120 120 120 120 120 120 120 
##$DBP= (0..7)
150 150 150 150 150 150 150 150 
##$DBP07= 0
##$DBPNAM0= <>
##$DBPNAM1= <>
##$DBPNAM2= <>
##$DBPNAM3= <>
##$DBPNAM4= <>
##$DBPNAM5= <>
##$DBPNAM6= <>
##$DBPNAM7= <>
##$DBPOAL= (0..7)
0.5 0.5 0.5 0.5 0.5 0.5 0.5 0.5 
##$DBPOFFS= (0..7)
0 0 0 0 0 0 0 0 
##$DE= 6
##$DECBNUC= <off>
##$DECIM= 32
##$DECNUC= <off>
##$DECSTAT= 4
##$DIGMOD= 1
##$DIGTYP= 9
##$DL= (0..7)
0 120 120 120 120 120 120 120 
##$DP= (0..7)
150 150 150 150 150 150 150 150 
##$DP07= 0
##$DPNAME0= <>
##$DPNAME1= <>
##$DPNAME2= <>
##$DPNAME3= <>
##$DPNAME4= <>
##$DPNAME5= <>
##$DPNAME6= <>
##$DPNAME7= <>
##$DPOAL= (0..7)
0.5 0.5 0.5 0.5 0.5 0.5 0.5 0.5 
##$DPOFFS= (0..7)
0 0 0 0 0 0 0 0 
##$DQDMODE= 0
##$DR= 18
##$DS= 0
##$DSLIST= <SSSSSSSSSSSSSSS>
$$ [...]
##$SUBNAM2= <"">
##$SUBNAM3= <"">
##$SUBNAM4= <"">
##$SUBNAM5= <"">
##$SUBNAM6= <"">
##$SUBNAM7= <"">
##$SUBNAM8= <"">
##$SUBNAM9= <"">
##$SW= 18.0517287032376
##$SWIBOX= (0..15)
0 0 2 0 0 0 0 0 0 0 0 0 0 0 0 0 
##$SW_h= 3612.71676300578
##$TD= 16384
##$TD0= 1
##$TE= 0
##$TE2= 300
##$TE3= 300
##$TEG= 300
##$TL= (0..7)
0 120 120 120 120 120 120 120 
##$TP= (0..7)
150 150 150 150 150 150 150 150 
##$TP07= 0
##$TPNAME0= <>
##$TPNAME1= <>
##$TPNAME2= <>
##$TPNAME3= <>
##$TPNAME4= <>
##$TPNAME5= <>
##$TPNAME6= <>
##$TPNAME7= <>
##$TPOAL= (0..7)
0.5 0.5 0.5 0.5 0.5 0.5 0.5 0.5 
##$TPOFFS= (0..7)
0 0 0 0 0 0 0 0 
##$TUNHIN= 0
##$TUNHOUT= 0
##$TUNXOUT= 0
##$USERA1= <user>
##$USERA2= <user>
##$USERA3= <user>
##$USERA4= <user>
##$USERA5= <user>
##$V9= 5
##$VALIST= <valist>
##$VCLIST= <CCCCCCCCCCCCCCC>
##$VD= 0
##$VDLIST= <DDDDDDDDDDDDDDD>
##$VPLIST= <PPPPPPPPPPPPPPP>
##$VTLIST= <TTTTTTTTTTTTTTT>
##$WBST= 1024
##$WBSW= 4
##$XGAIN= (0..3)
0 0 0 0 
##$XL= 0
##$YL= 0
##$YMAX_a= 99269
##$YMIN_a= -163616
##$ZGOPTNS= <>
##$ZL1= 120
##$ZL2= 120
##$ZL3= 120
##$ZL4= 120
##$ABSF1= 10
##$ABSF2= 0
##$ABSG= 5
##$ABSL= 3
##$ALPHA= 0
##$AQORDER= 0
##$ASSFAC= 0
##$ASSFACI= 0
##$ASSFACX= 0
##$ASSWID= 0
##$AUNMP= <proc_1d>
##$AZFE= 0.1
##$AZFW= 0.1
##$BCFW= 1
##$BC_mod= 2
##$BYTORDP= 1
##$COROFFS= 0
##$CY= 11.3945322036743
##$DATMOD= 1
##$DC= 2
##$DFILT= <>
##$DTYPP= 0
##$F1P= 2.36226072786647
##$F2P= -0.459571619588291
##$FCOR= 0.5
##$FTSIZE= 0
##$FT_mod= 4
##$GAMMA= 1
##$GB= 0.15
##$INTBC= 1
##$INTSCL= 1
##$ISEN= 128
##$LB= 0.24
##$LEV0= 0
##$LPBIN= 0
##$MAXI= 10000
##$MC2= 0
##$MEAN= 0
##$ME_mod= 0
##$MI= 1.114404
##$NCOEF= 0
##$NC_proc= 0
##$NLEV= 6
##$NOISF1= 3.799351
##$NOISF2= 2.8
##$NSP= 1
##$NTH_PI= 0
##$NZP= 0
##$OFFSET= 15.70392
##$PC= 1
##$PHC0= -15866.3
##$PHC1= 6.800781
##$PH_mod= 1
##$PKNL= yes
##$PPARMOD= 0
##$PSCAL= 0
##$PSIGN= 0
##$REVERSE= no
##$SF= 200.130013532006
##$SI= 16384
##$SIGF1= 3
##$SIGF2= 2
##$SINO= 400
##$SIOLD= 16384
##$SREGLST= <1H.CDCl3>
##$SSB= 0
##$STSI= 0
##$STSR= 0
##$SW_p= 3612.71676300578
##$SYMM= 0
##$S_DEV= 0
##$TDeff= 0
##$TDoff= 0
##$TI= <>
##$TILT= no
##$TM1= 0
##$TM2= 0
##$TOPLEV= 0
##$USERP1= <user>
##$USERP2= <user>
##$USERP3= <user>
##$USERP4= <user>
##$USERP5= <user>
##$WDW= 1
##$XDIM= 8192
##$YMAX_p= 0
##$YMIN_p= 0
$$ End of Bruker specific parameters
$$ ---------------------------------
##NTUPLES= NMR FID
##VAR_NAME=  TIME,          FID/REAL,        FID/IMAG
##SYMBOL=    X,             R,               I
##VAR_TYPE=  INDEPENDENT,   DEPENDENT,       DEPENDENT
##VAR_FORM=  AFFN,          ASDF,            ASDF
##VAR_DIM=   8192,          8192,            8192
##UNITS=     SECONDS,       ARBITRARY UNITS, ARBITRARY UNITS
##FACTOR=    0.0002768,     1,               1
##FIRST=     0,             0,               0
##LAST=      2.2672688,     0,               0
##MIN=       0,             -163616,         0
##MAX=       2.2672688,     99269,           0
$$ Real data points
##PAGE= N=1
##DATA TABLE= (X++(R..R)), XYDATA
$$ [...]
$$ plain form
2002 745 927 928 529 252 347 -212 -408 -411 -785 -1261 -1078 -775 -1157 -651 -335 -789 -592 158 272 95 591 864
2024 864 830 707 1243 587 991 949 230 268 236 -282 -585 -624 -505 -1075 -1321 -1115 -1069 -902 -729 -776 -707 -242 464
2047 464 69 199 1031 990 1010 903 977 1091 868 878 790 484 98 -455 -516 -543 -844 -1295 -1223 -1048 -1261 -1297 -940
2070 -940 -792 -397 -270 -156 256 701 1214 858 916 1332 903 1097 1473 1073 784 453 -1 -97 -462 -313 -810
2091 -810 -1162 -1248 -1596 -1485 -1343 -772 -958 -489 -355 -164 200 414 719 1285 1123 1124 924 1210 1302 967 547
2112 547 941 393 -302 -526 -560 -805 -937 -1181 -1305 -1522 -1216 -1009 -1077 -334 -255 -322 12 457 768 848 1061 1041
2134 1041 1092 1046 895 721 1172 675 94 -57 -24 -308 -833 -811 -597 -1107 -1207 -1208 -792 -600 -814 -530 -105 537
2156 537 311 405 653 1194 880 767 922 849 561 550 637 -59 -17 -236 -678 -729 -699 -758 -807 -877 -634 -974 -509
$$ packed form
2002G45J82Jl99k77R5n59j96ll74m76J83L03l82N06L16m54J97P50J14j77M96K73
2024H64l4j23N36o56M04m2p19L8l2n18l03l9J19n70k46K06M6J67J73m7O9M65P06
2047D64l95J30Q32m1K0j07P4J14k23J0q8l06l86n53o1k7l01m51P2J75k13l6L57
2070i40J48L95J27J14M12M45N13l56N8M16m29J94L76m00k89l31m54r6l65J49m97
2091h10l52q6l48J11J42N71j86M69J34J91L64K14L05N66j62Jk00K86R2l35m20
2112E47L94n48o95k24l4k45j32k44j24k17L06K07o8P43P9o7L34M45L11Q0K13k0
2134A041N1m6j51j74M51m97n81j51L3k84n25K2K14n10j00jM16J92k14K84M25O42
2156E37k26R4K48N41l14j13J55p3k88j1Q7o96M2k19m42n1L0n9m9p0K43l40M65
$$ plain form
2179 -509 -169 -194 165 148 110 513 1082 725 592 1082 870 497 509 195 252 -14 -97 -704 -557 -515 -687 -843
2201 -843 -722 -441 -976 -892 -443 -98 -149 390 390 547 509 515 973 852 880 417 304 349 59 106 -231 -57 -308
2224 -308 -877 -1119 -809 -681 -872 -815 -761 -894 -425 -331 140 450 663 846 786 738 1060 963 769 689 527 518 230
2247 230 -5 92 -504 -915 -1064 -1000 -1036 -1095 -1218 -1101 -808 -362 -356 -117 76 332 636 389 776 992 1060 1035 1190
2270 1190 668 771 561 228 43 -223 -494 -513 -711 -1081 -1434 -1193 -932 -988 -1053 -881 -527 -457 -245 29 522
2291 522 889 934 781 932 1121 1003 921 1186 732 209 126 -50 -257 -407 -787 -719 -708 -884 -1112 -829 -884 -356
2313 -356 -751 -471 -112 355 451 656 688 617 965 803 940 946 940 539 498 315 -35 -292 -620 -769 -470 -820 -688
2336 -688 -850 -853 -653 -713 -483 -175 41 76 355 513 516 1146 588 550 878 579 548 498 370 108 -584 -359 -226
$$ packed form
2179e09L40k5L59j7l8M03N69l57j33M90k12l73J2l14N7k66q3o07J47M2j72j56
2201h43J21K81n35Q4M49L45n1N39%J57l8OM58j21K8m63j13M5k90M7l37J74k51
2224c08n69k42L10J28j91N7N4j33M69R4M71L10K13J83o0m8L22r7j94q0j62rk88
2247B30k35R7n96m11j49O4l6n9j23J17K93M46OK39J93K56L04k47L87K16O8k5J55
2270A190n22J03k10l33j85k66k71j9j98l70l53K41K61n6o5J72L54P0K12K74M93
2291E22L67M5j53J51J89j18q2K65m54n23q3j76k07j50l80O8J1j76k28K83n5N28
2313c56l95K80L59M67R6K05L2p1L48j62J37Oom01m1j83l50k57l28j49K99l50J32
2336f88j62lK00o0K30L08K16L5K79J58LO30n58l8L28k99l1n0j28k62o92K25J33
$$ plain form
2359 -226 -546 -834 -761 -502 -877 -860 -817 -377 -274 -139 107 -107 325 406 432 615 1048 855 297 446 483 236
2381 236 -190 -266 -367 -283 -708 -739 -620 -380 -582 -955 -403 -559 -156 -63 311 143 89 485 442 820 1062 715
2403 715 938 490 615 126 141 250 -115 -349 -575 -1022 -609 -502 -648 -841 -626 -536 -462 -256 157 223 153 576
2425 576 805 654 876 726 698 931 680 501 -18 362 40 -404 -535 -490 -538 -787 -870 -985 -642 -519 -730
2446 -730 -224 -337 34 225 218 791 645 615 1093 1263 904 887 901 604 415 104 -103 -90 -167 -589 -665 -814 -906
2469 -906 -971 -770 -735 -392 -612 -672 -331 -71 54 248 569 595 906 962 927 974 712 627 401 373 78 -19 -297
2492 -297 -350 -809 -696 -783 -1209 -757 -587 -592 -491 -549 -96 -321 133 557 288 626 500 733 767 843 627 515
2514 515 440 202 -23 35 -71 -368 -617 -495 -639 -456 -695 -811 -399 -476 -327 -264 -84 262 120 402 484 545
$$ packed form
2359b26l20k88P3K59l75J7M3M40J03J35K46k14M32Q1K6J83M33j93n58J49L7k47
2381B36m26p6j01Q4m25l1J19K40k02l73N52j56M03R3L74j68n4L96m3L78K42l47
2403G15K23m48J25m89J5J09l65k34k26m47M13J07j46j93K15R0P4K06M13O6p0M23
2425E76K29j51K22j50k8K33k51j79n19L80l22m44j31M5m8k49q3j15L43J23k11
2446g30N06j13L71J91pN73j46l0M78J70l59j7J4k97j89l11k07J3p7m22p6j49r2
2469i06o5K01L5L43k20o0L41K60J25J94L21K6L11N6l5M7k62q5k26k8k95r7k78
2492b97n3m59J13q7m26M52J70nJ01n8M53k25M54M24k69L38j26K33L4P6k16j12
2514E15p5k38k25N8j06k97k49J22j44J83k39j16M12p7J49O3J80L46j42K82Q2O1
$$ plain form
2536 545 830 485 603 557 551 460 116 16 -321 -268 -458 -379 -487 -686 -717 -870 -599 -391 -222 -112 -24 -4 354
2559 354 188 485 765 719 474 642 723 456 273 -20 209 5 -185 -480 -355 -307 -713 -615 -264 -244 -519 -434
2581 -434 -153 30 32 45 208 752 908 450 752 570 871 135 240 335 174 16 -256 -404 -497 -360 -893 -613
2603 -613 -848 -404 -636 -314 -177 -188 -174 -104 373 170 430 690 881 494 801 518 569 376 432 171 157 -242
2625 -242 -546 -706 -829 -523 -660 -905 -721 -700 -451 -332 -359 105 424 395 432 597 633 696 638 605 899 622 441
2648 441 121 203 -313 -296 -462 -680 -692 -578 -722 -796 -743 -749 -335 -567 -64 -43 163 105 503 608 529 773 768 1028
2672 1028 582 328 301 251 364 -75 -367 -418 -393 -431 -810 -876 -620 -524 -521 -322 -200 -242 -162 -79 220 266 292 539
2696 539 644 693 603 849 667 450 136 -302 377 21 -153 -285 -526 -462 -587 -516 -480 -343 -579 -467 -268 -50
$$ packed form
2536E45K85l45J18m6or1l44j00l37N3j90P9j08j99l1j53K71K08J69J10Q8K0L58
2559C54j66K97K80m6k45J68Q1k67j83k93K29k04j90k95J25M8m06R8L51K0k75Q5
2581d34K81J83KJ3J63N44J56m58L02j82L01p36J05R5j61j58k72j48r3J37n33K80
2603f13k35M44k32L22J37j1J4P0M77k03K60K60J91l87L07k83N1j93N6k61j4l99
2625b42l04j60j23L06j37k45J84K1K49J19k7M64L19k9L7J65L6O3n8l3K94k77j81
2648D41l20Q2n16J7j66k18j2J14j44p4N3oM14k32N03K1K06n8L98J05p9K44nK60
2672A028m46k54k7n0J13m39k92n1K5l8l79o6K56R6LJ99J22m2Q0Q3K99M6K6K47
2696E39J05M9r0K46j82k17l14m38O79l56j74j32k41O4j25P1L6J37k36J12J99K18
$$ plain form
2718 -50 26 47 440 320 283 647 397 624 502 266 252 227 330 -29 -76 -460 -429 -329 -488 -547 -420 -525 -511
2741 -511 -417 -288 -42 -128 -68 17 294 430 536 470 556 190 204 388 254 203 -50 -200 -83 -52 -445 -391 -526
2764 -526 -616 -597 -511 -278 -107 -133 -154 256 182 365 315 408 803 794 508 299 330 372 207 -110 -245 -133 -312 -633
2788 -633 -560 -637 -422 -606 -359 -407 -640 -436 -172 212 184 295 473 449 586 538 35 590 704 494 339 441
2810 441 206 -55 -155 -320 -390 -582 -557 -667 -733 -481 -743 -594 -438 56 -130 -79 87 346 901 594 534 717
2832 717 750 449 631 325 353 70 -52 -348 -503 -456 -620 -721 -623 -664 -523 -303 -299 -189 -320 -146 226 90
2854 90 447 447 541 730 582 598 494 357 226 176 119 115 -18 -242 -570 -411 -253 -469 -718 -470 -711 -505 -484
2877 -484 -304 -61 475 164 314 431 446 612 668 512 457 205 151 5 -38 -17 -124 -58 49 -239 -468 -334
$$ packed form
2718e0P6K1L93j20l7L64k50K27j22k36j4k5J03l59m7l84L1J00j59n9J27j05J4
2741e11R4J29K46q6O0Q5K77J36J06o6Q6l66J4J84j34n1k53j50J17L1l93N4j35
2764e26r0J9Q6K33J71k6k1M10p4J83n0R3L95rk86k09L1M2j65l17j35J12j79l21
2788f33P3p7K15j84K47m8k33K04K64L84k8J11J78k4J37m8n03N55J14k10j55J02
2810D41k35k61j00j65p0j92K5j10o6K52k62J49J56M94j86N1J66K59N55l07o0J83
2832G17L3l01J82l06K8k83j22k96j55M7j64j01R8m1J41K20MJ10j31J74L72j36
2854I0L57%R4J89j48J6j04j37j31n0n7mj33k24l28J59J58k16k49K48k41K06K1
2877d84J80K43N36l11J50J17J5J66N6j56n5k52n4j46m3K1j07O6J07k88k29J34
$$ plain form
2899 -334 -523 -350 -449 -126 -197 -371 -68 2 260 270 342 382 521 252 416 289 224 377 210 22 -158 -74 -609
2922 -609 -483 -439 -524 -438 -228 -268 -304 -206 -226 -183 296 142 169 -37 347 397 395 389 401 302 363 29 -242 -11 -171 -202
2948 -202 -390 -121 -547 -563 -232 -414 -204 -353 101 -90 -153 -18 -191 287 288 327 487 530 165 387 441 200
2970 200 114 230 -52 -368 -365 -135 -464 -576 -407 -224 -551 -488 -246 55 -34 8 265 250 392 236 486 454 616
2993 616 442 182 353 277 77 -26 -156 -257 -71 -256 -477 -510 -662 -619 -732 -522 -169 -266 100 -19 116
3014 116 285 258 434 454 490 453 639 461 565 544 103 234 342 -290 -264 -408 -395 -426 -512 -558 -632 -356 -232 -259
3038 -259 -101 36 -58 445 393 481 512 343 511 281 245 345 150 155 121 -168 -96 -247 -104 -422 -349 -354 -461 -362
3062 -362 -570 -291 -143 -478 -18 179 138 287 307 613 611 411 317 292 430 468 81 84 133 -26 -144 -384 -501
$$ packed form
2899c34j89J73r9L23p1j74L03P0K58J0P2M0J39k69J64j27o5J53j67j88j80Q4n35
2922f09J26M4q5Q6K10m0l6R8k0M3M79j54K7k06L84N0koJ2r9O1l34k71K31j60l1
2948b02j88K69m26j6L31j82K10j49M54j91o3J35j73M78JL9J60M3l65K22N4k41
2970B00q6J16k82l16LK30l29j12J69J83l27O3K42L01q9M2K57j5J42j56K50l2J62
2993F16j74k60J71p6k00j03j30j01J86j85k21l3j52M3j13K10L53r7L66j19J35
3014A16J69k7J76K0L6l7J86j78J04k1m41J31J08o32K6j44J3l1q6m6p4K76J24k7
3038b59J58J37r4N03n2Q8L1j69J68k30l6J00j95Nl4k89P2j51J43l18P3nj07R9
3062c62k08K79J48l35M60J97m1J49K0L06kk00r4k5J38L8l87LM9j59j18k40j17
$$ plain form
3085 -501 -303 -219 -274 -552 -125 -380 -351 -335 96 -24 161 339 304 167 386 385 235 551 404 80 178 197 -86
3108 -86 -55 -86 -114 -256 -397 -353 -407 -291 -162 -323 28 351 -114 36 289 436 467 366 569 572 348 494 195
3131 195 35 202 -100 -193 -289 -287 -355 -316 -251 -664 -369 -216 -310 -190 -200 57 -93 429 461 191 88 354 100
3154 100 508 273 95 38 -10 39 -189 -253 -194 -518 -421 -472 -255 -392 -456 -304 -178 -18 -77 61 45 185 185 701
3178 701 382 395 464 213 428 435 155 -88 2 47 -249 -474 -195 -363 -319 -719 -263 -167 -359 -354 -218 15 -61 105
3202 105 194 319 638 396 327 426 588 228 388 15 214 238 -301 -220 -670 -316 -445 -533 -196 -206 -496 -178
3224 -178 -138 42 52 -89 360 480 152 160 280 267 567 249 557 509 373 159 -289 -278 -261 -309 -196 -256 -201 -342
3248 -342 -502 -244 -421 -94 -181 -61 -243 332 -62 335 373 483 455 295 579 295 122 172 -11 273 -31
$$ packed form
3085e01J98Q4n5k78M27k55K9J6M31j20J85J78l5j37K19jj50L16j47l24R8J9k83
3108h6L1l1k8j42j41M4n4J16J29j61L51L23m65J50K53J47L1j01K03Lk24J46k99
3131A95j60J67l02r3r6Ko8L9O5m13K95J53r4J20j0K57j50N22L2k70j03K66k54
3154A00M08k35j78n7m8M9k28o4N9l24R7n1K17j37o4J52J26J60n9J38j6J40%N16
3178G01l19J3O9k51K15Pk80k43R0M5k96k25K79j68M4m00M56R6j92NJ36K33p6J66
3202A05Q9J25L19k42o9R9J62l60J60l73J99K4n39Q1m50L54j29q8L37j0k90L18
3224a78M0J80J0j41M49J20l28QJ20j3L00l18L08m8j36k14m48J1J7m8J13o0N5j41
3248c42j60K58j77L27q7J20j82N75l94L97L8J10k8j60K84k84j73N0j83K84l04
$$ plain form
3269 -31 -47 -430 -101 -14 -206 -209 -265 -211 -334 -131 -264 -38 103 -257 350 85 166 386 393 362 143 36 54 250
3293 250 0 -176 -54 -120 -77 -110 -294 -136 -311 -317 -272 -356 -272 -357 -138 210 7 348 153 478 576 257 208 288
3317 288 285 155 -153 86 -66 -104 -136 -413 -386 -292 -311 -571 -201 -164 -263 -55 -221 97 75 189 103 222 288 677
3341 677 249 512 323 220 184 -7 47 229 -164 -266 -122 -208 -686 -430 -194 -232 -285 -199 63 161 416 -30
3363 -30 32 358 258 309 593 460 401 508 202 103 -38 122 -166 -276 -343 -413 -342 -430 -318 -606 -355 -262 -147
3386 -147 -141 22 176 58 193 463 411 116 361 283 160 505 161 314 54 16 30 67 -173 -73 -419 -640
3408 -640 -552 -512 -57 -223 -320 -107 -185 54 235 129 141 144 323 291 462 453 242 390 -41 59 111 -86 -210 -35
3432 -35 -285 -269 -489 -543 -276 -212 -20 -201 -102 -20 -38 101 51 549 272 58 333 349 191 132 8 253 315 49
$$ packed form
3269c1j6l83L29Q7j92ln6N4j23K03j33K26J41l60O07k65Q1K20Pl1k19j07J8J96
3293B50k50j76J22o6M3l3j84J58j75oM5q4Q4q5K19L48k03L41j95L25R8l19m9Q0
3317B88lj30l08K39j52l8l2k77K7R4j9k60L70L7r9K08j66L18k2J14q6J19O6L89
3341F77m28K63j89j03l6j91N4J82l93j02J44q6m78K56K36l8n3Q6K62R8K55m46
3363c0O2L26j00N1K84j33n9J07l06r9j41J60k88j10o7p0P1q8J12k88K51R3J15
3386a47OJ63J54j18J35K70n2k95K45p8j23L45l44J53k60l8J4L7k40J00l46k21
3408f40Q8M0M55j66r7K13p8K39J81j06J2LJ79l2J71rk11J48m31J00N2j97j24J75
3432c5k50J6k20n4K67O4J92j81R9Q2j8J39n0M98k77k14K75J6j58n9j24K45O2k66
$$ plain form
3456 49 -101 -158 -55 -355 -112 -39 -235 -68 -206 -351 22 -36 144 76 -237 145 16 219 375 294 190 213
3478 213 253 89 263 31 44 95 -182 83 -292 -334 -367 -390 -260 -154 -24 -46 -158 158 239 77 435 -2 101
3501 101 308 227 184 -130 328 329 129 -60 -211 -114 -285 -72 -150 -401 -343 115 -105 -169 -111 -47 143 255 62
3524 62 291 -41 358 245 386 189 255 16 168 66 100 83 -100 -144 19 -37 -300 -410 -370 -249 -138 -467
3546 -467 -285 22 -81 -111 -5 283 185 327 144 320 210 298 244 390 72 402 -153 14 36 -135 -196 -397
3568 -397 -200 -347 -296 -315 -100 -171 121 -29 28 291 262 126 395 263 -53 310 525 322 80 193 105 -123
3590 -123 -248 143 -208 -416 -114 -168 -61 -113 -157 -94 -301 -172 171 51 9 162 139 277 281 130 388 350 158
3613 158 93 97 187 -152 -104 -61 -203 -9 -248 -343 -124 -320 -143 -364 7 -99 88 82 207 79 135 312 287 59
$$ packed form
3456D9j50n7J03l00K43P3j96J67j38j45L73n8J80o8l13L82j29K03J56q1j04K3
3478B13M0j64J74k32J3N1k77K65l75m2l3k3J30J06J30k2j12L16Q1j62L58m37J03
3501A01K07q1m3l14M58Jk00j89j51R7j71K13p8k51N8M58k20o4N8O4J90J12j93
3524F2K29l32L99j13J41j97O6k39J52j02L4j7j83m4J63n6k63j10M0J21J11l29
3546d67J82L07j03l0J06K88r8J42j83J76j10Q8n4J46l18L30n55J67K2j71o1k01
3568c97J97j47N1j9K15p1K92j50N7K63k9j36K69j32l16L63K15k03k42J13q8k28
3590a23j25L91l51k08L02n4J07n2m4O3k07J29L43j20m2J53k3J38Mj51K58l8j92
3613A58o5MR0l39M8M3j42J94k39r5K19j96J77k21L71j06J87oJ25j28N6J77k5k28
$$ plain form
3637 59 113 174 193 24 85 59 -335 39 -46 -286 -105 -65 -247 126 -357 -92 -215 -310 82 141 2 305 142
3660 142 34 194 256 441 414 476 108 -116 59 -212 -109 -119 -112 -174 7 -181 -354 -32 -1 -50 -188 -393 204
3683 204 -89 131 322 -64 180 151 466 261 95 60 -2 -71 -97 -106 -98 -38 -37 -194 -309 -160 -152 -134 -244 -103 -31
3708 -31 265 -106 109 153 225 217 -104 -53 415 266 142 227 325 -161 44 -212 94 -480 -228 -96 -37 -455 -81
3731 -81 -120 -219 -35 -112 125 13 -94 244 133 322 254 8 318 201 16 250 20 -83 45 -142 140 -290
3753 -290 16 -144 -264 -362 -387 -326 -251 60 -360 -177 84 -10 152 -113 291 324 186 523 255 420 416 271 4
3776 4 -76 4 -103 -68 -120 -322 -206 -125 58 -216 -161 -96 -123 -150 -84 -208 -122 238 211 275 460 293 55 103 -229
3801 -229 173 -141 58 76 53 -107 -185 -258 -403 40 -141 -54 -316 -201 -50 -257 -89 -237 138 108 79 -36
$$ packed form
3637E9N4O1J9j69O1k6l94L74q5k40J81M0j82L73m83K65j23r5L92N9j39L03j63
3660A42j08J60O2J85k7O2l68k24J75k71J03j0Po2J81j88j73L22L1m9j38k05N97
3683B04k93K20J91l86K44k9L15k05j66l5o2o9k6rQO0Jj57j15J49QJ8j10J41P2
3708c1K96l71K15M4P2ql21N1M68j49j24Q5R8m86K05k56L06n74K52J32N9m18L74
3731h1l9r9J84p7K37j12j07L38j11J89o8k46L10j17j85K34k30j03J28j87K82m30
3753b90L06j60j20r8k5O1P5L11m20J83K61r4J62k65M04L3j38L37k68J65mj45k67
3776Dq0Q0j07L5n2k02J16Q1J83k74N5O5k7k7O6j24Q6L60k7O4J85j67k38M8l32
3801b29M02l14J99J8k3j60p8p3j45M43j81Q7k62J15J51k07J68j48L75l0k9j15
$$ plain form
3823 -36 101 284 209 314 142 -11 62 -134 44 -161 -79 -144 -67 -87 -153 -331 -35 -99 -255 -250 -65 184 79 -86
3847 -86 229 191 170 67 338 267 235 75 -13 32 -91 -16 -288 22 -28 -45 -346 -217 -101 -137 -174 45 -89 -61
3871 -61 155 118 -116 162 441 270 4 61 88 152 146 142 140 116 -171 -15 -190 -130 -179 -396 20 -21 -175 64 62 -38
3897 -38 -106 105 85 340 141 338 419 -35 96 154 75 231 147 -134 124 139 -89 -142 -301 -121 -54 -49 -392 -76
3921 -76 32 -253 89 -256 461 176 -33 98 -18 205 497 108 143 51 144 426 79 -39 46 95 27 -246
3943 -246 -228 -68 -285 -86 -170 -94 -384 -4 -43 68 340 -117 273 3 343 130 117 143 182 55 252 73
3965 73 -99 32 -230 -118 97 57 -266 -446 -301 -163 -21 -164 -24 202 13 201 222 33 -1 292 259 59
3987 59 216 194 225 117 112 232 53 -165 -284 -22 -202 -29 -157 -1 -242 -118 -416 -295 -119 51 37 -42
$$ packed form
3823c6J37J83p5J05j72j53P3j96J78k05Q2o5P7k0o6j78K96o4j56NJ85K49j05j65
3847h6L15l8k1j03K71p1l2j60q8M5j23P5k72L10n0j7l01J29J16l6l7K19j34K8
3871f1K16l7k34K78K79j71k66N7K7O4omkk4k87J56j75O0m9k17M16m1j54K39kj00
3897c8o8K11k0K55j99J97Q1m54J31N8p9J56q4k81K58J5k28n3j59J80O7Nl43L16
3921g6J08k85L42l45P17k85k09J31j16K23K92l89L5r2R3K82l47j18Q5M9o8k73
3943b46J8J60k17J99q4P6k90L80l9J11K72m57L90k70L40k13j3K6L9j27J97j79
3965G3j72J31k62J12K15m0l23j80J45J38J42j43J40K26j89J88K1j89l4K93l3k00
3987E9J57k2L1j08nJ20j79k18j19K62j80J73j28J56k41J24k98J21J76J70j4p9
$$ plain form
4009 -42 52 220 80 317 227 236 180 217 194 -123 3 -105 -197 -10 -36 -135 -91 -12 -141 -113 88 -68 99 82 -50
4034 -50 -208 302 11 102 70 39 -16 118 -83 -225 8 -244 92 34 -114 -134 -422 -103 23 -142 37 -4 -65
4057 -65 45 76 14 231 217 111 39 326 323 3 91 183 -17 138 -68 202 89 18 -65 -158 -126 -158 -226 -94 9
4082 9 -82 -29 -51 -155 49 -122 98 76 -9 1 155 113 362 -161 -27 -27 -73 26 -87 -52 -106 -320 -123 47 -262
4107 -262 -165 -18 -157 -238 44 21 58 200 -57 290 -66 313 148 150 -28 123 158 -168 204 -75 15 -126 -55
4130 -55 -258 -356 -127 -314 -199 -342 -169 -360 92 -15 -93 102 165 226 340 227 336 252 229 206 170 172 152 -155
4154 -155 110 53 -190 -247 -129 -418 17 31 -38 -212 -177 58 31 145 58 54 249 336 145 119 213 151 -63 20 325
4179 325 41 -248 -127 192 -122 -387 82 -299 6 -35 -336 -243 48 105 75 147 18 115 139 365 298 -36 168
$$ packed form
4009d2R4J68j40K37r0Rn6L7k3l17J26j08r2J87k6r9M4P9j29K8K01j56J67j7j32
4034e0j58N10k91R1l2l1n5J34k01j42K33k52L36n8j48k0k88L19J26j65J79m1o1
4057f5J10L1o2K17j4j06p2K87ll20Q8R2k00J55k06K70j13p1q3r3L2l2o8J32J03
4082Ir1N3k2j04K04j71K20k2q5J0J54m2K49n23J34%m6R9j13L5n4k14J97J70l09
4107b62R7J47j39q1K82k3L7J42k57L47l56L79j65Kj78J51L5l26L72k79R0j41P1
4130e5k03r8K29j87J15j43J73j91M52j07p8J95O3O1J14j13J09q4k3k3l6Kk0l07
4154a55K65n7k43n7J18k89M35J4o9j74L5K35k7J14q7mJ95Q7j91k6R4o2k14Q3L05
4179C25k84k89J21L19l14k65M69l81L05m1l01R3K91N7l0P2j29R7K4K26o7l34K04
$$ plain form
4202 168 150 258 -86 76 66 -168 -140 -74 100 -122 -369 -62 -167 -241 -20 50 -71 -91 392 -82 132 -83
4224 -83 -2 89 -3 131 312 41 109 183 -148 120 -45 -350 -57 -97 -292 -91 -330 -193 -82 123 87 -145 -195
4247 -195 -115 194 140 294 184 210 384 103 62 137 253 30 -220 -18 -117 -43 -179 -279 -215 -458 26 -293 -126
4270 -126 -153 101 265 64 166 -61 -72 60 194 72 117 211 293 -143 5 -11 38 -165 -133 39 -325 -176 -21
4293 -21 -54 -209 -78 -100 8 -186 12 45 199 86 42 59 361 269 411 129 182 79 125 60 -17 -109 -285 136
4317 136 -312 -345 -273 -121 -144 -10 -176 -70 -315 -271 -176 77 -113 -155 36 172 303 257 230 77 -16 93 -62
4340 -62 -115 26 -141 16 -93 -142 -89 60 -139 -59 -88 23 -90 -131 380 83 73 409 121 146 -15 54 49 257
4364 257 185 167 -47 0 31 -236 -220 -413 -371 -114 -97 -192 -379 -189 -199 171 -144 -36 -26 177 149 -177 8 379
$$ packed form
4202A68j8J08l44J62j0k34K8O6J74k22k47L07j05p4K21P0j21k0M83m74K14k15
4224h3Q1R1r2J34J81k71O8P4l31K68j65l05K93m0j95K01k39J37J11K05l6k32n0
4247a95Q0L09n4J54j10K6J74k81m1P5J16k23k50K02r9P4j36j00O4k43M84l19J67
4270a26k7K54J64k01J02k27j1J32J34j22M5R4Q2m36J48j6M9k03L2J72l64J49J55
4293b1l3j55J31k2J08j94J98L3J54j13m4J7L02r2J42k82N3j03M6o5p7r2j76M21
4317A36m48l3P2J52k3J34j66J06k45M4R5K53j90m2J91J36J31m6k7j53r3J09j55
4340f2n3J41j67J57j09m9N3J49j99Q0k9J11j13m1N11k97j0L36k88K5j61O9nK08
4364B57p2j8k14M7L1k67J6j93M2K57J7r5j87J90j0L70l15J08J0K03k8l26J85L71
$$ plain form
4388 379 110 -36 47 -21 84 378 96 153 68 31 -121 -464 -80 -91 -76 -178 -48 -214 -304 162 -30 107 23
4411 23 57 184 249 -190 515 112 10 208 94 176 -167 -89 -104 -126 -171 -249 69 13 -241 -202 -208 101 48 -13 3
4436 3 220 0 386 36 167 62 11 97 -20 176 -8 50 -126 50 -87 31 -273 28 -142 -158 -97 -155 -169
4459 -169 -140 67 -103 -44 25 159 -108 118 157 118 272 -37 -91 113 234 50 88 90 -195 -88 -418 -81 -8
4482 -8 -294 -80 -214 -25 -47 -43 238 -192 -199 230 215 227 103 218 143 44 119 -36 -101 -55 -65 -112 -30 -214 -288 -138
4508 -138 45 -305 -355 -265 -146 -167 -5 89 39 -103 123 86 98 123 -81 13 200 116 49 -145 199 -156 200 -30
4532 -30 -266 -161 -235 -44 -410 -259 -125 204 150 -264 41 240 -122 328 -142 142 -110 252 267 38 140
4553 140 -71 -56 -290 -176 100 -69 -185 -36 -380 -107 -147 -329 47 -80 -90 313 205 194 -35 85 114 186
$$ packed form
4388C79k69j46Q3o8J05K94k82N7q5l7j52l43L84j1J5j02J30j66r0M66j92J37q4
4411B3L4J27O5m39P05m03j02J98j14Q2l43P8j5k2m5p8L18n6k54L9oL09n3o1J6
4436CK17k20L86l50J31j05n1Q6j17J96j84N8j76J76j37J18l04L01j70j6O1n8j4
4459a69K9K07j70N9O9J34k67K26L9l9J54l09n4K04J21j84L8Kk85J07l30L37P3
4482hk86K14j34J89k2MK81m30pM29j5J2j24J15p5r9P5j55o5M6j0m7Q2j84p4J50
4508a38J83l50n0R0J19k1J62R4n0j42K26l7J2K5k04R4J87q4o7j94L44l55L56k30
4532c0k36J05p4J91l66J51J34L29n4m14L05J99l62M50m70K84k52L62J5k29J02
4553A40k11J5k34J14K76j69j16J49l44K73m0j82L76j27j0M03j08j1k29J20K9P2
$$ plain form
4575 186 -45 88 78 -6 -70 -28 -187 4 114 -252 22 -43 -92 -75 -127 -90 71 17 -249 125 34 93 -68 51
4599 51 99 -119 92 -154 47 296 239 22 114 -162 -38 -180 -15 -49 84 -187 -299 -170 -147 -60 -58 -369 210
4622 210 16 171 -35 -42 172 261 -97 114 118 97 269 -164 69 -2 92 -92 -88 -128 -223 70 -189 -91 -79 -308 -86
4647 -86 86 -22 83 69 102 4 198 136 215 93 64 465 109 -62 -13 28 -3 -151 -424 1 -207 -50 -70 -269
4671 -269 -185 -137 -25 -40 48 75 190 24 197 146 237 -18 60 252 261 36 127 175 -20 55 -272 -290 21 -68 -345
4696 -345 115 -105 -288 -23 40 4 -307 -138 -103 135 32 165 351 90 73 84 64 199 -120 163 -74 -109
4718 -109 16 -17 -294 -50 145 -88 97 -191 -327 -39 -52 -252 197 -99 101 142 253 250 204 99 70 238
4740 238 -136 -142 -30 -33 -224 21 70 -32 93 -31 -19 -78 -278 15 -3 121 14 68 -1 297 241 168 163 -98 273
$$ packed form
4575A86k31J33j0q4o4M2j59J91J10l66K74o5m9J7n2L7J61n4k66L74r1N9j61J19
4599E1M8k18K11k46K01K49n7k17R2k76J24j42J65l4J33k71j12J29K3Q7Kl11N79
4622B10j94J55k06pK14Q9l58K11Mk1J72m33K33p1R4j84Mm0r5K93k59R8J2k29K22
4647h6J72j08J05j4L3r8J94o2P9j22k9M01l56j71M9M1l1j48k73M25k08J57k0j99
4671b69Q4M8J12j5Q8K7J15j66J73n1R1k55P8J92Rk25R1M8j95P5l27j8L11q9k77
4696c45M60k20j83K65O3l6l11J69L5K38j03J33J86k61j7J1k0J35l19K83k37l5
4718a09J25l3k77K44J95k33J85k88j36K88j3k00M49k96K00M1J11lm6j05k9J68
4740B38l74oJ12lj91K45M9j02J25j24J2n9k00K93j8J24j07N4o9K98n6p3nk61L71
$$ plain form
4765 273 126 236 54 28 98 186 -49 -101 -7 -170 72 -122 -188 113 -177 87 -96 -304 253 71 -20 354
4787 354 144 261 90 411 234 -127 -34 121 -108 60 11 -255 18 -131 -281 -103 -139 26 -134 -103 -310
4808 -310 -15 -23 143 -49 172 -62 208 60 -194 325 -57 293 242 -1 198 200 -358 -157 232 -74 -466 -57
4830 -57 61 -196 98 49 -183 -62 38 -310 230 207 121 239 95 298 139 365 184 -32 175 124 58 -17
4852 -17 28 60 212 -137 -232 -248 -110 -262 -56 -74 -72 -33 -136 -146 -145 294 351 -258 324 213 278 68 17 -96 107
4877 107 -237 6 224 -40 146 -307 -119 -178 34 -87 -331 30 -206 -113 -77 48 -41 284 278 392 44 85
4899 85 121 261 65 -110 231 -105 -25 48 -62 -139 -313 -42 -180 -53 -262 -263 -25 -186 -57 -225 218 -129
4921 -129 22 31 24 264 -81 295 295 160 277 111 79 -383 147 55 40 -147 -60 -285 154 134 -15 210 155 -9
$$ packed form
4765B73j47J10j82k6P0Q8k35n2R4j63K42j94o6L01k90K64j83k08N57j82r1L74
4787C54k10J17j71L21j77l61R3J55k29J68m9k66K73j49j50J78l6J65j60L1k07
4808c10K95qJ66j92K21k34K70j48k54N19l82L50n1k43J99Kn58K01L89l06l92M09
4830e7J18k57K94m9k32J21J00l48N40k3q6J18j44K03j59K26j81k16K07n1o6p5
4852a7M5L2J52l49r5j6J38j52K06j8KL9j03j0JM39N7o09N82j11O5k10n1j13K03
4877A07l44K43K18k64J86m53J88n9K12j21k44L61k36R3L6J25q9L25oJ14l48M1
4899H5L6J40j96j75L41l36Q0P3j10p7j74K71j38J27k09jK38j61J29j68M43l47
4921a29J51RpK40l45L76%j35J17j66l2m62N30r2j5j87Q7k25M39k0j49K25n5j64
$$ plain form
4945 -9 229 -88 -129 35 181 51 -127 173 137 104 113 29 95 64 95 -76 -331 -65 -88 -117 -112 199 -102 76 64
4970 64 -50 -94 -123 100 -76 395 153 -91 73 236 123 -6 -135 123 -128 89 -28 -189 -299 119 99
4991 99 173 135 67 146 107 264 5 65 -27 69 200 45 226 273 139 405 -31 119 176 88 101 147 -162 -136 -128 -157
5017 -157 -84 -208 241 -139 101 167 -33 -48 29 41 302 98 138 40 128 429 16 20 175 48 -13 19 -52 117
5041 117 -112 125 -19 -125 -9 -200 -384 -276 45 117 4 8 -30 46 218 469 342 -19 215 130 121 98 -97
5064 -97 -60 -191 116 -125 -251 -280 -83 -292 -95 50 61 -187 -202 -266 -56 -87 125 71 228 105 21 213 253
5087 253 243 21 -43 200 -95 -30 -14 -87 -131 -318 -375 -51 -133 -96 -28 -189 -7 -36 114 -169 200 243 -111 222
5111 222 205 64 196 227 229 268 197 76 41 -40 -253 -120 9 -317 18 34 -295 -208 -234 43 -77 90 13 423
$$ packed form
4945iK38l17m1J64J46j30j78L00l6l3Rq4O6l1L1j71k55K66k3k9NL11l01J78j2
4970F4j14m4k9K23j76M71k42k44J64J63j13j29j29K58k51K17j17j61j10M18k0
4991I9P4l8o8P9l9J57k59O0r2R6J31j55J81M7j34K66m36J50N7q8J3M6l09K6Qk9
5017a57P3j24M49l80K40O6k00j5P7J2K61k04M0r8Q8L01m13MJ55j27o1L2p1J69
5041A17k29K37j44j06J16j91j84J08L21P2j13Ml8P6J72K51j27l61K34q5rk3j95
5064i7L7j31L07k41j26k9J97k09J97J45J1k48j5o4K10l1K12n4J57j23q4J92M0
5087B53j0k22o4K43k95O5J6p3m4j87n7L24q2L7O8j61J82k9J50k83L69M3l54L33
5111B22j7j41J32L1KL9p1j21l5q1k13J33J29l26L35J6l29Q7k6K77j20J67p7M10
$$ plain form
5135 423 -62 247 130 201 113 165 -13 -97 87 164 36 -126 -123 18 -40 -75 -349 -221 -200 3 64 -211 -10 -262
5159 -262 -195 55 154 24 2 50 280 90 -121 260 9 104 -15 219 -28 -40 -60 -99 -167 9 -22 -148 -339
5182 -339 -209 176 -103 139 -167 5 25 242 80 311 251 123 -35 58 45 226 42 164 -84 189 -162
5203 -162 -167 -237 4 -59 -31 76 -177 -5 -99 86 37 -153 333 144 79 112 286 263 222 -117 61 196 -8 -43
5227 -43 -5 -38 -110 165 -252 -300 -95 -69 -274 -12 -179 40 -245 145 1 276 233 -266 364 241 118 -101
5249 -101 -181 43 -175 212 60 -125 25 96 40 -114 -194 -75 -15 -151 -203 108 78 -56 364 185 113 -23 -220
5272 -220 -57 50 102 76 202 84 116 195 -134 -161 -2 -72 -27 -129 -196 -261 120 148 -214 -139 -61 -137 147 -32
5296 -32 156 339 -72 -26 131 257 32 83 22 133 237 -23 39 -6 41 -25 -6 2 -222 -180 -277 -294 32 55 -93
$$ packed form
5135D23m85L09j17P1q8N2j78q4J84P7j28j62LJ41n8l5k74J28K1K03O1k75K01k52
5159b62O7K50R9j30k2M8K30j90k11L81k51R5j19K34k47j2k0l9o8J76l1j26j91
5182c39J30L85k79K42l06J72K0K17j62K31o0j28j58R3j3J81j84J22k48K73l51
5203a62np0K41o3K8J07k53J72r4J85m9j90M86j89o5L3J74k3m1l39J78J35k04l5
5227d3L8l3p2K75m17m8K05K6k05K62j67K19k85L90j44K75m3m99O30j23j23k19
5249a01q0K24k18L87j52j85J50P1n6j54q0J19O0j36n2L11l0j34M20j79p2j36j97
5272b20J63J07N2k6J26j18L2P9l29k7J59p0M5j02o7o5L81K8l62P5P8p6K84j79
5296c2J88J83m11M6J57J26k25N1o1J11J04k60O2m5M7o6J9Qk24M2r7j7L26K3j48
$$ plain form
5321 -93 220 -167 177 7 3 -60 0 102 213 -193 266 37 -307 -35 -119 -228 -452 -150 -254 -132 -293 -100
5343 -100 33 -42 -189 -157 87 115 -25 196 -30 192 -125 45 55 115 130 237 -58 -116 10 143 -357 -335 -253
5366 -253 -57 3 -149 -146 14 80 -47 -135 -11 254 52 75 77 137 -134 308 255 -105 204 -146 -90 -61 -301 -206
5390 -206 -111 130 -235 -224 -336 -181 -5 -150 179 -265 134 161 180 136 -28 189 64 217 228 235 497 67 -224
5413 -224 185 -67 -74 -52 -311 -145 -393 -75 -260 -399 -116 -298 -82 -213 131 158 -77 102 338 252 80 300
5435 300 -70 -34 231 -83 8 33 222 108 328 127 -352 -189 -302 -185 -162 67 -83 43 -123 -17 66 -77
5457 -77 241 29 33 290 -203 -54 143 -4 112 -57 44 64 -78 -137 62 -341 -224 58 -95 -2 -62 -167
5479 -167 -195 122 74 -65 -41 71 248 174 -50 11 79 79 133 62 157 -178 -225 -308 -267 -52 -184 -124 117 -59 -27
$$ packed form
5321i3L13l87L44j70mo3O0J02J11m06M59k29l44K72q4j09k24L02j04J22j61J93
5343a00J33p5j47L2K44K8j40K21k26K22l17J70J0O0J5J07k95n8J26J33n00K2Q2
5366b53J96O0j52LJ60O6j27q8J24K65k02K3KO0k71M42n3l60L09l50N6K9k40R5
5390b06R5K41l65J1j12J55J76j45L29m44L99K7J9m4j64K17j25J53J1PK62m30k91
5413b24M09k52pK2k59J66k48L18j85j39K83j82K16j31L44K7k35J79K36q6j72K20
5435C00l70L6K65l14R1K5J89j14K20k01m79J63j13J17K3K29j50J26j66J06Q3j43
5457g7L18k12MK57m93J49J97j47J16j69J01K0j42n9J99m03J17K82j53R3o0j05
5479a67k8L17m8j39K4J12J77p4k24O1O8%N4p1R5l35m7q3M1K15j32O0K41j76L2
$$ plain form
5504 -27 -314 1 -211 -291 -60 289 56 162 95 263 -22 159 217 -76 23 -34 -201 -158 54 -59 153 -33
5526 -33 -79 -54 -186 -196 4 40 -87 14 184 62 236 140 145 -176 -42 -46 361 317 -23 31 -14 182 -72 -209
5550 -209 -21 -225 -79 152 135 56 158 -83 -187 -35 -30 61 165 107 71 114 -60 294 141 200 -14 184 -175
5573 -175 0 40 -26 -78 105 -247 -249 -89 20 -46 -274 -68 192 -188 -20 128 -129 -113 -14 35 396 258 35
5596 35 -30 -17 216 -61 282 200 177 -83 -113 -419 -116 75 -110 -2 -250 -23 -159 -93 64 259 53 -11 191
5619 191 109 121 101 38 62 63 283 95 275 -140 -7 -227 -224 102 -200 -272 10 8 -179 -187 51 -72 39 180 274
5644 274 41 120 280 26 144 102 206 -107 109 67 186 -205 54 147 -114 -70 2 22 -361 -257 -84 27
5666 27 -72 67 -75 72 97 -198 9 -144 -48 312 38 -21 60 103 -199 -41 129 124 24 -60 39 -204 46 -242
$$ packed form
5504b7k87L15k12q0K31L49k33J06o7J68k85J81N8k93R9n7j67M3K12j13K12j86
5526c3m6K5j32j0K00L6j27J01J70j22J74r6Nl21J34mM07m4l40N4m5J96k54j37
5550b09J88k04J46K31j7p9J02k41j04J52NR1J04n8l6M3j74L54j53N9k14J98l59
5573a75J75M0o6n2J83l52kJ60J09o6k28K06K60l80J68J48k57J6R9M9L61j38k23
5596C5o5J3K33k77L43q2k3k60l0l06L03J91j85J08k48K27j36O6J57J95k06o4K02
5619A91q2J2k0o3K4JK20j88J80m15J33k20LL26l02p2K82kj87qK38j23J11J41R4
5644B74k33P9J60k54J18m2J04l13K16m2J19l91K59R3k61M4P2K0l83J04J73J11
5666B7r9J39j42J47K5k95K07j53R6L60k74n9Q1M3l02J58J70nj00q4R9k43K50k88
$$ plain form
5690 -242 -1 -161 -129 -73 -2 -42 167 -60 -27 54 207 102 93 42 -327 -113 -328 65 -296 -209 69 -9 60 -56
5714 -56 -219 -276 -384 225 -42 -158 -352 11 -99 -210 26 20 172 252 279 92 114 -34 -70 271 36 13 -203
5737 -203 -295 -202 -152 89 -106 -357 -110 -112 -122 -17 -18 8 232 98 42 257 119 144 153 160 339 -99 -256 -59 185
5762 185 -290 104 -227 -9 -191 -150 -196 -25 4 159 5 143 147 30 109 165 99 399 -137 84 138 150 187 -277
5786 -277 -169 -113 -204 -30 -263 12 45 -60 -164 -125 21 -167 -161 -281 115 -148 158 -68 -64 124 351 130 152
5809 152 310 -2 -61 233 82 -267 106 -46 -69 -21 -169 -251 -156 22 -167 -264 175 -244 -61 221 132 -101
5831 -101 92 189 53 399 136 -95 5 53 58 -26 7 -61 -144 -44 40 -94 -93 -166 -311 -7 -140 214 69 -4
5855 -4 -125 -128 -68 55 137 -119 74 151 212 -99 97 240 22 191 47 11 74 -5 -53 -132 39 -161 204 33
$$ packed form
5690b42K41j60L2N6P1m0K09k27L3Q1J53j05rn1l69K14k15L93l61Q7K78p8O9j16
5714e6j63n7j08O09k67j16j94L63j10j11K36oJ52Q0K7j87K2j48l6L41k35k3k16
5737b03r2R3N0K41j95k51K47kj0J05jK6K24j34n6K15j38K5RPJ79m38j57J97K44
5762A85m75L94l31K18j82M1m6J71K9J55j54J38Mj17P9N6o6L00n36K21N4J2L7m64
5786b77J08N6r1J74k33K75L3j05j04L9J46j88Oj20L96k63L06k26MJ88K27k21K2
5809A52J58l12n9K94j51l49L73j52k3M8j48q2R5J78j89r7M39m19J83K82q9k33
5831a01J93R7j36L46k63k31J00M8Nq4L3o8q3J00Q4j34Jp3j45L04j33L54j45p3
5855dj21lO0J23Q2k56J93P7O1l11J96J43k18J69j44l6O3p9m8p9J71k00L65j71
$$ plain form
5879 33 -26 -79 -83 30 71 50 55 177 81 -122 -83 -40 -177 68 -8 -292 121 -275 -415 -89 -170 -298 -117 -80 41
5904 41 -285 -44 -126 222 -18 -149 97 16 45 72 85 115 -8 244 46 69 46 33 -87 -284 -120 -61 -39 -155
5928 -155 40 -124 309 -80 41 -69 84 61 240 116 -94 -73 12 163 -72 35 -227 -71 147 107 -106
5949 -106 293 -105 5 -58 79 -112 142 43 -168 89 -262 234 -109 281 89 35 165 92 17 83 71 -11 15
5972 15 99 36 49 45 -82 -79 -109 -84 -124 -26 -26 -154 -135 -125 -57 22 133 65 130 139 61 115 152 109 294 284 -213 88 103
6001 103 266 -8 18 123 -161 -106 -205 -48 85 -23 62 -207 -72 12 28 -185 179 155 213 136 52 45 -21 148
6025 148 91 60 32 8 -15 -191 -110 -49 -118 -68 -269 -6 -69 -201 92 26 311 171 -69 115 68 120 277 75
6049 75 30 34 17 -39 -133 261 123 76 -31 -190 -138 97 -3 -40 -44 -175 71 104 -93 211 -173 -32 248 128
$$ packed form
5879C3n9n3mJ13M1k1NJ22r6k03L9M3j37K45p6k84M13l96j40L26q1j28J81L7J21
5904D1l26K41q2L48k40j31K46q1K9K7J3L0j23K52j98K3k3j3j20j97J64N9K2j16
5928a55J95j64M33l89J21j10J53k3J79j24k10K1Q5J51k35J07k62J56K18m0k13
5949a06L99l98J10o3J37j91K54r9k11K57l51M96l43L90j92n4J30p3p5O6j2q2K6
5972A5Q4o3J3mj27Ll0K5m0R8%j28J9J0O8P9J11o8O5Rp8N4L7m3J85j0m97L01J5
6001A03J63k74K6J05k84N5r9J57J33j08Q5k69J35Q4J6k13L64k4N8p7q4po6J69
6025A48n7l1k8k4k3j76Q1O1o9N0k01K63o3j32K93o6K85j40k40J84m7N2J57k02
6049G5m5Mj7n6r4L94j38m7j07j59N2K35j00l7mj31K46L3j97L04l84J41K80j20
$$ plain form
6073 128 -27 133 -10 113 193 -146 -17 181 105 65 -35 151 -50 -8 48 -265 -50 -235 -27 9 -48 -294
6095 -294 -53 172 -167 352 43 96 -89 239 221 -10 183 -239 99 203 34 -80 62 12 -139 10 -232
6116 -232 -32 -83 -208 -28 -265 264 104 -3 -175 110 267 429 -130 152 66 135 191 135 350 -148 156 5
6138 5 226 220 103 -29 -430 -118 -240 -142 75 -7 19 -118 103 236 136 200 101 35 95 -20 50 250 -121 -9
6162 -9 -203 111 -268 -47 -51 -179 44 33 140 -95 -186 -73 -123 -17 -32 -37 36 78 185 164 275 -195 -10 264
6186 264 -216 207 149 16 -66 -181 -29 -34 96 -138 -30 -261 -158 77 -18 13 -5 301 72 151 159 -184 267
6209 267 246 12 330 138 -344 80 192 -25 146 -228 -50 -210 -202 -129 -264 67 -102 208 399 101 22 194
6231 194 -326 -148 259 162 44 -17 120 227 118 -29 -80 -48 43 61 -66 -184 32 52 122 48 92 135 169 -86
$$ packed form
6073A28j55J60j43J23Q0l39J29J98p6m0j00J86k01M2N6l13K15j85K08L6n7k46
6095b94K41K25l39N19l09N3j85L28j8k31J93m22L38J04j69j14J42n0j51J49k42
6116b32K00n1j25J80k37N29j60j07j72K85J57J62n59K82q6O9N6n6K15m98L04j51
6138EK21oj17j32m01L12j22R8K17q2K6j37K21J33j00O4r9o6O0j15P0K00l71J12
6162ij94L14l79K21mj28K23j1J07k35r1J13n0J06j5nP3M2J07k1J11m70J85K74
6186B64m80M23n8j33q2j15J52nJ30k34J08k31J03K35r5L1j8L06k29P9Ql43M51
6209B67k1k34L18j92m82M24J12k17J71l74J78j60QP3j35L31j69L10J91k98p9J72
6231A94n20J78M07r7j18o1J37J07j09j47n1L2R1J8j27j18K16K0P0p4M4M3L4k55
$$ plain form
6255 -86 -72 -238 88 -151 -27 179 94 106 64 -88 118 -271 30 -27 82 -25 228 -46 -173 -261 -280 -31 106
6278 106 66 13 50 -120 -53 -160 201 -153 163 93 126 -48 167 -21 16 142 -90 -165 69 7 170 -73 -201
6301 -201 -257 -176 13 -208 -258 -253 -2 247 94 -75 -14 73 57 -5 165 35 -1 56 121 -113 -62 40 -18 30 -82
6326 -82 -111 56 -344 39 -275 -313 -209 115 -200 11 -60 32 50 209 -51 -96 21 -30 120 191 158 -15 -75 33
6350 33 22 -34 210 -337 -165 -53 -61 -146 106 -343 -144 -55 -86 -204 234 55 -274 85 76 112 177 52 257 125
6374 125 122 32 133 136 -110 6 -58 96 -175 -131 63 -6 -185 77 -300 17 59 263 -181 49 117 191 97 52
6398 52 219 216 346 121 195 -13 120 121 -2 -193 74 -159 -94 8 -18 92 -116 -63 -44 -23 37 -38 203 165 239
6423 239 -56 259 178 -97 -13 35 79 -92 -116 149 -109 -193 -162 -5 -155 223 36 -1 -68 42 42 145 42 -115
$$ packed form
6255h6J4j66L26k39J24K06q5J2m2j52K06l89L01n7J09j07K53k74j27q8j9K49J37
6278A06m0n3L7j70O7j07L61l54L16p0L3j74K15j88L7J26k32p5K34o2J63k43j28
6301b01n6Q1J89k21n0NK51K49j53j69O1Q7j6o2J70j30l6N7O5k34N1J02n8M8j12
6326h2k9J67m00L83l14l8J04L24l15K11p1R2J8J59k60m5J17n1J50P1l3j73o0J08
6350C3j1n6K44n47J72J12qq5K52m49J99Q9l1j18M38j79l29L59rL6O5j25K05j32
6374A25lr0J01Lk46J16o4J54k71M4J94o9j79K62l77L17M2K04m44K30O8P4r4m5
6398E2J67lJ30k25P4k08J33Jj23j91K67k33O5J02k6J10k08N3J9K1O0p5K41l8P4
6423B39k95L15q1k75Q4M8M4j71k4K65k58q4L1J57j50L78j87l7o7J10%J03j03j57
$$ plain form
6447 -115 102 141 245 24 116 95 23 111 95 -41 -169 -158 89 -89 -15 -116 -67 -278 -100 -115 5 -89 134 48
6471 48 1 -68 -140 98 190 16 141 160 197 -77 125 -5 207 10 81 -67 61 2 -118 111 -165 -140 -305
6494 -305 198 114 -112 190 214 -179 341 18 202 113 76 -16 1 165 -89 99 206 -108 -86 -76 121 -54 -208
6517 -208 -73 -358 -116 -161 -92 -26 -124 -16 -29 -65 140 37 69 -80 38 3 225 94 214 185 -119 -114 171 -127
6541 -127 -127 -74 146 -257 -9 -38 -63 -115 -61 197 55 62 166 -5 198 -5 41 70 -103 147 -127 126 -28 -120
6565 -120 185 -136 -146 11 -314 68 -129 -198 -49 230 -210 -154 -324 -19 -85 348 363 -17 102 -129 153 190
6587 190 -102 -4 216 196 65 -52 -71 -187 -56 -271 -179 -100 64 27 -119 52 -69 -155 146 -1 130 -59
6609 -59 -80 84 -8 118 -36 116 160 -17 -216 -8 94 -44 -126 33 -141 72 -221 -117 -181 -60 -164 -12
$$ packed form
6447a15K17L9J04k21R2k1p2Q8j6j36j28J1K47j78P4j01M9k11J78j5J20r4K23q6
6471D8m7o9p2K38R2j74J25J9L7k74K02j30K12j97P1j48J28n9j20K29k76K5j65
6494c05N03q4k26L02K4l93N20l23J84q9l7r2J7J64k54J88J07l14K2J0J97j75j54
6517b08J35k85K42m5O9O6r8J08j3l6K05j03L2j49J18l5K22j31J20k9l04NK85k98
6541a27%N3K20m03K48k9k5n2N4K58j42PJ04j71K03k03M6K9j73K50k74K53j54r2
6565a20L05l21j0J57l25L82j97o9J49K79m40N6j70L05o6M33J5l80J19k31K82L7
6587A90k92R8K20k0j31j17j9j16J31k15R2P9J64l7j46J71j21q6L01j47J31j89
6609e9k1J64r2J26j54J52M4j77j99K08J02j38q2J59j74K13k93J04o4J21j04J52
$$ plain form
6631 -12 146 125 -154 69 51 180 109 120 454 46 -99 60 54 -210 -294 -136 -131 -98 -55 -70 172 -67 -286 -189 -93
6656 -93 97 -15 126 97 51 -24 155 -101 184 178 -94 -64 57 -9 -61 -159 8 -37 -219 -129 -211 -148 316 188 7
6681 7 -7 -59 19 58 79 -73 140 -134 -25 -45 -34 -134 179 297 -119 137 -8 -102 6 -308 -86 145 83 66
6705 66 -86 120 83 15 190 -213 -173 58 -111 -68 259 -101 66 -25 33 -34 193 -7 7 95 249 -26 -170
6728 -170 134 -12 -48 134 75 178 -51 -41 -5 -22 -199 49 -7 36 -65 22 86 -75 172 28 127 -105 -26 -113
6752 -113 102 105 -16 135 42 31 -51 110 204 15 -67 -53 72 88 -270 193 258 -25 32 109 71 -2 314 83 64
6777 64 -151 105 -145 -39 155 21 -241 -38 77 82 -152 -29 137 -80 38 -138 -31 -53 245 102 111 288
6799 288 -58 -73 15 -207 -135 219 -385 -165 -44 -71 -165 -31 -161 -313 -47 150 -130 53 -24 114 152 6
$$ packed form
6631a2J58k1k79K23j8J29p1J1L34m08j45J59ok64q4J58NL3M3j5K42k39k19R7R6
6656i3J90j12J41k9m6p5J79k56K85ok72L0J21o6n2r8J67m5j82R0q2O3M64j28j81
6681Gj4n2P8L9K1j52K13k74J09k0J1j00L13J18m16K56j45r4J08l14K22K31o2j7
6705F6j52K06l7o8J75m03M0K31j69M3L27l60J67r1N8o7K27k00J4Q8J54k75j44
6728a70L04j46l6J82n9J03k29J0L6j7j77K48n6M3j01Q7O4j61K47j44R9k32P9q7
6752a13K15Lj21J51r3j1q2J61R4j89q2J4J25J6l58M63O5k83N7P7l8p3L16k31j9
6777F4k15K56k50J06J94j34k62K03J15Nk34J23J66k17J18j76J07k2K98j43RJ77
6799B88l46j5Q8k22P2L54o04K20J21k7r4J34j30j52K66J97k80J83p7J38L8j46
$$ plain form
6821 6 -139 194 190 74 59 243 -134 220 3 -131 52 -42 74 -192 -41 -32 8 -275 148 69 -91 -55 -85 98
6845 98 -80 -85 -3 -27 9 315 56 141 107 351 -13 -206 69 -21 -227 167 -177 14 -218 -88 49 147 200 2
6869 2 -36 -59 207 18 324 309 43 78 225 239 159 146 217 102 -202 29 23 -53 198 1 -151 -138 -2 106 68
6894 68 -130 -24 -92 46 60 -110 -25 55 272 100 -55 265 19 204 33 -34 -60 -15 -63 40 108 -61 164
6917 164 -68 -234 -37 54 -86 -19 -233 74 243 282 164 168 31 65 375 149 -112 49 170 42 162 -145
6939 -145 -33 -100 132 118 -105 -55 -252 9 -140 -35 -153 100 106 -64 -158 -331 96 -77 43 183 85 190
6961 190 -25 211 180 -1 -14 -186 -273 -118 -211 126 31 -140 -125 -104 63 -130 -71 24 108 108 213 220 -85 221 -48
6986 -48 167 -89 127 164 18 -38 80 75 -184 -21 183 -47 112 -124 3 -339 107 -119 -65 204 130 -16
$$ packed form
6821Fj45L33mj16j5J84l77L54k17j34J83r4J16k66J51RM0k83M23p9j60L6l0J83
6845I8j78nQ2k4L6L06k59Q5l4K44l64j93K75r0k06L94l44J91k32J30J37R8N3j98
6869Bl8k3K66j89L06j5k66L5J47J4q0j3P1j15l04K31op6K51j97j52J3J36J08l8
6894F8j98J06o8J38J4j70Q5Q0K17j72j55L20k46J85j71o7k6M5m8J03O8j69K25
6917A64k32j66J97R1j40O7k14L07J69L9j18Mj37L4L10k26k61J61J21j28J20l07
6939a45J12o7K32j4k23N0j97K61j49J05j18K53Oj70r4j73M27j73J20J40r8J05
6961A90k15K36l1j81j3j72q7J55r3L37r5j71J5K1J67j93N9R5Q4%J05Pl05L06k69
6986d8K15k56K16L7j46n6J18nk59J63K04k30J59k36J27l42M46k26N4K69p4j46
$$ plain form
7008 -16 147 -233 -80 92 58 206 -221 93 205 -11 17 -92 -81 -176 -151 -132 24 -35 -122 7 139 10 -166
7031 -166 -59 266 -23 55 17 223 221 -76 177 -200 -136 164 107 -125 15 -283 59 -157 19 -200 45 -211
7053 -211 -54 50 -36 -133 -111 -131 145 -115 6 198 112 281 -69 169 18 170 -9 36 -381 133 -70 10
7075 10 -216 -49 231 -184 -70 212 -105 -77 137 -107 72 -131 -120 51 -96 -4 117 -40 101 61 208 122
7097 122 -128 169 24 -234 -16 87 9 -281 -138 -137 12 -121 21 -125 93 162 -277 101 -113 16 62 60
7119 60 -124 211 100 -190 43 -107 136 8 -100 -96 -38 -137 118 -307 67 27 -123 -44 -146 127 -103 80
7141 80 -225 15 300 186 5 231 83 79 156 -165 236 71 6 -12 -161 -119 -99 -108 -8 -189 146 63 -175 19
7165 19 251 35 -163 -207 90 -128 -173 -17 128 -356 12 99 177 176 101 154 42 189 -119 152 86 152 -106 139
$$ packed form
7008a6J63l80J53J72l4J48m27L14J12k16K8j09J1r5K5J9J56n9q7J29J32j29j76
7031a66J07L25k89P8l8K06kk97K53l77O4L00n7k32J40k98L42k16J76k19K45k56
7053b11J57J04q6r7K2k0K76k60J21J92q6J69l50K38j51J52j79M5m17N14k03Q0
7075A0k26J67K80m15J14K82l17K8K14k44J79k03J1J71j47R2J21j57J41m0J47q6
7097A22k50K97j45k58K18J03p8k90J43JJ49j33J42j46K18O9m39L78k14J29M6k
7119F0j84L35j11k90K33j50K43j28j08MN8r9K55m25L74m0j50P9j02K73k30J83
7141H0l05K40K85j14j81K26j48mP7l21M01j65o5j8j49M2K0rJ00j81L35q3k38J94
7165A9K32k16j98m4K97k18m5J56J45m84L68Q7P8jp5N3j12J47l08K71o6O6k58K45
$$ plain form
7189 139 133 -113 -14 -200 -196 126 250 78 -244 190 146 26 148 -4 -47 -15 101 -325 -199 -97 -183 -152 -68 90
7213 90 -105 -214 -58 110 -58 85 -143 168 44 93 88 -68 184 134 -44 -43 51 56 -11 146 -26 -66 -53 -64 -164
7238 -164 -57 280 170 35 -7 -72 -161 -39 -12 -50 50 372 215 -152 54 249 -79 175 -83 -25 -129 -82
7260 -82 67 141 -181 53 11 -35 -216 -50 -179 -148 9 176 -60 -214 -190 -12 14 -30 96 24 350 16 -316
7283 -316 50 127 118 131 10 -76 -10 48 -9 -40 46 -3 96 -185 -136 -417 -72 7 -59 -6 2 -73 152 95 159 50 66
7310 66 16 55 70 -9 58 -117 46 61 -85 -165 -285 -60 172 -140 -69 273 130 40 -89 38 135 64 -127 85
7334 85 96 -45 263 -161 71 207 -185 34 -100 -113 156 36 -146 25 -220 25 138 59 4 161 93 -9
7356 -9 -168 62 74 145 250 88 30 -80 -20 113 288 327 41 43 -90 -14 -97 -41 11 41 -197 -104 19 300 -24
$$ packed form
7189A39ok46R9j86ML22J24j72l22M34m4j20J22j52m3L2J16m26J26J02q6L1Q4J58
7213I0j95j09J56J68j68J43k28L11j24M9nj56K52n0j78JR4No7J57j72m0J3j1j00
7238a64J07L37j10j35m2o5q9J22K7l8J00L22j57l67K06J95l28K54k58N8j04M7
7260h2J49P4l22K34m2m6j81J66j29L1J57J67k36j54K4J78K6m4J26p2L26l34l32
7283c16L66P7rJ3j21q6O6N8n7l1Q6m9R9k81M9k81L45P9o6N3Qp5K25n7O4j09J6
7310F6n0L9J5p9O7j75J63J5j46q0j20K25K32l12P1L42j43r0j29J27R7p1j91K12
7334H5J1j41L08m24K32J36l92K19j34j3K69j20j82J71k45K45J13p9n5J57o8j02
7356ij59K30J2P1J05j62n8j10O0J33J75L9k86Kj33P6q3N6N2L0k38R3J23K81l24
$$ plain form
7381 -24 61 205 73 -95 212 -56 -28 -87 119 60 -96 80 106 39 1 -37 -64 38 -150 150 352 -54 -118 25
7405 25 -6 -327 201 240 -136 50 131 209 -265 -4 -33 110 -73 78 -264 63 -69 -89 -179 -136 -65 -320 58
7428 58 112 -106 -153 99 203 229 -68 3 102 264 82 174 280 113 -230 -121 99 30 162 -27 45 -86 -94 -186
7452 -186 -63 20 -390 -34 75 105 155 0 -150 -66 9 72 -102 140 207 -134 211 335 -112 -130 -109 -86 124
7475 124 52 -127 69 -25 76 -138 -68 -41 -35 -58 121 -39 -120 60 60 19 58 290 29 -63 76 19 185 57 189
7500 189 -40 -31 -142 -446 -24 -273 -92 63 -80 -131 260 -280 148 31 -323 128 145 -77 -30 114 -163 29
7522 29 248 -126 12 99 187 -28 231 -252 45 -74 33 323 69 -29 150 151 86 -75 -89 311 -83 -149 94
7545 94 98 217 -225 49 -92 23 -208 131 -18 -138 -37 -293 -141 -239 -24 -42 -132 60 -225 -88 -116 325
$$ packed form
7381b4Q5J44j32j68L07k68K8n9K06n9j56J76K6o7l8l8k7J02j88L00K02m06o4J43
7405B5l1l21N28L9l76J86Q1P8m74K61k9J43j83J51l42L27j32k0r0M3P1k55L78
7428E8N4k18m7K52J04K6k97P1R9J62j82R2J06j67l43J09K20o9J32j89P2j31qr2
7452a86J23Q3m10L56J09L0N0j55j50Q4P5O3j74K42O7l41L45J24m47j8K1K3K10
7475A24p2j79J96r4J01k14P0K7Ok3J79j60q1J80%m1L9K32k61r2J39n7J66j28J32
7500A89k29Rj11l04M22k49J81J55j43n1L91n40M28j17l54M51J7k22M7J44k77J92
7522B9K19l74J38Q7Q8k15K59m83K97j19J07K90k54r8J79Jo5j61j4M00l94o6K43
7545I4MJ19m42K74j41J15k31L39j49j20J01k56J52r8K15j8r0J92k85J37k8M41
$$ plain form
7567 325 242 80 -44 31 57 -107 35 268 0 -98 -5 272 223 -279 -114 98 -79 -117 218 -149 -313 -52
7589 -52 77 -42 49 104 -37 184 -37 296 -131 8 91 -70 311 41 -132 74 -97 -64 84 23 -73 176
7611 176 128 -157 -134 74 54 95 99 -20 48 -82 -37 11 229 53 55 152 170 -206 125 -24 227 157 150 47 -101
7636 -101 106 39 -196 -85 -58 -123 -228 -164 -162 -180 -117 37 19 75 -35 113 -28 -72 179 181 80 188 -41 82
7660 82 -98 92 101 26 89 -1 49 -100 -87 -53 -80 -167 134 -158 -18 179 -135 -48 -26 126 128 -63 -123 0 102
7685 102 216 50 108 197 103 118 -181 -313 -50 -75 8 68 -31 124 -6 18 103 30 -80 -241 167 -108 188 56
7709 56 -133 313 107 -12 13 -92 56 93 -199 214 -136 -6 -33 -63 49 -11 395 -113 -61 192 124 90 397
7732 397 4 105 -12 170 134 -19 128 20 6 -9 106 -291 -125 160 -168 87 183 47 -19 -3 93 -187
$$ packed form
7567C25q3j62j24P5K6j64J42K33k68r8R3K77m9n02J65K12j77l8L35l67j64K61
7589e2J29j19R1N5j41K21k21L33m27J39Q3j61L81k70j73K06j71L3J48o1r6K49
7611A76m8k85K3K08k0M1Mj19O8j30M5M8K18j76KR7J8l76L31j49K51p0pj03j48
7636a01K07o7k35J11K7o5j05O4Kj8O3J54j8N6j10J48j41m4K51Kj01J08k29J23
7660H2j80J90Rp5O3r0N0j49J3L4k7q7L01k92J40J97l14Q7K2J52Kj91o0J23J02
7685A02J14j66N8Q9r4J5k99j32K63k5Q3O0r9J55j30K4Q5p3j10j61M08k75K96j32
7709E6j89M46k06j19K5j05J48L7k92M13l50J30k7l0J12o0M06n08N2K53o8l4L07
7732C97l93J01j17J82l6j53J47j08j4j5J15l97J66K85l28K55R6j36o6J6R6k80
$$ plain form
7754 -187 -248 14 28 30 62 59 74 -65 42 -137 -149 -75 44 258 61 -99 257 -87 -36 -140 89 -79 -207 311
7778 311 30 -42 158 134 -63 138 219 -108 230 16 48 5 187 159 -18 -112 124 212 -153 -164 40 9 -325
7801 -325 108 -348 55 62 -62 -106 -216 -117 -146 155 -70 111 51 56 113 220 377 -26 -8 284 80 -170 33
7824 33 -51 106 -136 -8 -56 63 -2 -20 -181 -158 -68 -177 78 196 -17 148 247 369 146 326 -226 -147 43
7847 43 -117 191 28 -58 -78 -72 124 -31 -256 56 -15 47 52 183 170 64 90 -70 222 -9 -138 -84 66 -29
7871 -29 167 16 -97 87 291 -81 19 82 -284 -73 11 46 -104 37 69 -190 -41 -36 -14 19 217 171 71
7894 71 -127 123 -17 -123 -19 49 171 108 163 54 157 131 -156 -61 -120 50 -201 299 18 214 0 146
7916 146 71 44 -37 157 -13 205 56 209 62 254 -257 -238 -11 38 78 -110 4 83 -9 247 -5 35 17
$$ packed form
7754a87o1K62J4KL2lJ5j39J07j79j2P4J19K14j97j60L56l44N1j04K29j68j28N18
7778C11k81p2K00k4j97K01Q1l27L38k14L2m3J82k8j77r4K36Q8l65j1K04l1l34
7801c25M33m56M03Pj24m4j10R9k9L01k25J81o0NN7J07J57m03J8K92k04k50K03
7824C3q4J57k42J28m8J19o5j8j61K3R0j09K55J18k13J65R9J22k23J80n52P9J90
7847D3j60L08j63q6k0OJ96j55k25L12p1O2NJ31j3j06K6j60K92k31j29N4J50r5
7871b9J96j51j13J84K04l72J00O3l66K11Q4L5j50J41L2k59J49NK2L3J98m6j00
7894G1j98K50j40j06J04O8J22o3N5j09J03k6k87R5n9J70k51N00k81J96k14J46
7916A46p5k7q1J94j70K18j49J53j47J92n11J9K27M9M0j88J14P9r2K56k52M0j8
$$ plain form
7939 17 -113 -57 -273 105 2 150 -115 -112 161 -8 -6 178 62 4 -34 -61 -186 -26 134 -391 75 -204 -57
7962 -57 -22 97 52 -393 -68 -126 219 -84 -183 299 337 176 8 99 47 47 155 194 -50 15 -173 -147 -284 -49
7986 -49 -36 135 66 -62 -25 -70 -138 11 116 -8 -166 -32 179 -149 -62 1 -1 -56 340 44 91 -57 116 168
8010 168 24 22 -87 -47 -298 -189 -174 -51 -411 -16 -148 -144 40 -79 156 32 124 -34 -121 -5 84 -285 383
8033 383 208 74 2 38 29 -193 -130 165 -148 -237 162 116 64 20 -28 -63 56 179 92 163 78 -52 109 -2 7
8058 7 238 -103 221 -90 205 -71 -158 -74 64 -90 7 -108 13 -270 75 9 33 -24 -119 146 -192 -58 -24
8081 -24 190 -369 277 -225 -84 85 -187 -117 -101 4 28 -249 -97 -43 -197 -73 73 -246 32 180 -230 54
8103 54 159 121 197 105 -54 -196 -117 36 -80 -124 262 51 49 141 93 -239 -229 -315 70 -128 -51 -21 -165 97 -28
$$ packed form
7939A7j30N6k16L78j03J48k65LK73j69KJ84j16n8l8k7j25J60J60n25M66k79J47
7962e7L5J19m5m45L25n8L45l03r9M82L8j61j68R1n2%J08L9k44O5j88K6j37K35
7986d9J3J71o9j28L7m5o8J49J05j24j58J34K11l28Q7O3kn5L96k96M7j48J73N2
8010A68j44kj09M0k51J09J5J23l60L95j32MJ84j19K35j24R2j58q7J16Q9l69O68
8033C83j75j34p2L6rk22O3K95l13q9L99m6n2m4m8l5J19J23q7P1q5j30J61j11R
8058GK31l41L24l11K95k76q7Q4J38j54R7j15J21k83L45o6K4n7r5K65l38J34L4
8081b4K14n59O46n02J41J69k72P0J6J05K4k77J52N4j54J24J46l19K78J48m10K84
8103E4J05l8P6r2j59j42P9J53j16m4L86k11kR2m8l32J0q6L85j98P7L0j44K62j25
$$ plain form
8128 -28 79 -37 54 100 -66 -60 -126 234 48 -78 86 0 -19 -149 -40 133 -58 -57 -30 -143 -125 24 84 -323
8152 -323 -131 -165 9 -51 37 124 89 3 -381 -70 -15 148 219 -183 -2 -132 -45 83 128 -89 -49 -183 -142 20
8176 20 -245 -103 43 -138 39 106 -169 86 80 66 52 -126 -159 34 -280
$$ packed form
8128b8J07j16R1M6j66Oo6L60j86j26J64q6j9j30J09J73j91JK7j13J8J49O0m07
8152c23J92l4J74o0Q8Q7l5q6l84L11N5J63P1m02J81j30Q7J28M5k17M0j34M1J62
8176B0k65J42J46j81J77O7k75K55oj4j4j78l3J93l14
8191b80
$$ Imaginary data points
##PAGE= N=2
##DATA TABLE= (X++(I..I)), XYDATA
$$ plain form
0 0 0 0 0 0 0 0 0 0 0 0 0 0 0 0 0 0 8 -8 8 -8 8 -8 16 -16 16 -24 24 -28 32 -39 41 -48 56 -63 71 -79 89 -100
38 -100 110 -124 136 -152 167 -187 204 -228 251 -276 304 -336 369 -407 448 -494 548 -606 674 -753
58 -753 846 -958 1093 -1261 1478 -1768 2178 -2798 3847 -5929 11623 -58845 -163616 37741
72 37741 93593 -30615 9181 97609 14709 8306 56782 9964 1840 61304 25612 -35960
84 -35960 -3419 8608 -32197 -12548 3967 -26515 -46498 -24318 -16320 -30619 -4533 -434 -31070
97 -31070 -7887 6909 -17575 -10592 48834 61489 -1264 3333 44542 12310 -1221 37424 29964
110 29964 -4647 10147 -3053 -48216 -5272 28340 -28379 -49295 -12680 -17293 -44617 -12327
122 -12327 9642 -15915 -1862 7056 -8539 17166 37544 19749 14886 32112 14138 -15585
$$ packed form
0@%%%%%%%%%%%%%%%%Qj6J6j6J6j6K4l2L2m0M8n2O0p1Q0q9J04j19J34j50J68j89
38a00K10k34K60k88L19l54L91m32M79n27N80o40P05p76Q55r42J042j154J280j427
58g53J599j804K051k354K739l246L946m976O645r776J7552p0468j04771K01357
72C7741N5852j24208L9796Q8428q2900o403M8476m6818q124N9464l5692o1572
84c5960L2541J2027m0805J9649J6515l0482j9983K2180P998j4299K6086M099l0636
97c1070K3183J4796k4484O983N9426J2655o2753M597M1209l2232j3531L8645p460
110B9964l4611J4794j3200m5163M2944L3612n6719k0916L6615m613k7324L2290
122a2327K1969k5557J4053Q918j5595K5705K0378j7795m863J7226j7974k9723
$$ plain form
134 -15585 5023 22008 6969 -1499 -1146 -3837 -9244 -5579 -9937 -10423 4624 -12589 -36437 -26569
148 -26569 -7990 -6829 -11731 7896 11689 -8876 4011 23996 25599 29129 26673 7087 -3051
161 -3051 11707 4426 -11135 4040 5923 -15323 -20810 -12112 -10445 -6482 987 -17632 -22050 421
175 421 -9139 -16350 9472 16124 -1471 2411 19243 5617 5236 29502 21143 6786 11032 1667
189 1667 -13177 721 16392 -6370 -17472 -4787 -12817 -22949 -16837 -8502 -8157 -9670 -10825 -17818
203 -17818 -4618 16486 9665 5886 16572 16964 3315 8712 28166 17521 2624 8872 6406
216 6406 -6555 -5387 2252 -5636 -4780 2142 -21541 -29657 -4538 -6323 -25042 -12376 5892 -12335
230 -12335 -17530 7688 9646 8832 22608 13480 1039 16831 25052 5480 8951 23669 2743
$$ packed form
134a5585K0608J6985j5039q468L53k691n407L665m358m86J5047j7213k3848R868
148b6569J8579J161m902J9627L793k0565J2887J9985J603L530k456j9586j0138
161c051J4758p281j5561J5175J883k1246n487Q698J667L963P469j8619m418K2471
175D21r560p211K5822O652j7595L882J6832j3626l81K4266q359j4357M246r365
189A667j4844J3898J5671k2762j1102J2685q030j0132O112Q335L45j513j155o993
203a7818J3200K1104o821l779J0686L92j3649N397J9454j0645j4897O248k466
216F406j2961J168P639p888Q56O922k3683q116K5119j785j8719J2666J8268j8227
230a2335n195K5218J958q14J3776r128j2441J5792Q221j9572L471J4718k0926
$$ plain form
243 2743 -10926 85 -845 -7519 -2383 -2848 -18103 -17608 -12526 -21121 -11826 1049 -9136 -17237 -4660
258 -4660 7759 1417 2555 14037 15785 14717 12239 7437 9872 20069 19151 1624 -1763 5219
272 5219 -4537 -10984 -2586 -776 -13464 -18260 -11871 -15526 -14185 -6184 -6236 -2643 542 -5756 -7064
287 -7064 8720 17636 5999 5800 13945 9759 8097 12270 12883 9561 7829 34 -9326 -2198 400
302 400 -10643 -11647 -5907 -9857 -19100 -14703 -3113 -2080 -2282 -2242 -2317 2181 3708 3938 7508 14751
318 14751 11846 843 4595 12739 9119 4907 5459 3111 -3709 -5533 -7992 -10269 -542 -2542 -16716
333 -16716 -15477 -4300 -5449 -8740 2061 5727 -2498 1265 4566 2627 9313 14202 7014 4301
347 4301 10854 5329 -1764 6676 7765 -2469 -5956 -6853 -9534 -7290 -4010 -9222 -9235 -2271 -8473 -12848
$$ packed form
243B743j3669J1011r30o674N136m65j5255M95N082q595R295J2875j0185q101J2577
258d660J2419o342J138J1482J748j068k478m802K435J0197r18j7527l387O982
272E219r756o447Q398J810j2688m796O389l655J341Q001n2L593L185o298j308
287g064J5784Q916j1637j99Q145m186j662M173O13l322j732p795r360P128K598
302D00j1043j004N740l950r243M397J1590J033k02M0p5M498J527K30L570P243
318A4751k905j1003L752Q144l620m212N52k348o820j824k459k277R727k000j4174
333a6716J239J1177j149l291J0801L666q225L763L301j939O686M889p188k713
347D301O553n525p093Q440J089j0234l487q97k681K244L280n212j3O964o202m375
$$ plain form
363 -12848 -2160 5564 3135 931 4928 4953 3709 7821 11082 13103 10349 4258 2297 3676 4783
378 4783 208 -4672 -3204 -5335 -13648 -16299 -8107 -3165 -8557 -8747 -6532 -5127 -809 1748 2888
393 2888 6960 10050 4093 2179 11013 11410 6807 10664 10486 3830 1489 1201 -1523 546 1013 -10938
409 -10938 -15477 -8293 -10158 -14052 -8818 -5118 -7620 -6779 -3652 -2782 5921 12464 6635 5221 11518
424 11518 10531 5825 9946 15060 8876 3290 1457 -280 -593 -1264 -4797 -8266 -7701 -9927 -15648 -12287
440 -12287 -4535 -6637 -9703 -4852 -402 -4022 -1660 7687 9414 8806 8391 5613 7394 13305 12071
455 12071 4989 7831 9023 -1733 -4707 268 -2050 -7029 -8053 -10550 -14504 -11391 -8378 -8815 -3221
470 -3221 -1228 -5774 -4124 4325 7459 4752 7083 9746 7233 5522 5663 6735 8315 7513 4218 -969
$$ packed form
363a2848J0688P724k429k204L997K5j244M112L261K021k754o091j961J379J107
378D783m575m880J468k131q313k651Q192M942n392j90K215J405M318K557J140
393B888M072L090n957j914Q834L97m603L857j78o656k341k88k724K069M67j1951
409a0938m539P184j865l894N234L700k502Q41L127Q70Q703O543n829j414O297
424A1518r87m706M121N114o184n586j833j737l13o71l533l469N65k226n721L361
440a2287P752k102l066M851M450l620K362R347J727o08m15k778J781N911j234
455A2071p082K842J192j0756k974M975k318m979j024k497l954L113L013m37N594
470c221J993m546J650Q449L134k707K331K663k513j711J41J072J580q02l295n187
$$ plain form
486 -969 -995 568 -3580 -5974 -3871 -4254 -11641 -12822 -7314 -5778 -4935 -2447 -3873 -1352 3875 2757
502 2757 2022 10364 13336 3966 2716 7855 5513 4048 5990 3169 -623 -650 -5038 -8025 -1812 -2168
518 -2168 -9687 -8420 -4525 -7189 -7245 -1249 600 614 2482 379 1399 7460 7039 4179 7172 7630 2058
535 2058 806 4548 4160 2134 626 -2591 -4425 -4926 -6220 -6280 -5009 -5320 -8182 -9063 -5476 -514 975
552 975 1712 4392 5903 4630 4976 7501 7843 7732 5714 2125 714 2770 269 -2426 100 -1155
568 -1155 -6913 -7696 -5533 -6049 -5616 -4702 -7800 -6552 -1740 -3749 -3940 4226 7881 3239 3243 7517 7235
585 7235 7025 9236 6978 5241 4415 592 -2065 660 1994 -4557 -7827 -5426 -6898 -10456 -8957 -4632
601 -4632 -4750 -6369 -4970 -3401 -189 3766 4122 4403 7403 8091 4481 5092 10667 8224 3546 4450 3322
$$ packed form
486i69k6J563m148k394K103l83p387j181N508J536Q43K488j426K521N227j118
502B757p35Q342K972r370j250N139k342j465J942k821l792k7m388k987O213l56
518b168p519J267L895k664n6N996J849J4J868k103J020O061m21k860K993M58n572
535B058j252L742l88k026j508l217j834n01j294o0J271l11k862q81L587M962J489
552I75P37K680J511j273L46K525L42j11k018l589j411K056k501k695K526j255
568a155n758p83K163n16M33R14l098J248M812k009j91Q166L655m642MM274k82
585G235k10K211k258j737q26l823k657K725J334o551l270K401j472l558J499M325
601d632j18j619J399J569L212L955L56K81L000O88l610O11N575k443m678R04j128
$$ plain form
618 3322 -751 -851 560 -2322 -3610 -4017 -8957 -10472 -5795 -5926 -8039 -5479 -3323 -5358 -3129 1771
634 1771 3555 5368 6767 5302 5904 8050 7306 5377 6839 6873 2330 -1013 -1665 -411 99 -3520 -6303
651 -6303 -5923 -5741 -7915 -8094 -5392 -2928 -3448 -4533 -3719 1136 2465 2421 5288 7219 5117 3572 5688
668 5688 6633 6447 5222 1764 914 1783 -1969 -3710 -1132 -1163 -6373 -7423 -5824 -6369 -4177 -3561 -4445
685 -4445 -1321 762 -2142 -649 5500 6342 3397 5495 5162 2724 4716 5244 2435 2241 2523 -1838
701 -1838 -2991 -1213 -2739 -4115 -2895 -4281 -6722 -6006 -3838 -2523 -816 -174 -1361 -208 2603 3537
717 3537 3982 5532 6470 5219 2312 2155 3544 3091 1483 137 -1906 -2918 -3454 -4545 -4751 -2203 -3484
734 -3484 -7168 -5214 -2047 -2670 -2256 1647 2100 769 2559 3230 4774 7554 6312 2928 4266 5338
$$ packed form
618C322m073j00J411k882j288m07m940j515M677j31k113K560K156k035K229M900
634A771J784J813J399j465O02K146p44j929J462L4m543l343o52J254N10l619k783
651f303L80J82k174j79K702K464n20j085Q14M855J329m4K867J931k102j545K116
668E688R45j86j225l458q50Q69l752j741K578l1n210j050J599n45K192O16q84
685d445L124K083k904J493O149Q42k945K098l33k438J992N28k809j94K82m361
701a838j153J778j526j376J220j386k441P16K168J315J707O42j187J153K811R34
717C537M45J550R38j251k907j57J389m53j608j346k043j012n36j091k06K548j281
734c484l684J954L167o23M14L903M53j331J790O71J544K780j242l384J338J072
$$ plain form
750 5338 1281 -317 2705 1120 -3408 -4391 -4940 -4876 -4588 -4564 -4649 -4520 -4387 -5034 -3248 194 2102 1936
768 1936 2520 3989 4222 4603 6309 7445 5870 5038 3962 1836 878 2070 -431 -3023 -3036 -4909 -7315
785 -7315 -6133 -4789 -5760 -5607 -3993 -5232 -3596 -22 491 1070 4539 4575 2361 4336 7598 6443 6276
802 6276 6350 3901 2915 2297 -469 -1123 593 -2311 -7151 -6297 -4369 -6451 -6410 -4719 -4253 -4301 -3706 -2696
820 -2696 -50 3006 3215 2705 4134 5277 4385 5263 7119 6766 4172 2144 2188 1356 46 -1127 -2206
837 -2206 -3896 -4508 -5858 -7095 -5394 -2963 -4016 -5072 -2564 -1268 -1411 1372 3136 2743 4035 5073
853 5073 3446 3818 6924 5755 2980 3588 2630 -1235 -1097 -88 -2682 -3403 -3609 -5603 -6168 -3399 -3230
870 -3230 -4174 -1316 -482 -2607 -1301 2535 2786 1891 3832 3796 2549 3639 4182 3202 3884 3982 596 -1740
$$ packed form
750E338m057j598L022j585m528r83n49O4K88K4q5J29J33o47J786L442J908j66
768A936N84J469K33L81J706J136j575q32j076k126r58J192k501k592j3j873k406
785g315J182J344r71J53J614j239J636L574N13N79L469L6k214J975L262j155j67
802F276P4k449r86o18k766o54J716k904m840Q54J928k082M1J691M66m8N95J010
820b696K646L056K09n10J429J143q92Q78J856l53k594k028M4q32j310j173j079
837b206j690o12j350j237J701K431j053j056K508J296j43K783J764l93J292J038
853E073j627L72L106j169k775O08r58l865J38J009k594p21k06j994n65K769J69
870c230r44K858Q34k125J306L836K51q95J941l6j247J090N43r80O82R8l386k336
$$ plain form
888 -1740 385 -760 -3694 -3140 -2053 -4792 -6147 -3966 -3091 -2654 -817 -830 -896 1571 2477 918 3317
905 3317 6290 3754 1203 3283 3543 1849 2288 2010 -500 -1156 -1436 -3687 -3838 -1306 -3031 -5320 -3970
922 -3970 -2864 -4112 -2520 274 259 -91 1777 1710 1702 4536 5472 3649 3655 5032 2570 1136 2631 2364
940 2364 -382 -1575 -2357 -4555 -4579 -3369 -4931 -5390 -3251 -3574 -5075 -1916 1527 232 744 3691 2940
957 2940 2010 4326 4961 3970 4781 4026 751 2099 3710 516 -1263 1107 -1541 -5198 -4182 -3351 -5256
974 -5256 -4718 -3652 -5186 -4492 -1558 -1912 -1108 2665 3441 1417 2837 5475 4247 4179 5911 4681 2848
991 2848 2571 1754 452 984 174 -2867 -4048 -3115 -4429 -5705 -4392 -3115 -4024 -4116 -2639 -2419 -912
1008 -912 1761 1758 1298 3118 4285 2540 3591 6031 4746 2579 3279 2601 570 1135 634 -1909 -2404
$$ packed form
888a740K125j145k934N54J087k739j355K181Q75M37J837j3o6K467R06j559K399
905C317K973k536k551K080K60j694M39k78k510o56k80k251j51K532j725k289J350
922c970J106j248J592K794j5l50J868o7qK834R36j823OJ377k462j434J495k67
940B364k746j193p82k198k4J210j562m59K139l23j501L159L443j295N12K947p51
957B940r30K316O35r91Q11p55l275J348J611l194j779K370k648l657J016Q31j905
974e256N38J066j534O94K934l54Q04L773P76k024J420K638j228o8J732j230j833
991B848k77q17j302N32q10l041j181R33j314j276J313J277r09r2J477K20J507
1008i12K673lm60J820J167j745J051K440j285k167P00o78k031N65n01k543m95
$$ plain form
1025 -2404 -2685 -5266 -5440 -2753 -3548 -5155 -2579 -2166 -2684 -806 1678 1027 2201 3737 2092 2170 4505
1042 4505 3814 2440 3373 3625 394 -390 1289 282 -1408 -1483 -1875 -3896 -3493 -3206 -3447 -2668 -967 -2650
1060 -2650 -3136 23 1179 -85 1950 4325 2224 1558 3210 3015 2045 3593 2468 -662 107 748
1076 748 -2115 -1908 -275 -2586 -4333 -2769 -2988 -3891 -1405 -426 -2222 -665 1143 354 622 3402 3593
1093 3593 1992 2243 3079 1878 2211 2753 1387 605 240 -1007 -3068 -1665 -1000 -3194 -4128 -2487 -2939
1110 -2939 -4232 -1857 -130 -821 -309 1072 766 1670 4035 3382 2537 4376 3588 670 1950 3579 628
1127 628 -145 928 -1255 -3547 -2054 -2489 -3892 -2691 -2746 -4589 -3313 -884 -1823 -1087 1282 1240 419
1144 419 2318 3561 3538 4171 4330 3143 2580 2737 1975 734 1174 467 -1431 -2582 -3055 -3262 -3259 -3353 -3640
$$ packed form
1025b404k81k581j74K687p95j607K576M13n18J878K484o51J174J536j645P8K335
1042D505o91j374R33K52l231p84J679j007j690p5l92k021M03K87k41P79J701j683
1060b650m86L159J156j264K035K375k101o66J652j95r70J548j125l130P69O41
1076G48k863K07J633k311j747J564k19r03K486R79j796J557J808p89K68K780J91
1093C593j601K51Q36j201L33N42j366p82l65j247k061J403O65k194r34J641m52
1110b939j293K375J727o91N12J381l06R04K365o53q45J839p88k918J280J629k951
1127F28p73J073k183k292J493m35j403J201n5j843J276K429r39P36K369m2q21
1144D19J899J243k3O33J59j187n63J57p62j241M40p07j898j151m73k07Lr4k87
$$ plain form
1163 -3640 -4162 -3287 -2316 -2482 -1180 1320 1083 741 2055 3212 3283 4069 4346 3644 3322 2908 1411 1366 1920
1182 1920 81 -1913 -1305 -2048 -4132 -3574 -2559 -3301 -3658 -3192 -3399 -2338 -678 -343 87 1942 2284
1199 2284 1428 2538 4063 3663 3263 3828 2542 1452 1369 1544 218 -409 -978 -2534 -2997 -2510 -2618 -3549
1217 -3549 -2578 -2369 -3115 -2439 -728 -375 311 1777 1369 1230 2334 3467 2691 2770 3611 2131 1026 1453
1235 1453 864 -125 89 -576 -2381 -2427 -1893 -3295 -3091 -1458 -1942 -2851 -1433 -536 -644 560 1667 1641
1253 1641 2127 2277 1892 2195 3561 2692 916 1091 901 -290 -1041 -339 -736 -2042 -2501 -2530 -2611 -2284 -1500
1272 -1500 -1699 -1326 -679 -208 -512 1069 2233 1716 1972 2433 2123 1497 2353 2489 1229 1101 351 -1043
1290 -1043 -1031 -887 -1545 -2300 -2073 -2473 -3528 -2242 -1369 -1722 -540 309 -137 422 1707 2049 2287 2869 2855
$$ packed form
1163c640n22Q75R71j66J302K500k37l42J314J157P1P86K77p02l22m14j497m5N54
1182A920j839j994O08p43k084N58J015p42l57M66k07J061J660L35M30J855L42
1199B284q56J110J525m00m00N65j286j090q3J75j326o27n69j556m63M87j08r31
1217c549R71K09p46O76J711L53O86J466m08j39J104J133p76P9Q41j480j105M27
1235A453n89r89K14o65j805m6N34j402K04J633m84r09J418Q97j08J204J107k6
1253A641M86J50l85L03J366q69j776J75j90j191p51P02l97j306m59k9q1L27P84
1272a500j99L73O47M71l04J581J164n17K56M61l10o26Q56J36j260j28p50j394
1290a043J2J44o58p55K27m00j055J286Q73l53J182Q49m46N59J285L42K38N82j4
$$ plain form
1309 2855 1866 2150 2195 1799 1246 1140 -130 -959 -1188 -2049 -2484 -1814 -2325 -3202 -3202 -2264 -2260 -1782 -598 -136 244
1330 244 742 1203 2017 2935 3294 3091 2792 2939 2159 1521 1753 1544 20 -1115 -1567 -2088 -2311 -2483 -2779
1349 -2779 -3044 -2432 -2795 -2921 -1612 -587 -453 34 1055 909 1454 2596 2656 2835 3125 3054 2049 1946 2248
1368 2248 1482 441 427 -886 -2052 -2154 -2424 -2904 -2689 -2647 -3070 -2905 -1647 -958 -797 299 1004 881 1156
1387 1156 2304 2531 2448 2958 2731 1777 1627 1684 1042 806 678 -881 -1980 -1572 -1906 -2747 -1822 -1991 -2541
1406 -2541 -2569 -1709 -1425 -904 212 320 219 1414 2007 1595 2389 2989 2444 1722 1602 1102 665 639 55 -872
1426 -872 -960 -1536 -2352 -2124 -1461 -1799 -2008 -1399 -1131 -1292 -288 482 583 907 1184 1217 1463 1997 2235 1752
1446 1752 1397 1363 842 22 325 -11 -464 -940 -1620 -2431 -2228 -1579 -1731 -1568 -789 -882 -1093 -164 832 1051
$$ packed form
1309B855r89K84M5l96n53j06j270q29k29q61m35O70n11q77%R38MM78J184M62L80
1330B44M98M61Q14R18L59k03k99J47p80o38K32k09j524j135m52n21k23j72k96
1349b779k65O12l63j26J309J025J34M87J021j46N45J142O0J79K90p1j005j03L02
1368B248p66j041j4j313j166j02k70m80K15M2m23J65J258O89J61J096P05j23K75
1387A156J148K27q3N10k27r54j50N7o42k36j28j559j099M08l34q41R25j69n50
1406b541k8Q60K84N21J116J08j01J195N93m12P94O00n45p22j20n00m37k6n84r27
1426h72q8n76q16K28O63l38k09O09K68j61J004P70J01L24K77L3K46N34K38m83
1446A752l55l4n21q20L03l36m53m76o80q11K03O49j52J63P79r3k11R29R96K19
$$ plain form
1466 1051 1560 1945 1301 1646 2271 1667 1303 1946 1003 -328 51 -65 -1029 -1298 -1055 -1708 -2584 -2287 -1888
1485 -1888 -1733 -1062 -821 -942 -156 410 372 1121 2059 1961 1727 1790 2284 1922 1738 1754 1073 76 66 -673 -1312
1506 -1312 -1303 -1375 -2276 -2500 -2156 -2178 -2220 -1638 -758 -927 33 577 578 1186 2359 2048 2079 2455 2381 1374 1713 1810
1528 1810 1069 573 61 -943 -1377 -1322 -1604 -2151 -2076 -2277 -2776 -2394 -1572 -1201 -822 -113 -21 559 1251 1554
1548 1554 2030 2790 2702 2007 1652 2094 1831 1058 999 450 -617 -1160 -1081 -1557 -1908 -1954 -2354 -2530 -2224 -1616 -1669
1569 -1669 -773 -84 35 115 773 1479 1582 2213 2164 1728 1659 1733 1453 1440 1250 141 -318 -435 -990 -1525 -1229
1590 -1229 -1571 -2261 -1894 -1874 -2044 -1315 -222 -351 -297 493 746 586 1271 1904 1825 1833 1520 1301 959 1175 942
1611 942 -120 286 -406 -1245 -1665 -1316 -1408 -1567 -1688 -1467 -1422 -1164 -533 -321 255 624 486 688 1417 1787
$$ packed form
1466A051N09L85o44L45O25o04l64O43r43j331L79j16r64k69K43o53q76K97L99
1485a888J55O71K41j21P86N66l8P49R38r8k34O3M94l62j84J6o81r97j0p39o39
1506a312Rp2r01k24L44k2m2N82Q80j69R60N44JO08J173l11L1L76p4j007L39R7
1528A810p41m96n12j004m34N5k82n47P5k01m99L82Q22L71L79P09R2N80O92L03
1548A554M76P60q8o95l55M42k63p73n9n49j067n43P9m76l51m6m00j76L06O08n3
1569a669Q96O89J19Q0O58P06J03O31m9m36o9P4k80j3j90j109m59j17n55n35K96
1590a229l42o90L67K0j70P29J093j29N4P90K53j60O85O33p9Ql13k19l42K16k33
1611I42j062M06o92q39m20L49r2j59j21K21M5K58O31K12N76L69j38K02P29L70
$$ plain form
1631 1787 1211 1584 1739 1065 549 435 309 -71 -455 -810 -1520 -1230 -1418 -1616 -1257 -817 -1195 -1369 -744 -123
1651 -123 64 601 1191 1174 1497 1523 1506 1316 1712 1548 794 331 135 -100 -589 -861 -1117 -1346 -1795 -1886 -1813 -1377
1673 -1377 -1026 -1094 -857 -494 18 56 674 1353 1482 1580 1713 1482 1586 1460 1496 1178 543 87 -616 -555 -732
1694 -732 -1336 -1752 -1766 -1875 -1627 -1600 -1499 -1145 -594 -506 -273 512 965 1091 1496 2070 1955 1859 1790 1663 1510 1353
1716 1353 520 336 -36 -465 -1089 -1278 -1209 -1775 -1905 -2082 -1674 -1534 -1279 -849 -399 -295 117 708 712 1620 1921
1737 1921 1721 1700 1866 1725 1339 1369 1010 298 121 -390 -1186 -1144 -894 -1498 -1994 -1628 -1808 -1915 -1147 -691 -752
1758 -752 -495 34 255 988 1603 1098 1482 2020 1562 900 1237 1549 1019 559 475 -248 -890 -1166 -1141 -1361 -1179
1779 -1179 -1475 -1729 -1550 -1043 -756 -856 -74 207 105 628 1264 1438 1244 1279 1329 1036 1341 732 665 803 250
$$ packed form
1631A787n76L73J55o74n16j14j26l80l84l55p10K90j88j98L59M40l78j74O25O21
1651a23J87N37N90j7L23K6j7j90L96j64p54m63j96k35m89k72k56k29m49r1P3M36
1673a377L51o8K37L63N12L8O18O79J29R8J33k31J04j26L6l18o35m56p03O1j77
1694g32o04m16j4j09K48K7J01L54N51Q8K33P85M53J26M05N74j15r6o9j27j53j57
1716A353q33j84l72m29o24j89O9n66j30j77M08J40K55M30M50J04M12N91MR08L01
1737A921k00k1J66j41l86L0l59p12j77n11p96M2K50o04m96L66j80j07P68M56o1
1758g52K57N29K21P33O15n05L84N38m58o62L37L12n30m60q4p23o42k76K5k20J82
1779a179k96k54J79N07K87j00P82K81j02N23O36J74j94L5N0k93L05o09o7J38n53
$$ plain form
1800 250 -368 -914 -736 -717 -1055 -898 -1104 -1793 -1122 -1017 -738 -413 140 326 322 1000 814 853 1453 1344 1197
1821 1197 1020 699 143 346 380 -112 -848 -671 -931 -1398 -1362 -998 -968 -1176 -950 -773 -412 -80 330 807 862
1842 862 1058 822 1024 1634 1462 939 1063 860 371 206 -10 -63 -472 -561 -1568 -1394 -1194 -1265 -1524 -1172 -485
1863 -485 -854 -404 310 348 855 907 1217 1354 1436 1612 1164 1321 1394 468 162 181 -70 -741 -806 -930 -1472 -1458
1885 -1458 -1314 -1546 -1291 -1162 -905 -907 -386 340 158 490 1411 1247 1442 1541 1569 1507 1341 1024 705 423 426 -467
1907 -467 -722 -477 -870 -1564 -1554 -1492 -1388 -1410 -1242 -827 -1016 -292 -243 149 713 1199 1231 1075 1668 1442 1173 1306
1929 1306 1190 1080 502 420 -79 -158 -384 -1278 -1345 -1236 -1540 -1638 -1498 -960 -847 -1226 -393 -204 20 690 888
1950 888 910 1433 1554 1332 1133 1454 1097 606 888 650 -253 -195 -270 -963 -759 -963 -1450 -1309 -1151 -1002 -904
$$ packed form
1800B50o18n46J78J9l38J57k06o89O71J05K79L25N53J86mO78j86L9O00j09j47
1821A197j77l21n56K03L4m92p36J77k60m67L6L64L0k08K26J77L61L32M10M77N5
1842H62J96k36K02O10j72n23J24k03m89j65k16n3m09q9j007J74K00p1k59L52O87
1863d85l69M50P14L8N07N2L10J37Q2J76m48J57P3r26l06J9k51o71o5j24n42J4
1885a458J44k32K55J29K57kN21P26j82L32R21j64J95R9K8o2j66l17l19k82Lq93
1907d67k55K45l93o94J0O2J04k2J68M15j89P24M9L92N64M86L2j56N93k26k69J33
1929A306j16j10n78q2m99p9k26q94o7J09l04r8J40N38J13l79Q33J89K24O70J98
1950H88K2N23J21k22j99L21l57m91K82k38r03N8p5o93K04k04m87J41J58J49R8
$$ plain form
1971 -904 -567 -318 -326 -75 305 682 707 1178 905 855 1365 970 687 785 861 56 -380 -269 -280 -751 -868 -1069
1993 -1069 -1100 -872 -1015 -571 -735 -287 -56 -198 170 431 512 661 1172 1170 730 649 660 517 463 287 -49 -391
2015 -391 -287 -944 -744 -580 -993 -1127 -892 -778 -823 -579 -164 -57 143 630 631 342 1259 1268 832 1010 988 649
2037 649 360 371 92 -137 -136 -847 -1368 -984 -936 -1263 -1338 -886 -554 -892 -593 -78 233 493 540 904 1290 1380
2059 1380 1140 1174 1242 1292 513 393 497 -22 -542 -472 -774 -1142 -1127 -1278 -1420 -938 -992 -1050 -814 -172 -223 -306 492
2082 492 832 796 896 1264 1321 1365 1074 1059 877 878 418 -225 -171 1 -1086 -966 -1109 -1202 -1408 -1438 -930 -1090 -532
2105 -532 -543 -414 -40 209 392 513 931 1268 759 1228 1535 1134 957 635 362 101 192 -464 -802 -722 -725 -1200
2127 -1200 -1324 -1160 -745 -1130 -579 -655 -567 153 69 588 799 1025 718 1097 1288 1004 729 838 762 512 86
$$ packed form
1971i04L37K49qK51L80L77K5M71k73n0N10l95k83R8P6q05m36J11j1m71j17k01
1993a069l1K28j43M44j64M48K31j42L68K61Q1J49N11km40q1J1j43n4j76l36l42
2015c91J04o57K00J64m13j34K35J14m5K44M15J07K00M87Jk89R17Rm36J78k2l39
2037F49k89J1k79k29Jp11n21L84M8l27p5M52L32l38K99N15L11K60M7L64L86R0
2059A380k40L4O8N0p79j20J04n19n20P0l02l68J5j51j42M82n4n8K36O42n1q3P98
2082D92L40l6J00L68N7M4k91j5j82Jm60o43N4J72j087J20j43r3k06l0N08j60N58
2105e32j1J29L74K49J83J21M18L37n09M69L07m01j77l22k73k61R1o56l38Q0lm75
2127a200j24J64M15l85N51p6Q8P20q4N19K11K26l07L79J91k84k75J09p6k50m26
$$ plain form
2148 86 7 -350 -540 -459 -1208 -902 -965 -962 -1182 -794 -561 -606 -524 -74 287 654 623 861 1139 1031 1072 1054 889 727
2172 727 694 163 -176 4 -312 -578 -330 -969 -1080 -1071 -1028 -893 -659 -377 -388 -109 331 254 79 643 861 550
2194 550 546 926 745 687 453 291 115 123 -390 -346 -609 -756 -808 -849 -1042 -881 -676 -439 -342 122 27 160 366
2217 366 771 1016 935 989 1141 959 563 385 110 260 -255 -208 -480 -524 -747 -1148 -792 -960 -874 -749 -637 -385
2239 -385 -241 -22 75 499 505 839 795 957 1431 1174 835 741 837 401 214 88 -57 -513 -778 -1114 -948 -728
2261 -728 -1165 -1024 -552 -708 -561 -577 -70 258 463 870 687 919 1131 1133 1000 1118 777 750 474 95 -114
2282 -114 -173 -501 -536 -630 -1083 -1265 -940 -860 -989 -1018 -851 -449 45 95 192 539 656 637 876 954 1059 898 1013
2305 1013 884 750 297 -80 0 -354 -343 -588 -895 -750 -602 -997 -803 -736 -498 -512 -376 -83 378 569 731
$$ packed form
2148H6p9l57j90Q1p49L06o3Lk20L88K33m5Q2M50L61L67l1K38K78j08M1j8j65j62
2172G27l3n31l39J80l16k66K48o39j11RM3J35K34K82j1K79M40p7j75N64K18l11
2194E50mL80j81n8k34j62j76Qn13M4k63j47n2m1j93J61K05K37R7M64r5J33K06
2217C66M05K45q1N4J52j82l96j78k75J50n15M7k72m4k23m01L56j68Q6J25J12K52
2239c85J44K19R7M24OL34m4J62M74k57l39r4R6m36j87j26j45m56k65l36J66K20
2261g28m37J41M72j56J47j6N07L28K05M07j83K32K12Kj33J18l41k7k76l79k09
2282a14n9l28l5r4m53j82L25Q0j29k9J67M02M94N0R7L47J17j9K39P8J05j61J15
2305A013j29j34m53l77Q0l54J1k45l07J45J48l95J94O7K38j4J36K93M61J91J62
$$ plain form
2326 731 566 992 700 914 1092 784 871 371 235 263 -151 -339 -623 -561 -450 -773 -928 -944 -360 -472 -665
2347 -665 -318 -65 -2 346 436 524 513 575 624 760 830 669 457 474 499 -54 -271 -334 -218 -550 -840 -885 -628 -543
2371 -543 -596 -683 -251 -12 -77 233 341 827 742 550 1008 802 765 325 581 214 389 -151 -373 -215 -404 -638
2393 -638 -320 -525 -676 -290 -753 -436 -147 -168 191 246 260 561 640 695 759 977 662 647 611 479 2 165 46
2416 46 -275 -274 -822 -674 -638 -866 -761 -838 -638 -790 -403 -261 101 158 487 649 480 786 1093 809 779 828 683
2439 683 567 228 68 -157 -377 -437 -433 -683 -811 -1068 -1064 -689 -707 -735 -620 -126 -75 -119 424 520 948 882 859 928
2463 928 1233 806 727 735 461 198 -85 -255 -373 -439 -807 -767 -713 -849 -826 -1131 -707 -325 -563 -78 109 354
2485 354 500 399 697 684 778 1141 784 698 528 442 84 211 185 -225 -417 -816 -541 -1029 -752 -738 -555 -616
$$ packed form
2326G31j65M26k92K14J78l08Q7n00j36K8m14j88k84O2J11l23j55j6N84j12j93
2347f65L47K53O3L48R0Q8j1O2M9J36P0j61k12J7K5n53k17o3J16l32k90m5K57Q5
2371e43n3q7M32K39o5L10J08M86q5j92M58k06l7m40K56l67J75n40k22J58j89k34
2393f38L18k05j51L86m63L17K89k1L59N5J4L01P9N5O4K18l15j5l6j32m77J63j19
2416D6l21Jn48J48L6k28J05p7K00j52L87J42L62N7L29J62j69L06L07k84l0M9j45
2439F83j16l39j60k25k20o0Mk50j28k57ML75j8k8J15M94N1m4N43R6M28o6k3O9
2463I28L05m27p9Qk74k63k83j70j18o6l68M0N4j36K3l05M24L82k38M85J87K45
2485C54J46j01K98j3R4L63l57q6j70q6l58J27k6m10j92l99K75m88K77J4J83o1
$$ plain form
2507 -616 -511 -302 -143 69 181 329 454 441 597 732 949 625 275 550 363 190 -25 1 -189 -203 -422
2528 -422 -952 -731 -491 -515 -971 -646 -320 -125 -362 138 203 732 359 554 509 611 602 488 505 531 121 28 -138
2551 -138 -286 -330 -493 -459 -335 -650 -396 -401 -534 -178 -430 -317 -17 -86 249 452 517 715 434 725 672 552
2573 552 463 466 -54 180 -25 -440 -426 -407 -572 -535 -668 -372 -568 -291 -408 -116 13 340 189 365 777 660
2595 660 629 473 582 555 333 251 259 274 -7 -384 -469 -637 -356 -599 -766 -597 -407 -437 -429 -185 -120 -14 212 572
2619 572 700 577 655 647 419 885 585 237 307 444 -42 -103 -229 -435 -707 -638 -739 -509 -604 -851 -626 -175
2641 -175 -223 -117 87 171 106 184 611 632 678 603 767 626 906 619 143 -50 -9 -222 -541 -677 -547 -635 -783
2664 -783 -705 -670 -502 -565 -512 -172 90 216 333 250 661 462 862 506 619 736 718 455 338 350 24 -397
$$ packed form
2507f16J05K09J59K12J12J48J25j3J56J35K17l24l50K75j87j73k15K6j90j4k19
2528d22n30K21K40k4m56L25L26J95k37N00O5N29l73J95m5J02rj14J7K6m10r3j66
2551a38j48m4j63L4J24l15K54nj33L56k52J13L00o9L35K03O5J98k81K91n3j20
2573E52q9Ln20K34k05m15J4J9j65L7j33K96j96K77j17K92J29L27j51J76M12j17
2595F60l1j56J09k7k22q2QJ5k81l77q5j68K81k43j67J69J90l0QK44O5J06K26L60
2619E72J28j23P8qk28M66l00l48P0J37m86o1j26k06k72O9j01K30r5k47K25M51
2641a75m8J06K04Q4o5P8M27K1M6p5J64j41K80k87m76j93M1k13l19j36J30q8j48
2664g83P8L5J68o3N3L40K62J26J17q3M11j99M00l56J13J17j8k63j17J2l26m21
$$ plain form
2686 -397 -324 -463 -534 -690 -661 -605 -865 -573 -559 -442 88 41 130 323 200 383 458 579 915 544 287 457 512
2709 512 350 164 -137 -61 -347 -646 -581 -223 -622 -677 -498 -489 -519 -629 -420 -138 108 245 306 237 450 411 525
2732 525 399 422 216 191 216 279 -36 -222 -533 -368 -481 -359 -421 -229 -150 -790 -283 -229 -283 -61 138 184 383
2755 383 462 280 268 338 619 393 324 69 103 140 -37 -268 -143 -618 -744 -830 -366 -583 -365 -326 -164 -60 -65
2778 -65 193 439 408 336 426 489 608 177 423 314 187 193 77 -94 -131 -274 -480 -558 -791 -788 -567 -606 -517 -211
2802 -211 -260 167 -148 238 303 339 651 621 650 571 623 538 542 183 116 157 -187 -327 -546 -345 -656 -736 -426 -519 -496
2827 -496 -356 -414 -490 122 -16 5 200 391 403 550 747 582 548 641 457 431 240 -16 -47 -304 -97 -265 -537
2850 -537 -590 -551 -422 -688 -503 -412 -359 -166 -140 261 107 206 607 698 681 432 496 153 214 447 326 334 17 -206
$$ packed form
2686c97P3j39p1j56K9N6k60K92J4J17N30m7Q9J93j23J83P5J21L36l71k57J70N5
2709E12j62j86l01P6k86k99O5L58l99n5J79Rl0j10K09K82K46J37O1o9K13l9J14
2732E25j26K3k06k5K5O3l15j86l11J65j13J22o2J92P9o40N07N4n4K22J99M6J99
2755C83P9j82j2P0K81k26o9k55L4L7j77k31J25m75j26q6M64k17K18L9J62J04n
2778f5K58K46l1p2R0O3J19m31K46j09j27Oj16j71l7j43k06p8k33LK21l9Q9L06
2802b11m9M27l15L86O5L6L12l0K9p9N2q5Ml59o7M1l44j40k19K01l11q0L10r3K3
2827d96J40n8p6O12j38K1J95J91J2J47J97j65l4R3j84k6j91k56l1k57K07j68k72
2850e37n3L9J29k66J85R1N3J93K6M01j54R9M01R1j7k49O4l43O1K33j21Ql17k23
$$ plain form
2874 -206 -309 -408 -556 -521 -648 -585 -733 -470 -360 -379 112 176 84 186 177 302 500 293 481 502 241 380 271
2897 271 232 193 -143 -102 -205 -174 -286 -302 -544 -458 -327 -309 -302 -220 167 26 99 245 273 515 323 239 569 318
2921 318 171 116 -17 22 -142 115 -318 -90 -733 -575 -549 -471 -319 -539 -266 -238 -234 -117 -35 216 395 258 360
2944 360 230 582 239 213 306 60 3 67 -93 -182 -142 -164 -385 -382 -411 -289 -501 -268 -240 -504 -321 146 299 219
2968 219 676 414 425 208 485 513 477 220 416 -51 8 -446 -68 -233 -246 -592 -653 -413 -401 -374 -348 -277 -230 74
2992 74 13 134 285 655 689 451 390 444 298 493 189 305 -68 -31 -247 -473 -303 -281 -466 -635 -298 -488
3014 -488 -673 -425 -173 143 -46 -170 -117 246 460 499 313 499 538 430 563 310 187 100 100 -49 -239 -173
3036 -173 -497 -533 -290 -227 -322 -486 -135 -102 -209 29 226 29 361 213 375 355 493 313 306 509 202 200 380
$$ packed form
2874b06j03r9j48L5j27O3j48K63J10j9M91O4r2J02rJ25J98k07J88K1k61J39j09
2897B71l9l9l36M1j03L1j12j6k42Q6J31J8PQ2L87j41P3J46K8K42j92q4L30k51
2921C18j47n5j33L9j64K57m33K28o43J58K6P8J52k20K73K8MJ17Q2K51J79j37J02
2944C60j30L52l43k6R3k46n7O4j60q9M0k2k21Lk9J22k12K33K8k64J83M67J53q0
2968B19M57k62J1k17K77K8l6k57J96m67N9m54L78j65j3l46o1K40J2K7K6P1M7L04
2992G4o1J21J51L70L4k38o1N4j46J95l04J16l73L7k16k26J70K2j85j69L37j90
3014d88j85K48K52L16j89j24N3L63K14L9j86J86L9j08J33k53j23q7%j49j90O6
3036a73l24l6K43O3r5j64L51L3j07K38J97j97L32j48J62k0J38j80pK03l07kJ80
$$ plain form
3059 380 122 -318 -116 -313 -98 -74 -505 -487 -565 -618 -452 -326 -17 77 -41 -166 154 355 316 287 270 422 495
3082 495 260 205 82 122 213 -299 124 -196 -226 -404 -420 -528 -304 -160 -384 190 -5 -73 5 -31 -51 250 131
3105 131 511 460 348 146 507 438 231 176 -148 71 -261 -166 -479 -416 9 -363 -414 -449 -145 146 217 -45 108
3128 108 214 426 239 349 359 448 289 579 202 -205 169 208 -114 -315 -77 -205 -498 -409 -429 -571 -182 -432
3150 -432 -447 -149 -64 102 283 6 400 508 581 353 632 639 215 290 236 127 -235 -276 -304 -269 -502 -267 -352 -494
3174 -494 -208 -443 -197 -329 -68 290 253 299 654 323 462 428 610 501 360 81 526 363 -49 -130 -355
3195 -355 -166 -379 -477 -593 -566 -388 -255 -388 -217 -8 110 -118 144 512 152 221 441 398 253 419 577
3216 577 175 221 262 76 -160 40 -202 -243 -259 -453 -680 -491 -416 -335 -322 -90 -7 222 93 154 486 360 493
$$ packed form
3059C80k58m40K02j97K15K4m31J8p8n3J66J26L09R4j18j25L20K01l9k9j7J52P3
3082D95k35n5j23M0R1n12M23l20l0j78j6j08K24J44k24N74j95o8P8l6k0L01j19
3105A31L80n1j12k02L61o9k07n5l24K19l32R5l13O3M25l72n1l5L04K91P1k62J53
3128A08J06K12j87J10J0Q9j59K90l77m07L74L9l22k01K38j28k93Q9k0j42L89k50
3150d32j5K98Q5J66J81k77L94J08P3k28K79Pm24P5n4j09l62m1k8L5k33K35q5j42
3174d94K86k35K46j32K61L58l7M6L55l31J39l4J82j09j41k79M45j63m12q1k25
3195c55J89k13r8j16K7J78J33j33J71K09J18k28K62L68l60O9K20m3j45J66J58
3216E77m02M6M1j86k36K00k42m1j6j94k27J89P5Q1J3K32Q3K29j29O1L32j26J33
$$ plain form
3239 493 323 564 212 358 145 347 188 159 33 -268 -363 -227 -363 -334 -417 -224 -334 -332 -238 -108 -127 -150 222
3262 222 -2 62 273 461 218 490 140 303 467 242 180 -51 107 158 -143 -70 -191 -346 -99 -388 -82
3283 -82 -522 -83 -149 153 -177 -17 227 20 534 261 330 400 464 -49 172 17 53 -57 45 -22 -224 -183 -356
3306 -356 -287 -285 -110 -297 -282 98 -13 -73 83 -43 377 377 392 221 113 124 379 353 112 151 194 -64 -129 -130 -178
3331 -178 -323 -295 -137 -436 -211 -417 -98 -150 118 -130 292 216 162 176 203 513 592 209 258 372 212 180 110
3354 110 -165 -184 -158 -247 -446 -107 -297 -229 -552 -375 -79 -173 33 79 97 189 407 449 374 286 318 375 274 278 296
3379 296 328 161 208 120 -369 -206 -148 -307 -376 -430 -421 -550 -96 145 -273 -131 42 253 71 587 337 60 457
3402 457 285 568 292 526 165 307 156 -311 -22 -69 -90 -200 -370 -324 -502 -165 -486 -85 24 -180 -27
$$ packed form
3239D93j70K41l52J46k13K02j59k9j26l01r5J36j36K9q3J93j10KR4J30j9k3L72
3262B22k24O4K11J88k43K72l50J63J64k25o2k31J58N1l01P3j21j55K47k89L06
3283h2m40M39o6L02l30J60K44k07N14k73O9P0O4n13K21j55L6j10J02o7k02M1j73
3306c56O9KJ75j87J5L80j11o0J56j26M20%J5j71j08J1K55k6k41L9M3k58o5jm8
3331a78j45K8J58k99K25k06L19n2K68k48M22p6n4J4K7L10P9l83M9J14j60l2p0
3354A10k75j9K6q9j99L39j90O8l23J77K96r4K06M6J8R2K18M2p5q8L2N7j01MJ8
3379B96L2j67M7q8m89J63N8j59o9n4Rj29M54K41m18J42J73K11j82N16k50k77L97
3402D57j72K83k76K34l61J42j51m67K89m7k1j10j70M6j78L37l21M01J09k04J53
$$ plain form
3423 -27 226 328 32 54 632 73 470 287 321 183 179 -77 102 -10 -182 -181 -69 -132 -193 -356 -102 -173 -227 -254
3447 -254 -68 -182 -284 -49 136 45 410 249 264 31 454 5 436 4 34 170 -91 -163 -259 -214 -125 -82 -107
3470 -107 -112 -115 -302 -278 97 -99 -118 137 356 348 408 180 19 333 287 237 248 54 104 127 -20 -329 -260 -232 18
3495 18 -327 -256 -274 -51 -84 -192 -187 -35 310 -52 287 214 204 163 111 158 150 18 221 30 -97 -144 -177 -587 -211
3520 -211 -293 -347 -409 -278 -96 -58 -54 -307 47 431 304 97 203 233 405 258 170 285 234 -7 54 149 -244 -265
3544 -265 -270 -364 24 -544 -279 -474 -272 -149 -379 -115 2 -213 226 58 163 211 92 411 333 281 75 154
3566 154 -108 112 198 -90 -53 -187 -136 -252 -180 -410 -292 -118 -217 -146 -77 -8 189 158 362 124 97 312 309 98
3590 98 359 382 252 288 -62 152 -4 16 -354 -373 -190 -318 -638 -159 -69 85 -51 -76 -55 -51 166 79 201 86
$$ packed form
3423b7K53J02k96K2N78n59L97j83L4j38mk56J79j12j72JJ12o3o1j63K54p1n4k7
3447b54J86j14j02K35J85r1L65j61J5k33M23m49M31m32L0J36k61p2r6M5Q9M3k5
3470a07nlj87K4L75j96j9K55K19qO0k28j61L14m6n0J1j94N0K3j47l09O9K8K50
3495A8l45P1j8K23l3j08NJ52L45l62L39p3j0m1n2M7qj32K03j91j27m7l3m10L76
3520b11q2n4o2J31J82L8Mk53L54L84j27k07J06L0J72j47q8J15n1k41O1R5l93k1
3544b65nr4L88n68K65j95K02J23k30K64J17k15M39j68J05M8j19L19p8n2k06P9
3566A54k62K20Q6k88L7j34N1j16P2k30J18J74r9P1O9O9J97l1K04k38k7K15lk11
3590I8K61K3j30L6l50K14j56K0l70j9J83j28l20M79R0J54j36k5K1MK17q7J22j15
$$ plain form
3614 86 415 313 398 185 260 189 116 98 93 -139 -54 -495 -104 -106 -283 -400 -484 -250 -72 40 -59 -111 -218 -370 68
3639 68 33 374 331 300 125 225 108 184 154 150 114 -85 129 -197 -211 -237 -212 -436 -479 -16 -318 48 -399 -85
3663 -85 193 121 71 41 154 79 284 474 251 -56 209 4 -47 -21 -69 -33 -258 -33 -208 -30 -270 -151 -198
3686 -198 -319 -197 128 14 -101 188 287 356 199 131 175 292 307 -47 202 284 -316 -118 95 -242 -210 -220 -198
3709 -198 -305 -62 -202 -105 -176 -117 -14 71 363 194 258 -10 311 416 297 100 310 78 83 298 -107 98
3731 98 -186 -204 -261 -246 -112 -359 59 -355 -353 -189 -125 46 41 20 24 228 400 320 298 285 -61 248 147 286 1
3756 1 20 248 -265 6 -124 -261 -245 -31 -402 -165 -30 -243 -408 -208 -135 148 -94 0 155 150 307 495 51
3779 51 266 139 -172 372 14 289 -11 -329 -381 -170 -136 -278 -122 -267 -280 -348 18 -196 137 -31 -191 43
$$ packed form
3614H6L29j02Q5k13P5p1p3j8nk32Q5m41L91kj77j17q4K34J78J12r9n2j07j52M38
3639F8l5L41m3l1j75J00j17P6l0ml6j99K14l26j4k6K5k24m3M63l02L66m47L14
3663h5K78p2n0l0J13p5K05J90k23l07K65k05n1K6m8L6k25K25j75J78k40J19m7
3686a98j21J22L25j14j15K89R9O9j57o8M4J17J5l54K49Q2o00J98K13l37L2j0K2
3709a98j07K43j40R7p1N9J03Q5K92j69O4k68L21J05j19j97K10k32NK15m05K05
3731I8k84j8n7J5J34k47M18m14KJ64O4J71nk1MK04J72q0k2j3l46L09j01J39k85
3756AJ9K28n13K71j30j37J6K14l71K37J35k13j65K00P3K83k42R4J55nJ57J88m44
3779E1K15j27l11N44l58K75l00l18n2K11L4j42J56j45j3o8L66k14L33j68j60K34
$$ plain form
3801 43 32 -59 389 82 117 336 159 -10 308 92 -197 -133 -182 -79 -107 -503 -286 -131 -174 50 -294 -27 213
3824 213 138 105 194 247 22 101 62 217 266 321 222 296 195 76 -34 -99 21 -281 -77 -174 -417 19 -128 127
3848 127 31 -52 -65 217 55 136 156 132 293 243 62 173 304 -43 -216 124 130 -12 -68 -84 -198 -87 -236 -99
3872 -99 45 -184 -43 75 79 35 154 119 90 489 -55 274 162 -39 295 136 2 -11 178 62 76 -354 -415
3895 -415 -119 -345 -333 152 108 -408 -302 241 -106 14 111 41 216 361 107 112 243 69 260 255 213 -22 -98
3918 -98 -227 -24 -146 -303 -256 -181 -319 -40 -130 -187 -119 -63 120 -41 -39 -33 428 367 214 364 391 298 262 253 89 -32
3944 -32 43 -238 -115 -118 -46 -216 -191 -178 -21 -109 -137 -243 -254 -160 271 57 -56 177 138 226 8 251 215 -174 122
3969 122 192 151 55 226 135 16 -26 -309 -193 -110 -165 -178 -427 -163 -207 -125 -163 23 76 105 424 10 244 131
$$ packed form
3801D3j1r1M48l07L5K19j77j69L18k16k89O4m9J03k8l96K17J55m3K24l44K67K40
3824B13p5l3Q9N3k25P9l9J55M9N5r9P4j01j19j10o5J20l02K04r7k43M36j47K55
3848A27r6q3j3K82j62Q1K0k4J61n0j81J11J31l47j73L40Oj42n6j6j14J11j49J37
3872i9J44k29J41J18Mm4J19l5k9L99n44L29j12k01L34j59j34j3J89j16J4m30o1
3895d15K96k26J2M85m4n16J06N43l47J20R7p0J75J45k54NJ31j74J91nm2k35p6
3918i8j29K03j22j57M7P5j38K79r0n7O8N6J83j61KOM61o1j53J50K7r3l6rj64j21
3944c2P5k81J23lP2j70K5J3J57q8k8j06j1R4M31k14j13K33l9Q8k18K43l6l89K96
3969A22P0m1r6J71r1j19m2k83J16Q3n5j3k49K64m4Q2l8J86N3K9L19m14K34j13
$$ plain form
3993 131 66 5 151 150 194 -31 380 -80 -345 -308 -298 -138 -232 173 -248 -157 -111 -142 10 42 100 135 386 285 189
4018 189 195 397 31 186 215 146 49 -136 58 153 -113 -172 -118 -142 -95 6 -138 -157 0 178 275 282 106 3 170
4043 170 127 73 79 -2 222 17 369 99 32 -205 -372 -124 48 -258 -205 -146 -309 -26 -181 -87 -158 -206 151 165
4067 165 146 112 242 312 383 71 51 180 -40 226 -85 -161 -252 14 -64 -215 -60 -94 -377 -509 -218 -253 -142
4090 -142 114 13 -224 277 129 158 158 279 44 494 175 138 353 198 -282 82 -92 -267 -271 -400 -498 -82
4112 -82 -239 -80 -60 -359 -89 -50 -34 -92 45 -68 137 9 245 195 174 37 -25 285 6 6 -177 -19 177
4135 177 -8 -95 -389 -217 -186 -136 -127 -394 -104 -39 217 115 176 122 100 244 100 229 367 168 180 45 138 -71
4159 -71 112 -169 115 -3 -119 127 -29 197 -198 -224 -192 -108 -34 84 17 -20 140 268 347 48 311 272 160
$$ packed form
3993A31o5o1J46jM4k25M11m60k65L7J0J60r4M05m21R1M6l1J52L2N8L5K51j01r6
4018A89OK02l66J55K9o9r7j85J94R5k66n9N4k4M7J01j44j9J57J78R7Pj76j03J67
4043A70m3n4Oq1K24k05L52k70o7k37j67K48J72l06N3N9j63K83j55R4p1m8L57J4
4067A65j9l4J30P0P1l12k0J29k20K66l11p6r1K66p8j51J55l4k83j32K91l5J11
4090a42K56j01k37N01j48K9%J21k35M50l19l7K15j55m80L64j74j75mj29r8M16
4112h2j57J59K0k99K70L9J6n8J37j13K05j28K36n0k1j37o2L10k79%j83J58J96
4135A77j85q7k94J72L1N0Rk67K90O5K56j02O1n4k2J44j44J29J38j99J2j35R3k09
4159g1J83k81K84j18j16K46j56K26l95k6L2Q4P4J18o7l7J60J28P9k99K63l9j12
$$ plain form
4182 160 292 7 293 -82 68 177 71 50 -22 1 -158 -124 14 -66 -153 -91 -55 -144 -61 -58 129 -119 37 -125
4206 -125 74 299 339 175 11 357 91 -260 15 -48 -21 4 -44 -254 -89 -252 -150 28 -179 -214 -238 175
4228 175 -194 -106 58 212 266 205 353 234 -126 -231 116 130 -23 -114 -335 -78 -282 -98 -87 -246 -199 -276 -77
4251 -77 258 -185 -131 4 29 118 197 16 -48 166 -10 101 336 311 236 -27 -100 -186 -39 -103 -435 -312 0 -191
4275 -191 -137 -49 4 -81 -32 212 81 168 198 365 174 282 83 306 204 116 236 227 -29 -30 72 43 -179 6
4299 6 -110 -169 -176 -11 -274 -283 -66 -164 54 106 79 254 41 204 56 270 231 422 40 -44 172 -174 84 -70
4323 -70 -148 -183 -163 -175 -207 -139 -259 -316 -211 92 134 199 71 -27 -221 32 195 -87 206 -3 155 178 -87 125
4347 125 236 -53 -32 -94 -247 -216 -166 -277 87 -227 -426 114 -6 -258 69 -88 72 34 173 293 299 240 67
$$ packed form
4182A60J32k85K86l75J50J09j06k1p2K3j59L4J38q0q7O2L6q9Q3LJ87k48J56j62
4206a25J99K25M0j64j64L46k66l51K75o3K7K5m8k10J65j63J02J78k07l5k4M13
4228A75l69Q8J64J54N4o1J48j19l60j05L47J4j53r1k21K57k04J84J1j59M7p7J99
4251g7L35m43N4J35K5Q9P9j81o4K14j76J11K35k5p5k63p3q6J47o4l32J23L12j91
4275a91N4Q8N3q5M9K44j31Q7L0J67j91J08j99K23j02q8J20rk56jJ02k9k22J85
4299Fj16n9pJ65k63rK17r8K18N2k7J75k13J63j48K14l9J91l82q4K16l46K58j54
4323g0p8l5K0j2l2O8j20n7J05L03M2O5j28r8j94K53J63k82K93k09J58K3k65K12
4347A25J11k89K1o2j53L1N0j11L64l14j99N40j20k52L27j57J60l8J39J20On9j73
$$ plain form
4370 67 166 92 387 73 46 12 -62 -107 -26 183 -75 22 13 -90 -204 -196 99 -59 64 121 -91 -5 -55 229 47
4395 47 83 124 12 188 121 -79 -35 162 137 -101 -86 -110 -16 -57 -314 -9 -126 -107 23 76 -86 114 -28 -76
4419 -76 295 520 273 260 194 107 19 111 12 -111 -11 -283 -222 -145 -297 -37 0 -311 -130 -165 38 3 162 -83
4443 -83 108 114 65 41 158 -47 -87 149 -196 145 -13 -10 -55 -67 -91 -345 -441 -271 -164 -89 -213 -201 -142 -263 282
4468 282 146 134 28 260 109 322 5 106 148 181 268 -14 -212 24 169 -60 -278 -79 -177 -412 -6 -9
4490 -9 78 -45 -43 -302 128 88 -8 -67 -29 73 97 87 380 171 118 299 100 -120 116 -225 161 -247 -194 -226 -254
4515 -254 -391 -221 -102 131 -32 -11 -23 81 288 -26 288 309 15 302 15 156 171 276 37 104 267 58
4537 58 -135 8 -66 -146 -80 -48 -15 49 54 -106 -310 -193 -1 -136 5 351 83 77 -40 112 163 310 118 198
$$ packed form
4370F7R9p4K95l14k7l4p4m5Q1K09k58R7rj03j14QK95j58J23N7k12Q6n0K84j82
4395D7L6M1j12J76o7k00M4J97k5k38J5k4R4m1k57L05j17J9J30N3j62K00j42m8
4419g6L71K25k47j3o6q7q8R2r9j23J00k72O1P7j52K60L7l11J81l5K03l5J59k45
4443h3J91Om9k4J17k05m0K36l45L41j58Lm5j2k4k54r6J70J07P5j24J2N9j21N45
4468B82j36j2j06K32j51K13l17J01M2L3Q7k82j98K36J45k29k18J99r8k35M06l
4490iQ7j23Kk59M30m0r6n9L8J02K4j0K93k09n3J81j99k20K36l41L86m08N3l2k8
4515b54j37J70J19K33j63K1j2J04K07l14L14K1k94K87k87J41J5J05k39O7J63k09
4537E8j93J43p4q0O6L2L3O4Nj60k04J17J92j35J41L46k68oj17J52N1J47j92Q0
$$ plain form
4561 198 19 236 -74 9 -124 -140 153 75 -171 -190 -347 -328 8 43 109 -181 -62 72 264 -132 -11 124
4583 124 138 324 6 315 57 -65 -136 -147 243 -49 -54 -131 -32 -165 141 -54 -10 -10 116 65 136 -113 76 16
4607 16 284 284 106 59 61 299 140 92 78 198 5 -132 12 -37 -137 -95 -122 -101 -202 -130 50 -70 -11 -23 181
4632 181 -104 111 83 58 16 -26 27 155 3 -52 37 -28 -162 -180 -180 -70 -297 -183 -121 -109 45 117 151 -77 -101
4657 -101 41 -104 135 161 119 101 43 175 303 232 -22 -149 -115 185 -103 -190 -249 -12 -57 -223 -113 -171 -154 -139
4681 -139 -205 -124 22 134 406 -35 -141 139 156 267 109 20 187 89 137 12 2 -202 -275 348 107 34 -415
4704 -415 -347 20 -138 -94 -357 0 132 55 172 167 365 78 178 11 -79 -164 95 -5 -90 -132 -130 207 -39 -274
4728 -274 64 -265 -301 -515 27 -316 96 -13 -188 163 57 151 170 22 116 -68 113 350 52 141 -36 -62
$$ packed form
4561A98j79K17l10Q3j33j6K93p8k46j9j57J9L36L5O6k90J19J34J92l96J21J35
4583A24J4J86l18L09k58j22p1j1L90k92np7R9j33L06j95M4%J26n1P1k49J89o0
4607A6K68%j78m7KK38j59m8j4J20j93j37J44m9j00M2k7K1j01P2J80j20N9j2K04
4632A81k85K15k8k5m2m2N3J28j52n5Q9o5j34j8%J10k27J14O2J2J54P2L4k28k4
4657a01J42j45K39K6m2j8n8J32J28p1k54j27L4L00k88q7n9K37m5j66J10n8J7J5
4681a39o6Q1J46J12K72m41j06K80J7J11j58q9J67r8M8j25j0k04p3O23k41p3m49
4704d15O8L67j58M4k63L57J32p7J17nJ98k87J00j67r0q5K59j00q5m2KL37k46k35
4728b74L38l29l6k14N42l43M12j09j75L51j06R4J9j48R4j84J81K37k98Q9j77k6
$$ plain form
4750 -62 -160 133 -258 -46 -106 -36 -184 -235 -254 -14 191 -47 -11 166 284 -22 41 53 4 286 201 277 63 -14
4774 -14 84 55 20 -147 -85 -47 -378 151 -90 -145 -93 -15 91 40 11 143 44 -50 146 143 96 -93 -144 282 267 215
4800 215 -60 -236 215 23 -208 -39 -50 -154 -279 -224 42 -75 226 -170 -107 119 -13 -220 202 62 82
4821 82 86 190 176 -84 281 162 257 36 1 -185 -487 120 -95 -57 -383 -348 -40 -78 -215 -74 84 -378 -108
4844 -108 92 137 316 27 68 253 188 222 -7 -7 -170 100 -42 73 -48 -183 -153 -165 -157 -128 -223 -144 -316 -303 -112
4869 -112 135 33 32 169 213 129 231 234 48 163 168 140 17 -159 -54 253 -81 -263 176 -52 -42 -142 -128 -140
4893 -140 -76 -206 -84 -17 -84 185 171 81 94 64 -54 57 218 184 -46 -126 146 104 -87 -145 -80 -214 -414 -35
4917 -35 -236 -91 -134 -124 -224 -30 -35 -10 146 -11 97 178 79 -66 -8 108 101 174 252 111 172 -79 11 -109 -67
$$ packed form
4750f2r8K93l91K12o0P0j48n1j9K40K05k38L6J77J18l06O3J2m9K82q5P6k14p7
4774a4R8k9l5j67O2L8l31N29k41n5N2P8J06n1k9J32r9r4J96lm7j89n1M26j5n2
4800B15k75j76M51j92k31J69j1j04j25N5K66j17L01l96O3K26j32k07M22j40K0
4821H2MJ04j4k60L65j19R5k21l5j86l02O07k15L8l26L5L08l8j37J41J58m62K70
4844a08K00M5J79k89M1J85o5L4k29%j63K70j42J15j21j35L0j2QK9r5P9j72J3J91
4869a12K47j02jJ37M4q4J02Lj86J15Nk8j23j76J05L07l34j82M39k28J0j00J4j2
4893a40O4j30J22O7o7K69j4r0J3l0j18J11J61l4k30q0K72m2j91n8O5j34k00L79
4917c5k01J45m3J0j00J94nK5J56j57J08Q1r9j45N8J16pP3P8j41O1k51R0j20M2
$$ plain form
4942 -67 -278 -48 16 -121 -257 -258 -166 54 10 -69 0 20 2 -158 230 6 409 26 378 48 -42 82 178 113
4966 113 114 102 -178 -172 -134 -71 -175 14 -134 155 -110 121 -198 47 -103 31 -187 -25 98 -68 143 134 252
4989 252 29 -10 -84 -94 -86 -176 -193 -25 -119 31 86 -93 -456 64 203 92 24 -29 185 245 95 334 6 177
5013 177 333 351 171 212 -88 96 -2 -169 -117 -58 -144 -262 154 -294 -53 88 -79 50 -129 -168 -3 -61 115
5036 115 -1 168 -111 330 114 -88 -58 78 141 -101 70 104 -136 -145 57 -66 102 1 -9 -49 37 -12 -236
5059 -236 324 28 67 85 74 221 144 11 160 -85 -74 182 137 5 -101 77 -89 -52 145 -46 -288 -130
5081 -130 -128 -308 -212 -109 -28 102 2 124 189 -84 78 155 289 51 97 28 -267 62 36 -74 128 -281 -145
5104 -145 -65 -135 -161 -74 148 35 -125 -164 152 175 90 50 160 -184 208 168 258 205 -182 -167 110 -162 -114 -181 -39
$$ packed form
4942f7k11K30O4j37j36jR2K20m4p9O9K0j8j60L88k24M03l83L52l30r0J24R6o5
4966A13Jj2k80OL8O3j04J89j48K89k65K31l19K45j50J34k18J62J23j66K11rJ18
4989B52k23l9p4j0Qr0j7J68r4J50N5j79l63N20J39j11o8n3K14O0j50K39l28J71
5013A77J56J8j80M1l00J84r8j67N2N9q6j18M16m48K41J41j67J29j79l9J65n8J76
5036A15j16J69k79M41k16k02L0J36O3k42J71L4k40rK02j23J68j01j0m0Q6m9k24
5059b36N60k96L9J8j1J47p7j33J49k45J1K56m5j32j06J78j66L7J97j91k42J58
5081a30Kj80R6J03Q1J30j00J22O5k73J62P7J34k38M6o9k95L29k6j10K02m09J36
5104a45Q0p0k6Q7K22j13j60l9L16K3q5m0J10l44L92m0R0n3l87J5K77k72M8o7J42
$$ plain form
5129 -39 -133 6 -149 -238 -117 -167 -43 -191 -170 -33 175 227 16 36 162 55 43 148 60 -265 187 -162 85
5152 85 -83 114 -56 -140 26 -48 -75 -95 -319 -236 -70 -66 90 121 74 18 253 -111 -70 139 166 203 282 97 -125
5177 -125 79 221 -166 186 44 -324 30 -41 -178 -293 -150 -95 32 -302 -96 53 69 -10 -83 153 241 173
5199 173 67 66 245 3 -28 -53 155 212 -199 -29 79 -259 -472 -78 -110 -36 69 8 -16 98 170 -76 212
5222 212 350 30 212 -13 40 288 154 120 13 83 148 -136 -58 -255 -283 135 119 -205 -190 -207 -201 71 -45 144
5246 144 18 249 29 187 139 427 29 84 204 153 26 268 213 -144 -104 -178 -14 -87 -237 -100 41 -255
5268 -255 -226 -200 -17 -244 150 -31 -9 369 79 -55 41 247 -10 194 92 436 74 47 46 -273 -221 -226 -57
5291 -57 -205 -204 -187 -83 64 16 -78 -35 -49 -169 232 -23 101 122 -53 84 59 169 19 177 15 111 -47 251
$$ packed form
5129c9r4J39j55q9J21n0J24j48K1J37K08N2k11K0J26j07j2J05q8l25M52l49K47
5152H5j68J97j70q4J66p4k7k0k24Q3J66MJ56L1m7n6K35l64M1K09K7L7P9j85k22
5177a25K04J42l87L52j42l68L54p1j37j15J43N5J27l34K06J49J6p9p3K36Q8o8
5199A73j06jJ79k42l1k5K08N7m11J70J08l38k13L94l2P4J05o1k4J14P2k46K88
5222B12J38l20J82k25N3K48j34l4j07P0O5k84P8j97k8M18j6l24J5j7OK72j16J89
5246A44j26K31k20J58m8K88l98N5J20n1j27K42n5l57M0p4J64p3j50J37J41k96
5268b55K9K6J83k27L94j81K2L78k90j34R6K06k57K04j02L44l62k7jl19N2nJ69
5291e7j48JJ7J04J47m8r4M3j4j20M01k55J24K1j75J37k5J10j50J58j62R6j58K98
$$ plain form
5315 251 -244 -148 147 -41 -107 -124 -65 -4 -14 22 52 97 318 141 35 59 44 102 146 47 -144 81 -90 39 45
5340 45 -151 -27 92 -130 -93 -134 -201 -267 -201 5 240 -199 -54 -64 -196 44 14 49 267 115 25 220 -126
5363 -126 214 363 -22 -152 58 -101 -218 -175 40 82 -201 73 -58 -20 220 138 -24 27 25 106 -51 -40 292
5386 292 119 309 66 89 112 87 116 -92 220 -131 -19 56 -211 -477 -145 -232 -77 3 -142 -104 -76 62 117
5409 117 98 -162 152 220 303 405 174 275 -12 -155 -38 -1 44 -56 -12 -206 -375 -295 -66 2 -173 -54 -78
5432 -78 -256 -10 -214 -84 -58 210 11 164 312 66 232 6 201 -112 125 -54 83 -235 11 -157 90
5453 90 17 -111 -27 -129 -203 -109 -171 236 132 172 33 221 114 282 -69 -192 -102 -6 133 112 -157 -34 -6 -228
5477 -228 66 59 47 -35 -3 -58 -151 -63 158 -60 8 299 -90 84 256 23 34 36 -5 22 343 -10 173 95 -91
$$ packed form
5315B51m95R6K95j88o6j7N9O1j0L6L0M5K21j77j06K4j5N8M4r9j91K25j71J29O
5340D5j96J24J19k22L7m1o7o6O6K06K35m39J45j0j32K40l0L5K18j52r0J95l46
5363a26L40J49l85j30K10j59j17M3K15M2k83K74j31L8K40q2j62N1kQ1j57J1L32
5386B92j73J90k43K3K3k5K9k08L12l51J12P5k67k66L32q7J55Q0j45L8K8J38N5
5409A17j9k60L14O8Q3J02k31J01k87j43J17L7M5j00M4j94j69Q0K29O8j75J19k4
5432g8j78K46k04J30K6K68j99J53J48k46J66k26J95l13K37j79J37l18K46j68K47
5453I0p3j28Q4j02p4R4o2M07j04M0j39J88j07J68l51j23R0R6J39k1k69J23K8k22
5477b28K94pj2q2L2n5r3Q8K21k18O8K91l89J74J72k33J1Km1K7L21l53J83p8j86
$$ plain form
5502 -91 -219 -70 -185 -112 -65 47 -132 -181 -227 296 -181 17 176 18 19 62 177 -261 199 33 -89 -49 42
5525 42 154 46 -111 -196 -14 58 -50 -98 99 -158 142 91 -25 70 24 -122 241 -123 156 223 170 222 272 61
5549 61 183 156 45 225 -227 -148 -171 32 -5 -317 -51 11 -132 94 -59 175 39 -45 30 160 42 108 131
5572 131 121 206 81 215 -4 -9 -7 144 104 -183 -161 -305 -51 -88 -66 -132 -10 68 -273 138 -65 283 49 140
5596 140 -114 49 175 448 151 97 19 -149 71 -111 -64 45 -198 -66 -32 55 -68 -162 -86 -385 -53 -33 -116
5619 -116 -47 -14 -55 -77 67 19 230 124 97 156 -169 -49 -103 -92 118 -94 -379 -13 -263 -96 -231 68 26
5642 26 -125 -20 -44 -38 -120 72 203 -38 -59 104 119 174 258 221 221 245 -149 175 -134 50 -27 389 -101 -220 -134
5667 -134 -127 -82 3 -239 257 -110 -56 18 -55 -12 -103 244 315 65 -132 287 -56 54 298 -112 24 81 -148 -60
$$ packed form
5502i1j28J49j15P3M7J12j79m9m6N23m77J98J59j58JM3J15m38M60j66j22M0R1
5525D2J12j08j57q5J82P2j08m8J97k57L00n1j16R5m6j46L63l64K79O7n3N2N0k11
5549F1J22k7j11J80m52P9k3K03l7l12K66O2j43K26j53K34j36q4P5J30j18O6K3
5572A31j0Q5j25J34k19nKJ51m0k87K2j44K54l7K2o6J22P8l41M11k03L48k34R1
5596A40k54J63J26K73k97n4p8j68K20j82M7J09k43J32L4Q7j23r4P6k99L32K0q3
5619a16O9L3m1k2J44m8K11j06k7N9l25J20n4J1K10k12k85L66k50J67j35K99m2
5642B6j51J05k4Oq2J92J31k41k1J63J5N5Q4l7%K4l94L24l09J84p7M16m90j19Q6
5667a34PM5Q5k42M96l67N4P4p3M3r1L47P1k50j97M19l43J10K44m10J36N7k29Q8
$$ plain form
5691 -60 -49 28 -224 -148 -152 -89 -27 -38 430 -52 -124 -176 274 209 242 -121 300 359 77 12 215 131 -26 4 91 -42
5717 -42 -45 28 141 -215 52 69 -205 -65 42 75 -186 -73 29 203 77 78 169 187 21 221 63 -5 23 -156
5741 -156 -38 10 6 25 -76 168 -128 39 131 73 -134 -135 -180 58 -23 211 16 159 50 -19 126 -69 -41 369
5765 369 -134 85 -155 -242 -233 39 -17 -206 -50 -210 8 21 -160 -276 -12 154 -95 73 8 76 112 174 136
5788 136 94 -57 177 2 -16 205 131 313 -296 -122 -121 -237 -147 -71 -417 -36 -121 -163 -54 -27 184 200 362 58
5812 58 7 125 -65 8 410 261 27 27 71 139 -70 -274 -6 -29 -68 -9 -36 131 78 51 30 108 149 -60 26 255
$$ packed form
5691f0J1P7k52P6mO3O2j1M68m82p2n2M50o5L3l63M21N9k82o5K03q4j57L0Q7j33
5717d2lP3J13l56K67J7k74J40J07L3k61J13J02J74j26JR1J8j66K00j58o8K8j79
5741a56J18M8mJ9j01K44k96J67R2n8k07jm5K38q1K34j95J43j09o9J45j95K8M10
5765C69n03K19k40q7RK72n6j89J56j60K18J3j81j16K64J66k49J68o5O8L6O2l8
5788A36m2j51K34j75j8K21p4J82o09J74Jj16R0P6l46L81q5m2J09K7K11J6J62l04
5812E8n1J18j90P3M02j49k34%M4O8k09k04K68k3l9N9k7J67n3k7k1P8M1k09Q6K29
$$ [...]
8191B55
##END NTUPLES=NMR FID
##END=
