##TITLE=1H_SL31(SL30-mCPBA)-f9
 CDCl3
 8 sc, 
 7.12.2021
##JCAMPDX= 6.0         $$ Bruker NMR JCAMP-DX V2.0
##DATA TYPE= NMR FID
##DATA CLASS= NTUPLES
##ORIGIN= UXNMR, Bruker Analytische Messtechnik GmbH
##OWNER= root
$$ XWIN-NMR		Version 3.5
$$ Tue Dec  7 13:37:45 2021 Russian Standard Time (UT+4h)  she@DPX200
##.OBSERVE FREQUENCY= 200.131346
##.OBSERVE NUCLEUS= ^1H
##.DELAY= (6, 6)
##.ACQUISITION MODE= SIMULTANEOUS
##.ACQUISITION SCHEME= undefined
##.AVERAGES= 8
##.DIGITISER RES= 18
##SPECTROMETER/DATA SYSTEM= spect
##.PULSE SEQUENCE= zg30
##.SOLVENT NAME= CDCl3
##.SHIFT REFERENCE= (INTERNAL, CDCl3, 0, 15.7039)
##AUDIT TRAIL= $$ (NUMBER, WHEN, WHO, WHERE, WHAT)
$$ ##TITLE= Audit trail, XWIN-NMR		Version 3.5
$$ ##JCAMPDX= 5.01
$$ ##ORIGIN= Bruker BioSpin GmbH
$$ ##OWNER= she
$$ F:/spectra/data/she/nmr/H-F/1/audita.txt
$$ ##AUDIT TRAIL=  $$ (NUMBER, WHEN, WHO, WHERE, WHAT)
(   1,<2021-12-07 13:35:55.59 +0400>,<she>,<DPX200>,
      <created by zg, POWCHK disabled, PULCHK disabled
       configuration hash MD5:
       00 E9 B6 7A A2 85 ED C7 34 08 36 98 17 FE 4E 26
       data hash MD5: 16K
       D9 8C 41 BB F3 BD 10 E5 5D 95 FD E0 85 CB 12 36>)
$$ ##END=
$$ 
$$ hash MD5
$$ 12 01 6F 4E D2 75 DB 14 FD 0E FA D6 C3 8A 89 EF
##$RELAX= 
##$RELAX= 
##$RELAX= 
##$RELAX= 
##$RELAX= 
##$RELAX= 
$$ Bruker specific parameters
$$ --------------------------
##$DU= <F:/spectra>
##$EXPNO= 1
##$NAME= <H-F>
##$PROCNO= 1
##$TYPE= <nmr>
##$USER= <she>
##$AMP= (0..31)
100 100 100 100 100 100 100 100 100 100 100 100 100 100 100 100 100 100 
100 100 100 100 100 100 100 100 100 100 100 100 100 100 
##$AQSEQ= 0
##$AQ_mod= 1
##$AUNM= <au_zg>
##$AUTOPOS= <>
##$BF1= 200.13
##$BF2= 200.13
##$BF3= 200.13
##$BF4= 200.13
##$BF5= 200.13
##$BF6= 200.13
##$BF7= 200.13
##$BF8= 200.13
##$BYTORDA= 1
##$CFDGTYP= 0
##$CFRGTYP= 5
##$CHEMSTR= <none>
##$CNST= (0..31)
1 1 145 1 1 1 1 1 1 1 1 1 1 1 1 1 1 1 1 1 1 1 1 1 1 1 1 1 1 1 1 1 
##$CPDPRG= <>
##$CPDPRG1= <>
##$CPDPRG2= <>
##$CPDPRG3= <>
##$CPDPRG4= <mlev>
##$CPDPRG5= <mlev>
##$CPDPRG6= <mlev>
##$CPDPRG7= <mlev>
##$CPDPRG8= <mlev>
##$CPDPRGB= <>
##$CPDPRGT= <>
##$D= (0..31)
0 1.2 0 0 0 0 0 0 0 0.06 0 0.03 0 0 0 0 0.0002 0 0 0 0 0 0 0 0 0 0 0 0 
0 0 0 
##$DATE= 1638869755
##$DBL= (0..7)
120 120 120 120 120 120 120 120 
##$DBP= (0..7)
150 150 150 150 150 150 150 150 
##$DBP07= 0
##$DBPNAM0= <>
##$DBPNAM1= <>
##$DBPNAM2= <>
##$DBPNAM3= <>
##$DBPNAM4= <>
##$DBPNAM5= <>
##$DBPNAM6= <>
##$DBPNAM7= <>
##$DBPOAL= (0..7)
0.5 0.5 0.5 0.5 0.5 0.5 0.5 0.5 
##$DBPOFFS= (0..7)
0 0 0 0 0 0 0 0 
##$DE= 6
##$DECBNUC= <off>
##$DECIM= 32
##$DECNUC= <off>
##$DECSTAT= 4
##$DIGMOD= 1
##$DIGTYP= 9
##$DL= (0..7)
0 120 120 120 120 120 120 120 
##$DP= (0..7)
150 150 150 150 150 150 150 150 
##$DP07= 0
##$DPNAME0= <>
##$DPNAME1= <>
##$DPNAME2= <>
##$DPNAME3= <>
##$DPNAME4= <>
##$DPNAME5= <>
##$DPNAME6= <>
##$DPNAME7= <>
##$DPOAL= (0..7)
0.5 0.5 0.5 0.5 0.5 0.5 0.5 0.5 
##$DPOFFS= (0..7)
0 0 0 0 0 0 0 0 
##$DQDMODE= 0
##$DR= 18
##$DS= 0
$$ [...]
##$SUBNAM2= <"">
##$SUBNAM3= <"">
##$SUBNAM4= <"">
##$SUBNAM5= <"">
##$SUBNAM6= <"">
##$SUBNAM7= <"">
##$SUBNAM8= <"">
##$SUBNAM9= <"">
##$SW= 18.0517287032376
##$SWIBOX= (0..15)
0 0 2 0 0 0 0 0 0 0 0 0 0 0 0 0 
##$SW_h= 3612.71676300578
##$TD= 16384
##$TD0= 1
##$TE= 0
##$TE2= 300
##$TE3= 300
##$TEG= 300
##$TL= (0..7)
0 120 120 120 120 120 120 120 
##$TP= (0..7)
150 150 150 150 150 150 150 150 
##$TP07= 0
##$TPNAME0= <>
##$TPNAME1= <>
##$TPNAME2= <>
##$TPNAME3= <>
##$TPNAME4= <>
##$TPNAME5= <>
##$TPNAME6= <>
##$TPNAME7= <>
##$TPOAL= (0..7)
0.5 0.5 0.5 0.5 0.5 0.5 0.5 0.5 
##$TPOFFS= (0..7)
0 0 0 0 0 0 0 0 
##$TUNHIN= 0
##$TUNHOUT= 0
##$TUNXOUT= 0
##$USERA1= <user>
##$USERA2= <user>
##$USERA3= <user>
##$USERA4= <user>
##$USERA5= <user>
##$V9= 5
##$VALIST= <valist>
##$VCLIST= <CCCCCCCCCCCCCCC>
##$VD= 0
##$VDLIST= <DDDDDDDDDDDDDDD>
##$VPLIST= <PPPPPPPPPPPPPPP>
##$VTLIST= <TTTTTTTTTTTTTTT>
##$WBST= 1024
##$WBSW= 4
##$XGAIN= (0..3)
0 0 0 0 
##$XL= 0
##$YL= 0
##$YMAX_a= 83797
##$YMIN_a= -106967
##$ZGOPTNS= <>
##$ZL1= 120
##$ZL2= 120
##$ZL3= 120
##$ZL4= 120
##$ABSF1= 10
##$ABSF2= 0
##$ABSG= 5
##$ABSL= 3
##$ALPHA= 0
##$AQORDER= 0
##$ASSFAC= 0
##$ASSFACI= 0
##$ASSFACX= 0
##$ASSWID= 0
##$AUNMP= <proc_1d>
##$AZFE= 0.1
##$AZFW= 0.1
##$BCFW= 1
##$BC_mod= 2
##$BYTORDP= 1
##$COROFFS= 0
##$CY= 11.3945322036743
##$DATMOD= 1
##$DC= 2
##$DFILT= <>
##$DTYPP= 0
##$F1P= 2.36226072786647
##$F2P= -0.459571619588291
##$FCOR= 0.5
##$FTSIZE= 0
##$FT_mod= 4
##$GAMMA= 1
##$GB= 0.15
##$INTBC= 1
##$INTSCL= 1
##$ISEN= 128
##$LB= 0.24
##$LEV0= 0
##$LPBIN= 0
##$MAXI= 10000
##$MC2= 0
##$MEAN= 0
##$ME_mod= 0
##$MI= 1.114404
##$NCOEF= 0
##$NC_proc= 0
##$NLEV= 6
##$NOISF1= 3.799351
##$NOISF2= 2.8
##$NSP= 1
##$NTH_PI= 0
##$NZP= 0
##$OFFSET= 15.70392
##$PC= 1
##$PHC0= -15513.67
##$PHC1= 12.6008
##$PH_mod= 1
##$PKNL= yes
##$PPARMOD= 0
##$PSCAL= 0
##$PSIGN= 0
##$REVERSE= no
##$SF= 200.130013532006
##$SI= 16384
##$SIGF1= 3
##$SIGF2= 2
##$SINO= 400
##$SIOLD= 16384
##$SREGLST= <1H.CDCl3>
##$SSB= 0
##$STSI= 0
##$STSR= 0
##$SW_p= 3612.71676300578
##$SYMM= 0
##$S_DEV= 0
##$TDeff= 0
##$TDoff= 0
##$TI= <>
##$TILT= no
##$TM1= 0
##$TM2= 0
##$TOPLEV= 0
##$USERP1= <user>
##$USERP2= <user>
##$USERP3= <user>
##$USERP4= <user>
##$USERP5= <user>
##$WDW= 1
##$XDIM= 8192
##$YMAX_p= 0
##$YMIN_p= 0
$$ End of Bruker specific parameters
$$ ---------------------------------
##NTUPLES= NMR FID
##VAR_NAME=  TIME,          FID/REAL,        FID/IMAG
##SYMBOL=    X,             R,               I
##VAR_TYPE=  INDEPENDENT,   DEPENDENT,       DEPENDENT
##VAR_FORM=  AFFN,          ASDF,            ASDF
##VAR_DIM=   8192,          8192,            8192
##UNITS=     SECONDS,       ARBITRARY UNITS, ARBITRARY UNITS
##FACTOR=    0.0002768,     1,               1
##FIRST=     0,             0,               0
##LAST=      2.2672688,     0,               0
##MIN=       0,             -106967,         0
##MAX=       2.2672688,     83797,           0
$$ Real data points
##PAGE= N=1
##DATA TABLE= (X++(R..R)), XYDATA
$$ plain form
0 0 0 0 0 0 0 0 0 0 0 0 0 0 0 0 -8 8 -8 8 -8 16 -16 16 -24 24 -32 36 -40 48 -56 64 -72 84 -95 108 -122 136
36 136 -154 172 -193 216 -241 266 -297 327 -363 400 -442 486 -537 590 -652 718 -791 872 -964
55 -964 1066 -1183 1318 -1473 1653 -1874 2140 -2476 2909 -3496 4336 -5658 8025 -13614 58697
70 58697 -7893 -62003 83797 23613 -55318 19185 43728 -46167 -14790 33429 -11722 -34880
82 -34880 -2934 -10725 -3869 7921 -15167 -16286 14063 -7005 -25970 -3049 -3626 -21565 442
95 442 14851 138 -2530 7563 7000 2569 -2336 2699 12002 4265 -951 12440 5433 -11294 -1014
110 -1014 1851 -13973 -2605 6720 -10860 -7457 5820 -5840 -1045 10997 -10454 -4348 31231
123 31231 11771 -12385 19702 18154 -17525 4819 20570 -19220 -14366 23951 6066 -12253
$$ packed form
0@%%%%%%%%%%%%%%qJ6j6J6j6K4l2L2m0M8n6O8p6Q8j04J20j36J56j79K03k30K58
36A36k90L26l65M09m57N07n63O24o90P63q42R28j023J127j242J370j509J663j836
55i64K030k249K501k791L126l527M014m616N385o405P832r994J3683k1639P2311
70E8697o6590n4110J45800o0184p8931P4503K4543q9895L1377M8219m5151k3158
82c4880L1946p791O856J1790k3088j119L0349k1068j8965K2921n77j7939K2007
95D42J4409j4713k668J0093n63m431m905N035R303p737n216J3391p007j6727J0280
110a014K865j5824J1368R325j7580L403J3277j1660M795J2042k1451O106L5579
123C1231j9460k4156L2087j548l5679K2344J5751l9790M854L8317j7885j8319
$$ plain form
135 -12253 4458 -1798 -7169 10500 -2804 -17380 7232 5218 -16537 3915 6152 -27809 -10585
148 -10585 19305 -10821 -21473 12352 5403 -13134 7727 5807 -18238 -872 15233 -4686
160 -4686 -5059 11485 1442 -6838 4377 1128 -8374 355 7970 3134 1070 6182 8747 3816 555
175 555 6057 6941 -264 4722 9097 -4697 -4245 9739 -4358 -18478 1060 6071 -12283 -4939
189 -4939 6913 -7468 -8136 6037 -451 -5747 3055 1990 4179 10375 -5441 -10539 11815 3723
203 3723 -18320 170 10588 -13178 -4660 16275 -5464 -15498 10355 6676 -11180 1014 3491
216 3491 -10127 -146 4439 -13235 -8234 7056 -2305 -4991 7658 3898 299 10237 8809 2325
230 2325 8060 8803 5304 9420 5706 -1169 4822 5459 -5357 -5846 -2079 -6178 -6429 -5624 -8919 -5389
$$ packed form
135a2253J6711o256n371J7669j3304j4576K4612k014k1755K0452K237l3961J7224
148a0585K9890l0126j0652L3825o949j8537K0861j920k4045J7366J6105j9919
160d686l73J6544j0043q280J1215l249r502Q729P615m836k064N112K565m931l261
175E55N502Q84p205M986M375j3794M52J3984j4097j4120J9538N011j8354P344
189d939J1852j4381o68J4173o488n296Q802j065K189O196j5816n098K2354q092
203C723k2043J8490J0418k3766Q518K0935k1739j0034K5853l679j7856J2194K477
216C491j3618R981M585j7674N001J5290r361k686J2649l760l599R938j428o484
230B325N735P43l499M116l714o875N991O37j0816m89L767m099k51Q05l295L530
$$ plain form
246 -5389 -1840 -5834 -3035 721 -3804 345 5770 -3080 -3618 4788 -1638 -3668 5934 -2694 -7230
261 -7230 11937 7697 -10745 4815 13814 -7680 -3323 11571 -7805 -12182 9692 -1700 -16911
274 -16911 2205 2932 -12495 1692 7550 -10478 220 15464 -1201 -2391 13304 4555 550
287 550 13512 3719 -4617 11102 5879 -9240 2667 4423 -12239 -2558 8003 -10253 -10593 7933
301 7933 234 -10105 1051 1801 -6021 -1211 1621 -6288 -5335 786 111 -3346 -3446 1724 3532 -1427
317 -1427 717 6205 -1355 -3035 9136 3319 -9347 2168 8561 -6145 -3433 5548 -5064 -3422
331 -3422 7602 -4175 -7052 9457 2252 -7598 10366 8290 -9255 6893 16314 -7818 -5431
344 -5431 12965 -2383 -10451 6263 -2090 -12601 5660 3805 -13329 1013 10372 -7474 -2806
$$ packed form
246e389L549l994K799L756m525M149N425q850n38Q406o426k030R602q628m536
261g230J9167m240j8442J5560Q999k1494M357J4894j9376m377K1874j1392j5211
274a6911J9116P27j5427J4187N858j8028J0698J5244j6665j190J5695q749m005
287E50J2962r793q336J5719n223j5119J1907J756j6662R681J0561j8256l40J8526
301G933p699j0339J1156P50p822M810K832p909R53O121o75l457j00N170J808m959
317a427K144N488p560j680J2171n817j2666J1515O393j4706K712Q981j0612J642
331c422J1024j1777k877J6509p205r850J7964k076j7545J6148R421k4132K387
344e431J8396j5348q068J6714q353j0511J8261j855j7134J4342R359j7846M668
$$ plain form
357 -2806 10894 -2866 -7936 8626 3541 -9855 -571 4282 -4216 -2184 717 -4556 -1985 2147
371 2147 -2760 -4609 67 740 -1973 -916 1458 717 -1407 857 4404 -1251 -4349 4013 4979 -3118
387 -3118 297 6084 1295 3025 7752 1069 1023 9134 2184 -4014 4779 367 -9019 541 1220 -12190
403 -12190 -5192 4831 -6743 -7050 4706 -2716 -4996 8163 1396 -8215 6583 8328 -6860 1485
417 1485 9522 -4504 -2946 9770 -1000 -7605 4965 2392 -7555 386 1607 -7698 -1242 3636
431 3636 -6554 -5814 3415 -1211 -5889 648 891 -1949 1553 3356 1332 2403 4381 5214 5231 4092
447 4092 3506 4375 3562 2257 687 -2222 -501 1479 -4705 -6487 315 -2120 -7374 -1006 695 -6592
463 -6592 -1699 3924 -3756 -2804 4604 -1086 -2501 5884 -507 -6066 5922 5079 -7270 664 7517
$$ packed form
357b806J3700j3760n070J6562n085j3396R284M853q498K032K901n273K571M132
371B147m907j849M676O73k713J057K374p41k124K264L547n655l098Q362R66q097
387c118L415N787m789J730M727o683m6Q111o950o198Q793m412r386R560O79j3410
403a2190O998J0023j1574l07J1756p422k280J3159o767r611J4798J745j5188Q345
417A485Q037j4026J558J2716j0770o605J2570k573r947P941J221r305O456M878
431C636j0190P40R229m626m678O537K43k840L502J803k024J071J978Q33J7j139
447D092n86Q69q13j305j570k909J721J980o184j782O802k435n254O368J701p287
463f592M893N623p680R52P408n690j415Q385o391n559J1988q43j2349P934O853
$$ plain form
478 7517 -3485 -1401 7070 -1612 -3553 5859 -288 -6016 3036 31 -7055 1863 2215 -8760 -2006
493 -2006 6373 -3275 -4082 4604 827 -1324 4669 1327 -1250 5460 2942 -1787 4714 4296 -3810 1296
509 1296 5291 -3331 -5217 1918 33 -4149 -1364 69 -549 -64 -682 -114 682 -937 -213 1249 -2029
526 -2029 -2900 -8 -2414 -2858 556 -2213 -2907 3781 1553 -4314 2732 4975 -2974 69 4359 -2509
542 -2509 -692 5572 -1120 -3248 4947 505 -4820 4606 3053 -6115 2727 6754 -5023 -2179 6414
557 6414 -1628 -3357 5286 -391 -5591 4040 1745 -7621 -70 3091 -6503 -2918 4582 -1789 -2839
572 -2839 5966 3750 -1961 2119 3302 220 1514 1398 -850 71 359 -1890 -2128 -1582 -1740 -1069 -1437
589 -1437 -1917 -597 -1466 -2572 -119 -1253 -3950 -435 1943 -931 794 2792 746 2617 4448 -582
$$ packed form
478G517j1002K084Q471q682j941R412o147n728R052l005p086Q918L52j0975O754
493b006Q379r648q07Q686l777k151N993l342k577O710k518m729O501m18q106N106
509A296L995q622j886P135j885m182K785J433o18M85o18N68P96j619P24J462l278
526b029q71K892k406m44L414k769o94O688k228n867P046K243p949L043M290o868
542b509J817O264o692k128Q195m442n325R426j553r168Q842M027j1777K844Q593
557F414q042j729Q643n677n200R631k295r366P551L161r594L585P500o371j050
572b839Q805k216n711M080J183l082J294j16k248R21K88k249k38N46j58O71l68
589a437m80J320q69j106K453j134k697L515K378k874J725J998k046J871J831n030
$$ plain form
605 -582 1636 7791 2158 -1108 6503 3038 -4759 1764 3994 -5733 -3121 3089 -4086 -5693 590
620 590 -4144 -6402 2179 -1115 -7117 2494 5435 -3542 275 6869 -565 -1756 5269 2457 -732
635 -732 3252 2692 -369 1476 -375 -2673 994 1174 -4162 -1430 1739 -2593 -3886 -298 -1208 -3749
651 -3749 -1426 212 -583 -1020 524 2023 994 74 1754 2124 1259 3544 3498 -453 2037 4585 -1937
668 -1937 -2630 3624 -335 -5354 1914 1808 -6448 -1772 3171 -4668 -3824 3477 -1924 -3995 4609 1135
684 1135 -5218 3389 4205 -5056 -227 5888 -2335 -2404 4965 -463 -3990 2665 644 -3369 1972 2040
700 2040 -3028 1420 2919 -3053 -1051 3476 -1158 -2512 1951 508 -1964 1159 704 -1521 391
715 391 1170 -486 397 1097 -7 71 110 -333 -670 -1286 -291 1317 -872 -1985 1784 1244 -2594 297
$$ packed form
605e82K218O155n633l266P611l465p797O523K230r727K612O210p175j607O283
620E90m734k258Q581l294o002R611K941q977L817O594p434j191P025k812l189
635g32L984n60l061J845j851k298L667J80n336K732L169m332j293L588r10k541
651c749K323J638p95m37J544J499j029r20J680L70q65K285m6l951K490K548o522
668a937o93O254l959n019P268j06q256M676M943p839Q44P301n401k071Q604l474
684A135o353Q607Q16r261M829O115q223o9P369n428l527O655k021m013N341O8
700B040n068M448J499n972K002M527m634j354M463j443k472L123m55k225J912
715C91P79j656Q83P00j104P8L9m43l37o16R95J608k189j113L769n40l838K891
$$ plain form
733 297 2291 -373 255 2221 35 201 1795 -1103 -522 2391 -1927 -3509 2439 -130 -5378 147
749 147 1671 -4554 -1546 2923 -2693 -1573 3746 -1267 -2484 4601 1152 -3555 4302 3909 -4049 1360
765 1360 6537 -1953 -1832 4742 266 -2715 2460 99 -3681 786 -122 -4861 -681 997 -4317 -2259
781 -2259 1778 -1865 -3056 1696 959 -776 1337 2211 1120 1913 1995 919 1827 2146 883 738 931
798 931 570 -246 -1315 -764 -190 -2696 -2487 572 -1373 -3708 -535 77 -3070 -851 717 -1622 467
815 467 2678 -1095 691 5092 -219 -1466 5256 2108 -3480 3106 4513 -3474 -957 3618 -2457
830 -2457 -3423 2330 -1561 -4037 1569 -550 -4852 578 674 -4131 -470 2842 -1915 -685 4111 303
846 303 -1023 3316 1275 -887 2757 2253 -1112 1632 2731 -1442 -1328 1265 -299 -2031 -441 149
$$ packed form
733B97J994k664O28J966k186J66J594k898N81K913m318j582N948k569n248N525
749A47J524o225L008M469n616J120N319n013j217P085l449m707P857l93p958N409
765A360N177q490J21O574m476k981N175k361l780M467r08m739M180J678n314K058
781b259M037l643j191M752p37j735K113Q74j091P93Q2j076R08L19j263j45J93
798I31l61q16j069N51N74k506K09L059j945k335L173O12l147K219J568k339K089
815D67K211l773J786M401n311j247O722l148n588O586J407p987K517M575o075
830b457r66N753l891k476N606k119m302N430R6m805L661L312m757J230M796l808
846C03j326M339k041k162L644n04l365K744J099m173J14K593j564j732J590N90
$$ plain form
862 149 -818 -1587 -1116 -311 -1581 -1996 139 159 -915 597 802 -699 693 1218 -1656 129 3053 -924
880 -924 -1252 3203 598 -2830 1362 1417 -2785 386 2185 -2097 -728 2471 -2305 -2225 3376 -777 -3526
897 -3526 3212 2745 -2922 1114 3638 -1897 -1277 2552 -885 -1249 2138 -322 -1560 1751 -282 -3335
913 -3335 1207 1618 -2916 -195 2866 -533 -1818 1612 673 -1176 371 1339 493 195 701 385 -104
930 -104 -460 -370 -891 -1150 -39 -664 -2383 -1035 745 -2508 -2528 1646 -81 -2337 1393 2191 -1381 1228
948 1228 3069 -146 675 3462 371 471 4019 595 -1757 2849 957 -3718 633 2088 -3609 -1933
964 -1933 1804 -2523 -3414 1035 -1474 -3541 1213 444 -2727 1357 2377 -1818 279 3417 364 -64
980 -64 3180 1259 62 2146 753 -1274 495 -124 -2260 -1020 -338 -2136 -2297 -825 -1313 -2271 -1134
$$ packed form
862A49r67p69M71Q05j270m15K135K0j074J512K05j501J392N25k874J785K924l977
880i24l28M455k605l428M192N5m202L171J799m282J369L199m776Q0N601m153k749
897c526O738m67n667M036K524n535O20L829l437l64L387k460j238L311k033l053
913c335M542M11m534K721L061l399j285L430r39j849J547R68q46k98N06l16m89
930a04l56R0n21k59J111o25j719J348J780l253k0M174j727k256L730P98l572K609
948A228J841l215Q21K787l091J00L548l424k352M606j892m675M351J455n697J676
964a933L737m327q91M449k509k067M754p69l171M084J020m195K097L138l053m28
980f4L244j921j197K084j393k027J769o19k136J240O82j798j61J472m88r58J137
$$ plain form
997 -1134 97 -179 -585 -55 1465 1073 59 1510 1775 1019 1624 2020 1216 1971 1729 -44 1088 1636
1015 1636 -1338 -1143 1980 -895 -3154 1074 -140 -3721 -846 1020 -3192 -1434 2268 -2045 -2254
1030 -2254 3112 499 -2883 2235 2632 -2312 405 3224 -674 -894 2183 -430 -1496 893 -944
1045 -944 -1518 1358 -335 -2472 1211 1107 -2343 -290 2041 -945 -1388 1516 298 -1057 711 865
1061 865 -162 768 1024 -365 544 1568 435 -291 1023 903 -122 -598 634 1013 -888 -745 1283
1078 1283 -503 -1936 284 468 -842 -433 478 -510 64 126 -948 400 999 -2145 -1179 1864 -1405
1095 -1405 -2665 1509 478 -3347 252 2049 -2511 -276 2834 -887 -1228 3009 674 -1551 2719
1110 2719 2037 -1518 970 2537 -993 -516 1932 -704 -850 1375 -412 -1478 1053 98 -1806 275
$$ packed form
997a134J231k76m06N30J520l92j014J451K65p56O05L96q04P55k42j773J132N48
1015A636k974J95L123k875k259M228j214l581K875J866m212J758L702m313k09
1030b254N366k613l382N118L97m944K717K819l898k20L077k613j066K389j837
1045i44n74K876j693k137L683j04l450K053K331k986m43K904j218j355J768J54
1061H65j027R30K56j389R09J024j133p26J314j20j025m76J232L79j901J43K028
1078A283j786j433K220J84j310M09R11r88N74O2j074J348N99l144R66L043l269
1095a405j260M174j031l825L599J797m560K235L110l721l41M237k335k225M270
1110B719o82l555K488J567l530M77K448k636j46K225j787j066K531r55j904K081
$$ plain form
1126 275 851 -1935 -940 902 -259 -1297 57 309 -122 247 456 701 538 837 997 722 327 651
1144 651 311 -253 383 -396 -1938 -692 -140 -2661 -2235 330 -1540 -2629 497 14 -1666 1080 1588
1161 1588 -1026 1479 3128 -590 644 4092 461 -1343 3014 2328 -2018 1290 2747 -1553 -705
1176 -705 1496 -1053 -1646 823 -1317 -2084 451 -716 -2795 68 843 -2584 -828 1640 -732 -1116
1192 -1116 1603 1146 79 1333 1242 533 1122 1011 -286 -70 365 -697 -1392 -584 -353 -1792 -1706 62
1210 62 -372 -1993 -902 1131 -450 -1041 1346 1364 -754 853 1681 -17 530 1933 123 308 2122
1227 2122 -234 -317 2311 589 -1506 1102 1137 -1606 4 818 -1517 -912 982 -1887 -1634 1103 -949
1244 -949 -2434 1424 480 -2361 351 2116 -1291 -726 1857 -57 -1023 1054 135 -1260 698 -37
$$ packed form
1126B75N76k786R95J842j161j038J354K52m31L69K09K45j63K99J60k75l95L24
1144F51l40n64O36p79j542J246N52k521M26K565j870j089L126m83j680K746N08
1161A588k614K505J649l718J234L448l631j804M357o86m346L308J457m300Q48
1176g05K201k549n93K469k140p67K535j167k079K863P75l427J756K468k372l84
1192a116K719m57j067J254r1p09N89j11j297K16M35j062o95Q08K31j439Q6J768
1210F2m34j621J091K033j581n91K387J8k118J607Q28j698N47J403j810J85J814
1227B122k356q3K628j722k095K608L5k743J610Q14k335O05J894k869K53K737k052
1244i49j485L858r44k841K712J765l407N65K583j914r66K077r19j395J958p35
$$ plain form
1260 -37 -1459 -287 413 -963 -126 847 -326 -66 633 801 600 922 523 559 296 -66 314 42 143
1279 143 150 -428 -165 307 42 -923 332 1083 -522 -84 1123 -162 -843 839 158 -1180 315 355 -1381
1298 -1381 467 1380 -1342 -181 2440 -605 -2123 1418 709 -2353 -115 1159 -1870 -1957 17 -1207
1314 -1207 -1593 -403 -804 -500 924 22 -458 1762 1480 -60 1547 2406 150 823 2053 478 -195
1331 -195 756 -52 -347 489 -204 -1137 -206 126 -790 -773 -511 -395 -1018 -563 -73 296 -868 -517 745 -91
1351 -91 -641 685 813 111 1206 1196 -53 554 831 -835 140 885 -1137 -1707 457 -742 -2673 -709
1369 -709 -557 -1810 -462 73 -861 603 888 -519 883 1717 -596 -31 2963 1527 -920 1831 1756
1386 1756 -1286 335 1900 -288 -679 1501 176 -945 532 -149 -1477 -212 200 -1256 -458 255
$$ packed form
1260c7j422J172P00j376Q37R73j173K60O99J68k01L22l99L6k63l62L80k72J01
1279A43Pn78K63M72k65r65J255P51j605M38J207j285o81J682o81j338J495M0j736
1298a381J848R13k722J161K621l045j518L541p09l062K238J274l029q7J974j224
1314a207l86J190m01L04J424r02m80K220k82j540J607Q59k256O73J230j575o73
1331a95R51q08k95Q36o93r33R31L32r16J7K62J16o23M55M90L69j164L51J262q36
1351i1n50J326J28p02J095j0j249O07K77j666R75P45k022n70K164j199j931J964
1369g09J52j253J348N35r34J464K85j407J402Q34k313N65K994j436k447K751p5
1386A756l042J621J565k188l91K180j325j121J477o81j328J265M12j456P98P13
$$ plain form
1402 255 -640 -1369 -316 -387 -759 79 193 -25 358 317 391 581 471 478 119 -32 462 243 -506 -79 -449
1423 -449 -1317 -898 168 -771 -348 680 139 -445 925 256 -1019 1124 1125 -957 419 2347 -607 -957
1441 -957 1835 87 -2073 932 1661 -815 583 1277 -476 -358 1184 -489 -634 857 -158 -1157
1457 -1157 483 38 -1762 -380 421 -1020 -376 614 -256 17 613 -516 -800 707 -522 -1408 26
1474 26 188 -1411 -744 130 -286 -897 314 654 488 514 1288 1544 603 553 1226 602 176 1049 305 -509
1494 -509 503 -3 -1574 -730 512 -1357 -980 1314 -116 -1298 527 806 -867 -285 466 -478 187
1511 187 798 -482 441 1064 -339 -253 1432 190 -711 1153 782 -1570 -194 198 -1591 -1367 199
1528 199 -1427 -1553 34 -686 -1838 -141 524 -725 151 1367 985 986 1561 1433 850 1209 1030 790 625
$$ packed form
1402B55q95p29J053p1l72Q38J14k18L83m1P4J90j10Pl59j51M94k19p49M27l70
1423d49q68M19J066r39M23J028n41n84J370o69j275K143Jk082J376J928k954l50
1441i57K792j748k160L005P29k476J398O94j753J18J542j673j45J491j015r99
1457a157J640m45j800J382Q01j441O44R90q70K73N96j129k84J507j229q86J434
1474B6J62j599O67Q74m16o11J211L40j66K6P74K56r41n0O73o24m26Q73p44q14
1494e09J012n06j571Q44J242j869L77K294j430j182J825K79j673N82P51r44O65
1511A87O11j280R23O23j403Q6J685j242r01J864l71k352J376L92j789K24J566
1528A99j626j26J587p20j152J697O65j249Q76J216l82JN75j28n83L59j79k40j65
$$ plain form
1547 625 114 297 200 -133 -473 -445 -596 -494 -155 -891 -288 222 -525 -1047 -16 -521 -1042 -176 262 -477
1567 -477 135 371 -335 597 444 -563 780 1234 -584 -126 1230 -58 -1264 433 -262 -1771 -523
1584 -523 220 -1375 -595 304 -890 -532 907 30 -487 1114 1359 79 413 1004 333 651 394 75
1602 75 412 599 -254 265 917 -294 -582 828 243 -766 47 369 -330 -705 -308 -208 -199 -294 -356 -228 -250
1623 -250 -307 -354 72 10 56 -99 -98 641 -448 -449 744 307 -1146 -476 742 -322 -830 487 232 -616 467
1644 467 766 -98 857 991 -144 620 1098 -307 -239 1114 -75 -1033 97 10 -891 -194 21 -760 266
1663 266 650 -497 94 1007 -45 -485 1096 518 -757 301 811 -683 -448 430 -173 -522 -158 -176
1681 -176 -189 84 -164 -476 -292 -172 -806 -696 -274 -452 -652 -633 -131 312 -358 142 1113 495 748 1107 1003
$$ packed form
1547F25n11J83r7l33l40K8j51J02L39p36O03N10p47n22J031n05n21Q66M38p39
1567d77O12K36p06R32j53j007J343M54j818M58J356j288j206J697o95j509J248
1584e23P43j595P80Q99j194L58J439q77n17J601K45j280L34N91o71L18k57l19
1602G5L37J87q53N19O52j211k88J410n85j009Q13L22o99l75L97J00Rr5o2J28k2
1623b50n7m7M26o2M6j55JP39j089jJ193m37j453O70J218j064n08J317k55q48J083
1644D67K99q64R55J34j135P64M78j405O8J353j189r58J130q7r01O97K15p81J026
1663B66L84j147N91R13j052m40J581n78j275J058N10j494K35Q78o03l49L64j8
1681a76j3K73k48l12J84J20o34J10M22j78k00J9N02M43o70N00R71o18K53L59j04
$$ plain form
1702 1003 592 1368 785 391 667 621 -479 -8 474 -1103 -945 269 -760 -1383 227 -369 -856 362
1720 362 310 -938 307 753 -833 155 1646 -286 -686 881 760 -897 553 946 -468 -16 528
1737 528 -280 -217 250 -896 -703 130 -816 -1468 -285 -99 -1094 -512 237 -203 -486 386 437 283 429 873
1757 873 1072 636 619 750 727 530 309 -263 -78 145 -451 -740 -199 -136 -1147 -57 302 -592 -504 512
1777 512 -7 -895 214 -234 -885 276 607 -1289 -34 1092 -97 -314 1118 600 -689 698 821
1794 821 -639 19 546 -692 -620 49 -596 -780 97 -490 -436 428 454 -668 315 928 -39 237 678 63
1814 63 84 732 263 -171 -118 -202 -369 -34 -2 -305 -185 224 391 -165 -109 443 319 -141 73 426 -184 -82
1836 -82 -2 -322 -503 15 -561 -208 226 -446 -785 -12 -82 -868 -345 323 -445 -515 317 7 -391 504 270
$$ packed form
1702A003m11P76n83l94K76m6j100M71M82j577J58J214j029o23J610n96m87J218
1720C62n2j248J245M46j586R88J491j932m00J567j21j657J450L93j414M52N44
1737E28q08O3M67j146J93Q33r46o52J183J86r95N82P49m40k83Q72N1j54J46M44
1757H73J99m36j7J31k3j97k21n72J85K23n96k89N41O3j011J090L59q94Q8J016
1777E12n19q88J109m48o51J161L31j896J255J126j189k17J432n18j289J387J23
1794H21j460O58N27j238P2O69o45j84Q77n87N4Q64K6j122R83O13r67K76M41o15
1814F3K1O48m69m34N3q4j67L35L2l03J20M09J67n56N6N52j24m60K14L53o10J02
1836h2Q0l20j81N18n76L53M34o72l39P73p0p86N23O68p68p0Q32l10l98Q95k34
$$ plain form
1857 270 -358 527 749 -371 618 1310 133 200 1023 628 -398 200 426 -339 -321 -358 -1170 -365 -312 -1099
1877 -1099 -701 514 -214 -678 665 566 -169 238 940 187 66 710 615 125 116 392 -131 -58 205 -93 -625
1898 -625 -232 -219 -769 -789 -212 -505 -1059 -19 -20 -592 -406 130 58 -99 194 391 706 1201 812 546 1229
1919 1229 658 -226 840 982 -768 -664 640 -286 -1242 -213 -248 -1082 -129 -136 -930 -49 74 -455 -66
1938 -66 650 -393 -288 958 269 -275 834 740 -158 -205 703 122 -115 178 107 -127 427 81 -320 -8
1958 -8 -354 -437 -353 -503 -287 -369 -441 -391 -429 -170 209 188 550 526 -27 338 311 284 -122 317 485 -31 -535 533
1982 533 262 -452 -156 399 -476 -677 536 -131 -462 158 18 -459 416 142 -450 -26 501 -488 -281 409
2002 409 -315 -486 277 334 -398 145 206 -272 275 529 -123 -60 466 -178 -603 817 380 -395 -233 551 4
$$ packed form
1857B70o28Q85K22j120R89O92j177O7Q23l95j026N98K26p65J8l7q12Q05N3p87
1877a099L98J215p28m64J343r9p35M07P02p53j21O44r5m90rK76n23P3K63k98n32
1898f25L93J3n50k0N77k93n54J040jn72J86N36p2j57K93J97L15M95l89k66O83
1919A229n71q84J066J42j750J04J304r26r56J029l5q34R53pp94Q81J23n29L89
1938f6P16j043J05J246o89n44J109r4q98m7R08n81k37K93p1k34N54l46m01L12
1958hl46q3Q4j50K16q2p2N0l8K59L79k1L62k4n53L65k7k7m06M39J68n16n04J068
1982E33k71p14K96N55q75k01J213o67l31O20j40m77Q75k74n92M24N27r89K07O90
2002D09p24j71P63N7p32N43O1m78N47K54o52O3N26o44m25J420m37p75J62P84n47
$$ plain form
2023 4 -101 498 188 -365 79 -17 -221 66 -16 -364 15 178 -111 -1043 -256 511 -529 -444 175 222 -306 165
2045 165 710 305 245 497 351 192 208 -124 -15 203 -145 -835 42 133 -848 -666 330 -511 -992 164 -51
2066 -51 -641 -24 13 -243 94 505 -113 293 638 320 196 843 751 61 691 389 -101 266 414 -383 -260
2087 -260 -77 -461 -753 -312 -472 -712 -497 -43 -539 -280 -11 270 77 488 721 227 164 526 464 321 285
2108 285 125 288 106 200 -197 -108 290 -312 -417 -42 -204 -716 -282 -32 -630 -341 190 -399 -307 186 -133
2129 -133 -379 653 591 -342 466 1057 -134 -35 656 426 -496 178 139 -437 -171 -189 -455 -286 -64 -620 -307
2150 -307 402 7 -417 398 164 -524 29 661 245 -208 319 414 -16 107 44 46 180 89 -114 -101 380 -283
2172 -283 -601 -30 207 -364 -322 357 2 -172 -44 241 -423 -27 104 -55 39 457 -215 166 560 118 -570
$$ packed form
2023Dj05N99l10n53M44r6k04K87q2l48L79J63k89r32P87P67j040Q5O19M7n28M71
2045A65N45m05o0K52j46j59J6l32J09K18l48o90Q77R1r81J82R96q41m81J156k15
2066e1n90O17L7k56L37M11o18M06L45l18j24O47r2o90O30l02m90L67J48p97J23
2087b60J83l84k92M41j60k40K15M54m96K59K69K81j93M11K33m94o3L62o2j43l6
2108B85j60J63j82R4l97Q9L98o02j05L75j62n12M34K50n98K89N31n89R2M93l19
2129a33k46J032o2r33Q08N91j191R9O91k30r22O74l9n76K66j8k66J69K22n56L13
2150c07P09l95m24Q15k34o88N53O32m16m53N27R5m30J23o3KJ34r1k03J3M81o63
2172b83l18N71K37n71M2O79l55j74J28K85o64L96J31j59R4M18o72L81L94m42o88
$$ plain form
2193 -570 80 259 -699 -240 262 76 -394 313 -4 -135 215 189 -93 550 76 -113 309 581 -94 -483
2213 -483 388 106 -467 -11 -22 -664 -449 -52 -249 -355 72 -225 -137 410 154 -160 197 208 -271 -50 490
2234 490 134 157 515 300 40 396 328 161 -101 37 -13 -192 -162 -124 -487 -396 -150 -530 -606 6 87 -507 -47
2257 -47 372 -5 33 361 151 366 609 253 323 866 462 -253 -104 567 -515 -341 94 -162 -324 -330 -258 -525
2279 -525 -177 -91 -508 3 -58 -144 148 383 40 -317 460 698 13 39 773 542 209 116 333 -210 32 -133
2301 -133 -325 -33 -146 -418 -273 -129 -473 -516 -243 -383 -350 -484 93 121 -270 -100 285 248 385 164 598
2322 598 416 182 97 123 87 -100 -80 415 80 -488 -236 291 -471 -304 11 -211 -222 -163 -217 -372 180 91 -372
2345 -372 155 395 -366 56 462 92 -253 264 -139 70 -111 -170 -278 -119 27 -295 -53 -46 -154 -261 135
$$ packed form
2193e70O50J79r58M59N02j86m70P07l17j31L50k6k82O43m74j89M22K72o75l89
2213d83Q71k82n73M56j1o42K15L97j97j06M27k97Q8N47k56l14L57J1m79K21N40
2234D90l56K3L58k15k60L56o8j67k62J38n0j79L0L8l63R1K46l80p6O12Q1n94M60
2257d7M19l77L8L28k10K15K43l56P0N43m04p15J49O71j082J74M35k56j62oP2k67
2279e25L48Q6m17N11o1q6K92K35l43l57P77K38o85K6P34k31l33r3K17n43K42j65
2301a33j92K92j13k72J45J44l44m3K73j40L3j34N77K8l91J70L85l7J37k21M34
2322E98j82k34q5K6l6j87K0M95l35n68K52N27p62J67L15k22j1N9n4j55N52q9m63
2345c72N27K40p61M22M06l70l45N17m03K09j81n9j08J59J46l22K42Pj08j07L96
$$ plain form
2366 135 257 -431 124 304 -67 -56 121 47 283 39 -1 37 9 -158 -177 179 281 78 -414 334 274 -374
2388 -374 -64 490 208 -224 215 89 -280 -72 175 182 -216 298 -60 -371 254 128 -335 -227 124 -337 -289
2409 -289 -38 -262 -431 -75 -302 -433 307 -40 -271 571 724 -81 319 469 -22 72 567 336 -119 269
2429 269 308 106 -122 -42 -537 -68 -104 -389 -383 209 -547 -610 -119 53 -248 -303 397 564 -28 236 557 386
2451 386 -15 341 484 258 227 89 148 -90 -177 -290 -246 3 -597 -414 -55 -270 -603 -240 -216 -290 -154 -81
2473 -81 -10 299 356 83 -17 347 442 -18 491 486 386 39 618 378 -50 34 128 -194 -441 -196 -271 -556 -271
2496 -271 -358 -363 -110 -45 -350 230 340 -191 214 357 154 88 74 164 227 2 47 260 134 -215 -337 -214 139
2519 139 -101 -523 58 -157 -256 -162 362 50 -419 99 141 50 146 300 -311 -49 326 126 52 466 373 -250
$$ packed form
2366A35J22o88N55J80l71J1J77p4K36k44m0L8k8j67j9L56J02k03m92P48o0o48
2388c74L10N54k82m32M39j26l69K08K47Pl98N14l58l11O25j26m63J08L51m61M8
2409b89K51k24j69L56k27j31P40l47k31Q42J53q05M00J50m91R4M95k31m55L88
2429B69L9k02k28Q0m95M69l6k85ON92p56o3M91J72l01n5P00J67n92K64L21j71
2451C86m01L56J43k26l1j38N9k38q7j13M4K49o00J83L59k15l33L63K4p4J36P3
2473h1P1L09N7k73j00L64R5m60N09nj00l47N79k40m28Q4R4l22k47K45p5k85K85
2496b71q7nK53O5l05N80J10n31M05J43k03o6j4R0O3k25M5K13j26l49j22J23L53
2519A39k40m22N81k15r9R4N24l12m69N18M2r1R6J54o11K62L75k00p4M14r3o23
$$ plain form
2541 -250 291 374 -4 -40 261 -231 -70 30 -134 -205 -43 -86 50 80 85 -181 166 196 -102 -43 4 45 -565 -64
2565 -64 13 -109 -60 -156 -91 -226 17 -180 -309 204 -54 -147 28 45 105 212 173 145 31 106 438 64 229 -162
2589 -162 22 13 -30 -256 -273 106 -90 -359 -141 118 -223 -359 112 26 -137 -146 103 124 34 317 435 250 93
2612 93 -46 284 413 199 -123 10 341 -492 -47 -5 -277 -334 -91 -331 -620 -334 -51 -321 -153 -68 -8 196
2634 196 430 166 15 581 382 19 341 398 105 41 65 443 93 90 106 -75 -248 -92 -457 -56 -26 -173
2656 -173 -427 -75 -75 -100 3 -4 -118 -214 206 611 201 383 -32 150 364 90 88 34 104 -320 -283 -263 -300 -387 -288
2681 -288 -344 -156 -265 -2 -300 41 162 -172 -122 300 464 -70 136 413 88 294 599 228 115 52 341
2702 341 72 378 34 -26 161 178 -170 -479 -111 -270 -315 101 149 -226 -427 13 220 -61 -68 212 -180 284
$$ packed form
2541b50N41Q3l78l6L01m92J61J00j64p1J62m3J36L0Nk66L47L0k98N9M7M1o10N01
2565f4P7j22M9r6O5j35K43j97j29N13k58r3J75J7O0J07l9k8j14P5L32l74J65l91
2589a62J84rm3k26j7L79j96k69K18K59l41j36M71q6j63rK49K1r0K83J18j85j57
2612I3j39L30J29k14l22J33L31q33M45M2k72n7K43k40k89K86K83k70J68Q5O0K04
2634A96K34k64j51N66j99l63L22N7k93o4K4L78l50lJ6j81j73J56l65M01L0j47
2656a73k54L52%k5J03pj14r6M20M05m10J82m15J82K14k74kn4P0m24L7K0l7q7R9
2681b88n6J88j09K63k98L41J21l34N0M22J64n34K06K77l25K06L05l71j13o3K89
2702C41k69L06l44o0J87J7l48l09L68j59m5M16M8l75k01M40K07k81pK80l92M64
$$ plain form
2724 284 -32 149 -23 66 -312 -202 -9 -72 -102 -55 40 -136 -148 145 9 -206 -164 42 -95 -29 154 -170 37
2747 37 31 -341 19 281 -19 -472 -34 80 144 1 248 49 -18 -20 -104 -18 34 -34 -61 0 244 -59 -93 316 33
2772 33 -167 20 154 -76 -249 -46 -119 -200 -144 6 -119 -566 -201 -470 -335 -241 -295 39 -97 19 16 269 117
2795 117 44 292 368 328 295 117 126 25 170 6 -197 194 55 -315 -248 -166 -385 -239 35 -22 -533 -258 251
2818 251 -98 -28 20 230 -40 253 143 15 199 242 88 508 194 49 -110 190 -52 -354 -227 -218 -218 -370
2840 -370 -158 -403 -189 -270 -214 -32 272 -20 -268 324 370 12 228 194 156 224 467 140 -5 78 73 -55 16
2863 16 -92 184 -84 -118 -255 -227 -93 6 -255 -385 29 -103 -98 -121 -106 156 235 225 87 302 193 -110 -99 157
2887 157 146 -152 79 14 -245 -265 89 -70 -299 -276 -67 -8 -165 -234 11 -93 65 -111 239 349 -70 61
$$ packed form
2724B84l16J81j72Q9l78J10J93o3l0M7R5j76j2K93j36k15M2K06j37O6J83l24K07
2747C7ol72L60K62l00m53M38J14O4j43K47j99o7kq4Q6N2o8k7O1K44l03l4M09k83
2772C3k00J87J34k30j73K03p3q1N6J50j25m47L65k69J35R4n4L34j36J16lK53j52
2795A17p3K48P6m0l3j78Rj01J45j64k03L91j39l70O7Q2k19J46K74n7n11K75N09
2818B51l49P0M8K10k70K93j10j28J84M3j54M20l14j45j59L00k42l02J27R%j52
2840c70K12k45K14q1N6J82L04k92k48N92M6l58K16l4l8O8K43l27j45Q3nj28P1
2863A6j08K76k68l4j37K8J34R9k61j30M14j32Nk3J5K62P9j0j38K15j09l03J1K56
2887A57j1k98K31o5k59k0L54j59k29K3K09N9j57o9K45j04J58j76L50J10m19J31
$$ plain form
2909 61 268 129 -17 104 72 -159 111 166 -39 -23 -11 -81 -101 263 116 -98 278 64 42 -185 149 43 2
2932 2 -38 -6 8 -161 -22 135 -54 16 -333 -71 314 -198 -114 -19 -114 -173 -169 44 -77 25 58 -107 146 158 504
2957 504 310 205 188 -22 114 305 398 -212 -314 36 -4 32 -265 -144 -23 -212 -20 3 80 -17 -126 196
2979 196 160 98 -23 160 190 102 359 72 35 252 88 108 86 -277 -148 177 -122 -56 -278 -192 -169 -551 -454 -159
3003 -159 -344 -281 -197 -125 -56 38 277 154 334 185 326 208 102 245 142 188 -12 -343 100 346 -23 -484
3025 -484 -55 -118 -451 -212 -195 -106 -327 -250 -209 7 -145 -89 -44 183 158 -169 123 516 15 135 353 60 226
3048 226 -137 52 -19 2 -84 -133 -178 -292 -377 -303 -102 -140 -447 -108 75 -146 86 333 95 39 -10 407 167
3071 167 -64 108 -45 -18 84 -101 128 71 -59 -152 -255 -50 -225 -151 192 33 -318 -163 49 -123 123
$$ packed form
2909F1K07j39j46J21l2k31K70N5k05J6J2p0k0L64j47k14L76k14k2k27L34j06m1
2932Bm0L2J4j69J39J57j89P0l49K62L85n12Q4R5r5n9MK13j21J02L3j65K53J2L46
2957E04j94j05j7k10J36J91R3o10j02L50m0L6k97J21J21j89J92K3P7r7j09L22
2979A96l6o2j21J83L0q8K57k87l7K17j64K0k2l63J29L25k99O6k22Q6K3l82R7K95
3003a59j85O3Q4P2O9R4K39j23J80j49J41j18j06J43j03M6k00l31M43K46l69m61
3025d84M29o3l33K39J7Q9k21P7M1K16j52N6M5K27k5l27K92L93n01J20K18k93J66
3048B26l63J89p1K1q6m9m5j14q5P4K01l8l07L39J83k21K32K47k38n6m9M17k40
3071A67k31J72j53K7J02j85K29n7j30r3j03K05j75P4L43j59l51J55K12j72K46
$$ plain form
3092 123 198 -202 -144 163 56 -366 71 -252 -188 221 105 -213 25 226 -185 -272 84 -18 145 -70 -34 -186
3114 -186 -75 -8 -23 -106 265 95 -8 45 77 -18 -88 290 -129 -124 102 96 -141 -15 13 -267 31 230 -87 142
3138 142 197 -272 116 318 453 -159 -106 -91 33 3 -101 43 -89 -93 -119 -171 -144 5 -191 -29 -52 -50 -271 -86
3162 -86 -48 -145 -238 -66 208 -99 59 78 244 66 348 289 191 83 275 167 222 -5 -94 -90 -110 -235 -212 -281 -280
3187 -280 -262 -31 -134 -97 -112 6 -25 146 125 -83 135 -25 23 65 54 -195 154 -111 37 170 155 276 -152
3210 -152 -298 -119 -208 -26 -55 -192 -582 78 -39 -274 90 20 121 113 -131 -70 111 476 108 23 -4 60 -97
3233 -97 169 131 57 -29 -172 30 -285 -227 -25 -139 -381 -38 -67 -156 -107 -46 67 104 -289 -20 -52 24 -67 -1 83
3258 83 38 58 205 -109 173 -48 -224 127 176 -39 -82 -284 201 2 -170 -105 -48 -340 -205 -297 -17 -61 61
$$ packed form
3092A23P5m00N8L07j07m22M37l23O4M09j16l18K38K01m11q7L56j02J63k15L6j52
3114a86J11O7j5q3L71j70j03N3L2r5p0L78m19NK26ok37J26K8k80K98J99l17K29
3138A42N5m69L88K02J35o12N3J5J24l0j04J44j32mk6n2K7J49j96J62k3Kk21J85
3162h6L8r7r3J72K74l07J58J9J66j78K82n9r8j08J92j08N5k27q9Mk0j25K3o9J
3187b80J8K31j03L7j5J18l1J71k1k08K18j60M8M2j1k49L49k65J48J33j5J21m28
3210a52j46J79q9J82k9j37l90O60j17k35L64p0J01qk44O1J81L65l68q5k7O4j57
3233i7K66l8p4q6j43K02l15N8K02j14k42L43k9q9M9O1J13L7l93K69l2P6r1O6Q4
3258H3m5K0J47l14K82k21j76L51M9k15m3k02M85j99j72O5N7k92J35r2K80m4J22
$$ plain form
3281 61 -123 -115 -230 56 -209 84 73 -134 -13 30 -147 -153 -20 162 130 -42 -66 58 102 -91 236 144 137 -13
3305 -13 61 -147 27 -354 116 0 64 -114 -73 148 -134 -108 -40 -245 -125 -113 -65 -114 -218 137 -161 -119 -142 -73
3329 -73 -137 -124 151 155 -1 249 -92 180 178 -31 -259 -225 -85 -182 144 -326 -215 -185 -80 -339 -44 190 -229
3352 -229 -241 144 105 150 101 112 226 247 210 152 -54 -178 67 -109 -16 -183 -67 -2 163 -210 -187 -94 -114 -116 -415
3377 -415 -6 33 -30 -263 -175 168 137 99 85 367 267 219 102 204 -103 352 140 69 59 16 -75 56 -78 -118
3401 -118 -220 -136 -196 -353 -318 -126 -54 -103 -26 -40 13 -25 167 304 160 -5 -45 64 116 137 48 -41 -95 -35 -133 31
3427 31 -31 -333 -101 -108 -169 -149 0 140 -260 -179 31 -86 -66 -265 119 177 -225 36 50 87 32 -101 -6 -134
3451 -134 21 -203 19 132 -87 -214 -140 265 -125 -86 -69 -180 130 49 15 16 120 -164 -7 152 -18 -184
$$ packed form
3281F1j84Qj15K86k65K93j1k07J21M3j77oJ33J82l2j72k4J24M4j93L27r2pj50
3305a3P4k08J74l81M70j16O4j78M1K21k82K6O8k05J20J2M8m9j04L55k98M2k3O9
3329g3o4J3K75Mj56K50l41K72kk09k28L4J40r7L26m70J11L0J05k59K95K34m19
3352b29j2L85l9M5m9J1J14K1l7n8k06j24K45j76R3j67J16O5J65l73K3R3k0kk99
3377d15M09L9o3k33Q8L43l1l8j4K82j00m8j17J02l07M55k12p1j0m3r1J31j34m0
3401a18j02Q4o0j57L5J92P2m9P7j4N3l8J92J37j44j65m0J09N2K1q9q9n4O0r8J64
3427C1o2l02K32po1K0J49J40m00Q1K10j17K0j99L84N8m02K61J4L7n5j33R5j28
3451a34J55k24K22J13k19j27P4M05l90L9J7j11L10q1l4JJ04k84J57J59j70j66
$$ plain form
3473 -184 -212 32 -37 -241 110 173 -202 151 15 -79 47 -5 121 1 69 -94 138 89 -167 65 -141 -211 -18
3496 -18 -52 -210 226 -69 12 219 -152 -14 -140 -107 -142 -48 -78 48 22 -82 23 -74 112 65 191 95 235 210
3520 210 48 -100 -29 79 -11 -64 92 83 -229 37 17 55 -281 -87 -36 -428 55 120 153 171 -152 -119 -83 -50 75
3545 75 133 243 147 -19 344 91 -92 161 -62 249 -271 -403 -88 -115 -157 -110 -289 -140 -223 -130 71 6 -85
3568 -85 -15 -150 -50 214 190 100 299 113 -12 93 -37 74 118 130 204 52 124 87 94 104 -137 -197 -53 106
3592 106 -164 -5 143 -51 -63 -197 86 -64 214 263 238 171 36 260 149 -15 -8 116 229 81 -9 -119
3614 -119 -299 -305 -303 -66 -123 -20 -110 2 217 -85 99 -16 17 137 246 36 347 288 -24 218 3 59 98
3637 98 13 18 -25 209 18 -50 -35 -160 121 82 -66 -148 419 4 77 -150 12 64 -67 -26 -151 155 117 -126
$$ packed form
3473a84k8K44o9k04L51O3l75L53j36r4J26n2J26j20O8j63K32m9k56K32k06p0J93
3496a8l4j58M36k95Q1K07l71J38j26L3l5R4l0J26k6j04J05r7J86m7J26r6J40k5
3520B10j62j48P1J08r0n3J56rl12K66k0L8l36J94N1l92M83O5L3J8l23L3L6L3J25
3545G5N8J10r6j66L63k53j83K53k23L11n20j32L15k7m2M7j79J49q3R3K01o5r1
3568h5P0j35J00K64k4r0J99j86j25J05j30J11M4J2P4j52P2l7PJ0k41o0J44J59
3592A06k70J59J48j94j2j34K83j50K78M9k5o7j35K24j11j64PJ24J13j48r0j10
3614a19j80oKK37n7J03r0J12K15l02J84j15L3J20J09k10L11n9l12K42k15N6L9
3637I8q5Nm3K34j91o8J5j25K81l9j48q2N67m15P3k27J62N2j31M1j25L06l8k43
$$ plain form
3661 -126 -10 86 159 -96 -51 116 -116 -12 -142 -153 -151 -56 25 -111 161 211 -22 156 7 116 -3 -45 -120 77
3685 77 -273 -77 56 -265 -109 -8 -229 -116 90 157 166 -72 -45 86 59 -61 -28 37 -112 86 -33 127 -46
3708 -46 83 56 -184 -285 175 32 92 -81 -59 -14 -33 -115 -218 -109 -32 -211 -241 -103 -4 -116 -113 -28 -41 186 112
3733 112 19 66 -138 227 -11 272 11 -286 207 -60 -411 -261 28 16 -144 -152 -131 -69 -15 -216 -139 -115 -168 76
3757 76 86 134 35 -2 166 20 -34 185 136 163 -11 -25 277 51 -244 -52 -15 -193 143 -49 -31 -31 -67 -196 -65
3782 -65 -136 -100 1 -193 17 235 127 137 25 185 65 103 -61 77 -99 74 191 -173 -216 51 -31 -2 -161
3805 -161 193 113 150 -69 -17 206 -57 -38 149 127 -120 91 81 -50 235 38 73 14 76 -407 95 26 231
3828 231 -39 -50 -26 100 -115 -163 -46 -9 -61 -122 25 -66 43 -217 12 28 67 90 -97 157 -109 -6 66 -122
$$ packed form
3661a26J16R6P3k55M5J67k32J04j30j1KR5Q1j36K72N0k33J78j49J09j19m2p5J97
3685G7l50J96J33l21J56J01k21J13K06O7Rk38K7J31k7j20L3O5j49J98j19J60j73
3708d6J29k7k40j01M60j43O0j73K2M5j9q2j03J09P7j79l0J38R9j12LQ5j3K27p4
3733A12r3M7k04L65k38K83k61k97M93k67l51J50K89j2j60qK1O2N4k01P7K4n3K44
3757G6J0M8r9l7J68j46n4K19m9K7j74j4L02k26k95J92L7j78L36j92J8%l6j29J31
3782f5p1L6J01j94K10K18j08J0j12J60j20L8j64J38j76J73J17l64m3K67q2K9j59
3805a61L54q0L7k19N2K23k63J9J87k2k47K11j0j31K85j97L5n9O2m83N02o9K05
3828B31k70j1K4J26k15m8J17L7n2o1J47r1J09k60K29J6L9K3j87K54k66J03P2j88
$$ plain form
3852 -122 -84 -197 37 -3 -162 26 170 -71 -125 221 122 98 -108 -66 -7 289 -125 -189 20 59 -27 -4 -224 -114
3876 -114 111 -157 -163 -177 -114 -74 35 50 -140 4 40 -9 128 -319 154 12 79 283 101 70 58 228 -7 13
3900 13 -328 108 30 32 -212 69 50 27 -357 -287 163 -144 -292 -88 -20 -106 210 18 198 -177 43 -69 297
3923 297 416 -46 476 53 260 -7 80 -30 184 -87 -156 -74 -159 -145 -146 36 -255 -19 -72 9 -37 -6 137 173
3947 173 142 -42 162 95 239 109 242 36 13 -150 47 23 89 -102 44 -169 -23 -17 -54 51 72 -17 114
3970 114 28 -23 146 -3 138 238 134 119 260 -7 25 199 -117 100 -255 -92 64 224 -52 -142 54 -383
3992 -383 -271 -187 83 -255 -276 -110 -174 238 -272 -237 20 242 -67 -136 -79 69 46 -224 81 28 -47 -117 -113 -42
4016 -42 -90 -119 -17 210 61 110 -67 229 258 129 286 -263 -110 40 107 113 65 -5 -117 59 2 55 -302 -150
$$ packed form
3852a22L8j13K34m0j59J88J44k41n4L46r9k4k06M2N9K96m14o4K09L9q6K3k20J10
3876a14K25k68oj4O3M0J09J5j90J44L6m9J37m47M73j42O7K04j82l1j2J70k35K0
3900A3l41M36p8Kk44K81j9k3l84P0M50l07j48K04O8q6L16j92J80l75K20j12L66
3923B97J19m62N22m23K07k67Q7j10K14k71o9Q2q5J4jJ82k91K36n3Q1m6L1J43L6
3947A73l1j84K04o7J44j30J33k06k3j63J97k4O6j91J46k13J46Ol7J05K1q9J31
3970A14q6n1J69j49J41J00j04j5J41k67L2J74l16K17l55J63J56J60k76r0J96m37
3992c83J12Q4K70l38k1J66o4M12n10L5K57K22l09o9N7J48k3k70L05n3p5p0MP1
4016d2m8k9J02K27j49M9j77K96K9j29J57n49J53J50O7Om8p0j12J76n7N3l57J52
$$ plain form
4040 -150 -20 141 -11 -12 -95 -118 -93 -141 -65 287 -52 102 89 -13 264 34 -152 223 253 -111 -131 -180 203 155
4064 155 -224 -4 -4 -238 52 -76 -112 -202 -25 82 -21 72 102 -25 163 117 293 -132 -243 184 -32 149
4086 149 -214 65 -59 -136 60 -45 -10 61 96 -68 30 3 181 -22 -44 -203 133 115 -199 235 149 195 58
4109 58 120 121 108 160 -26 63 -23 14 55 -95 -60 -120 -76 80 -47 -75 -136 -274 -109 18 28 70 112 -10 162 -19
4135 -19 -21 -109 55 142 26 208 26 198 292 -128 -114 -106 -59 81 -102 -1 -98 -59 -132 97 -5 -1 117 -4 -99
4160 -99 33 -20 223 -1 98 136 261 33 9 -165 19 3 3 102 172 -213 -65 -15 -158 245 -151 -44 193 143
4184 143 -189 110 83 -108 -51 -65 -40 20 53 43 43 65 49 -85 -90 189 -142 48 72 17 68 -97 -222 -157 -63 -62 -21
4211 -21 -175 -81 -46 -51 124 -93 10 143 256 -189 -228 240 -61 -208 0 169 -2 -6 -39 -49 -60 213 -114 47
$$ packed form
4040a50J30J61j52jq3k3K5m8P6L52l39J54j3j02K77k30j86L75L0l64k0m9L83m8
4064A55l79K20%k34K90j28l6r0J77J07j03R3L0j27J88m6J76m25j11M27k16J81
4086A49l63K79j24p7J96j05L5P1L5j64R8k7J78k03k2j59L36j8l14M34q6M6j37
4109E8O2Jj3N2j86Q9q6L7M1j50L5o0M4J56j27k8o1j38J65J27J0M2M2j22J72j81
4135a9kq8J64Q7j16J82j82J72R4m20J4QM7J40j83J01r7L9p3K29j02MJ18j21r5
4160i9J32n3K43k24R9L8J25k28k4j74J84j6%R9P0l85J48N0j43M03l96J07K37n0
4184A43l32K99k7j91N7j4K5O0L3j0%K2j6j34nK79l31J90K4n5N1j65j25O5R4JM1
4211b1j54R4L5nJ75k17J03J33J13m45l9M68l01j47K08J69j71ml3j0j1K73l27J61
$$ plain form
4235 47 110 -58 113 -78 81 -57 -29 194 116 8 110 -46 120 -239 -142 24 -75 197 -193 -49 -151 -169
4257 -169 -10 -132 -121 105 43 90 -107 31 -90 262 45 9 170 248 180 -68 2 14 133 -155 -93 92 -101
4280 -101 -126 -28 -40 8 116 -176 34 18 80 -48 -74 -258 9 -72 24 189 -234 265 110 -324 107 130 326
4303 326 -99 72 68 -12 6 -33 148 -93 -186 157 -91 40 -48 -293 -47 -105 106 163 -13 78 95 -141 -273 162
4327 162 -174 -10 136 77 87 -190 71 5 -31 -30 -54 -55 -130 -35 72 181 44 291 40 74 23 -116 195 11
4351 11 182 8 81 166 157 -4 189 198 -27 42 -99 -149 189 39 -22 -244 -170 -73 -102 -121 14 175 -127 143 117
4376 117 -24 -98 90 -1 -135 3 204 105 -55 -78 131 -59 185 -278 -19 -58 -288 215 -204 -97 -131 -82
4398 -82 0 -97 365 -21 -134 133 146 49 65 100 -91 -268 3 50 -97 74 -23 143 -57 -24 -99 -104 -34 114 125
$$ packed form
4235D7O3j68J71j91J59j38K8K23p8j08J02j56J66l59R7J66r9K72l90J44j02j8
4257a69J59j22J1K26o2M7j97J38j21L52k17l6J61P8o8k48P0J2J19k88O2J85j93
4280a01k5R8j2M8J08k92K10j6O2j28k6j84K67q1R6J65m23M99j55m34M31K3J96
4303C26m25J71mq0J8l9J81k41r3L43k48J31q8k45K46n8K11N7j76R1J7k36j32M35
4327A62l36J64J46n9J0k77K61o6l6Jk4jp5R5J07J09j37K47k51L4n1j39L11j84
4351A1J71j74P3Q5rj61J93Rk25O9j41n0L38j50o1k22P4R7k9j9J35J61l02K70k6
4376A17j41p4J88r1j34J38K01r9j60k3K09j90K44m63K59l9k30N03m19J07l4M9
4398h2Q2r7M62l86j13K67J3r7J6L5j91j77K71M7j47J71r7J66k00L3p5nP0J48J1
$$ plain form
4423 125 168 12 66 -67 65 -85 42 88 73 46 -37 -108 -161 -97 -35 112 -168 -268 -198 42 62 167 78 186
4447 186 -61 6 221 -108 275 157 100 55 234 -111 -47 152 185 88 -62 10 32 -181 -6 -44 221 -21 57
4470 57 -198 -153 -527 -118 69 95 -53 -84 -112 -30 -28 87 339 57 -64 -281 136 11 85 65 -73 6 33 -145
4494 -145 61 -184 -133 -57 -24 -30 -188 -30 9 281 -129 151 -52 -19 280 -153 -48 190 -118 41 135 116 20
4517 20 176 419 69 -43 145 95 134 -114 -158 16 138 199 -152 -104 -165 36 13 -104 -40 21 -185 -6 166
4540 166 49 51 82 -5 100 -34 -81 -79 11 18 43 62 -4 -185 63 -27 -156 17 -278 -72 -30 -186 64 115 -40
4565 -40 -132 67 -30 -10 -11 -141 173 274 113 -126 55 82 -11 110 11 46 13 -170 104 -60 -215 80 -88 -260
4589 -260 218 -15 121 -77 -33 -276 -83 -82 64 -26 -46 66 -164 -232 144 -106 20 -169 -106 -95 -139 284 -224
$$ packed form
4423A25M3j56N4j33J32j50J27M6j5k7q3p1n3O4O2J47k80j00P0K40K0J05q9J08
4447A86k47O7K15l29L83j18n7m5J79l45O4J99L3r7j50P2K2k13J75l8K65k42P8
4470E7k55M5l74M09J87K6j48l1k8Q2KJ15K52k82j21k17M17j25P4k0j38P9K7j78
4494a45K06k45N1P6L3oj58J58L9K72m10K80k03L3K99m33J05K38l08J59R4j9r6
4517B0J56K43l50j12J88n0L9k48m4J74J22O1l51M8o1K01k3j17O4O1k06J79J72
4540A66j17KL1q7J05j34m7KR0PK5J9o6j81K48r0j29J73k95K06M2j56K50N1j55
4565d0r2J99r7K0jj30L14J01j61k39J81K7r3J21r9L5l3j83K74j64j55K95j68j72
4589b60M78k33J36j98M4k43J93JJ46r0k0J12k30o8L76k50J26j89O3J1m4M23n08
$$ plain form
4612 -224 -222 194 67 342 64 312 307 113 -16 103 -86 -40 54 179 -301 31 -7 -336 0 -88 -48 -5 -150
4635 -150 93 126 -123 236 238 -130 -12 35 117 206 -65 -7 -48 224 18 -204 240 -4 -7 191 -202 -190 -181 105
4659 105 -120 -108 -85 -83 114 -8 -132 156 80 109 62 192 -111 87 -122 -197 -47 50 -11 -4 263 -39 -189 -3
4683 -3 -58 -71 -22 -269 -193 -111 -166 -53 -181 64 55 -33 117 232 81 84 -9 69 -131 28 173 177 -29 -20 -8 45 55
4710 55 72 -120 -131 -70 -130 -83 -103 71 151 -96 -1 -98 39 133 166 19 -31 143 -28 -46 -44 15 65 -86 100 88
4736 88 -31 -136 47 -78 -189 -151 105 -81 -57 53 -121 69 150 -182 86 -43 38 60 138 -68 97 266
4758 266 -139 45 51 124 -64 -22 -120 -68 35 121 -18 -229 -84 252 50 -193 122 48 15 58 -129 107 98 -180
4782 -180 143 -127 85 198 36 55 54 28 -34 -34 -39 -32 -263 95 56 -6 12 64 242 0 81 188 57 -45 83
$$ packed form
4612b24KM16j27K75k78K48nj94j29J19j89M6R4J25m80L32l8l29L36q8M0M3j45
4635a50K43L3k49L59Kl68J18M7Q2Q9k71N8m1K72k06k22M44k44lJ98l93J2RK86
4659A05k25J2K3KJ97j22j24K88p6K9m7J30l03J98k09p5J50R7o1PK67l02j50J86
4683cn5j3M9k47P6Q2n5J13j28K45rq8J50J15j51Lr3P8k00J59J45Mk06RJ2N3J0
4710E5J7j92j1O1o0M7k0J74Q0k47R5r7J37R4L3j47n0J74j71j8KN9N0j51J86j2
4736H8j19j05J83j25j11L8K56j86K4J10j74J90Q1l32K68j29Q1K2P8k06J65J69
4758B66m05J84OP3j88M2r8N2J03Q6j39k11J45L36k02k43L15p4l3M3j87K36rk78
4782a80L23k70K12J13j62J9jk6o2%nPk31L58l9o2J8N2J78k42Q1J07j31j02J28
$$ plain form
4807 83 -66 39 84 89 262 -83 -199 -138 -63 -383 -96 215 -176 10 -59 182 -28 -201 -232 51 52 -255 121
4830 121 -57 83 61 -145 370 5 -147 103 51 31 294 -29 -195 -113 -265 39 -31 -113 -34 -65 -6 -85 5 91
4854 91 105 54 61 120 228 -288 70 41 2 -70 -34 345 -155 -44 -70 -197 -196 166 -129 -214 -164 -12 -34 -154 -115 177
4880 177 -183 122 22 131 -22 -7 -38 296 30 -145 72 258 -169 113 -8 -127 244 -124 100 146 -36
4901 -36 -13 76 36 -21 -53 -44 -177 33 -53 92 299 68 -59 44 314 97 94 -333 -65 -143 110 20 -98 289
4925 289 142 65 67 -8 -87 22 217 1 -48 -185 -61 70 -97 -99 -92 -119 -114 37 170 -117 38 50 -104 290 -130
4950 -130 300 8 -64 115 223 279 8 -35 -55 -109 -214 -131 230 0 -114 85 90 -50 -86 55 -73 -111 -31 -188
4974 -188 -197 -2 -19 180 -193 4 16 32 229 23 -82 -129 129 60 52 54 -12 141 -176 51 103 72 -90 -155 68
$$ packed form
4807H3j49J05M5NJ73l45j16O1P5l20K87L11l91J86o9K41k10j73l1K83Jl07L76
4830A21j78J40k2k06N15l65j52K50n2k0K63l23j66Q2j52L04p0q2P9l1N9p9R0Q6
4854I1J4n1PN9J08n16L58k9l9p2L6L79n00J11k6j27JL62k95q5N0J52k2j20L9K92
4880A77l60L05j00J09j53J5l1L34k66j75K17J86m27K82j21j19L71l68K24M6j82
4901c6K3Q9m0n7l2Rj33K10q6J45K07k31j27J03K70k17lm27K68p8K53r0j18L87
4925B89j47p7Kp5p9J09J95k16m9j37J24J31j67kPk7NJ51J33k87J55J2j54L94m20
4950a30M30k92p2J79J08N6k71m3k0n4j05Q3L61k30j14J99Nj40l6J41j28l8Q0j57
4974a88rJ95j7J99l73J97J2J6J97k06j05m7K58o9qKo6J53l17K27N2l1j62o5K23
$$ plain form
4999 68 16 -281 164 -13 72 -82 -23 -24 -168 -79 40 129 195 -231 -97 56 -27 127 112 -81 84 274 99 108
5023 108 -166 -37 -63 -176 -282 -192 -206 48 55 -8 -220 5 101 -173 2 259 -9 29 130 -186 93 -40 145
5046 145 -26 78 131 -120 -19 -26 -220 -109 -152 360 -43 -65 -5 -21 -11 -108 -98 -125 -133 -105 122 -260 -115 -132 199
5071 199 197 65 -219 101 -178 243 212 109 430 74 57 -123 218 -44 43 75 3 -102 -166 -79 -233 -118 -16
5094 -16 -160 -18 -86 8 -39 113 102 -286 95 -274 -31 -9 182 47 -32 -94 -133 -87 -28 -49 139 -190 -52 -31
5118 -31 35 177 28 -140 84 -287 63 -42 -121 176 -125 182 71 -163 -161 -80 147 96 42 -4 12 286 89
5141 89 131 -262 25 -113 44 121 13 -112 90 142 -17 -201 -104 -126 -8 24 179 138 -85 31 -187 78 -166
5164 -166 -221 -88 105 -77 -212 124 -92 -25 -71 -57 78 -128 226 161 -214 86 -13 43 -115 25 -165 -201 61
$$ packed form
4999F8n2k97M45j77Q5j54N9jj44Q9J19Q9O6m26J34J53q3J54j5j93J65J90j75R
5023A08k74J29k6j13j06R0j4K54Po3k12K25R6k74J75K57k68L8J01l16K79j33J85
5046A45j71J04N3k51J01pj94J11m3N12m03k2O0j6J0r7J0k7qK8K27l82J45j7L31
5071A99kj32k84L20k79M21l1j03L21l56j7j80L41k62Q7L2p2j05o4Q7j54J15J02
5094a6j44J42o8R4m7J52j1l88L81l69K43K2J91j35p9o2l9M6N9k1J88l29J38K1
5118c1O6J42j49j68K24l71L50j05p9K97l01L07j11k34KQ1K27n1n4m6J6K74j97
5141H9M2l93K87j38J57P7j08j25K02N2j59j84R7k2J18L2J55m1k23J16k18K65k44
5164a66n5J33J93j82j35L36k16O7m6J4J35k06L54o5l75L00r9N6j58J40j90l6K62
$$ plain form
5187 61 -242 -106 -234 85 -30 -65 55 222 104 -39 209 215 130 226 -19 99 284 56 89 255 22 -41 134
5210 134 -145 15 -449 158 27 -75 151 263 -155 122 -142 -350 16 58 101 -70 -75 45 -169 55 -35 -61
5232 -61 7 30 26 -33 241 -92 63 -39 290 65 -87 40 129 -80 160 -116 45 -179 -168 -195 165 16 -193
5255 -193 -247 119 209 278 -87 39 -170 264 -11 -186 357 -75 -134 212 -103 124 -52 -341 -46 162 -119
5276 -119 168 -84 -82 -228 48 4 173 116 46 3 18 215 189 219 -59 59 82 262 -67 36 58 -66 90 147
5300 147 25 -112 -115 80 -70 -184 -161 126 -133 -147 26 38 136 52 114 -113 -107 -85 -127 -118 -30 78 15 85 211 92
5326 92 -90 309 52 -120 64 187 210 25 164 -218 206 20 -179 106 -110 -86 145 12 115 -257 -85
5347 -85 -45 -6 86 -68 -26 -34 -208 -8 20 -150 -76 182 -142 -73 -20 88 165 -131 -58 141 -1 37 -298 26 165
$$ packed form
5187F1l03J36j28L19j15l5J20J67j18j43K48Oq5R6k45J18J85k28L3J66k33o3J75
5210A34k79J60m64O07j31j02K26J12m18K77k64k08L66M2M3j71nJ20k14K24r0k6
5232f1O8K3mn9K74l33J55j02L29k25j52J27Q9k09K40k76J61k24J1k7L60j49k09
5255a93n4L66R0O9l65J26k09M34k75j75N43m32n9L46l15K27j76k89K95K08k81
5276a19K87k52Kj46K76m4J69n7p0m3J5J97k6L0k78J18K3J80l29J03K2j24J56N7
5300A47j22j37lJ95j50j14K3K87k59j4J73J2R8q4O2k27OK2m2RQ8J08o3P0J26j19
5326I2j82L99k57j72J84J23K3j85J39l82M24j86j99K85k16K4K31j33J03l72J72
5347h5M0L9R2j54M2qj74K00K8j70P4K58l24O9N3J08P7k96P3J99j42L8l35L24J39
$$ plain form
5372 165 -12 -3 178 -18 -83 38 48 -1 -227 34 -276 -272 -145 -193 -115 88 3 120 -83 31 -111 -30 147 108
5396 108 -192 -120 -37 -1 -65 21 113 -186 -59 -50 59 -36 -135 -241 -123 71 106 -41 -41 25 168 13 231 -80 172
5421 172 82 -134 116 241 -57 46 33 -191 -251 -60 72 -187 -261 80 -339 58 -111 100 -109 -203 -37 -1
5443 -1 186 -238 -119 104 -54 -37 229 29 -5 412 171 -46 96 -70 -26 24 36 248 -175 -169 170 -241 79
5466 79 -75 135 172 -323 149 -117 -14 -216 24 95 -197 -182 6 -223 -192 40 -48 68 -101 -66 -9 32 -99
5489 -99 57 -2 44 7 -74 -20 -91 36 81 -83 -88 125 60 -72 -82 -188 69 100 -12 81 155 -203 94 -22 33
5514 33 256 -27 -5 51 52 121 -74 136 2 177 -195 -43 123 55 52 -82 116 20 109 -115 -222 63 186 -103
5538 -103 42 33 160 75 29 185 -50 -60 235 300 97 -67 -63 -50 -3 102 -27 107 -55 -245 -160 -171 -33 -17
$$ packed form
5372A65j77RJ81j96o5J21J0m9k26K61l10MJ27m8P8K03q5J17k03J14j42Q1J77l9
5396A08l00P2Q3L6o4Q6R2k99J27RJ09r5r9j06J18J94L5j47%O6J43j55K18l11K52
5421A72r0k16K50J25k98J03j3k24o0J91J32k59p4L41m19L97j69K11k09r4J66L6
5443aJ87m24J19K23j58J7K66k00l4M17k41k17J42j66M4N0J2K12m23OL39m11L20
5466G9j54K10L7m95M72k66J03k02K40P1k92J5J88k29L1K32q8J16j69L5N7M1j31
5489i9J56n9M6l7q1N4p1J27M5j64nK13o5j32j0j06K57L1j12R3P4l58K97j16N5
5514C3K23k83K2N6JO9j95K10j34J75l72J52J66o8lj34J98r6Q9k24j07K85J23k89
5538a03J45rJ27q5m6J56k35j0K95O5k03j64MJ3M7J05j29J34j62j90Q5j1J38J6
$$ plain form
5562 -17 -146 -426 124 22 -51 140 117 -215 -102 -65 -50 -123 128 -79 134 70 -67 207 193 -99 -13 5 101 -1
5586 -1 133 103 172 95 -32 -135 -99 -58 -79 73 -302 -206 71 -73 45 51 80 143 3 -1 -10 101 266 41 71 287
5612 287 -135 -1 -128 177 74 -184 -92 -45 16 -57 -65 -160 69 -188 -63 89 -239 220 -157 51 194 -243
5634 -243 -116 -201 186 -158 12 -77 -11 -117 28 116 -15 -243 64 -75 -208 -255 143 211 167 85 4 262 -209
5657 -209 22 -71 -214 -15 75 -7 -162 -150 -54 -66 117 144 35 213 -246 -35 -78 62 23 -61 -9 -71 -78 117 -66
5682 -66 -93 -74 207 -18 2 116 51 52 105 4 -187 26 32 13 6 -261 173 -135 91 35 -23 -226 -5 31 -119
5707 -119 30 71 24 114 253 -4 -41 137 171 40 57 23 275 67 88 163 -1 92 -171 94 32 43 128 92 -57
5732 -57 -10 12 138 35 370 14 117 68 23 113 47 -193 106 47 -101 -55 85 81 -84 -95 -11 -66 -84 115 -55
$$ packed form
5562a7j29k80N50j02p3J91k3l32J13L7J5p3K51k07K13o4j37K74j4k92Q6J8R6j02
5586aJ34l0O9p7j27j03L6M1k1J52l75R6K77j44J18OK9O3j40mrJ11J65k25L0K16
5612B87m22J34j27L05j03k58R2M7O1p3qr5K29k57J25J52l28M59l77K08J43m37
5634b43J27q5L87l44J70q9O6j06J45Q8j31k28L07j39j33m7L98O8m4q2q1K58m71
5657b09K31r3j43J99R0q2j55J2R6j2J83K7j09J78m59K11m3J40l9q4N2o2pJ95j83
5682f6k7J9K81k25K0J14o5JN3j01j91K13Oj9pk67M34l08K26n6n8k03K21L6j50
5707a19J49M1m7R0J39k57l7J78L4j31J7l4K52k08K1P5j64R3k63K65o2J1Q5l6j49
5732e7M7K2J26j03L35l56J03m9m5R0o6k40K99n9j48M6J40mj65j1Q4n5j8J99j70
$$ plain form
5757 -55 325 111 -204 203 -130 210 55 306 20 -120 3 -7 7 -9 160 68 -237 -233 -23 -173 -75 -105 -251
5780 -251 -176 -37 83 14 -82 14 -34 -183 35 114 -201 -53 13 -75 -172 -1 209 -136 112 114 84 -56 68 53
5804 53 78 -74 -108 -127 32 -2 -56 -107 111 50 -44 111 94 128 40 96 139 -12 -54 122 207 -77 -135 26 157 166
5830 166 -65 -83 -233 99 -1 2 -73 89 -75 8 250 -94 80 289 70 -106 -142 -75 12 -88 -94 39 40 -45
5854 -45 -50 120 -74 121 121 18 201 -135 75 15 -163 186 256 -46 113 -114 -56 189 11 47 -2 -95 20 -61
5878 -61 -48 -36 -135 -119 21 102 42 115 -57 74 34 -38 3 -252 39 72 -162 323 -60 140 44 119 -91 -40 -67
5903 -67 -4 -109 -140 93 10 102 -123 -12 -156 -66 58 -264 -120 -306 66 -136 -135 -3 -9 -8 -177 148 -19 4
5927 4 207 -92 -66 129 -219 16 107 -62 20 -35 -214 -141 -155 -218 -46 23 -74 -2 148 -6 -50 -6 118 -31 25
$$ packed form
5757e5L80k14l15M07l33L40j55K51k86j40J23j0J4j6J69r2l05MK10j50R8l0j46
5780b51P5J39J20o9r6R6m8j49K18P9l15J48O6q8r7J71K10l45K48Kl0j40J24j5
5804E3K5j52l4j9J59l4n4n1K18o1r4J55j7L4q8N6M3j51m2J76Q5k84n8J61J31R
5830A66k31j8j50L32j00Lp5J62j64Q3K42l44J74K09k19j76l6O7Q7j00oJ33Jq5
5854d5nJ70j94J95%j03J83l36K10o0j78L49P0l02J59k27N8K45j78L6m9r3J15q1
5878f1J3J2r9J6J40Q1o0P3j72J31m0p2M1k55K91L3k34M85l83K00r6P5k10N1k7
5903f7O3j05l1K33q3R2k25J11j44R0J24l22J44j86L72k02JJ32oJj69L25j67K3
5927DK03k99K6J95l48K35R1j69Q2n5j79P3j4o3J72O9r7P2J50j54m4M4J24j49N6
$$ plain form
5952 25 8 99 1 99 45 -33 162 -189 129 -101 -95 -61 143 93 -242 62 -140 -299 26 65 34 69 86 -72 -86
5977 -86 -76 145 -109 354 -131 -55 36 153 108 73 294 48 -110 -1 -54 -72 223 -135 250 166 -60 -117 -34 -202
6001 -202 -78 45 -28 -309 -39 -26 -129 58 -20 -20 79 -39 67 168 -109 15 129 35 149 -41 -98 -27 118
6024 118 -31 -264 150 132 81 34 -26 101 -77 76 -28 96 135 275 -20 -24 108 31 142 91 70 51 185 64
6048 64 -14 -141 -15 77 -86 -51 174 161 141 -178 269 -121 55 18 -327 -150 -57 30 6 -69 -232 67 49 140
6072 140 -138 62 -72 -187 -21 -158 82 143 -118 66 40 -1 38 143 -41 -331 -46 -155 -238 109 -86 3
6094 3 211 97 6 112 -6 41 -131 26 -17 17 96 81 -103 -47 -67 65 99 -33 -57 -3 -96 -124 -53 209 163 17
6120 17 108 -177 -122 23 -41 3 71 122 -198 -124 -171 50 41 164 -28 -225 -114 35 130 -31 -24 74 4 156 7
$$ packed form
5952B5j7R1r8R8n4p8J95l51L18k30OL4K04n0l35L04k02j59L25L9l1L5J7j58j4
5977h6J0K21k54M63m85P6R1J17m5l5K21k46j58J09n3j8K95l58L85q4k26n7Q3j68
6001b02J24J23p3k81K70J3j03J87p8%R9j18J06J01k77J24J14r4J14j90n7P1J45
6024A18j49k33M14j8n1m7o0J27j78J53j04J24L9J40k95mJ32p7J11n1k1j9J34j21
6048F4p8j27J26R2j63L5K25j3k0l19M47l90J76l7l45J77R3Q7k4p5j63K99j8R1
6072A40k78K00j34j15J66j37K40O1k61J84k6m1L9J05j84k90K85j09q3L47j95Q9
6094CK08j14r1J06j18M7j72J57m3L4P9j5j84N6k0J32L4j32k4N4r3k8P1K62m6j46
6120A7R1k85N5J45o4M4O8N1l20P4m7K21rJ23j92j97J11J49R5j61PR8p0J52j49
$$ plain form
6145 7 249 -37 -87 127 -95 42 41 -247 243 -98 68 -209 -148 241 -231 100 101 95 243 -88 -135 234 46 217
6169 217 44 257 -29 21 -173 -169 244 -93 -19 61 -31 32 -59 -86 -248 -185 129 -42 -44 -26 210 222 85 79 -114
6194 -114 -154 93 -223 -131 18 -209 227 73 22 136 -106 -62 45 248 271 -43 12 -140 44 -129 -84 -10 30
6217 30 -76 -148 -42 72 142 249 0 26 -101 -24 49 -110 88 22 -129 -103 -42 -108 116 -19 -6 -193 155 -173
6241 -173 -127 73 144 -23 109 -119 21 -157 -136 -33 47 151 27 -322 -148 284 -303 -26 24 141 63 -90
6263 -90 100 -12 -121 -140 169 124 -97 230 -216 43 -175 147 60 83 113 -57 124 19 -219 -110 41 -24
6285 -24 -140 -165 -113 -40 -183 56 -98 -4 78 -45 12 117 107 -74 16 -271 23 -174 91 273 132 52 -154
6308 -154 221 -52 50 -35 -128 -46 -264 49 -309 -172 53 223 -128 -48 69 -24 78 -6 58 -171 58 251
$$ packed form
6145GK42k86n0K14k22J37jk88M90l41J66k77O1L89m72L31JoJ48l31m7L69j88J71
6169B17j73K13k86N0j94MM13l37P4Q0r2O3r1k7j62O3L14j71kJ8K36J2j37oj93
6194a14m0K47l16R2J49k27M36j54n1J14k42M4J07K03K3l14N5j52J84j73M5P4M0
6217C0j06p2J06J14P0J07k49K6j27P7P3j59J98o6j51K6O1o6K24j35J3j87L48l28
6241a73M6K00P1j67J32k28J40j78K1J03Q0J04j24l49J74M32n87K77N0J17p8j53
6263i0J90j12j09j9L09m5k21L27m46K59k18L22q7K3L0j70J81j05k38J09J51o5
6285b4j16k5N2P3j43K39j54R4Q2j23N7J05j0j81R0k87K94j97K65J82j41q0k06
6308a54L75k73J02q5r3Q2k18L13l58J37K25J70l51Q0J17r3J02q4O4k29K29J93
$$ plain form
6330 251 -44 23 74 -78 -154 211 8 60 -20 -132 -50 91 -23 -51 241 80 14 -127 -249 -167 -2 -55 22 -134
6354 -134 20 -86 -162 -55 251 -63 -105 -192 -110 33 -101 -205 -145 -71 -29 -101 147 107 -8 39 7 152 -85 51
6378 51 117 65 330 -16 -17 240 84 -144 -28 -36 -34 -53 96 -179 114 62 -123 71 208 33 -185 46 75 27
6402 27 -99 -178 -26 -63 124 -200 -105 70 -124 23 135 102 -102 -20 256 227 132 -89 128 77 -27 35 -39 354
6426 354 69 -190 2 -100 15 180 185 79 -222 -77 76 57 -57 -61 219 -72 -23 104 -62 -148 95 -62
6448 -62 55 -72 -66 313 228 49 83 54 40 -81 -28 309 -94 134 -157 57 6 181 -143 -90 -253 243 -85
6471 -85 5 -154 -98 49 -21 190 -169 -95 -35 -43 -77 -205 -95 157 -46 136 -115 -255 81 175 163 -194 -70 -29
6495 -29 -56 136 -77 113 -253 73 -184 -82 -171 -125 19 19 -43 -68 -130 160 128 -69 166 169 -58 -240 47 183
$$ packed form
6330B51k95O7N1j52p6L65k03N2q0j12Q2J41j14k8K92j61o6j41j22Q2J65n3P7j56
6354a34J54j06p6J07L06l14m2q7Q2J43j34j04O0P4M2p2K48m0j15M7l2J45k37J36
6378E1O6n2K65l46jK57j56k28J16qKj9J49k75K93n2j85J94J37j75k18K31K9m8
6402B7j26p9J52l7J87l24R5J75j94J47J12l3k04Q2K76k9r5k21K17n1j04O2p4L93
6426C54k85k59J92j02J15J65Nj06l01J45J53j9j14mK80k91M9J27j66q6K43j57
6448f2J17j27OL79q5j79L4k9j4j21N3L37m03K28k91K14n1J75l24N3j63M96l28
6471h5R0j59N6J47p0K11l59P4O0ql4j28J10K52k03J82k51j40L36R4j2l57J24M1
6495b9k7J92k13J90l66L26k57J02q9M6J44%o2k5o2K90l2j97K35Lk27j82K87J36
$$ plain form
6519 183 -4 -36 76 41 -193 19 -163 -39 91 169 -130 254 142 -194 -3 -314 70 56 -63 -126 207 155
6541 155 -141 -127 188 12 -191 332 -87 -42 124 -127 -2 66 141 -34 374 -240 -70 -163 175 137 -109 -159
6563 -159 -54 -244 -227 81 -17 86 171 -45 53 -92 -155 196 155 219 -148 25 -43 -94 276 76 -82 -51 119
6586 119 -51 -105 -9 131 -157 -257 -174 -2 -87 -127 38 -61 164 171 -76 21 250 -108 -235 -105 -87 -37 164 -126
6610 -126 -64 132 -89 20 -66 -32 -65 8 23 23 -160 51 -42 42 137 19 48 -8 -64 -73 194 -28 115 -2 -34 -44
6636 -44 81 -37 16 10 196 -98 -180 105 53 24 -7 18 10 83 100 -77 24 -84 -19 -218 -4 -24 -89 -111 248 18
6662 18 162 29 68 -28 136 227 47 -15 -170 -11 -146 96 -167 -143 40 -9 -163 88 -193 -62 253 -33
6684 -33 -88 -39 23 -393 -82 -50 -309 -131 15 -25 -47 -340 338 65 80 -33 -105 84 8 62 4 58 -108 32
$$ packed form
6519A83j87l2J12l5k34K12j82J24J30P8k99L84j12l36J91l11L84j4j19o3L33n2
6541A55k96J4L15j76k03N23m19M5J66k51J25O8P5j75M08o14J70r3L38l8k46n0
6563a59J05j90J7L08r8J03Q5k16R8j45o3L51m1O4l67J73o8n1L70k00j58L1J70
6586A19j70n4R6J40k88j00Q3J72q5m0J65r9K25Pk47R7K29l58j27J30J8N0K01k90
6610a26O2J96k21J09q6L4l3P3J5%j83K11r3Q4R5j18K9n6n6rK67k22J43j17l2j0
6636d4J25j18N3oJ86k94q2K85n2k9l1K5qP3J7j77J01j08O5j99K14k0o5k2L59k30
6662A8J44j33L9r6J64R1j80o2j55J59j35K42k63K4J83m9j54K51k81J31L15k86
6684c3n5M9O2m16L11L2k59J78J46m0k2k93O78k73J5j13p2J89p6N4n8N4j66J40
$$ plain form
6708 32 -89 -28 -207 -129 12 -6 -63 -121 73 78 -61 -151 35 -71 -334 -38 52 41 7 171 122 -39 134 -182
6732 -182 54 -2 40 91 -26 269 -13 -1 47 74 -251 40 -192 -216 -33 92 -208 106 -78 22 75 150 121
6755 121 28 -124 -242 -166 -107 10 -30 171 146 159 71 55 -157 -116 -162 0 161 15 130 66 -31 69 31 87 -119
6780 -119 161 138 -80 -128 -212 -82 -67 0 3 27 226 145 -121 -215 -69 132 -65 -44 13 153 -70 190 -2 -6 136
6805 136 -88 51 276 111 -161 1 152 136 -19 -47 -198 -142 -129 -100 120 7 51 -65 61 354 -114 -80
6827 -80 131 -298 142 -42 -10 59 185 -42 -26 150 -38 -166 -5 285 -20 122 -144 -34 329 117 -39
6848 -39 -220 77 -167 -140 -131 -171 -15 -5 10 92 -24 95 -90 -27 82 -103 -35 319 -39 231 -86 91 37 102
6872 102 228 -6 -208 -21 32 -161 -268 -74 -131 -329 227 -138 94 17 -297 -139 22 -184 -10 36 312
$$ packed form
6708C2j21O1j79P8J41j8n7n8J94Nj39r0J86j06k63K96R0j1l4J64m9j61J73l16
6732a82K36n6M2N1j17K95k82J2M8K7l25K91k32k4J83J25l00L14j84J00N3P5k9
6755A21r3j52j18P6N9J17m0K01k5J3q8j6k12M1m6J62J61j46J15o4r7J00l8N6k06
6780a19K80k3k18m8q4J30J5O7LK4J99q1k66r4J46K01j97K1N7J40k23K60j92mJ42
6805A36k24J39K25j65k72J62J51j6j55k8j51N6J3K9K20j13M4j16J26K93m68L4
6827h0K11m29M40j84L2O9J26k27J6J76j88j28J61K90l05J42k66J10L63k12j56
6848c9j81K97k44K7Rm0J56J0J5Q2j16J19j85O3J09j85O8L54l58K70l17J77n4O5
6872A02J26k34k02J87N3j93j07J94n7j98N56l65K32p7l14J58J61k06J74M6K76
$$ plain form
6893 312 210 145 40 111 -26 28 42 -50 -199 -3 3 168 -70 -237 -8 -22 -45 155 -14 -185 -194 -192 -100 -297 -54
6918 -54 -27 181 102 -212 63 -45 -65 -97 -47 99 40 -26 -150 -138 47 -14 147 -141 180 136 17 248 12 79
6942 79 31 166 69 -53 2 -68 -120 -66 296 -80 136 10 -108 101 25 10 -48 131 -96 -6 -111 163 -153 -118
6966 -118 -35 86 -435 21 -169 -121 73 -108 -8 -16 -163 72 -114 -45 -271 160 30 110 183 -36 -73 105 -54
6989 -54 -108 45 -5 -61 196 160 -24 31 56 -131 -70 -25 34 -129 -96 162 -37 -72 -100 -4 -63 42 -120 134 252
7014 252 284 156 182 -60 42 83 31 313 -255 0 -61 -11 232 131 32 -102 113 116 32 271 58 142 88 -108
7038 -108 -228 -38 171 -111 -48 85 37 -83 -162 -7 -33 199 29 139 87 52 -21 46 -37 -104 199 105 -5 -124
7062 -124 -190 -12 -43 32 -51 -17 -63 -149 205 4 -92 -135 -103 398 -72 65 147 -37 -43 21 89 -48 -113 302 -166
$$ packed form
6893C12j02o5j05P1j37N4J4r2j49J96OJ65k38j67K29j4k3K00j69j71rKR2j97K43
6918e4K7K08p9l14K75j08k0l2N0J46n9o6j24J2J85o1J61k88L21m4j19K31k36O7
6942G9m8J35r7j22N5p0n2N4L62l76K16j26j18K09p6j5n8J79k27R0j05K74l16L5
6966a18Q3J21n21M56j90M8J94j81J00qj47K35j86O9k26M31j30Q0P3k19l7J78j59
6989e4n4J53n0n6K57l6j84N5K5j87O1M5N9j63L3K58j99l5k8R6n9J05j62K54J18
7014B52L2j28K6k42J02M1n2K82n68K55o1N0K43j01r9j34K15Lq4K39k13Q4n4j96
7038a08j20J90K09k82O3J33m8j20p9J55k6K32j70J10n2l5p3O7q3o7L03r4j10j19
7062a24o6J78l1P5q3L4m6q6L54k01r6m3L2N01m70J37Q2j84oO4O8j37o5M15m68
$$ plain form
7087 -166 26 1 -88 14 -30 75 43 57 -146 84 -100 27 37 -127 60 -43 217 -40 -148 -99 98 -31
7109 -31 132 25 -181 -55 -23 -116 101 -137 -56 -211 -79 205 -34 12 -16 -62 -251 -58 -31 -25 34 139 -47 -97
7133 -97 29 -42 124 48 -110 -28 3 135 93 14 -153 85 14 -58 -342 94 97 100 258 247 -6 117 -151 -320 141
7158 141 135 -40 46 -113 -31 96 77 39 4 -95 -141 -86 -27 115 -211 -131 29 108 13 6 85 116 17 -33 -111 126 -77
7185 -77 0 -221 5 150 70 -123 -35 32 -46 13 42 193 -60 -327 -88 40 -99 -156 -172 -33 81 -12 168 125
7209 125 140 72 89 64 -149 182 -145 0 26 190 62 213 -128 -285 76 171 19 169 -322 128 127 97 226
7232 226 -154 -336 -145 -70 97 -44 -178 10 35 -99 -11 -153 -63 73 43 -5 193 -101 229 -55 -154 24
7254 24 -111 6 68 192 73 -69 -259 259 28 132 25 185 17 97 180 -67 -7 1 290 186 -19 -97 186
$$ packed form
7087a66J92k5q9J02m4J05l2J4k03K30j84J27J0j64J87j03K60k57j08M9J97j29
7109c1J63j07k06J26L2r3K17k38Q1j55J32K84k39M6k8m6j89J93K7ON9J05j86n0
7133i7J26p1J66p6j58Q2L1J32m2p9j67K38p1p2k84M36LLJ58j1k53J23k68j69M61
7158A41oj75Q6j59Q2J27j9l8l5r9m6N5N9J42l26Q0J60P9r5pP9L1r9n0p8K37k03
7185g7P7k21K26J45q0j93Q8O7p8N9K9J51k53k67K39J28j39n7j6J39J14r3J80m3
7209A25J5o8J7k5k13L31l27J45K6J64j28J51l41j57L61R5j52J50m91M50jl0J29
7232B26l80j82J91P5J67j41j34J88K5j34Q8j42R0J36l0m8J98k94L30k84r9J78
7254B4j35J17O2J24j19j42j90N18k31J04j07J60j68Q0Q3k47O0QK89j04k05p8K83
$$ plain form
7277 186 50 -3 -90 134 167 -116 97 -326 -31 -132 -3 6 120 -277 -259 60 -130 -177 82 91 -34 76 218
7300 218 89 232 73 68 178 -37 -110 -141 0 143 39 -143 -213 -115 -36 -77 -83 79 -65 25 211 188 -78 -185
7324 -185 43 31 -35 35 103 -124 70 -52 -107 -29 -8 -179 -130 -163 -93 -193 -98 -124 -41 56 77 179 -90 125 48
7349 48 37 133 -71 60 233 53 81 -111 -168 -4 -74 6 -14 -94 -96 66 -238 40 -32 -16 -129 -81 6 -226 206
7374 206 87 -131 -91 148 115 -39 -84 82 -28 85 126 -49 -198 -150 -56 -199 249 -2 -89 86 62 39 135
7397 135 -122 109 111 77 29 -207 -177 -45 290 -29 32 -89 139 16 72 151 -187 -20 -19 -100 7 235 190 29
7421 29 92 -12 132 -61 244 144 0 69 -150 118 -38 -72 -174 105 -263 302 55 -163 -160 12 110 -194
7443 -194 -155 -113 243 -97 93 73 116 106 93 176 282 11 -157 -102 -82 63 189 -21 -154 -30 78 -249 -8
$$ packed form
7277A86j36n3q7K24L3k83K13m23K95j01J29RJ14l97J8L19j90m7K59Rj25J10J42
7300B18j29J43j59nJ10k15p3l1J41J43j04j82p0R8P9m1oJ62j44R0J86k3k66j07
7324a85K28j2o6P0O8k27J94j22n5P8K1j71M9l3P0j00R5k6Q3R7K1J02k69K15p7
7349D8j1R6k04J31J73j80K8j92n7J64p0Q0k0q0kJ62l04K78p2J6j13M8Q7k32M32
7374B06j19k18M0K39l3j54m5J66j10J13M1j75j49M8R4j43M48k51q7J75k4k3R6
7397A35k57K31Kl4m8k36L0J32L35l19O1j21K28j23N6P9l38J67Jq1J07K28m5j61
7421B9O3j04J44j93L05j00j44O9k19K68j56l4j02K79l68N65k47k18LJ72R8l04
7443a94L9M2L56l40J90k0M3j0j3Q3J06k71j68N5K0J45J26k10j33J24J08l27K41
$$ plain form
7466 -8 62 178 82 -123 32 75 128 -91 -153 238 133 52 -93 165 131 122 -154 73 49 67 100 -67 65 -71 230
7491 230 140 72 -63 -223 -32 93 -253 -228 49 -80 -180 -12 134 120 57 14 112 3 42 107 144 -21 17 57
7515 57 4 2 -150 -57 141 -82 -138 33 190 -51 85 -250 54 86 -203 234 61 61 -38 86 -204 204 -30
7538 -30 -21 -69 213 -232 121 194 42 -40 -113 90 45 -129 135 -137 138 170 82 -81 -93 145 -8 430 -137 -56
7562 -56 -83 188 169 204 -79 9 257 132 90 86 -151 -45 -281 73 11 -88 45 -44 -28 148 180 -46 146 -89
7586 -89 105 -70 203 -18 110 27 17 8 -257 -29 268 15 120 -67 -62 77 -98 -127 64 -31 -36 152 -210 -111
7610 -111 -130 245 99 -69 37 78 -280 -17 -121 60 81 -142 -68 19 -4 -202 -178 118 124 -157 87 -45 160
7633 160 54 -135 34 64 -106 -67 66 -91 51 170 169 299 233 159 -60 -160 69 512 74 70 -55 -91 -14
$$ packed form
7466hP0J16r6k05J55M3N3k19o2L91j05q1j45K58l4rk76K27k4J8L3j67J32j36L01
7491B30r0o8j35j60J91J25l46K5K77j29j00J68J46j4o3m3R8j09L9O5L7j65L8M0
7515E7n3kj52R3J98k23n6J71J57k41J36l35L04L2k89M37j73%r9J24k90M08k34
7538c0Rm8K82m45L53P3j52q2p3K03m5j74K64k72K75L2q8j63j2K38j53M38n67Q1
7562e6k7K71j9L5k83Q8K48j25m2mk37J06k36L54o2r9J33q9J6J76L2k26J92k35
7586h9J94j75K73k21J28q3j0rk65K28K97k53J05j87NJ39j75k9J91r5nJ88l62R9
7610a11j9L75j46j68J06M1l58K63j04J81K1k23P4Q7k3j98K4K96Ok81K44j32K05
7633A60j06j89J69L0j70L9J33j57J42J19jJ30o6p4k19j00K29M43m38mj25l6P7
$$ plain form
7656 -14 -174 42 2 -192 10 89 -182 42 55 -41 39 101 127 -69 -271 289 -1 -415 19 -273 190 217 -63
7679 -63 -96 -229 223 -211 49 43 34 -49 -68 -62 97 -88 0 -93 48 192 -65 36 184 132 -11 -26 21 6 -143
7704 -143 45 -13 178 -35 -8 48 6 -18 72 -169 171 -82 5 -35 -215 165 56 -193 50 -108 179 -53 158
7727 158 -97 58 0 -33 -73 -212 51 -140 -59 45 77 -133 31 -169 145 -65 71 -232 -77 -175 -139 -124 69
7750 69 -93 -171 -27 4 -177 -83 -110 124 183 -16 -2 128 164 62 127 -31 82 111 -135 -70 -173 81 -272 -8
7774 -8 202 -56 63 -59 -18 38 -227 -204 -193 181 88 -74 83 -105 75 163 25 66 -54 76 -151 50 208
7797 208 -91 -31 89 106 112 197 -180 102 -41 35 -91 16 -191 8 -58 60 -64 -33 45 -47 142 47 -196 -85
7821 -85 -160 -128 -153 -346 142 -180 -34 82 -101 -61 14 74 41 144 145 145 -165 -19 -23 -83 -65 159 111 -130 -221 178
$$ packed form
7656a4j60K16m0j94K02P9k71K24J3r6Q0O2K6j96k02N60k90m14M34k92M63K7k80
7679f3l3j33M52m34K60orq3j9OJ59j85Q8r3J41J44k57J01J48n2j43j5M7j5j49
7704a43J88n8J91k13K7N6m2k4R0k41L40k53Q7m0j80L80j09k49K43j58K87k32K11
7727A58k55J55n8l3m0j39K63j91Q1J04L2k10J64k00L14k10J36l03J55r8L6J5J93
7750F9j62p8J44L1j81R4k7K34N9j99J4J30L6j02O5j58J13K9k46O5j03K54l53K64
7774hK10k58J19j22M1N6k65K3J1L74r3j62J57j88J80Q8j38M1j20J30k27K01J58
7797B08k99O0J20J7OQ5l77K82j43P6j26J07k07J99o6J18j24L1P8r2J89r5k43J11
7821h5p5L2k5j93M88l22J46J16j83M0P5O0l3J03J%l10J46mo0J8K24m8k41r1L99
$$ plain form
7847 178 -141 -5 129 -93 -151 45 -177 4 -32 57 37 127 8 82 213 84 -50 -110 103 -94 -18 -20 -7 -13
7871 -13 -118 8 -30 -202 -43 -177 -194 64 -58 18 -136 -139 62 18 -30 -106 -76 -147 -58 -4 85 -191 -20 65 -59
7896 -59 165 10 -125 -97 48 -47 3 -54 -24 -103 62 126 174 -49 91 210 108 -20 -24 127 64 51 275 33
7920 33 20 0 -183 178 8 144 -23 195 149 -27 197 201 145 -32 133 98 170 80 78 97 71 347 -184 48 -181
7945 -181 -65 -150 -188 -53 -306 -32 -99 -29 -35 -8 0 -37 24 -8 -70 -58 -25 42 -211 85 205 -48 94 223 99
7970 99 44 99 -138 180 -173 57 -25 73 202 175 32 85 129 -101 -209 14 -143 193 91 192 13 74 149
7993 149 33 14 30 132 40 23 -12 25 -129 -108 -57 151 -358 86 321 55 -126 -81 49 -249 -180 -110 -62 51
8017 51 -124 210 -16 -108 12 314 45 119 -39 40 308 -1 -81 108 -9 86 18 5 -144 -130 -231 -135 3
$$ packed form
7847A78l19J36J34k22n8J96k22J81l6Q9k0R0j19P4J31j29j34o0K13j97P6kJ3o
7871a3j05J26l8j72J59j34j7K58j22P6j54lK01m4m8p6L0p1Q9N4Q9k76J71Q5j24
7896e9K24j55j35K8J45r5N0n7L0p9J65O4M8k23J40J19j02j28mJ51o3j3K24k42
7920C3j3k0j83L61j70J36j67K18m6j76K24Mn6j77J65l5P2r0kJ9k6K76n31K32k29
7945a81J16q5l8J35k53K74o7P0oK7Ql7O1l2o2J2L3O7k53K96J20k53J42J29j24
7970I9n5N5k37L18l53K30q2R8J29k7j43N3M4k30j08K23j57L36j02J01j79O1P5
7993A49j16j9J6J02r2j7l5L7j54K1N1K08n09M44K35k66j81M5J30k98O9P0M8J13
8017E1j75L34k26r2J20L02k69P4j58P9K68l09q0J89j17R5o8j3j49J4j01R6J38
$$ plain form
8040 3 92 318 -113 211 -118 -16 -199 -199 143 -49 -38 -13 130 -34 -144 238 172 -17 -4 -105 -16 150 54 -8
8064 -8 181 -92 -60 -25 -121 18 102 -72 80 -186 -200 -147 -19 59 27 144 -71 -73 -99 33 -138 -22 148 170 49
8089 49 -234 100 38 79 92 44 248 107 -32 13 38 62 -134 -46 71 31 332 -37 42 60 -66 104 159 121 -154
8114 -154 51 -81 44 14 204 -96 -57 95 -30 42 -11 161 20 -67 28 82 -47 -132 57 -87 -191 57 -418
8137 -418 -186 -86 -119 -135 -104 198 -50 -76 153 117 -179 50 -242 48 -102 -9 81 163 -38 22 -128 -31 -30 -22 99
8162 99 80 210 -137 -97 -218 129 -47 22 -87 -304 237 24 12 92 -109 404 -52 -21 -120 -17 -165 137 -100
8185 -100 64 79 76 -264 -311 -48
$$ packed form
8040CQ9K26m31L24l29J02j83%L42j92J1K5J43j64j10L82o6j89J3j01Q9J66r6o2
8064hJ89k73L2L5r6J39Q4j74J52k66j4N3J28P8l2J17k15kk6J32j71J16J70K2j21
8089D9k83L34o2M1J3m8K04j41j39M5K5K4j96Q8J17m0L01l69P9J8j26J70N5l8k75
8114a54K05j32J25l0J90l00L9J52j25P2n3J72j41q7R5N4j29q5J89j44j04K48m75
8137d18K32J00l3j6L1L02k48k6K29l6k96K29k92K90j50R3R0Q2k01O0j50R7JQJ21
8162I9j9J30l47M0j21L47j76O9j09k17N41k13j2Q0k01N13m56L1r9J03j48L02k37
8185a00J64J5ll40m7K63
8191d8
$$ Imaginary data points
##PAGE= N=2
##DATA TABLE= (X++(I..I)), XYDATA
$$ plain form
0 0 0 0 0 0 0 0 0 0 0 0 0 0 0 0 0 0 0 -8 8 -8 8 -8 8 -13 16 -16 16 -24 24 -31 32 -39 40 -48 55 -61 68 -76 85
39 85 -95 105 -116 129 -142 157 -173 192 -211 234 -258 282 -312 343 -379 420 -466 519 -581 653
59 653 -738 842 -974 1141 -1369 1688 -2170 2985 -4597 8940 -43495 -106967 50212 38823
73 38823 -65516 5208 62280 -27059 -19133 48837 5596 -32247 9965 14209 2168 12486
85 12486 -5428 -16654 10034 -4667 -33150 -11404 -2144 -23131 -8042 10810 -5928 -10998 5624
98 5624 8662 5367 5970 11134 18662 11688 1194 10164 7452 -10057 -1220 10880 -2281 3013 17455
113 17455 1433 -2861 12396 1795 -6006 5295 -9244 -14154 15832 2718 -29491 -2205 10425
126 10425 -24266 -10784 17504 -14198 -18353 23599 11107 -18390 993 6699 -5552 8319
$$ packed form
0@%%%%%%%%%%%%%%%%%qJ6j6J6j6J6k1K9l2L2m0M8n5O3p1P9q8J03j16J29j44J61
39H5j80K00k21K45k71K99l30L65m03M45m92N40n94O55p22P99q86R85j100J234
59F53j391J580j816K115k510L057l858N155p582J3537n2435o3472J57179j1389
73C8823j04339P0724N7072q9339P926O7970m3241l7843M2212M244j2041J0318
85A2486j7914j1226K6688j4701k8483K1746R260k0987J5089J8852j6738n070J6622
98E624L038l295O03N164P528o974j0494Q970k712j7509Q837J2100j3161N294J4442
113A7455j6022m294J5257j0601p801J1301j4539m910K9986j3114l2209K7286J2630
126A0425l4691J3482K8288l1702m155M1952j2492k9497J9383N706j2251J3871
$$ plain form
138 8319 4646 -14046 5419 11267 -15731 -5492 7075 -22129 -13725 21301 -1932 -21274 14047
151 14047 17032 -9573 5530 14261 -9143 1253 22427 1737 -7225 10938 4005 -9699 1074
164 1074 3064 -7623 -335 8128 1138 -2906 2223 4153 117 -2486 3145 5933 -984 233 5690
179 5690 -4966 -8729 5360 -2445 -17340 494 11579 -8433 -7276 8585 -3820 -10477 4426
192 4426 427 -10505 -1495 514 -3579 1200 -7515 -13174 7946 8349 -14105 468 18544 -2772
206 -2772 -3746 19920 4212 -11598 14047 17279 -5834 2329 11934 -3475 -948 7062 -9550 -10294
220 -10294 6233 -1715 -11057 1298 1529 -6212 2096 4027 -4484 -59 4046 -1248 632 643 -5221
235 -5221 537 5784 -2940 -2522 5767 3757 1280 3096 -157 -246 1747 -4333 -6357 -3086 -7356 -7563
$$ packed form
138H319l673j8692J9465N848k6998J0239J2567k9204Q404L5026k3233j9342L5321
151A4047K985k6605J5103Q731k3404J0396K1174k0690q962J8163o933j3704J0773
164A074J990j0687P288Q463o990m044N129J930m036k603N631K788o917J217N457
179E690j0656l763J4089p805j4895J7834J1085k0012J157J5861j2405o657J4903
192D426l999j0932R010K009m093M779q715n659K1120M03k2454J4573J8076k1316
206b772r74K3666j5708j5810K5645L232k3113Q163R605j5409K527Q010j6612p44
220a0294J6527p948r342J2355K31p741Q308J931q511M425M105n294J880J1n864
235e221N758N247q724M18Q289k010k477J816l253q9J993o080k024L271m270k07
$$ plain form
251 -7563 -1662 -8063 -10265 152 -2072 -6658 3201 1270 -5203 11067 12801 -6161 5678 20728
265 20728 1550 -1202 17843 3632 -7975 12276 6779 -14602 677 8164 -10737 -3308 8207
278 8207 -9470 -6421 11297 -3717 -12378 4807 536 -10318 1974 -669 -11651 2792 6343
291 6343 -9527 707 10640 -4797 -473 13836 -1753 -8281 10875 5564 -10061 -584 4154
304 4154 -6242 -3923 714 -6945 -7382 274 -857 -4848 -3723 1322 3805 -101 733 7584 3196
319 3196 -908 9384 7175 -6955 1796 11186 -3491 -5418 7092 93 -3597 8175 949 -7344
333 -7344 7446 5169 -9664 3108 7235 -12092 -2632 11579 -9125 -12662 9879 506 -13234
346 -13234 3990 3086 -11467 2705 7289 -12104 -2976 11389 -5545 -7523 9328 -711 -10636
$$ packed form
251g563N901o401k202J0417k224m586R859j931o473J6270J734j8962J1839J5050
265B0728j9178k752J9045j4211j1607K0251n497k1381J5279P487j8901P429J1515
278H207j7677L049J7718j5014q661J7185m271j0854J2292k643j0982J4443L551
291F343j5870J0234R933j5437M324J4309j5589o528J9156n311j5625R477M738
304D154j0396K319M637p659m37P656j131l991J125N045K483l906Q34O851m388
319C196m104J0292k209j4130Q751R390j4677j927J2510o999l690J1772p226q293
333g344J4790k277j4833J2772M127j9327R460J4211k0704l537K2541r373j3740
346a3234J7224r04j4553J4172M584j9393R128J4365j6934j978J6851j0039r925
$$ plain form
359 -10636 5800 5005 -10519 -2588 6989 -1824 -2193 4340 1514 2286 7732 3611 136 4651 5111
374 5111 115 -1393 141 -1286 -3645 -2831 250 -3209 -6256 1643 4025 -4206 -2455 5415 1011
389 1011 -1198 4368 246 -1915 6466 2818 -4876 3600 4511 -5395 1259 5989 -6919 -4143 7761
404 7761 -3087 -8824 3743 -398 -8498 2309 -175 -12585 -1121 4962 -10522 -6903 6412
417 6412 -4237 -6142 9195 3855 -4935 9332 11706 -165 5533 10493 278 2180 8399 -2209
431 -2209 -5173 4060 -3 -7660 -2236 -282 -4912 -2894 -497 -3126 -2894 -96 224 -34 -404 -408 1466
448 1466 1860 743 1043 -57 1318 3835 -288 -2890 3640 3300 -3719 299 3775 -3896 -2924 3783
464 3783 -3280 -6096 1729 -1832 -6706 1201 -1047 -8160 2181 5377 -7014 -1733 9122 -514
$$ packed form
359a0636J6436p95j5524P931R577q813l69O533k826P72N446m121l475M515M60
374E111m996j508J534j427k359Q14L081l459l047P899K382q231J751P870m404
389A011k209N566m122k161Q381l648p694Q476R11r906O654M730j2908K776J1904
404G761j0848n737J2567m141q100J0807k484j2410J1464O083j5484L619J3315
417F412j0649j905J5337n340q790J4267K374j1871N698M960j0215J902O219j0608
431b209k964R233m063p657N424J954m630K018K397k629K32K798L20k58l70mJ874
448A466L94j117L00j100J375K517m123k602O530l40p019M018L476p671R72O707
464C783p063k816P825l561m874P907k248p113J0341L196j2391N281J0855r636
$$ plain form
478 -514 -2338 8190 2844 -2544 7524 4840 -3467 4135 5031 -4354 1521 5036 -6698 -3641 6628
493 6628 -1789 -6667 3174 1648 -3860 1364 762 -4143 1125 1416 -5153 -134 2531 -4883 -1795 4940
509 4940 -2240 -4551 3913 3191 -2564 -23 2098 32 -647 -975 -778 399 -592 -388 1072 -862 -2002
526 -2002 1304 335 -1769 1433 252 -2172 3311 3030 -3604 1244 5731 -2148 -2200 4191 -807 -2811
542 -2811 4008 -921 -5724 2417 1799 -5104 2981 5377 -3886 1415 8441 -2484 -4122 6295 192
557 192 -5913 3219 825 -6521 1912 3395 -6761 -1372 5196 -4031 -3936 4765 -1096 -6096 2414 1363
573 1363 -6128 -2249 1844 -1345 -630 1635 -97 727 2389 671 759 2691 2920 3088 2750 1757 2623
590 2623 1852 -622 521 -364 -3865 -1960 216 -3415 -3970 -898 -2952 -2384 719 -2065 -1370 5645
$$ packed form
478e14j824J0528n346n388J0068k684q307P602Q96r385N875L515j1734L057J0269
493F628q417m878R841j526n508N224o02m905N268K91o569N019K665p414L088O735
509D940p180k311Q464p22n755K541K121k066o79l28J97J177r91K04J460j934j140
526b002L306r69k104L202j181k424N483k81o634M848M487p879n2O391m998k004
542b811O819m929m803Q141o18o903Q085K396r263N301P026j0925j638J0417o103
557A92o105R132k394p346Q433J483j0156N389O568r227R5Q701n861n000Q510j051
573A363p491L879M093l189P15K265j732Q24J662j718Q8J932K29J68l38r93Q66
590B623p71k474J143q85l501J905K176l631n55L072k054N68L103k784O95P015
$$ plain form
606 5645 2198 -2974 4380 4856 -3886 1597 6749 -1977 -1878 6327 386 -3980 2925 456 -5031 1781
622 1781 797 -7370 -745 3647 -6330 -5900 2743 -2802 -6309 1608 1754 -3392 1300 3579 155 1787
638 1787 2287 494 4054 5216 378 1478 5321 832 -2207 1344 761 -2704 -1638 -72 -1726 -3287
654 -3287 -2073 -937 -1982 -3259 -1404 371 -718 832 2032 -1081 522 4080 -401 -2258 4883
669 4883 2922 -3338 2332 4573 -3928 -1742 5051 -2023 -4353 3724 -96 -5199 2302 1396 -6895
684 -6895 -399 3500 -5480 -2957 5493 -1114 -4044 4279 1562 -3840 2872 3481 -2498 1888 3887
699 3887 -2009 216 3351 -2356 -2221 3381 -170 -3425 1567 1135 -2156 199 977 -1700 9 1323
715 1323 -247 111 1407 82 -469 -225 -270 -608 -1249 -443 659 -892 -2260 646 1039 -2477 -1012
$$ packed form
606E645l447n172P354M76q742N483N152q726R9Q205n941m366O905k469n487O812
622A781r84q167O625M392r977M30Q643n545l507P917J46n146M692K279l424J632
638A787N00j793L560J162m838J100L843m489l039L551n83l465J066J566j654j561
654c287J214J136j045j277J855J775j089J550J200l113J603L558m481j857P141
669D883j961o260N670K241q501K186O793p074k330Q077l820n103P501r06q291
684f895O496L899q980K523Q450o607k930Q323k717n402O712O09n979M386J999
699C887n896K225L135n707J35N602l551l255M992m32l291K355P78k677J709J314
715A323j570L58J296j325n51K44m5l38o41Q06J102j551j368K906L93l516J465
$$ plain form
732 -1012 2328 -445 -1066 1963 -86 -722 1462 -371 -751 2665 640 -2049 3259 2944 -3432 812
748 812 4245 -2481 -2238 3252 -1508 -3281 2021 -1344 -5259 1371 541 -5663 682 3277 -4679 -1223
764 -1223 5840 -687 -2983 5245 2651 -2103 3291 3441 -1524 2195 3277 -2265 -202 3053 -2220
779 -2220 -2452 2093 -1511 -4136 84 145 -3598 -1633 -166 -1836 -1396 -207 -960 214 1409 967 1318
796 1318 1913 1958 1927 1138 1864 2748 888 149 2267 925 -2441 -247 527 -2994 -2452 118 -2776 -2471
814 -2471 171 -2927 -2827 1694 -1279 -4133 2646 2517 -3416 1503 5932 -1682 -941 5880 1225 -1776
830 -1776 4335 2837 -1929 2686 2330 -3449 -24 1961 -3610 -2082 2213 -2376 -3499 1347 -1223
845 -1223 -3899 490 449 -2481 1216 2338 -1427 110 3011 -409 -1139 2600 1588 -428 830 1874
$$ packed form
732a012L340k773o21L029k049o36K184j833l80L416k025k689N308l15o376M244
748H12L433o726K43N490m760j773N302l365l915O630q30o204O345K595p956L456
764a223P063o527k296Q228k594m754N394J50m965L719J082n542K063L255n273
779b220k32M545l604k625M220O1l743J965J467j670M40J189p53J174J195m42L51
796A318N95M5l1p89P26Q84j860p39K118j342l366K194P74l521N42K570k894L05
814b471K642l098J00M521k973k854O779j29n933M919M429p614P41O821m655l001
830a776O111j498m766M615l56n779L425J985n571J528M295m589j123M846k570
845a223k676M389m1k930L697J122l765J537K901l420p30L739j012k016J258J044
$$ plain form
861 1874 642 -579 8 335 -741 -1534 -135 83 -1664 -942 -273 -1892 -1125 544 -1712 -713 2563
878 2563 13 -1752 2561 1383 -2695 1071 2893 -1447 319 3291 -716 -1072 3011 -871 -2847
893 -2847 2870 741 -3627 2051 3077 -3658 -950 3456 -1639 -2508 2584 425 -1781 2002 741
908 741 -2342 1011 177 -3057 358 1920 -2912 -1493 2334 -951 -3198 544 478 -2288 -587 968
924 968 90 -77 870 762 424 576 1013 1280 936 1199 1412 -506 216 1604 -895 -2053 1507 375
942 375 -3091 -192 1264 -2742 -1950 1225 -1576 -2053 1605 -223 -1313 2756 895 -1710 3033 3142
958 3142 -1635 1598 4839 -930 -942 3485 -333 -3331 779 -163 -3948 -370 -156 -4150 -1724 619
974 619 -3397 -2633 1440 -1095 -2047 1932 1151 -889 1933 2146 72 1742 2494 772 1635 2831 935
$$ packed form
861A874j232j221N87L27j076p93J399K18j747P22O69j619P67J669k256R99L276
878B563k550j765M313j178m078L766J822m340J766K972m007l56M083l882j976
893b847N717k129m368N678J026o735K708M406n095q69N092k159k206L783j261
908G41l083L353q34l234L415J562m832J419L827l285k247L742o6k766J701J555
924I68q78j67R47j08l38J52M37K67l44K63K13j918P22J388k499j158L560j132
942C75l466K899J456m006P92L175k801m77L658j828j090M069j861k605M743J09
958C142m777L233L241n769j2M427l818k998M110r42l785L578K14l994K426K343
974F19m016P64M073k535r52L979p81k040K822K13k074J670P52j722Q63J196j896
$$ plain form
991 935 -10 1589 811 -730 -216 134 -285 -1462 -1888 -688 -1117 -2476 -1347 -269 -1281 -927 457
1008 457 12 523 1548 299 826 2629 285 -111 3070 901 -1962 1246 1645 -2732 -1051 1729
1024 1729 -2253 -2228 1771 -1305 -3931 1597 345 -4070 348 2365 -3068 -1544 2930 -685 -1909
1039 -1909 2328 1167 -850 1786 1540 -148 2253 1784 -1090 1482 2662 -1373 -551 2336 -449 -1994
1055 -1994 1023 496 -2092 -81 291 -1350 -299 316 -792 -338 789 106 -643 330 256 -770 -758 377
1073 377 618 -1166 -1090 815 -229 -2083 24 1393 -791 -427 1110 -9 115 812 -378 105 1064
1090 1064 -1000 -905 2372 158 -2622 1857 2020 -2495 1 2616 -1425 -1074 2611 -386 -2273 1971
1106 1971 614 -2557 1090 1875 -2277 -486 2636 -821 -809 2446 363 -806 1737 821 -1236 1215
$$ packed form
991I35r45J599p78j541N14L50m19j177m26J200m29j359J129J078j012L54J384
1008D57m45N11J025j249N27J803k344l96L181k169k863L208L99m377J681K780
1024A729l982K5L999l076k626N528j252m415M418K017n433J524M474l615j224
1039a909M237j161k017K636k46j688K401m69k874K572J180m035Q22K887k785j545
1055a994L017n27k588K011L72j641J051O15j108M54J127o83p49R73p4j026J2J135
1073C77K41j784P6J905j044j854K107J369k184L64J537j119J24O97j190M83R59
1090A064k064R5L277k214k780M479J63m515K496K615m041L51L685k997j887M244
1106A971j357l171L647P85m152J791L122l457J2L255k083j169K543r16k057K451
$$ plain form
1122 1215 1153 -1497 -193 1032 -1929 -1764 157 -902 -2308 -1255 -709 -1260 -1132 -404 -170 -541 -23
1139 -23 336 705 414 1157 909 807 1478 879 -74 1160 2252 -11 -315 2370 506 -1795 1067 775
1157 775 -1790 -240 950 -2333 -1596 895 -1985 -2243 1773 -225 -2934 1381 2427 -1897 405 3588
1173 3588 -55 -278 3193 1059 -634 1643 649 -1642 430 -21 -3206 -915 249 -2750 -2279 769
1189 769 -1375 -2494 94 324 -1385 -11 615 -209 197 1146 210 599 1667 1075 407 1398 1567 466
1207 466 376 1577 1451 -696 -69 1423 -292 -1322 78 318 -1694 -1092 245 -1535 -1488 330 -769
1224 -769 -940 1453 127 -830 1874 1575 -1272 916 1953 -1132 -344 1240 -988 -1100 687 -1070
1240 -1070 -1797 877 -88 -2211 934 1106 -2123 -516 1897 -937 -1390 1737 178 -1183 795 553
$$ packed form
1122A215o2k650J304J225k961J65J921j059j406J053N46n51J28P28K34l71N18
1139b3L59L69k91P43k48j02O71n99r53J234J092k263l04K685j864k301K862k92
1157G75k565J550J190l283P37K491k880k58M016j998k709M315J046m324K302L183
1173C588l643k23L471k134j693K277r94k291K072m51l185K291J164k999M71L048
1189G69k144j119K588K30j709J374O26q24M06R49r36L89J068n92o68R91J69j101
1207D66r0J201j26k147O27J492j715j030J400K40k012O02J337j780M7J818j099
1224g69j71K393j326r57K704k99k847K188J037l085P88J584k228j12J787j757
1240a070p27K674r65k123L145J72l229J607K413k834m53L127j559j361J978k42
$$ plain form
1256 553 -1109 358 1004 -632 351 1392 -229 418 1520 127 -228 721 555 -189 -46 285 -136 -75
1274 -75 -305 -147 131 52 195 16 53 375 525 -478 -92 569 -903 -1203 330 -829 -2196 -436 -446
1293 -446 -1827 -347 312 -1276 -95 1483 -734 -401 2762 603 -1070 2088 2159 -1175 295 2442
1309 2442 -771 -1063 1247 274 -1050 479 224 -451 523 -170 -1236 405 528 -1452 -92 826 -1029
1326 -1029 -350 1063 105 -438 1076 901 349 1336 1212 320 815 1232 -273 -366 85 -439 -1011 -1185 -996
1345 -996 -999 -1695 -2162 -815 -984 -1507 -305 337 -731 245 944 253 289 1314 600 830 2175 516 -316
1364 -316 1752 1170 -801 578 1403 -384 53 836 -360 -447 389 -1056 -666 848 -1347 -1851 1254
1381 1254 278 -2624 -5 1293 -1478 -440 1836 290 -319 1840 1156 -535 684 907 -806 -78
$$ packed form
1256E53j662J467O46j636R83J041j621O47J102j393l55R49j66p44J43L31m21O1
1274g5k30J58K78p9J43j79L7L22J50j003L86O61j472l00J533j159j367J760j0
1293d46j381J480O59j588J181J578k217L33L163k159j673L158P1l334J470K147
1309B442l213k92K310r73j324J529k55o75R74o93j066J641J23j980J360R18j855
1326a029O79J413r58n43J514j75n52R87j24q92M95M17j505r3M51n24n72j74J89
1345i96lo96m67J347j69n23J202O42j068R76O99o91L6J025p14K30J345j659q32
1364c16K068n82j971J379Q25j787M37P83j196q7Q36j445L90J514k195n04L105
1381A254r76k902K619J298k771J038K276j546o09K159o84j691J219K23j713P28
$$ plain form
1397 -78 535 -1077 -1172 199 -825 -1613 -394 -553 -1165 -377 38 -97 -359 -62 95 -241 12 230 451
1416 451 431 776 671 204 649 674 110 429 1361 731 197 1040 433 -515 821 151 -1407 127 1045 -1537
1436 -1537 -847 1236 -1038 -1994 1156 745 -1894 297 1889 -545 -526 953 -500 -939 535 -604
1452 -604 -1590 665 -127 -1513 -60 266 -1308 -337 1133 -57 -286 1209 468 80 914 -11 -341 592
1470 592 160 -809 185 722 -803 -825 577 253 -781 182 973 294 -232 381 401 -276 -493 483 20 -265
1490 -265 418 527 -61 537 867 -566 69 1510 54 -822 1252 73 -2054 -642 38 -1997 -1538
1507 -1538 -318 -946 -1339 -292 -1175 -703 499 -537 -448 1353 1137 6 1694 1923 -368 456 1612
1524 1612 -271 -402 1375 174 -645 844 419 -1289 -112 492 -673 -542 540 -210 -721 -47 -209
$$ packed form
1397g8O13j612r5J371j024p88J219j59o12P88M15j35k62K97J57l36K53K18K21
1416D51k0L45j05m67M45K5n64L19R32o30n34Q43o07r48J336o70j558J534R18k582
1436a537O90K083k274r56L150m11k639K191J592k434J9J479j453m39J474j139
1452f04r86K255p92j386J453L26j574R71J470j190k29J495p41l88Q34r25l30R33
1470E92m32r69R94N37j525k2J402l24j034R63P91o79n26O13K0o77k17R76m63k85
1490b65O83J09n88N98L30j433O35J441j456q76K074j179k127J412O80k035M59
1507a538J220o28l93J047q83M72J202j036Q9J801k16j131J688K29k291Q24J156
1524A612j883j31J777j201q19J489m25j708J177O04j165J31J082p50n11O74j62
$$ plain form
1541 -209 -449 -323 58 281 433 357 546 949 571 456 678 473 643 304 -101 -124 141 -860 -1337 -641
1561 -641 -763 -1879 -970 -836 -1285 -759 -378 -609 -65 362 -195 773 1606 35 72 1560 808 -734 982
1580 982 1228 -350 390 1331 -159 -156 860 47 -623 956 121 -1056 237 288 -1089 -848 182 -511
1598 -511 -471 -63 -396 -195 572 -153 208 918 149 -344 644 980 -655 -202 342 -317 -757 -604 -448 -412
1618 -412 -475 -433 -32 -40 -128 -130 307 228 382 145 79 524 -12 -184 218 635 -910 -310 926 243 -759 807
1640 807 944 -424 249 1006 -212 211 998 80 -81 834 -421 -720 606 181 -1199 87 533 -864
1658 -864 -333 572 1 -270 671 -644 -764 364 -658 -1424 -36 -238 -1286 -668 308 -557 -476 589
1676 589 800 138 1010 807 627 563 880 -11 326 278 71 -45 56 -69 -452 -582 -355 -50 -873 -528 254
$$ packed form
1541b09k40J26L81K23J52p6J89M03l78j15K22k05J70l39m05k3K65j001m77O96
1561f41j22j116R09J34m49N26L81k31N44M27n57R68Q33j571L7J488p52j542J716
1580I82K46j578P40R41j490LJ016q13o70J579q35j177J293N1j377K41J030o93
1598e11M0M08l33K01P67p25L61P10p69m93R88L36j635M53N44o59m40J53J56L6
1618d12o3M2M01qq8kM37p9J54k37o6M45n36j72M02M17j545O00J236o83j002J566
1640H07J37j368O73P57j218M23P87r18j61R15j255k99J326m25j380J286M46j397
1658h64N31R05n71k71R41j315j20J128j022p66J388k02j048O18R76q65Q1J065
1676E89K11o62Q72k03j80o4L17q91L37m8k07j16J01j25l83j30K27L05q23L45P82
$$ plain form
1697 254 73 -398 427 356 -153 288 187 -34 412 499 -167 350 1031 -233 0 933 617 -653 678 294
1717 294 -984 18 -248 -1212 -715 -1 -1765 -1527 252 -1109 -1774 447 511 -715 318 1496 104
1734 104 186 1187 823 502 1023 422 269 823 248 -428 99 570 -744 -714 476 -129 -682 67 218 -398
1754 -398 -496 177 -141 -313 -511 12 31 -234 -130 31 301 569 493 -33 651 705 -83 -320 523 -463 -899
1775 -899 141 -105 -1349 -420 -431 -1261 -327 201 -943 -553 933 -185 -602 821 866 -504 512 1062
1793 1062 -92 145 905 -76 -206 572 -240 -376 621 147 -398 760 382 -244 20 546 9 -228 210
1812 210 -194 -327 118 -89 -423 -100 -12 -110 120 359 -319 -175 -231 29 -178 -367 31 -27 -326 -310 72 -337
1834 -337 -310 288 3 -117 419 299 569 677 678 112 428 621 -495 -257 496 -295 -870 -49 -71 -904 -382
$$ packed form
1697B54j81m71Q25p1n09M41j01k21M46Q7o66N17O81j264K33R33l16j270J331l84
1717B94j278J002k66r64M97P14j764K38J779j361o65K221O4j226J033J178j392
1734A04Q2J001l64l21N21o01j53N54n75o76N27M71j314L0J190o05n53P49J51o16
1754c98r8O73l18j72j98N23J9k65J04J61K70K68p6n26O84N4p88k37Q43r86m36
1775h99J040k46j244R29j1q30R34N28j144L90J486j118m17J423M5j370J016N50
1793A062j154K37P60r81j30P78q12j36R97m74n45J158l78o26K64N26n37k37M38
1812B10m04j33M45k07l34L23Q8r8K30K39o78J44n6K60k07j89L98n8k99J6L82m09
1834c37K7N98k85j20N36j20K70J08Jn66L16J93j116K38P53p91n75Q21k2q33N22
$$ plain form
1855 -382 55 -595 108 597 -57 252 1045 361 -429 800 700 -200 555 706 179 19 403 -347 -293 321
1875 321 -487 -475 342 -468 -903 154 39 -1156 -809 135 -606 -1124 -122 222 -358 -198 195 457 393 997
1895 997 931 661 897 866 364 116 542 210 -288 -153 180 -934 -760 42 -367 -996 -337 -48 -371 272
1915 272 9 -439 532 460 -444 516 943 -169 -348 1316 609 -767 365 826 -163 10 680 -206 -438
1934 -438 257 -687 -694 438 -695 -1476 -88 -463 -966 -268 330 -619 -109 669 566 10 541 624 361 533
1954 533 236 -2 240 189 133 -44 300 -37 -125 -183 -39 -201 -229 45 16 -140 -152 -327 -36 24 -25 -442 -206
1977 -206 350 -217 -370 548 745 -437 202 950 203 -454 392 449 -147 -136 167 -609 -277 76 -472 -484 532
1998 532 -311 -684 162 307 -333 315 523 -343 -116 229 -251 -33 473 -334 -472 226 -294 -774 362 466
$$ packed form
1855c82M37o50P03M89o54L09P93o84p90J229j00r00P55J51n27j60L84p50N4O14
1875C21q08J2Q17q10m35J057j15j195L47R44p41n18J002L44n80J60L93K62o4O04
1895I97o6k70K36l1n02k48M26l32m98J35L33j114J74Q02m09o29O59K89l23O43
1915B72k63m48R71p2r04R60M27j112j79J664p07j376J132M61r89J73O70q86k32
1934d38O95r44pJ132j133p81J388l75n03O98N98r49N10P78j03n56N31Q3k63J72
1954E33k97k38K42n1n6j77L44l37q8n8J44j62k8K74k9j56j2j75K91O0m9m17K36
1977b06N56n67j53R18J97j182O39P48p47o57Q46N7n96J1L03p76L32L53n48j2J016
1998E32q43l73Q46J45o40O48K08q66K27L45m80K18N06q07j38O98n20m80J136J04
$$ plain form
2018 466 -629 -431 479 149 -45 406 297 -104 334 446 93 127 193 -234 -559 219 -243 -864 -224 519
2038 519 -382 -621 -93 125 -715 -593 -117 -145 -586 146 125 -65 141 285 -3 537 224 -552 559 965
2058 965 100 -272 910 98 -474 176 148 -784 -562 -305 -605 -373 -4 -567 -241 247 -223 -313 416 321 -138
2079 -138 293 956 275 349 639 232 220 823 289 10 13 338 -373 -151 58 -511 -554 -283 -267 -493 -779 -115
2101 -115 -133 -561 -209 78 -168 -234 110 500 237 709 541 476 545 299 258 753 517 -440 -141 101 -338 -425
2123 -425 -396 -339 -774 22 -371 -937 -9 215 -742 0 679 -374 -476 578 380 -497 171 551 75 128
2143 128 571 -215 232 322 -222 50 263 -180 -510 208 116 -695 -328 219 -205 -411 -166 -71 -24 -195 182
2164 182 101 352 140 -91 305 415 173 -292 303 181 -223 -307 153 -39 -341 -245 177 -351 -130 371 159
$$ packed form
2018D66j095J98R10l30j94M51j09m01M38J12l53L4O6m27l25P78m62o21O40P43
2038E19r01k39N28K18q40J22M76k8m41P32k1j90K06J44k88N40l13p76J111M06
2058I65q65l72J182q12n72O50k8r32K22K57l00K32L69n63L26M88m70r0P29r5m59
2079a38M31O63o81P4K90m07j2O03n34k79LL25p11K22K09n69m3K71J6k26k86O64
2101a15j8m28L52K87k46o6L44L90k63M72j68o5O9k46m1M95k36r57K99K42m39q7
2123d25K9N7m35P96l93n66R28K24r57P42O79j053j02J054j98q77O68L80m76N3
2143A28M43p86M47R0n44K72K13m43l30P18r2q11L67N47m24k06K45R5M7j71L77
2164A82q1K51k12k31L96J10k42m65N95j22m04q4M60j92l02R6M22n28K21N01k12
$$ plain form
2185 159 -216 42 59 -340 385 373 -346 289 518 -271 -571 397 -39 -520 86 101 -463 -141 39 -229 68
2206 68 293 -223 -198 557 -89 -301 884 351 -522 457 486 -94 90 436 143 -155 120 -306 -424 189 -287
2227 -287 -741 -217 -38 -838 -564 10 -241 -561 81 507 -63 117 612 212 246 354 313 344 455 367 324 -188
2249 -188 346 -246 -385 33 -152 -397 -355 246 -571 -657 -213 0 -413 -102 14 -33 112 438 42 256 791
2270 791 261 301 710 409 24 88 251 -244 76 117 -632 -157 239 -404 -606 -21 -207 -771 -109 22 -232
2291 -232 29 377 197 382 238 321 306 355 187 252 422 462 154 64 681 -31 -219 160 390 -198 -461 243
2313 243 100 -370 -288 -10 -330 -680 -58 -5 177 -106 70 439 363 84 -74 530 575 -171 27 414 124
2334 124 -304 147 -347 -418 -192 -14 -526 -49 -38 -459 -329 -97 -209 -211 338 294 -308 258 200 -19 50 370
$$ packed form
2185A59l75K58J7l99P25j2p19O35K29p89l00R68m36m81O06J5n64L22J80k68K97
2206F8K25n16K5P55o46k12J185n33q73R79K9n80J84L46k93k98K75m26j18O13m76
2227b87m54N24J79q00K74N74k51l20O42M26n70J80M95m00L4J08m1L1J11q8m3n12
2249a88N34n92j39M18j85k45M2O01q17q6M44K13m13L11J16m7J45L26l96K14N35
2270G91n30M0M09l01l85O4J63m95L20M1p49M75L96o43k02N85j86n64O62J31k54
2291b32K61L48j80J85j44Q3j5M9j68O5J70M0l08r0O17p12j88L79K30n88k63P04
2313B43j43m70Q2K78l20l50O22N3J82k83J76L69p6k79j58O04M5p46J98L87k90
2334A24m28M51m94p1K26J78n12M77J1m21J30K32j12kN49m4o02N66n8k19O9L20
$$ plain form
2356 370 -11 -115 191 -81 78 301 52 -333 297 14 -348 -332 57 -18 -100 -37 238 103 120 79 248 222
2378 222 -58 159 -75 345 -164 -247 -159 -113 -146 -329 309 46 -700 -197 135 -415 -215 207 189 -228 164 329
2400 329 -315 342 343 129 103 550 146 57 372 212 -221 23 -68 -61 -54 -256 -119 -164 41 -594 -75 173 -219
2423 -219 -202 452 487 -49 131 293 336 53 400 303 138 224 98 105 99 66 -601 -414 -45 -735 -518 -118 -204 -505
2447 -505 -241 -10 -136 -258 101 311 192 115 387 318 302 455 234 352 330 214 226 339 404 -74 -179 -10
2469 -10 -143 -460 -194 -259 -70 -73 -290 -41 230 149 -294 154 456 -179 70 404 195 -20 9 658 309 115
2491 115 304 202 -152 101 -164 -383 -153 -287 -703 -275 -212 -657 -338 -96 -66 -386 104 127 -1 143 301
2512 301 132 277 233 186 330 367 237 84 125 277 -126 -261 174 -62 -367 -5 48 -156 -174 -2 -417 -305
$$ packed form
2356C70l81j04L06k72J59K23k49l85O30k83l62J6L89p5q2O3K75j35J7m1J69k6
2378B22k80K17k34M20n09q3Q8M6l3j83O38k63p46N03L32n50K00M22j8m17L92J65
2400C29o44O57Jk14k6M47m04q9L15j60m33K44r1PPk02J37m5K05o35N19K48l92
2423b19J7O54L5n36J80J62M3k83L47r7j65Q6j26Pol3o67J87L69o90K17M00q6l01
2447e05K64K31j26j22L59K10j19p7K72o9j6J53k21J18k2j16J2J13O5m78j05J69
2469a0j33l17K66o5J89lk17K49K71q1m43M48L02o35K49L34k09k15K9O49l49j94
2491A15J89j02l54K53k65k19K30j34m16M28O3m45L19K42L0l20M90K3j28J44J58
2512C01j69J45m4m7J44L7j30j53M1J52m03j35M35k36l05L62N3k04j8J72m15J12
$$ plain form
2534 -305 432 -139 -282 146 233 -151 33 148 -223 -188 128 141 -383 -95 103 -253 40 39 -198 -106 82 -222
2556 -222 57 128 -142 -115 129 -80 -404 100 333 -5 -188 120 -65 18 347 -13 -234 -6 -26 -280 -35
2577 -35 -2 -103 -175 -76 196 -94 -91 288 68 33 77 85 246 177 -11 -25 3 314 -111 -1 39 -291 -168 -171 -181 -415
2603 -415 -391 8 -214 -371 -302 -175 240 109 -194 94 410 -35 37 392 534 -151 13 551 72 -160 205
2624 205 -69 -112 -116 247 -371 -232 -145 -402 -124 -10 -504 -343 -133 56 -276 61 229 85 -13 487 311 260
2646 260 241 309 274 357 -13 40 -2 111 -364 -104 -190 -80 -394 -295 -108 -387 -195 -535 38 -158 -33 7 32
2669 32 280 295 34 254 261 358 -53 304 608 119 113 176 -99 -97 287 -12 -70 -459 -84 -35 -180 -12 -301 13
2693 13 -22 -100 -259 -21 95 189 -8 198 117 48 487 -104 172 208 -448 80 327 -190 -391 -23 19 -117 -314
$$ packed form
2534c05P37n71j43M28Q7l84J84J15l71L5L16J3n24K88J98l56K93jk37R2J88l04
2556b22K79P1k70K7K44k09l24N04K33l38j83L08j85Q3L29l60k21K28k0k54K45
2577c5L3j01p2R9K72k90LL79k20l5M4QJ61o9j88j4K8L11m25J10M0l30J23lj0k34
2603d15K4L99k22j57O9J27M15j31l03K88L16m45P2L55J42o85J64N38m79k32L65
2624B05k74m3mL63o18J39Q7k57K78J14m94J61K10J89l32L37J68j44r8N00j76n1
2646B60j9O8l5Q3l70N3m2J13m75K60q6J10l14R9J87k79J92l40N73j96J25M0K5
2669C2K48J5k61K20PR7m11L57L04m89oO3k75KL84k99n8l89L75M9j45J68k89L14
2693A3l5p8j59K38J16R4j97K06q1o9M39n91K76L6o56N28K47n17k01L68M2j36j97
$$ plain form
2716 -314 12 -43 -406 9 -231 -100 -74 48 -42 50 -24 -125 -47 225 -97 101 63 315 285 97 323 15 -159
2739 -159 44 106 2 -192 117 -21 -13 130 283 41 291 160 -84 87 181 -15 -112 182 57 -129 -193 -150
2761 -150 -242 -284 -343 -317 0 -28 1 -99 75 -230 -261 1 0 74 107 9 160 -21 234 32 15 7 -22 -233 10
2786 10 -8 113 -127 86 -58 -326 -193 121 -133 -222 -44 -25 -61 51 136 32 225 403 -1 292 181 326
2808 326 36 234 314 -102 143 -57 -138 -218 161 -252 -316 -416 -283 -178 -327 -300 -120 -191 5 105 21 428
2830 428 251 152 352 94 397 80 281 58 147 130 -15 258 245 -68 -81 27 -22 -425 91 -234 -279 -117
2852 -117 -5 37 -157 -173 187 198 -67 103 541 64 254 162 265 67 -89 34 -34 211 -70 -304 -406 -171
2874 -171 -485 -311 10 -48 -244 -150 -304 -266 -83 54 -195 307 203 87 294 276 -71 -32 295 154 -35 21
$$ packed form
2716c14L26n5l63M15k40J31K6J22r0R2p4j01P8K72l22J98l8K52l0j88K26l08j74
2739a59K03O2j04j94L09j38QJ43J53k42K50j31k44J71R4j96r7K94j25j86o4M3
2761a50r2m2n9K6L17k8K9j00J74l05l1K62jP4L3r8J51j81K55k02j7qk9k11K43
2786A0j8J21k40K13j44k68J33L14k54q9J78J9l6J12Q5j04J93J78m04K93j11J45
2808C26k90J98Q0m16K45k00q1q0L79m13o4j00J33J05j49K7J80p1J96J00q4M07
2830D28j77r9K00k58L03l17K01k23Q9j7j45K73j3l13j3J08m9m03N16l25m5J62
2852a17J12M2j94j6L60J1k65J70M38m77J90r2J03j98j56J23o8K45k81k34j02K35
2874a71l14J74L21n8j96R4j54L8J83J37k49N02j04j16K07j8l47L9L27j41j89N6
$$ plain form
2896 21 78 41 231 -46 -140 36 29 -330 -124 -43 -167 -271 171 -26 -201 -95 375 59 143 116 -94 83 134
2919 134 -293 68 143 -70 -241 -91 109 -91 -357 -76 270 -113 -193 60 -20 11 95 -15 106 33 -72 -60
2941 -60 248 107 -331 3 -101 -262 80 488 47 -52 52 78 -2 313 266 83 179 184 -195 -152 5 27 18 139
2965 139 342 -13 -16 326 100 -177 -69 12 -106 -236 -71 -343 165 -552 -388 -415 28 -246 -311 34 165 -142
2987 -142 -273 208 220 -14 254 248 171 288 233 289 112 173 -250 -92 171 69 -249 -154 48 -169 -186 268 -149
3010 -149 -342 -141 97 53 37 21 -2 40 414 -165 -41 417 206 -105 332 215 206 -131 -40 24 -279 -167 -181
3033 -181 -145 -402 -345 -439 -87 -76 -252 92 198 -128 -17 205 45 -80 -27 294 330 85 246 -172 214 146
3055 146 20 -5 110 96 -54 279 128 -58 -121 120 57 -342 171 5 -376 -100 -82 -127 -26 324 80 73 123
$$ packed form
2896B1N7l7J90k77r4J76pl59K06Q1j24j04M42j97j75J06M70l16Q4k7k10J77N1
2919A34m27L61P5k13j71J50K00k00k66K81L46l83q0K53q0L1Q4j10J21p3j05J2
2941f0L08j41m38L34j04j61L42M08m41r9J04K6q0L15m7j83R6Nl79M3J57K2rJ21
2965A39K03l55lL42k26k77J08Q1j18j30J65k72N08p17J64k7M43k74o5L45J31l07
2987a42j31M81J2k34K68op7J17n5N6j77O1m23J58K63j02l18R5K02k17j7M54m17
3010a49j93K01K38m4j6j6k3M2L74n79J24M58k11l11M37j17rl37R1O4l03J12j4
3033a81L6k57N7r4L52J1j76L44J06l26J11K22j60j25N3L21L6k45J61m18L86o8
3055A46j26k5J15j4j50L33j51j86o3K41o3l99N13j66l81K76J8m5J01L50k44pN0
$$ plain form
3078 123 241 76 245 122 -46 -43 -61 -22 -465 -38 -83 8 -104 -39 -128 -83 -29 -163 -439 24 218 60 -3 197
3102 197 84 -172 223 68 53 -67 272 -69 -125 221 -53 143 81 -74 65 323 180 87 51 327 159 -43
3124 -43 204 128 -158 -133 -179 -166 -49 -34 19 -113 -194 -238 -210 146 -128 -200 -79 -2 -314 -303 -157 196 -69 198
3148 198 198 -100 122 113 49 104 428 191 95 262 122 -353 -117 -29 -450 -169 123 77 -170 -374 -145 -75 -101 -16
3172 -16 135 314 -78 78 431 350 -63 193 301 97 -59 45 142 -83 -126 -117 -8 -133 82 -367 -91 -360
3194 -360 -150 -416 -181 -148 -272 -121 -289 -80 47 132 352 423 341 117 58 318 238 -77 -127 281 -91 -62 -185
3217 -185 37 -244 63 -21 -107 26 -136 42 -116 7 11 -201 -34 -108 -151 5 110 -16 -128 65 256 102
3239 102 107 260 133 164 -24 -23 58 34 -154 -89 -173 -411 -236 -448 -173 141 -254 215 48 143 -50 74 98 310
$$ packed form
3078A23J18j65J69j23j68Lj8L9m43M27m5R1j12O5q9M5N4j34k76M63J94j58o3K00
3102A97j13k56L95j55j5j20L39l41n6L46k74J96o2j55J39K58j43r3l6K76j68k02
3124d3K47p6k86K5m6J3J17J5N3j32q1m4K8L56k74p2J21P7l12J1J46L53k65K67
3148A98%k98K22ro4N5L24k37r6J67j40m75K36Q8m21K81K92m6k47k04K29P0k6Q5
3172a6J51J79l92J56L53q1m13K56J08k04j56J04R7k25m3RJ09j25K15m49K76k69
3194c60K10k66K35L3j24J51j68K09J27Q5K20P1q2k24n9K60q0l15n0M08l72K9j23
3217a85K22k81L07q4q6J33j62J78j58J23Mk12J67p4m3J56J05j26j12J93J91j54
3239A02NJ53j27L1j88JQ1k4j88O5q4k38J75k12K75L14l95M69j67R5j93J24K4K12
$$ plain form
3263 310 95 149 276 261 7 -25 44 -5 49 -188 467 25 -226 41 375 -201 45 -109 -110 -22 13 -7 218 45
3287 45 -78 184 87 -116 -3 36 421 232 -181 56 59 41 108 43 238 165 -69 34 -54 -67 -250 115 -48 385
3311 385 184 -58 26 -83 -37 41 370 125 -5 28 -31 -174 -67 -110 -86 -324 -121 -247 106 104 -14 -39 181
3334 181 6 -154 382 198 -52 216 143 12 69 -80 -16 -195 -76 -92 -167 -230 8 -450 -246 -222 -145 -283 -197
3357 -197 -232 -12 -254 -171 -29 -33 64 404 265 200 109 75 35 106 101 -185 311 66 -83 118 -110 -204 -70 -76 -41
3382 -41 -367 -85 155 -124 158 102 -29 -147 41 53 -48 198 178 -3 21 138 133 330 257 -100 295 42 -52
3405 -52 137 -144 -189 -92 -14 -36 -329 -81 -117 -119 -42 -120 188 15 162 258 169 15 267 97 401 80 -149 90
3429 90 125 407 -111 -2 59 -180 -139 -189 68 103 -268 -247 126 -115 -241 -60 49 -185 47 27 132 179 6
$$ packed form
3263C10k15N4J27j5k54l2O9m9N4k37O55m42k51K67L34n76K46j54jQ8L5k0K25j73
3287D5j23K62r7k03J13L9L85j89m13K37Lj8O7o5J95p3k34J03q8j3j83L65j63M33
3311C85k01k42Q4j09M6P8L29k45j30L3n9j43J07m3K4k38K03j26L53kj18k5K20
3334A81j75j60N36j84k50K68p3j31N7j49O4j79J19j6p5o3K38m58K04K4P7j38Q6
3357a97l5K20k42Q3J42mR7L40j39o5r1l4m0P1nk86M96k45j49K01k28r4J34oL5
3382d1l26K82K40k79K82n6j31j18J88J2j01K46k0j81K4J17nJ97p3l57L95k53r4
3405e2J89k81m5R7P8k2k93K48l6kP7p8L08j73J47R6q9j54K52j70L04l21k29K39
3429I0L5K82n18J09O1k39M1n0K57L5l71K1L73k41j26J81J09k34K32k0J05M7j73
$$ [...]
8191b18
##END NTUPLES=NMR FID
##END=
