##TITLE=1H_SL30-Dau(B)
 CDCl3
 8 sc, 
 14.1.2022
##JCAMPDX= 6.0         $$ Bruker NMR JCAMP-DX V2.0
##DATA TYPE= NMR FID
##DATA CLASS= NTUPLES
##ORIGIN= UXNMR, Bruker Analytische Messtechnik GmbH
##OWNER= root
$$ XWIN-NMR		Version 3.5
$$ Fri Jan 14 14:57:57 2022 Russian Standard Time (UT+4h)  she@DPX200
##.OBSERVE FREQUENCY= 200.131346
##.OBSERVE NUCLEUS= ^1H
##.DELAY= (6, 6)
##.ACQUISITION MODE= SIMULTANEOUS
##.ACQUISITION SCHEME= undefined
##.AVERAGES= 8
##.DIGITISER RES= 18
##SPECTROMETER/DATA SYSTEM= spect
##.PULSE SEQUENCE= zg30
##.SOLVENT NAME= CDCl3
##.SHIFT REFERENCE= (INTERNAL, CDCl3, 0, 15.7039)
##AUDIT TRAIL= $$ (NUMBER, WHEN, WHO, WHERE, WHAT)
$$ ##TITLE= Audit trail, XWIN-NMR		Version 3.5
$$ ##JCAMPDX= 5.01
$$ ##ORIGIN= Bruker BioSpin GmbH
$$ ##OWNER= she
$$ F:/spectra/data/she/nmr/H-F/1/audita.txt
$$ ##AUDIT TRAIL=  $$ (NUMBER, WHEN, WHO, WHERE, WHAT)
(   1,<2022-01-14 14:56:53.17 +0400>,<she>,<DPX200>,
      <created by zg, POWCHK disabled, PULCHK disabled
       configuration hash MD5:
       00 E9 B6 7A A2 85 ED C7 34 08 36 98 17 FE 4E 26
       data hash MD5: 16K
       62 C7 DA C4 F0 85 76 8E F3 1C 9C FE EE F0 13 1C>)
$$ ##END=
$$ 
$$ hash MD5
$$ 30 6C 60 40 5F FC 94 B2 7F A0 6D 01 75 D2 3E 56
##$RELAX= 
##$RELAX= 
##$RELAX= 
##$RELAX= 
##$RELAX= 
##$RELAX= 
$$ Bruker specific parameters
$$ --------------------------
##$DU= <F:/spectra>
##$EXPNO= 1
##$NAME= <H-F>
##$PROCNO= 1
##$TYPE= <nmr>
##$USER= <she>
##$AMP= (0..31)
100 100 100 100 100 100 100 100 100 100 100 100 100 100 100 100 100 100 
100 100 100 100 100 100 100 100 100 100 100 100 100 100 
##$AQSEQ= 0
##$AQ_mod= 1
##$AUNM= <au_zg>
##$AUTOPOS= <>
##$BF1= 200.13
##$BF2= 200.13
##$BF3= 200.13
##$BF4= 200.13
##$BF5= 200.13
##$BF6= 200.13
##$BF7= 200.13
##$BF8= 200.13
##$BYTORDA= 1
##$CFDGTYP= 0
##$CFRGTYP= 5
##$CHEMSTR= <none>
##$CNST= (0..31)
1 1 145 1 1 1 1 1 1 1 1 1 1 1 1 1 1 1 1 1 1 1 1 1 1 1 1 1 1 1 1 1 
##$CPDPRG= <>
##$CPDPRG1= <>
##$CPDPRG2= <>
##$CPDPRG3= <>
##$CPDPRG4= <mlev>
##$CPDPRG5= <mlev>
##$CPDPRG6= <mlev>
##$CPDPRG7= <mlev>
##$CPDPRG8= <mlev>
##$CPDPRGB= <>
##$CPDPRGT= <>
##$D= (0..31)
0 1.2 0 0 0 0 0 0 0 0.06 0 0.03 0 0 0 0 0.0002 0 0 0 0 0 0 0 0 0 0 0 0 
0 0 0 
##$DATE= 1642157812
##$DBL= (0..7)
120 120 120 120 120 120 120 120 
##$DBP= (0..7)
150 150 150 150 150 150 150 150 
##$DBP07= 0
##$DBPNAM0= <>
##$DBPNAM1= <>
##$DBPNAM2= <>
##$DBPNAM3= <>
##$DBPNAM4= <>
##$DBPNAM5= <>
##$DBPNAM6= <>
##$DBPNAM7= <>
##$DBPOAL= (0..7)
0.5 0.5 0.5 0.5 0.5 0.5 0.5 0.5 
##$DBPOFFS= (0..7)
0 0 0 0 0 0 0 0 
##$DE= 6
##$DECBNUC= <off>
##$DECIM= 32
##$DECNUC= <off>
##$DECSTAT= 4
##$DIGMOD= 1
##$DIGTYP= 9
##$DL= (0..7)
0 120 120 120 120 120 120 120 
##$DP= (0..7)
150 150 150 150 150 150 150 150 
##$DP07= 0
##$DPNAME0= <>
##$DPNAME1= <>
##$DPNAME2= <>
##$DPNAME3= <>
##$DPNAME4= <>
##$DPNAME5= <>
##$DPNAME6= <>
##$DPNAME7= <>
##$DPOAL= (0..7)
0.5 0.5 0.5 0.5 0.5 0.5 0.5 0.5 
##$DPOFFS= (0..7)
0 0 0 0 0 0 0 0 
##$DQDMODE= 0
##$DR= 18
##$DS= 0
##$DSLIST= <SSSSSSSSSSSSSSS>
$$ [...]
##$SUBNAM2= <"">
##$SUBNAM3= <"">
##$SUBNAM4= <"">
##$SUBNAM5= <"">
##$SUBNAM6= <"">
##$SUBNAM7= <"">
##$SUBNAM8= <"">
##$SUBNAM9= <"">
##$SW= 18.0517287032376
##$SWIBOX= (0..15)
0 0 2 0 0 0 0 0 0 0 0 0 0 0 0 0 
##$SW_h= 3612.71676300578
##$TD= 16384
##$TD0= 1
##$TE= 0
##$TE2= 300
##$TE3= 300
##$TEG= 300
##$TL= (0..7)
0 120 120 120 120 120 120 120 
##$TP= (0..7)
150 150 150 150 150 150 150 150 
##$TP07= 0
##$TPNAME0= <>
##$TPNAME1= <>
##$TPNAME2= <>
##$TPNAME3= <>
##$TPNAME4= <>
##$TPNAME5= <>
##$TPNAME6= <>
##$TPNAME7= <>
##$TPOAL= (0..7)
0.5 0.5 0.5 0.5 0.5 0.5 0.5 0.5 
##$TPOFFS= (0..7)
0 0 0 0 0 0 0 0 
##$TUNHIN= 0
##$TUNHOUT= 0
##$TUNXOUT= 0
##$USERA1= <user>
##$USERA2= <user>
##$USERA3= <user>
##$USERA4= <user>
##$USERA5= <user>
##$V9= 5
##$VALIST= <valist>
##$VCLIST= <CCCCCCCCCCCCCCC>
##$VD= 0
##$VDLIST= <DDDDDDDDDDDDDDD>
##$VPLIST= <PPPPPPPPPPPPPPP>
##$VTLIST= <TTTTTTTTTTTTTTT>
##$WBST= 1024
##$WBSW= 4
##$XGAIN= (0..3)
0 0 0 0 
##$XL= 0
##$YL= 0
##$YMAX_a= 133556
##$YMIN_a= -247240
##$ZGOPTNS= <>
##$ZL1= 120
##$ZL2= 120
##$ZL3= 120
##$ZL4= 120
##$ABSF1= 10
##$ABSF2= 0
##$ABSG= 5
##$ABSL= 3
##$ALPHA= 0
##$AQORDER= 0
##$ASSFAC= 0
##$ASSFACI= 0
##$ASSFACX= 0
##$ASSWID= 0
##$AUNMP= <proc_1d>
##$AZFE= 0.1
##$AZFW= 0.1
##$BCFW= 1
##$BC_mod= 2
##$BYTORDP= 1
##$COROFFS= 0
##$CY= 11.3945322036743
##$DATMOD= 1
##$DC= 2
##$DFILT= <>
##$DTYPP= 0
##$F1P= 2.36226072786647
##$F2P= -0.459571619588291
##$FCOR= 0.5
##$FTSIZE= 0
##$FT_mod= 4
##$GAMMA= 1
##$GB= 0.15
##$INTBC= 1
##$INTSCL= 1
##$ISEN= 128
##$LB= 0.24
##$LEV0= 0
##$LPBIN= 0
##$MAXI= 10000
##$MC2= 0
##$MEAN= 0
##$ME_mod= 0
##$MI= 1.114404
##$NCOEF= 0
##$NC_proc= 0
##$NLEV= 6
##$NOISF1= 3.799351
##$NOISF2= 2.8
##$NSP= 1
##$NTH_PI= 0
##$NZP= 0
##$OFFSET= 15.70392
##$PC= 1
##$PHC0= -15869.35
##$PHC1= 12.20078
##$PH_mod= 1
##$PKNL= yes
##$PPARMOD= 0
##$PSCAL= 0
##$PSIGN= 0
##$REVERSE= no
##$SF= 200.130013532006
##$SI= 16384
##$SIGF1= 3
##$SIGF2= 2
##$SINO= 400
##$SIOLD= 16384
##$SREGLST= <1H.CDCl3>
##$SSB= 0
##$STSI= 0
##$STSR= 0
##$SW_p= 3612.71676300578
##$SYMM= 0
##$S_DEV= 0
##$TDeff= 0
##$TDoff= 0
##$TI= <>
##$TILT= no
##$TM1= 0
##$TM2= 0
##$TOPLEV= 0
##$USERP1= <user>
##$USERP2= <user>
##$USERP3= <user>
##$USERP4= <user>
##$USERP5= <user>
##$WDW= 1
##$XDIM= 8192
##$YMAX_p= 0
##$YMIN_p= 0
$$ End of Bruker specific parameters
$$ ---------------------------------
##NTUPLES= NMR FID
##VAR_NAME=  TIME,          FID/REAL,        FID/IMAG
##SYMBOL=    X,             R,               I
##VAR_TYPE=  INDEPENDENT,   DEPENDENT,       DEPENDENT
##VAR_FORM=  AFFN,          ASDF,            ASDF
##VAR_DIM=   8192,          8192,            8192
##UNITS=     SECONDS,       ARBITRARY UNITS, ARBITRARY UNITS
##FACTOR=    0.0002768,     1,               1
##FIRST=     0,             0,               0
##LAST=      2.2672688,     0,               0
##MIN=       0,             -247240,         0
##MAX=       2.2672688,     133556,          0
$$ Real data points
##PAGE= N=1
##DATA TABLE= (X++(R..R)), XYDATA
0 0 0 0 0 0 0 0 0 0 0 0 0 8 -8 8 -8 16 -16 16 -24 32 -32 40 -48 56 -71 80 -95 109 -125 144 -162 185 -212
33 -212 240 -271 304 -343 383 -430 478 -533 592 -657 727 -805 890 -981 1085 -1193 1315
50 1315 -1448 1595 -1758 1940 -2141 2371 -2631 2929 -3274 3683 -4170 4766 -5515 6484 -7801
65 -7801 9693 -12666 18021 -30719 127389 -4626 -194198 103265 64380 -89264 -26847
76 -26847 70963 -32419 -38518 15583 -28647 -31788 54815 25180 -16828 -1547 7478 -29274 -10763
89 -10763 16817 -11246 -28248 -15901 -5485 11748 2278 14302 30897 25794 1348 -25700 -6900
102 -6900 25621 19705 -2376 -9213 2030 -17224 -20227 11824 12306 10198 10715 -27209 -49471 2636
116 2636 42132 -9789 -17771 27566 -8741 -40151 12679 37133 -1906 -143 23062 -18722 -27146
129 -27146 18235 2617 -14968 21995 22094 -30030 -22629 28908 11860 -16343 1642 9639 1405
142 1405 -10736 -15012 3687 23453 5105 -26686 -10435 6769 -5286 7716 20658 6323
154 6323 -9781 -17463 -14228 6803 22757 -377 -11231 5647 -12972 -23770 9402 19036 3506
167 3506 9828 7048 -20466 -3185 29476 -457 -15748 13725 7630 -21499 -10422 11755 3178
180 3178 -480 7115 -3898 -10380 -6201 -3735 1057 3170 -1296 -11546 -13732 646 14535 12509
194 12509 1569 7130 9013 -10074 -9785 10423 16250 4708 -12203 -16889 -2123 10946 1962
207 1962 2473 20128 2479 -23171 -6548 4617 -8429 -4468 2168 -14637 -9220 9627 -11415
220 -11415 -9651 33667 20141 -21189 2770 25429 -13288 -17230 23115 7816 -21166 -2491
232 -2491 2769 -8373 12097 21184 -9486 -10713 13192 -4086 -20008 4515 15348 -5421 -17470
245 -17470 -11211 -3399 5190 9134 3053 680 -155 -4903 -1544 5677 7706 3560 -1327 -1693 -215
260 -215 -734 -3779 2020 11875 7106 -6719 -12224 -381 11053 833 -7709 4009 7286 -11972
274 -11972 -13050 7307 5937 -5040 -248 -4484 -11229 2226 8332 -2370 5859 13355 -11044 -15667
288 -15667 13452 14113 -5899 -108 6483 -6727 -7136 4120 4071 6269 7009 -6449 -7558 4559 -966
303 -966 -9519 1146 6785 -3377 -8065 -8711 -3918 9700 7098 -7784 -1951 8369 -5226 -9809
317 -9809 9559 11564 -2051 -19 1588 -5416 1219 10221 2958 -2284 1801 -4992 -10932 2110
331 2110 10551 88 -7887 -2552 1009 -3450 -2704 3942 3602 -2057 -4417 -5046 -5193 2694 9051 215
347 215 -2288 6947 2981 -7872 1110 11677 2806 -4967 -2459 -2810 -2729 -165 -203 4676 8149 -4422
363 -4422 -11315 3039 8814 -1418 -1673 59 -6344 -4560 -368 -3057 4489 11414 -4516 -11263 6834
378 6834 6572 -7380 2129 10293 -5230 -9842 1414 1708 385 6427 2959 -3025 3093 2656 -4897
393 -4897 554 7963 1168 -5802 -4923 -3367 -1477 1336 1305 1657 1377 -4278 -6623 -35 5702 2728
409 2728 -1938 -4570 -3184 811 935 -196 4929 7869 858 -6169 292 9596 5805 -2700 -872
424 -872 3901 -3412 -9668 47 6193 -1224 -5433 -3317 -3751 -1077 1578 -4376 -1041 9043 -161
439 -161 -13295 -519 11255 80 -2119 7286 270 -6441 3000 5073 1472 5767 2045 -7007
453 -7007 -2 5631 -4473 -2311 8323 -1261 -11934 -4098 160 -2427 968 -228 -6426 -788
467 -788 2893 -3149 570 10035 4631 -3286 1038 3043 -672 1149 2431 -476 -434 23 -4456 -4022
483 -4022 5710 8276 -879 -4768 1000 1567 -4950 -2505 4296 -322 -6859 -4416 -2336 -1002 4708
498 4708 3687 -1867 2626 5578 -4125 -3066 9922 5310 -7938 -4012 2559 -2346 -2432 2656 1309
513 1309 1386 1741 -3301 -2802 5444 2893 -3253 731 2087 -4350 -3919 1102 1968 1920 -51 -4826 -2729
530 -2729 2173 -714 -2290 3629 2141 -4685 -2288 2061 1648 3403 3371 -1619 -1775 1442 -727 -1685
546 -1685 3683 2816 -2449 -2173 467 1259 2319 1049 -70 1476 -1121 -6460 -3709 2273 115 -3908
562 -3908 -2762 -1235 -247 463 184 2369 6791 3166 -4360 -1826 4998 3523 -1367 -700 2212 -243
578 -243 -4095 -890 5210 3400 -2103 -1575 -832 -2648 -201 -76 -3104 -4 964 -6879 -4993 6844
594 6844 2958 -5437 2263 6445 -3434 -3274 4608 2693 1403 3590 -2088 -3537 4840 2925 -4376
609 -4376 1639 5261 -3633 -5554 445 -1044 -1405 2071 -1502 -4691 -158 389 -2298 2634 4704 -2344
625 -2344 -4191 1253 1346 -1080 854 2079 528 95 -49 -906 2421 5624 2051 -3431 -1101 2364
641 2364 -1185 -3634 1217 2985 -3127 -4178 55 1049 -295 1074 500 -416 440 -2317 -4563 2271
657 2271 5870 -2558 -5345 2608 2443 -2615 781 4777 2161 -79 -1288 -2527 2155 4747 -927
672 -927 -2772 2154 693 -3872 -287 2482 248 -210 -1075 -3879 -1579 1240 -1101 -870 1747 -1377
688 -1377 -3120 1113 1797 484 1976 1219 -1358 112 419 -1182 2025 4580 -152 -3225 -43 1514
704 1514 692 1026 -284 -594 181 -2450 -4071 827 2959 -1334 -2972 -587 139 -935 -537 1205 2801
721 2801 932 -3032 -1767 3356 2351 -536 -17 2061 883 -1986 -1762 2357 4161 -491 -3083 44
737 44 759 -2060 -205 1737 -196 -342 -1873 -3170 659 3429 -1661 -2086 2861 -373 -4941 933
753 933 4523 -89 -627 1303 -1638 -993 2908 657 -1060 3010 1415 -3833 -941 3229 519 -153
769 -153 625 -1831 -1842 756 -700 -1248 2189 1176 -3609 -2402 841 417 -357 403 8 -444 -634 -1120
787 -1120 737 3354 1893 -1359 -634 2068 546 -1456 1218 3591 575 -3682 -1647 2151 983
802 983 -982 -325 -193 -737 -1497 -2092 -799 2439 397 -4010 -1175 1595 -865 -920 3432 2422 -1495
819 -1495 -298 853 917 2566 1456 -796 370 1188 -2067 -1201 2651 1598 -1264 -710 -951 -1516 732
836 732 445 -2155 -219 474 -2993 -3008 1540 1777 -216 317 -679 -231 1605 916 -225 2353 2553 -2056
854 -2056 -1718 1530 1371 13 261 480 -570 -1585 -1656 305 1914 -17 -2346 -1321 662 -500 -1558
871 -1558 607 2145 567 -2230 -1726 1320 1407 -309 81 857 -166 -580 -170 1010 2218 1370 -1141
888 -1141 -454 1400 -63 -1365 1430 1219 -1905 -2129 -845 -162 1357 1087 -1309 -280 1375 -965
904 -965 -1940 1622 1726 -1651 -1501 -569 -1049 505 1687 103 325 2319 -26 -1621 1788 2644 144
921 144 -646 -74 -972 -588 -23 -390 609 1204 -1702 -2337 606 1207 -696 -768 160 -336 -1462 -1305 155
940 155 1702 876 -1676 -1117 1073 525 -599 1011 2096 904 -1223 -722 1379 1656 129 -570 594
957 594 -299 -2229 -1412 47 549 -396 -1995 -1667 440 272 -816 872 1876 -200 -1259 -8 136
974 136 822 939 -564 -817 982 114 -903 1729 2428 56 -290 393 -835 -300 707 -997 -1339 268
992 268 -1227 -3303 252 2306 -531 -1128 665 292 -375 299 103 1012 1475 -498 -2381 441 2330
1009 2330 -305 -681 1381 1227 -1088 -1120 1031 1346 594 -868 -1063 -328 163 -790 -355 990 135 -1663
1027 -1663 -1753 595 820 -546 -294 689 -338 -666 362 1254 930 1156 -162 -1274 472 876 -464
1044 -464 140 1762 -111 -1419 -160 533 176 859 526 -1293 -593 91 -1422 -597 1223 -109 -2091
1061 -2091 -987 309 -113 648 858 124 706 209 -1115 -30 2496 1004 -1044 -317 859 -54 -54 274
1079 274 791 955 -764 -1621 -58 963 -425 -833 -66 -185 -1116 -1396 -112 901 572 -599 -996 220
1097 220 193 -610 287 1695 721 -686 -53 493 1317 669 -66 475 349 -683 -758 258 790 260 -910
1116 -910 -1284 -509 523 -372 -421 593 69 -1391 -698 143 49 665 95 -933 -71 816 -361 396 1709
1135 1709 777 -909 -101 553 177 676 358 -352 325 360 -1595 -833 1845 527 -1742 -560 524 -1101
1153 -1101 -718 439 305 133 7 -1113 -486 1350 732 -765 241 1484 -496 -941 615 1456 628
1170 628 -287 -610 62 411 -30 -102 461 516 -758 -1493 -237 600 -163 -855 -82 231 -883 -865 467 762
1190 762 373 249 -329 -436 904 485 -463 962 1232 -644 -847 1023 832 128 754 -343 -476 117
1208 117 -397 -1012 289 1000 -984 -1584 -17 187 -363 10 40 -266 30 -312 -501 982 1016 -235 -576
1227 -576 755 275 -484 494 1085 633 -330 -1058 -99 636 117 -674 -45 533 -440 -1188 58 680 304
1246 304 -786 -971 -108 329 -234 -144 966 290 -403 -153 422 666 758 207 26 605 -43 -700 224 1104
1266 1104 502 -234 -415 -339 72 87 -489 -31 365 -774 -1239 22 205 174 30 -510 -371 166 160 -383 604
1287 604 1332 -210 -897 494 733 -105 455 414 231 71 -419 -590 831 1124 -424 -1031 603 146 -925
1306 -925 -458 795 115 -762 -842 -466 293 450 -550 -394 875 255 -684 298 1186 611 -220 -211 349 269
1326 269 78 300 563 525 -344 -788 -4 590 134 -357 -631 -134 -451 -1133 -335 490 -64 -377 -355 -339 133
1347 133 622 133 95 1008 297 -771 -18 1246 494 14 8 -210 120 322 -370 95 963 -22 -1718 -323
1367 -323 812 -317 -537 120 -56 -747 -346 -762 154 727 -244 -865 295 646 -55 1 935 702 -259
1386 -259 -252 222 194 288 -124 195 515 -170 -751 -50 650 384 -352 -365 -163 9 -377 -182 364 37 -442 -653
1408 -653 -244 498 521 9 -44 342 478 -11 131 744 536 -51 -186 -105 122 132 -9 95 498 407 -1072
1429 -1072 -461 539 530 -575 -651 -169 -473 -248 -129 -191 763 181 -1217 -510 816 388 -242 617 506 79
1449 79 -187 194 627 773 217 -525 -55 304 -250 -675 458 240 -642 -661 -419 120 -16 -188 -94 165 73
1470 73 -460 -387 513 463 -202 -258 76 288 229 304 464 566 325 -176 -208 395 323 -257 -233 2 45 -685 -667 163
1494 163 351 -343 -518 -173 125 366 -116 -140 169 -17 -370 -299 702 352 -22 170 330 145 217 87 346
1515 346 319 518 -727 -134 616 114 -545 51 154 -429 -718 -271 59 154 49 -542 -76 373 93 -472
1535 -472 316 826 -108 -71 212 177 -30 389 -108 53 112 -341 -242 578 514 -220 -497 -208 32 -180 -229 74
1557 74 -127 -220 -699 -323 -23 116 43 -144 211 118 -142 82 535 614 161 -354 48 162 401 239 -49 148
1579 148 536 -274 -618 356 662 -405 -496 58 -151 -550 -292 -190 43 131 -465 -395 150 352 -262 -199 591
1600 591 187 -394 115 563 480 119 -139 -182 162 194 -252 226 479 -337 -640 -308 372 -204 -77 -74 -153 -270
1622 -270 -273 -190 33 135 -75 -155 -171 138 188 84 449 470 -41 -110 -80 417 246 166 -21 240 151 173 -274 199
1646 199 519 18 -574 -30 21 -1 -138 -23 13 107 -375 -478 -13 675 -36 -475 139 367 26 -20 111 513
1668 513 294 -247 -260 444 441 -60 -327 295 72 -539 -179 304 -96 -212 -572 -450 123 32 -269 -84 542
1689 542 -203 -241 -117 376 -62 339 -47 -164 149 -94 -43 499 410 283 40 -8 121 110 -30 62 228 -181
1711 -181 -143 -641 -164 361 -205 -403 -348 -129 -102 -341 -23 426 138 -290 -156 398 193 132 168 368 425 -14
1733 -14 -419 320 734 -22 -376 29 49 -226 -277 286 425 -240 -211 -448 -235 351 -207 -260 1 -5 -399 -262
1755 -262 323 258 18 -18 134 126 324 75 82 497 -16 -322 21 225 297 -107 -200 -157 -187 -175 -350 -34 -51 128
1779 128 -415 -269 -170 264 74 -227 19 -26 -211 -292 197 359 -21 -127 349 20 -205 -121 218 493 321
1800 321 -389 -255 342 187 -611 -98 185 -134 -86 36 84 135 -19 -499 -44 219 30 -250 82 343 179
1821 179 -170 24 61 131 118 -65 210 245 -194 -150 150 133 -97 -188 -95 -234 -70 -293 -166 -67 -23 -611 -102
1844 -102 -30 113 -107 50 136 -141 -48 128 -151 159 184 40 -188 -4 16 10 -45 116 234 -31 -180 121 182
1867 182 22 -401 -229 -210 155 -220 -117 228 296 -679 -403 259 232 -29 -107 318 -223 48 -48 21 531 151
1889 151 -127 82 151 8 -204 166 338 -47 -404 -344 198 80 24 -347 -19 86 -261 -449 273 301 -93
1910 -93 -280 -62 -94 -155 119 148 119 43 3 -88 62 100 165 95 203 38 -8 -186 287 221 104 -182 -48 13 -66
1935 -66 -174 -223 -51 199 -334 -266 192 290 201 -64 -87 121 292 -39 40 332 218 -223 -354 382 376 12 -152
1958 -152 368 -127 -10 -437 96 188 -173 -322 -125 90 -247 -374 -302 511 41 -254 -253 74 -161 10 262
1979 262 149 347 -76 -66 206 338 -98 -41 44 162 -102 -92 -129 -212 86 7 -333 77 306 41 -98 129
2001 129 95 -23 -191 -301 274 145 37 -239 196 490 9 -42 127 25 109 -203 -87 662 53 -191 -125
2022 -125 75 9 -180 43 -168 -9 -75 -198 -151 149 9 -73 258 219 -18 -70 267 451 190 20 270 63
2044 63 86 -50 148 214 -167 -135 -292 284 317 108 -80 112 22 -92 -127 -23 298 -19 -233 -145 -58 128 23
2067 23 -14 222 56 67 -119 -226 227 85 -134 160 239 301 168 140 86 215 -63 -134 -230 214 -99 -341 83
2090 83 100 -117 -306 -167 274 -113 -341 -2 208 -143 -202 27 -21 31 -185 -177 41 372 -55 174 307 253 -85
2113 -85 -45 147 225 66 -10 82 -74 -177 -371 -151 64 -92 -184 168 116 55 -133 81 -109 35 229 -66 -11
2136 -11 271 39 -196 231 -95 7 34 129 149 172 128 -254 -83 10 217 -148 -114 111 -155 -273 -225 161 162 -125
2160 -125 -431 -51 339 157 -1 -2 223 -206 -108 206 313 78 -99 -4 506 136 -273 154 7 -107 -160 -94
2182 -94 112 151 -117 -254 -46 -135 -279 -197 -43 142 -110 -147 -2 68 131 -126 150 345 438 -45 -97 -66 307
2205 307 244 43 -24 -208 -107 -141 -187 289 203 -178 -150 -96 114 -116 -364 -52 61 177 -220 86 191 237 -49
2228 -49 29 66 154 -23 -171 29 -25 -14 -268 439 -22 -44 -298 -177 -33 -209 -195 -147 -110 64 -155 -92 186 6
2252 6 -5 -250 212 -339 -72 -184 171 342 66 66 112 170 11 49 261 170 263 -133 -59 -60 -150 49 -379 139 -124
2277 -124 -216 -285 -150 -151 82 -256 -202 -196 209 5 101 12 30 107 -143 89 225 149 -126 107 239 318 -230 -30
2301 -30 102 190 2 -102 -270 194 -261 -24 20 179 -384 -179 -57 -67 71 -45 -317 290 20 -209 38
2322 38 117 114 64 8 272 232 -1 -155 189 52 67 -22 -94 197 -130 -78 -177 -133 -10 -168 -24 84 -270 19
2346 19 -41 -87 16 -158 115 40 118 -62 12 -50 -20 148 -24 418 208 105 100 -89 172 -305 -156 -349 -217
2369 -217 168 -446 0 -65 181 -27 -39 -318 35 160 -208 128 88 179 -35 37 224 172 79 88 106 322 -20
2392 -20 -246 157 141 -110 -195 -19 -124 -6 -89 -272 44 230 -305 -198 -179 171 -162 -180 116 62 7 218 19
2415 19 228 60 -184 2 -45 13 -17 -26 4 -16 -69 -219 -29 55 -162 -12 -170 283 -133 -195 2 -8 5 75 -89
2440 -89 157 33 -264 154 -206 247 83 175 141 262 213 -95 53 353 44 -132 -104 198 166 66 -79 -124
2462 -124 98 -49 -187 -273 129 -22 -23 195 175 -68 -345 -255 321 -54 94 -61 325 -59 -176 6 -28 218
2484 218 -5 -31 192 -32 47 70 -163 -162 -111 118 -233 70 -58 -205 -195 -91 -268 190 162 63 -230 226 -383
2507 -383 -105 143 -10 232 8 297 -36 32 -47 61 295 169 -148 -163 228 17 -213 43 -83 -25 -252
2528 -252 -98 98 78 -261 14 -9 -17 123 -13 168 303 -23 -81 -77 135 96 -15 -56 237 -32 -4 -44 297 -60
2552 -60 -14 -30 87 189 84 -326 -28 -233 -102 -152 -87 -23 -57 -23 155 82 -68 36 156 -144 217 -74 147
2575 147 -92 122 249 21 119 5 -160 40 43 211 60 -42 -137 27 125 61 -307 52 160 231 -50 -127 334
2598 334 41 54 -38 -115 -29 23 -99 237 -204 4 40 121 409 80 -154 0 33 -2 -156 -95 80 -66 -120 197
2622 197 18 -233 -37 -182 209 235 -119 101 -115 -8 149 -28 40 246 -102 -17 -123 -103 93 -191 -4
2643 -4 0 -171 -75 3 -78 -55 -89 -2 -140 22 -203 7 -161 -18 -99 -12 -22 -28 174 49 90 274 68 248 -98
2668 -98 22 292 87 33 -92 147 194 -23 -289 -32 -60 83 34 177 127 -79 -313 -163 -143 95 -46 -305
2690 -305 176 27 -45 -42 -3 84 -7 184 31 166 -29 15 88 281 152 5 243 225 136 -202 77 -161 -17
2713 -17 -106 -156 3 -45 -144 -21 -289 -31 -43 -131 -17 95 365 -32 80 -53 -11 119 119 33 38 188 109 -54 124
2738 124 -72 -174 26 142 -128 -291 21 71 139 -175 -335 -256 54 100 222 -88 -210 190 -54 280 159
2759 159 -42 -189 46 189 154 37 71 65 -47 -149 158 165 90 29 106 -58 69 -108 10 33 -116 -144 -184 133
2783 133 340 51 -28 117 55 -97 -96 71 351 198 -82 244 -17 193 135 66 220 133 72 42 -231 -13 -47
2806 -47 -304 195 -2 -151 -111 34 -67 19 -82 -190 87 73 -224 -40 68 226 176 -16 59 -55 -20 -173
2828 -173 2 48 145 163 -253 84 62 2 -227 -328 -3 -198 -50 -21 -7 -23 -174 -32 -134 -214 -113 -15 -20 -40
2852 -40 101 -102 39 39 141 -285 -71 -56 72 -160 11 -17 -144 26 -28 29 198 -163 -347 -373 5 245 -16
2875 -16 76 158 -42 157 -109 -290 163 -65 -242 57 -111 105 12 49 32 179 -260 46 425 155 -109 -189
2897 -189 18 30 -266 -13 -49 -17 -271 -218 8 127 -281 -211 -186 142 -239 -320 185 -53 -4 -127 73 254 -66
2920 -66 -79 178 -28 68 48 208 36 -43 67 0 148 -72 128 46 -27 -117 -181 -2 52 35 142 -124 -221 -381
2944 -381 83 -229 209 -72 -48 -55 24 79 -179 73 -22 -186 312 125 -174 -139 -161 195 52 -85 -127 91 260
2967 260 -91 -184 66 6 -191 -133 152 -41 -14 -188 28 50 42 273 181 -47 31 -261 41 -49 -50 -115 -198 252 -87
2992 -87 -53 40 315 -47 -64 149 -36 54 -194 -103 48 -81 -294 136 -51 162 202 143 -259 76 87 42 -16 95
3016 95 32 50 84 180 -59 -1 191 62 54 -82 -75 -121 53 157 -112 -312 -129 -132 93 63 142 2 224 148 238 -60
3042 -60 -12 -128 -192 56 -121 27 8 46 21 -202 -250 331 7 2 -2 -72 -199 -19 99 -34 146 -348 -98 -152
3066 -152 109 -121 -283 53 196 41 22 112 50 -78 212 -82 -88 157 176 57 195 298 64 -75 -98 -260
3088 -260 -55 -91 -6 48 -47 -3 22 -128 -34 -20 -46 93 -95 46 177 94 46 -108 290 -146 103 225 233 -182
3112 -182 200 -9 47 99 -2 270 -26 -158 -260 51 154 9 206 50 102 -256 116 21 -92 221 40
3133 40 17 35 -102 30 228 157 45 267 124 6 -3 13 20 100 -62 -220 13 10 112 -3 -91 113 81 -45 -139
3158 -139 24 139 38 -214 -53 135 130 187 -131 31 186 -42 -164 5 -8 115 -158 163 81 -90 290 -198
3180 -198 -49 114 -350 -331 -28 44 -15 -152 14 65 -202 -100 -117 162 -165 -13 55 -93 -104 12 307 42
3202 42 -15 -121 -173 191 31 122 97 189 136 -109 82 14 -126 -250 -32 121 -3 -26 -47 172 319 -82 243
3225 243 -41 47 -149 170 272 102 333 340 239 132 15 -235 -18 -124 69 168 153 -46 76 57 -327 -85
3247 -85 -154 186 12 -160 -111 -8 -246 -26 -116 -46 -147 7 -88 61 -9 -118 149 53 141 214 -233 284 114
3270 114 -24 -76 -90 202 128 -107 71 -116 25 54 -187 -90 -47 26 -149 -154 257 73 -291 21 -100 142 75
3293 75 179 92 109 6 237 69 22 41 -129 399 -226 -70 43 -36 52 79 -182 -188 -24 -25 -169 -58 -41 50 2
3318 2 -180 -46 -129 189 6 -140 240 -3 -90 -239 -62 -261 16 185 323 75 -286 -60 79 1 3 -282
3340 -282 -158 25 83 -250 58 145 23 -19 -55 103 -136 12 -92 341 101 -157 -111 -56 234 -144 -20 90
3362 90 132 93 176 -118 -36 -97 102 22 57 -128 34 -78 -337 -60 46 -241 -408 -27 -202 123 -164 185 9
3385 9 -106 174 15 11 241 171 -35 124 -99 122 -80 46 167 -85 -91 -62 164 -77 -67 -18 85 -47 24 -137
3409 -137 -102 53 -8 167 -197 76 22 63 178 65 59 -253 -194 78 -79 -137 -158 162 33 198 -16 -398 -153
3432 -153 -21 112 113 76 -22 -9 -127 112 -151 -377 56 -136 128 163 60 150 -4 -106 193 112 28 307 78
3455 78 188 114 -28 145 72 247 193 165 -185 -177 19 -179 -42 -72 112 -185 104 2 -13 -10 63 143 364 21
3479 21 -272 -175 83 120 50 -32 93 29 -181 117 140 -146 87 37 -223 -85 -79 -85 -75 -225 -99 -165 143 -129 215
3504 215 -167 355 90 87 319 -102 125 140 -68 12 141 2 -133 -58 -114 8 193 -126 164 -112 -108 -193 -182
3527 -182 -84 -161 -128 -232 -117 93 -39 -2 172 99 21 33 78 68 -19 126 -133 -146 -149 -32 44 -9 313 -92 -68
3552 -68 -103 147 -170 204 -1 47 61 -396 -110 -155 61 -18 -197 -33 -7 -39 -145 67 134 -72 34 290 36
3575 36 149 -63 120 -52 -144 -133 155 -252 -262 168 -27 11 5 -247 105 -14 -25 -37 -25 153 173 -182 40 -197
3599 -197 40 169 63 -295 -42 23 115 174 44 -121 246 -281 17 -58 82 -179 -52 267 122 201 101 98
3621 98 -40 -219 -239 137 -215 -52 85 44 40 -144 -14 -110 361 -151 58 -169 -59 119 -7 -16 34 286 38
3644 38 -168 121 268 -91 -42 -19 -249 -23 -147 154 100 -91 -2 98 36 -97 379 -190 -137 -169 -97 27 189
3667 189 70 100 393 42 345 133 -65 -225 -63 -66 -128 -6 89 205 -23 137 -174 -32 -73 -126 12 141
3689 141 155 -134 59 -271 42 -5 33 80 4 138 77 77 103 -53 71 -26 151 11 -69 16 50 28 150 263 91
3714 91 10 59 -121 -167 44 49 -93 -11 104 359 -66 -110 28 114 -111 159 167 55 34 72 148 -218 180 -179 261
3739 261 -197 66 -56 69 -48 215 203 -74 221 238 14 -229 206 201 -226 -77 -322 156 -12 -50 -190 132
3761 132 111 9 -97 -3 -237 59 -40 183 170 -163 -40 84 9 70 -112 136 -7 23 -103 -206 -170 -180 34
3784 34 -7 233 251 55 161 145 90 -238 -116 62 -270 185 163 354 65 41 -89 96 -120 -68 58 48 0
3807 0 334 121 133 -145 212 108 150 71 -165 178 -128 67 103 -39 -13 -24 255 177 129 -188 169 -69 -218
3830 -218 17 245 182 341 52 125 -9 -242 22 -94 -164 -111 -65 -225 368 13 100 81 -80 147 -84 122
3852 122 98 237 1 221 -246 -57 -366 -296 73 -229 -16 -69 27 8 -54 58 -410 76 173 88 -86 -118 -204
3875 -204 -31 -385 80 -189 -98 61 -88 55 -154 72 90 -28 61 -51 3 236 27 110 -113 81 362 24
3897 24 -253 43 -61 -33 177 -24 32 -104 -79 -81 -181 29 38 -16 266 211 156 -116 -29 289 78 -31 11 -43 -15
3922 -15 8 44 100 78 23 159 83 -12 -228 -73 152 -150 67 -149 53 85 119 120 -257 133 -65 4 -40 67 203
3947 203 -154 11 155 356 -51 177 -349 44 164 132 54 -97 94 268 113 -97 254 -174 -19 -76 -127
3968 -127 -97 -259 -40 25 1 -95 -158 161 195 -249 -57 -262 -215 181 -141 -222 -64 56 25 116 -98 -252 185
3991 185 63 -162 -180 -248 -91 -128 46 -136 -109 36 -219 -66 -75 25 201 218 -6 73 -117 -63 165 -71 -12
4014 -12 159 -103 -34 82 -11 -205 -3 -156 -11 91 134 83 98 -169 74 -5 -14 -122 11 126 -184 -116 -35 -100
4038 -100 -170 38 110 -96 -287 74 318 -54 242 184 230 128 272 182 142 -289 34 -42 141 -17 -8 -83 18
4061 18 5 -145 147 42 2 67 131 6 138 38 -66 -86 18 15 -91 273 -142 111 -48 42 -103 -234 75
4084 75 103 -69 -31 -16 -40 96 -311 -188 -90 -122 132 247 -69 -396 -60 -54 -261 -118 63 124 37 105 309 260
4108 260 47 -126 -170 246 61 -60 54 -215 95 -16 -24 -101 49 -5 -132 16 -172 -130 33 -226 56 63 65
4131 65 -141 -209 -56 48 -151 -37 122 -198 182 150 -25 84 -107 12 -66 125 5 83 142 72 -60 60
4153 60 -23 -92 39 49 3 -67 -140 -102 -76 41 14 63 101 14 210 90 127 256 29 117 142 -232 -10 94 -169
4178 -169 -121 62 -37 -140 226 -75 -149 -37 -126 128 -268 -182 -70 15 259 -139 -118 -155 195 188 149 -174 -18 -159
4202 -159 93 -22 145 -51 81 -14 183 -31 212 193 -84 39 -92 -156 -83 -9 -188 -68 -227 114 32 45
4224 45 -155 -212 -60 228 108 -76 14 220 100 -105 212 -2 62 218 0 -158 111 -107 -64 -157 -232 76
4246 76 -72 -89 -43 6 236 -30 -175 36 5 34 74 3 -93 -126 -99 23 -208 51 207 119 -189 91 134 237
4270 237 -83 80 80 57 -149 -16 70 -6 217 -101 -92 -149 -170 50 108 191 -284 156 36 120 132 -59 148 188 53
4295 53 79 -28 -373 -55 -48 100 -27 -100 -65 171 0 -75 -17 -208 -126 183 107 123 117 -74 144 -3 67 308 29
4320 29 -86 96 -75 -70 -82 -135 199 139 247 -95 -96 65 -31 177 -26 135 -22 -19 -133 41 -94 -48 76 22
4344 22 200 312 -7 71 -52 -51 77 -86 196 -240 58 356 -30 -197 -109 -166 300 26 -362 -33 -8 107
4366 107 -1 -7 -59 88 -180 -116 62 -37 -24 64 -91 128 105 -110 -112 8 -61 -232 -25 24 144 -179 -90 94
4390 94 -62 -269 71 189 -53 38 1 113 -84 -19 -161 123 -188 -69 151 -48 -156 113 243 -38 151
4411 151 -26 -61 -187 -8 207 72 -83 -144 -173 42 101 203 -60 -73 267 70 -87 163 -79 111 54 35
4433 35 -12 -329 -1 111 -101 261 34 -95 -72 115 -30 -186 63 10 38 137 -238 -50 -157 -62 144 116 -105
4456 -105 87 305 209 13 59 -148 -255 -32 -74 -151 45 -25 -37 -80 -197 101 177 123 126 -80 103 287 -79 45
4480 45 157 -103 -124 -277 -40 122 -31 380 181 -372 -292 180 224 47 110 98 173 -112 -63 -178 -7 181 9
4503 9 1 -115 -13 -84 -84 161 102 172 44 -36 -148 -65 65 145 -20 -15 5 -146 -221 -34 148 191 61 -78 -74 -157 -53
4530 -53 -114 125 -163 -309 -102 207 -52 -24 250 -67 27 67 -82 -34 -197 46 40 158 134 -2 -277 -100 3
4553 3 -28 -44 171 -224 285 262 -24 52 -18 66 41 208 -109 -102 -107 -111 -231 -364 253 -170 -112 -133 44 13 -77 123
4579 123 292 -135 -29 -145 -178 -283 146 -5 34 3 -198 -196 11 -152 -70 149 2 258 -166 21 111 26 -92
4602 -92 -74 -152 -18 300 18 -5 312 38 272 -106 54 158 -129 -233 -300 19 -23 82 189 30 -190 -21
4624 -21 -47 -50 -13 -11 -58 80 -85 152 -38 124 239 40 -2 187 -118 -133 50 5 242 -139 -128 -161 59 127 -119
4649 -119 -99 229 -81 -106 60 107 -196 -37 240 -61 -238 98 131 -108 -99 190 -96 -109 -119 -169 291 25 44
4672 44 228 -125 -172 -130 -159 13 -69 178 -86 202 -166 1 -150 -1 135 -180 -118 35 -149 -77 127 -62
4694 -62 73 47 -10 -41 210 -37 -102 -419 164 32 146 199 177 11 -15 -161 -55 5 54 40 24 -119 -5 -43
4718 -43 -70 -63 29 36 135 -97 229 167 93 -116 -49 -48 102 -80 178 64 95 211 49 -9 143 197 -81 80 -29
4743 -29 -1 -161 -167 92 -91 22 139 -115 -93 -73 -21 -175 44 -30 -277 77 -108 18 153 -56 44 -11 64
4766 64 191 158 -186 212 -142 -29 -67 184 -88 -78 -219 8 -155 -117 -132 -250 -206 -85 -67 -150 -157 -5 55 -49
4790 -49 -197 -253 211 131 -17 -59 138 60 -172 153 26 -128 -94 142 151 44 -66 148 60 198 -180 33 -34
4813 -34 -68 -67 -230 -234 8 228 -222 42 -261 100 123 230 55 126 -63 117 -89 -95 154 224 60 210 256 44
4837 44 92 -113 -239 -80 134 143 141 31 -53 -16 1 -37 -134 24 69 -109 -12 68 157 -68 14 103 274 64 -164 -341
4863 -341 70 53 256 62 -214 -71 -127 100 -22 70 -223 -118 -52 -18 110 -109 -32 -7 -7 10 -141 38 -103
4886 -103 -145 -110 145 187 45 -322 148 127 110 65 -38 -72 46 -243 -22 169 -190 -25 72 -24 -14 -86 -210 105
4910 105 178 -147 -116 -216 156 -19 216 -239 3 14 -48 122 81 -229 124 81 -35 88 33 -232 142 67 -109
4933 -109 -57 -302 -151 -3 86 -101 -103 -47 98 43 125 70 66 15 167 -124 120 53 -117 97 229 -11 129 -28
4957 -28 14 118 -197 182 -115 -49 -130 -39 -12 188 -27 -26 102 28 -106 118 -61 -10 36 -26 234 -68 44 -205
4981 -205 -140 -96 -127 112 72 -24 -55 99 -259 20 -17 -109 -172 68 -1 -91 -127 36 49 -51 41 -183 -43 65 -186
5006 -186 -17 6 59 55 -195 67 42 -110 59 2 112 -83 221 -211 281 257 58 228 -165 -64 -101 -48 -108
5029 -108 -83 97 233 -49 -244 124 11 63 330 58 -114 105 -2 -7 210 86 -12 74 -39 20 -53 207 34
5052 34 236 93 -205 21 -27 -27 -174 -90 -53 -222 -175 137 -23 -34 122 -187 -73 -161 255 140 -263 -33 -2
5075 -2 32 -46 52 -34 251 -240 79 213 -29 -41 171 162 -71 -4 -105 -232 -166 267 -20 -18 -81 197 -342 -6 -120
5100 -120 -37 79 170 -226 -53 96 -121 -4 237 157 -148 -75 3 48 -134 12 -19 -130 -36 -31 -249 236 89
5123 89 20 185 140 130 -55 16 -121 -192 125 -168 -235 -85 -90 82 -7 216 -109 -19 -11 -168 -94 -20 32 -232 -16
5148 -16 -293 -14 255 -73 -217 47 87 40 44 -101 -19 -56 -76 132 -16 -16 128 20 -120 -43 -30 -274 -80 -359
5172 -359 160 -106 -138 -54 148 11 123 63 -181 -42 -108 41 272 -33 -43 172 -51 15 -7 -169 -12 59 82
5195 82 49 115 -104 -80 -83 65 243 -90 -29 212 -13 242 138 -331 -52 104 -135 13 -39 -8 -75 214 77
5218 77 -8 127 -166 -245 24 -219 -116 -13 151 98 49 21 114 -29 39 191 121 283 -72 36 -191 160 131
5241 131 -171 243 12 -11 219 85 0 -153 72 117 -151 -151 -187 88 -238 66 177 8 -247 45 -18 51 51
5264 51 38 -117 31 -16 60 -41 -97 22 -116 140 48 -216 83 -60 117 -150 127 93 11 -23 -138 -10 -208
5287 -208 -50 146 -15 -7 44 187 -1 43 130 -141 -84 70 179 -127 -112 -17 62 68 -44 134 -135 65 -25 49
5311 49 -44 70 -16 -37 8 -110 23 158 -93 41 187 105 258 94 -194 132 -106 -38 63 16 152 -39 150
5334 150 298 91 -109 59 26 -72 -74 -227 136 -170 53 66 61 -73 122 48 20 -6 105 6 239 95 -89 -53
5358 -53 99 -92 -159 95 211 50 -50 -118 112 -117 -133 -149 133 312 93 96 -303 -46 -280 -16 73 68 95 23
5382 23 44 -180 53 -96 39 185 -66 150 18 254 -8 -23 292 -133 51 49 31 -22 106 120 92 199 121
5405 121 41 -37 -216 -108 8 -20 -106 -167 -250 130 57 -44 0 101 8 -117 -171 134 38 -29 -108 -148 -126 -196 -59
5430 -59 183 -46 -92 -62 180 -59 -102 159 -157 113 365 -84 31 -175 -152 21 245 111 -219 -26 -284 72
5452 72 -82 -86 -83 -49 38 52 -55 -57 181 -60 -149 24 70 -245 39 -35 -162 102 -54 -106 -135 170 -16 -61 183
5477 183 -2 93 189 -37 103 61 -221 -49 13 -30 -29 238 -44 95 -287 138 246 -84 90 -100 -66 -155 39
5500 39 -218 -319 181 -169 114 11 -75 -149 -186 175 154 -106 106 60 -206 30 213 34 -265 36 71 -51
5522 -51 -88 -208 -92 142 212 10 338 -68 34 143 55 -56 -120 -202 -158 88 146 119 -116 113 88 87 25 105 23
5547 23 134 154 -176 201 42 79 54 41 -47 29 -143 -175 -107 -66 255 -130 -77 107 143 38 125 -421 -102 74
5571 74 349 -177 144 -69 -110 148 -7 86 19 -50 -115 51 -142 111 46 78 52 -403 75 176 5 116 -336
5594 -336 -29 -196 -153 -281 -85 111 -133 121 -228 -35 -157 87 -226 162 -246 9 160 329 85 35 65
5615 65 -89 -203 -177 8 -307 141 -254 33 -109 -129 -299 -18 -21 78 102 -50 64 -218 79 -241 -125 202
5637 202 -9 -42 161 79 -13 -45 -78 -39 207 -124 -1 -94 39 -23 96 36 76 185 -154 78 -65 -121 -99 177
5661 177 -91 170 -233 -94 279 -46 -133 -264 94 -47 -85 -25 24 -33 -239 -78 -144 7 -265 40 277 -62
5683 -62 -252 -74 -88 -5 19 -77 290 95 88 159 291 -134 150 138 -24 80 100 50 57 153 123 -128 -33 -108 -3 -260
5709 -260 -71 200 -75 72 45 198 -31 112 80 -173 192 -99 103 -158 -129 9 -218 210 -160 -187 -49
5730 -49 173 94 -85 46 61 127 230 -24 -168 -107 -74 -28 45 -72 -105 -143 111 -232 77 198 253 -185 104 -145
5754 -145 -30 -56 71 161 322 -103 -27 125 138 156 118 95 -44 -198 18 -27 47 64 -44 -185 -80 81 164 -68
5778 -68 70 293 283 -48 -190 -72 75 -157 -47 218 -50 -184 173 241 281 -18 122 -288 -152 130 71 18
5800 18 175 16 9 112 -72 90 -93 -6 52 159 -14 62 -24 -139 3 72 46 6 101 -163 -274 223 -112 -182
5824 -182 -218 117 250 -140 127 116 -216 -138 -165 -33 -108 -82 31 -98 -49 224 -32 56 -101 -9 -6 -50 -1 -61 -87
5849 -87 -176 -135 -137 163 -149 77 -236 -36 161 -219 -98 -43 89 -68 -83 -24 286 16 -23 213 -11 9 194
5872 194 30 61 109 -57 120 88 141 -281 -206 121 -164 -47 -30 -8 -212 44 -63 41 -136 21 -192 -187 114
5895 114 328 -109 -45 -84 -266 9 132 187 40 -38 -107 84 100 49 -100 -337 131 -25 71 100 58 -32 2 -145
5919 -145 -96 185 -19 9 -200 -171 286 -83 -120 35 -12 -36 -53 -96 42 230 334 -103 64 -163 -34 -71 35
5942 35 74 -35 -108 80 -90 0 185 276 51 -16 90 56 104 251 192 -55 250 38 156 -75 295 -56 54
5965 54 -112 190 -100 -149 -69 -28 -19 55 -131 150 24 110 83 -59 24 156 107 51 61 13 110 110 -277 -58 -38 -112
5991 -112 78 -45 137 88 -185 -124 42 -313 -224 50 -9 -8 -15 73 -108 -98 73 -126 172 -5 50 82 185 194 -43
6016 -43 172 -33 -63 -121 29 131 220 196 -31 -283 -30 126 268 72 85 -25 -176 -77 -1 -153 65 12 -227
6039 -227 3 -124 23 23 111 -43 -119 122 -115 -5 249 -168 185 70 -24 -31 -33 116 9 96 -43 -159 -3
6062 -3 -2 -284 184 60 -193 -27 41 142 101 -82 25 -157 -146 9 -79 -2 -375 -48 85 151 92 49 85 -94
6086 -94 -109 26 118 -146 -145 118 89 132 32 72 -205 -62 9 103 40 73 -46 131 290 32 -264 -9 4 38 -342
6111 -342 -117 -117 -30 106 69 134 74 -142 100 79 145 52 -214 -95 -247 -175 124 -83 -83 -27 -16 16 -50 37 55 61 201
6138 201 -78 88 343 -17 4 -260 -256 275 76 19 260 160 -120 164 71 -64 -128 -125 123 -71 -47 53 32
6161 32 254 -115 107 90 -7 180 183 152 0 44 -238 9 -224 136 48 57 160 -109 105 115 -120 10 -16 -70
6185 -70 11 153 38 -167 114 281 41 373 -93 -14 -82 246 219 -22 133 137 -3 -22 -53 203 -6 -150 -13
6208 -13 -51 -48 -100 -55 65 -43 -121 -4 -39 -20 68 46 -86 34 8 -186 -184 -101 -86 -141 -156 19 -100 -77 78 -1 40
6235 40 -162 94 -174 43 27 50 82 103 29 -90 12 -3 196 -5 95 -169 115 -17 350 -108 -242 76
6257 76 358 47 29 72 -162 -69 26 -8 -138 53 -33 55 -129 -196 12 76 -173 268 -62 107 237 -93 -199
6280 -199 -204 71 -34 -76 293 -187 -82 11 -163 -95 -135 -296 -23 72 -218 -174 20 306 225 54 -164 87 99
6303 99 -22 12 127 -136 -79 76 -9 -52 110 -192 -44 -96 119 83 274 -76 -77 -102 -137 298 23 -33 -232 12
6327 12 85 -3 57 147 41 -22 -254 0 159 98 -49 40 -94 -51 178 170 -133 -114 140 -9 -70 64 13 -314 126
6352 126 -49 -70 1 -51 -283 -223 -96 201 -198 98 15 -36 -84 0 57 -89 -61 -31 79 36 -262 -180 117 -98
6376 -98 301 -92 126 -54 189 -170 -12 -45 4 -127 123 -184 87 -151 50 47 -14 120 32 44 -134 -38 -66
6399 -66 -157 44 -89 -220 -110 -31 44 9 -95 -139 140 116 27 -2 141 -73 -52 10 90 -218 -103 228 245 -60
6423 -60 101 208 -185 -24 -87 -4 -106 219 49 161 -7 -81 -64 -122 189 -168 -138 -75 101 -111 -42 122 8
6446 8 122 -185 -61 31 -102 -92 -142 124 -4 22 -58 -29 206 33 -196 99 22 -2 -118 55 228 29 -72
6469 -72 -3 -135 34 -192 82 207 14 -11 -190 -1 16 130 94 -134 10 -154 43 21 395 133 -27 -43
6491 -43 43 -83 -51 10 312 66 189 43 175 -258 -75 323 -287 -120 -150 -11 95 56 -200 -46 -162 245
6513 245 -266 -133 40 -118 -189 102 419 176 171 -182 -42 55 -18 57 -170 -147 103 -68 -82 51 7 -102 -160
6536 -160 25 40 37 -76 -205 -141 -34 -14 -236 73 244 37 84 143 192 -35 -208 -99 128 -68 -34 -23 41 218
6560 218 -27 191 -55 132 227 2 76 84 -190 -27 -107 -341 45 33 10 68 -61 266 43 -102 -38 -40 -129 113
6584 113 -111 199 119 -232 175 144 -167 -104 18 8 -149 46 -153 -107 -44 -223 134 -3 -38 -30 234 -143 120
6607 120 -8 21 -143 -76 98 -129 63 -142 51 -206 -137 -122 -57 -26 257 -160 -139 -28 -137 6 -22 76 157
6630 157 -76 215 7 -100 141 4 -28 -135 -136 -169 -192 -175 -133 -7 237 -3 53 -26 -250 188 -66 -157 34
6653 34 74 53 134 -83 -84 29 244 212 -36 292 218 299 -47 -265 -108 -87 28 207 178 -25 -119 -26 15 -221 -68
6678 -68 97 76 -99 279 41 68 128 -46 10 -144 -54 -134 -145 144 -134 -51 -93 153 109 -77 -145 107 25 82 58
6703 58 11 149 -151 41 -90 61 135 53 115 -15 185 65 -265 -130 -248 -18 -132 -6 -50 -164 90 48
6725 48 250 -38 12 267 56 253 106 206 -9 -34 -112 -89 225 -269 59 101 32 -18 94 -174 145 130 -82
6748 -82 -74 74 -159 48 168 34 -84 110 256 -242 122 55 44 140 -39 23 -53 1 -55 -10 7 12 -30 43 158
6773 158 109 216 40 219 -99 -239 36 22 -87 -14 -164 -150 296 -4 59 6 -43 -83 -130 -195 -140 17 -121 -202
6797 -202 -107 104 49 15 36 26 51 -101 -44 -128 226 81 204 66 35 -192 31 -82 -33 94 -47 182 -81
6820 -81 19 -89 102 -191 12 9 40 -208 111 -46 89 -42 118 101 -38 56 -137 -25 109 136 187 -48 -73
6843 -73 141 73 122 304 127 106 -65 -123 243 -103 151 -128 139 -108 -32 -168 129 -108 4 10 258 11 65
6866 65 33 16 29 -116 -55 155 -152 98 -129 -48 23 -89 -56 403 -132 -52 72 6 -60 -35 -173 137 359 55
6890 55 -66 -125 -39 -164 41 202 115 -269 95 -85 62 138 189 64 -113 21 -6 41 -64 -75 104 67 -130
6913 -130 -44 -44 -221 343 -74 -46 -45 -21 -19 121 -135 103 -82 3 -137 -131 39 95 206 145 104 -102 -41 -141 -109 121
6939 121 -203 -152 -9 -4 258 27 -67 5 -241 -21 27 39 12 80 268 70 -87 -137 -138 -62 -246 -16 -69 101 38
6964 38 214 102 10 50 4 -196 44 -108 39 47 248 23 -52 -252 -64 117 95 -125 -244 -188 1 15 -35 13
6988 13 -13 -31 -43 -257 73 79 -86 77 275 -114 193 275 -207 -139 -45 -203 261 19 -197 336 77 -11 133
7011 133 -25 14 61 137 -125 -61 203 180 -104 -9 -95 -298 142 -146 104 77 -204 -21 172 -55 275 127 -58
7034 -58 72 -152 73 67 93 120 -16 -31 -90 81 75 -207 17 170 40 -37 84 -44 101 -157 -223 -40 186 -84
7058 -84 91 -169 -88 -127 36 23 12 -179 -122 -153 -109 62 -93 -5 -1 -32 182 -19 -159 181 -100 187 -32 184
7082 184 -187 120 66 -49 0 -227 -90 -30 3 86 141 -149 253 180 128 -58 -49 176 -81 -103 70 229 -155 -18
7106 -18 139 261 130 130 -39 6 -160 -77 19 134 8 -48 63 -195 -277 75 279 96 -63 258 66 -73 -165
7129 -165 -23 -177 153 165 180 -101 81 142 11 219 87 -104 -189 -134 109 54 55 -239 101 -74 -26 -152 -55
7152 -55 90 -95 -161 -75 93 2 -21 -148 185 131 -221 -367 -185 14 47 153 50 -332 -187 4 -74 -7 -143
7175 -143 -63 -52 -81 240 -5 -179 -131 138 19 47 216 -48 -224 54 43 -23 83 67 -9 -19 45 17 -97 -74
7199 -74 117 168 -15 -14 -2 -138 -53 39 18 -188 47 116 -63 -70 -241 -6 238 44 102 6 -176 -140 280 -198 190
7224 190 -251 -74 193 320 14 25 67 233 109 -235 -133 -64 91 -45 -126 -60 -102 -147 -80 -42 58 -125 159
7247 159 47 -142 4 158 198 -177 127 67 215 -136 47 -74 -26 -140 -114 -26 -257 -21 -370 70 39 -156
7269 -156 -230 -42 43 -134 73 -221 56 77 108 -42 150 222 -19 73 16 131 -251 -125 115 99 -75 -140 46
7292 46 -77 135 229 13 -142 -247 -226 52 -122 129 -52 121 62 -50 -87 -54 150 -201 -247 46 -71 48
7314 48 46 -158 16 -29 -5 262 73 60 -50 -243 -10 -154 132 -151 -143 -18 -416 -44 -1 -40 -87 51 108 110 0
7339 0 119 25 -60 -29 -295 91 88 124 -158 153 -304 220 131 131 141 -135 67 55 30 -33 -107 325 78 -76 59
7364 59 -177 112 -173 251 91 19 34 205 11 -97 54 -42 -120 119 -37 -161 109 355 68 -185 -37 53
7386 53 119 -67 50 46 147 -115 -107 56 40 -45 6 -285 100 33 -31 -21 225 -318 116 76 132 210 121 -14 169
7411 169 18 1 -9 88 46 131 345 99 -92 97 -17 31 -243 59 1 -48 -52 -3 16 174 108 5 54 -24 148
7436 148 90 118 157 -56 2 1 -5 269 159 136 -99 58 -144 9 91 -11 132 49 -131 67 70 20 110 -61 -75
7461 -75 16 132 -49 -106 -82 -39 -70 41 -20 89 -144 73 106 51 -178 -192 -47 -37 -119 -59 -10 -7 127 -132 -3
7486 -3 -57 -97 119 244 -79 133 232 238 6 73 156 103 293 -71 106 -9 253 -159 -217 -91 19 -143 -58 134
7510 134 160 -43 76 149 -200 -24 139 -8 -78 -233 45 -39 -47 -298 187 -55 -248 161 -212 7 -137 121
7532 121 -145 119 -97 54 163 74 -35 34 79 -115 157 -24 -62 216 -173 -78 -179 -100 58 -159 -7 -115
7554 -115 -137 -55 154 -3 1 -159 84 146 -72 -80 15 162 16 148 -23 113 -96 100 90 -171 0 107 -296
7577 -296 -88 32 12 268 30 -125 -20 -307 13 -236 -162 139 -186 213 75 59 -211 -91 190 114 99 31
7599 31 29 110 -141 -62 -127 8 -421 83 120 42 235 -159 -315 11 -189 -59 13 184 63 -21 -71 -211 103 -42
7623 -42 65 -40 176 28 67 77 36 279 -69 -157 -204 -55 -114 13 -285 -31 94 -117 -122 -272 96 -7 3
7646 3 -35 382 251 -185 80 211 -100 108 197 117 -39 -121 -5 -126 -176 110 213 116 -28 81 318 77 53
7669 53 76 260 -200 210 -8 5 -45 -100 -103 -109 352 -123 29 49 -38 -91 -63 -20 64 -192 -126 -24 -128 -98 -181 -88
7695 -88 136 136 9 104 76 102 87 10 1 106 -108 144 140 -67 8 16 -76 163 29 158 -33 -5 129 90 164 10
7721 10 -113 -23 -47 -5 -77 94 84 -101 55 -136 44 -32 -25 -27 23 60 -121 -130 -107 38 186 31 16 30 -142 70
7747 70 -105 -91 -14 127 99 -257 29 -140 286 -78 -232 25 107 -39 21 131 -136 -15 -13 228 -22 -33 135
7770 135 -68 -173 -324 -213 -215 -44 -105 -93 -35 64 -157 170 45 -338 -128 31 37 275 196 2 213 147 -185
7793 -185 -98 96 -156 70 -135 -1 7 -111 100 257 75 46 -2 -38 -30 -119 -3 -261 364 -49 102 -179 -153
7816 -153 -112 62 -43 163 65 -137 -32 -176 -64 207 -10 -1 256 -51 16 -73 -75 23 86 -138 87 -90 -61 -54
7840 -54 50 -105 -80 260 -228 -101 12 -73 -202 -83 -38 24 -58 -188 82 -61 257 67 -118 -17 -52 -88 -137
7863 -137 65 -82 -54 27 313 -14 -161 3 145 -384 126 298 -73 -144 225 37 -84 -62 86 -42 -143
7884 -143 44 169 84 -122 186 -192 -248 134 -149 59 -13 104 -17 16 61 -83 53 47 134 56 -43 -35 -80 144
7908 144 -136 -41 -61 -2 -45 -3 -207 86 205 -228 -69 14 -110 -36 -17 39 -282 74 -342 68 -75 -40 -34 116
7932 116 -31 -307 -119 18 -160 -38 -92 -79 -243 -195 -210 189 65 220 39 24 -170 289 -157 -27 86 69
7954 69 58 72 49 -102 81 20 -22 59 26 -3 -307 -117 -188 -242 86 -13 -72 -89 2 1 62 -236 103 131 66 16 135
7981 135 -187 -66 -54 40 -56 -172 98 -116 145 -149 117 94 109 -8 -57 -1 79 -127 21 -9 -89 93 104 164
8005 164 -169 -58 75 -66 -206 31 251 -217 86 -127 -116 -182 105 -102 215 67 -20 -25 44 -178 -45 -236
8027 -236 -85 178 -55 26 137 -369 -71 -79 -69 199 29 -37 166 -181 -79 302 15 -185 -117 -56 119 154 106
8050 106 179 -120 14 121 -188 101 37 -202 -28 29 234 -134 -38 -138 -40 296 -1 -95 -121 -134 -223 -3 -295
8073 -295 176 94 10 136 -268 167 77 -110 100 54 28 -65 -169 219 -28 -167 -42 15 73 -208 -89 -109 -123
8096 -123 26 98 -61 -258 -16 252 107 215 18 -15 131 -156 -138 -16 81 -187 -18 43 85 68 -67 -54 -75
8119 -75 -107 -27 -171 205 -64 120 -17 19 -65 129 142 232 58 2 23 180 28 161 -59 -196 212 -189 13
8142 13 361 82 -20 -304 220 -2 -358 -88 -38 -100 -344 261 121 -17 158 -5 56 -189 -10 164 -3
8163 -3 -7 78 33 5 199 225 -17 -68 66 197 -10 -4 8 -149 -248 34 -73 167 -173 46 50 -169 134 -45 13
8188 13 143 -37 -16
8191a6
$$ Imaginary data points
##PAGE= N=2
##DATA TABLE= (X++(I..I)), XYDATA
0 0 0 0 0 0 0 0 0 0 0 0 0 0 0 0 4 -8 8 -8 8 -8 16 -16 16 -24 24 -32 32 -40 45 -52 60 -68 76 -85 98 -108 124
37 124 -136 152 -169 188 -209 233 -257 283 -313 345 -381 419 -460 507 -558 616 -680 754 -836
56 -836 930 -1040 1169 -1322 1509 -1744 2048 -2452 3026 -3901 5377 -8333 16475 -83964 -247240
71 -247240 49884 133556 -75592 -32202 119550 5291 -37079 38423 8072 -18799 44629
82 44629 28560 -45279 -20894 8641 -24264 -2958 19636 -497 -22432 -11295 12541 5443
94 5443 -1787 -1237 -813 1026 -27972 -32078 -290 27499 27011 -7876 -8631 10273 -1531 175 21416
109 21416 26025 4462 -3454 -15837 -35313 16601 49137 -11909 -34356 4863 -5938 -43804
121 -43804 3093 42124 -10346 -15908 16968 -8091 -17192 24205 24324 -12890 7372 17107 -37971
134 -37971 -29623 24399 12081 -20993 -4639 19710 5979 -2463 3574 11872 24965 -546 -33600
147 -33600 -14557 7193 -1358 -3071 10463 -846 -17863 -5966 4496 20296 29301 -1168 -17470
160 -17470 -3438 -8877 -21643 3872 19618 -8221 -9053 1110 -17688 -1312 29914 6714 -18044
173 -18044 8729 15145 -18224 -6784 20892 8323 -1855 3319 -1374 -8153 -1658 5007 2018
186 2018 1500 -5249 -14006 -9528 2249 13265 5522 -9548 -3953 419 -10130 -9537 10614 14668
200 14668 -4771 -14813 -10567 6713 21495 9365 3523 15211 3810 -18783 -4318 16002
212 16002 -1470 -7701 2643 -11825 -11735 7906 -4232 -11023 21556 15957 -29590 -11274 23355
225 23355 -10280 -22060 18501 11671 -23518 -5765 15316 296 9243 21164 -7924 -12862 14029
238 14029 5754 -13917 5568 18353 -8050 -20369 -6026 3711 8124 5950 -2547 -5996 -4675
251 -4675 -4041 -1754 5091 4418 -2896 -5941 -5258 -1514 136 -1210 4429 10071 4681 -7277 -7737 6427
267 6427 14630 4107 -7363 1268 7270 -9910 -11045 9825 9172 -6570 -4426 -699 -6662 3005
281 3005 11270 -3013 -3431 5206 -12407 -17847 10234 14406 -10846 -8195 6541 -3550 -4419 10039
295 10039 9410 4882 4079 -5259 -7157 6232 4771 -6455 2091 8314 -3132 -7957 -3127 2067 9362
310 9362 5391 -10470 -8077 5079 -5217 -12188 6220 9183 -7512 -7249 1702 -1769 1404 10942
324 10942 3571 -4350 1434 -23 -4168 6014 13091 196 -9340 -1655 3878 -182 -1347 3626
338 3626 2608 -5191 -6381 -3317 -2115 3156 6529 -2445 -7210 1363 1773 -8217 -501 11140 1504
353 1504 -7657 -1963 1834 903 3775 3879 3542 5018 -4301 -10344 4537 11150 -2231 -5708 -81
368 -81 -3694 -3353 3453 1219 2401 7155 -5555 -12631 5516 9375 -6949 -2411 8378 -5427 -12301
383 -12301 2089 4664 -844 2339 1127 -5298 582 4398 -1878 1770 9634 2027 -6488 -2902 1132
398 1132 2017 2539 1219 -595 -614 -3652 -4156 3319 7619 1850 -4213 -5483 -3003 207 -781 -3221 -1218
415 -1218 943 -4373 -7735 830 10450 6803 -2098 55 6495 1295 -4411 3833 9096 -1175 -6792
430 -6792 -1661 -99 366 2926 -1532 -1780 5525 -1233 -13936 -2715 10452 -2330 -9511 1403
444 1403 -1109 -8456 1955 7913 1219 2517 2542 -4911 564 8996 205 -1802 8556 1748 -9075
459 -9075 35 7798 1726 525 -21 -6613 -4217 1075 -4634 -4603 4115 17 -8212 -1794 4391 1365
475 1365 1747 4334 862 -918 476 -2306 -2357 5142 6065 -3220 -6092 2109 5400 -312 666 6629
491 6629 1646 -6214 -3701 -386 -1036 537 -400 -6301 -2625 2700 -3117 -3108 9596 6623 -7610 -4125
507 -4125 5841 1316 -2563 2390 1147 -1317 -419 -2992 -2164 5439 4397 -3575 -637 3087 -2218 -2599
523 -2599 3485 3407 209 -816 -3681 -1476 3881 1156 -2598 1696 692 -6554 -4289 2074 1150 601
539 601 1195 -2595 -2411 2433 1698 97 3395 2299 -3966 -3459 797 1404 1326 897 -15 1775 1803 -1790
557 -1790 1036 6305 2694 -3914 -3225 -1623 -2554 -2365 -2840 -1775 1036 -1103 -6200 -1459 6322 4602
573 4602 -1292 -637 2315 340 -3051 -291 5224 3048 -3365 -1850 1927 1198 2194 3206 -251 87
589 87 1363 -4817 -4793 5024 2483 -8308 -2698 4362 -4414 -5784 4177 2993 -1592 954 -1663 -3397
605 -3397 4667 4775 -3105 1051 6480 -1533 -3869 3696 3627 -83 1816 -603 -4774 -529 1577 -2012
621 -2012 897 3081 -3115 -5004 1276 2533 -1546 -426 711 -1780 -2464 -1558 -1140 1394 4081 1002
637 1002 -3438 -284 4495 1955 -1680 2596 3701 -2765 -4651 756 2112 -580 221 496 -1068 -224
653 -224 -697 -2337 2449 5080 -3087 -7159 1187 2705 -3845 -1531 3322 468 -2585 -1090 -404 2786
669 2786 5044 -534 -3108 2098 1706 -2585 745 4292 737 -1048 -114 -1472 43 2858 347 -1555
685 -1555 291 -1546 -3638 95 1613 -1354 -638 139 -2206 -861 970 -461 998 3203 -1039 -3953
701 -3953 619 2890 1386 792 475 -9 932 -67 -1592 2427 4218 -1448 -3874 -624 481 -884
717 -884 -1008 121 714 -935 -3794 -1921 2709 1945 -1871 -1478 806 145 -1773 -816 3143 4028 -704
734 -704 -3131 864 2404 -368 288 2424 132 -1378 -1020 -1548 1068 3164 -1333 -3457 1501 427
750 427 -4509 198 4606 -1182 -3390 199 -1076 -1568 2367 955 -2329 1347 1757 -3070 -519 4332
766 4332 1577 -1343 582 -266 -1194 1972 1189 -559 1752 1069 -2893 -1826 2318 1227 -891 -474
782 -474 -711 -1450 -1275 -1006 115 1804 41 -3046 -1309 1828 736 -851 1177 3327 286 -3003
798 -3003 -155 4020 2095 -711 66 758 -315 -319 -86 731 2397 -196 -4004 -1852 1720 -914 -2213
815 -2213 952 565 -3440 -2140 803 806 1070 907 -1003 -183 2203 -654 -538 3535 2124 -1766 -968
832 -968 672 -43 1529 1567 -939 -383 1112 -1875 -2439 1736 1466 -1944 -1794 -1274 -1559 348 374 -1032
850 -1032 947 1527 -1984 -1824 2579 2323 -76 111 773 -82 -635 -245 1392 2267 214 -2531 -842
867 -842 1449 -108 -905 334 1226 -674 -2613 -1573 1686 1558 -1022 -1280 237 -545 -1205 -116 764
884 764 1007 353 -1732 -673 1954 1391 -244 1701 1609 -1402 -1675 331 682 970 314 -1567 -1109 1535
902 1535 -269 -1030 2130 2124 -1599 -1789 107 -489 -410 489 -1350 -1822 414 -840 -2241 1464 3099 -139
920 -139 -860 738 351 371 897 426 734 1053 -1280 -2077 1444 2273 -366 -691 625 -433 -910 -868 301
939 301 933 -291 -2474 -1946 602 564 -922 -111 989 -448 -1647 -694 1769 1977 55 -78 1068
956 1068 862 -172 209 1795 1508 -284 -1665 -1181 102 159 -1142 -285 752 -1263 -1855 42 906
973 906 511 644 -817 -1278 -33 -60 -1078 682 1821 -711 -1240 1108 764 829 2318 822 -635 886
991 886 216 -2166 550 1968 -1126 -2556 -102 4 -856 -50 415 313 507 -750 -1843 548 2041
1008 2041 -372 -1629 693 820 -972 -782 1483 1808 661 -695 -582 662 1101 90 -251 1001
1024 1001 480 -1234 -1300 1043 1142 -847 -892 -3 -601 -1551 -58 681 205 -300 -718 -1181 726 1368 -167
1043 -167 -214 1150 -19 -1783 27 1126 425 501 537 -515 236 1277 -5 124 1593 403 -2066
1060 -2066 -1010 534 -368 -339 -188 -520 -789 -329 -829 -154 2170 697 -1732 -409 1092 50 -199
1077 -199 473 953 700 -268 -856 1012 2311 581 -767 179 623 -763 -656 201 871 68 -1355 -1338
1095 -1338 -53 147 -563 -106 699 -305 -1448 -683 543 1031 171 -396 272 756 33 36 1334 1357 336
1114 336 -425 -813 0 868 -86 -531 384 276 -1155 -498 336 214 144 -257 -1330 -666 310 -752 -603
1133 -603 1182 305 -1612 -295 1003 617 584 532 -211 336 667 -760 -423 1943 1216 -1734 -388 1040
1151 1040 -87 -393 353 231 -585 -877 -1229 -615 991 266 -1163 -313 656 -348 -1263 489 1400 -103
1169 -103 -1106 -261 339 718 385 139 793 662 -194 -406 548 1235 153 -904 -2 156 -794 -472 550
1188 550 291 -359 -408 -605 -346 912 199 -550 66 742 -956 -991 1156 1421 -276 74 156 -247 921
1207 921 786 -302 609 1169 -651 -1447 113 889 -285 -368 -465 -691 -293 -367 -490 579 502 -1107 -1165 546
1227 546 182 -680 545 935 -63 -386 -559 430 1236 743 -333 41 913 -198 -650 507 1168 211 -906
1246 -906 -852 -146 446 -549 -369 413 295 -1027 -635 -201 366 305 -391 -410 254 243 -452 262 794 447 -389
1267 -389 -153 331 864 523 71 104 386 -440 -939 300 667 -74 -388 -450 -429 -209 100 -346 177 731 -661
1288 -661 -1226 420 738 -249 52 363 18 -85 -80 -24 834 1141 -329 -999 764 558 -455 18 997 133
1308 133 -836 -613 -315 566 219 -639 -692 228 -141 -1251 177 872 -168 -704 -452 215 328 63 -76
1327 -76 453 377 -237 -429 368 986 461 -118 206 677 35 -448 298 534 -58 -659 -901 -678 -88 306 -354
1348 -354 -751 141 -50 -668 -31 997 122 -374 -6 95 -8 467 136 207 1013 59 -1187 301 1357
1367 1357 112 -444 463 363 -507 -530 -178 6 368 -461 -1426 -325 270 -625 -635 471 386 -527 -525 260
1387 260 422 653 58 -148 317 119 -392 241 757 394 -526 -259 349 323 -98 194 340 -158 -383 -553
1407 -553 -200 316 116 -583 -636 -244 -148 -380 -245 707 381 -341 -225 188 542 581 228 -157 330 33 -311
1428 -311 -120 1092 550 -339 -356 81 123 86 -179 110 97 -80 -1091 -511 753 362 -638 -105 240 -260
1448 -260 -331 290 574 527 1 -401 19 719 479 -125 558 466 -446 -287 120 92 272 -383 -417 -88 -120 -397
1470 -397 -239 433 35 -771 -407 -85 -16 211 -295 -54 62 -130 -287 269 842 641 175 -395 317 98
1490 98 13 -5 559 402 -317 -448 80 268 248 -330 -435 86 -43 -587 -641 392 130 -404 -561 94 26 -22
1512 -22 122 468 589 174 -676 97 956 456 -232 168 601 -157 -232 301 532 119 -100 -763 -101 167 -179
1533 -179 -519 -15 234 -832 -773 282 273 26 -120 75 -93 77 -12 180 474 567 74 -345 193 537 19
1554 19 370 211 -2 -277 -338 -231 89 300 -333 -497 -14 -71 -504 -389 39 241 -285 -597 67 297 46
1575 46 86 -108 -115 290 -38 -147 606 920 -280 -529 500 186 -132 222 100 209 79 -551 -407 423 377
1596 377 -487 -494 239 -469 -629 7 358 98 -84 -289 -69 271 325 -66 203 569 -85 -183 255 255 132 -80
1618 -80 -29 -279 -116 -398 -247 242 74 -333 -224 -457 98 210 -29 -197 -164 -254 -313 98 323 350 -16 12
1640 12 -77 141 158 81 170 718 32 -391 -241 261 381 -3 6 283 -8 -193 -467 47 311 -209 -690 -135
1662 -135 19 -94 -179 341 -17 3 -198 -133 549 410 -310 -195 503 -74 -449 120 587 167 74 -334 -42
1683 -42 64 37 -246 54 81 -356 -543 6 438 23 -244 -137 -15 -90 -179 -157 241 583 40 -249 30 299
1705 299 194 150 141 474 -89 17 99 -14 227 161 -28 -240 18 -82 -332 88 138 -65 -628 -224 237 0
1727 0 -200 -265 -113 156 -45 -269 153 790 -19 -751 228 642 -87 -191 287 141 -245 216 -37 73 491
1748 491 -200 105 -40 224 -292 -347 348 -44 -559 -221 -19 -91 -79 118 187 60 261 -521 17 499 249
1769 249 218 -5 173 112 -36 -5 252 70 -12 -232 -468 -87 43 59 -212 -132 129 -329 -481 -43 313 128
1791 128 -323 -71 254 69 115 74 473 251 -161 1 515 229 -109 -50 156 118 -329 -176 35 349 -242
1812 -242 -331 -143 176 -107 -250 259 -61 -162 -420 -297 70 252 -149 -39 303 -116 -174 -179 559 259 -404
1833 -404 108 316 85 -23 65 -7 294 -97 -262 -43 267 88 -76 -202 -161 -262 -200 -48 -287 237 17
1854 17 -268 -276 375 498 -102 -121 150 108 -194 -249 153 538 13 -236 54 324 188 -179 -44 372 -13 -635
1876 -635 -99 206 -51 -168 -263 -28 -88 -220 -208 80 250 154 -273 -70 335 5 -61 181 347 144 -32 319
1898 319 263 182 70 -61 -208 242 -164 -83 36 39 -317 -100 -2 -307 11 -60 -231 -213 7 -115 -66 191 54
1921 54 78 -95 -46 288 132 -55 309 243 233 -170 -372 454 350 112 -100 -31 -17 -322 -633 -233 19 -127
1943 -127 -332 -104 62 152 -260 -154 264 212 -177 -8 157 480 -150 -126 365 21 -278 -41 250 519 55
1964 55 -173 112 256 -144 -161 -218 159 -335 -492 -3 56 116 67 -243 -234 -8 -86 -204 12 392 -111 -99 -72 303
1988 303 287 81 146 -68 176 66 -85 121 370 -149 -365 246 95 -33 -314 -125 -130 8 -434 -276 258
2009 258 322 -27 -141 279 108 48 -424 238 395 321 -233 -7 232 -1 -190 -135 551 -20 -192 -149 273 -86
2031 -86 -216 -49 78 84 -327 -209 210 204 -82 -354 -158 235 -23 -388 49 209 205 -250 -98 232 105 366
2053 366 203 68 97 54 -312 -14 115 -8 -317 66 186 132 -160 -226 -124 171 -337 -543 321 30 51 -229
2075 -229 13 -26 42 -146 108 250 138 -12 -48 217 137 143 99 294 222 -105 -107 -103 147 82 -472 -226 109 -85
2099 -85 -231 -204 334 -23 -300 -176 12 128 -57 131 204 158 -239 -8 420 547 11 -44 -19 50 -226 -209 153
2122 153 -9 -21 -214 -89 44 -193 -102 -273 -15 27 -72 -158 -106 156 -90 -93 -118 254 250 -35 139 306 265 246
2146 246 -53 -33 242 -120 -88 -124 213 195 -139 56 -7 29 -515 -319 -42 323 69 -202 -46 -108 -214 -316
2168 -316 77 208 23 -356 153 19 147 -18 173 211 320 12 -499 -80 109 197 85 76 -58 -95 -328 210
2190 210 2 -222 -163 18 -24 -114 -17 -31 110 69 -179 -87 238 308 211 150 154 -100 -19 53 -47 270 198 -70 -163
2215 -163 267 423 -62 -146 -201 -78 -258 -38 -179 76 275 51 -21 54 25 -153 -9 71 79 -175 -9 91 3
2238 3 89 46 0 156 256 -215 94 303 -53 -245 75 173 67 -265 16 -86 112 -84 -350 -1 87 115 -27
2261 -27 -90 215 -307 -244 97 286 350 87 -56 109 68 135 -9 -101 279 120 -257 -86 258 -64 -228 -14
2283 -14 -144 -88 -52 -111 -96 -24 -136 -128 -157 245 194 -44 -22 108 -84 -70 213 399 -32 -129 84 -86 -24 28 -46
2308 -46 95 229 -181 -212 237 71 -44 53 -77 -62 61 -164 -20 142 42 100 -216 87 205 -26 -54 596
2330 596 218 -1 -43 -60 168 135 123 174 231 -16 -190 22 312 70 -283 -104 -45 -235 148 -46 123 -36
2352 -36 47 -149 -136 97 60 -76 174 -86 269 -277 4 184 232 -30 127 36 140 -87 93 110 -43 23 5
2375 5 123 -117 5 -248 -352 -181 262 34 128 -25 -72 -215 -175 -45 123 60 -353 185 55 244 130 -54
2397 -54 107 65 -420 37 138 66 -95 232 229 -79 -229 -91 -111 8 -155 -8 -20 -102 -159 -147 -12 5 171 -55
2421 -55 -139 -18 -158 140 134 -81 83 235 -29 128 119 98 -177 -324 55 -179 22 -136 -18 -13 -184 -211 5
2444 5 67 -12 -168 -198 163 156 -73 -52 86 116 7 30 31 184 -113 61 161 91 -39 -124 54 108 -200 157 -219
2469 -219 -27 40 -176 -52 -79 84 22 -190 95 -78 -388 -25 -17 146 37 -98 82 131 -75 239 89 75
2491 75 302 -20 -15 -27 105 -244 -246 -200 197 -58 -8 -253 -292 -160 118 -122 144 -142 -25 -136 6 132 -137
2514 -137 -198 172 222 -90 -247 0 163 104 -191 86 48 221 100 37 309 144 -218 51 -144 213 -134 -261
2536 -261 -118 71 80 -270 -278 403 -32 -132 -160 221 -164 -177 93 281 327 277 -234 182 182 207 -44 99 281 40
2560 40 -266 -26 218 -413 -238 -173 -189 -323 191 -90 -292 132 -53 -81 -24 218 113 47 -17 242 16 -283
2582 -283 -32 134 -13 114 -150 15 247 103 -196 96 154 -7 -191 -156 -22 174 -175 -93 65 -111 -45
2603 -45 46 150 170 -171 -64 -84 -13 31 -154 239 306 222 84 144 172 53 -37 256 162 104 2 -65 157 -84 -169
2628 -169 -10 -184 -182 40 12 100 80 98 -69 71 149 78 4 -76 88 62 -47 -106 11 119 180 -141 -72 71 -55
2653 -55 -40 49 263 -15 -197 -45 23 -14 167 -89 25 -149 51 -112 -157 172 -24 -233 -31 81 -79 80
2675 80 85 234 45 -153 198 181 -64 -236 -29 131 289 -120 -326 -75 357 33 -267 235 -38 -340 183
2696 183 -186 218 -148 -54 -13 -32 -23 127 -195 -69 83 -40 -1 -49 237 167 -35 -44 209 189 -158 -39 -87 2
2720 2 -73 -137 -206 25 35 -55 -76 -164 170 -57 39 78 137 -84 113 102 64 209 70 -25 16 114 -161 96 64 32
2746 32 -59 78 228 168 -51 -110 -84 176 -231 20 144 148 -250 -219 -94 -130 -106 -102 29 -11 -164 260 268 38 15
2771 15 21 65 -162 -151 78 14 5 213 -191 -246 -123 -164 -81 30 -76 150 112 126 146 -108 -104 -149 -10 38 -302 193
2797 193 58 188 -91 102 197 -26 156 86 -32 -2 -29 -8 55 -60 105 -28 -1 23 -59 -142 113 -249 31
2820 31 -51 129 -231 -136 -162 219 -155 144 -6 74 73 -236 -28 192 -186 216 -125 174 243 23 -56 -218 -217 -95
2844 -95 27 -164 56 -66 -33 78 -9 -299 82 69 26 -112 121 -102 224 -130 38 127 132 148 -14 -17 -188 202
2868 202 159 110 36 242 101 -164 -36 -147 168 -26 -282 213 -74 -78 -192 -38 173 -60 -10 40 -9 41 -125
2891 -125 131 36 124 126 -53 85 248 45 -133 160 -136 -160 -56 49 93 -53 95 75 191 -74 -96 246 204
2914 204 138 -56 -123 307 -75 -124 -36 314 -273 -62 -157 -86 61 -12 154 -4 142 -266 208 -50 -128 -99 7
2937 7 -108 -65 79 58 145 -225 27 31 -104 23 -53 -98 -156 -78 10 149 -13 -40 191 -121 152 72 228 243 -6
2962 -6 6 142 -133 35 -4 -32 -230 97 -51 -10 38 -66 -253 -268 -174 188 -160 -72 14 -67 143 -62 -58 53 -23
2987 -23 -51 229 -30 69 -49 76 284 94 -122 48 -81 243 158 -103 -59 -188 241 -129 76 46 -172 140
3009 140 -334 -64 68 59 -187 -14 -83 87 -53 -121 252 -78 6 -40 -119 2 39 155 76 58 117 159 -131 -62
3033 -62 93 96 -35 71 -140 -91 270 -155 -76 -174 59 288 232 26 124 50 86 51 62 329 -36 97 100 162 -232
3058 -232 -75 132 -217 65 13 -146 -42 -62 69 -11 126 -55 -188 -211 79 158 116 -10 81 -9 160 36 -103
3081 -103 -137 -93 168 31 130 -110 30 -59 43 -67 -51 51 -67 168 260 83 -202 -220 -122 1 -40 -162 200
3104 200 263 -103 -282 17 87 15 200 237 9 -25 148 -63 82 92 -131 30 -271 151 99 60 63 39 -160 -13
3128 -13 182 167 -39 -309 23 -65 -31 15 -42 -96 -48 -90 53 -167 216 64 89 43 -180 -13 318 -74 100 -188
3152 -188 34 123 28 80 -57 -140 93 -22 5 10 84 -167 -122 35 -157 -60 16 134 -243 -109 278 -85 -39 -15
3176 -15 113 48 27 404 63 117 -17 -25 215 -95 -28 99 -67 182 -122 -104 108 -147 -43 -84 92 144 -184
3199 -184 81 38 -16 296 135 176 138 177 170 -5 6 -27 -130 205 85 -81 -253 47 10 53 -7 65 -260 -106
3223 -106 -42 -159 -31 -72 25 147 27 -20 14 -3 54 -219 255 -48 234 -94 40 57 -268 -77 202 -158 -11
3246 -11 -185 -169 207 195 -105 -61 -146 114 -86 -241 -191 -39 -3 -178 -107 -97 -263 -95 260 -30 19 -95 144
3269 144 12 -125 -426 25 -103 -60 -84 70 -82 75 -67 -177 120 -61 -95 175 137 19 -186 -271 124 -234
3291 -234 164 -4 -36 244 -7 37 -328 -45 -120 -142 69 141 -68 46 77 90 -124 142 55 -42 -15 206 -475
3314 -475 -68 78 -86 -7 17 129 87 74 -192 23 29 260 -32 298 46 -6 -28 95 46 -42 -10 191 -97 -123
3338 -123 37 296 193 -286 -33 -239 49 -40 -122 144 33 85 -137 -18 259 -68 -169 111 17 196 -137
3359 -137 -231 85 -101 -31 100 150 -69 -113 -163 231 -115 -68 -123 -196 -60 122 -56 -263 230 29 2 -91 267
3382 267 -20 64 238 -149 -88 -29 132 57 96 282 187 -84 -152 68 88 111 -8 169 309 -104 191 171 198 -64
3406 -64 -225 -226 -138 -103 138 7 126 7 -68 -72 75 34 -255 -76 16 -144 -75 39 253 119 -74 194 126 215
3430 215 -27 -100 -220 24 -19 31 212 158 72 -143 -134 -63 -94 196 -152 -358 -216 -176 8 -67 90 226 -84 -120
3454 -120 244 41 -64 69 -103 -99 21 -121 49 -193 -20 -63 42 -198 49 -17 211 225 88 207 29 202
3476 202 -9 -86 -149 39 217 60 -71 54 328 -123 83 153 170 -79 27 225 -2 -11 -127 287 147 -210
3498 -210 50 -70 33 95 88 161 -212 -292 -214 -106 8 -19 -193 -23 -301 160 -160 -107 300 -134 62 -161 -87
3521 -87 -21 -157 -90 204 178 136 8 108 -268 -12 81 61 16 42 -105 -386 -239 106 134 -18 -100 -63 195 -139
3545 -139 -32 25 -27 264 -29 -86 39 113 -67 -204 209 147 23 -191 54 152 179 37 -146 136 211 -158 -127
3568 -127 138 -201 -98 -220 -280 -85 -470 -13 16 -62 249 -70 -119 9 127 -189 -22 -20 96 -37 159 0
3590 0 -55 96 48 -169 -215 167 -75 139 -94 103 158 -4 -84 -82 2 -147 -46 26 -109 -159 136 77 240 310 190
3615 190 -197 -48 174 170 153 130 122 -162 57 232 21 2 313 -14 -33 -110 2 -98 -26 63 -80 226 212 -110
3639 -110 151 106 -48 44 -39 15 87 -211 160 90 41 -1 11 -187 61 -18 -3 -82 210 109 -293 -136 -35 -74
3663 -74 7 17 -81 155 164 50 -46 14 66 198 -28 206 -14 -68 196 -80 -2 52 -233 -122 62 -2 -59 241 -197
3688 -197 52 -153 -374 129 -17 -216 -233 -45 -66 53 36 -84 176 -25 20 149 23 -3 -54 203 -15 43
3710 43 167 -136 64 -120 -120 -92 33 -182 49 35 -15 -13 -247 43 -143 49 -165 62 -77 56 -40 -134 -68 -57
3734 -57 -12 112 -165 19 68 -182 -78 172 33 122 201 -138 6 -166 -148 118 -5 -25 24 -213 73 -158 -92
3757 -92 -70 74 -28 3 -28 -162 -14 -160 -316 -129 -250 -209 -66 226 134 45 12 83 56 39 129 24 -162 151
3781 151 80 -14 -2 104 179 -74 103 -162 -72 -214 -168 -20 209 52 -126 -22 -88 18 17 105 -93 162 113 58
3805 58 41 193 252 67 -101 59 -106 161 9 62 28 -11 19 -286 -242 -108 -55 -82 183 -200 63 -34 36 -141
3829 -141 45 38 -31 159 -111 233 -153 4 127 -68 62 114 -21 -3 210 -164 -25 -9 51 168 -245 -132
3851 -132 -31 -70 -86 -261 -132 -179 -67 -108 -83 -97 -117 -2 307 214 -177 -204 130 -73 154 -41 -37 183 -93 -241
3875 -241 -164 -314 -19 -115 -260 42 -39 161 -299 -61 41 -42 -75 -133 18 162 67 97 105 13 -68 200 21 220
3899 220 279 -94 85 208 39 11 -205 -9 178 80 -140 -66 107 240 -89 98 -35 150 -214 -277 -108 -71
3921 -71 137 -195 196 -250 112 287 -82 115 -112 -103 48 168 61 -380 110 180 57 28 67 -59 17 128
3943 128 -20 66 8 26 -23 -72 8 -147 -4 -28 -151 171 192 80 28 -142 110 -192 207 132 173 -127 -135 180
3967 180 -15 -155 38 175 -132 -23 -35 -131 96 51 -45 60 -78 -221 -96 -171 -50 -59 -162 -26 271 488
3989 488 -7 -118 -97 39 15 -46 49 36 -7 226 -164 -212 -239 121 162 164 11 -53 64 73 124 -40 87 -257 2
4014 2 -52 -48 -91 14 -219 -61 -47 -120 90 243 60 248 22 -151 103 78 178 57 54 -24 29 49 210 -16 -68
4039 -68 -52 -271 -185 26 34 -72 -25 -141 247 -185 -134 -72 -120 114 -1 243 -72 6 -21 45 25 -159 94 40 -43
4064 -43 126 -50 25 42 -66 -97 54 123 73 71 -240 -128 297 41 -22 69 68 -79 95 274 -76 -11 -158 155
4088 155 1 103 22 -39 -234 -81 -205 -43 5 -181 -133 -159 120 81 69 -241 -59 118 -41 39 -20 60 178
4111 178 -89 -151 -19 168 -148 123 -155 191 153 159 -15 95 3 29 -19 175 -77 -55 0 -155 28 -117 32
4134 32 -9 29 -89 -21 -272 200 -190 -264 -56 222 47 188 126 84 12 159 -111 335 144 -41 117 204 -347
4157 -347 -237 38 -286 -237 -27 37 -239 -75 55 51 69 -153 -91 -44 37 255 -104 87 140 60 83 43 -22 47 -18
4182 -18 8 -140 60 -16 2 64 1 54 7 22 46 143 -39 -55 84 -52 -181 -187 95 -33 -16 46 5 -185 72 -116
4208 -116 -22 71 -13 168 -242 -34 -134 -162 -59 11 -38 76 90 -255 111 124 91 -21 -11 -189 80 -186 -86
4231 -86 5 -204 161 134 -64 -144 52 -132 -28 0 25 38 -61 223 -192 -217 89 -161 24 17 101 381 30 309
4255 309 -192 -77 -1 99 -375 56 33 -21 -49 13 -62 67 47 -150 7 -238 140 64 -131 1 60 -44 -28
4278 -28 -71 101 -174 -231 148 99 -10 -93 -222 12 44 53 -94 129 -183 -164 147 -135 11 -45 23 -105 99 11
4302 11 -254 116 150 -71 -99 -72 -128 -142 38 -81 362 -385 -49 -55 -122 305 179 112 61 114 -40 82 -4 102
4326 102 -26 62 -327 106 -136 3 -45 33 98 66 -78 -186 -31 127 72 102 216 -149 110 -245 -231 75 -237
4349 -237 20 -68 -96 -95 -301 90 0 -316 -187 224 60 -60 -286 -84 120 -236 -82 336 -109 128 176 10
4371 10 -2 28 223 7 83 41 -193 -41 5 -93 169 -171 52 118 -196 4 -118 107 30 48 -131 -142 164 101
4395 101 -184 -46 -109 80 -97 -93 -30 -222 277 -42 82 51 108 -220 -153 -116 -178 -338 166 -294 -10 55 248
4418 248 190 20 -25 24 18 82 -19 -144 -101 54 -20 -18 2 104 -75 -70 88 243 181 -119 139 105 -41 -218 81
4443 81 62 181 -221 -36 -67 -61 -268 -145 -62 80 21 -248 -93 -122 109 35 157 -24 303 199 30 37 -76 -50
4467 -50 -43 250 26 140 -239 204 74 -14 70 206 46 109 -78 -72 -2 373 56 -156 -54 129 -254 87 -144
4490 -144 89 16 114 84 43 58 -67 -112 -90 -57 -73 223 111 -57 -31 42 21 -77 -68 -202 34 57 -21 101 -144 -95
4516 -95 -170 52 11 -344 74 107 -57 207 -95 138 220 -90 173 -29 -134 -117 -66 117 -36 79 -100 101
4538 101 -143 -39 -96 152 -172 -61 83 -96 164 -81 -39 -8 43 106 107 -158 76 -158 22 -103 -221 -27
4560 -27 -225 -68 -146 162 63 -58 -23 216 12 -58 -23 229 119 104 126 -90 48 93 -23 42 -66 202 -89
4583 -89 44 -106 18 -35 -112 -45 2 242 70 157 134 -124 245 172 -27 78 -52 -19 -63 128 -90 -325 117
4606 117 -195 -201 -58 172 -11 -78 -85 148 42 -84 85 -13 -54 16 75 -102 -36 -56 23 243 61 8 -291 79
4630 79 100 -106 38 98 -91 -67 -74 -4 235 176 225 -167 -92 224 -100 -66 140 -74 47 -69 -75 207 58 -187
4654 -187 96 7 130 114 273 207 -124 177 292 231 -35 26 -48 -56 -50 97 140 -68 -155 -191 -85 175 135 125 -143
4679 -143 147 -99 35 319 -80 -79 41 -319 -143 201 126 114 63 -128 -175 196 -22 -55 -36 103 -78 -128 -133 -143
4703 -143 -22 8 -127 242 -115 -340 203 -46 -198 -194 82 144 73 109 -76 6 -84 -24 -104 107 244 -336 156
4726 156 -55 -40 15 -88 259 -135 131 125 -232 104 -45 -18 114 -27 175 66 -47 -262 -97 -118 198 14
4748 14 51 -46 -174 24 42 127 -105 98 -182 196 -4 -134 -16 23 -82 38 -66 -213 14 9 -30 50 145 26
4772 26 -177 -199 393 -121 -108 93 -189 67 -220 -12 160 13 -95 235 225 -148 -96 16 -157 170 6 -72
4794 -72 -11 -193 181 48 62 -187 -267 70 378 7 33 38 80 83 -55 -139 -40 -51 118 102 -121 100 -113 -55 -115
4819 -115 -108 11 -89 105 80 31 -38 160 -3 -35 231 -43 36 199 263 10 76 -237 -3 -30 -19 -69 147 238
4843 238 285 57 -151 -10 -143 -22 -57 -187 -15 34 -20 101 -61 -94 -45 138 12 191 -124 191 -89 32
4865 32 43 -15 -226 114 -16 15 135 16 -45 -56 106 -96 -101 16 104 32 -116 -18 12 -189 311 -376 136 8
4889 8 -112 -305 -202 -88 79 -214 -299 154 -143 95 59 284 -300 48 -23 66 75 370 -190 -40 -272 -16 91
4912 91 131 177 -197 44 -6 151 -155 45 95 -268 241 -24 -183 72 155 -50 24 -92 54 101 -130 149 -99
4935 -99 -174 207 149 81 -52 105 284 113 1 -104 1 -156 -125 -74 -62 -57 208 -32 117 49 116 -186 1 190
4959 190 199 -157 -54 52 67 -75 100 -65 -157 170 319 26 -357 -103 -287 -222 41 44 96 -138 64 -101 144
4982 144 -20 133 171 10 -122 -186 -152 -135 -45 -50 -22 1 -147 -69 34 215 150 122 -51 95 185 -61 -44 -458 61
5007 61 85 118 159 151 -37 96 -42 115 -147 -105 123 -67 81 -99 28 71 -15 -176 -4 37 172 152 -98 -44
5031 -44 115 82 -9 -56 -12 -149 107 77 -56 278 -191 -63 75 -207 101 -116 45 6 86 75 57 -53 56
5054 56 -64 -18 -156 -161 172 -125 -24 -86 -160 -129 -26 64 12 -226 140 -61 -46 157 -45 142 -256 149 23
5077 23 -29 109 131 -38 -41 -64 -184 -308 154 -12 -12 -237 -137 224 158 -50 26 105 -9 -136 109 -75 52 -214
5101 -214 -61 39 -11 3 -248 79 69 -193 46 -168 190 -83 139 -122 -85 21 -2 98 12 106 -44 139
5123 139 121 177 -90 -6 -30 69 -18 305 -86 -100 -63 -132 109 -97 -18 180 -117 -3 -112 16 43 -206 142 -18
5147 -18 -12 -140 -160 33 -8 -5 24 -172 -137 -53 -227 -90 43 -124 -34 -127 -260 78 293 31 138 -10 -56 -111 45
5172 45 -126 84 371 -77 -115 169 -345 -172 223 35 -97 27 -138 -39 -84 -28 -144 85 69 42 102 29 -44
5195 -44 132 -2 -103 -82 23 110 199 302 57 93 -24 74 59 -92 146 -14 98 -99 -96 61 147 -123 -72 -299
5219 -299 -219 36 79 271 227 146 42 93 311 -8 -32 110 -80 -57 205 249 -113 -312 99 187 1 -301 27
5242 27 19 49 -85 -20 27 235 -166 -266 -117 -73 -8 -56 83 -159 173 -41 -75 95 46 88 70 -178 13 -89
5266 -89 1 -93 -96 -71 3 -9 -141 18 -64 -35 53 -31 182 114 -169 180 108 124 131 66 34 -108 -267 201 -10 -216
5292 -216 -114 137 109 -18 -19 -2 17 27 -19 -21 -224 -37 112 31 -189 52 121 290 156 65 127 -68 -142 155 -189
5317 -189 139 59 -5 -111 80 87 40 -161 15 -146 -232 109 173 -49 -150 -229 -133 -115 123 18 48 -264 -194 11
5341 11 -229 -121 -130 -45 77 301 102 112 72 -322 -55 -76 41 140 135 -137 -166 71 67 -164 -76 39 164 -102 39
5366 39 15 154 96 116 206 98 179 26 -50 115 92 -120 -70 -35 -71 -51 39 -141 -132 104 -8 -42 74 -34 -79 112
5392 112 24 -55 -80 120 -245 -279 -135 -8 -235 72 138 196 -125 -119 312 51 135 -208 62 119 -179 -5 231
5415 231 -107 -174 171 27 31 -28 215 124 -191 140 -18 -66 -55 -159 91 156 23 6 173 11 75 33 72 -98
5439 -98 108 147 -132 -79 208 74 -64 7 19 -136 -88 -21 51 130 -173 -41 -45 -23 299 -190 102 -16 -109 173
5463 173 -88 91 -101 252 46 245 288 -111 99 177 37 100 41 -42 -214 3 -197 14 -62 131 -167 -87
5485 -87 20 128 104 -37 -27 -134 51 81 -92 -24 5 -78 -2 -14 12 14 -133 75 -90 148 112 -4 -9 -102 -26 54
5511 54 83 -8 238 -222 -2 -152 -302 -24 -113 -303 -79 100 171 -41 -7 -14 -34 53 -124 29 140 -10 -124
5534 -124 346 -11 166 27 325 142 -46 -87 18 -72 -252 60 67 -158 -38 -214 -60 21 64 -112 100 -163
5556 -163 -323 26 179 -197 51 -97 94 159 -42 220 -127 -153 181 74 -157 -210 20 -80 146 21 -73
5577 -73 -179 0 4 52 55 -112 -186 76 252 -152 134 18 277 5 -62 173 -84 -159 23 233 -190 17 -138
5600 -138 -56 82 130 13 43 206 40 189 -128 -109 1 8 37 204 60 -29 152 0 -6 -136 45 294 54
5623 54 218 18 -223 138 11 205 120 145 -55 164 -133 -165 -103 -38 -294 91 113 103 64 348 164 159 -202 -166
5647 -166 125 60 12 -151 -45 211 151 -12 78 -103 27 -101 -190 -79 6 53 35 184 5 39 168 -64 -64 -7
5671 -7 -157 51 -157 -177 -49 140 226 -16 171 58 -49 57 51 -124 171 171 -143 128 45 56 161 -167 -10
5694 -10 -328 13 -223 54 11 -187 71 -210 -55 -97 -91 107 20 -28 -136 -124 17 -25 -204 34 6 -224 68
5717 68 99 38 113 78 -15 14 85 -11 -46 -32 -234 28 -8 50 140 -110 159 29 45 118 53 -296 319 -173 -178 -76
5743 -76 -35 44 -29 178 -98 -260 -8 -75 -4 -39 9 -179 -60 -33 178 -204 76 -58 -137 84 -216 38 147
5766 147 32 55 -22 -52 -51 -43 161 -33 -130 118 34 -116 239 -246 280 -20 42 217 57 284 -58 327 -65
5789 -65 -140 -39 -289 -150 -150 -45 -157 -21 -116 142 -262 247 -121 128 116 34 136 -107 145 -174 27 65 59
5812 59 -66 80 -40 -34 -49 21 34 -15 -51 -114 -24 244 -96 -87 214 -90 -305 -57 24 78 -34 134 -109 -129 -199
5837 -199 -185 -15 -52 307 305 -74 43 54 52 -120 -91 120 207 77 -80 -149 -316 -170 19 39 -15 -282 -225 -191 150
5862 150 -45 103 26 -90 149 9 98 -50 47 -88 -72 55 -62 -49 -43 109 -30 92 -122 123 -143 20
5884 20 258 49 -239 277 79 95 106 -50 173 -29 -23 2 -176 -83 -182 -91 22 102 87 -84 -65 -29 194 204 213
5909 213 -252 -101 62 -129 33 87 80 157 -9 54 -80 64 -77 -77 -15 115 140 -77 3 -220 -71 57 -23 -18
5933 -18 193 170 -8 209 -119 64 112 -42 168 157 41 -39 6 92 86 -8 -7 51 -100 209 -107 -13 62 0 -23 159
5959 159 -75 321 89 113 -176 215 8 13 90 21 -9 -44 143 0 122 -155 88 -29 78 -14 160 316 -152
5982 -152 55 4 14 -107 -153 68 18 26 -54 -91 16 357 -26 67 -272 -166 -65 18 -78 48 -196 -91 -168 113
6006 113 -52 -46 -107 -34 110 -327 31 243 -216 -126 -131 -28 386 -82 362 -178 63 79 86 -161 -2 137 -124
6029 -124 -403 -24 163 170 143 -154 -216 -68 -5 -107 -74 344 -50 42 30 -125 -287 213 149 91 -99 82 -5 -57
6053 -57 -253 -79 -89 0 -20 -9 -59 -76 175 7 -45 -123 -55 -194 94 142 65 11 -193 128 -98 -27 40 -83 83
6078 83 80 147 -59 227 -68 -128 34 103 60 235 26 -142 85 28 63 -118 -180 -19 9 79 -16 157 107 -29 27
6103 27 -89 161 -212 -33 18 -184 -113 208 169 68 3 -16 -75 -78 -157 -83 17 -91 90 111 257 5 214 -24
6127 -24 327 132 107 93 -129 99 91 -6 93 170 75 22 43 -79 -213 -184 233 154 -127 111 144 33 169 -74 250
6152 250 202 341 -140 -207 152 114 153 79 137 31 208 -169 -46 4 175 -12 -11 181 -176 -29 58 18 -244 -108
6176 -108 -110 -159 26 83 -242 -181 -129 22 162 -146 118 80 -7 -41 132 165 -125 -69 108 -168 -75 105 37 -91
6200 -91 116 114 -192 -66 21 135 234 45 133 -29 -227 47 -353 -59 282 366 -93 -110 -106 144 79 68 -17 148
6224 148 -50 -183 -98 378 -19 -52 91 44 74 96 166 -175 136 -181 122 -185 -13 41 61 -40 199 -41 -105
6247 -105 33 185 47 -252 31 -93 60 116 346 -93 -79 -64 -72 -24 -73 61 -164 68 -79 254 151 197 -21
6270 -21 15 100 42 175 96 74 76 -125 87 46 142 -32 278 -41 -130 -11 18 157 -82 -149 13 196 108 -49 -77
6295 -77 -93 -229 -77 21 111 -113 179 363 130 68 -162 -35 -5 -132 -242 107 41 -134 166 -20 -175 28
6317 28 51 156 2 -4 75 23 13 -26 11 49 -36 293 50 155 -263 -324 -70 -300 -101 196 180 -129 102 78 117
6342 117 -164 125 32 103 121 -128 163 -9 -29 89 102 -1 29 148 321 72 -88 137 -9 -126 18 30
6364 30 -91 -69 -30 -70 82 -46 -75 -135 294 391 -24 -57 -247 -241 80 56 116 136 -47 -34 156 171 -80 -28 -83 102
6390 102 -63 -75 204 -115 73 -176 209 -61 35 49 99 318 155 180 -129 71 85 -150 302 -86 114 196
6412 196 221 156 -68 -307 -50 22 -88 -91 75 269 10 143 -294 -9 -120 -109 160 39 -88 -42 23 132 286
6435 286 -49 -87 -134 -6 -59 -25 1 -117 213 139 108 -38 -73 228 -105 -205 -12 -290 -228 -32 -27 24 -50 -76 -139
6460 -139 42 253 112 -119 111 128 -151 -42 165 -79 -2 -207 -23 0 2 -57 -301 184 2 -142 128 -98
6482 -98 -140 16 61 -117 -70 17 75 -29 -242 -54 -51 59 -68 102 -70 -216 -184 213 -65 164 99 -68 -53 -108
6506 -108 -68 63 52 69 20 15 -31 -412 -277 -130 111 217 -19 277 85 178 2 -20 14 -161 -5 22 -30 -34 118
6531 118 384 -35 -100 -69 -77 163 118 31 -122 -229 -148 5 30 -202 5 -36 127 85 76 4 -38 282 15 166 227
6556 227 186 -67 166 4 128 73 43 -76 -4 199 236 67 35 -45 35 21 -214 -129 212 319 -3 -172 208
6579 208 -38 10 50 -38 -25 46 -151 -46 10 217 21 -12 191 -39 94 -7 30 -106 -111 153 206 -26 55 -53
6603 -53 -75 16 -138 133 2 57 100 -371 -100 -112 -34 88 97 -65 0 84 -84 78 169 21 -33 109 -41 88
6627 88 111 221 161 -176 -47 -139 -26 -89 -36 -88 135 96 -135 -39 117 201 -163 -127 -4 88 -96 180 -158 -71
6651 -71 -165 -126 -267 -94 -117 -82 -46 50 -132 24 -249 -133 -29 -79 -61 1 196 -41 71 112 161 189 67 -65
6675 -65 -52 -30 -97 -74 318 -33 -179 -97 233 -122 -156 -113 160 -194 -52 173 -128 27 -153 36 245 -108 1
6698 1 140 17 -93 -110 -79 9 -102 75 -204 44 158 42 -88 -196 2 -103 216 49 7 9 -126 -9 -161
6721 -161 10 20 203 108 -87 4 -108 -131 97 -65 -108 -65 -15 -57 -17 -80 33 -52 -183 -28 -37 97 -127 17
6745 17 -80 -23 79 -145 -7 12 -74 -238 2 -64 6 -99 0 -80 335 100 -116 -127 -178 -186 -64 -60 13 14 -121 -40
6771 -40 100 -16 42 48 -357 -128 -118 -307 -118 -22 79 26 59 67 165 174 3 -6 -232 -103 -91 47 246 43 8 85
6797 85 -145 154 -34 120 46 -160 -35 -77 -33 29 215 61 -210 18 -240 131 -96 -51 -18 -16 49 -77 -121 -33
6821 -33 -90 46 -34 -67 -159 176 -146 153 -297 -2 86 -9 -9 61 198 -164 84 -89 30 96 127 120 58 0 285
6846 285 -47 19 -117 125 -77 77 -5 -252 172 125 113 31 55 -35 141 5 102 -17 24 -37 15 -77 57 -77
6870 -77 32 -13 29 64 -126 166 116 162 -233 282 21 45 27 -4 35 262 -167 123 -37 -138 145 -119 86
6893 86 -22 -103 47 -164 -150 96 236 136 -200 -24 -31 243 5 -13 -18 49 -164 -58 -91 102 -123 165 -149
6916 -149 -269 39 82 77 -77 -21 -325 46 -291 -33 238 -3 44 -127 73 -266 -108 86 165 -199 -180 146
6938 146 -113 54 -221 115 118 74 -189 -12 -129 -131 -65 -5 7 -179 14 72 233 65 -3 -23 27 -91 210 -133
6962 -133 -164 -87 51 167 -324 -16 -70 27 -176 26 53 -51 -167 -262 -142 120 -169 -10 -44 7 106 -16 -19 -22
6986 -22 -15 -110 -68 22 215 116 -24 -84 -145 49 -116 -130 -83 -187 128 -216 -76 40 128 41 47 149 -73 17 136
7011 136 -79 -62 -57 330 239 185 170 -342 -44 -24 -33 19 44 -36 31 30 1 -91 84 14 -109 10 30 10 -101 254 76
7038 76 27 127 -59 -32 -122 112 43 28 121 -21 -266 -48 43 -90 3 -61 227 203 -53 89 -183 362 137 63
7062 63 -41 9 -176 -65 -93 238 6 240 205 38 -55 274 -9 -135 -31 174 -124 -116 -158 188 -53 142 -137
7085 -137 -80 71 -21 15 -63 183 -144 154 38 19 192 -92 -62 153 88 -65 115 -19 -235 43 78 -9 3
7108 3 36 -96 93 73 152 -59 137 116 -252 -161 -84 265 108 -65 -88 -182 21 237 239 48 86 58 -137 198 77
7133 77 -6 -11 -105 11 -113 204 107 -30 -169 -30 -93 -68 151 -104 -37 68 -134 -279 36 -121 -168 -39 96
7156 96 49 -33 2 12 -7 49 70 61 -70 -160 69 88 -197 -8 27 78 149 -165 -62 -161 184 -130 23 187 -121
7181 -121 -139 -131 99 185 -177 3 126 -139 -56 -46 -132 42 -81 -54 27 -57 -34 -48 -209 128 -29 89 16 123
7205 123 99 -92 179 13 149 75 -113 -45 -98 -60 -98 -167 29 -167 -100 -12 6 17 -45 41 118 -22 -45 182 -35
7230 -35 97 10 23 218 92 34 151 112 26 52 -25 59 -294 -78 101 173 -146 -5 -121 45 186 -26 47 -244
7254 -244 -149 149 -44 20 -168 -52 195 -128 -123 -99 14 -45 -129 49 -50 115 -98 -80 -45 14 147 -53 -96 -45
7278 -45 333 57 -9 15 7 -113 92 -104 24 -148 44 48 -8 -220 -233 -81 -83 -62 -177 88 215 -90 -137 -47 181
7303 181 -81 -171 -324 -80 157 30 -136 299 129 128 122 11 -139 -78 51 -319 111 118 43 36 73 72 -64 -133 -34
7328 -34 59 7 97 100 -59 288 118 42 150 106 -67 186 162 -50 79 99 19 -119 134 -194 -80 92 -71 67
7352 67 -83 158 177 75 101 5 113 -146 -68 -92 35 69 -147 -61 -22 68 106 100 162 -185 42 -63 -106 -163 -170 -248
7378 -248 -137 134 -250 -46 -123 158 -40 -197 -52 25 13 -70 114 -176 -32 230 -56 192 26 -136 63
7399 63 130 121 7 72 -116 -109 -64 99 28 -368 -222 62 8 29 -94 140 -142 -50 -209 -184 -4 104 -96 63
7423 63 286 2 -289 -102 -110 61 94 -323 -27 -68 80 -88 -39 33 188 360 112 16 178 237 -49 13 97 123
7447 123 64 153 197 -65 96 161 -168 12 175 -224 75 15 -33 218 33 -76 -88 164 69 -2 -88 180 -68
7470 -68 -63 265 -261 -224 -20 83 17 110 35 -155 32 327 -162 -38 -297 9 26 27 83 -47 -115 -29 52 168 -237
7495 -237 134 142 91 -53 -265 86 148 -30 174 162 -130 -179 -239 143 77 7 -82 -60 -235 -24 -212 33 168 147
7519 147 124 -44 42 112 -241 202 -340 95 -64 -65 -22 119 259 -282 114 10 22 138 303 115 132 -194 -1
7542 -1 -72 273 321 -86 -85 229 -121 116 -10 -8 6 15 79 -56 112 88 278 -14 -15 -111 -153 -7 -209 -28 -21 -240
7568 -240 16 -141 -242 127 -228 -115 381 82 -201 -63 67 286 -67 179 1 -4 -109 -4 -175 102 -297
7589 -297 -14 58 21 -291 58 108 -87 379 25 224 125 9 74 -2 -45 10 40 63 -64 161 4 161 -192
7612 -192 171 -126 -79 155 -16 -176 106 44 97 189 110 -120 -98 252 55 180 29 168 -22 -114 -266 304
7634 304 -113 23 124 90 -112 186 -80 -28 45 -45 174 -140 6 -5 -48 81 89 -62 318 142 142 60 98 54
7658 54 -60 -194 -121 30 170 14 -262 -140 181 -71 -158 -220 -171 148 121 16 -276 -35 -278 84 -63 -29
7680 -29 58 -72 148 24 -5 57 -92 -16 -37 -54 -248 65 338 -145 42 287 -92 204 -144 89 227 -14
7702 -14 -156 -57 -132 -48 213 -56 218 179 -151 4 166 191 49 102 -117 -235 99 34 253 164 237 16 -67 -129
7726 -129 100 9 6 91 -242 -72 -4 -137 -75 13 32 -181 -259 0 -14 -66 -106 -48 186 90 -9 -27 49 186 122 -14
7752 -14 -92 -158 -274 243 -177 -177 -36 130 -186 16 -26 -132 -34 -206 232 249 71 -268 -27 -16 38 32 48 -88
7776 -88 76 87 119 186 68 -40 -61 132 -61 -38 12 120 -138 -1 -162 20 127 79 -33 47 43 -140 89 171
7800 171 -173 72 188 -148 149 51 -104 90 -81 -14 -209 91 -154 -21 55 -30 163 -272 168 157 175 19
7822 19 -197 30 -114 -54 39 -92 -140 285 9 -42 -92 151 -328 -45 -115 -77 -93 -114 113 -42 -157 -160 238 134
7846 134 202 59 -24 252 -102 17 -111 -136 275 -66 38 351 156 207 149 -177 -41 66 303 -159 135 -249
7868 -249 131 99 -104 -94 -138 156 -145 168 -45 72 -310 -47 -247 15 108 -22 191 -113 -53 25 -109 -215
7890 -215 99 181 100 -288 189 -194 -286 235 -62 -95 -12 -35 -13 139 121 -11 -72 -153 93 45 -74 101 45 -24
7914 -24 156 -11 7 -95 -6 -89 13 -35 -68 124 122 -151 -267 -200 -130 40 65 -163 51 77 114 -24 31 25 273
7939 273 30 -136 -42 -118 -111 139 -161 65 -105 120 -228 2 -63 -315 -5 90 -16 -111 -169 39 -35 -79 151
7962 151 201 177 -78 36 -210 -197 -191 33 -30 -215 -6 -193 -14 32 -83 124 206 -158 27 33 -266 89 -2 369
7986 369 -2 39 44 136 -118 42 272 3 -202 -72 10 143 99 -76 66 -31 -56 -25 -67 171 285 -386 48
8009 48 71 114 179 118 77 -124 -184 -214 308 146 36 58 -4 112 -251 65 74 140 16 192 190 34 55 -100 -48 97
8035 97 58 -117 -109 -4 117 -159 -31 -50 73 -203 105 18 -4 114 14 111 48 -153 -193 52 -51 -70 209 -70
8059 -70 -187 264 -36 13 -72 -84 100 346 113 -3 -227 -139 -298 -72 -73 -10 -33 36 -36 18 -130 -24 76 -116
8083 -116 -232 138 77 -196 101 -119 -8 -111 -238 -127 64 123 298 100 186 -94 14 -164 -28 -183 198
8104 198 4 254 71 -75 359 129 186 -16 -13 5 79 -108 -234 -73 -183 -168 39 -71 -51 -93 -53 -48 307 300
8128 300 -64 118 -115 -70 70 -170 -221 17 -69 -251 22 -31 5 -75 -153 64 -103 151 -337 38 -124 208
8150 208 35 -146 -200 84 174 33 8 12 78 202 -52 -99 -44 -78 70 -105 -233 -27 145 25 211 -79 -129
8173 -129 -108 67 39 17 -129 303 100 -131 -149 -44 233 -55 113 180 56 -163 86 -85
8191h5
##END NTUPLES=NMR FID
##END=
