##TITLE=1H_SL30-Dau(A)
 CDCl3
 8 sc, 
 14.1.2022
##JCAMPDX= 6.0         $$ Bruker NMR JCAMP-DX V2.0
##DATA TYPE= NMR FID
##DATA CLASS= NTUPLES
##ORIGIN= UXNMR, Bruker Analytische Messtechnik GmbH
##OWNER= root
$$ XWIN-NMR		Version 3.5
$$ Fri Jan 14 14:52:26 2022 Russian Standard Time (UT+4h)  she@DPX200
##.OBSERVE FREQUENCY= 200.131346
##.OBSERVE NUCLEUS= ^1H
##.DELAY= (6, 6)
##.ACQUISITION MODE= SIMULTANEOUS
##.ACQUISITION SCHEME= undefined
##.AVERAGES= 8
##.DIGITISER RES= 18
##SPECTROMETER/DATA SYSTEM= spect
##.PULSE SEQUENCE= zg30
##.SOLVENT NAME= CDCl3
##.SHIFT REFERENCE= (INTERNAL, CDCl3, 0, 15.7039)
##AUDIT TRAIL= $$ (NUMBER, WHEN, WHO, WHERE, WHAT)
$$ ##TITLE= Audit trail, XWIN-NMR		Version 3.5
$$ ##JCAMPDX= 5.01
$$ ##ORIGIN= Bruker BioSpin GmbH
$$ ##OWNER= she
$$ F:/spectra/data/she/nmr/H-F/1/audita.txt
$$ ##AUDIT TRAIL=  $$ (NUMBER, WHEN, WHO, WHERE, WHAT)
(   1,<2022-01-14 14:51:09.43 +0400>,<she>,<DPX200>,
      <created by zg, POWCHK disabled, PULCHK disabled
       configuration hash MD5:
       00 E9 B6 7A A2 85 ED C7 34 08 36 98 17 FE 4E 26
       data hash MD5: 16K
       28 C0 19 EC 6D 2F 0B 2B 3F D3 9F A8 B6 19 BB 47>)
$$ ##END=
$$ 
$$ hash MD5
$$ 65 36 D4 AC 9B AC E8 FA 9A 5F 7F 91 58 52 9F 05
##$RELAX= 
##$RELAX= 
##$RELAX= 
##$RELAX= 
##$RELAX= 
##$RELAX= 
$$ Bruker specific parameters
$$ --------------------------
##$DU= <F:/spectra>
##$EXPNO= 1
##$NAME= <H-F>
##$PROCNO= 1
##$TYPE= <nmr>
##$USER= <she>
##$AMP= (0..31)
100 100 100 100 100 100 100 100 100 100 100 100 100 100 100 100 100 100 
100 100 100 100 100 100 100 100 100 100 100 100 100 100 
##$AQSEQ= 0
##$AQ_mod= 1
##$AUNM= <au_zg>
##$AUTOPOS= <>
##$BF1= 200.13
##$BF2= 200.13
##$BF3= 200.13
##$BF4= 200.13
##$BF5= 200.13
##$BF6= 200.13
##$BF7= 200.13
##$BF8= 200.13
##$BYTORDA= 1
##$CFDGTYP= 0
##$CFRGTYP= 5
##$CHEMSTR= <none>
##$CNST= (0..31)
1 1 145 1 1 1 1 1 1 1 1 1 1 1 1 1 1 1 1 1 1 1 1 1 1 1 1 1 1 1 1 1 
##$CPDPRG= <>
##$CPDPRG1= <>
##$CPDPRG2= <>
##$CPDPRG3= <>
##$CPDPRG4= <mlev>
##$CPDPRG5= <mlev>
##$CPDPRG6= <mlev>
##$CPDPRG7= <mlev>
##$CPDPRG8= <mlev>
##$CPDPRGB= <>
##$CPDPRGT= <>
##$D= (0..31)
0 1.2 0 0 0 0 0 0 0 0.06 0 0.03 0 0 0 0 0.0002 0 0 0 0 0 0 0 0 0 0 0 0 
0 0 0 
##$DATE= 1642157468
##$DBL= (0..7)
120 120 120 120 120 120 120 120 
##$DBP= (0..7)
150 150 150 150 150 150 150 150 
##$DBP07= 0
##$DBPNAM0= <>
##$DBPNAM1= <>
##$DBPNAM2= <>
##$DBPNAM3= <>
##$DBPNAM4= <>
##$DBPNAM5= <>
##$DBPNAM6= <>
##$DBPNAM7= <>
##$DBPOAL= (0..7)
0.5 0.5 0.5 0.5 0.5 0.5 0.5 0.5 
##$DBPOFFS= (0..7)
0 0 0 0 0 0 0 0 
##$DE= 6
##$DECBNUC= <off>
##$DECIM= 32
##$DECNUC= <off>
##$DECSTAT= 4
##$DIGMOD= 1
##$DIGTYP= 9
##$DL= (0..7)
0 120 120 120 120 120 120 120 
##$DP= (0..7)
150 150 150 150 150 150 150 150 
##$DP07= 0
##$DPNAME0= <>
##$DPNAME1= <>
##$DPNAME2= <>
##$DPNAME3= <>
##$DPNAME4= <>
##$DPNAME5= <>
##$DPNAME6= <>
##$DPNAME7= <>
##$DPOAL= (0..7)
0.5 0.5 0.5 0.5 0.5 0.5 0.5 0.5 
##$DPOFFS= (0..7)
0 0 0 0 0 0 0 0 
##$DQDMODE= 0
##$DR= 18
##$DS= 0
##$DSLIST= <SSSSSSSSSSSSSSS>
$$ [...]
##$SUBNAM2= <"">
##$SUBNAM3= <"">
##$SUBNAM4= <"">
##$SUBNAM5= <"">
##$SUBNAM6= <"">
##$SUBNAM7= <"">
##$SUBNAM8= <"">
##$SUBNAM9= <"">
##$SW= 18.0517287032376
##$SWIBOX= (0..15)
0 0 2 0 0 0 0 0 0 0 0 0 0 0 0 0 
##$SW_h= 3612.71676300578
##$TD= 16384
##$TD0= 1
##$TE= 0
##$TE2= 300
##$TE3= 300
##$TEG= 300
##$TL= (0..7)
0 120 120 120 120 120 120 120 
##$TP= (0..7)
150 150 150 150 150 150 150 150 
##$TP07= 0
##$TPNAME0= <>
##$TPNAME1= <>
##$TPNAME2= <>
##$TPNAME3= <>
##$TPNAME4= <>
##$TPNAME5= <>
##$TPNAME6= <>
##$TPNAME7= <>
##$TPOAL= (0..7)
0.5 0.5 0.5 0.5 0.5 0.5 0.5 0.5 
##$TPOFFS= (0..7)
0 0 0 0 0 0 0 0 
##$TUNHIN= 0
##$TUNHOUT= 0
##$TUNXOUT= 0
##$USERA1= <user>
##$USERA2= <user>
##$USERA3= <user>
##$USERA4= <user>
##$USERA5= <user>
##$V9= 5
##$VALIST= <valist>
##$VCLIST= <CCCCCCCCCCCCCCC>
##$VD= 0
##$VDLIST= <DDDDDDDDDDDDDDD>
##$VPLIST= <PPPPPPPPPPPPPPP>
##$VTLIST= <TTTTTTTTTTTTTTT>
##$WBST= 1024
##$WBSW= 4
##$XGAIN= (0..3)
0 0 0 0 
##$XL= 0
##$YL= 0
##$YMAX_a= 153420
##$YMIN_a= -285523
##$ZGOPTNS= <>
##$ZL1= 120
##$ZL2= 120
##$ZL3= 120
##$ZL4= 120
##$ABSF1= 10
##$ABSF2= 0
##$ABSG= 5
##$ABSL= 3
##$ALPHA= 0
##$AQORDER= 0
##$ASSFAC= 0
##$ASSFACI= 0
##$ASSFACX= 0
##$ASSWID= 0
##$AUNMP= <proc_1d>
##$AZFE= 0.1
##$AZFW= 0.1
##$BCFW= 1
##$BC_mod= 2
##$BYTORDP= 1
##$COROFFS= 0
##$CY= 11.3945322036743
##$DATMOD= 1
##$DC= 2
##$DFILT= <>
##$DTYPP= 0
##$F1P= 2.36226072786647
##$F2P= -0.459571619588291
##$FCOR= 0.5
##$FTSIZE= 0
##$FT_mod= 4
##$GAMMA= 1
##$GB= 0.15
##$INTBC= 1
##$INTSCL= 1
##$ISEN= 128
##$LB= 0.24
##$LEV0= 0
##$LPBIN= 0
##$MAXI= 10000
##$MC2= 0
##$MEAN= 0
##$ME_mod= 0
##$MI= 1.114404
##$NCOEF= 0
##$NC_proc= 0
##$NLEV= 6
##$NOISF1= 3.799351
##$NOISF2= 2.8
##$NSP= 1
##$NTH_PI= 0
##$NZP= 0
##$OFFSET= 15.70392
##$PC= 1
##$PHC0= -15873.97
##$PHC1= 17.60078
##$PH_mod= 1
##$PKNL= yes
##$PPARMOD= 0
##$PSCAL= 0
##$PSIGN= 0
##$REVERSE= no
##$SF= 200.130013532006
##$SI= 16384
##$SIGF1= 3
##$SIGF2= 2
##$SINO= 400
##$SIOLD= 16384
##$SREGLST= <1H.CDCl3>
##$SSB= 0
##$STSI= 0
##$STSR= 0
##$SW_p= 3612.71676300578
##$SYMM= 0
##$S_DEV= 0
##$TDeff= 0
##$TDoff= 0
##$TI= <>
##$TILT= no
##$TM1= 0
##$TM2= 0
##$TOPLEV= 0
##$USERP1= <user>
##$USERP2= <user>
##$USERP3= <user>
##$USERP4= <user>
##$USERP5= <user>
##$WDW= 1
##$XDIM= 8192
##$YMAX_p= 0
##$YMIN_p= 0
$$ End of Bruker specific parameters
$$ ---------------------------------
##NTUPLES= NMR FID
##VAR_NAME=  TIME,          FID/REAL,        FID/IMAG
##SYMBOL=    X,             R,               I
##VAR_TYPE=  INDEPENDENT,   DEPENDENT,       DEPENDENT
##VAR_FORM=  AFFN,          ASDF,            ASDF
##VAR_DIM=   8192,          8192,            8192
##UNITS=     SECONDS,       ARBITRARY UNITS, ARBITRARY UNITS
##FACTOR=    0.0002768,     1,               1
##FIRST=     0,             0,               0
##LAST=      2.2672688,     0,               0
##MIN=       0,             -285523,         0
##MAX=       2.2672688,     153420,          0
$$ Real data points
##PAGE= N=1
##DATA TABLE= (X++(R..R)), XYDATA
$$ [...]
$$ plain form
1755 -2 -196 -229 390 -52 93 1131 891 -667 -304 1280 520 -540 60 663 -181 -1097 -549 233 757 -83
1775 -83 -1188 -482 791 -751 -1062 623 876 -450 -849 -93 636 387 -261 -137 880 395 -863 -160
1793 -160 1516 828 -337 -62 721 358 -423 -258 502 143 -934 -1163 -162 68 -162 -345 -224 89 -235
1812 -235 -477 74 858 475 -250 -80 -80 -19 319 324 -57 231 168 -162 -64 691 622 -37 -96 -117 2 64 -463 -173
1836 -173 515 -268 -1340 -628 408 -332 -316 257 200 88 -446 -367 694 914 -385 -646 458 919 -356
1855 -356 -339 736 950 -422 -832 439 1082 151 -624 220 507 -308 -1053 -302 554 338 -1181 -937 348
1874 348 -84 -946 177 595 -92 -365 -15 364 549 446 -184 205 420 -256 -350 686 355 -112 -113 13
1894 13 -325 7 178 -87 -3 35 -270 -637 -334 36 -36 -420 -746 -166 101 -348 66 460 582 252 -357
$$ packed form
1755bj94l3O19m42J45J038k40j558L63J584p60j060O00O03q44r16N48P82N24q40
1775h3j105P06J273j542l11J685K53j326l99P56P29k49o48J24J017m85j258P03
1793a60J676o88j165K75P83l63p81J65P60l59j077k29J001K30k30j83J21L13l24
1812b35k42N51P84l83p25J70%O1L38Nl81K88o3l30R8P55o9o59n9k1J19O2n27K90
1836a73O88p83j072P12J036p40J6N73n7j12n34P9J061K20j299k61J104M61j275
1855c56J7J075K14j372m10J271O43r31p75Q44K87q15p45P51Q56k16j519K44J285
1874C48m32q62J123M18o87k73L50L79J85j03o30L89K15o76r4J036l31m67jJ26
1894A3l38L32J71k65Q4L8l05l67L03L70p2l84l26N80K67m49M14L94J22l30o09
$$ plain form
1915 -357 -17 1074 913 -404 -85 696 145 -777 6 961 429 -409 -613 90 394 -358 -729 558 652
1934 652 -923 -1075 273 474 -466 -597 201 252 -260 -564 193 1011 258 -524 59 978 377 -56 416 739
1954 739 86 -617 -319 365 83 -357 -220 -13 -316 -251 -279 -178 339 15 -618 -416 66 -13 141 -17 -232
1975 -232 -56 422 -77 -47 691 740 131 -300 174 441 280 445 149 144 85 -822 -189 850 192 -805 -328
1996 -328 373 -316 -945 -138 470 -63 -698 -643 339 454 -277 -152 767 731 -397 -637 599 1209 119 -516
2016 -516 154 734 -415 -306 303 537 -141 -550 -322 77 -127 -692 -433 142 -519 -881 -182 337 65 -90
2036 -90 237 -186 68 273 158 361 598 197 14 82 295 303 188 86 -357 -133 -25 -159 -318 177 156 -459
2058 -459 -826 -191 365 -218 -497 209 178 -437 -686 331 773 260 -518 -21 769 83 -304 414 1097 248
$$ packed form
1915c57L40J091j61j317L19P81n51r22P83R55n32q38k04P03L04p52l71J287R4
1934F52j575j52J348K01r40j31P98N1n12l04P57Q18p53p82N83R19o01m33M72L23
1954G39o53p03K98O84k82m40J37K07l03O5k8J01N17l24o33K02M82p9J54j58k15
1975b32J76M78m99L0P38M9o09m31M74K67j61J65k96nn9r07O33J039o58r97M77
1996c28P01o89o29Q07O08n33o35N5R82J15p31J25R19l6j128k40J236O10j090o35
2016e16O70N80j149J09O09K34o78m09K28L99k04n65K59N75o61l62O99N19k72j55
2036i0L27m23K54K05j15K03K37m01j83O8K13Qj15j02m43K24J08j34j59M95k1o15
2058d59l67O35N56n83k79P06l1o15k49J017M42n13p78M97P90o86l87P18O83q49
$$ plain form
2078 248 -522 -151 534 294 -429 -298 327 38 -1026 -596 825 368 -818 -513 314 46 -655 -252 477
2097 477 155 -438 -590 15 421 84 -192 255 476 -191 -119 152 596 159 -176 -6 -18 -125 -60 115 -98
2118 -98 -82 -227 -442 -400 42 319 -123 -12 -208 -223 -86 -144 -61 410 372 -133 -490 438 693 104 235 726
2140 726 253 -13 -69 183 562 159 -610 -224 435 -226 -689 395 453 -435 -1242 -120 465 80 -642 -103
2160 -103 377 -280 -816 -105 529 457 -306 -398 458 552 -161 -7 720 567 -360 -329 224 194 -68 -175 -145 94
2182 94 -269 -664 12 256 -166 -359 -80 -260 -476 109 395 309 366 137 100 -84 383 500 326 51 143 292
2204 292 182 -79 96 294 -203 -710 -389 234 130 -443 -427 -104 93 -749 -746 194 630 -483 -571 157 601
2225 601 -88 -281 461 763 -27 -645 342 832 225 -189 352 533 -65 -421 -107 655 255 -500 -601 254
$$ packed form
2078B48p70L71O85k40p23J31O25k89j064M30J421m57j186L05Q27k68p01M03P29
2097D77l22n93j52O05M06l37k76M47K21o67P2K71M44m37l35J70j2j07O5J75k13
2118i8J6j45k15M2M42K77m42J11j96j5J37n8Q3M71l8n05l57R28K55n89J31M91
2140G26m73k66n6K52L79m03p69L86O59o61m63J084N8q88q07J122N85l85p22N39
2160a03M80o57n36P11O34p2p63r2Q56R4p13J54P27j53r27L1N53l0k62j07L0K39
2182I4l63l95O76K44m22j93K79j80k16N85K86q6N7k29l7j84M67J17j74k75R2J49
2204B92j10k61J75J98m97n07L21O23j04n73J6L23J97q42LR40M36j113q8P28M44
2225F01o89j93P42L02p90o18R87M90o07m14N41J81n98l56L14P62m00p55j01Q55
$$ plain form
2245 254 -129 -742 -147 285 -16 -804 -178 339 256 35 -147 155 199 23 -67 415 462 -23 -25 198 160 33
2267 33 244 317 -11 -124 85 -116 -115 27 1 -168 -613 -290 -96 -281 -114 116 -83 55 -277 -427 579
2288 579 753 -313 -392 616 263 -575 77 750 305 -244 -196 96 309 -175 -311 424 656 -369 -849 139
2308 139 384 -280 -774 -107 243 -516 -673 -122 442 19 -413 -26 555 309 -162 67 829 203 -394 28
2328 28 614 219 -203 -117 226 -180 -284 29 155 245 -50 -144 -118 -286 -305 35 20 -185 -410 -271 185 -57
2350 -57 60 339 237 6 195 334 115 -33 173 294 114 -568 -179 359 474 -372 -10 188 -207 -601
2370 -601 -183 405 -48 -598 -605 -78 164 -313 -359 299 323 -340 -336 409 831 -323 -383 455 278 -310 -445 731
2392 731 527 60 -266 108 226 -9 -523 -115 177 -184 -856 -345 101 -25 -540 -125 46 -307 -238 -183 270
$$ packed form
2245B54l83o13N95M32l01p88O26N17q3k21j82L02M4j76r0M82M7m85kK23l8j27
2267C3K11P3l28j13K09k01JJ42k6j69m45L23J94j85J67K30j99J38l32j50J006
2288E79J74j066p9J008l53q38O52O73m45n49M8K92K13m84j36P35K32j025m80R88
2308A39K45o64m94O67L50p59j57N51N64m23m32L87N81k46m71K29P62o26n97M22
2328B8N86l95m22Q6L43m06j04L13J26R0k95r4K6j68j9L40j5k05k25J39M56k42
2350e7J17K79j02k31J89J39k19j48K06J21j80o82L89N38J15q46L62J98l95l94
2370f01M18N88m53n50pN27K42m77m6O58K4o63MP45M22j154o0Q38j77n88j35J176
2392G31k04m67l26L74J18k35n14M08K92l61o72N11M46j26n15M15J71l53O9N5M53
$$ plain form
2413 270 209 -196 -342 154 300 223 327 404 108 -19 105 180 74 3 184 -149 -308 -143 149 -275 -452 92
2435 92 -14 -473 -496 3 126 -29 -499 -248 226 200 -279 -25 611 346 -508 201 756 235 -283 -128 436
2456 436 146 -433 -291 292 392 -361 -556 285 202 -573 -549 226 329 -533 -668 39 302 -179 -343 218 326
2477 326 292 21 154 681 250 -261 49 411 -52 -243 309 457 71 17 -336 -39 21 15 -252 -184 -196 -321
2499 -321 -281 -252 -141 -269 4 -310 -349 316 453 -103 -273 244 403 -57 -78 484 423 207 -367 -40 459 118
2521 118 -464 58 497 -186 -722 -324 458 -84 -499 -133 650 -228 -472 -43 450 159 -212 -275 91 389
2541 389 -408 -146 639 544 -304 -253 488 339 -147 -201 49 260 -26 -192 -88 129 9 -744 -289 265 -195
2562 -195 -282 148 56 -143 -440 25 23 161 63 115 -17 -64 381 147 188 132 56 357 -54 1 89 383 -109 -172
$$ packed form
2413B70o1m05j46M96J46p7J04P7k96j27J24P5j06p1J81l33j59J65K92m24j77N44
2435I2j06m59k3M99J23j55m70K51M74k6m79K54O36k65q54P09N55n21n18J55N64
2456D36k90n79J42N83J00p53j95Q41q3p75K4P75J03q62j35P07K63m81j64N61J08
2477C26l4k71J33N27m31n11L10L62m63j91N52J48l86n4l53K97O0ok67O8j2j25
2499c21M0K9J11j28K73l14l9O65J37n56j70N17J59m60k1N62o1k16n74L27M99l41
2521A18n82N22M39o83n36L98P82n42m15L66P83q78k44M29M93k91l71o3L66K98
2541C89p97K62P85r5q48N1P41j49m86n4K50K11k86j66J04K17j20p53M55N54m60
2562a95q7M30r2j99k97M65kJ38r8N2j32m7M45k34M1n6p6L01m11N5Q8K94m92o3
$$ plain form
2586 -172 88 105 -519 -583 391 154 -315 -267 111 -73 -145 -427 61 656 -143 -582 105 843 262 -421 160
2607 160 507 394 -292 -53 732 308 -253 -234 301 426 -469 -189 370 -28 -568 -586 225 82 -321 -269 -25
2628 -25 335 -246 -369 204 259 212 -117 26 450 227 117 375 354 154 122 183 107 -123 354 33 -422 44
2650 44 102 -158 -199 -79 -65 -67 -472 -289 -61 238 -162 -452 251 327 -377 -148 645 666 -241 -77 281 412 -194
2673 -194 -213 394 431 -159 -582 -38 441 -173 -606 -15 178 -326 -523 -40 502 -100 -565 -78 322 93 -78
2694 -78 -193 447 244 -222 -127 438 309 -176 114 274 240 -33 139 119 182 -70 -238 -60 -197 -127 -243 -66
2716 -66 55 -247 -299 -120 -44 -111 -6 -46 -337 -243 221 137 -126 116 204 11 -316 174 374 249 29 10 338
2739 338 319 -487 -233 298 163 -489 -542 122 146 -212 -235 90 116 -209 -599 -66 484 -306 -513 239 439 124
$$ packed form
2586a72K60J7o24o4R74k37m69M8L78j84p2k82M88N95p99m39O87P38n81o83N81
2607A60L47j13o86K39P85m24n61J9N35J25q95K80N59l98n40j8Q11j43m03N2K44
2628b5L60n81j23N73N5m7l29J43M24k23j10K58k1k00l2O1p6k30M77l21m55M66
2650D4N8k60m1J20J4km05J83K28K99m00k90P03P6p04K29P93K1r07J64L58J31o06
2673a94j9O07L7n90m23N44M79o14m33N91J93n04j97M83N42o02m65M87M00k29j71
2694g8j15O40k03m66R5N65j29m85K90J60l4k73J72k0O3k52j68J78j37P0j16J77
2716f6J21l02n2J79P6o7J05m0k91R4M64q4k63K42Q8j93l27M90K00j25k20j9L28
2739C38j9q06K54N31j35o52n3O64K4l58k3L25K6l25l90N33N50p90k07P52K00l15
$$ plain form
2761 124 -197 220 403 -71 -107 119 540 181 -177 -51 272 40 -411 17 155 55 -378 -131 89 -55
2781 -55 -349 -18 78 -251 -146 -143 -33 38 188 60 169 148 51 67 199 72 43 212 73 -285 65 215 49
2804 49 -368 222 227 -22 -298 133 -17 -210 -300 -234 -118 33 -242 -222 368 430 -462 -190 416 516 -344 -91
2826 -91 426 285 -152 -338 518 470 -89 -234 264 385 -40 -615 -24 486 -204 -514 -43 279 -270 -360 -34
2847 -34 447 -55 -244 -120 335 138 -101 -311 394 77 -122 158 323 -29 173 290 22 -53 -42 -175 -312
2868 -312 -107 -98 -59 -180 83 -39 -112 -5 -209 -102 101 -19 -328 73 226 2 -337 196 326 119 -331
2889 -331 91 182 140 -135 -92 356 106 -328 -304 442 72 -440 -258 174 147 -343 -218 148 212 -253 -540 91
2911 91 500 -70 -387 616 289 -34 -314 529 423 103 155 124 166 -133 -318 -7 73 135 -298 -55 58 -3
$$ packed form
2761A24l21M17J83m74l6K26M21l59l58J26L23k32m51M28J38j00m33K47K20j44
2781e5k94L31R6l29J05LJ10P1J50j28J09k1r7J6J32j27k9J69j39l58L50J50j66
2804D9m17N90Nk49k76M31j50j93r0O6J16J51k75K0N90O2q92K72O06J00q60K53
2826i1N17j41m37j86Q56m8n59j45M98J21m25n75N91N10o90l10M71L22n49r0L26
2847c4M81n02j89J24M55j97k39k10P05l17j99K80J65l52K02J17k68p5J1j33j37
2868c12K05RL9j21K63j22p3J07k04J07K03j20l09M01J53k24l39N33J30k07m50
2889c31M22R1m2k75M3M48k50m34K4P46l70n12J82M32k7m90J25L66O4m65k87O31
2911I1M09n70l17J003l27l23k80Q43j06l20N2l1M2k99j85L11Q0O2m33K43J13o1
$$ plain form
2933 -3 -411 -106 80 -34 -144 -115 -199 -188 -110 -33 -138 -155 187 168 -80 220 387 -26 -117 26 29 177 72 -51
2957 -51 48 536 70 -413 49 282 -171 -270 -214 -198 -286 -327 -164 254 144 -471 -330 380 115 -326 -289 237 5
2980 5 -216 -99 283 252 -115 -55 302 378 10 -80 171 171 -189 -425 257 209 -262 -367 28 231 -328 -259 -31
3003 -31 273 -9 15 95 13 -19 -51 9 120 34 -18 183 48 12 492 249 156 11 89 364 20 -116 125 106
3027 106 -125 63 58 109 79 -391 -82 208 -257 -319 156 505 -11 -385 112 228 -107 -99 199 285 81 -255 82
3050 82 354 233 -360 -22 189 -20 -422 -88 183 -100 -545 -462 65 -167 -175 -350 264 96 -204 -215 54 231
3072 231 -287 -154 339 210 -207 66 180 214 113 174 83 121 -2 59 227 3 -199 -165 24 -136 -62 -154 68
3095 68 -299 -231 128 120 -315 59 211 -152 -106 55 132 187 -117 -253 210 236 -145 -264 38 408 -147 -530 70
$$ packed form
2933cm08L05J86j14j10K9q4J1P8P7j05j7L42j9k48L00J67m13r1J43LJ48j05j23
2957e1R9M88m66m83M62K33m53r9N6J6q8m1J63M18j10o15J41P10k65m41L7N26k32
2980Ek21J17L82l1l67O0L57P6l68r0K51%l60k36O82m8m71j05L95K03n59O9K28
3003c1L04k82K4Q0q2l2l2O0J11q6n2K01j35l6M80k43r3j45P8K75l44j36K41j9
3027A06k31J88nN1l0m70L09K90m65o2M75L49n16l74M97J16l35QK98Q6k04l36L37
3050H2K72j21n93L38K11k09m02L34K71k83m45Q3N27k32qj75O14j68l00j1K69J77
3072B31n18J33M93j29m17K73J14L4j01O1r1L8j23O1J68k24k02L4J89j60P4r2K22
3095F8l67O8L59qm35L74J52l63M6J61P7N5l04j36M63K6l81j19L02L70n55l83O00
$$ plain form
3118 70 282 -269 -158 225 -17 -133 -333 -142 33 62 -454 -109 121 97 -217 116 360 88 -297 51 231
3139 231 206 -36 109 286 138 -31 -95 286 202 -4 -146 211 -72 -199 -187 81 -169 -295 14 -211 -148 -42
3161 -42 -85 60 55 -61 -33 137 183 141 176 383 8 -159 90 401 7 -3 380 135 -260 -104 131 39 -172
3184 -172 -279 -221 78 -196 -187 -27 106 -330 -294 127 373 -157 -123 329 359 -105 -224 129 353 -122 50 235
3206 235 417 -98 -183 122 348 17 -507 9 276 -228 -202 138 140 -373 -315 -62 78 121 -260 -231 21 54 -58
3229 -58 2 518 -32 -49 115 192 72 -90 119 157 76 -115 -11 -35 51 141 -170 104 -103 -104 -61 140 -206 -114
3253 -114 -39 -218 -403 55 273 21 -165 -11 174 363 -191 -124 287 23 -55 -227 431 316 -303 -188 215
3274 215 280 -431 -238 64 144 -147 -346 28 119 -199 -342 -190 182 -11 -308 44 310 261 -58 93 354
$$ packed form
3118G0K12n51J11L83k42j16k00J91J75K9n16L45K30k4l14L33K44k72l85L48J80
3139B31k5k42J45J77j48j69o4L81q4k06j42L57k83j27J2K68k50j26L09k25O3J06
3161d2m3J45nj16K8J70M6m2L5K07l75j67K49L11l94j0L83k45l95J56K35r2k11
3184a72j07N8K99k74RJ60J33m36L6M21K46n30L4M52L0m64j19L53K24m75J72J85
3206B35J82n15q5L05K26l31n24N16K67n04K6L40Kn13N8K53J40M3l81K9K52L3j12
3229e8O0N16n50j7J64P7j20j62K09L8q1j91J04k4Q6R0l11K74k07jM3K01l46R2
3253a14P5j79j85M58K18k52j86J54J85J89n54O7M11k64p8j72O58j15o19J15M03
3274B15O5p11J93L02Q0k91j99L74R1l18j43J52L72j93k97L52K66m9l19J51K61
$$ plain form
3295 354 39 -91 156 388 40 58 15 222 -48 -103 -261 127 8 -238 -166 -298 -183 -226 82 -32 -194 -147
3317 -147 68 10 -202 258 45 183 -10 63 369 77 -10 -75 321 106 -78 -9 283 -52 -188 -149 -7 -207
3339 -207 -292 -46 -37 -53 -23 -140 87 -18 -366 -324 276 90 -186 -148 311 77 -7 -105 329 491 141 -145 171
3362 171 382 5 -380 115 -4 -178 -282 -75 -89 -107 -318 145 76 -134 26 -121 -23 75 -5 -212 104 93
3384 93 -122 -89 271 204 105 220 98 -174 86 131 45 244 -77 0 81 11 47 74 -130 -218 -80 -126 -22 -260
3408 -260 135 94 -186 -398 177 146 -86 -60 162 200 25 -265 3 171 170 -189 -99 203 187 -127 -44 216 231
3431 231 -314 -46 216 187 -279 124 214 -112 -184 -388 79 405 -83 -373 -131 157 -212 -197 295 183 -5
3452 -5 -119 45 108 160 59 203 195 242 -169 -98 -6 -34 -126 -20 93 -314 15 -178 -270 -63 36 -36 -106 -19 136
$$ packed form
3295C54l15j30K47K32l48J8m3K07k70n5j58L88j19k46P2j32J15m3L08j14j62M7
3317a47K15n8k12M60k13J38j93P3L06k92q7o5L96k15j84O9K92l35j36L9J42k00
3339b07q5K46Rj6L0j17K27j05l48M2O00j86k76L8M59k34q4r8M34J62l50k86L16
3362A71K11l77l85M95j19j74j04K07j4j8k11M63o9k10J60j47R8R8q0k07L16j1
3384I3k15L3L60o7r9J15j22k72K60M5q6J99l21P7Q1p0L6K7k04q8J38m6J04k38
3408b60L95m1k80k12N75l1k32K6K22L8j75k90K68J68jl59R0L02j6l14Q3K60J5
3431B31n45K68K62k9m66M03R0l26p2k04M67L26m88k90K42K88l69J5M92j12j88
3452ej14J64O3N2j01J44qM7m11P1R2k8r2J06J13m07L29j93r2K07R9p2p0Q7J55
$$ plain form
3477 136 124 -93 -160 122 311 138 -197 52 356 -17 -193 300 395 -3 -341 -19 197 -141 -212 -6 119
3498 119 58 -250 51 2 -120 -368 -256 309 -14 -300 -16 365 271 -28 54 400 155 -24 -9 296 153 -85
3520 -85 -176 -11 190 -5 -247 -148 57 -125 -34 87 -132 -148 -21 235 -207 -269 109 -64 -36 132 23 -101
3542 -101 -43 62 319 172 -4 -95 -47 -49 -74 -253 160 108 -129 -213 254 117 19 41 -102 22 -291 -305 -9 96
3566 96 73 -194 -67 261 -8 -133 294 262 -238 -40 299 235 145 -100 2 241 -7 -311 27 365 4 58
3588 58 -129 33 -66 -193 -208 240 26 -174 -85 36 -120 -112 -279 67 -12 -225 -200 174 40 -121 318 -47 0
3611 0 49 184 -76 120 27 36 9 -80 -83 -33 232 -54 27 149 -59 -116 -91 112 -33 -312 -182 37 -38 -53 31 236
3637 236 239 -134 165 249 305 -102 -97 113 402 -148 -199 175 172 -195 -185 -83 -5 -177 -448 -74 93 -43 -413 -36
$$ packed form
3477A36j2k17o7K82J89j73l35K49L04l73j76M93R5l98l38L22K16l38p1K06J25
3498A19o1l08L01m9j22k48J12N65l23k86K84L81r4k99Q2L46k45j79J5L05j43k38
3520h5r1J65K01j95k42R9K05j82R1J21k19j6J27K56m42o2L78j73K8J68j09j24
3542a01N8J05K57j47j76r1M8kk5j79M13n2k37q4M67j37r8K2j43J24l13j4K96J05
3566I6k3k67J27L28k69j25M27l2n00J98L39o4r0k45J02K39k48l04L38L38l61N4
3588E8j87J62r9j27j5M48k14k00Q9J21j56Qj67L46p9k13K5L74j34j61M39l65M7
3611@M9J35k60J96r3Rk7q9lN0K65k86Q1J22k08n7K5K03j45k79J30K19p5j5Q4K05
3637B36Ll73K99Q4N6m07NK10K89n50n1L74ll67J0J02P8j72k71L74J67j36l70L77
$$ plain form
3661 -36 278 -37 -196 288 267 -183 -163 47 83 228 -65 100 168 -13 88 57 96 133 -139 56 37 -94 -234
3684 -234 175 -176 -286 116 -192 -227 -18 1 -35 -121 -133 110 -18 127 -88 132 287 140 2 -110 341 132
3706 132 -184 -61 259 46 -327 90 -46 -149 -122 -110 7 209 -49 -228 -61 -98 -288 -106 170 142 -302
3727 -302 -138 42 116 89 -202 92 239 -33 8 -147 228 -11 -345 5 415 16 -111 171 55 -85 -184
3748 -184 65 134 7 -84 -136 46 -44 -284 11 130 -178 -93 94 313 -168 -101 298 227 -132 145 280 67
3770 67 -261 43 119 12 -142 -292 170 142 -174 -125 163 -89 -294 -105 136 -58 -46 82 223 -155 -238 29
3792 29 348 250 -132 -152 277 425 -122 -14 365 258 158 -161 99 18 -80 -220 230 45 -52 -115 -32 35 -91
3815 -91 -126 32 171 -110 -191 -81 -55 42 -85 -223 -80 -109 -33 -65 172 163 -44 28 44 124 -203 83 20 -89 37
$$ packed form
3661c6L14l15j59M84k1m50K0K10L6J45k93J65O8j81J01l1L9L7k72J95j9j31j40
3684b34M09l51j10M02l08l5K09J9l6q6j2K43j28J45k15K20J55j47j38j12M51k09
3706A32l16J23L20k13l73M17j36j03K7J2J17K02k58j79J67l7j90J82K76k8m44
3727c02J64J80P4k7k91K94J47k72M1j55L75k39l34L50M10l99j27K82j16j40r9
3748a84K49O9j27r1n2J82r0k40K95J19l08Q5J87K19m81O7L99p1l59K77J35k13
3770F7l28L04P6j07j54j50M62k8l16M9K88k52k05J89K41j94J2J28J41l78q3K67
3792B9L19r8l82k0M29J48n47J08L79j07j00l19K60q1r8j40M50j85r7o3Q3O7j26
3815i1l5J58J39k81q1J10K6R7j27j38J43k9P6l2K37rk07P2J6Q0l27K86o3j09J26
$$ plain form
3840 37 98 -58 -43 61 38 -195 -58 149 -35 -46 2 6 138 -138 132 23 238 100 -93 -56 141 228 -152
3863 -152 -129 64 -192 -79 -19 117 133 -126 90 104 -126 -287 -249 71 80 -263 -203 36 -65 -201 63 186 134
3886 134 -80 43 -21 158 -5 -126 44 292 -30 -21 151 181 -127 39 -258 -12 -85 1 -179 -143 -70 26 -147
3909 -147 -97 -147 -108 -42 -167 -142 129 179 -192 -28 96 258 -11 4 159 280 209 -119 148 97 -26 0 145
3932 145 52 -87 -268 -41 175 -142 -399 -166 -44 -70 -237 10 -19 -84 -70 -201 258 28 -135 69 97 40
3954 40 -134 26 85 -287 -220 -26 209 -264 -274 238 61 -32 -190 106 -120 16 26 -93 -157 -175 -142 -93 190
3977 190 -180 134 90 65 90 113 196 296 -1 -109 119 -52 -67 -87 -109 241 -15 121 96 56 -178 -195 261 203
4001 203 -226 -230 144 -25 2 -62 94 135 54 -115 -111 102 -114 -163 -94 290 -85 43 23 263 -82 2 -7 352 -135
$$ packed form
3840C7O1j56J5J04k3k33J37K07j84j1M8MJ32k76K70j09K15j38j93L7J97Q7l80
3863a52K3J93k56J13O0J36J6k59K16J4k30j61L8L20Rl43O0K39j01j36K64J23n2
3886A34k14J23o4J79j63j21J70K48l22RJ72L0l08J66k97K46p3Q6j80L6P3R6j73
3909a47N0n0L9O6j25K5K71N0l71J64J24J62k69J5J55J21p1l28K67n1j23K6J45
3932A45r3j39j81K27K16l17k57K33J22k6j67K47k9o5J4j31M59k30j63K04K8n7
3954D0j74J60N9l72O7J94K35m73j0N12j77r3j58K96k26J36J0j19o4j8L3M9K83
3977A90l70L14m4k5K5K3Q3J00k97j08K28j71j5k0k2L50k56J36k5m0k34j7M56n8
4001B03m29mL74j69K7o4J56M1q1j69MK13k16m9O9L84l75J28k0K40l45Q4rL59m87
$$ plain form
4026 -135 -111 212 199 -140 -277 70 74 -42 -379 -137 -12 24 6 -72 340 244 -231 -17 26 -19 44 -67 97 199
4050 199 12 -3 227 67 -230 127 157 -115 -213 -79 41 69 -69 129 -125 -107 -172 -12 -120 -68 -54 32 141
4073 141 -44 -44 169 37 66 -108 100 86 49 -51 298 204 -22 45 24 252 157 -163 -45 215 -336 -164 64
4096 64 -1 23 -101 -2 140 -162 -107 -102 -22 103 -147 -11 144 52 -127 342 282 6 96 238 310 190 36 52
4120 52 31 -175 -314 -57 138 -186 -244 189 -22 120 -36 -67 47 -234 -140 -131 326 -18 40 -71 -58 -51 215 89
4144 89 80 75 -95 87 -3 -37 -11 45 78 -171 3 75 -40 -147 -57 -260 -156 -224 -68 48 85 -20 16 -7 30 4
4170 4 -91 387 198 -351 -18 416 241 -78 -40 75 83 -138 -89 -184 69 -80 -121 106 47 -100 -129 49 86 -151
4194 -151 -32 -21 -185 -8 -44 22 -31 220 52 75 218 231 172 99 161 -71 -45 55 97 -192 55 -22 -222 51
$$ packed form
4026a35K4L23j3l39j37L47Mj16l37K42J25L6j8p8M12r6m75K14M3m5O3j11J64J02
4050A99j87j5K30j60k97L57L0k72r8J34J20K8j38J98k54J8o5J60j08N2J4Q6J09
4073A41j85%K13j32K9j74K08j4l7j00L49r4k26O7k1K28r5l20J18K60n51J72K28
4096F4o5K4j24R9J42l02N5NQ0J25k50J36J55r2j79M69o0k76R0J42P2j20j54J6
4120E2k1k06j39K57J95l24n8M33k11J42j56l1J14k81R4RM57l44N8j11J3PK66j26
4144H9rnj70J82r0l4K6N6L3k49J74P2j15j07R0k03J04o8J56J16L7j05L6k3L7k6
4170Dr5M78j89n49L33M34j75l19L8J15Qk21M9r5K53j49m1K27n9j47k9J78L7k37
4194a51J19J1j64J77l6O6n3K51j68K3J43J3n9p3O2k32K6J00M2k89K47p7k00K73
$$ plain form
4218 51 -33 108 104 -33 99 6 -93 -118 -46 -82 -65 -281 -28 223 -180 -152 47 179 -11 -6 20 18 115 292 -54 111
4244 111 -55 -110 -107 117 16 -118 -263 8 89 49 -2 58 -112 -53 -333 213 214 -168 34 179 251 14 -175 156
4268 156 166 -127 -131 73 244 -177 92 124 -50 -187 75 10 124 -50 -21 -147 -60 31 -135 -15 54 146 94 1
4292 1 50 35 -64 241 68 -72 10 85 112 25 -21 100 33 -255 150 -15 -57 -212 22 287 -44 -32 -137 135
4316 135 57 -262 -282 -8 -64 -115 14 180 215 76 -118 175 188 100 -53 -18 263 -229 -201 112 -62 -92 -95 -39
4340 -39 240 -243 -168 28 -141 -70 58 26 111 7 -60 131 -226 -160 -6 26 47 -20 -124 91 98 26 -118 100
4364 100 68 243 139 -110 300 -31 -38 41 -69 -33 -30 107 -128 -335 97 77 -171 -4 -109 15 -169 -151 36
4387 36 88 213 -183 117 91 103 -180 72 24 75 233 23 82 84 -133 -151 228 -18 -257 -128 158 -5 -47 21
$$ packed form
4218E1q4J41mj37J32r3r9k5P2l6J7k16K53K51m03K8J99J32j90NK6kR7J77l46J65
4244A11j66n5LK24j01j34j45K71Q1m0n1O0j70N9k80N46Jl82K02J45P2k37j89L31
4268A56J0k93mK04J71m21K69L2j74j37K62o5J14j74K9j26Q7R1j66J20O9R2n2r3
4292AM9j5r9L05j73j40Q2P5K7q7m6J21o7k88M05j65m2j55K34K65l31J2j05K72
4316A35p8l19k0K74n6n1J29J66L5j39j94K93J3q8j53L5K81m92K8L13j74l0lN6
4340c9K79m83P5J96j69P1J28l2Q5j04o7J91l57O6J54L2K1o7j04K15Pp2j44K18
4364A00l2J75j04k49M10l31pP9j10L6LJ37k35k07M32k0k48J67j05J24j84J8J87
4387C6N2J25l96L00k6J2k83K52m8N1J58k10N9Kk17j8L79k46k39J29K86j63m2O8
$$ plain form
4411 21 127 186 -256 -7 141 118 -44 49 97 148 38 220 40 296 17 -149 76 21 21 115 53 127 8 4 -47
4436 -47 -75 18 71 281 -71 135 156 17 -20 -52 9 99 -17 -104 152 52 -119 89 224 163 95 -30 154 325
4460 325 -25 -86 141 138 -263 -325 227 86 -203 -112 101 -25 -86 -267 -96 327 -135 -294 58 320 47 16
4482 16 8 14 28 -28 30 149 -48 4 107 109 16 -101 6 43 111 83 6 -49 -162 -109 -19 -21 -51 -130 -78 -38 -42 -26 -60 -19
4512 -19 -164 -109 63 69 -98 -154 29 -39 -36 63 41 -4 169 -217 111 182 -54 -218 -36 129 -79 -164 115 -85
4536 -85 -125 19 75 67 -134 -105 58 190 218 6 -135 134 -35 -87 -58 -23 -10 -93 85 342 43 -107 16 -273
4560 -273 15 -75 34 -8 -329 -47 -54 -149 -46 -159 -67 -239 -183 -96 126 -36 145 59 109 52 -47 -55 190 240 -93
4585 -93 201 266 16 134 243 -4 -43 -239 -24 -89 81 -8 101 -30 -165 -60 -224 66 45 -108 1 139
$$ packed form
4411B1J06N9m42K49J48k3j62R3M8N1j10J82j80K56k79j66K25n5%R4o2P4j19mn1
4436d7k8R3N3K10l52K06K1j39l7l2O1R0j16q7K56j00j71K08J35o1o8j25J84J71
4460C25l50o1K27lm01o2N52j41k89R1K13j26o1j81J71M23m62j59L52K62k73l1
4482A6qOJ4n6N8J19j97N2J03Kr3j17J07L7O8k8p7n5j13N3R0kl0p9N2M0mJ6l4M1
4512a9j45N5J72Oj67n6J83o8LR9k2m5J73l86L28P1k36j64J82J65k08q5K79k00
4536h5m0J44N6qk01K9J63J32K8k12j41K69j69n2K9L5J3q3J78K57k99j50J23k89
4560b73K88r0J09m2l21K82pr5J03j13R2j72N6Q7K22j62J81q6N0n7r9qK45N0l33
4585i3K94O5k50J18J09k47l9j96K15o5J70q9J09j31j35J05j64K90k1j53J09J38
$$ plain form
4607 139 131 -63 149 55 46 -179 -58 222 85 -53 47 -76 87 128 -158 107 290 -200 -66 -64 12 -249 34
4630 34 -144 -7 32 -110 97 2 -27 -211 46 -153 -44 -214 68 132 54 165 302 237 -32 18 -14 -34 -32 66
4654 66 30 38 -20 95 65 -5 6 -43 39 -192 -51 52 62 112 -58 7 66 -162 -98 80 170 66 -197 35 227
4679 227 133 79 -106 105 115 -71 -52 -111 -168 -85 -21 6 -151 -124 -53 219 110 -181 0 115 -14 -41 -224 233
4703 233 186 18 97 293 81 12 -139 67 76 -28 -127 44 -134 -7 -48 -52 -262 -166 -136 -115 -26 -62 -152 -156 -93 -246
4729 -246 126 79 57 -221 176 48 41 165 -39 -78 130 -141 30 17 11 -60 -140 -61 -153 59 -32 41 -157 -82 -51
4754 -51 49 -146 -186 78 -127 -93 -125 236 58 81 -99 -74 -39 77 -5 -42 -31 -121 -123 0 86 58 19 163 175 120
4780 120 -298 -115 193 -246 -216 -131 -62 -15 -81 -32 -26 43 -30 -93 -45 150 234 -78 80 130 52 74 156 96 -32 75
$$ packed form
4607A39qj94K12r4rk25J21K80j37j38J00j23J63M1k86K65J83m90J34KP6k61K83
4630C4j78J37L9j42K07r5k9j84K57j99J09j70K82O4p8J11J37o5k69N0l2k0KR8
4654F6l6Qn8J15l0p0J1m9Q2k31J41J03J0N0j70O5N9k28O4J78R0j04k63K32J92
4679B27r4n4j85K11J0j86J9n9n7Q3O4K7j57K7P1K72j09k91J81J15j29k7j83M57
4703B33m7j68P9J96k12o9j51K06Rj04r9J71j78J27m1mk10R6L0K1Q9l6r0mO3j53
4729b46L72m7k2k78L97j28pJ24k04l9K08k71J71j3op1q0P9r2K12r1P3j98P5L1
4754e1J00j95m0K64k05L4l2L61j78K3j80K5L5J16q2l7J1r0kJ23Q6k8l9J44J2n5
4780A20m18J83L08m39L0Q5O9M7o6M9OO9p3o3M8J95Q4l12J58N0p8K2Q2o0j28J07
$$ plain form
4806 75 -2 164 -189 97 11 -70 -46 1 -13 16 -111 -167 46 -237 34 125 279 56 -124 11 17 -184 84 353
4830 353 -2 -71 -146 90 201 147 39 -4 218 -171 -113 -98 66 -3 -157 85 -90 133 -84 25 -73 3 -38
4853 -38 -225 -1 -14 -161 -8 89 32 -33 73 86 15 -33 65 -121 115 95 -128 -9 -181 -126 -29 75 -254 -146
4877 -146 -79 52 -13 -239 88 -13 -43 -201 27 -38 -60 -36 -113 90 30 39 142 255 -41 18 226 -62 -141 60
4901 60 106 -2 -245 -126 45 65 -214 -26 54 61 46 -140 -55 -50 -125 -162 -5 50 -67 -13 329 26 15 -33 231
4926 231 83 223 33 30 -13 2 43 31 55 -36 -216 -19 -171 14 -73 -7 80 -75 -229 36 -12 -227 -48 56
4950 56 250 -107 14 -116 62 -144 42 0 185 -210 88 311 -58 -78 -120 136 115 -81 -47 61 20 -65 -77
4973 -77 -12 113 -270 -105 -114 -8 -109 -72 217 -114 22 11 -12 125 -17 -209 40 88 29 -243 141 60 -5 99
$$ packed form
4806G5p7J66l53K86q6q1K4M7j4K9j27n6K13k83K71R1J54k23j80J35Ok01K68K69
4830C53l55o9p5K36J11n4j08m3K22l89N8J5J64o9j54K42j75K23k17J09r8P6m1
4853c8j87K24j3j47J53R7n7o5J06J3p1m8R8j86K36k0k23J19j72N5R7J04l29J08
4877a46O7J31o5k26L27j01l0j58K28o5k2K4p7K03o0RJ03J13k96N9K08k88p9K01
4901F0M6j08k43J19J71K0k79J88Q0Pj5j86Q5Np5l7J57N5j17N4L42l03j1m8K64
4926B31j48J40j90lm3J5M1j2K4r1j80J97j52J85q7O6Q7j55j54K65m8k15J79J04
4950E6J94l57J21j30J78k06J86m2J85l95K98K23l69k0m2K56k1j96L4J08m1q5j2
4973g7O5J25l83J65rJ06j01L7K89l31J36j1k3J37j42j92K49M8n9k72L84q1o5J04
$$ plain form
4997 99 65 6 -206 -78 72 -51 -121 -131 113 -67 -183 73 -44 216 -110 -151 -104 -11 -4 -71 82 219 -94 -65
5021 -65 235 75 -29 175 113 -5 95 121 155 7 9 -108 105 7 -66 -69 -25 -10 122 -25 50 18 57 51 -114 -84
5047 -84 -130 -22 112 252 -60 68 173 -26 107 35 107 -76 60 -100 193 -65 -92 -119 179 32 -44 32 185
5070 185 117 -106 -40 6 -23 -178 -105 49 83 8 -10 -57 -26 -6 -15 262 18 94 -144 -58 122 52 35 0 -56 -59 -84
5097 -84 21 -11 34 -70 38 70 -159 31 -39 -94 -58 268 135 15 148 101 -120 150 -74 -37 -84 32 158
5120 158 115 -27 -127 215 -11 125 -14 -35 -140 202 196 -28 43 -29 11 -167 19 -56 87 101 148 132 179 154
5144 154 -114 76 43 66 4 137 183 -41 -129 -35 189 -218 -40 0 139 34 -112 4 -59 -148 25 28 -263 -263
5168 -263 -9 93 71 -41 237 47 -168 81 -150 45 172 20 -59 118 59 137 -60 49 -96 16 -176
$$ packed form
4997I9l4n9k12J28J50j23p0j0K44j80j16K56j17K60l26m1M7R3Po7J53J37l13K9
5021f5L00j60j04K04o2j18J00K6L4j48Kj17K13r8p3lM4J5J32j47P5l2L9oj65L0
5047h4m6J08J34J40l12J28J05j99J33p2P2j83J36j60K93k58k7k7K98j47p6P6J53
5070A85o8k23O6M6k9j55P3J54L4p5j8m7L1K0rK77k44P6k38Q6J80p0j7l5n6lk5
5097h4J05l2M5j04J08L2k29J90p0n5L6L26j33j20J33m7k21K70k24L7m7J16J26
5120A58m3j42j00L42k26J36j39k1j05L42ok24P1p2M0j78J86p5J43J4M7j6M7k5
5144A54k68J90l3K3o2J33M6k24q8R4K24m07J78M0J39j05j46J16o3q9J73Lk91%
5168b63K54J02k2j12K78j90k15K49k31J95J27j52p9J77n9P8j97J09j45J12j92
$$ plain form
5189 -176 112 -76 -95 100 88 -127 -9 146 -66 -50 -204 -162 -43 -76 -123 155 115 37 -86 -172 65 -167 -14
5212 -14 86 94 260 5 -4 303 -162 -53 43 -62 -57 -186 153 -85 -62 -57 -22 -24 -58 113 3 149 20 -31 -39 -3
5238 -3 -4 91 233 110 -81 -149 11 53 -107 -37 -73 229 -26 -100 -56 102 -110 -9 -80 44 -53 -148 -49 -115 -35 -142
5264 -142 -124 -33 -207 -107 29 132 2 -42 279 83 85 -103 100 6 -155 182 -125 -19 -87 -189 73 76 105
5287 105 -61 277 -8 104 -188 16 164 23 -241 -59 112 101 11 35 125 43 -83 -46 234 -36 -204 1
5309 1 83 2 -105 88 -21 -8 -90 90 57 -85 -124 -95 40 -68 -5 -140 -28 -11 63 10 94 75 34 122 223 124
5335 124 60 1 51 4 -12 -8 -133 133 -180 114 45 111 10 -28 112 -98 35 -46 -15 -286 -171 -23 274 -5
5359 -5 -56 115 98 -6 -22 -31 51 59 -21 109 37 31 -82 93 63 -64 -16 -139 21 -1 -28 105 20 23 -2 -103 100
$$ packed form
5189a76K88j88j9J95j2k15J18J55k12J6j54M2J19l3m7K78m0p8j23q6K37k32J53
5212a4J00QJ66k55rL07m65J09R6j05Nj29L39k38K3NL5kl4J71j10J46j29n1qL6
5238cjR5J42j23j91o8J60M2j60P0l6L02k55p4M4J58k12J01p1J24r7r5R9o6Q0j07
5264a42J8R1j74J00J36J03j30m4L21j96Kj88K03r4j61L37l07J06o8j02K62LK9
5287A05j66L38k85J12k92K04J48j41k64J82J71j1r0K4R0q2j26L7K80k70j68K05
5309AQ2q1j07J93j09J3q2J80l3j42l9K9J35j08O3j35J12J7P4n3Q4j9m1Q8J01r9
5335A24o4n9N0m7j6Mj25K66l13K94o9O6j01l8J40k10J33q1L1k71J15J48K97k79
5359en1J71j7j04j6rQ2Qq0J30p2oj13J75l0j27M8j23J60k2k7J33q5Lk5j01K03
$$ plain form
5386 100 0 -89 -51 229 -56 98 -237 193 -33 93 96 -65 -40 2 123 161 -22 -29 54 192 -80 154 -266
5409 -266 -27 -74 -100 72 -102 -49 35 3 -225 -129 -90 47 133 89 129 42 -89 34 -141 63 50 -104 155 -240
5433 -240 175 34 176 -20 143 -267 -153 66 13 -69 -177 28 -58 -202 -239 -176 86 -97 18 231 92 -46
5455 -46 51 171 84 125 91 180 64 119 49 47 -24 -145 28 -88 156 -3 -349 -59 100 -33 -87 -163 -12 -76 -17
5480 -17 124 66 -78 -276 -62 75 -126 48 64 -135 127 -61 -47 143 -162 -62 -222 9 11 -8 110 -130
5502 -130 52 -125 -200 8 -57 -101 -128 36 -191 -87 -105 -23 -8 -206 67 138 -214 30 79 374 100 -68 -54
5525 -54 137 37 109 -5 141 88 -177 180 122 15 -110 -3 -33 -101 -6 -117 58 -181 -289 -225 77 69 -211
5548 -211 74 -246 -207 89 25 37 -95 187 25 -36 -82 -153 -31 83 -218 94 57 13 -383 -46 13 81 -162
$$ packed form
5386A00j00q9L8K80k85J54l35M30k26J26Lj61K5M2J21L8j83pQ3J38k72K34m20
5409b66K39m7k6J72j74N3Q4l2k28R6L9J37Q6m4M0q7j31J23j75K04j3j54K59l95
5433b40M15j41J42j96J63m10J14K19n3q2j08K05q6j44l7O3K62j83J15K13j39j38
5455d6R7J20q7M1l4Q9j16N5p0kp1j21J73j16K44j59l46K90J59j33n4p6J51o4N9
5480a7J41n8j44j98K14J37k01J74J6j99K62j88J4J90l05J00j60K31Kj9J18k40
5502a30J82j77p5K08o5m4k7J64k27J04j8Q2J5j98K73P1l52K44M9K95k74j68J4
5525e4J91j00P2j14J46n3k65L57n8j07j25J07l0o8R5j11J75k39j08O4L02qk80
5548b11K85l20L9K96o4J2j32K82j62o1m6p1J22J14l01L12l7m4l96L37N9O8k43
$$ plain form
5571 -162 -13 -94 -257 -57 22 -82 -141 127 134 132 15 -12 9 104 20 9 159 -70 48 -105 92 71 8 128 12
5596 12 34 -5 -53 94 -119 -96 -32 -17 24 30 -155 -164 55 80 89 -23 -103 31 -64 188 137 -36 -25 36 -235 -80 16
5623 16 -20 94 -87 -132 -171 43 141 -151 99 216 71 -180 153 111 94 33 -83 -16 95 3 247 185 -50 70
5647 70 241 83 -127 -34 -19 -65 -182 -184 -74 110 -44 26 -37 146 139 -253 49 53 30 -79 -334 -204 -131 -68 43
5672 43 190 46 -119 44 21 137 -41 23 -4 17 158 -73 240 52 -299 42 70 -208 26 39 24 -19 11
5695 11 2 140 -89 -46 -112 12 4 88 -268 -39 -56 34 157 354 -18 4 289 39 -51 204 72 -1 -21 -19 137
5720 137 30 -133 -227 -70 -48 -223 -260 122 44 -75 32 174 -1 -218 -143 -240 -51 -194 -13 -92 36 137
5742 137 -31 221 169 -53 21 -71 166 -130 -33 52 -24 88 -12 -199 25 -41 -252 86 41 -91 -19 -105 125
$$ packed form
5571a62J49q1j63K00P9j04n9K68Pkj17k7K1R5q4j1J50k29J18j53J97k1o3J20j16
5596A2K2l9m8J47k13K3O4J5M1Oj85rK19K5Rj12q0J34r5K52n1j73J1O1k71J55R6
5623A6l6J14j81m5l9K14R8k92K50J17j45k51L33m2j7o1j16O7J11r2K44o2k35J20
5647G0J71j58k10R3J5m6j17kJ10J84j54P0o3J83pl92L02Mk3j09k55J30P3O3J11
5672D3J47j44j65J63k3J16j78O4k7K1J41k31L13j88l51L41K8k78K34J3j5m3L0
5695A1rJ38k29M3o6J24qQ4l56K29j7R0J23J97l72K2K85k50r0K55j32p3k0KJ56
5720A37j07j63r4J57K2j75l7L82p8j19J07J42j75k17P5r7J89j43J81p9J28J01
5742A37j68K52n2k22P4r2K37k96R7Q5p6J12j00j87K24o6k11L38m5j32P2q6K30
$$ plain form
5765 125 -79 -134 -18 130 195 67 -7 46 -135 28 60 38 -32 -41 -42 -81 55 -129 -139 -150 -230 -81 -165 189 -12
5790 -12 -132 -177 103 -228 -81 -5 40 -19 -8 -78 -83 40 -233 -93 98 -233 88 100 23 19 -126 193 44 17 -71
5815 -71 10 98 -257 -91 112 217 -30 -100 -19 -41 -224 -15 -33 58 -5 10 -61 -49 13 180 2 -12 28 30 112 -75
5841 -75 -138 -21 -356 153 22 30 16 -42 -10 -49 16 66 -182 -64 -127 -81 20 -169 -25 55 52 203 6 140 115
5866 115 41 186 8 128 92 53 -78 -21 -165 25 -8 -15 -147 52 -102 -174 -156 85 -128 -55 -78 -80 136 211 -52
5891 -52 96 82 95 65 129 -72 32 -80 91 0 -102 -33 -107 136 100 86 -393 134 -178 -123 -144 39 -139 -126
5915 -126 3 -16 87 -131 145 -123 175 -224 42 63 107 -158 94 -53 -95 -56 -20 19 154 -47 11 12 -63 -21
5939 -21 41 110 51 -50 -95 -253 -66 -8 155 -52 -287 -15 -46 135 26 49 44 -35 110 136 177 -6 -9 84 110 -41
$$ packed form
5765A25k04n5J16J48O5j28p4N3j81J63L2k2p0rjl9J36j84j0j1q0J49q4L54k01
5790a2j20m5K80l31J47P6M5n9J1p0nJ23k73J40J91l31L21J2p7mj45L19j49k7q8
5815g1Q1Q8l55J66K03J05k47p0Q1k2j83K09j8R1o3J5p1J2O2J67j78j4M0KQ2j87
5841g5o3J17l35N09j31Qj4n8L2l9O5N0k48J18o3M6J01j89J44Q0lJ51j97J34k5
5866A15p4J45j78J20l6l9j31N7j44J90l3pj32J99j54p2J8K41k13P3k3kK16P5k63
5891e2J48j4J3l0O4k01J04j12J71r1j02O9p4K43l6j4m79N27l12N5k1J83j78J3
5915a26J29j9J03k18K76k68K98l99K66K1M4k65K52j47m2L9L6L9J35k01N8Jp5M2
5939b1O2O9n9j01m5j58J87N8J63k07k35K72l1J81j09K3np9J45K6M1j83lR3K6j51
$$ plain form
5965 -41 -32 -146 -83 102 9 -216 -31 204 35 142 -33 -29 -38 -261 -77 142 196 103 177 -143 -120 -31 152 148 -8
5990 -8 34 -44 -84 -33 -40 -75 73 44 -17 197 -211 -79 -63 -3 59 15 -51 -10 228 -193 -22 310 -73 18 -15 38 85
6017 85 -171 182 68 -58 -16 -40 -57 30 -25 -12 244 53 -59 17 93 56 -191 -5 -67 -37 41 -138 -94 34 -191
6042 -191 -254 13 -126 -71 119 11 156 128 189 27 -61 83 -185 84 -19 -138 -111 64 -131 48 -90 49
6064 49 -68 -177 -108 -70 -15 -136 194 -119 -149 -40 -14 -97 -43 -94 3 81 158 -4 123 52 -132 -54 79 -49 271
6089 271 -128 81 66 -57 13 -218 -96 8 -130 115 -23 14 -330 -246 151 -69 -196 -251 78 95 17 -73 169
6112 169 8 -82 118 22 31 40 37 59 -65 -6 259 125 94 -55 -78 -15 -113 -102 118 52 -85 -100 43 55 64 -78 25
6139 25 -87 186 90 77 -41 1 -57 -191 47 -126 -127 235 61 58 -187 6 -85 -106 214 -150 68 73 -51 -127 -138
$$ packed form
5965d1Rj14O3J85r3k25J85K35j69J07j75Mrk23J84K19N4r3P4l20K3Q9J83mj56
5990hM2p8m0N1pl5J48k9o1K14m08J32J6O0O2m4o6M1K38m21J71L32l83R1l3N3M7
6017H5k56L53j14j26M2k4j7Q7n5J3K56j91j12P6P6l7k47J86o2L0P8j79M4J28k25
6042a91o3K67j39N5J90j08J45k8O1j62q8J44k68K69j03j19K7J75j95J79j38J39
6064D9j17j09O9L8N5j21L30l13l0J09K6q3N4n1R7P8P7j62J27p1j84P8J33j28L20
6089B71l99K09j5j23P0k31J22J04j38K45j38L7l44Q4L97k20j27n5L29J7p8r0K42
6112A69j61r0K00r6RRlK2j24N9K65j34l1j49k3O3r8J1K20o6j37j5J43J2Rj42J03
6139B5j12K73r6j3j18M2n8j34K38j73jL62j74lk45J93r1k1L20l64K18Nj24p6j1
$$ plain form
6164 -138 -46 -180 37 -22 -31 81 61 21 2 -91 -1 -39 111 -7 17 -7 1 55 15 42 -112 -161 -242 3 -168 174
6190 174 23 178 38 -176 1 78 103 -170 -242 -81 21 -88 114 102 -157 -169 71 113 170 -218 -95 -72 -179
6213 -179 -106 109 81 61 80 5 125 152 84 116 47 -188 -93 -179 -62 -44 -37 -75 155 -223 38 13 59 -45 166 -81
6239 -81 -49 -144 118 -11 -71 -103 -32 -137 -164 68 4 279 111 92 -131 -105 -116 47 -55 18 -30 -19 -184 -27 175
6264 175 -116 -34 -172 35 -46 -297 34 -37 -58 -2 2 146 -11 -126 -22 126 50 43 122 -138 -109 -58 9 -72 -57
6289 -57 -78 -142 -1 -7 15 10 84 3 11 106 19 61 143 76 100 -10 90 -37 -69 -56 -73 35 183 144 -121 66 27 -38
6317 -38 130 23 114 -103 91 62 -100 -8 -92 55 -169 -130 -63 -143 10 86 24 57 3 100 6 -47 83 -95 128
6342 128 113 -68 125 -192 125 -62 -49 56 -2 22 33 63 101 -104 -109 93 39 185 -147 89 192 -37 4 -161
$$ packed form
6164a38R2j34K17n9rJ12k0m0j9r3R0l8J50j18K4k4QN4m0K7j54m9q1K45j71L42
6190A74j51J55j40k14J77P7K5k73p2J61J02j09K02j2k59j2K40M2N7l88J23K3j07
6213a79P3K15k8k0J9p5J20K7o8L2o9k35R5q6J17J8Pl8K30l78K61k5M6j04K11k47
6239h1L2r5K62j29o0l2P1j05k7K32o4K75j68j9k23K6j1J63j02P3m8J1j65J57K02
6264A75k91Q2j38K07q1k51L31p1k1N6MJ44j57j15J04J48p6pP9k60K9N1O7q1J5
6289e7k1o4J41oK2nP4q1QR5q7M2Q2o7K4j10J00j27l2J3j7J08J48l9k65J87l9o5
6317c8J68j07R1k17J94k9j62R2q4J47k24L9O7q0J53P6o2L3n4R7r4n3J30j78K23
6342A28j5j81J93l17L17j87J3J05n8K4J1L0L8k05nK02n4J46l32K36J03k29M1j65
$$ plain form
6366 -161 30 2 -111 103 -52 -14 157 -6 -200 -31 69 -89 65 -84 -14 78 40 -67 -69 76 40 12 -22
6389 -22 -57 15 21 -151 48 62 60 -18 -38 125 39 -114 -230 110 21 97 -32 -181 -116 90 -44 22 -75 -32 147 -133
6415 -133 -200 49 77 34 -56 -38 -170 -37 220 124 -96 133 80 -83 142 60 94 -128 -50 3 -157 -28 2 -111
6439 -111 -24 -68 -212 140 -69 -165 46 90 -135 46 -3 -9 18 -146 -104 4 -35 8 83 -19 8 135 75 127 -50
6464 -50 -111 116 -167 -64 -60 -126 -84 -142 4 -16 -33 12 -59 148 -18 104 -34 -7 54 -158 -25 93 52 -54 -8
6489 -8 92 -63 -6 -101 195 -111 112 -163 -19 96 -192 -59 -62 87 89 -43 168 -134 -150 -62 208 -37 -45 -98
6513 -98 53 -32 9 24 -34 82 -33 -109 -16 95 183 45 -135 15 -4 -15 -6 -273 62 140 -38 174 164 -41 41
6538 41 -50 -78 -36 90 14 -119 129 -135 -19 -25 -130 18 96 -63 -77 124 136 -139 59 -42 -27 103 30 -8
$$ packed form
6366a61J91k8j13K14j55L8J71j63j94J69J00j58J54j49P0R2l8j07kJ45l6k8l4
6389b2l5P2Oj72J99J4kp8k0J63q6j53j16L40q9P6j29j49O5K06j34O6r7M3J79k80
6415a33o7K49K8m3r0J8j32J33K57r6k20K29n3j63K25q2L4k22P8N3j60J29L0j13
6439a11Q7m4j44L52k09r6K11M4k25J81m9oK7j64M2J08l9M3P5j02K7J27o0N2j77
6464e0o1K27k83J03Mo6M2n8J46k0j7M5p1K07j66J22j38K7O1k12J33J18m1j06M6
6489hJ00j55N7r5K96l06K23k75J44J15k88J33lJ49Kj32K11l02j6Q8K70k45qn3
6513i8J51q5M1J5n8J16j15p6R3J11Q8j38j80J50j9j1Rk67L35P8j78K12j0k05Q2
6538D1r1k8M2J26p6j33K48k64J16oj05J48P8j59j4K01J2k75J98j01J5J30p3l8
$$ plain form
6562 -8 89 50 117 -142 221 -93 -7 -159 18 83 12 -30 137 -42 -105 29 -87 6 -109 44 61 -38 -83 192 -149
6587 -149 13 -41 11 129 183 -1 213 -8 -38 -25 -125 -111 -81 -90 -31 -59 -77 -51 117 58 -153 -13 88 69 -163
6612 -163 76 61 88 13 132 -19 -26 59 65 5 -86 -12 76 -65 -64 -80 -88 -3 196 -130 209 56 48 -55 7 -44 55 49
6640 49 -4 -52 227 -55 19 91 -68 52 151 -111 -76 -153 -82 151 -72 -77 86 -211 -124 1 35 172 -49 -18 199
6665 199 -136 -81 122 35 -193 9 160 -186 -31 13 51 84 99 141 -265 -102 287 51 -152 -121 -160 -86 31
6688 31 50 69 -14 -243 31 -78 32 -104 -298 43 119 166 -125 -10 -59 -20 92 -68 27 81 183 84 70 -47
6712 -47 -61 -116 -60 57 92 232 71 146 -101 261 -67 90 -20 -67 -32 -14 119 -26 -154 126 -5 -233 48
6735 48 225 22 -211 -88 23 -4 202 109 82 -190 58 -111 -61 -137 -332 47 48 -10 145 -1 -29 -64 -169 121
$$ packed form
6562hR7l9O7k59L63l14Q6j52J77O5p1m2J67j79o3J34j16R3j15J53J7r9m5K75l41
6587a49J62n4N2J18N4j84K14k21l0J3j00J4L0rN9k8j8K6J68n9k11J40J01j9k32
6612a63K39j5K7p5J19j51pQ5Oo0r1P4Q8j41Jj6qQ5J99l26L39j53qj03O2n1R9o
6640D9n3m8K79k82P4P2j59J20R9k62L5p7P1K33k23nJ63k97Q7J25L4J37k21L1K17
6665A99l35N5K03q7k28K02J51l46J55M4L8L3J5M2m06J63L89k36k03L1l9P4J17
6688C1J9J9q3k29K74j09J10j36j94L41P6M7k91J15m9L9J12j60R5N4J02r9j4j17
6712d7j4n5N6J17L5J40j61P5k47L62l28J57j10m7L5J8J33j45j28K80j31k28K81
6735D8J77k03k33J23J11k7K06r3k7k72K48j69N0p6j95L79Jn8J55j46k8l5j05K90
$$ plain form
6759 121 255 -109 -11 -185 -169 -16 -77 4 -69 170 58 200 40 172 118 -51 -88 -88 -175 -81 -126 62 -23 -12 -288
6784 -288 -136 13 -119 46 -5 116 -2 61 41 -217 51 262 25 102 -32 96 -75 -249 19 -46 294 -63
6806 -63 55 131 -20 -55 -20 -160 -126 46 -121 -221 -43 35 -54 29 -95 -153 65 -93 -84 -130 62 19 68 -161 8
6831 8 -93 85 48 6 -42 -110 157 110 93 60 145 -29 -117 -116 -7 15 124 50 192 26 16 -14 -86 -162 35 -118
6857 -118 215 60 -203 9 171 12 63 73 194 -17 31 -107 72 53 -136 -179 3 -4 -72 -110 -60 48 77 176
6881 176 -129 -29 -92 11 23 -121 -20 122 69 17 -110 74 85 19 -173 -77 67 148 130 110 -52 -30 -13 73
6905 73 108 -62 -181 119 128 -30 -154 -110 -16 -56 86 6 201 -90 203 -30 -34 -43 1 -151 7 59 -34 -117 -56 44
6931 44 1 -26 36 8 -110 -121 -113 189 -173 -10 -51 48 -68 61 -210 98 -18 -315 75 -89 53 8 70 -169
$$ packed form
6759A21J34l64R8j74J6J53o1Q1p3K39j12J42j60J32n4j69l7%q7R4m5J88q5J1k76
6784b88J52J49j32J65n1J21j18O3k0k58K68K11k37P7j34J28j71j74K68o5L40l57
6806f3J18P6j51l5L5j40L4J72j67j00J78P8q9Q3j24n8K18j58Rm6J92m3M9k29J69
6831Hj01J78l7m2m8o8K67m7j7l3Q5j74q8JJ09K2J09p4J42j66j0l0p2p6J97j53
6857a18L33j55k63K12J62j59N1J0J21k11M8j38J79j9j89m3J82po8l8N0J08K9R9
6881A76l05J00o3J03J2j44J01J42n3n2j27J84J1o6j92R6J44Q1j8k0j62K2J7Q6
6905G3L5j70j19L00Rj58j24M4R4m0J42q0J95k91K93k33mrM4j52J58N2r3q3O1J00
6931D4m3k7O2k8j18j1QL02l62J63m1R9j16J29k71L08j16k97L90j64J42m5O2k39
$$ plain form
6955 -169 93 -38 112 74 -112 133 102 -98 -9 107 -43 4 72 -34 36 -129 -94 176 -89 153 37 -95
6977 -95 84 44 -1 -65 94 -167 148 -29 -28 110 -202 -36 196 -49 6 -152 -23 95 -99 23 85 -74 160
7000 160 93 145 120 -55 -155 135 -51 -16 -245 63 -75 14 -10 -153 126 -154 117 -141 -128 182 62 94 -111
7023 -111 6 19 -90 -78 69 183 137 92 40 -123 -83 -13 -244 -60 2 59 -22 -26 -42 189 -167 23 -37 12 -48
7048 -48 37 -33 -36 79 -7 -125 173 195 46 -79 -18 13 -32 -167 27 -31 -84 -98 33 -83 -69 -32 -27 -47 -42 -23 36
7075 36 46 118 192 -200 27 84 121 -244 -11 -73 7 155 137 82 -114 77 79 -135 20 -105 -106 -14 -63 -116 54 -73
7101 -73 172 49 77 -136 60 -16 -157 155 -60 -71 -48 -44 -48 70 58 9 -44 60 -15 225 101 45 -8 -120 -66
7126 -66 -23 38 -182 47 19 -31 -58 106 72 -268 -45 92 153 -7 -73 123 12 -44 -73 -16 106 -68 81 88 175
$$ packed form
6955a69K62j31J50l8j86K45l1k00Q9J16j50M7O8j06P0j65L5K70k65K42j16j32
6977i5J79m0m5o4J59k61L15j77JJ38l12J66K32k45N5j58J29J18j94J22O2j59K34
7000A60o7N2k5j75j00K90j86L5k29L08j38Q9k4j43K79k80K71k58J3L10j20L2k05
7023a11J17J3j09J2J47J14m6m5n2j63M0P0k31J84O2N7q1mj6K31l56J90o0M9o0
7048d8Q5p0lJ15q6j18K98K2j49j25O1L1m5j35J94n8n3j4J31j16J4L7Nk0NJ9N9
7075C6J0P2P4l92K27N7L7l65K33o2Q0J48j8n5j96J91Kk14J55j25jR2m9n3J70j27
7101g3K45j23K8k13J96p6j41L12k15j1K3MmJ18j2m9n3J04p5K40j24n6n3j12N4
7126f6M3O1k20K29k8n0k7J64l4l40K23J37O1j60o6J96j11n6k9N7J22j74J49PQ7
$$ plain form
7151 175 157 57 -118 119 84 -94 -36 72 -48 117 175 -139 -91 102 136 71 92 1 203 18 5 -69 -108 -67
7175 -67 228 14 256 -5 -26 -27 38 120 162 1 76 26 -67 33 -91 -100 -69 -96 -112 33 -192 -88 -108 -191 26 131
7201 131 -80 30 -39 98 -10 94 129 73 172 35 -167 25 -118 12 29 90 50 -159 -121 115 42 -81 31
7224 31 48 22 44 227 105 -13 -34 11 -65 -53 -12 -177 100 -112 153 -60 66 166 -6 30 -89 115 113 -43
7248 -43 5 29 33 15 -190 73 -49 16 -103 -21 -218 -268 -234 28 63 99 219 81 33 13 20 -148 -181 27 -87 -30
7274 -30 -109 9 51 67 175 5 60 194 149 151 43 -184 -62 -88 -12 -52 -65 9 -131 56 -1 138 -123 -34 213
7299 213 10 34 110 2 3 -29 -6 44 -73 -55 -52 50 126 23 -83 110 81 108 128 -73 -92 52 111 27 -151 -95
7325 -95 -56 -185 20 -32 -23 -98 171 -15 12 -57 86 -52 54 128 -12 48 -28 -30 199 11 -46 -227 -46 114 -48
$$ packed form
7151A75j8j00j75K37l5j78N8J08j20J65N8l14M8J93L4o5K1r1K02j85j3p4l9M1
7175f7K95k14K42k61k1jO5Q2M2j61P5n0r3J00j24rL1k7j6J45k25J04k0q3K17J05
7201A31k11J10o9J37j08J04L5n6R9j37k02J92j43J30J7O1m0k09L8K36p3j23J12
7224C1J7k6K2J83j22j18k1M5p6J2M1j65K77k12K65k13J26J00j72L6j19K04kj56
7248d3M8K4Mj8k05K63j22O5j19Q2j97n0L4K62L5L6J20j38m8k0Pj68l3K08j14N7
7274c0p9J18M2J6J08j70N5J34m5Kj08k27J22k6P6m0j3P4j40J87n7J39k61Q9K47
7299B13k03K4P6j08Jl2K3N0j17J8LJ02P6j03j06J93k9K7K0k01j9J44N9q4j78N6
7325i5L9j29K05n2Rp5K69j86K7o9J43j38J06P4j40O0p6kK29j88n7j81J81J60j62
$$ plain form
7350 -48 -162 61 44 71 -239 -220 0 -51 -27 -2 121 -92 72 94 38 -120 187 -78 -98 109 -44 0 124 -145
7374 -145 -93 -137 -53 211 52 -99 -114 131 53 -24 -106 198 30 -10 -20 -122 146 -125 49 120 6 9 -67 267
7398 267 13 16 -143 57 -107 117 87 -92 46 15 83 -3 59 52 61 4 -91 -109 -69 37 54 -159 -92 89 -136 233
7424 233 99 33 -113 122 -90 -38 -240 59 -8 14 -14 30 88 23 81 -18 166 -144 141 -155 171 -119 39
7447 39 112 -79 6 -49 -122 -72 21 -29 82 22 -69 36 39 -48 -25 37 11 -138 -23 -118 -50 -91 18 10 -80 66 -16 -110
7475 -110 -97 -20 -107 -77 25 -40 183 98 -167 2 59 -33 -97 -31 -169 134 -7 20 243 -103 49 50 119 -13 62
7500 62 -111 -203 33 -98 -29 -105 -120 -68 -182 12 -233 -113 -19 -147 115 5 83 -34 -19 7 125 -21 70 -56
7524 -56 -15 -244 -116 33 -92 0 -178 -154 190 80 -185 -117 88 -115 -322 147 155 -59 -105 -141 -111 124 123 155
$$ packed form
7350d8j14K23j7K7l10J9K20n1K4K5J23k13J64K2n6j58L07k65k0K07j53M4J24k69
7374a45N2m4Q4K64j59j51j5K45p8p7q2L04j68m0j0j02K68k71J74P1j14Lp6L34
7398B67k54Lj59K00j64K24l0j79J38l1O8q6O2pRn7r5j8M0J06J7k13O7J81k25L69
7424B33j34o6j46K35k12N2k02K99o7K2k8M4N8o5N8r9J84l10K85k96L26k90J58
7447C9P3j91Q5n5p3N0R3n0J11o0r1J05Lq7K3O2k6j49J15r5O8m1J09qr0J46q2r4
7475a10J3P7q7L0J02o5K23q5k65J69N7r2o4O6j38L03j41K7K23l46J52JO9j32P5
7500F2j73r2K36j31O9p6j5N2j14J94k45J20R4j28K62j10P8j17J5K6J18j46R1j26
7524e6M1k29J28J49j25R2j78K4L44j10k65O8K05k03k07M69Qk14m6l6L0K35jL2
$$ plain form
7548 155 22 -122 -148 184 -16 -163 23 49 -149 -87 -99 -85 21 -201 -255 30 57 -14 -13 -59 -69 -211 65 -40
7572 -40 65 -125 -89 -96 -302 -51 58 -17 -22 78 1 -212 -60 -169 67 71 -74 53 5 28 -160 39 -221 -20
7596 -20 -49 -116 -165 10 27 148 24 -285 -175 69 -6 55 47 -95 60 7 -37 -66 -175 -59 130 124 24 176 122
7621 122 111 -97 -20 70 -131 -175 1 5 11 174 -51 186 -118 90 201 285 -80 146 -48 -61 -76 50 45 24 -6
7646 -6 -81 -176 30 69 -104 93 75 -14 24 43 -124 -27 37 -62 133 27 86 38 -91 -202 -124 -174 63 -186 -58
7671 -58 174 159 -222 15 -190 -193 172 -158 88 36 187 116 37 84 179 -71 260 -37 -13 26 42 40 -99 130 136
7696 136 71 53 -52 -248 -173 -75 20 -3 8 119 -31 19 -45 140 -61 144 66 -79 45 -84 2 70 -18 -46 -123
7721 -123 -185 -78 43 22 208 54 -79 28 -44 21 205 129 -89 -2 -14 10 8 -150 33 145 125 -40 118 89
$$ packed form
7548A55j33j44k6L32k00j47J86K6j98O2j2J4J06k22n4K85K7p1Jm6j0j42K76j05
7572d0J05j90L6pk06K51J09p5nJ00p7k13J52j09K36Mj45J27m8K3j88J99k60K01
7596b0k9o7m9J75J7J21j24l09J10K44p5O1qj42J55n3m4k9j09J16J89oj00J52n4
7621A22j1k08P7R0k01m4J76MOJ63k25K37l04K08J11Q4l65K26j94j3j5J26nk1l0
7646fp5r5K06L9j73J97j8q9L8J9j67R7O4r9J95j06N9m8j29j11P8n0K37k49J28
7671e8K32j5l81K37k05lL65l30K46n2J51p1p9M7R5k50L31k97K4L9J6kj39K29O
7696A36o5j8j05j96P5R8R5k3J1J11j50N0o4J85k01K05p8j45J24j29Q6O8q8k8p7
7721a23o2J07J21k1J86j54j33J07p2O5J84p6k18Q7j2K4kj58J83J12k0j65J58k9
$$ plain form
7745 89 49 -158 -35 -190 -142 331 -38 74 -25 42 49 -120 -127 42 115 118 -80 -52 255 -37 131 181 205 -53 64
7770 64 79 -47 201 -77 96 -79 -96 43 91 50 210 228 -171 23 292 -196 -65 91 49 61 -79 117 120
7793 120 -69 -53 158 -79 -36 -71 -13 -83 265 60 -16 -86 -142 11 111 235 -90 40 -85 -123 5 -58 232
7816 232 -200 161 0 183 -69 7 -6 75 -42 -23 72 -141 -46 -109 59 -160 -114 -10 70 36 -31 -19 -171 73
7840 73 -120 68 20 10 -35 4 -47 81 -102 -81 -55 79 -87 -90 39 74 101 57 -121 58 -59 -57 -21 -99 -78 -110
7866 -110 23 -38 64 57 29 -76 -91 -23 43 -102 -249 -41 -140 31 -175 -43 128 27 -185 -250 -30 -262 -41
7889 -41 -97 -27 -44 196 -27 -128 109 117 31 -107 10 -38 -123 74 62 -156 -48 208 125 85 -4 -225 205 -6
7913 -6 59 -2 -26 44 145 -198 65 100 85 15 -14 40 37 -10 -130 27 -175 -78 25 -168 -158 123 2 19 11 -33 -103
$$ packed form
7745H9m0k07J23j55M8M73l69J12r9O7Pj69pJ69P3Lj98K8L07k92J68N0K4k58J17
7770F4J5j26K48k78J73j75j7J39M8m1J60J8l99J94K69m88J31J56m2J2j40J96L
7793A20j89J6K11k37M3l5N8p0L48k05p6p0n6J53J00J24l25J30j25l8J28o3K90
7816B32m32L61j61J83k52P6j3Q1j17J9R5k13R5o3J68k19M6J04Q0l4o7J2j52K44
7840G3j93J88m8j0m5L9n1J28j83K1K6J34j66lJ29L5K7m4j78J79j17KL6p8K1l2
7866a10J33o1J02pk8j05j5O8O6j45j47K08r9J71k06J32J71j01k12o5K20k32K21
7889d1n6P0j7K40k23j01K37Qq6j38J17m8q5J97j2k18J08K56q3m0q9k21M30k11
7913fO5o1k4P0J01l43K63L5j5p0k9N4lm7j20J57k02R7J03j93J0K81j21J7qm4p0
$$ plain form
7940 -103 -5 -14 76 -118 38 -230 159 107 -58 -56 83 -16 10 -23 -51 175 -6 -13 92 258 42 -75 26 46 -43
7965 -43 122 -46 -28 8 34 148 -68 55 42 -24 29 -94 -62 -34 -74 53 -8 -35 26 -111 65 -94 15 -86
7989 -86 -48 55 -56 -80 48 86 -159 103 -23 72 -10 -20 71 79 -81 344 -1 71 46 -91 82 154 -126 68
8013 68 -18 105 -33 -103 -56 -9 35 9 -148 96 -29 -24 166 -27 13 -69 96 5 -35 -149 -54 -131 197 45 16
8038 16 119 -146 -28 136 292 -143 33 13 89 82 -169 -73 187 -16 61 210 167 112 -51 0 115 10 55 190
8062 190 -5 -81 105 -7 -66 -108 -9 46 -66 -87 -129 -18 -100 -12 -8 -38 56 -95 -97 -147 41 9 -10 -161 0 102
8088 102 -170 122 52 -56 140 34 -76 19 -207 -34 -75 -24 119 -5 179 5 -9 109 85 65 -49 -73 -33
8111 -33 -127 31 8 32 108 -34 137 108 81 -187 -12 190 24 -31 68 -31 -140 102 125 -57 -5 121 61 119 -3
$$ packed form
7940a03R8rR0j94J56k68L89n2j65KJ39r9K6l3k8K26j81pJ05J66k16j17J01K0q9
7965d3J65j68J8L6K6J14k16J23j3o6N3j23L2K8m0J27o1k7O1j37J76j59J09j01
7989h6L8J03j11k4J28L8k45K62j26R5q2j0R1Qj60M25l45P2k5j37J73P2k80J94
8013F8q6J23j38p0M7M7M4k6j57K44j25NJ90j93M0q2J65r1m0j14R5p7L28j52k9
8038A6J03k65J18J64J56m35J76k0P6pk51R6K60k03P7J49m3n5j63N1J15j05M5J35
8062A90j95p6J86j12n9m2R9N5j12k1m2J11q2Q8Ml0R4j51kn0J88l2j9j51J61J02
8088A02k72K92p0j08J96j06j10R5k26J73m1N1J43j24J84j74j4J18k4k0j14k4M0
8111c3r4J58k3K4P6j42J71k9k7k68J75K02j66n5R9r9j09K42K3j82N2J26o0N8j22
$$ plain form
8136 -3 29 -18 33 68 -50 -106 54 24 17 -78 48 69 -75 14 -219 60 208 -44 120 70 -45 94 116 68 -141
8161 -141 165 -141 119 -67 -14 -63 -135 166 -12 -37 -47 -126 97 -2 59 69 -66 43 66 -84 -44 25 54 -190
8185 -190 115 75 -9 84 -42 -103
$$ packed form
8136cL2m7N1L5j18n6J60l0pr5J26K1j44Q9k33K79J48k52J64n0j15J39K2m8k09
8161a41L06l06K60j86N3m9p2L01j78k5j0p9K23r9O1J0j35J09K3j50M0O9K9k44
8185a90L05m0q4R3j26o1
8191a03
$$ Imaginary data points
##PAGE= N=2
##DATA TABLE= (X++(I..I)), XYDATA
$$ plain form
0 0 0 0 0 0 0 0 0 0 0 0 0 0 0 0 8 -8 8 -8 8 -13 16 -16 24 -24 29 -32 40 -44 50 -58 66 -75 85 -97 108 -122
36 -122 137 -151 170 -190 208 -232 258 -285 315 -347 382 -422 464 -511 563 -622 685 -757 837
55 837 -928 1033 -1155 1299 -1471 1681 -1944 2283 -2740 3385 -4373 6045 -9405 18673 -95445
70 -95445 -285523 53036 153420 -79492 -34919 131509 9938 -30356 39774 -6233 -16750
81 -16750 59481 21481 -62344 -26742 9083 -19123 5139 18087 1203 -15032 -15624 11670 8253
94 8253 2624 7505 -16549 -22606 -25387 -26863 -5023 35790 51176 -4683 -18481 16255 -6553
107 -6553 -7870 27371 19799 679 6038 -23790 -43799 44348 60104 -41323 -25346 24232 -30154
120 -30154 -45763 17309 21013 -26695 -5684 4656 -23617 17867 45796 13416 5374 9006 -16380
$$ packed form
0@%%%%%%%%%%%%%%Qj6J6j6J6k1K9l2M0m8N3o1P2q4R4j08J24j41J60j82K05k30
36a22K59k88L21l60L98m40M90n43O00o62P29q04Q86r75J074j185J307j442J594
55H37j765J961k188K454k770L152l625M227n023O125p758J0418j5450K8078j14118
70i5445j90078L38559J00384k32912M4573J66428j21571m0294P0130m6007j0517
81a6750P6231l8000q3825L5602L5825k8206K4262J2948j6884j6235n92K7294l417
94H253n629M881k4054o057k781j476K1840M0813J5386n5859j3798L4736k2808
107f553j317L5241p572j9120N359k9828k0009Q8147J5756j01427J5977M9578n4386
120c0154j5609O3072L704m7708K1011J0340k8273M1484K7929l2380q042L632k5386
$$ plain form
133 -16380 -38793 -8737 22872 4628 -18160 -10527 20494 11236 -17135 13627 37761 16031
145 16031 -13944 -32735 -19686 3533 6103 -12183 -7501 14343 -10098 -19643 16252 30914 21242
158 21242 -4524 -20951 -5086 2822 -11737 317 34109 57 -43339 -2959 14545 -7045
170 -7045 12540 15767 -19574 -13153 16391 -9106 -12889 36795 16814 -23824 -3336 1025 -11819
183 -11819 6394 15722 -7476 -4266 11732 -13671 -12747 21963 14324 -8450 -8844 -5979 -14037 -13146
197 -13146 3777 8764 7744 -584 -15794 -5980 19573 25957 -1302 -11514 12154 -6366 -34297
210 -34297 4256 35293 1556 -17363 10155 4187 -11132 16010 8709 -13937 7337 -1768 -41562
223 -41562 -14993 30751 -1732 -24221 17383 14019 -15656 1462 15963 6743 4505 -283 -14586
$$ packed form
133a6380k2413L0056L1609j8244k2788P633L1021r258k8371L0762K4134k1730
145A6031k9975j8791J3049K3219K570j8286M682K1844k4441r545L5895J4662r672
158B1242k5766j6427J5865P908j4559J2054L3792l4052m3396M0380J7504k1590
170g045J9585L227l5341O421K9544k5497l783M9684j9981m0638K0488M361j2844
183a1819J8213R328k3198L210J5998k5403R24L4710p639k2774l94K865q058Q91
197a3146J6923M987j020q328j5210R814K5553O384k7259j0212K3668j8520k7931
210c4297L8553L1037l3737j8919K7518n968j5319K7142p301k2646K1274r105l9794
223d1562K6569M5744l2483k2489M1604l364k9675J7118J4501r220k238m788j4303
$$ plain form
236 -14586 -5880 8768 -5002 1600 22811 6036 -15792 -9889 6356 11522 5519 -3230 -13810
249 -13810 -9527 -45 -4126 -3455 8742 12272 -10202 -19816 4606 8523 -4142 7144 9866 -11164
263 -11164 -10002 11986 4825 912 20311 -477 -22069 5441 11588 -15631 -6781 20172 4164
276 4164 -15281 -3852 1227 4785 9120 -4716 -5396 3283 -10763 -18534 5688 16516 -2420 -6217
290 -6217 -1906 -3044 7725 7880 -2882 5962 10084 -13124 -21146 8589 20002 -1156 -5222 4895
304 4895 2810 -6737 -2908 11840 7529 -6227 -8233 -7270 -3641 4701 1903 -8250 2883 11998
318 11998 -14430 -17805 14683 11491 -10365 -793 6362 -9170 -4208 12338 3342 3197 10481 -5587
332 -5587 -10431 4592 5991 708 4775 950 -8670 -2786 -816 -2985 10521 7756 -14577 -12774
$$ packed form
236a4586Q706J4648j3770O602K1211j6775k1828N903J6245N166o003q749j0580
249a3810M283R482m081O71J2197L530k2474r614K4422L917j2665J1286K722k1030
263a1164J162K1988p161l913J9399k0788k1592K7510O147k7219Q850K6953j6008
276D164j9445J1429N079L558M335j3836o80Q679j4046p771K4222J0828j8936l797
290f217M311j138J0769J55j0762Q844M122k3208q022K9735J1413k1158m066J0117
304D895k085r547L829J4748m311j3756k006R63L629Q342k798j0153J1133R115
318A1998k6428l375L2488l192k1856R572P155j5532M962J6546q996j45P284j6068
332e587m844J5023J399n283M067l825r620N884J970k169J3506k765k2333J803
$$ plain form
346 -12774 3136 -236 -6457 3768 5171 -5282 -5006 -938 1845 8425 9720 -117 -7858 2664
360 2664 6671 -7747 -2277 17515 5482 -17667 -3001 14039 -4609 -8176 10039 2513 -9677
373 -9677 -5046 -7038 -5334 12559 6643 -15520 -3474 9855 -6522 -5532 12729 8447 -3351 -4153
387 -4153 -3876 599 10478 3098 -4201 6349 -849 -14459 375 12600 364 -5446 2680 -1415
401 -1415 -6885 2236 4770 -1677 -1064 443 -6734 -9656 2432 8341 -1585 -2519 6343 2103 -6431
416 -6431 2667 9771 2175 1433 -2322 -15136 -3395 12269 -2757 -9940 9874 7881 -12477 -3155
430 -3155 11800 5365 4019 1714 -10073 -5105 4436 -4561 -4341 9796 -1369 -15473 2149 10976
444 10976 -2281 -1221 6580 841 -5118 -3732 -4386 800 9075 -1140 -11390 -111 7875 -1223
$$ packed form
346a2774J5910l372o221J0225J403j0453K76M068K783O580J295r837p741J0522
360B664M007j4418N470J9792j2033k3149J4666J7040j8648l567J8215p526j2190
373i677M631j992J704J7893n916k2163J2046J3329j6377R90J8261m282j1798q02
387d153K77M475R879p380p299J0550p198j3610J4834J2225j2236n810Q126m095
401a415n470R121K534o447O13J507p177k922J2088N909r926r34Q862m240q534
416f431R098P104p596p42l755j2814J1741J5664j5026p183J9814j993k0358R322
430c155J4955o435j346k305j1787M968R541q997K20J4137j1165j4104J7622Q827
444A0976j3257J060P801n739n959J386o54N186Q275j0215j0250J1279P986r098
$$ plain form
458 -1223 -3276 10994 11793 -6153 -8039 4771 4167 -2794 1801 3802 -4574 -4535 -2307 -5575 2996
473 2996 8832 -4892 -11174 -134 718 -4884 3313 5473 -3204 -888 113 -2980 6652 11434 -326
488 -326 -3457 3488 -644 -4590 2940 3303 1010 2396 -4965 -8652 3781 8796 -2389 -4857 2953
503 2953 -1577 -9072 -5766 1387 2844 -2575 -5221 -1402 1211 1705 4063 8175 8164 1140 -5395 -1382
519 -1382 8353 4650 -5445 -1119 3020 -5902 -8285 1997 6242 3749 -1114 -6932 -2668 4692 -3449
534 -3449 -5860 6213 1486 -11544 -4136 5332 -377 2093 7412 -1557 -1979 6171 -1465 -2959 10729
549 10729 6510 -9010 -3661 4665 -2176 -1819 5790 1314 -4783 -2606 -3636 -5308 1960 5914 -1605
564 -1605 -6635 -1055 2047 -958 1155 7025 3100 -3478 -2098 -1831 -255 6105 1859 -7335 -15
$$ packed form
458a223k053J4270P99j7946j886J2810o04o961M595K001q376L9K228l268Q571
473B996N836j3724o282J1040Q52n602Q197K160q677K316J001l093R632M782j1760
488c26l131O945m132l946P530L63k293J386p361l687J2433N015j1185k468P810
503B953m530p495L306P153J457n419k646L819K613M94K358M112j1p024o535M013
519a382R735l703j0095M326M139q922k383J0282M245k493m863n818M264P360q141
534c449k411J2073m727j3030P408R468n709K470N319q969m22Q150p636j494J3688
549A0729m219j5520N349Q326o841L57P609m476o097K177j030j672P268L954p519
564a605n030N580L102l005K113N870l925o578J380K67J576O360m246r194P320
$$ plain form
579 -15 5413 -6262 -4252 12845 6747 -7028 -751 2778 -3295 314 1824 -3913 520 793 -11310
594 -11310 -4367 11955 3273 -6589 3428 5243 -5920 -3094 5334 1983 -523 -721 -5665 -4696 1921
609 1921 2709 554 3072 3414 -3059 -4415 4931 7901 -1692 -4173 3282 439 -7696 -2001 5054 2232
625 2232 -159 -1913 -5283 -825 5358 -235 -3225 1902 -1508 -4943 -887 -16 1294 6196 690
640 690 -6297 510 5052 -1164 872 6050 389 -3379 -1467 -2273 1682 6706 -333 -4884 2196 908
656 908 -6389 -697 5579 -102 -5969 -4755 -467 1582 -457 -1049 2847 3607 -3440 -4497 3252 7095
672 7095 2668 -3150 -1480 2474 -850 -3327 2905 5735 -190 -2872 -1204 -1687 778 1695 -1742 832
688 832 1655 -7105 -6320 5862 3161 -5936 326 2878 -4340 -672 4010 -151 2115 4672 -3975 -5459
$$ packed form
579a5N428j1675K010J7097o098j3775O277L529o073L609J510n737M433K73j2103
594a1310O943J6322q682r862J0017J815j1163K826Q428l351k506j98m944R69O617
609A921P88k155K518L42o473j356R346K970r593k481P455k843q135N695P055k822
625B232k391j754l370M458O183n593k990N127l410l435M056Q71J310M902n506
640F90o987O807M542o216K036N178n661l768J912q06L955N024p039m551P080j288
656I08p297N692O276n681n867J214M288K049k039n92L896P60p047j057P749L843
672G095m427n818J670L954l324k477O232K830n925k682J668m83K465R17l437K574
688H32Q23q760P85J2182k701r097O262K552p218L668M682m161K266K557q647j484
$$ plain form
704 -5459 4946 4451 -1674 2231 3033 -3043 -2102 1816 821 1476 3092 -1436 -5379 -1733 1528 -1045
720 -1045 -2184 2064 2216 -5053 -4242 3230 2743 -333 553 -1102 -2039 1775 -272 -2955 5527 6690
736 6690 -6695 -4946 7474 3241 -3562 3126 4315 -2640 -2635 -1614 -1517 4219 2488 -6128 -2276 3563
752 3563 -3234 -4913 4038 4363 -3546 -3765 -512 626 968 0 232 2026 22 -2903 -614 4054
768 4054 4463 1063 -1911 -366 1649 -639 -546 2849 1192 -2100 -2160 -2720 -2080 2381 1893 -2881 -1439
785 -1439 -62 -3213 -887 2881 338 -160 862 -2660 -1368 4273 1124 -1737 4277 2866 -4930
800 -4930 -1530 5712 3147 -271 -1129 -1817 369 428 -4211 -1069 5382 290 -7047 -2614 2815 823
816 823 -1394 33 763 -289 -2255 -2331 2395 4719 394 -2952 -227 2476 494 -1543 2348 4709
$$ packed form
704e459J0405m95o125L905Q02o076R41L918r95O55J616m528l943L646L261k573
720a045j139M248J52p269Q11P472m87l076Q86j655r37L814k047k683Q482J163
736F690j3385J749J2420m233o803O688J189o955NJ021R7N736j731q616L852N839
752C563o797j679Q951L25p909k19L253J138L42r68K32J794k004k925K289M668
768D054M09l400k974J545K015k288R3L395j657l292o0n60O40M461m88m774J442
785a439J377l151K326L768k543m98J022l522J292N641l149k861O014j411p796
800d930L400P242k565l418q58o88K186N9m639L142O451n092p337M433N429j992
816H23k217J427P30j052j966p6M726K324m325l346K725K703j982k037L891K361
$$ plain form
832 4709 -1648 -4794 775 2368 -593 348 782 -1484 -506 -980 -2903 1755 4777 -2749 -5364 1355
848 1355 296 -3128 1568 2750 -1333 -68 343 -2381 1159 4924 57 -2229 854 -294 -2404
863 -2404 529 2598 1014 -154 -1387 -1698 1592 2718 96 -390 1606 495 -3737 -3290 2346 2779
879 2779 -2656 -4073 -60 601 -778 63 907 2192 1953 -3274 -3763 4323 4299 -3528 -1148 4137 -1183
896 -1183 -3770 1671 3139 1761 1429 -1903 -1819 2894 950 -3496 1446 3532 -4379 -5890 900 1629
912 1629 -1393 -702 -701 -841 -284 -1339 -648 3206 3080 -885 -1459 1262 2335 1187 980 1785 849 -1317
930 -1317 -1621 -647 699 1605 197 -2702 -1777 1323 -678 -2148 2342 1723 -3209 -3149 -658 -1245 515
947 515 1087 -2277 -631 2677 -1146 -1434 6097 5668 -1733 -963 2722 587 -611 152 -262 337 -952
$$ packed form
832D709o357l146N569J593k961R41M34k266R78m74j923M658L022p526k615O719
848A355j059l424M696J182m083J265M11k724L540L765m867k286L083j148k110
863b404K933K069j584j168j233l11L290J126k622m86J996j111m232M47N636M33
879B779n435j417M013O61j379Q41Q44J285k39n227m89Q086k4p827K380N285n320
896a183k587N441J468j378l32l332Q4M713j944m446M942K086p911j511O790P29
912A629l022O91Jj40N57j055O91L854j26l965n74K721J073j148k07Q05r36k166
930a317l04R74J346R06j408k899R25L100k001j470M490o19m932O0K491n87J760
947E15N72l364J646L308l823k88P531m29p401P70L685k135j198P63m14N99j289
$$ plain form
964 -952 -4812 -2578 3629 1910 -3223 -1012 2494 -865 -3766 -389 2923 1224 -2902 -3022 -129 1306
980 1306 475 -150 1513 3071 333 -2545 969 4605 1225 -1358 516 -46 -2264 -758 1106 350
996 350 419 -992 -3541 -1150 1782 -891 -1072 1463 -798 -2761 -63 1033 574 2355 1028 -2303
1012 -2303 -509 1418 -596 -465 1844 885 -1700 -1422 -223 1937 2767 564 -869 955 115 -2333
1028 -2333 -1252 2181 1381 -3191 -3855 -423 1079 -831 -504 2469 1779 -1531 -2241 342 2967 1726
1044 1726 -2455 -2207 1885 -62 -3594 906 4645 657 -1845 -275 1037 1648 1537 -596 -597 1570
1060 1570 -1678 -4184 844 3126 -1149 -1669 144 -1121 -1380 705 467 144 1250 -866 -2508 -160
1076 -160 2001 469 177 945 180 -911 364 1370 1080 1233 383 -1708 -1736 1303 1346 -1221 -157 1483
$$ packed form
964i52l860K234O207j719n133K211L506l359k901L377L312j699m126j20K893J435
980A306q31o25J663J558k738k878L514L636l380k583J874n62k218J506J864p56
996C50O9j411k549K391K932k673j81K535k261j963K698J096m59J781j327l331
1012b303J794J927k014J31K309r59k585K78J199K160Q30k203j433J824q40k448
1028b333J081L433q00m572o64L432J502j910L27K973o90l310p10K583K625j241
1044A726m181K48M092j947l532M500L739l988k502J570J312O11j11k133jK167
1060A570l248k506N028K282m275n20J813j265k59K085k38l23J106k116j642K348
1076a60K161j532k92P68p65j091J275J006k90J53q50k091k8L039M3k567J064J640
$$ plain form
1094 1483 -2094 -3421 750 1990 -826 -950 -546 -1260 -623 -275 -1047 1914 3290 -1901 -2675 3239 2623
1111 2623 -1332 854 2824 296 -1508 -934 -50 2200 1243 -2342 -1529 1268 -220 -2265 472 2079
1127 2079 -663 -2909 -2003 251 807 -71 -174 636 -23 -1203 -644 1279 1906 1133 -989 -442 1031
1144 1031 7 -300 1706 1689 -342 -809 -187 -433 1225 1000 -1575 -1288 168 -1629 -1813 636 947
1161 947 -228 -618 -1809 -973 2020 1215 -1122 1059 1776 -1744 -1479 1499 1705 858 331 -831 265
1178 265 1276 -305 -164 2540 1193 -2659 -1950 1218 519 -1492 -652 678 -289 -2220 -1302 1090 1806
1195 1806 185 -1545 -812 1002 298 -1444 812 3138 -143 -2374 576 1822 65 418 1559 -293
1211 -293 -522 242 -1295 -71 2469 -653 -3019 309 505 -1847 -156 1192 -629 -1123 -504 -1352 -477
$$ packed form
1094A483l577j327M171J240k816j24M04p14O37L48p72K961J376n191p74N914o16
1111B623l955K186J970k528j804N74Q84K250r57l585Q13K797j488k045K737J607
1127B079k742k246R06K254N56q78j03Q10o59j180N59J923O27p73k122N47J473
1144A031j024l07K006j7k031m67O22k46J658k25k575K87J456j797j84K449L11
1161I47j175l90j191Q36K993q05k337K181P17l520K65K978K06q47n27j162J096
1178B65J011j581J41K704j347l852P09L168o99k011Q40J330r67j931R18K392P16
1195A806j621j730P33J814p04j742K256K326l281k231K950J246j757L53J141j852
1211b93k29P64j537J224K540l122k366L328J96k352J691J348j821m94O19q48Q75
$$ plain form
1228 -477 2224 886 -1351 -301 1029 -182 -96 1174 1753 831 -575 -497 232 885 913 -21 -543 765
1246 765 -348 -2192 2 2386 -577 -2593 247 300 -1843 -421 973 320 -52 -957 -1747 1351 2514
1263 2514 -894 -917 2593 420 -2538 42 2068 1027 -159 -677 -622 589 572 -893 261 1786 -915
1280 -915 -2298 -254 943 -22 -672 -576 -123 -1006 -1284 -150 1069 734 -135 -620 -207 797 385 92
1298 92 875 863 -720 -855 142 742 678 889 -605 -1038 795 190 -973 800 1477 -940 -1643 -591 -305
1317 -305 231 211 -1386 -655 830 -733 -1868 1697 2416 -519 -838 720 564 162 182 429 881 191
1335 191 -1394 -795 1485 1317 -583 -636 954 123 -1759 -388 1482 524 -1854 -1398 -220 -388 -787
1352 -787 -20 153 599 -139 -1335 175 2590 718 -906 1233 1292 -908 59 1340 449 358 249 -1295
$$ packed form
1228d77K701j338k237J050J330j211Q6J270N79r22j406P8P29O53K8r34n22J308
1246G65j113j844K194K384k963k016K840N3k143J422J394o53l72r05p90L098J163
1263B514l408k3L510k173k958K580K026j041j186n18N5J211j7j465J154J525k701
1280i15j383K044J197r65o50R6M53q83k78J134J219l35q69m85M13J004m12k93
1298I2P83j2j583j35R97O00o4K11j494m33J833o05j163J773O77k417p03J052K86
1317c05N36k0j597P31J485j563j135L565P19k935l19J558j56m02K0K47M52o90
1335A91j585N99K280j68j900n3J590q31j882J371J870r58k378M56J178j68l99
1352g87P67J73M46p38j196J510K415j872j624K139N9k200R67J281q91r1j09j544
$$ plain form
1370 -1295 -1017 1082 167 -776 479 151 -1338 -660 -34 -136 493 165 -1303 -1078 498 -92 -698 568
1388 568 984 -120 -1014 452 1710 1461 284 451 644 132 -296 -276 400 1150 -736 -2469 -744 1034
1406 1034 -574 -1281 1005 509 -1220 -995 -151 304 804 -580 -1301 591 594 -1357 148 2283 473
1423 473 -984 467 1058 578 714 559 301 376 -786 -1347 263 1047 -666 -1024 -169 -390 -990 -457 485
1442 485 424 -89 -534 -586 -17 339 613 11 -156 551 -102 -878 573 1332 231 -94 -1 -416 403 1261
1462 1261 58 124 1319 -467 -1897 120 1353 -557 -993 -516 -756 -576 -546 -694 821 1485 -745
1479 -745 -1384 909 1217 -331 -161 1105 388 -816 -684 308 1200 440 -571 -5 930 249 -506 510
1497 510 1224 -21 -1746 -1169 444 72 -1141 -41 442 -832 -1096 -182 492 747 477 -657 21 643
$$ packed form
1370a295K78K099r15r43J255l28j489O78O26j02O29l28j468K25J576n90o06J266
1388E68M16j104q94J466J258k49j177J67J93n12m28K0O76P50j886j733J725J778
1406A034j608p07K286m96j729K25Q44M55N00j384p21J892Lj951J505K135j810
1423D73j457J451N91m80J36j55k58P5j162n61J610P84j713l58Q55k21o00N33R42
1442D85o1n13m45n2N69L56K74o02j67P07o53p76J451P59j101l25R3m15Q19Q58
1462A261j203O6J195j786j430K017J233j910m36M77k40J80L0j48J515O64k230
1479g45o39K293L08j548J70J266p17j204J32R92Q92p60j011N66R35o81p55J016
1497E10P14j245j725N77J613l72j213J100M83j274k64R14O74K55k70j134O78O22
$$ plain form
1515 643 -12 -272 1316 1133 -188 -5 150 -53 708 960 -242 -105 168 -699 -698 406 373 -55 -492 -986
1535 -986 -661 120 112 -644 82 450 -844 -1008 347 1316 330 -461 29 789 361 -185 626 1400 618 -744
1555 -744 -1136 294 949 -220 -956 674 464 -1716 -1385 1026 541 -754 -641 -436 -217 -37 -569 224
1573 224 1261 8 -1577 -30 1345 223 -76 1084 427 -319 -247 163 766 1081 41 -731 202 -22
1591 -22 -573 -220 502 -118 -1216 -898 -319 -133 87 59 -99 -392 -51 212 -172 293 1251 388 -1193 -5
1611 -5 800 111 312 460 141 370 -130 -764 285 1854 171 -1716 -155 482 -789 -990 313 288 -441
1630 -441 -995 -1033 393 979 -97 -405 910 336 -1102 -376 1610 957 -247 -388 418 335 -300 -64 870
1649 870 858 -423 -1074 -92 769 253 -666 -452 292 -523 -1341 -291 658 43 -831 -305 -359 -69 57 117
$$ packed form
1515F43o55k60J588j83j321J83J55k03P61K52j202J37K73q67JJ104l3m28m37m94
1535i86L25P81qp56P26L68j294j64J355R69r86p91M90P60m28n46Q11P74p82j362
1555g44l92J430O55j169p36J630k10k180L31K411m85j295J13K05K19J80n32P93
1573B24J037j253j585J547J375j122k99J160o57p46P2M10O03L15j040p72R33k24
1591b2n51L53P22o20j098L18N79J86K20k8j58k93L41K63l84M65R58q63j581J188
1611eQ05o89K01J48l19K29n00o34J049J569j683j887J561O37j271k01J303k5p29
1630d41n54l8J426N86j076l08J315n74j438P26J986o53j204j41Q06q3o35K36R34
1649H70j2j281o51R82Q61n16r19K14P44q15q18J050R49o15q74N26n4K90J26O0
$$ plain form
1669 117 388 733 -25 -406 294 709 717 671 -170 -473 105 152 -198 462 772 -482 -898 -233 29 134 -62
1690 -62 -530 -54 -12 -581 -982 614 1206 -478 -1131 141 554 -299 -341 971 1314 -177 -1108 -25 1174
1709 1174 817 -535 -166 663 112 -1061 -665 1192 678 -1172 -898 423 52 -668 -441 93 250 -498
1727 -498 -1239 -381 946 387 -729 442 808 -583 -249 1108 727 294 421 -303 -271 644 261 -165 382
1746 382 213 -543 -607 7 184 34 -362 -355 -730 -470 -156 -377 32 276 316 -979 -491 1260 664 -480
1766 -480 79 1014 294 -296 216 988 1228 86 -848 -96 979 -407 -1053 571 634 -1060 -1467 90
1784 90 589 123 -582 -364 369 -195 -1264 -323 1215 543 -1126 -378 985 473 -3 262 975 712 -438
1803 -438 -424 359 929 -81 -268 -162 -99 -303 -863 -319 613 118 -706 -354 184 -48 -9 171 -340 -65 -135
$$ packed form
1669A17K71L45p58l81P00M15Qm6q41l03N78M7l50O60L10j254m16O65K62J05j96
1690f2m68M76M2n69m01J596N92j684o53J272M13q53m2J312L43j491r31J083J199
1709A174l57j352L69Q29n51j173L96J857n14j850K74J321l71p20K27N34J57p48
1727d98p41Q58J327n59j116J171L66j391L34J357l81m33J27p24L2R15l83m26N47
1746C82j69p56o4O14J77j50l96Pl75K60L14k21M09K44M0j295M88J751n96j144
1766d80N59R35p20n90N12P72K40j142r34P52J075j386o46J624O3j694m07J557
1784I0M99m66p05K18P33n64j069R41J538o72j669P48J363n12m76K65P13k63j150
1803d38J4P83N70j010j87J06O3k04n60N44R32m95q24L52N38k32L9J80n11K75p0
$$ plain form
1824 -135 -516 -239 753 437 -142 -86 -181 453 484 223 246 1001 176 -1018 10 865 -146 -620 -179 -265 -235
1845 -235 -536 -407 476 541 -675 -1104 73 729 -232 -663 651 657 -631 -941 483 1109 182 -728 393
1864 393 684 159 -184 290 1103 316 -657 -618 799 312 -753 -326 276 -416 -892 -565 99 212 -63 -436
1884 -436 -106 393 -54 -208 642 445 -395 -298 150 37 165 624 131 -99 455 87 -75 190 604 181
1904 181 -11 -661 -161 190 -302 -481 -276 111 -387 -732 -216 572 434 -754 -599 725 385 -651 240
1923 240 1148 385 -636 -239 481 750 53 -610 515 720 -627 -908 996 672 -552 -693 -19 -231
1941 -231 -470 -653 -133 492 -233 -968 -304 557 53 -418 113 680 144 -395 280 749 534 -6 85 182 169
1962 169 -41 18 103 15 -178 -294 -368 110 116 -110 -337 -310 -369 -16 -354 -576 324 113 -560 -625 384 289 144
$$ packed form
1824a35l81K77R92l16n79N6r5O34L1k61K3P55q25j194J028Q55j011m74M41q6L0
1845b35l01J29Q83O5j216m29J177O56r61m31J314Oj288l10J424O26r27r10J121
1864C93K91n25l43M74Q13p87r73L9J417m87j065M27O02o92m76L27O64J13k75l73
1884d36L30M99m47j54Q50j97q40R7M48j13J28M59m93k30N54l68j62K65M14m23
1904A81j92o50N00L51m92j79K05L87m98l45N16P88j38j188J55J324l40j036Q91
1923B40R08p63j021L97P20K69o97o63J125K05j347k81J904l24j224j41O74k12
1941b31k39j83N20O25p25p35O64Q61n04m71N31N67n36n39O75M69k15n40R1R7j3
1962A69k10N9Q5q8j93j16p4M78Ok26k27K7n9L53l38k22R00k11o73o5J009r5j45
$$ plain form
1985 144 257 77 378 274 -157 -4 884 401 -689 -18 824 -47 -538 389 494 -66 -1081 -694 95
2004 95 264 -585 -525 348 33 -739 -538 449 822 -85 -687 406 672 -135 -289 816 903 -88 -468 171
2024 171 698 306 -129 -166 204 -173 -755 -362 471 -227 -599 -283 -470 -258 -85 -2 100 64 -266 -242 111
2045 111 252 439 317 272 -46 60 435 300 118 353 285 -421 -462 472 551 -173 -497 229 209 -550 -470 84
2067 84 565 -273 -769 -277 506 23 -378 231 646 308 -625 -34 735 553 -85 -15 603 460 -469 -322 929
2088 929 742 -663 -598 446 372 -317 -158 539 96 -508 -723 -4 195 -139 -316 -252 405 -203 -677 192
2108 192 475 461 -391 -58 303 91 322 342 211 43 -175 -158 -178 325 294 -227 -131 -242 -163 57 95 -480 -131
2131 -131 49 -762 -676 200 374 -421 -412 425 -99 -202 200 545 504 135 -492 40 923 300 -297 386 738
$$ packed form
1985A44J13j80L01j04m31J53Q88m83j090O71Q42q71m91R27J05n60j015L87P89
2004I5J69q49O0Q73l15p72K01R87L73r07o02J093K66q07j54J105Q7r91l80O39
2024A71N27l92m35l7L70l77n82L93Q33o98l72L16j87K12J73Q3J02l6l30K4L53
2045A11J41J87j22m5l18J06L75j35j82K35o8p06m1R34P9p24l24P26k0p59Q0N54
2067H4M81q38m96M92P83m83m01O09M15l38r33N91P69j82o38P0O18j43r29J47J251
2088I29j87j405O5J044p4o89J59O97m43o04k15P19J99l34j77O4O57o08m74Q69
2108A92K83j4q52L33L61k12K31K0j31j68k18J7k0N03l1n21R6j11P9K20L8n75L49
2131a31J80q11Q6Q76J74p95RQ37n24j03M02L45m1l69o27N32Q83o23n97O83L52
$$ plain form
2152 738 -166 -805 32 735 -113 -761 -293 219 -348 -737 -174 518 81 -711 -578 81 99 -442 -142 639
2172 639 352 -305 -17 739 738 75 -34 257 439 29 -147 168 541 0 -638 -260 -301 -236 -31 25 -129 -482
2194 -482 -269 -337 -185 41 144 18 -226 97 49 308 227 313 565 102 -161 190 596 579 -115 -259 179 288
2216 288 -235 -475 85 224 -350 -1035 -30 320 -443 -350 145 617 -409 -656 -38 876 -11 -355 423 505
2236 505 -5 -196 383 803 568 -426 -200 758 530 -408 -369 616 -40 -928 -318 214 34 -337 -280 162 192
2257 192 -76 -380 217 428 -282 -432 17 106 -77 19 190 21 -82 165 313 51 150 435 140 -262 96
2278 96 15 29 -200 104 116 -282 -496 -542 -11 202 -474 -564 255 -25 -533 -216 745 126 -449 -309 315 461
2300 461 9 -200 321 536 -86 -414 281 881 204 -551 145 583 -210 -536 91 567 -220 -872 -492 2
$$ packed form
2152G38r04o39Q37P03q48o48M68N12n67l89N63O92m37p92J33O59J8n41L00P81
2172F39k87o57K88P56jo63j09K91J82m10j76L15L73n41o38L78m1O5K05N6j54l53
2194d82K13o8J52K26J03j26k44L23m8K59q1Q6K52m63k63L51M06j7o94j44M38J09
2216B88n23k40N60J39n74o85J005L50p63R3M95M72j026k47O18R14q87l44P78Q2
2236E05n10j91N79M20k35r94K26R58k28r38L9R85o56q88O10N32j80l71N7M42L0
2257A92k68l04N97K11p10j50M49Q9j83R6J71j69j03K47J48k62R9K85k95m02L58
2278I6q1J4k29L04J2l98k14m6N31K13o76r0Q19k80n08L17R61o19n75J40O24J46
2300D61m52k09N21K15o22l28O95O00o77p55O96M38p93l26O27M76p87o52L80M94
$$ plain form
2320 2 -258 -378 -268 361 206 -327 -152 645 536 -417 59 324 63 -120 249 239 154 90 -17 -43 520 273
2342 273 70 262 -9 -434 -261 -76 -9 -142 -117 -435 -361 -222 127 164 -105 64 332 49 -208 74 543
2363 543 490 -146 -98 358 403 -117 238 645 129 -399 -499 425 280 -388 -368 221 155 -433 -502 203 450 -275
2385 -275 -779 180 465 -557 -347 632 568 -127 -360 439 749 357 -135 113 577 61 -424 132 637 -29
2405 -29 -206 -105 74 -219 -386 -229 238 30 -288 -314 -131 -39 -87 -359 -54 -46 0 56 442 372 147 203 19
2428 19 -143 315 247 55 -319 57 138 -203 -399 -116 142 5 -572 -318 121 -31 -468 -356 269 -113 -695
2449 -695 -201 479 131 -358 -10 533 339 -352 -170 632 313 -314 -252 545 426 -347 -245 505 370 -436
2469 -436 -468 -93 316 -310 -498 -154 69 -350 -552 -14 302 26 -434 -107 273 -18 -163 267 183 -8 -84
$$ packed form
2320Bk60j20J10O29j55n33J75P97j09r53M76K65k61j83L69j0q5o4j07k6N63k47
2342B73k03J92k71m25J73J85O7j33K5l18P4J39L49L7k69J69K68k83k57K82M69
2363E43n3o36M8M56M5n20L55M07n16n28j00R24j45o68K0N89o6n88o9P05K47p25
2385b75n04R59K85j022K10R79o4o95k33P99L10l92m92K48M64n16m85N56N05o66
2405b9j77J01J79k93j67J57M67k08l18k6J83R2m8k72L05QM6N6L86p0k25N6j84
2428A9j62M58o8j92l74L76Q1l41j96K83K58j37n77K54M39j52m37J12O25l82n82
2449f95M94O80l48m89L48N43j94o91J82Q02l19o27O2P97j19p73J02P50j35q06
2469d36l2L75M09o26j88L44K23m19k02N38L16k76m60L27L80k91j45M30q4j91p6
$$ plain form
2490 -84 163 291 351 318 120 145 13 15 97 -14 -127 -218 30 -260 -492 -110 173 -119 -439 174 321 -292 -383
2513 -383 144 585 -41 -563 281 373 273 -159 102 672 30 -417 131 633 155 -602 -59 280 -227 -478
2533 -478 -289 517 48 -570 -329 158 215 -231 -547 415 418 -689 -474 194 584 -236 -63 310 433 178 -42
2554 -42 492 520 42 -344 46 328 11 42 176 -42 -259 -283 -119 -75 62 -167 -75 -363 -252 43 -196 -188 -18
2577 -18 -25 143 -42 -36 148 426 186 -157 308 350 57 -12 502 290 -380 -80 26 540 -65 -409 87 145 -84
2600 -84 -666 -153 532 -232 -719 -71 325 72 -409 114 610 125 -400 -22 585 669 -129 -91 429 314 -464
2621 -464 -180 410 448 -387 -303 45 98 -174 -401 143 -79 -239 -399 -142 117 -62 -173 217 128 -136 -163 136
2643 136 183 214 246 186 -73 -77 423 168 -118 114 -43 -359 -251 -178 203 76 -405 -530 119 324 -400 -297
$$ packed form
2490h4K47J28O0l3j98K5j32KQ2j11j13r1K48k90k32L82K83k92l20O13J47o13r1
2513c83N27M41o26n22Q44R2j00m32K61N70o42m47N48N02m78p57N43L39n07k51
2533d78J89Q06m69o18K41M87N7m46l16R62Lj107K15O68L90q20J73L73J23k55k20
2554d2N34K8m78l86L90K82l17L1J34k18k17k4J64M4J37k29R2k88J11K95k39QJ70
2577a8pJ68j85OJ84K78k40l43M65M2k93o9N14k12o70L00J06N14o05l44M96N8k29
2600h4n82N13O85p64m87O48L96k53m81N23M96m85n25L78O07Q4p98L8N20j15p78
2621d64K84N90L8q35Q4L48N3k72k27N44k22j60j60K57K59j79j11L90q9k64k7K99
2643A36M7L1L2o0k59mN00k55k86K32j57l16J08P3L81j27m81j25O49K05p24J03
$$ plain form
2665 -297 164 165 -568 -550 277 252 -234 -313 326 410 -59 -367 337 448 272 -504 96 475 -155 -454 37 513
2687 513 -257 -675 -40 239 147 -433 -311 89 182 -433 -177 329 185 -105 -167 31 251 -216 -123 304 169
2708 169 59 -21 272 242 128 101 6 311 -180 -166 67 6 -296 24 -288 -261 -140 262 3 -232 134 231 -224
2731 -224 -169 128 426 257 -46 -102 -12 386 -81 -71 338 550 -183 -319 448 228 -365 -76 87 205 -201
2752 -201 -428 197 574 -216 -639 20 286 -416 -683 68 234 -165 -518 -114 536 -52 -137 -37 256 266 -159
2773 -159 100 334 198 -122 -98 160 127 -68 136 336 -29 -229 -175 -3 28 -215 -135 -345 -63 -250 -62 116
2795 116 102 67 93 134 -5 170 581 118 -176 110 293 -4 -166 159 449 20 -126 -1 283 174 -529
2816 -529 -400 186 -69 -488 -423 256 404 -296 -143 273 74 -256 -276 364 304 -163 -329 126 617 259 -77
$$ packed form
2665b97M61Jp33J8Q27k5m86p9O39Q4m69l08P04J11j76p76O00L79o30k99M91M76
2687E13p70m18O35K79r2n80J22M00R3o15K56N06j44k90o2J98K20m67R3M27j35
2708A69j10q0K93l0j14k7r5L05m91J4K33o1l02L20l12K7J21M02k59k35L66R7m55
2731b24N5K97K98j69l03n6R0L98m67J0M09K12p33j36P67k20n93K89J63J18m06
2752b01k27O25L77p90m23O59K66p02k67P51J66l99l53M04O50n88q5J00K93J0m25
2773a59K59K34j36l20K4K58l3j95K04K00l65k00N4J72L1k43Q0k10K82j87J88J78
2795A16j4l5K6M1j39J75M11m63k94K86J83k97j62L25K90m29j46J25K84j09p03
2816e29J29N86k55m19O5O79J48p00J53M16j99l30k0O40o0m67j66M55M91l58l36
$$ plain form
2837 -77 335 314 -65 -525 177 328 -228 -433 180 153 -77 -355 -78 261 8 -70 -394 208 -66 -229 -212 157
2859 157 -121 -142 189 64 179 217 86 -3 212 120 310 60 -66 88 4 52 -245 -98 282 46 -253 -118
2881 -118 84 -130 -397 32 194 -124 -400 -272 136 315 -79 68 235 332 -132 -92 644 430 -240 -191 362
2902 362 134 -535 -286 229 263 -135 -359 122 269 -392 -439 -39 159 -383 -469 45 258 -41 -50 320 419 155
2924 155 -38 276 240 104 -94 -86 125 66 3 85 136 -36 -245 28 -118 -156 -199 -151 -266 -231 154 -56 -176 115
2948 115 33 193 -90 -73 102 499 2 -94 234 440 32 -224 221 461 -81 -206 83 393 119 -123 -113
2969 -113 176 -40 -379 -185 186 18 -339 -114 236 40 -367 -365 179 -79 -360 -227 235 139 -67 -122 267
2990 267 240 -31 -277 390 468 9 -244 92 218 -391 -286 124 31 -155 -88 -81 73 112 -153 -165 -62 -186 -156
$$ packed form
2837g7M12k1l79m60P02J51n56k05O13k7k30k78K77L39k53p8l24O02k74j63J7L69
2859A57k78k1L31j25J15L8j31q9K15r2J90k50j26J54q4M8k97J47L80k36k99J35
2881a18K02k14k67M29J62l18k76J28M08J79l94J47J67R7m64M0P36k14o70M9N53
2902C62k28o69K49N15L4l98k24M81J47o61m7M00J98n42q6N14K13k99rL70R9k64
2924A55j93L14l6j36j98QK11n9o3Q2N1j72k09K73j46l8m3M8j15L5L85k10j20K91
2948A15q2J60k83J7J75L97m97r6L28K06m08k56M45K40n42j25K89L10k74k42J0
2969a13K89k16l39J94L71j68l57K25L50j96m07KN44k58k81J33M62r6k06n5L89
2990B67k7k71k46O67P8m59k53L36J26o09J05M10r3j86O7PJ54L9k65j2J03j24L0
$$ plain form
3013 -156 36 114 -48 -98 34 -75 46 380 215 -53 144 289 99 -125 213 187 181 101 -89 -25 211 -49
3035 -49 -442 -94 153 -77 -525 49 157 42 -283 -145 314 -71 -206 -58 455 295 -290 -221 514 296 -300
3056 -300 142 336 102 -105 -37 420 6 -167 -255 78 -51 -389 -413 161 -29 -234 -335 -23 -29 -142 -82 131
3078 131 203 -69 28 70 14 171 219 202 51 24 -12 202 -63 -184 -129 90 -10 -188 78 141 -69 -272 127
3101 127 -57 -5 -7 -27 -193 -154 -207 131 179 -46 -60 211 274 -172 -373 277 317 -118 -11 101 82 -297 -50 56
3125 56 325 -254 -417 -242 363 -111 -441 -39 247 -36 -707 -116 210 2 -171 122 259 114 -224 47
3145 47 394 246 -179 -45 165 391 -14 -74 82 143 -305 -7 31 -184 -160 -24 -83 -136 -141 -158 -87 -74 -92 -167 44
3170 44 -119 -80 202 159 -95 -46 132 36 -68 180 226 93 109 233 353 133 -67 -22 350 165 -379 -182 89
$$ packed form
3013a56J92P8j62n0J32j09J21L34j65k68J97J45j90k24L38k6oq0j90O4K36k60
3035d9l93L48K47k30m48N74J08j15l25J38M59l85j35J48N13j60n85O9P35k18n96
3056c00M42J94k34k07O8M57m14j73q8L33j29l38k4N74j90k05j01L12oj13O0K13
3078A31P2k72R7M2n6J57M8j7j51k7l6K14k65j21N5K19j00j78K66O3k10k03L99
3101A27j84N2kk0j66L9n3L38M8k25j4K71O3m46k01O50M0m35J07J12j9l79K47J06
3125E6K69n79j63J75O05m74l30M02K86k83o71N91L26k08j73K93J37j45l38K71
3145D7L47j48m25J34K10K26m05o0J56O1m48K98L8k15K4J36n9n3nj7P1J3j8p5K11
3170D4j63L9K82m3k54M9J78r6j04K48M6j33J6J24J20k20k00M5L72j85n44J97K71
$$ plain form
3193 89 53 -80 -329 57 109 -280 -528 54 418 -137 -376 50 278 -111 -226 236 438 182 -460 266 444
3214 444 -24 -135 192 124 -10 -263 -25 211 -113 -105 -244 39 13 -147 -157 32 13 -260 -121 271 104 165
3236 165 98 28 156 83 -1 152 131 51 88 183 39 -92 330 -33 -186 -261 -6 35 -131 -167 322 105 -378 -33
3260 -33 126 27 -457 45 261 18 -182 -69 308 317 -89 -179 48 209 -55 23 401 97 -82 -241 -184 -21
3282 -21 -72 -288 -132 117 -382 -434 -6 198 78 -168 -32 253 -61 -126 94 244 8 -199 4 157 114 219
3304 219 -10 160 192 -82 147 233 93 -50 174 -40 -282 67 -76 64 -63 32 -74 -212 71 -281 -106
3325 -106 20 -202 -181 7 38 -124 85 399 86 -274 143 418 72 -118 -16 347 252 -378 19 253 145
3346 145 -244 -96 79 79 -380 -453 272 -93 -402 -275 39 18 -37 -193 259 368 -24 -127 16 408 -60 -154
$$ packed form
3193H9l6j33k49L86N2l89k48N82L64n55k39M26K28l89j15M62K02k56o42P26J78
3214D44m68j11L27o8j34k53K38K36l24Qj39K83k6j60j0J89j9k73J39L92j67O1
3236A65o7p0J28p3q4J53k1q0L7R5j44j31M22l63j53p5K55M1j66l6M89k17m83L45
3260c3J59r9m84N02K16k43k00J13L77Rm06r0K27J61k64P8L78l04j79j59N7J63
3282b1n1k16J56K49m99n2M28K04j20k46J36K85l14o5K20J50k36k07K03J53m3J05
3304B19k29J70L2k74K29Q6j40j43K24k14k42L49j43J40j27R5j06j38K83l52J75
3325a06J26k22K1J88L1j62K09L14l13l60M17K75l46j90J02L63r5o30L97K34j08
3346A45l89J48J75%m59p3P25l65l09J27L14k1n5j56M52J09l92j03J43L92m68r4
$$ plain form
3368 -154 53 447 -122 38 305 18 -269 -232 -44 21 -49 30 -79 92 -184 -107 -103 44 40 -243 -34 -61 -80 48
3392 48 84 107 134 -57 252 145 71 179 239 147 -11 -7 138 89 -61 57 323 -253 -465 -86 214 -192 -279 -84
3416 -84 224 -96 -189 -63 286 300 -153 -420 331 -154 -290 -87 349 260 -276 -24 320 362 -121 122 40 213
3438 213 -211 -322 375 86 35 -423 268 170 -272 -302 336 -75 -170 -266 -164 116 76 -8 16 194 -98 16 154
3461 154 150 179 95 14 -17 -17 -47 -19 -87 -302 -52 128 -136 44 121 -194 -151 -247 7 -39 -84 -93 261 164 102 -257 156
3488 156 141 19 -148 63 114 31 -296 198 185 4 -77 190 45 64 -294 -42 95 96 -328 -158 11 -122 -365
3511 -365 -81 -21 -78 -203 13 186 250 147 -92 197 258 -16 -131 180 22 42 -171 192 77 33 -1 242
3533 242 -101 -40 -36 -149 142 6 -205 -93 -208 -134 36 158 27 -87 197 11 -46 31 236 28 -49 72
$$ packed form
3368a54K07L94n69J60K67k87k87L7J88O5p0P9j09J71k76P7MJ47mk83K09k7j9J28
3392D8L6K3K7j91L09j07p4J08O0r2j58MJ45m9j50J18K66n76k12L79L00m06q7J95
3416h4L08l20r3J26L49J4m53k67P51m85j36K03M36q9n36K52L44M2m83K43q2J73
3438B13m24j11O97k89n1m58O91r8m42l0O38m11r5r6J02K80m0q4K4J78k92J14J38
3461A54mK9q4q1l1%l0K8o8k15K50J80k64J80P7l15M3r6K54m6m5rL54r7o2l59M13
3488A56j5j22j67K11N1q3l27M94j3j81q1K67j45J9l58K52J37Jm24J70J69j33k43
3511c65K84O0n7j25K16J73O4j03k39K89O1k74j15L11j58K0k13L63j15m4l4K43
3533B42l43O1Mj13K91j36k11J12j15P4J70J22j31j14K84j86n7P7K05k08p7J21
$$ plain form
3555 72 170 174 59 -232 37 79 -265 72 134 -9 -66 -254 125 -62 -216 -107 10 267 -132 -187 -139 25 -119
3578 -119 32 158 238 140 -212 131 320 -43 -308 14 133 91 -39 -71 2 -211 -200 -116 56 47 11 -145 143
3601 143 71 -226 -102 67 144 -83 27 -52 -126 -19 203 118 21 155 308 -223 125 12 119 170 76 -97 49
3624 49 230 -176 71 88 -33 -220 -362 51 -82 -271 -106 -150 -77 -230 -170 69 287 -119 -163 83 155 -200
3646 -200 -170 366 406 139 -214 285 270 -100 48 1 230 -6 -104 -66 199 -47 -369 -55 57 -197 -152 22
3668 22 -8 60 -26 -56 77 46 -26 28 23 -48 -90 -54 154 -30 71 166 268 -87 -24 47 -192 -28 16 107 -106 32
3694 32 -92 -106 -44 -106 -102 -23 -53 -363 -106 123 -45 -92 -159 177 211 -47 25 290 26 -19 -118 223 128 -295 -217
3719 -217 250 147 -62 -96 157 224 -392 -287 79 11 17 -314 123 -28 123 -157 201 323 53 -212 91 239
$$ packed form
3555G2R8Mj15k91K69M2l44L37O2j43n7j88L79j87j54J09J17K57l99n5M8J64j44
3578a19J51J26Q0r8l52L43J89l63k65L22J19m2j30l2P3k13J1Q4J72rl6j56K88
3601A43p2k97J24J69P7k27J10p9p4J07K22q5r7J34J53n31L48j13J07N1r4j73J46
3624D9J81m06K47J7j21j87j42M13j33j89J65m4P3j53O0K39K18m06m4K46P2l55
3646b00L0N36M0k67l53M99j5l70J48m7K29k36r8L8K65k46l22L14J12k54M5J74
3668B2l0O8q6l0J33l1p2N4np1m2L6K08j84J01R5J02l55O3P1k39J64M4R1k13J38
3694C2j24j4O2o2MP9l0l10K57K29j68m7o7L36L4k58P2K65k64m5r9L41r5m23P8
3719b17M67j03k09l4K53O7o16J05L66o8Ol31M37j51J51k80L58J22k70k65L03J48
$$ plain form
3741 239 187 -237 205 178 204 62 123 238 23 72 -30 -49 -129 -111 39 -1 24 -101 -2 77 114 -102 177 45
3765 45 -13 -44 64 -76 -59 -135 41 177 29 34 332 31 -107 195 265 2 -227 -18 242 -98 32 -141 53
3788 53 -187 -196 -11 164 91 -296 -69 83 106 -164 -483 173 200 -121 3 282 298 -144 39 54 307 29 -153
3811 -153 153 -21 -158 -221 3 -81 -38 -353 23 15 -115 57 -9 -4 -102 17 82 70 -93 -103 -72 -24 -128 -43 21
3836 21 219 151 -181 -14 15 -48 -104 223 -136 -58 107 82 -90 -119 -119 11 -161 -210 -84 80 40 -203 30 390
3860 390 192 -341 100 159 87 -84 211 236 33 -59 163 -89 40 -20 -96 258 119 -358 -213 225 -189 -264
3882 -264 -179 121 -37 -320 -128 155 181 72 -16 198 -24 -10 2 113 30 -76 -151 -136 305 206 -75 141 154
3905 154 222 180 86 26 75 25 -15 -191 -30 -120 -142 -273 -149 -214 64 -73 -233 -73 129 -26 -51 98 77 189
$$ packed form
3741B39n2m24M42k7K6j42O1J15k15M9j02j9q0J8J50m0K5j25R9P9L7k16K79j32
3765D5n8l1J08j40J7p6J76J36j48NK98l01j38L02P0k63k29K09K60l40J30j73J94
3788E3k40rJ85J75p3l87K27J52K3k70l19O56K7l21J24K79J6m42J83J5K53k78j82
3811a53L06j74j37o3K24q4M3l15L76qj30J72o6Nr8J19O5j2j63j0L1M8j04Q5O4
3836B1J98o8l32J67K9o3n6L27l59P8J65k5j72k9%J30j72m9J26J64m0k43K33L60
3860C90j98n33M41N9p2j71K95K5k03r2K22k52J29o0p6L54j39m77J45M38m14p5
3882b64Q5L00j58k83J92K83K6j09q8K14k22J4J2J11q3j06p5J5M41r9k81K16J3
3905A54O8m2r4o0M9n0m0j76J61r0k2j31J24o5K78j37j60J60K02j55k5J49k1J12
$$ plain form
3929 189 223 67 147 83 60 86 193 213 -15 -134 110 -109 -152 -182 293 -100 -280 -141 -60 103 -165 -220 107
3952 107 113 -50 106 242 145 -101 79 387 2 -169 22 284 -104 191 165 159 24 -104 -57 155 32 -139
3974 -139 -26 -32 -150 -185 -30 -118 -36 -87 -87 210 25 16 87 109 53 1 233 228 113 87 137 153 107 -204 51 75 -103
4001 -103 -13 125 -140 -215 37 63 21 -118 -199 -148 52 -143 -133 24 267 -158 -77 200 190 -66 -203 124 213
4024 213 -68 -61 30 183 43 -11 92 154 77 -315 -61 276 -66 -78 -83 15 -198 -262 -135 83 6 22 150 147 139 -29
4050 -29 -3 120 -86 -93 10 162 15 -66 208 64 70 130 159 -77 -159 220 64 -130 -168 -188 96 -38 95 -128
4074 -128 59 47 -240 265 215 -15 -133 43 24 22 80 19 -24 311 25 -21 92 -44 -61 11 189 198 -323 -103
4098 -103 -60 38 44 -245 -86 178 8 -215 -109 152 142 -87 122 36 -2 -224 88 206 62 -120 -67 205 114
$$ packed form
3929A89L4j56Q0o4k3K6J07K0k28j19K44k19m3l0M75l93j80J39Q1J63k68n5L27
3952A07Oj63J56J36r7k46J80L08l85j71J91K62l88K95k6oj35j28M7K12j23j71
3974a39J13oj18l5J55q8Q2n1%K97j85rP1K2n6n2K32nj15k6N0J6m6l11K55K4j78
4001a03R0J38k65p5K52K6m2j39q1N1K00j95J0J57K43m25Q1K77j0k56j37L27Q9
4024B13k81PR1J53j40n4J03O2p7l92K54L37l42j2nR8k13o4J27K18p7J6J28lqj68
4050b9K6J23k06pJ03J52j47q1K74j44OO0K9k36q2L79j56j94l8k0K84j34J33k23
4074a28J87j2k87N05n0k30j18J76j9kN8o1m3L35k86m6J13j36j7P2J78Rn21K20
4098a03M3R8Ok89J59K64j70k23J06K61j0k29K09q6l8k22L12J18j44j82N3K72r1
$$ plain form
4121 114 -140 2 -111 10 97 131 163 8 -302 -105 190 -38 -326 -170 33 -168 66 31 -129 -103 46 39
4143 39 72 -186 -100 73 -14 -56 87 -15 148 -217 -149 61 291 -152 -77 3 -96 -180 -40 98 -20 -112 -109 -63 33
4168 33 -11 -132 292 42 -103 -267 -42 144 -154 12 136 -144 -76 -58 -83 -111 -135 -106 31 58 -46 -73 -139 -6
4192 -6 -269 4 134 61 -79 -47 -72 -72 -136 -103 35 45 26 -242 -89 36 -122 133 36 88 -6 98 135 11 31
4217 31 122 32 58 -68 152 -78 -19 -201 -169 -48 -50 -17 -130 63 -100 -291 41 50 -92 -187 36 20 -74 22 64
4242 64 256 98 -156 -23 362 178 44 52 31 117 -163 -188 288 23 -65 -77 -75 -24 -63 -166 -132 -75 -83 -193 -36
4267 -36 -75 -65 -25 136 213 -128 87 155 -3 122 69 -27 -15 172 23 -9 84 41 16 -167 7 -80 -249 -56 -269
4292 -269 -270 28 74 -111 -269 87 -24 -146 -160 158 23 -78 36 -130 174 -11 63 65 143 117 -105 -77 -29 51
$$ packed form
4121A14k54J42j13J21Q7L4L2j55l10J97K95k28k88J56K03k01K34l5j60K6J49p
4143C9L3k58Q6J73q7m2J43j02J63l65O8K10K30m43P5Q0r9q4J40J38j18r2LM6R6
4168C3m4j21M24k50j45j64K25J86k98J66J24k80O8J8k5k8k4K9J37K7j04k7o6J33
4192fk63K73J30p3j40L2k5%o4L3J38J0j9k68J53J25j58K55r7N2r4J04L7j24K0
4217C1R1r0K6j26K20k30N9j82L2J21kL3j13J93j63j91L32Rj42r5K23j6r4R6M2
4242F4J92j58k54J33L85j84j34Qk1Q6k80k5M76k65q8j2KN1l9j03L4N7qj10J57
4267c6l9J0M0J61P7l41K15O8j58J25n3r6J2J87j49l2R3m3k5j83J74q7j69J93k13
4292b69jK98M6j85j58L56j11j22j4L18j35j01J14j66L04j85P4KP8k6k22K8M8Q0
$$ plain form
4316 51 -6 -37 -88 11 -137 149 217 -14 -176 -46 44 71 -49 -163 95 78 -88 -29 364 207 -178 124 112 90
4340 90 -137 -119 -14 -11 -95 -152 92 15 -27 -242 -169 -130 -159 -93 -38 -84 -150 -149 -113 60 -2 -42 100 54 60 -64 20 88
4368 88 68 110 262 148 142 155 224 -224 34 70 -3 -122 -37 125 176 -55 -68 -8 -52 -181 -166 49 11 -233 -195 105
4394 105 142 -13 -116 54 61 123 -132 75 -46 113 -110 -81 251 172 -192 4 146 49 -115 38 43 90 -54
4417 -54 -127 -191 96 -8 -11 106 -43 -17 59 108 -94 13 56 40 -113 14 -16 -96 -118 -27 -59 16 -60 141 -77 147
4443 147 83 9 156 55 -235 1 168 -138 -181 -109 111 85 -38 -33 73 168 -28 -43 80 304 16 -160 54
4466 54 157 -97 64 237 141 -19 -87 227 65 -191 -152 -54 -54 100 -66 -190 -95 3 -178 -134 85 -25 -233
4489 -233 -36 33 -101 108 144 -54 -100 -13 57 -31 198 276 51 29 -42 64 7 -107 -132 -286 -39 0 -187 -72
$$ packed form
4316E1n7l1n1R9j48K86O8k31j62J30R0K7j20j14K58j7j66N9L93j57l85L02j2k2
4340I0k27J8J05Lq4n7K44p7m2k15P3L9k9O6N5m6o6JL6J73o2m0J42m6Oj24Q4O8
4368H8k0M2J52j14oJ3O9m48K58L6p3j19Q5J62N1k31j3O0m4j29J5K15l8k44L8L00
4394A05L7j55j03J70PO2k55K07j21J59k23K9L32p9l64J96J42r7j64J53NM7j44
4417e4p3o4K87j04lJ17j49K6P6M9k02J07M3j6j53J27l0q0k2R1l2P5p6K01k18K24
4443A47o4p4J47j01k90K36J67l06m3P2K20k6j23NJ06R5j96j5J23K24k88j76K14
4466E4J03k54J61J73r6j60o8L14j62k56L9R8%J54j66j24R5R8j81M4K19j10k08
4489b33J97O9j34K09L6j98m6Q7P0q8K29P8k25k2p1J06n7j14k5j54K47L9j87J15
$$ plain form
4513 -72 50 -32 -101 -180 -27 65 -144 -186 264 91 181 110 160 173 -177 -68 80 16 63 -70 147 108 108 -91 -7
4538 -7 35 106 -281 -10 -86 -56 -142 133 -22 -8 35 -39 36 -180 19 0 205 -1 -45 58 161 -99 7 -31 64
4563 64 55 23 176 58 68 -162 40 -27 201 -374 30 210 7 -196 42 15 4 -218 -65 241 64 3 66
4586 66 112 189 109 290 58 85 15 186 177 -99 53 113 29 -195 -112 -174 154 -60 -47 -62 -43 -34 -89 347 58 -59
4612 -59 -123 63 -55 -154 20 230 25 -274 -202 221 107 -114 -3 52 7 -135 -398 1 -166 -195 -35 63 170
4635 170 -40 -124 36 83 49 -110 9 14 -24 34 39 54 -5 63 129 -150 69 238 1 3 -12 -66 81 -152 115 -49
4661 -49 124 16 9 46 4 -199 -61 10 34 -291 -267 -8 157 -66 -180 70 88 166 -89 111 112 151 249 -2 231
4686 231 -64 41 -144 113 73 -113 14 244 141 -111 -107 19 81 -91 2 -46 75 -116 11 -88 180 -6
$$ packed form
4513g2J22q2o9p9J53R2k09m2M50j73R0p1N0J3l50J09J48o4M7j33K17l9%j99Q4
4538gM2P1l87K71p6L0q6K75j55J4M3p4P5k16J99j9K05k06m4J03J03k60J06l8R5
4563F4rl2J53j18J0k30K02o7K28n75M04J80k03k03K38k7j1k22J53L06j77o1O3
4586F6M6P7q0J81k32K7p0J71rk76J52O0q4k24Q3o2L28k14J3j5J9Rn5M36k89j17
4612e9o4J86j18r9J74K10k05k99P2M23j14k21J11N5m5j42k63L99j67k9J60R8J07
4635A70k10q4J60M7l4j59J19Nl8N8NJ5n9O8O6k79K19J69k37Kj5n4J47k33K67j64
4661d9J73j08pL7m2k03J38P1K4l25K4K59J65k23j14K50J8P8k55K00JL9R8k51K33
4686B31k95J05j85K57m0j86J27K30j03k52MJ26O2j72R3m8J21j91J27r9K68j86
$$ plain form
4708 -6 83 319 -40 -229 -23 -149 101 -73 -70 -12 -77 -162 68 13 155 142 -278 -38 -81 -111 147 114 -69 123
4732 123 74 -32 -42 165 -124 11 -141 89 24 67 20 -18 146 -89 8 17 -6 93 110 71 28 -14 31 -187 43
4757 43 96 -99 -100 17 -64 -64 -47 -39 -59 -102 -254 195 130 -110 -103 117 112 61 -227 -59 238 102 -163 -153 29 57 -86
4784 -86 -20 142 -63 -100 235 125 -121 -66 -188 98 9 34 -174 -101 -32 -10 54 180 98 -177 -125 84 90 -69 5
4809 5 181 -134 63 -122 -48 -75 2 10 -11 -130 -32 105 68 -31 -54 -23 7 -145 122 -118 3 -5 -79 -192 -10 -69
4835 -69 -198 55 131 -36 -71 148 257 9 -302 187 -64 -49 -39 108 92 39 -125 -66 -39 -95 -84 -25 93 27
4859 27 -189 -7 -101 -93 -115 -89 182 144 197 209 175 -91 66 -41 -123 88 -226 -44 249 -11 -99 65 58 -96 -106
4884 -106 -49 -75 -188 -90 -167 -72 118 -124 -105 3 -164 -80 49 14 227 -74 162 115 78 -19 9 171 -91 -81
$$ packed form
4708fQ9K36l59j89K06j26K50j74LN8o5q5K30n5J42j3m20K40m3l0K58l3j83J92
4732A23m9j06j0K07k89J35j52K30o5M3m7l8J64k35R7Rk3R9J7l9m3m2M5k18K30
4757D3N3j95jJ17q1%J7Qk0m3j52M49o5k40PK20nn1k88J68K97j36k65J0J82K8j43
4784h6O6J62k05l7L35j10k46N5j22K86q9K5k08P3O9K2O4J26q2k75N2K09Oj59P4
4809EJ76l15J97j85P4k7P7Qk1j19R8J37l7r9k3L1L0j52K67k40J21qp4j13J82n9
4835f9j29K53P6j67l5K19J09k48l11M89k51J5J0J47j6n3j64N9K7n6J1N9J18o6
4859B7k16J82r4Qk2K6K71l8N3J2l4k66J57j07q2K11l14J82K93k60q8J64pj54j0
4884a06N7k6j13R8p7R5J90k42J9J08j67Q4J29l5K13l01K36m7l7r7K8J62k62J0
$$ plain form
4908 -81 37 29 69 -50 1 93 -38 -161 84 112 -65 -44 267 -64 44 -115 55 -29 -86 -160 -64 17 -81 -70 -96
4933 -96 -10 2 -94 60 -10 -130 -193 68 264 37 212 -90 155 97 -74 92 -105 41 -182 35 98 76 22
4956 22 -53 -67 -69 -72 15 -34 9 47 -7 216 22 23 -117 -11 -107 -19 59 -81 -42 150 32 -127 -152 -116 -6 -131 70
4983 70 -69 -50 -4 -46 -176 95 86 -133 -133 98 -18 105 -166 36 173 55 -37 220 106 192 -25 141 -73
5006 -73 -193 37 -117 45 -293 21 -11 87 -21 20 197 -103 -196 -60 41 -39 76 -34 40 133 -32 23 154
5029 154 191 -129 104 103 -5 79 99 122 35 22 -95 -27 -225 -60 -92 -3 76 -135 211 42 192 -96 127 125 99
5054 99 2 -157 6 126 -55 -34 62 1 -174 -256 161 146 -46 -90 105 115 -87 -234 81 41 67 -76 57 -19
5078 -19 89 -95 -105 -87 -52 -1 -49 100 -107 16 -98 107 66 -151 252 78 144 99 48 69 77 92 83 -8 -92 13
$$ packed form
4908h1J18qM0j19N1R2j31j23K45K8j77K1L11l31J08j59J70q4n7p4R6Q1r8J1k6
4933i6Q6J2r6J54p0j20o3K61J96k27J75l02K45n8j71J66j97J46k23K17O3k2n4
4956B2p5j4klQ7m9M3L8n4K23j94Jj40J06r6Q8P8j40L9J92j18j59k5L6J10j25K01
4983G0j39J9M6m2j30K71rk19%K31j16J23k71K02J37j18r2K57j14Q6k17J66k14
5006g3j20K30j54J62l38L14l2R8j08M1J77l00r3J36J01q0J15j10P4R3j65N5J31
5029A54L7l20K33jj08Q4K0K3q7j3j17O8j98J65l2Q9P9k11L46j69J50k88K23kk6
5054I9r7j59J63J20j81K1R6o1j75q2M17j5j92m4J95J0k02j47L15m0K6j43J33p6
5078a9J08j84j0J8L5N1m8J49k07J23j14K05m1k17M03j74O6m5n1K1QJ5rr1q4J05
$$ plain form
5104 13 -16 193 -126 200 -52 -216 -130 44 150 -52 52 0 196 9 -78 -12 -111 -126 -155 27 -41 116 32 3
5128 3 48 -119 -145 121 -26 165 54 -163 75 37 -207 64 -49 -69 -57 -82 67 -125 -117 -116 43 175 -109 -106 -44
5153 -44 157 28 -3 88 99 38 33 -46 36 43 -299 100 -23 -67 -19 -41 -254 105 -192 -4 190 -14 -5 170 31
5178 31 -190 179 355 161 66 64 212 79 -120 35 89 64 -10 318 -41 65 -92 -115 -63 -18 -142 162 -162
5201 -162 14 -94 -99 63 -233 -37 169 10 304 -110 43 82 1 -8 15 86 137 10 2 110 -167 13 -47 147
5225 147 -55 -241 -115 25 136 -18 -1 52 -109 -97 -263 -7 47 36 34 22 -100 -44 83 182 9 -74 23 -76
5249 -76 5 23 102 240 -276 62 -3 127 -272 -283 90 -17 -38 -163 -53 57 -44 -16 11 24 48 -67 84 -96
5273 -96 -242 -32 -8 -47 -71 23 -53 108 -39 -35 164 -70 -74 -219 43 59 6 -158 -27 -46 -104 -168 48 173 13
$$ packed form
5104A3k9K09l19L26k52j64Q6J74J06k02J04n2J96j87q7O6r9j5k9J82o8J57q4k9
5128CM5j67k6K66j47J91j11k17K38l8k44K71j13k0J2k5J49j92QJJ59J32k84LO2
5153d4K01j29l1R1J1o1np9Q2Pl42L99j23m4M8k2k13L59k97J88J94k04RJ75j39
5178C1k21L69J76j94r5kJ48j33j99J55N4k5p4L28l59J06j57k3N2M5j24L04l24
5201a62J76j08nJ62k96J96K06j59K94m14J53L9q1rK3P1N1j27qJ08k77J80o0J94
5225A47k02j86J26J40J11j54J7N3j61J2j66K56N4j1kj2j22N6J27R9j73q3R7r9
5249g6Q1J8P9J38n16L38o5J30l99j1L73j07k1j25J10J10j01K8K7J3K4j15J51j80
5273i6j46K10K4l9k4R4p6J61j47MJ99k34mj45K62J6n3j64J31j9n8o4K16J25j60
$$ plain form
5298 13 -8 -157 9 7 -60 39 135 -41 -204 65 93 128 -64 66 55 209 -26 200 113 -49 69 -14 87 -65
5322 -65 8 89 86 -19 -150 186 142 -89 77 15 0 70 117 15 38 -83 67 -37 39 83 -38 -49 71 -149 -73
5347 -73 96 37 0 -166 84 51 -171 -79 -18 -174 -125 -107 -279 -146 -37 -60 151 -155 -17 -9 112 9 -57 -42
5371 -42 58 81 -29 -122 -15 104 -177 -38 222 3 -95 -77 197 104 -96 86 -28 26 16 -142 -55 121 -202
5394 -202 -89 97 378 -38 17 180 77 -206 37 12 155 87 242 43 -17 -29 -21 -12 -96 -176 -146 -3 40 1 1
5419 1 75 -82 -277 17 -219 -11 -63 -225 47 -89 9 -100 129 -138 -96 -109 -104 223 -169 -203 70 -23 -124 -120
5443 -120 130 29 -238 -146 280 -19 -105 -249 -53 -9 -94 -71 139 164 -106 -73 19 118 77 -52 120 -112 -29 4
5467 4 117 191 84 86 -80 166 -152 51 56 -65 -31 -76 -116 -42 -2 84 8 -86 119 20 91 148 -201 37 137 100
$$ packed form
5298A3k1j49J66ko7R9R6j76j63K69K8L5j92J30j1J54k35K26q7j62J18q3J01j52
5322f5P3Q1lj05j31L36m4k31J66o2j5P0M7j02K3j21J50j04P6M4j21j1J20k20P6
5347g3J69n9l7j66K50l3k22R2O1j56M9J8j72J33J09k3K11l06J38QJ21j03o6J5
5371d2J00K3j10r3J07J19k81J39K60k19r8J8K74r3k00J82j14N4j0j58Q7J76l23
5394b02J13J86K81m16N5J63j03k83K43k5J43o8J55j99o0j2QRq4q0L0J43M3l9%
5419AP4j57j95K94k36K08n2j62K72j36R8j09K29k67M2j3NL27l92l4K73r3j01M
5443a20K50j01k67R2M26k99q6j44J96M4q5K3K10K5k70L3R2R9m1j29J72k32Q3L3
5467DJ13P4j07Kj66K46l18K03Nj21L4m5m0P4M0Q6p6r4K05r9P1N7l49K38J00l7
$$ plain form
5493 100 -87 -164 191 172 60 65 85 64 41 198 149 134 -13 -118 78 -69 -241 221 327 50 -200 -101 210
5516 210 -227 -218 -205 28 -72 -45 -184 36 52 67 12 -120 146 -207 -146 116 73 -63 -108 -108 -161 51 163 45
5540 45 -30 -140 -145 -55 114 -113 46 242 -165 -133 -13 161 57 -98 7 37 -76 -132 45 37 -115 52 132 66
5564 66 -91 -158 43 120 35 -161 118 55 -248 -152 -84 104 -70 -25 -167 -81 72 -33 52 -59 -40 -108 -301 137
5588 137 -9 81 -42 96 -14 -133 71 366 -113 167 -44 61 37 -128 -141 289 -16 -48 129 60 -62 -274
5610 -274 -86 95 36 -201 -10 -185 -60 9 74 186 86 -215 72 58 47 80 6 -240 70 -21 -132 48 -111
5633 -111 36 59 117 -103 -9 11 107 65 -13 14 122 -91 36 -75 64 13 20 56 76 40 -59 10 -82 -113 75 -5
5659 -5 115 -39 -16 -19 -39 85 -14 21 89 -75 -44 -7 -67 116 -173 186 223 -64 -95 56 -67 159 -62 -232 77
$$ packed form
5493A00j87p7L55j9j12NK0k1k3J57m9j5j47j05J96j47j72M62J06k77k50R9L11
5516B10m37RJ3K33j00K7j39K20J6J5n5j32K66l53O1K62m3j36m5%n3K12J12j18
5540D5p5j10nR0J69k27J59J96m07L2J20J74j04j55J05L0j13n6J77qj52J67Q0o6
5564F6j57o7K01P7q5j96K79o3l03R6O8J88j74M5j42Q6J53j05Q5j11J9o8j93M38
5588A37j46R0j23J38j10j19K04K95m79K80k11J05k4j65j3M30l05l2J77o9j22k12
5610b74J88J81n9k37J91j75J25O9O5J12j00l01K87j4j1L3p4k46L10r1j11J80j59
5633a11J47K3N8k20R4K0R6m2p8K7J08k13J27j11J39n1PL6K0l6r9O9r2l1J88q0
5659eJ20j54K3lk0J24r9L5O8j64L1L7o0J83k89L59L7k87l1J51j23K26k21j70L09
$$ plain form
5684 77 122 -26 34 -138 87 251 17 -103 -18 178 74 10 12 -35 -43 158 -41 10 132 -33 -26 -161 -10 -4 28
5709 28 -109 -95 -1 177 -158 -102 -20 2 -17 67 6 32 22 -109 97 -9 -86 28 60 -101 -173 -109 257 -65 -205
5734 -205 318 186 -83 -118 -163 117 110 -34 319 93 -71 -90 228 259 -28 -191 -8 61 197 -72 0 -108 -13
5757 -13 -197 143 -176 -46 -52 -43 -20 -30 -94 46 4 82 -80 -154 57 -40 -27 -54 65 -124 14 -107 106 0 74
5782 74 171 61 45 37 72 -102 -76 24 93 78 -54 -68 141 -18 10 -36 -42 24 -203 -168 32 113 42 -16 -139 107
5808 107 -129 96 125 27 31 -92 39 125 -78 17 226 150 -147 -38 93 -94 -35 -70 -43 208 6 -84 -38 -37 -3
$$ packed form
5684G7M5j48O0j72K25J64k34j20Q5J96j04o4Km7qK01j99N1J22j65Pj35J51OL2
5709B8j37J4R4J78l35N6Q2K2j9Q4o1K6j0j31K06j06p7J14L2j61p2O4L66l22j40
5734b05N23j32k69l5m5K80pj44L53k26j64j9L18L1k87j63J83O9J36k69P2j08R5
5757a3j84L40l19J30oRK3j0o4J40m2P8j62p4K11r7J3k7J19j89J38j21K13j06P4
5782G4R7j10j6qL5j74K6J00O9j5j32j4K09j59K8m6oO6k27L5K00Q1p1n8j23K46
5808A07k36K25K9r8Mj23J31Q6k03R5K09p6k97J09J31j87N9l5K7K51k02r0M6JL4
$$ [...]
8191G
##END NTUPLES=NMR FID
##END=
