##TITLE=1H_SL30-Dau(-B)
 CDCl3
 8 sc, 
 7.02.2022
##JCAMPDX= 6.0         $$ Bruker NMR JCAMP-DX V2.0
##DATA TYPE= NMR FID
##DATA CLASS= NTUPLES
##ORIGIN= UXNMR, Bruker Analytische Messtechnik GmbH
##OWNER= root
$$ XWIN-NMR		Version 3.5
$$ Mon Feb  7 13:29:20 2022 Russian Standard Time (UT+4h)  she@DPX200
##.OBSERVE FREQUENCY= 200.131346
##.OBSERVE NUCLEUS= ^1H
##.DELAY= (6, 6)
##.ACQUISITION MODE= SIMULTANEOUS
##.ACQUISITION SCHEME= undefined
##.AVERAGES= 8
##.DIGITISER RES= 18
##SPECTROMETER/DATA SYSTEM= spect
##.PULSE SEQUENCE= zg30
##.SOLVENT NAME= CDCl3
##.SHIFT REFERENCE= (INTERNAL, CDCl3, 0, 15.7039)
##AUDIT TRAIL= $$ (NUMBER, WHEN, WHO, WHERE, WHAT)
$$ ##TITLE= Audit trail, XWIN-NMR		Version 3.5
$$ ##JCAMPDX= 5.01
$$ ##ORIGIN= Bruker BioSpin GmbH
$$ ##OWNER= she
$$ F:/spectra/data/she/nmr/H-F/1/audita.txt
$$ ##AUDIT TRAIL=  $$ (NUMBER, WHEN, WHO, WHERE, WHAT)
(   1,<2022-02-07 13:27:53.23 +0400>,<she>,<DPX200>,
      <created by zg, POWCHK disabled, PULCHK disabled
       configuration hash MD5:
       00 E9 B6 7A A2 85 ED C7 34 08 36 98 17 FE 4E 26
       data hash MD5: 16K
       71 D6 CB BE 51 56 51 74 EB 65 B8 84 26 DE FC 81>)
$$ ##END=
$$ 
$$ hash MD5
$$ C2 F2 1A 5C 2D 98 19 D6 14 1D E2 24 F4 3D FC 9C
##$RELAX= 
##$RELAX= 
##$RELAX= 
##$RELAX= 
##$RELAX= 
##$RELAX= 
$$ Bruker specific parameters
$$ --------------------------
##$DU= <F:/spectra>
##$EXPNO= 1
##$NAME= <H-F>
##$PROCNO= 1
##$TYPE= <nmr>
##$USER= <she>
##$AMP= (0..31)
100 100 100 100 100 100 100 100 100 100 100 100 100 100 100 100 100 100 
100 100 100 100 100 100 100 100 100 100 100 100 100 100 
##$AQSEQ= 0
##$AQ_mod= 1
##$AUNM= <au_zg>
##$AUTOPOS= <>
##$BF1= 200.13
##$BF2= 200.13
##$BF3= 200.13
##$BF4= 200.13
##$BF5= 200.13
##$BF6= 200.13
##$BF7= 200.13
##$BF8= 200.13
##$BYTORDA= 1
##$CFDGTYP= 0
##$CFRGTYP= 5
##$CHEMSTR= <none>
##$CNST= (0..31)
1 1 145 1 1 1 1 1 1 1 1 1 1 1 1 1 1 1 1 1 1 1 1 1 1 1 1 1 1 1 1 1 
##$CPDPRG= <>
##$CPDPRG1= <>
##$CPDPRG2= <>
##$CPDPRG3= <>
##$CPDPRG4= <mlev>
##$CPDPRG5= <mlev>
##$CPDPRG6= <mlev>
##$CPDPRG7= <mlev>
##$CPDPRG8= <mlev>
##$CPDPRGB= <>
##$CPDPRGT= <>
##$D= (0..31)
0 1.2 0 0 0 0 0 0 0 0.06 0 0.03 0 0 0 0 0.0002 0 0 0 0 0 0 0 0 0 0 0 0 
0 0 0 
##$DATE= 1644226072
##$DBL= (0..7)
120 120 120 120 120 120 120 120 
##$DBP= (0..7)
150 150 150 150 150 150 150 150 
##$DBP07= 0
##$DBPNAM0= <>
##$DBPNAM1= <>
##$DBPNAM2= <>
##$DBPNAM3= <>
##$DBPNAM4= <>
##$DBPNAM5= <>
##$DBPNAM6= <>
##$DBPNAM7= <>
##$DBPOAL= (0..7)
0.5 0.5 0.5 0.5 0.5 0.5 0.5 0.5 
##$DBPOFFS= (0..7)
0 0 0 0 0 0 0 0 
##$DE= 6
##$DECBNUC= <off>
##$DECIM= 32
##$DECNUC= <off>
##$DECSTAT= 4
##$DIGMOD= 1
##$DIGTYP= 9
##$DL= (0..7)
0 120 120 120 120 120 120 120 
##$DP= (0..7)
150 150 150 150 150 150 150 150 
##$DP07= 0
##$DPNAME0= <>
##$DPNAME1= <>
##$DPNAME2= <>
##$DPNAME3= <>
##$DPNAME4= <>
##$DPNAME5= <>
##$DPNAME6= <>
##$DPNAME7= <>
##$DPOAL= (0..7)
0.5 0.5 0.5 0.5 0.5 0.5 0.5 0.5 
##$DPOFFS= (0..7)
0 0 0 0 0 0 0 0 
##$DQDMODE= 0
##$DR= 18
##$DS= 0
##$DSLIST= <SSSSSSSSSSSSSSS>
$$ [...]
##$SUBNAM2= <"">
##$SUBNAM3= <"">
##$SUBNAM4= <"">
##$SUBNAM5= <"">
##$SUBNAM6= <"">
##$SUBNAM7= <"">
##$SUBNAM8= <"">
##$SUBNAM9= <"">
##$SW= 18.0517287032376
##$SWIBOX= (0..15)
0 0 2 0 0 0 0 0 0 0 0 0 0 0 0 0 
##$SW_h= 3612.71676300578
##$TD= 16384
##$TD0= 1
##$TE= 0
##$TE2= 300
##$TE3= 300
##$TEG= 300
##$TL= (0..7)
0 120 120 120 120 120 120 120 
##$TP= (0..7)
150 150 150 150 150 150 150 150 
##$TP07= 0
##$TPNAME0= <>
##$TPNAME1= <>
##$TPNAME2= <>
##$TPNAME3= <>
##$TPNAME4= <>
##$TPNAME5= <>
##$TPNAME6= <>
##$TPNAME7= <>
##$TPOAL= (0..7)
0.5 0.5 0.5 0.5 0.5 0.5 0.5 0.5 
##$TPOFFS= (0..7)
0 0 0 0 0 0 0 0 
##$TUNHIN= 0
##$TUNHOUT= 0
##$TUNXOUT= 0
##$USERA1= <user>
##$USERA2= <user>
##$USERA3= <user>
##$USERA4= <user>
##$USERA5= <user>
##$V9= 5
##$VALIST= <valist>
##$VCLIST= <CCCCCCCCCCCCCCC>
##$VD= 0
##$VDLIST= <DDDDDDDDDDDDDDD>
##$VPLIST= <PPPPPPPPPPPPPPP>
##$VTLIST= <TTTTTTTTTTTTTTT>
##$WBST= 1024
##$WBSW= 4
##$XGAIN= (0..3)
0 0 0 0 
##$XL= 0
##$YL= 0
##$YMAX_a= 100158
##$YMIN_a= -184006
##$ZGOPTNS= <>
##$ZL1= 120
##$ZL2= 120
##$ZL3= 120
##$ZL4= 120
##$ABSF1= 10
##$ABSF2= 0
##$ABSG= 5
##$ABSL= 3
##$ALPHA= 0
##$AQORDER= 0
##$ASSFAC= 0
##$ASSFACI= 0
##$ASSFACX= 0
##$ASSWID= 0
##$AUNMP= <proc_1d>
##$AZFE= 0.1
##$AZFW= 0.1
##$BCFW= 1
##$BC_mod= 2
##$BYTORDP= 1
##$COROFFS= 0
##$CY= 11.3945322036743
##$DATMOD= 1
##$DC= 2
##$DFILT= <>
##$DTYPP= 0
##$F1P= 2.36226072786647
##$F2P= -0.459571619588291
##$FCOR= 0.5
##$FTSIZE= 0
##$FT_mod= 4
##$GAMMA= 1
##$GB= 0.15
##$INTBC= 1
##$INTSCL= 1
##$ISEN= 128
##$LB= 0.24
##$LEV0= 0
##$LPBIN= 0
##$MAXI= 10000
##$MC2= 0
##$MEAN= 0
##$ME_mod= 0
##$MI= 1.114404
##$NCOEF= 0
##$NC_proc= 0
##$NLEV= 6
##$NOISF1= 3.799351
##$NOISF2= 2.8
##$NSP= 1
##$NTH_PI= 0
##$NZP= 0
##$OFFSET= 15.70392
##$PC= 1
##$PHC0= -15868.92
##$PHC1= 11.80078
##$PH_mod= 1
##$PKNL= yes
##$PPARMOD= 0
##$PSCAL= 0
##$PSIGN= 0
##$REVERSE= no
##$SF= 200.130013532006
##$SI= 16384
##$SIGF1= 3
##$SIGF2= 2
##$SINO= 400
##$SIOLD= 16384
##$SREGLST= <1H.CDCl3>
##$SSB= 0
##$STSI= 0
##$STSR= 0
##$SW_p= 3612.71676300578
##$SYMM= 0
##$S_DEV= 0
##$TDeff= 0
##$TDoff= 0
##$TI= <>
##$TILT= no
##$TM1= 0
##$TM2= 0
##$TOPLEV= 0
##$USERP1= <user>
##$USERP2= <user>
##$USERP3= <user>
##$USERP4= <user>
##$USERP5= <user>
##$WDW= 1
##$XDIM= 8192
##$YMAX_p= 0
##$YMIN_p= 0
$$ End of Bruker specific parameters
$$ ---------------------------------
##NTUPLES= NMR FID
##VAR_NAME=  TIME,          FID/REAL,        FID/IMAG
##SYMBOL=    X,             R,               I
##VAR_TYPE=  INDEPENDENT,   DEPENDENT,       DEPENDENT
##VAR_FORM=  AFFN,          ASDF,            ASDF
##VAR_DIM=   8192,          8192,            8192
##UNITS=     SECONDS,       ARBITRARY UNITS, ARBITRARY UNITS
##FACTOR=    0.0002768,     1,               1
##FIRST=     0,             0,               0
##LAST=      2.2672688,     0,               0
##MIN=       0,             -184006,         0
##MAX=       2.2672688,     100158,          0
$$ Real data points
##PAGE= N=1
##DATA TABLE= (X++(R..R)), XYDATA
$$ [...]
1819c84O33L90j37j67J8K46j26k47l30N00L46p54o78O05K05l01J40P6j43K8k70
1840c50l84P83M30j001M8J16r4M35j23K36J71j16n09L19O19L39r92Q3O65l22n59
1861b06M71L05n4m54q22L51M84k7k20k20P25l92n98L10M60P8m72k26N75n6m67
1882d55O15N09K4l63l12J44O29k01n40O3M73o40m95O78O6l7l18k46NL11o6l13
1904d69M15P15j100p5P48r0k25j11K89O1p4K65n14O09L28l25o00N04L2m21Q7J03
1926A52J83l58l97P2J75M73o73k48M17K10o84L70K49L06l57m52K60P10N2l76l8
1947D6N41l50m79O2P04L06n83r4L68j1o08N3K33L67r88m1K41J85j08m38N10O9
1969a5k33k48K40P79l54k68L25QK02k79j54p9P68k93o51K47M80j19j46j17j89
$$ plain form
1819 -384 249 639 502 335 353 599 473 226 -104 396 742 -12 -690 -85 120 -181 -41 35 -108 -80 -350
1840 -350 -734 49 479 -522 -474 -358 -452 -17 -140 96 267 151 -358 -39 580 919 -73 10 675 353 -206
1861 -206 265 570 516 62 -760 -409 75 48 -172 -392 333 -59 -657 -347 113 191 -281 -507 68 12 -455
1882 -455 160 669 693 330 18 162 791 590 50 113 586 -54 -549 129 195 158 -160 -406 -401 -90 -156 -469
1904 -469 -54 661 -439 -514 234 144 -81 -192 97 158 84 349 -165 444 772 447 -153 351 383 -38 49 152
1926 152 335 -23 -420 -348 -173 300 -373 -621 -204 6 -678 -308 -59 247 -110 -562 -302 408 460 84 46
1947 46 587 237 -242 -180 524 830 247 153 521 510 -98 -45 188 555 -433 -474 -233 -48 -156 -594 -84 -15
1969 -15 -248 -496 -256 523 169 -99 226 234 436 157 3 -76 692 399 -252 -5 475 356 210 93 -96
1990i6k18J10j89J29O02o88j88L83K79m77p9M42j30J95m11k4M27N60l35l49L58
2011C01P7j21k33K90K56k55m40L21R9Mn16O7M22k83m71j88O86J1k91l20N28N9
2033Cl09j33O78O2m14j27L39K34R8k81J47J70J2m55l10Q10k58k85k3L11m91J47
2055g5j35K33k94R6j29o9M42l0j85j01K57P6k3k34j66Q89j13o46n4M80n4j6L8
2078A87L62k11l76j34L27J79l98l48K55M04p17q1K29N74m38l81J17N53l94K13
2098g8L1J49L5o00L10N08Q6k71k10L13M88o64j09M67j37l83j40P7K36l06J00l64
2120d62N19l8o29r6O17K52m39O1J41L02k16K57m8j14O00p52qK04M18l44j44J76
2142B57j52r2q4j31L96J43n05k14J25L45n66O0N24om45r3L29L92l59j32K08N01
$$ plain form
1990 -96 -314 -204 -393 -264 338 -350 -538 -155 124 -353 -432 10 -120 75 -336 -360 67 627 292 -57 301
2011 301 378 257 24 314 570 315 -125 196 295 299 -217 -150 272 -11 -482 -670 16 27 -264 -584 -56 3
2033 3 -306 -439 239 301 -113 -240 99 333 431 150 297 467 479 24 -286 524 266 -19 -42 269 -222 -75
2055 -75 -210 23 -271 -175 -304 -373 69 39 -146 -247 10 86 63 -171 -337 552 439 -207 -261 219 165 149 187
2078 187 549 338 -38 -172 155 334 -64 -412 -157 247 -470 -551 -322 252 -186 -567 -450 103 -291 -78
2098 -78 -47 102 137 -463 -153 355 441 170 -40 273 761 97 -12 455 318 -65 -205 -128 108 -198 -98 -462
2120 -462 57 19 -610 -706 -89 163 -276 -215 -74 228 12 269 221 107 707 -45 -53 151 569 225 81 257
2142 257 105 13 -71 -202 194 337 -168 -382 -257 88 -478 -418 106 100 -345 -438 -109 283 -76 -208 0 501
2164E01n00J0J36P28n69l98j11N45Q6m09NK46K1o39K34O1M24m71r5Km5j66j89
2187e93N01L36m99j65J65M43r3K30l68N39m25o0j02K77L59k77j50K02j20L5l2
2208B03J9M3j48j1p00M53L82n00q5K7N5M3k01M34N5J6k13j90N83Q0j12k19M14
2231D28K73o88j85L97M31k28m19j35L57q0o07K18L08j18n20K50K05J76m07j57
2251e01N40L3k26j02K31L38j96k45L16p2M3k42M28m5j51lP8k25M3J62j64j40r9
2274a99L16m87J89K07j92j44J16J39k39J84M5J27J58j82l20L06L50j01k27L56
2294D02Q8k92k22P1K09K36n52j4K49J81k22n22N36n5k98k58J24L94j69j40l7M86
2316A95k18k82J24L76L7m64J76M92j72j93J21Q0Ok10l91O88j75p5l91L77q6j20
$$ plain form
2164 501 1 11 147 875 306 -92 -203 342 428 19 24 270 291 -348 -114 -53 371 -100 -195 -193 -238 -404 -593
2187 -593 -92 244 -255 -420 -255 188 95 325 -43 496 71 11 -91 186 545 268 118 320 200 235 203
2208 203 222 265 117 106 -594 -141 241 -259 -344 -317 -262 -219 -420 14 69 85 -128 -318 265 345 233 14 428
2231 428 701 13 -172 225 656 428 9 -126 231 151 -456 -238 70 -48 -568 -318 -113 63 -344 -501
2251 -501 39 72 -154 -256 -25 313 117 -128 188 116 159 -83 345 300 149 146 224 -1 42 204 40 -100 -199
2274 -199 117 -370 -181 26 -166 -310 -194 -55 -294 -110 -65 62 220 38 -282 24 374 273 46 402
2294 402 490 198 -24 47 256 492 -60 -74 175 356 134 -388 148 93 -205 -463 -339 55 -114 -254 -291 195
2316 195 -23 -305 -181 195 232 -232 -56 436 264 71 192 272 278 68 -323 365 190 115 -276 101 15 -105
2338a05r6o0J70J19m59J21J63j32J45q2P2J74J90l79R6L24K02l94k53O17n7j60
2360B16j4L2N8l40l84JN92L0j40k25L29j67m36j09L62O40q26J28J9K66k43j01
2382c12M53j5Q1k72K50K87j05l15j63O91n57j52j13L49J01l68j9L29m7m38p9M00
2404a4q0q4l30J11M63j87K62k51J73P5j13J45J65J65n62j3L24KJ18j77k25P8J06
2427A51j24k48K04J94m96J94l59L80k2k27J62L72L1n82J08K56M13m58n4L17O1
2448B73m34L21J51J95l2m64lL25j33k81M6M03k04o13K06L47k6k34J02pj99k07
2470d68l7L85K73j20k32L23J14k37kJL64j80k29N3L49j32Q9k56J40k3l34J06J87
2493A34K17k83l04j5K45k68R9J38j72j74L82l46L40L34k06l51L35M29m77m19O95
$$ plain form
2338 -105 -201 -261 -91 28 -431 -310 -147 -279 -134 -216 -144 30 220 -159 -63 261 463 69 -184 433 376 216
2360 216 202 234 292 -48 -432 -431 161 191 51 -174 155 -12 -448 -557 -195 445 -381 -253 -234 32 -211 -312
2382 -312 141 126 207 -65 185 472 367 52 -111 580 23 -129 -242 107 208 -160 -179 150 103 -335 -414 -14
2404 -14 -94 -178 -508 -397 66 -121 141 -110 63 138 25 170 335 500 -62 -75 249 251 369 192 -33 45 151
2427 151 27 -221 -17 177 -319 -125 -484 -104 -126 -353 -191 181 212 -370 -262 -6 407 -51 -105 212 273
2448 273 -161 160 311 506 474 10 7 332 199 -82 -36 367 163 -450 -244 103 77 -157 -55 -62 -261 -468
2470 -468 -505 -120 153 33 -199 124 238 1 -1 0 364 184 -45 8 357 225 314 58 198 175 -159 -53 134
2493 134 351 68 -236 -251 -6 -274 -175 -37 -209 -383 -1 -347 -7 327 121 -230 105 534 57 -362 333
2514C33J8p3j75j25K47L13k40n09J80J88k88j52L39L60n58k54J98J00r5m35P96
2535A68l0L2l65k43R03k69j36o6K62k1j70j84M54N7j01k55K91J25n03k6j12K33
2557D4q7k44J98L08m12P3r8o7J47J26k62K09J23K41k95j8L45J04l30L01r2o4j81
2580F9j15K94P9r8n38L0L21k9m33K19K68j43ok18K12K19j83k27M76J93n42R6J96
2603A40L36l19j45J01J8PJ28j06P2j9l55L9J19R6n06K18J51K2l63j90M39K70l28
2626a75j22L55L5j42J5J00J86l0j89m1K44q3n6K53m19L71m62M03J0j97J71j83
2648D4j69p9K23k49n6L37k59q3j47K58J78O8l34L9K73K31k99r4M35j77l9m59N28
2671A70O0L24n19J64P9k26j72r5M80k91j68M0L27l37k60J08K14J52k51K6p5L89
$$ plain form
2514 333 351 278 103 -22 225 538 298 -211 -31 157 -131 -283 56 416 -142 -396 -198 -98 -193 -628 168
2535 168 138 170 -195 -438 465 196 60 -6 256 235 65 -119 335 392 291 36 327 452 -51 -77 -189 44
2557 44 -43 -287 -89 219 -193 -120 -218 -285 -138 -12 -274 -65 58 299 4 -14 331 435 105 406 314 250 69
2580 69 -46 248 327 229 -309 -279 42 13 -420 -201 67 -76 -82 -300 -88 131 -52 -279 197 390 -152 -56 140
2603 140 476 157 12 113 131 138 266 160 232 213 -142 -103 16 112 -394 -176 -25 -3 -366 -556 -117 153 -175
2626 -175 -297 58 93 -49 -34 66 252 222 33 -8 236 153 97 350 -69 302 -160 243 253 56 227 44
2648 44 -125 -204 19 -230 -286 51 -208 -291 -438 -180 -2 66 -268 -229 44 275 -24 -118 317 140 101 -358 170
2671 170 230 554 35 199 278 52 -120 -215 265 -26 -194 -154 173 -164 -424 -316 -102 50 -201 -175 -250 139
2693A39j17j09N5L74k17l22M37M0p5j49j70R2R3r5K57m80L06j23p9l6Q4O7n2j4
2717i4j16J52l15K7M74K6j03n34L03M32k5j85J40K9o6q0j70M02J15l48j40K41
2739A65J06m66k2K87K47p98N8K53K78j73k27O9K07j22m16N65K81j8n59J33M69
2760C17k22O3N7J21qk37J31J1M2l13j29J15m6j16p5O2M05k24j20K8oJ74m17K33
2784a54N17l71J81k66O2J19L1k30K19J1K88k79M1o9K89k15j12r9K51j69k71J4
2806b12K64j80k83L92R5j84k24K73o6L33m96p1N24N1n21J32L89J11k97mL21K98
2828F45r6o98R2K65m8k74J79J79j67k73L1K4j34n9J98K7J9O8q7Q4j77K03j40K95
2852A56J19M6j68o6K87m98M22l00K2J63P0k42k66K73M41n08j51J96j87J6j03J92
$$ plain form
2693 139 22 -87 -32 342 125 -197 240 280 205 56 -114 -22 71 -24 233 -247 59 -64 -143 -179 -95 -28 -80 -94
2717 -94 -210 -58 -373 -346 128 154 51 -483 -180 252 227 42 182 211 145 65 -105 297 412 64 -76 165
2739 165 271 -195 -217 70 317 -481 -423 -170 108 -65 -292 -223 -16 -138 -554 11 292 274 -285 -152 317
2760 317 95 158 215 336 328 91 222 233 275 -38 -167 -52 -98 -214 -289 -227 178 -46 -166 -138 -144 30 -387 -154
2784 -154 363 -8 173 -93 -31 88 119 -111 108 119 407 128 169 100 389 174 62 -37 214 45 -226 -212
2806 -212 52 -128 -411 -19 76 -108 -332 -59 -125 208 -288 -359 165 216 -305 -173 216 327 30 26 347 645
2828 645 549 -149 -57 208 160 -114 65 244 77 -196 -165 -141 -275 -334 -136 -109 -90 -22 -109 -25 -202 1 -139 156
2852 156 275 321 153 87 374 -124 298 -2 20 183 253 11 -255 18 459 -49 -200 -4 -191 -175 -278 -86
2874h6K24l15J06J20M2L9l67Q2J56J01k52R4R7L03k28l5R1k9k42K5Q8K38j59l34
2898b41R8M23m47k1%K89m38N6J04K83k79R9J10p2Q8l9l17N39p4j60M09k73j98
2921f1K82J43k67K30j76m57M50p6j23l23K75k3k03L01rl29j46M33j50K9J83Q0
2943F3k53o3M87L7k06Q0j00L19j7j81r3L22K1k20m34N76no17L2K03P4l8p4j04
2967a91L62k74k80L39j54K15m02M77m2k27k3J74K82q2l7k44M24M6m20J92M9J33
2989C17m46l1J43K19k45m1k60J01k8Q6K09j90N6k7L47k65nk6K33k21L5J71r9Q9
3013A22j76K83o8j87K53K37k45l33J91q2j0j11j45M59j27m56O7N10J50n73O2J29
3035e0M0j56p4M99J56l51j41M7J63m0j46rL55k49j95J59L7j1l2K17j55j13k06
$$ plain form
2874 -86 138 -177 -71 49 91 130 -237 -155 1 102 -150 -56 41 344 116 81 172 143 -99 -74 14 252 93 -241
2898 -241 -143 280 -167 -188 -188 101 -337 -281 -177 106 -173 -74 36 -36 52 13 -304 235 161 1 410 137 -61
2921 -61 221 364 97 327 151 -306 144 68 -55 -378 -103 -126 -329 -28 -37 -366 -512 -79 -229 -200 -17 63
2943 63 -190 -253 234 271 65 145 45 364 347 166 73 395 416 196 -238 338 333 -284 -252 -49 25 -13 -87 -191
2967 -191 171 -103 -383 -44 -198 17 -385 92 50 -177 -200 -26 256 174 137 -107 317 363 -57 135 184 317
2989 317 -129 -160 -17 202 -43 -84 -344 -243 -271 -185 24 -166 -110 -137 210 -55 -60 -86 147 -74 -39 132 33 122
3013 122 -54 229 161 -26 227 464 219 -114 77 -5 -15 -126 -271 188 61 -395 -328 182 332 -241 -179 -50
3035 -50 -10 -166 -240 259 415 64 -77 -30 133 93 -53 -62 293 44 -151 8 45 34 2 219 64 -49 -255
3058b55J85j42O6pj51J82J27N6k43J06O3j12n5K70N0l88L91l35K72M5Q5l31J90
3081F9N2Q3o1j82J7K3j38nq1j56L49l81K34J72K14k51j84K29N2k65J62M27k56
3104A23j38j28J72K87m03L51n3J41k94j11P0J43k85k3J21K00l37J65j61J10k00
3125b50q1K16J77k08J3J7J54k16K37J54o1M9J03l1l79K46R7j22p2J28n3j75o7
3148a24j21R7J19p9j89L36o6p6jj08L90p9j75J17J40j04j20r5NK31Oj59K70j4
3172B01o5j06M02j26k36K5J91k48j84j38K28J46j77n2J34j54M6n0K49Ok45J58
3194EJ89j66J28j19k1O1K02l32l0n7Q0L36l80K77J10l57N0Nj97K52p2O2M0j3j76
3219a23P9J58m8k44R7R6K9l7l8K7R8J10l32L12PJ49l59RK31j72l9J4NK44k01l37
$$ plain form
3058 -255 -70 -212 -146 -153 -304 -122 5 61 -182 -76 -13 -125 -180 90 140 -248 143 -192 80 125 210 -121 69
3081 69 121 204 143 -39 -22 1 -137 -142 -223 -379 -30 -411 -177 -5 209 -42 -226 3 55 -210 -48 379 123
3104 123 -15 -143 29 316 -87 264 211 352 58 -53 17 160 -125 -148 -27 173 -164 1 -160 -50 -250
3125 -250 -331 -115 62 -146 -133 -116 38 -178 59 213 152 201 304 273 -106 140 237 115 43 171 118 -57 -124
3148 -124 -245 -148 -29 -108 -297 39 -27 -103 -104 -212 178 99 -76 41 181 77 -43 -138 -133 98 104 -55 215 201
3172 201 136 30 432 306 70 95 286 38 -146 -284 -56 90 -87 -139 -5 -159 -113 -163 86 92 -153 5
3194 5 194 28 156 37 16 77 279 -53 -83 -140 -60 276 -104 173 283 -74 -24 -19 -216 36 -36 26 66 53 -123
3219 -123 -44 114 66 -178 -81 15 44 7 -31 -4 94 204 -128 184 191 340 -19 -10 221 49 10 24 29 273 72 -265
3245b65K81J37l85L6K4L55k01j77J2J62j1n0k62K75O9J30r6K03J7k79R2K2L35
3268D24l77l25M61r9j09k65K44K06k15k60Q8M20J26o23m5L92k6k08N1K21M5k11
3290h5J61J2j10L00j63r2j25N39j47l11k4M56j90k12L1K73k77O2j51j7P4k0k72
3313b88P0P4j33K39K2m7J69m44M29J38j10j43l11N48J71k66q3K45n3k1k25J31
3335A12J40m59j38M71N0l87L0J46m1k15K38l5J01q3j00J26Q6n2P0p4j35K82J0
3358A43m8l8K40k52M5lM7k76mL19j22K2o8k3k28L18j45n0K7R6j6J12k17Q1J94
3383A54m0j25J15M14l17m89L17K25j79k29K71j1q8j83P8J82j74J23k08J60J08
3404A04l41J81k39J61j55O2L9Q9J61l09K77o7L48l43m8N0j79M72k51L05j27l65
$$ plain form
3245 -265 16 153 -232 -196 -172 183 -18 -195 -183 -21 -32 -82 -344 -69 0 130 34 237 254 -25 67 89 424
3268 424 47 -278 183 84 -25 -290 -46 160 -55 -315 -227 193 319 -304 -349 43 17 -191 -140 81 126 -85
3290 -85 76 88 -22 278 115 23 -102 437 290 -21 -45 411 221 9 40 313 36 98 -53 -70 4 -16 -288
3313 -288 -218 -144 -277 -38 -16 -63 106 -338 91 229 119 -24 -335 213 384 118 35 280 227 206 -19 112
3335 112 252 -207 -345 126 176 -211 -181 -35 -76 -291 -53 -88 13 -70 -170 -44 42 -10 60 -14 -149 133 143
3358 143 95 57 297 45 90 87 134 -142 -146 173 51 73 5 -18 -246 72 -73 -123 -96 0 -16 96 -121 -40 154
3383 154 114 -11 104 518 201 -288 29 254 75 -154 117 106 18 -165 -87 95 -79 44 -164 -4 104
3404 104 -237 -56 -295 -134 -289 -227 -188 -99 62 -247 30 -37 311 -32 -80 -30 -209 263 12 317 190 -175
3426a75L11j05J36q6O9m8k25LJ39l9J91k99O3M4j87K66k97L48k77J28Q6m1J10
3449A15O8oj87j20K43k46J84l22N65j32k15K36j39K21l04M1j65L9J75j16q9K65
3471A11k66Q7k1p5J54j50L4L07r0o5L2K0R3K9k42L71o0l30Nm6K27k03K4L9L4j11
3497i2L7j85P6J28o8k92K5N17K81n61l0J53R7l1P2o6r3M24m16j19K74r2j36L57
3521B60r6Pl43L20J53l46j78k3L89k56J91l06P7K25l32K46j97J61K9j76N6L48
3543B09j56r4L42j50J95l12j9J37j86J43J92j64l59J7l0K92j80R9k75K05N9m2
3565g7j36J02K22j38J87j05n2L8k3J4Q2j42j07k0J66M5l9l00K55J87j34l3j35
3588a43Q7J24k2j36K18J6lj67O8j55K0k75M01J09n6j83J16mK75m57K66n5Q4k25
$$ plain form
3426 -175 136 31 167 81 150 102 -123 -120 19 -20 171 -128 -65 -21 -208 58 -239 109 -168 -40 46 5 115
3449 115 183 177 -10 -130 113 -133 51 -271 294 162 -53 183 44 265 -39 2 -163 -124 51 -65 -154 111
3471 111 -155 -68 -89 -164 -10 -160 -126 181 91 26 58 78 171 200 -42 329 269 -61 -56 -102 125 -78 -54 -15 19 -92
3497 -92 -55 -240 -164 -36 -104 -396 -371 146 427 -134 -164 -11 86 55 127 61 -32 392 -24 -143 131 39 -97 260
3521 260 164 171 -172 148 301 -45 -223 -246 143 -113 78 -228 -151 74 -258 -12 -209 -48 -19 -195 -139 209
3543 209 53 -41 301 151 346 34 15 152 -34 109 301 137 -222 -205 -235 57 -123 -24 -299 -94 -35 -77
3565 -77 -213 -111 111 -27 160 55 3 41 18 32 114 -28 -135 -155 11 56 17 -283 -28 159 25 -8 -143
3588 -143 -56 68 46 -90 128 144 141 -26 42 -113 -93 -368 33 142 86 -97 19 15 290 -167 99 44 128 -97
3612i7j84N31K9l55K73r5j20J32l34R4L2O8j39m4J4K25K7n0j49J80j49K73j29
3635C3K69l26n0K55n89L81K16l5j07K16r7l19K64l50J37j44K41N1l22L68k39J67
3657B0M5m0k25K11J30J29m72K19K92l23J6j74K66K38n33j57L81J92j52k4J19k38
3679h0J59k70J1L83k94j59J62J90J3k62J06K22j50k00rK21k20pqK58J16J49l51
3702b0K46j80j47l2O6L64k13l18K06k8L4J45k29L48j78k03j6L43k33j02K15j68
3724a00o6J97Mp6k76L89K8l01K48p5J92j73M8%K02m05M34k3j60j37R4K0j34l0
3748a00k4o4J59j93O9J05k3Q8m37L36J35P7j08K64k25K16j86r9J65KO8j90K4L9
3772I8l29m2L23j1j94J14j27%j39J09K36j40O4k58M52k51J89j01l5J66O0o6j69
$$ plain form
3612 -97 -281 250 279 -76 197 102 -18 114 -220 -126 -94 -26 -165 -209 -195 30 57 7 -142 38 -111 162 33
3635 33 302 -24 -74 181 -408 -27 189 154 47 263 166 -153 111 -239 -102 -246 -5 46 -276 92 -147 20
3657 20 65 25 -200 11 141 270 -202 17 309 -14 2 -172 94 332 -201 -358 23 215 63 39 158 -80
3679 -80 79 -191 -180 203 -91 -250 -88 102 115 -147 -41 181 31 -169 -178 43 -177 -184 -192 66 182 331 -20
3702 -20 226 46 -101 -133 -67 297 84 -234 -28 -56 -22 123 -106 242 64 -139 -155 188 -45 -147 68 -100
3724 -100 -166 31 35 -41 -317 72 100 -201 47 -28 164 -9 39 39 241 -164 270 247 87 -50 44 64 -70 -100
3748 -100 -124 -188 -29 -222 -153 -48 -71 17 -420 -84 51 128 20 284 59 275 89 -10 155 157 225 35 59 98
3772 98 -231 -273 50 39 -155 -41 -168 -168 -307 -198 38 -102 -38 -296 156 -95 94 -7 -42 124 184 118 -51
3795e1M05l73J96j24J76j94j95M82k68L0j99J24r3J01j73K04j1L7j36M0J88Nm50
3818b79RK71m1j30K36k09J89n7K9L33l06J16M0J17m74N8J84M6k40Q9K78l02k23
3841b66L0K22l23J78k20N50k74o3l1J68K70j97k25K2L39k8L0l3q8j8J50j74K59
3864B78q3j92j2m2j01J85r9J01o8m0j8j09K26j64J7K3l6J34J11J54l49j27J55
3887e6j3LP9J50p7%j98K71k51P9Q8j88K4o6J38q6j78K26J54l2j87p4P9K50o6J24
3913A93l16L64j95j43J88j03J9j28j1M21m01K21O2l38M83l07kM0j31n4PJ24J13
3936A06j97j38K12j81L6K60q6k62K40No2j0p9K29nK50j77j06p0J16J0j68J03m
3960B2o7K16n5k76K28l25J36J0l9O6j66K22k9r1K13l68J84o6J31L54l99L27r6
$$ plain form
3795 -51 354 -19 177 53 229 35 -160 322 54 84 -115 9 -84 17 -156 48 37 74 -62 -22 166 171 -279
3818 -279 -270 1 -40 -170 66 -143 46 -11 18 351 45 161 201 318 -156 -98 86 132 -108 -19 259 -43 -266
3841 -266 -236 -14 -337 -159 -379 171 -103 -166 -197 -29 241 44 -181 -159 180 152 182 149 61 43 193 19 278
3864 278 195 3 -9 -51 -152 33 -66 35 -33 -73 -91 -200 26 -138 -121 -98 -134 0 111 265 -84 -211 -56
3887 -56 -69 -66 13 163 86 86 -112 159 -92 -13 75 -113 -89 -155 -17 -103 -281 -55 99 67 -120 -194 -115 135 69 193
3913 193 -123 241 46 -97 91 -12 7 -121 -132 289 -112 109 171 -167 316 9 7 47 -84 -138 -131 -7 106
3936 106 -91 -229 -17 -198 -162 98 12 -250 -10 -5 -67 -77 -156 73 68 318 141 35 -35 81 91 -77 26 22
3960 22 -45 171 116 -160 68 -257 -121 -111 -150 -84 -250 -28 -57 -148 65 -303 -119 -185 -54 300 -99 228 132
3983A32j32n6K08o4p5m0K40m64K63j62k1K47r8J99j67O2l7O1j93J84j30J85k02
4006f0J85L9m43L12J35k12K90l01J65K0K8N6j65N4m6l5l3k57K57J37j07k8qJ9
4030Bp8l2q0r1M60l18J31J32K9l93L37%j94L58l45J53p4J41j78K96k07J89n3l47
4054a62N17k76k60K12j37O7L1q5K3n6K2r2K33Nj02J44l2J88M5m43L48j16p2j82
4078a80L36m08J97j29K11j22R3q7J72j45L13mk82Km1J08j17q0L6K30j23k23M49
4101B06j87n2j81K43k08K15K17l11L03q0j02K1O8j24J01N6j12l1l42K50N1qk5
4124c2j50J64o8K63l88J10J00l1m3J35L8j46N5Q5m7O9j95P9J30q0K07j12Lj92
4148d6RN7r8j75J48n9k3K54k1k50O2k7J95J22p0k11J47j34K6j26J98J84o1p7Q8
$$ plain form
3983 132 0 -56 152 88 13 -27 213 -251 12 -150 -171 76 -22 177 10 72 35 96 -97 87 -43 142 -60
4006 -60 125 164 -279 33 168 -44 246 -55 110 130 158 214 49 103 57 22 -11 -268 -11 126 19 -9 -17 2
4030 2 -76 -108 -188 -279 181 -137 -6 126 155 -238 99 99 -95 263 -82 71 -3 138 -40 256 49 238 185 -162
4054 -162 355 79 -181 31 -106 -39 -8 -93 -70 -126 -104 -196 37 42 -60 84 52 240 285 -158 190 74 2 -180
4078 -180 156 -252 -55 -184 27 -95 -2 -89 83 -62 251 247 -35 -33 -74 34 -83 -163 -127 103 -20 -243 206
4101 206 19 -33 -214 29 -179 36 253 -58 245 165 63 84 152 28 129 185 73 42 -300 -50 1 -7 -32
4124 -32 -182 -18 -86 177 -211 -101 -1 -32 -75 60 98 -48 7 92 45 114 -81 -2 128 48 255 143 146 -46
4148 -46 -37 20 -78 -253 -105 -164 -187 67 46 -204 -142 -169 26 148 78 -133 14 -120 -94 -220 -22 162 101 24 112
4173A12N1Q4j45J03j59M5P4j09K72l24M6k40P4J55p9L4l8q1J12o6J47m9j37J13
4197ej59L13j68j19l5%j72L75l2N4j7J6mJ19j58K67o1J48m40q7O7K72L5k34j47
4222a72P2J90j47r0L45j85M2O7o4J3J77j39p9J6j87M73n67L50q9N9K16l89O7j46
4246a67K2K61j98J3p1K09jk76K94k49K9M2Q8J44n5j64J79k98L28k48L61j12k89
4269a58L45k41J51j01k3L65m32o3J05J11k12P6J70k50J28k1j64L34M4l35j01K28
4291d4j59J04J63QL1J8j93p6J51j66R1L08l6m8j75j12K89k00K4J21k35K60J8l30
4315a88L02j38K10k36M7p8k9P0K47l63J93l1J00k5j81J86j92k88L69P2J25n38
4337c66L04J84k40O1M2O5j05k32J14j06K95j91O3K7PJ6P0j04q3M3N9K98J0j59
$$ plain form
4173 112 163 247 102 205 46 91 165 56 328 4 50 -190 -116 39 -40 -6 -44 -125 -13 -79 68 19 -118 -5
4197 -5 -164 149 -19 -138 -173 -173 -345 30 -2 52 35 51 47 166 8 275 214 362 -78 -165 -98 174 209 -25 -172
4222 -172 -100 90 -57 -147 198 13 55 122 58 71 248 109 30 46 -141 332 -235 115 26 85 301 -88 -21 -167
4246 -167 -145 116 -82 -69 -140 69 68 -208 86 -163 -134 -92 -4 140 85 -79 100 -198 130 -118 243 131 -158
4269 -158 187 -54 97 -4 -27 338 -94 -157 -52 59 -153 -77 93 -157 -29 -50 -214 120 164 -171 -272 -44
4291 -44 -203 -99 64 72 103 121 -72 -148 3 -163 -72 236 200 152 -23 -135 154 -46 -22 99 -136 124 142 -188
4315 -188 114 -24 186 -50 -3 -81 -110 -40 207 -156 37 6 106 81 -100 86 -106 -394 -25 47 172 -366
4337 -366 -62 122 -118 -57 -15 50 -55 -287 -173 -279 16 -175 -112 -85 -78 -62 8 -96 -179 -136 -77 221 231 72
4361G2K99l67K22j68J79k63j1J01J43l68Q4J04l43L72k55L6J60l0L72m91J6J3
4383a23m3J29J21j69K13j53j22K20q2k0J79j66q8j49L36K30m7j94NJ90m43R7L52
4406B73k05j54L4J61m34M60k45j66K79l32J53J84J82j49K23n73P46l91Q0ll22
4427a99K48K7j80K27m45M61j68o9J82k65J06P3rJ03kk20Q0j08L77k86o2J46J39
4450A56k02J12Q8j64J1J82K56o29J85O9j92R7L15k72M8j43J19rj32L8lj03Q7J24
4474C8R8m40L20M08m72J61j24J9K1J08l41K78l0K43l44P2j11R0R3j60J65l4j35
4497g7o6K27k59J7o5kK14j75J29M1o4p0J09J72j35L9k19L98k35J65j33j42J08
4520b3jM7M9J81k37K16l05P4k9r7rJ6J81k38M5M1J6K01k38N1J69k07p5K01L71
$$ plain form
4361 72 371 4 226 58 237 -26 -37 64 207 -161 -77 27 -316 56 -199 -163 -3 -33 339 -152 -136 -123
4383 -123 -166 -37 84 -85 128 -25 -147 73 -9 -29 150 -16 -104 -253 83 313 266 72 77 267 -176 -79 273
4406 273 68 -86 -52 109 -325 135 -110 -276 3 -329 -176 8 190 41 264 -309 437 46 126 123 -199
4427 -199 49 76 -104 123 -322 139 -29 -98 84 -181 -75 -2 -11 92 90 -130 -50 -158 219 -67 -129 17 156
4450 156 -46 66 154 -10 1 183 439 -190 -5 64 -128 -31 284 12 60 -83 36 27 -105 -67 -70 -173 -86 38
4474 38 136 -304 16 424 -48 113 -11 8 29 137 -204 74 44 287 -57 15 -96 -6 87 -73 92 58 -77
4497 -77 -143 84 -175 -158 -223 -225 -11 -186 -57 -16 -80 -150 -41 131 -4 35 -184 214 -21 144 11 -131 -23
4520 -23 -24 23 72 253 16 232 -73 1 -28 -125 -134 -118 63 -175 -130 -89 -73 128 -110 -59 110 -97 -172 29 400
4545D00j66j88jR0o8J28j16j35N2J0K04l02K80k69J95j57k61L58Q3l82J27P6j5
4568e7N6j10P8J92m3K7p2J6r8p7PK18j67J51l08O5L21j79k76K80m5k68K71J7j03
4593a04K71r6j5K43l01K9j59K21l14K70j77J80p1j04L5qJ89J01j96j21M4J06o8
4616d5j53K89lP4j48p5L13j74k74J27Q2j77MK01K1K0k23J95j23K70J9j63K05j32
4640A30n5r6K34j86Q2J05jk38r9k1J42l13L06Q1R9k41j12o1M54j17j03N4j35J0
4664h1o6L09n04M46j22J59k96L31rj07J17K6j38J22l4k14J96j15Q0k99K05k06
4686b00K1j27J24J77M0M1l20N6M5pN5J42j24J75L8l34J34N6No6L45j93l3j49P
4711i2R6k5N3n2J64k30L24k62j48J64q3N2J2J3pj60J89k97N88o9k57mR7P2j6K3
$$ plain form
4545 400 234 46 45 135 67 195 79 -56 -4 6 210 -92 188 -81 114 -43 -304 54 137 -245 -118 -42 -57
4568 -57 -1 -111 -33 159 116 143 71 87 -11 -88 -81 137 -30 121 -187 -122 199 20 -256 24 -21 -289 -18 -1 -104
4593 -104 167 71 56 299 -2 27 -132 89 -225 45 -132 48 -23 -127 -92 -100 89 190 -6 -127 -83 23 -45
4616 -45 -198 91 88 162 14 -61 252 78 -196 -69 13 -164 -160 41 62 82 -141 54 -69 201 220 57 262 130
4640 130 75 -21 213 27 109 214 213 -25 -124 -145 -3 -316 -10 71 170 -71 -183 -244 210 93 -10 44 -91 -81
4664 -81 -147 162 -342 104 -18 141 -155 176 167 60 177 203 65 187 153 -61 135 20 100 -199 6 -200
4686 -200 -179 -306 -182 -5 35 76 -244 -188 -143 -150 -95 47 -77 98 136 -198 -64 -8 -3 -69 276 83 50 -99 -92
4711 -92 4 -21 32 -20 144 -86 238 -24 -172 -8 -91 -39 -27 -14 -21 -181 8 -289 299 230 -27 -31 66 138 122 145
4737A45r9J37j32r3J81M8Lj62r0k05Q3K23Q3k47n2K80K9l10K13k07K97J75m18
4760a18O7K82k89P3m3J94R2j95J84j26R2l51J8L13j45j49%PK35j32N5k27Q0p3
4784a56L78j69k04K86m20L61K4Kk69N8K03n2o5j13J07J42J8j64j06K11r5M15l26
4807F6j69K57k76J94r9Q5q6o8J24j57qJ51q7L7J45l6q5p8J67k64K42M9o8R6j24
4832HK1n2M0j9J13j23q4J57k95K41J36q9k04P1R3j10R3j52K78j99K79k29K9L1
4856C4j54K09O3l01R8J00J9r2J37j19r2Q5k1O2m1J00k56p7J81l3M7K72k92J01
4880C0j8k0k58L77j54J09J14J72k78q7K38r2j08N0k9k90L23j53O1N6R3n7N2j33
4904bj84J71P6k99J00J55N0k08M9J75k49K24k17J81n8j28R3K1J04N7K20j72j47
$$ plain form
4737 145 46 183 51 -42 139 187 190 28 -62 -267 -184 39 122 -125 -177 103 132 -178 35 -172 125 300 -118
4760 -118 -51 231 -58 15 -28 166 258 63 247 121 213 -138 -120 193 48 -101 -101 -94 141 9 64 -163 -83 -156
4784 -156 222 53 -151 135 -285 76 100 102 -167 -109 94 42 -23 -136 -29 113 131 -33 -139 72 -23 392 66
4807 66 -103 154 -122 72 -27 58 -28 -96 28 -129 -137 14 -73 -36 109 73 -12 -90 77 -187 55 104 36 132 8
4832 8 29 -23 17 -2 111 -12 -96 61 -234 7 143 54 -150 -79 14 -96 -3 -155 123 -76 203 -26 3 34
4856 34 -120 89 152 -149 -51 49 68 -24 113 -6 -98 -13 -34 28 -13 87 -169 -246 -65 -98 -51 221 -71 30
4880 30 12 -8 -266 111 -43 66 180 352 74 -13 225 133 25 75 46 -244 79 -74 -13 43 136 79 131 -2
4904 -2 -186 -15 61 -238 -138 17 67 -141 -92 83 -166 58 -159 22 -36 -164 -71 -50 54 111 331 159 12
4927A2J12k15K66j7l05K39J53k73q0j86J59k20O1L05j63J70J5j82K85j54n3J90
4949A19p5K7o5k49L79J18l19m7K07L4l86L25l5J5k8J31j36j14L64j61l61K60o7
4972f4J16j63J16m0j29J63K1k11J12K56j47p4K1M9J10jKj78l23J17L09n8J11N
4996A20j74j39K58j22m1L4L6p9Q5Q2j17M9J01j23J1k3K78k70K21J72m35J91P7
5019A92j56p6R2Q3q1p2K20l25L4R5q0J32K18j68l7j56M1K59j34k5j42J21P2rp2
5044B6J0P0q5O2o0J33j25j60J13K19k93K00j04K94l49l2N3J03k1j20j20K14q0
5067e2l10M98k99K29j62J66j65M7M2j00J95J69j88p0N2%jj86J26J2LJ55j25K0
5091E6L7j49j97L47j53j5R1j10J46O5j91J92M8k01J3K8J02K66n52M18k07j17N5
$$ plain form
4927 12 124 -91 175 158 -147 92 245 -28 -108 -294 -135 -355 -294 11 -152 18 33 -149 136 -18 -71 119
4949 119 44 71 6 -243 136 254 -65 -112 95 129 -257 68 33 48 20 151 15 -99 265 104 -257 3 -64
4972 -64 52 -111 5 -35 -164 -1 20 -191 -79 177 30 -44 -23 26 136 135 137 -41 -364 -247 62 4 115 120
4996 120 -54 -193 65 -57 -98 -64 -28 -107 -22 60 -57 -8 93 -30 -19 -42 236 -34 187 359 -76 115 192
5019 192 36 -40 52 135 54 -18 202 -123 -89 6 -74 58 276 108 71 -85 -44 215 81 56 -86 35 107 98 26
5044 26 36 106 21 83 23 156 31 -129 -16 203 -90 110 6 300 -49 -81 -28 75 54 -66 -186 28 -52
5067 -52 -362 136 -163 66 -96 70 -95 -48 -6 -106 89 258 70 0 52 52 51 -135 -9 3 6 161 36 56
5091 56 93 -56 -253 94 -59 -74 17 -93 53 118 -73 119 167 -34 -21 7 109 375 -177 241 34 -83 -28
5114b8j40L8K59J03l16N4P2l5L04k60j77O5J59k35R1M4j64j04Q6J41J01l66K69
5137c9r2J80kl29J15K62l32K22K0po2J17L6q9N3k84L01k42J86l86L49P6p1o3j86
5162b67M73m18R5J09k8K0RP3k97K74k08K18M8o7R7j05M5j38K77k58m8K47j78L22
5186B95m16oj65K09P0M4j1j37j34J68J16K52k50j68L44j55jj63P5J30j41K9j34
5209a49P9o1r7J21J21j08P9k33J71K52k54m3qK67k69K86k39K09j47K21l38L75
5231B35j70j5j39K13p0Q1Q1k84K59j70K5k1P2j73J9L9m0j19K33m1J27o3l86J92
5255a15k0J79j89M2J21N5Kk4j25j10K65o8J26Q9m14L31k60N5J81l31K09k3k8J4
5279c8k10J19L27l30M7k18K78pk07K69R5J30j0l29K53q5j08O6M7J14j31p7J10
$$ plain form
5114 -28 -168 -130 129 232 -84 -30 42 7 311 51 -126 -61 98 -137 -46 -2 -166 -270 -184 -43 58 -308 -39
5137 -39 -131 49 47 -282 -167 95 -237 -15 5 -2 -64 53 89 0 53 -231 70 -172 14 -372 -23 53 -18 -81 -267
5162 -267 206 -212 -117 -8 -36 -16 -7 66 -231 43 -165 53 101 34 131 26 71 -67 210 -48 -96 151 -27 295
5186 295 -121 -127 -292 -83 -13 31 20 -117 -251 -83 33 285 35 -133 211 56 55 -108 -33 97 -44 -15 -149
5209 -149 -70 -131 -228 -107 14 -94 -15 -248 -77 175 -79 -122 -130 137 -132 154 -85 124 -23 198 -140 235
5231 235 65 50 -89 124 54 135 216 -68 191 21 46 25 97 -76 -57 -18 -58 -177 56 15 142 79 -307 -115
5255 -115 -135 44 -145 -103 18 73 75 51 -74 -184 81 13 139 228 -186 145 -115 -60 121 -210 -1 -24 -52 -38
5279 -38 -248 -129 198 -132 -85 -303 -25 -32 -239 30 125 255 245 -84 169 84 -24 42 89 203 72 -5 105
5302A05k80K77m2k80K58q5m9K72k23O6j65Q3J25n5K04k21l33K42K28k2p1j26j04
5325a96L02L3j80R1j08Kl0J76k5j58J41r5J70M2nmj83K09l05J85L6r0j52L14k16
5350d6j77K79k7R6r8k04Q2K22m9j43M3J10k91K07j38RJ88R7k48M44j74m61K50
5373b9J41mk36R1rj38r1K53N6R3l46K40k44M21k35J6J48J95l71J18Mp9J11k0J22
5398B07Ll48L21k30J61l85K75K38k64j85L96k08m6J67k21N1K46j22r5j23m4L16
5420A10J4j02k11K36j70k3K7L71j88m4j50l4M12j60m5J61j66k03L81l33O0mk41
5443c02K89K84K7m11P3O0j13L9J36l3m9K10j75J87k40M8k23J10k2J21k76L74k17
5466a03K21j94J03j98R2k1P1%P3O5m6J2N6M1j25j27P8j66L22J07j74R4j2j27k7
$$ plain form
5302 105 -175 102 60 -220 38 -47 -96 176 -47 19 -146 -63 62 7 211 -10 -343 -101 127 105 34 -92 -196
5325 -196 106 139 -41 50 -58 -56 -86 90 65 -93 48 -47 123 165 160 156 -27 182 -123 62 98 8 -144 170 -46
5350 -46 -223 56 29 125 27 -177 -95 127 78 -65 -22 88 -203 4 -134 -125 63 160 -88 356 182 -279 -29
5373 -29 112 108 -128 -37 -46 -184 -275 -22 34 127 -219 21 -223 198 -37 -21 127 322 -49 69 73 -6 105 85 207
5398 207 210 -138 183 -47 114 -271 4 242 -22 -207 189 -19 -65 102 -119 -68 178 56 -39 -162 -206 110
5420 110 124 22 -189 47 -123 -146 -119 252 64 20 -130 -164 248 88 43 204 38 -165 216 -117 -57 -61 -302
5443 -302 -13 271 298 -113 -40 20 -93 -54 82 49 0 210 35 222 -18 30 -193 -83 -105 16 -260 114 -103
5466 -103 118 -76 27 -171 -79 -100 -29 -29 44 109 63 75 131 172 47 -80 -2 -168 154 261 87 181 169 42 15
5491A5K0j10J70k70J37J85R0j81k46K04j48L4K1J18m3k95K42p8j36M11j91K26
5513A75p2K1j56n7K79o6o7K57k97j96K35k51J08q5J78Q0j44j75L02k50K50j8m
5536D7j30J76j66j06J45Q2j29r3K38j40J75j51K51k24K52k04R7j6j04j28J32j31
5558a27K68k73j1j25O7K99j43J72M8k55J04j23J17j49J98n8n2m5O5K15O1j36J3
5581A30j69K12m5j71J47j42K99l66m6J02K11k11PJ17j36K14M2k67J73j32p2nJ43
5604C5J1qn4K11r8k89J91Q5L4K5r7Q8j05j66M25k70L6k75J73m3Q1k10k3Q2P1L6
5630e4m4m2n7K9J62p6J11k37L16j27j9M8l0l0j21K56M5k08J81j37p5J13J8K32
5654B54k11j65q3O2N2J39j39J66k33K6K52M9p1k5l80K08Km4M3J46R1n0J74k52
$$ plain form
5491 15 35 -75 95 -175 -38 147 237 56 -190 14 -134 -100 -79 39 -4 -299 -57 -135 -271 140 -51 175
5513 175 103 124 -32 -89 190 124 57 314 17 -179 56 -195 -87 -172 6 86 -58 -233 69 -181 69 51 47
5536 47 -83 93 -73 -179 -34 48 -81 -174 64 -76 99 -52 199 -25 227 23 120 104 0 -128 4 -127
5558 -127 141 -132 -143 -268 -201 98 -45 127 175 -80 24 -99 18 -131 67 9 -43 -88 -23 192 253 117 130
5581 130 -39 173 128 -43 104 -38 261 -105 -151 -49 162 -49 -42 75 -61 153 195 -72 101 -31 -103 -108 35
5604 35 46 38 -16 195 97 -192 -1 84 118 143 46 134 29 -137 288 18 54 -221 -48 -91 -10 -220 -243 -161 -90 -54
5630 -54 -98 -140 -197 -168 -6 -82 29 -208 108 -19 -38 10 -20 -50 -171 85 130 -78 103 -34 -109 4 22 254
5654 254 43 -122 -205 -143 -91 48 -91 75 -158 -132 120 169 98 73 -307 -99 -97 -141 -98 48 139 89 263 11
5678A1l6pJ36JP2p6j07K1k07M2J38mj82K30p7J12J04l89K11k0o9J07R2j86j82
5703b65L02J27J12k42J8j2K78k69j3K3n4J27j44L8J31l35J31J47N1j59r2J76j12
5726c6J62k02J93k0K27l78K39j08O3k07j10K90q7p3j13L63j97j82K81%J33k92
5748e4J36o0N8j30p6OK98k44n2M8k3K07j16N4R8o8n6j37O2P5M9j12J38k0j96K19
5774A04k77K37J12l5k27J86L2k38Q6j2J66l34L31l98L26k52O7J90k81J9M07j04
5796A05m70N31k20J55j3j43P7k15K03J53k84J04K23k57K52k58j39P9K7k8J44m7
5818b1j25K52p0J1j38J92l29j36M35j99J25J96o2o6nk6L98k74j65Q5j54RJ04p0
5842c3j45K17J10j31nj3l1j25L14j09j17NJ4pM2J48o8K3L6k09N6J5O9n8J4qM9
$$ plain form
5678 11 -25 -32 104 105 177 101 -6 15 -192 -150 -12 -16 -198 32 -45 67 171 -218 -7 -27 -96 11 103 -83 -265
5703 -265 37 164 276 34 52 40 318 49 36 59 5 132 -12 26 157 -178 -47 100 151 -8 -100 76 -36
5726 -36 126 -76 117 97 324 -54 185 77 140 -67 -177 113 26 -47 -160 203 6 -176 105 105 238 -54
5748 -54 82 22 80 -50 -126 -120 178 -66 -118 -70 -93 114 -2 52 150 82 26 -111 -49 26 75 -37 101 81 -115 104
5774 104 -173 64 176 141 -86 100 132 -106 -20 -32 134 -200 131 -267 59 -193 -126 64 -217 -198 209 105
5796 105 -365 166 -54 101 88 -55 22 -193 10 163 -121 -17 206 -51 201 -57 -196 -117 -90 -118 26 -21
5818 -21 -146 106 36 47 -91 101 -228 -364 71 -128 -3 193 131 65 60 34 432 158 -7 78 -76 -67 37 -33
5842 -33 -178 39 149 18 13 0 -31 -156 158 49 -68 -63 -49 -56 -14 134 66 89 125 -84 -28 -13 56 -2 12 4 53
5869E3J86l54J3K30j81K34k54j93J44J4M0j98K74j79j20N49l55m1K04j31QJ4J
5892d2J21j76J83p9K31j68j77K57J86k31k30K19j23k1j29J66Q8k61J2j23J90M0
5914f7j5k89M15k1J40j03L8o9j16r9M5J23j60J91O7k67L08k5q3J65k17l14K36
5937a17N8n3K41l68M18k65K49j22K5j40L21p1M4k90J51k0j67K30j16k05K18N7
5959G8j8k10Q5J62Q1k13k04K85M2r3QK5J4o7J60j40j9j33K26m2k0j2n3K41o6o9
5985D8j50K8R3Q9j29k43L68K46l22Q2k05P1o9J29P2k35k6j50L24J6r6J36q7k8
6009c8M6N9j73K1o1O5L45q6p7P4k20MK27o8q5k7o8J96k01L02j76N0n0k9K40j82
6035H8j35K18j02Pm6k77K00P4J83l31R4P5O1o3M4l2m8J53M3j79M6o9J24j23j61
$$ plain form
5869 53 239 -115 -102 128 -53 181 -73 -266 -122 -108 -68 -266 8 -171 -291 258 -97 -138 66 -65 -57 -43 -42
5892 -42 79 -97 86 7 238 70 -107 150 336 105 -125 94 -29 -50 -179 -13 75 -186 -174 -297 -107 -67
5914 -67 -82 -371 44 23 163 60 98 29 -87 -186 -141 -18 -178 13 80 -187 121 96 13 178 -39 -353 -117
5937 -117 -59 -112 129 -239 179 -86 163 41 66 -74 247 176 220 -70 81 61 -106 124 8 -197 21 78
5959 78 60 -150 -65 97 178 -35 -239 46 88 -5 3 28 42 -25 135 -5 -24 -157 69 27 7 -5 -58 183 117 48
5985 48 -102 -74 19 108 -21 -264 104 350 28 110 -95 -24 -93 36 108 -127 -153 -303 21 37 -59 77 -10 -38
6009 -38 8 67 -106 -85 -146 -81 264 178 101 175 -45 -41 186 118 33 6 -62 134 -67 235 59 109 59 30 270 88
6035 88 -47 171 69 76 30 -247 -47 27 210 -121 -27 48 109 46 90 58 10 163 206 27 73 4 128 5 -156
6060a56K98p5k64L29mj39k19K85k7n2J87k02k9j21j5J34K25k29J55j6j19k2MJ56
6084H4p5j42N1N0m9J35Q2r1NMj7q3j06R5M6n4K2J1L5jJ23j92n0K01K3j14J91l88
6112b04M73j54J14j98J80o8oj67J57k5j91K82k27O1K8O3l19L09J08j52M9j20K58
6135B51j60k84K53k28O2K01j39K43k25J95j83P%P8j06o9K4OL86k55l28M62lk72
6159h4l3R4J46j45M2J8K01l62K12j05Rj55J41m6J17L0J05j05j61J35q0Q5j48K4
6183f5J56k5Q9r3K0r8j68J49J10n3k0l4J58j11P2j99o8L56j56j99J93P2l58Q6
6207a86J64J86j92J85n5P0k46j20L28k8k00J95K2r0K8j27j60J25Mk3j78K18O9
6230a1k44M97j69Kl5k42M22j35O0k06j9J48L0k80K26o9k34M7J44j5L1J29k31o6
$$ plain form
6060 -156 142 67 -197 132 128 -11 -230 55 28 -24 163 -39 -68 -189 -204 -70 155 -74 81 65 -54 -76 -72 84
6084 84 9 -133 -82 -32 -81 54 136 45 50 54 37 -46 -152 -57 -11 -65 -43 -32 3 2 125 -67 -117 84 107 -7 184 -204
6112 -204 269 115 229 31 211 143 137 -30 127 102 -89 193 -34 27 55 118 -201 108 216 64 113 -7 251
6135 251 91 -193 60 -168 -106 95 -44 199 -26 169 -14 -7 -7 71 -35 -104 -80 -74 312 57 -271 191 188 -84
6159 -84 -117 -23 123 -22 20 38 239 -123 89 -16 -7 -162 -21 -67 50 80 185 80 -81 54 -26 59 -89 -65
6183 -65 91 66 155 62 82 -16 -184 -35 75 22 2 -32 126 15 87 -112 -180 176 20 -179 14 86 -272 -186
6207 -186 -22 164 -28 157 102 172 -74 -194 134 106 -94 101 123 33 61 -66 -226 -101 -97 -120 -298 -80 -11
6230 -11 -255 242 73 75 40 -202 220 85 145 -61 -80 68 98 -182 44 -25 -259 -212 -68 -83 -52 77 -154 -220
6254b20J13J58j79oL39p7k02O8Q1k5M3l2k5J42l89K42J27J33k78R3J4r1M0k13
6278a44K17n3j71J44j57J61Q8j10j02r5M13k27l5q0L92m29K64k08L70j15j27J61
6300A57j72K31l16L2J31LNr4M8P7k74J56K51o7N2k32j87L71k54l9O8J46p9J8p6
6325d4J78l6j53K0K3R4j09j75O2K06J74p9p1j79Q4q3K31k41J58q5rj85J45K52
6349A78m61J63N9J43o7mkj49L8m1L09j35q7k3Q7Ll8Q4j5K13Q3n35K85k18L04l68
6375a94L32k6j71P3m8K12R4k37L8j21L8R0j50J78j18M17n67O0K63j15q8K60m12
6398a92L23j36K36k17O8J44k75J19j49K72m7j05k58K16J60j34m8NJ01k81K38r
6420C1k73K44j49L46M1l52J78L5K57n11J3P8q4oL95j87j5j87p8M06k39M1kJ66
$$ plain form
6254 -220 -107 51 -128 -134 205 128 -74 -6 75 50 93 61 36 178 -211 31 158 291 13 106 120 29 69 -144
6278 -144 73 20 -151 -7 -164 -3 85 -25 -127 -222 191 -36 -71 -151 241 -188 76 -132 238 123 -4 157
6300 157 -15 216 -100 -68 63 66 71 -23 25 102 -172 -16 235 168 220 -12 -199 172 -82 -121 -53 93 14 32 -44
6325 -44 134 98 -55 -35 -12 82 -27 -202 -140 66 240 161 90 -89 -5 -88 143 -98 60 -25 -34 -219 -74 178
6349 178 -283 -120 -61 82 15 11 9 -140 -102 -143 166 31 -56 -79 8 11 -27 57 42 255 338 -197 88 -130 174 -194
6375 -194 138 112 -59 14 -34 178 272 35 73 -48 -10 80 -70 108 -10 407 -160 -100 163 48 -40 220 -192
6398 -192 131 -5 231 14 82 226 -49 70 -79 193 146 41 -217 -1 159 25 -23 -18 83 -198 40 31
6420 31 -242 2 -147 199 240 -112 66 101 358 -153 -140 -62 -146 -152 243 56 41 -146 -224 182 -57 -16 -18 148
6444A48j74j62J16R0J31k71J1J07j30k2q3J63K94j8J99k24j34n2Pl9L3J95j91
6467fPP7o0l3j56m8K27O9N3j72q5K58o2o8J51k39p5K36jQ1Kk3p5j39K02k27K02
6494I6k24L40Ok24j20M20j56j67j28l4J40Pj6k01M52l17L32l83L03l8k41l3K40
6517E4j1K5j66J44l8r8k04J26M22l34K44j45q3o6K77o9J75l87M66n11J93j11J9
6540g8L7OK7l9J09J18j02m5J6R3k51rj6J71j37L08k77K52r8j27J78j08l1J10K5
6565A32k22J98l2M2j03L8k08K13k40j46K83M4j21J30k6P8j11J5J98l02j5M3Q9
6588b3K9K84j81k5j94K57k61J16K4j4K80j90l58K29R4J08j51j02l5Q9m5R5PLJ8
6613E4j62J45K1M8l7M7j06J43q5j34n8J24L98l89r4J17k16L72l63J48j6k34J32
$$ plain form
6444 148 -26 -188 -72 18 149 -122 -111 -4 -134 -156 -239 -76 218 200 399 175 41 -11 -4 -43 -10 185 -6
6467 -6 1 78 18 -15 -171 -219 8 77 130 -42 -127 131 69 1 152 -87 -162 74 73 154 156 133 58 -81 121 -106 96
6494 96 -128 212 218 -6 -126 294 138 -29 -157 -191 -51 -44 -60 -261 191 -126 206 -177 126 88 -153 -186 54
6517 54 43 68 -98 46 8 -90 -294 -168 254 -80 164 19 -64 -130 147 78 253 -134 332 -179 14 -97 -78
6540 -78 -41 -35 -8 -47 62 180 78 33 49 142 -109 -118 -134 37 -100 208 -69 183 85 -42 136 28 -3 107 132
6565 132 -90 108 76 118 15 53 -155 58 -182 -328 -45 -1 -122 8 -18 60 -51 -36 162 -140 -155 -112 -23
6588 -23 6 290 109 84 -110 147 -114 2 26 12 292 102 -256 -27 67 175 24 -78 -113 -24 -69 26 33 36 54
6613 54 -108 37 58 106 69 116 10 153 68 -66 -124 0 398 9 -85 32 -184 188 -175 -27 -43 -277 -145
6636a45n8J69J23K4j47p0L52j80p3l3q5k1J29q4K1K45K6Kj12j67J57r5K23J6j83
6661C4j63J01L10m06K53k78J79J3O9k74K16q1l2j4J48k11K49m5r6m2K15J1k35
6684g9n7j32J14O7P3J35j81K26j75Rj53p3L25k90L4Q0j00J2M5J18l9J44k31L03
6708A75k94Q8j47K10N5j58K35k66J02N1j10K9K97l32K19j88J04p1Q6j15L0k74
6730b74J86J23l4O2j23J65j34P1o8k06N68l98P1k3J50j63R1m5o7l5M9N5j13N0
6754d2P4q3q1Q1Q2j61K00o5j34K04J58m33L61j99k8N7J30j52K52k58M26k33k10
6777e4N5J3j87L12j65J65q9L6l75L67Q2j12P7j86J62j75Q7J04j56k60L19j60O1
6800g9L49k73J72r8l2O7n2K8k1K37m53J3O4l6L82l01r5K30j36j14J45j05J17M7
$$ plain form
6636 -145 -203 -34 89 113 -34 -104 248 68 -5 -38 -123 -144 -15 -99 -78 167 193 195 83 -84 73 -22 201 217 34
6661 34 -129 -28 282 -124 129 -149 30 43 112 -162 54 -27 -59 -73 75 -136 113 68 -28 -70 145 156 -79
6684 -79 -136 -268 -154 -87 -14 121 -60 166 -9 0 -153 -226 99 -191 -157 -77 -177 -165 -120 -2 -41 103 -128 175
6708 175 -119 -31 -178 32 87 -71 164 -102 0 51 -59 -30 267 -65 154 -34 70 -1 85 -30 0 -274
6730 -274 -88 35 1 63 -60 105 -29 42 -26 -232 336 -62 9 -14 136 -27 64 19 -48 -83 -34 21 -92 -42
6754 -42 32 -51 -132 -51 31 -130 70 5 -129 75 233 -200 161 -38 -66 -9 121 -31 221 -37 389 156 -54
6777 -54 1 14 -173 139 -26 139 50 86 -289 78 160 48 125 -61 101 -74 13 117 -39 -299 20 -140 -79
6800 -79 270 -3 169 71 39 106 54 82 61 298 -155 -142 -78 -114 268 -33 -128 102 -34 -148 -3 -108 9 56
6824E6j61J35k09J86j28J56j5k14Q5l2K78m2k01K99k10n2J05n0P%K87l51Mo6J44
6849A1m4j0J42p6J84q9K09j96j32R9n67M08K89k56J13P5n4kj70K94j66r5r5K58
6873A30J5n6j25J85k41J76q6J23J8p1k34J09J80k25J66q0k15k4L1L73l9j89k16
6896b95M04O2k48Q8M4M0j54j5k0n4L76m08J84k29L29j61J49J05j02j84K24j18
6918A7k1jj11J41j41J99p2j2J18j40P8j54K18j22k2K11RRj26r4P3r8j68K26jj51
6944a35L4l9J07j69J82l0j75J13K01pkk92K39j35j4K58N3j39J01m3j49or2J33
6968fK77k28j78L57j6p4M7q6j56R7j03j86K56Q4q2K00j34j06J22pM3j93P9K6n9
6993b6J41K9k39K2J45K4p9L3j33m5q5K59L0j79J21j32M35l98j35L75R7l13J07
$$ plain form
6824 56 -105 30 -179 7 -121 35 20 -194 -109 -141 137 95 -106 193 -17 -69 36 -14 -7 -7 280 -71 -67 -133 11
6849 11 -33 -43 99 23 207 118 327 131 -1 98 -469 -61 228 -28 85 160 106 104 -66 228 62 -33 -128 130
6873 130 145 89 -36 149 -92 84 -2 121 139 68 -166 -57 123 -102 64 -16 -231 -255 -224 149 110 -79 -295
6896 -295 109 171 -77 11 55 95 -59 -74 -94 -148 228 -180 4 -225 104 -57 92 197 95 -89 135 17
6918 17 -4 -5 -116 25 -116 83 11 -1 117 -23 55 -99 119 -3 -25 186 195 204 78 -16 57 -41 -209 17 16 -135
6944 -135 -101 -140 -33 -202 -20 -50 -225 -112 89 82 80 -212 27 -108 -122 136 189 50 151 108 -41 -47 -139 -6
6968 -6 271 43 -135 222 206 132 179 93 -63 34 -69 -255 1 85 3 203 69 -37 85 78 121 -72 7 33 -26
6993 -26 115 144 -95 -73 72 96 17 50 -83 -128 -213 46 76 -103 18 -114 321 -77 -212 163 260 -53 54
7016E4N8l28J22J83J42l61L4J74J67l5j70P8m6J17r5j59j98J3K81q4P1o9o7q7
7040b05J38R7K66m12L2Q1J99l74J64L6Oj10K5m2K19m9L4j87o6J73j12l6J02j40
7064a61Q4P1j61M3M06k76Q0J26m02J60N1K76k28j62k53K14K08Q4m9LK2k33L21
7087B24k96O4j88K94q6j27k5K58l25L60o0j15J37j72k08J23J23o8j67J26Q7J02
7109F1mj62j29M36j87qK9r4L30j16k18K9q4l8J52J89l14n0p8Q3J88j13j3o2j03
7134b76L29J03j01j98K19q5J21j33L7Q3n2l34K41K48j40J8k21J9K21m2j77K47
7156A27j48J14k58J25q3L45k14M0j68K52k49J5N1n9J13J2j6KJ4J37k5j70J03j19
7180e9L07k1l68L42l63r7K16n4j59K54O4j26j3oJ8J65o7j39J07j97L07J74n60
$$ plain form
7016 54 112 -216 -94 89 231 -130 -96 78 245 210 40 118 72 189 94 -65 -263 -250 31 -53 18 -51 -118 -205
7040 -205 -67 30 296 -116 -84 -3 196 -178 -14 22 28 -82 -57 -99 120 71 105 -82 -148 25 -87 -123 -21 -161
7064 -161 -77 -6 -167 -124 282 6 86 212 -190 -30 21 297 69 -93 -346 -132 76 160 111 114 136 -97 224
7087 224 -72 -8 -196 98 12 -115 -140 118 -207 153 93 -22 115 -57 -265 -142 -19 -87 -254 -128 -41 61
7109 61 57 -105 -234 202 15 7 36 -58 272 156 -62 -33 -117 -155 -3 186 -128 -178 -256 -173 15 -98 -111 -173 -276
7134 -276 53 156 55 -143 76 -9 112 -21 16 99 47 -287 -46 202 62 80 -141 -122 99 57 -120 127
7156 127 -21 93 -165 -40 -123 222 8 48 -120 132 -117 -102 -51 -110 3 15 -1 1 15 152 127 -43 60 -59
7180 -59 248 227 -141 201 -162 -259 -43 -97 -256 -2 62 -64 -77 -83 -65 100 33 -106 1 -196 111 285 -275
7203b75J81J7J13n2k2K05j27k21L01o3k37M47k59J9O1L4k00J82lp9o3J58n2p9
7227a4J75k97J48l3J6j52j42M16j55j44N3j02J8J64K20p5po3k26J88m9Q3m06O16
7251B32k25k6k8J51nj79J38O1j33K3O2l4q4L1j58J21N08m78P5P4l14L01J38m06
7275a55K66k12J87K2Lk02K34k69J16j18N4L0K04J7j85K67m14K63j99Q5J31j55
7297c0k4M5k1J54k9O8k42J10m9J13j74J90J74j78p7j23K06L2k13m0L3p1oJ90j10
7322g2N4ml2r6k21K35j41L52Mj11Q4J3j79N8L7m4J05m7K53k73L34m97K21q5r3
7347a45j03L33P4l46J97j96J84LJ54j35L8L8k84J94O8J33j5k13Q0j41j6L03l24
7370a19m6K50l4Mj50J15j51r4L71j2rj67J0j17R2J42O2j24k64J90J62m1L5j52
$$ plain form
7203 -275 -94 -77 36 -16 -38 167 40 -181 120 57 -180 267 8 27 88 122 -78 104 101 22 -41 117 65 -14
7227 -14 161 -136 12 -21 -5 -157 -299 117 -38 -182 -129 -231 -213 -49 171 96 89 26 -200 -12 -61 22 -384 232
7251 232 7 -19 -47 104 99 -80 58 119 -14 9 71 37 -47 -16 -174 -53 455 -23 52 126 -188 113 251 -155
7275 -155 111 -101 86 108 111 -91 143 -126 -10 -128 -74 -44 160 177 -8 259 -155 108 -91 -6 125 -30
7297 -30 -54 -9 -30 124 95 163 -79 31 -18 95 -79 111 285 107 30 -93 113 145 -68 -108 -75 -146 -152 38 -72
7322 -72 -18 -22 -54 -150 -371 -136 -277 75 79 -32 52 65 -114 -56 -19 -63 42 -5 248 -25 309 -188 33 -52 -145
7347 -145 -248 85 159 -187 10 -186 -2 1 155 20 58 96 -188 6 74 207 192 -21 59 -82 -98 205 -119
7370 -119 -165 85 51 55 -95 20 -131 -225 146 134 125 -42 -32 -149 -57 85 147 23 -241 -51 111 70 105 -47
7394d7J70k7p4j47Q1KP9j10J77j39K78k38k44N2K86j89M6LPq7j07K64k4j85K18
7419D5L6j24L20l45K99l73J45j34J00J75k55Q0R5l3l1N1l01K09Pp6O6J95k09J24
7443F6J91l77J01J74r6K3j81J21j54j9k8J89K3N1K21m59K92k6j21J35k15J84l44
7466b49L79M0m00Q1J56j04Q6Mj18K65r9r6MOO0M5j40L05j39K4j76K17O1k05k26
7491b19M15m51p9L51Jj26K92j83OO3J6m5J12j83j82M19l68R2K02J5n18K77K3L18
7515B48j39m38K70k05N25l53R3n2L2j41L27j31q4J47M6q8k64K02q3J9j6J22jj75
7539a39K1K5J81N4j97p8m7J17K07q6r8j07J17j37J13J79j46J5j23K69o7P7k09
7562e9j6O6J3n7L00k70n3K29k33j30K52L1j94K6J75m7P6j28j16L44m52K92k42
$$ plain form
7394 -47 123 96 22 -125 -44 -42 37 -73 104 -35 243 5 -239 -187 99 -90 -44 -41 -34 -121 -228 36 12 -173 45
7419 45 81 -43 277 -68 231 -142 3 -131 -31 144 -111 -31 64 31 0 51 -250 -41 -34 -110 -44 151 -58 66
7443 66 257 -120 -19 155 59 82 -99 22 -132 -151 -179 10 33 84 305 -154 138 112 -9 126 -89 95 -249
7466 -249 130 170 -230 -149 7 -97 -11 -7 -125 140 41 -55 -51 -45 15 60 -80 225 86 110 -66 151 212 7 -219
7491 -219 196 -255 -334 17 18 -108 184 1 7 70 86 41 153 -30 -212 207 -161 -69 133 148 -370 -93 -70 248
7515 248 109 -329 -59 -264 261 -92 1 -51 -19 -160 167 36 -48 99 145 57 -207 -5 -88 -69 -85 37 36 -139
7539 -139 -118 -93 88 142 -55 -133 -180 -63 144 58 -40 -147 -30 -167 -54 125 -21 -6 -129 140 73 150 -59
7562 -59 -75 -9 4 -53 247 -23 -76 153 -80 -210 42 73 -121 -95 80 33 109 -19 -135 209 -243 49 -193
7585a93M89l37J56l3j14j58J21K73k44j1R3m26K90J49r3J33j18j39K45J82l01
7606c6k67J48L01q8n9k3P2j46J03J49l69K20k4J72Qj04j8lK6O1o6K1k87K04l6
7631d1J29k1k73K59o1M8l9J84k35m7J41L54m34K00k68K04q3P8o3j05j5j3m4K49
7655A04j02j60M9n2K79p4k8j2P8j48O9n7m8K12lk71n6L94l09K88j86K01j44j01
7679g7O1P1j09J48j00J53l1L1k77K82k20J13l84M24K6k83R4J36l6J00k62J23J15
7702I8k38k5m0J66J74l27K54L9j18J5J04L5l13J54KN9j07J33k35L46K46k82r1
7725D9n3K53j89J02k71L4P2k12J92J26k5q7j0m1K46l49K1L47j72l0J52L3j25k28
7749a65P0K8P7K41m60P8J14k0Q5k4K16j75j72j62J98Q5K09l95L2J88J8k3j32j14
$$ plain form
7585 -193 296 -41 115 82 -32 -190 -69 204 -40 -51 42 -384 -94 55 -38 95 -23 -162 83 265 -36
7606 -36 -303 -155 146 58 -1 -24 48 -98 5 154 -215 5 -19 153 161 57 39 36 62 123 57 78 -209 -5 -41
7631 -41 88 67 -206 53 -8 40 1 185 -50 -97 44 398 -36 164 -104 100 17 95 32 -73 -88 -101 -145 104
7655 104 2 -158 -109 -161 118 44 16 4 82 -66 3 -54 -102 110 107 -164 -220 174 -135 153 -33 168 24 -77
7679 -77 -16 55 -54 94 -6 147 116 147 -130 152 -68 45 -339 85 111 -172 -78 58 22 122 -140 -17 98
7702 98 -140 -165 -205 -39 135 -192 62 101 -17 -2 102 137 -176 -22 -20 39 -68 65 -170 176 422 140 49
7725 49 -4 249 60 162 -109 -75 -3 -215 -23 103 78 -9 -19 -60 186 -163 -142 205 33 3 155 188 63 -165
7749 -165 -95 -67 10 251 -209 -131 -17 -37 48 24 240 65 -107 -269 -71 14 223 -172 -140 48 66 43 -89 -203
7773b03R7J37o6j1K69j31o7N0m0l47M47kJ37j03l4J21k78J67k63PJ54M2l7k48
7797b02J11J84k8k35K16K46l46j38M50j90k31K13J16j47l6K11r9L5%j1N8k26K14
7820A65l88J0L04n6k78L83j97J75k21J73j47K00j37OP5j7j41J92q4m9J19q8r5
7843i6M8R0m4LJ47l7m1J39j99m5J17l6k12J99j79J98r6J6j18J38n5l5j00O5K26
7868I3j51k8K02o7o1J41j52Q8k30K17j69L39j22l3j64q0J89j07K88j85k09L12
7890A11J47m21K17p9K0L04m36K61k49R3P0J72k76P0K9j92O6Q1N7k89JN2N5nJ69
7915B8k51K63k24J92l14J22J69j33j44K00J58L0k6j00P0L7p6m8O0qk50N60l78
7938f3n3K58j99J83n1j19J69m04L17J21J39n46M29l03Q7j18L3L62j35j74K9K3
$$ plain form
7773 -203 -106 31 -35 -46 223 92 25 75 35 -312 135 133 270 167 133 254 -24 143 -120 -113 41 83 46 -202
7797 -202 -91 93 65 -170 46 292 -54 -192 258 68 -163 50 166 19 -17 194 95 130 130 119 177 -49 165
7820 165 -223 -213 91 35 -243 140 -57 118 -103 70 -77 123 -14 -8 67 50 -91 101 17 -32 87 -1 -96
7843 -96 -48 42 -2 1 148 111 70 209 10 -35 82 46 -166 33 -146 52 -44 -28 -146 -8 -63 -98 -198 -133 93
7868 93 -58 -86 116 49 -12 129 -23 65 -165 52 -117 222 100 67 -97 -177 12 -95 193 8 -201 111
7890 111 258 -163 54 -25 -5 299 -137 124 -125 -32 38 210 -66 4 33 -159 -93 -12 45 -244 -243 -191 -136 -141 28
7915 28 -223 40 -184 8 -306 -184 -15 -148 -292 -92 66 96 70 -30 40 77 1 -47 13 5 -245 315 -63
7938 -63 -116 142 -57 126 75 -44 125 -279 38 159 298 -248 181 -122 -35 -153 -120 242 107 -67 -38 -15
7960a5j61J67M2q5k00K13K81k91L2m8J29o5k72J6K32p3J37o1P6K1m8M1Q2k07m
7985f1J72o1m6j88J97L5k92O0J11n5K01r4m6l0k2J67K19j50l95K11l8M7oj82J74
8010g2r4Q5L52j64J45l05k5R2k31K41LQ7m1Rk65J93M3j51J20l5M4J28m14K82N1
8035G8M9q5j68j9J49J73l07j8L24Q5m77K80q4J93j56k23M75k34K10m1k82K36k22
8058f4O2j7J04j6ql4J04j17r9J34J39J7l12L35j94M1k25KO8Q8j06J46q8O1j99
8083a78N0N0Qp8J64O3r6J74j69R9j26j54K35J24k42K05j20qM4J2K01j72J44j34
8107I6j52J24j24k9O5m3Q2j53N3J05j38K33j2m8j43J75K41l36o4j25QP7oO0J84
8132A30j10j62J41r1k16L28k71L44j07L11m65P2K23j77K68k95J42j8J36j79J47
$$ plain form
7960 -15 -176 -9 33 -52 -252 -39 242 -49 -17 -65 64 -1 -273 -257 -25 -98 39 -22 54 75 27 68 150 -57 -61
7985 -61 111 50 4 -184 13 48 -244 -184 -73 -128 73 -21 -67 -97 -119 48 267 117 -278 -67 -105 -58 -64 -246 -72
8010 -72 -166 -81 271 107 252 -53 -78 14 -217 24 27 114 73 82 -183 10 53 -98 22 -13 31 159 -255 27 78
8035 78 127 42 -126 -145 4 177 -130 -148 176 261 -216 64 -20 173 17 -206 269 35 245 204 -78 158 -64
8058 -64 -2 -19 85 69 61 27 131 14 -85 49 188 205 -107 228 34 75 -150 -148 -80 8 -98 48 -40 21 -178
8083 -178 -128 -78 -70 -148 16 79 -17 157 -12 87 -39 -193 42 166 -76 129 9 1 45 57 258 86 230 96
8107 96 -56 68 -56 -85 -20 -63 19 -134 -81 24 -114 119 107 59 -84 91 332 -4 -68 -193 -185 -108 -114 -54 130
8132 130 20 -142 -1 -92 -308 20 -251 93 -14 297 -168 -96 127 -50 218 -77 65 47 183 4 151
8153A51k64K24J11k70J17J72j42K24k16j97J53j74J39J48l04j2J57K1m9l9K41
8174A91l03q6K56m4J3k39J31J28K15j04J35k71K33j58j27j05K9
$$ plain form
8153 151 -113 111 222 -48 69 241 99 323 107 -90 63 -111 28 176 -128 -140 17 38 -11 -50 191
8174 191 -112 -198 58 14 27 -212 -81 47 262 158 293 22 255 97 -30 -135 -106
8191a06
$$ Imaginary data points
##PAGE= N=2
##DATA TABLE= (X++(I..I)), XYDATA
0@%%%%%%%%%%%%%%%%Qj6J6j6J6j8K6l2L2m0M8n4O2p1Q1r1J05j19J33j50J69j89
38a00K12k36K60k88L21l57L95m36M81n30N83o40P05p78Q59r48J048j161J290j440
58g60J615j823K072k380K774l292M009n070O795j0052J8207p2811j23290K19066
72C5060O5098j55205L0454J14079q4300l2819N6538k1559k0479M6606j1646n3968
84c2141J8469J9790k5109J6605J7292j5193j8446Q741J8884o191l531q41k23L641
98A747k2294m736K3448K2493M79k7045j11J4214r299J439J6528M141j6576m829
112d01j0248j7190M0120K5353m5355j8085K9370p293l1323L6769L1398m1341n127
125a3353K5566j7808q723K9916K412k8140J5463P769m2354N281M1882o628k5916
$$ plain form
0 0 0 0 0 0 0 0 0 0 0 0 0 0 0 0 0 0 8 -8 8 -8 8 -10 16 -16 16 -24 24 -30 32 -39 42 -49 56 -63 70 -80 89 -100
38 -100 112 -124 136 -152 169 -188 207 -229 252 -278 305 -335 370 -408 451 -497 551 -610 680 -760
58 -760 855 -968 1104 -1276 1498 -1794 2215 -2855 3940 -6112 12095 -60716 -184006 35060
72 35060 100158 -55047 -24593 89486 5186 -27633 28905 7346 -13133 33473 21827 -32141
84 -32141 -13672 6118 -18991 -2386 14906 -287 -18733 -9992 8892 2701 -830 -1671 -1894 1747
98 1747 -20547 -25283 -1835 20658 21137 -5908 -6019 8195 -1104 335 16863 21004 4428 -401
112 -401 -10649 -27839 12281 37634 -7721 -25806 3564 -3729 -35052 1717 33115 -8226 -13353
125 -13353 12213 -5595 -14318 15598 18010 -10130 5333 13102 -29252 -23971 17911 11283 -14633
138a4633J0914J9410j0605m948L288N140J1799j9336k5325J2553J6670n929j452
151b454J2592r836j5373R773O929J3413Q195k3504j4365J0158k088j2543J9078
164b5J5901k1366p76P847j4918J1618K5616j5228k2243J9335P611k6909Q038K2253
178A6754q954q632L619k020p364M020N111j859J705p071r215L824J0730R992n955
193D685j0982L526K919o544k100J5211N448j4248q541L52J3839J3570q020l803
207E312Q892r150j9570J0701J6735j4911n303Q939j2002j613J6084p449o720K6624
221A6569j50l8896J1686L0101k5559j4037L2265n8l0177J0658J8823j0985Q372
234H612J1979k3960p952K1902k809j8315J2735J1843j9630r419Q978O100M672
$$ plain form
138 -14633 -3719 15691 5086 138 3426 8566 20365 1029 -24296 -11743 4927 -1002 -2454
151 -2454 10138 302 -15071 -5298 1631 15044 23239 -265 -14630 -4472 -6560 -19103 -25
164 -25 15876 -5490 -6266 1581 -13337 -1719 23897 8669 -13574 5761 13372 -13537 -5499 16754
178 16754 7800 -832 2787 767 -6597 -2577 2534 675 2380 -4691 -13906 -10082 648 10640 4685
193 4685 -6297 -2771 148 -6396 -8496 6715 12163 -2085 -10626 -10274 3565 17135 9115 5312
207 5312 14204 5054 -14516 -3815 12920 -1991 -7294 1645 -10357 -11970 4114 -3335 -10055 16569
221 16569 16419 -22477 -10791 19310 -6249 -20286 11979 11921 -18256 -7598 11225 240 8612
234 8612 20591 -3369 -11321 10581 7772 -10543 2192 14035 -5595 -15014 -6036 64 4736
247D736Q92m682l905p10k364J708J0202p72r218k590K530L940O48k043L282O857
263H511j06j1591n611J0841J0354n761j1612N428N558j2793j885J6036J035j3673
277e269J128M678p335N269R077q710j226O630j2966p614K2211P375k0365j44J2308
292E047o939l412J0888K889k778k31p981m065J2072P7j0278N402O036q077m665
307f015K259K066O932K185j3530k421J1402o599p032J4360N711j5368k110R968
321A808k660J60R249m058o531L904j350o325Q507J0145r706j0303M759N269k154
336G14j309L521j83n686k357J061Q20L785L898m205m915N099O20p514N236J0399
352H984n886r723K753M674o26J356N52J690L015p887p380J0575Q037q888m539
$$ plain form
247 4736 5628 946 -2959 -3669 -6033 -4325 5877 5105 -4113 -6703 -4173 -233 415 -1628 1654 8511
263 8511 8405 -3186 -8797 2044 12398 6637 -4975 453 6011 -6782 -8667 7369 8404 -5269
277 -5269 -4141 537 -6798 -1529 7548 -1162 -2388 4242 -8724 -16338 5873 13248 -7117 -7261 5047
292 5047 -1892 -5304 5584 8473 5695 5464 -2517 -6582 5490 5567 -4711 691 6727 -1350 -6015
307 -6015 -3756 -1690 5242 7427 -6103 -8524 2878 -3721 -10753 3607 9318 -6050 -8160 1808
321 1808 -852 -692 8557 4499 -2032 1872 522 -5803 2704 12849 3143 -7160 -2401 2868 714
336 714 -595 2926 2743 -2943 -5300 -4239 -3419 366 4264 59 -4856 243 863 -6651 -1415 8984
352 8984 3098 -6625 -3872 802 176 1532 2084 3774 6789 -1098 -8478 2097 10134 1246 -3293
367c293L467m491m78P299j413k41N564q113q840J2581O498j4524J380J2187j0558
382b975j0143J0770N861m036L005M44o175L947N049o216R11P941m587q287J166
397c325K841O70K576K3k462L05k445l169N982N324m812o382m82J023Q53J950l95
414a925J308K413l515m543O138R925k455r295K189O199m408p043N597Q207n455
429C337p209Q75J307J696L191l892l293O509j336j1742N320J1441o838n347Q726
444B745j850j0142P061R468l950q65p40o291M843Q942p446m506J0451j909j2144
459f333L445O835l772M33P64q055L07P382l642j967R430j477r254L741N671l689
475a81o01M388l186k966K022j703j356P804L630p679l942O204K075n394K76O691
$$ plain form
367 -3293 174 -4317 -4795 2504 1091 850 6414 -1699 -10539 2042 8540 -5984 -4604 7583 -2975
382 -2975 -13118 -2348 3513 -523 2482 2926 -3249 698 5747 -469 442 8383 3796 -4491 -3325
397 -3325 -484 186 2762 2785 323 628 -1817 -4986 996 6320 1508 -4874 -5356 -4333 -3480 -1530 -1925
414 -1925 -617 1796 -1719 -6262 -124 9801 7346 -1949 240 6439 2031 -5012 585 8792 3337
429 3337 -3872 -2997 -1690 6 3197 -695 -3988 2521 1185 -10557 -5237 6204 -634 -5981 2745
444 2745 895 -9247 -2186 7282 3332 2467 1727 -4564 279 9221 1775 -2731 7720 5811 -6333
459 -6333 -2888 3947 175 608 1372 -6683 -6376 1006 -2636 -4603 4827 3350 -5904 -2163 3508 -181
475 -181 -782 3606 420 -2546 -524 -2227 -3583 4221 7851 172 -3770 2434 4509 -885 -609 6082
491F082k937q696l92M138J640J960p27m906J904N322m695l282R918J773j1722
506d620j354P265j716k731M906J019l241l4j454j17O625j67o710J943M434m963
522i15k755O018J950j477j197m461j180N871N5m977K576J909o394o75O298O98
538A344r06K016k653k997L319N45k091L698J155n728j019M169J886M04j37j419
554A586J291l1m906q89O454n84p132r3J746n94R89J324M2K120L56n660k51P119
572B887J237n365J36L816j999m201K843O394k04n745r33K319k59l2J105k259q8
589c48J696n350k709R357J959r851J419P348n791m388P272K004l523K177j173
604I9m099O096L444o363J476O001o787n053O919J547l993J757k05m097K584K688
$$ plain form
491 6082 3145 -5551 -5943 -1805 -165 1795 1068 -3838 -1934 3388 -1307 -4589 5329 7102 -4620
506 -4620 -5974 1291 -425 -3156 1750 2769 -472 -506 -1960 -2077 4548 4381 -2329 -386 4048 -915
522 -915 -3670 2348 4298 2821 1624 -2837 -4017 1854 1909 -3068 -492 1417 -4977 -5652 646 1344
538 1344 438 2454 -199 -3196 123 668 -1423 2275 3430 -2298 -3317 852 2738 3142 3005 1586
554 1586 2877 2846 -2060 -2949 3505 2921 -4211 -4304 -2558 -3152 -2163 -839 -797 1323 1679 -3981 -4232 2887
572 2887 4124 -1241 -1105 2711 712 -3489 -646 5748 5544 -201 -1134 1185 926 894 1999 -260 -348
589 -348 1348 -4002 -6711 2646 4605 -5246 -3827 3521 -2270 -6658 614 2618 -905 1272 99
604 99 -4000 2096 5540 -823 653 6654 -133 -5186 1733 3280 -713 1044 839 -3258 -674 2014
620B014m476K364O154o159o451M639L523l307P26J579k968k02K530n94L54M030
636C756n72n019Q90L597k178k669M470K738o137l514M655L365k161o35L82k81
652F87n59j545k796L973N488n989o217N125M418m907p6M894q79k907k30n82K076
669b6M205k526l854L253J380m237J977M581k884k667J730j675j153K838n28j528
685a114K437j572m683L053M412k220j439R49k136M43K209j652N10M463j781n096
701c217K075L660l37j50j27j391J92m62k674L042L902l834m399K707J750k171
717a434M5J767O64q06l409r38M288K323l286j199K933j61k449l11L662K405k470
734A624l842J944K100j910j75K615m02k014o86j141K063L345l199l762L960Q17
$$ plain form
620 2014 -2462 -98 6056 -103 -6554 -1915 1608 -1699 -973 606 -2362 -2564 -34 -628 -274 3756
636 3756 3184 -1835 -945 2652 474 -2195 2275 5013 -1124 -4638 17 3382 1221 586 968 687
652 687 128 -1417 -4213 -240 5248 -741 -6958 -1833 2585 -2322 -2398 2496 1617 -1290 -1520 -2102 -26
669 -26 4179 1653 -2201 1052 2432 -1805 172 4753 1869 -798 932 -743 -1896 942 414 -1114
685 -1114 1323 -249 -4932 -1879 2533 313 -1126 -177 -2313 -1870 339 -1313 -803 3660 1879 -3217
701 -3217 -1142 2518 2181 2031 1904 513 705 243 -2431 611 4513 679 -3720 -1013 737 -1434
717 -1434 -1389 378 1042 236 -3173 -4111 177 2500 -786 -1985 948 787 -1662 -1973 1689 4094 1624
734 1624 -2218 -274 1826 -84 -259 2356 1954 -60 -746 -1887 176 3521 322 -3440 520 1337
750A337n853J444O359k403l947K507p46j743M336N60l702K552K014n277K5O102
766C565q24k959J617o43k216K561N49k181K554J027n554r57M700l63k451J083
782d92N52k149J69N4R6L120Q35m178j122M174M28k575J371L047j396l835K12L734
800B045Q17j902j5O05j491j105j40J363J665j142m097J32L945q78l030L159K609
817B540l672j515J753N37J471Q60k477n39K520j702j374L718J751l724k48J342
833A241j849R59J804k290m43K197l180k576M195K368l251o49R62j294Q13R80j304
850a317J610K232l706k431M232K379k722l47J413j106r18j35O81J995P24l403
866h19j173K849L38k060J436J872j408k928n44J826J556j842o64J185L88j764
$$ plain form
750 1337 -4516 -3072 3287 884 -3063 -556 -1302 -3045 1291 1851 -1851 701 2715 -2562 -2537 3565
766 3565 2741 -218 1399 756 -1460 1101 1650 -531 2023 3050 -2504 -3461 1239 876 -1575 -492
782 -492 60 -2089 -1920 -1866 -1770 1350 2185 -1993 -3115 1059 1487 -1088 283 3330 1934 -1901 -1689 2045
800 2045 2862 960 945 1550 59 -1046 -1186 177 1842 700 -3397 -3265 680 -198 -3228 -69 2540
817 2540 -1132 -2647 -894 -357 1114 1974 -503 -1042 1478 -224 -1598 2120 3871 147 -101 1241
833 1241 -608 351 2155 -135 -578 1619 -1561 -4137 58 2426 -825 -1474 -512 -1806 -993 -13 -1317
850 -1317 293 2525 -1181 -3612 620 2999 277 -70 1343 237 -681 -816 -135 1860 2584 -819
866 -819 -1992 857 1195 -865 571 2443 1035 -1893 -2437 -611 945 -897 -1561 -376 12 -1752
882a752l04K323K164q55k333j022K606M18j910R63J883j575k119J355J038N38
898A418J053j561j534J643q02k264J961K498l193k443J926j00j07J804k51j349
914a301J735k51l073K109M060j794k399J603r2p66J013QJ73J381j802k975J784
931e87K945k070j422K226q87j845j9N98J471O96k707j948K441J413j778L73K774
948A674J29k591m5J805J644n75j701N14P60j940r82J750Q15n60j571n75J164K93
966Hp26O72J624j128k860L31J221M26M08m68r60J339N18j667J440K855j123k280
984c70Q75j30m55J569k20k030J093P26k877L01M026r78l015R48Q57j656N94R61
1002B19l60R62p32k951P29M157j089k716J912J567k350j013J894J388K88j130
$$ plain form
882 -1752 -2056 267 2431 1576 -757 -1779 827 1245 -665 298 2181 606 -1513 -158 880 1418
898 1418 2471 910 -624 1019 217 -2047 -86 2412 -781 -3224 -1298 -1398 -1505 299 48 -1301
914 -1301 434 183 -2890 -781 3279 1485 -914 689 597 -169 844 852 1025 2406 604 -2371 -587
931 -587 2358 288 -1134 1092 205 -1640 -1659 -1061 410 1106 -1601 -3549 -1108 305 -1473 -1100 1674
948 1674 1803 -788 -833 972 2616 2041 340 854 1614 -326 -1308 442 1257 697 -874 -1449 -285 8
966 8 -718 -46 1578 450 -2410 -2079 -858 -432 -24 -492 -1452 -113 405 -1262 178 3033 1910 -370
984 -370 505 375 -80 1489 1269 -761 332 1058 -1819 -1518 2508 1530 -1485 -537 320 -1336 -742 219
1002 219 -141 821 89 -2862 -2133 2024 935 -1781 131 1698 -652 -1665 229 1617 1905 775
1018G75j212L90J528p33r06J304P63k748j310J809J444j248n28J098n97r23j5
1035a109J126N81k09j070j264R69J242p31m16J991M45j884m97J916L47j7M17j562
1053B75j000J590r26j537K339J296l094r26J905j53o14R91k64q07N03j001o14
1070b037K561J623k958o09K365l31r37M71J029L34o78j541K11K108q2k137O49
1087D1J225j504j047P38J224l86o71j173K06J048p40k48J995L38k091l67J241
1104a71Q91Q8m86k32L29k07q50L25J443M73r44j043L07Q64l7j047L63M00j332
1123h66o58O91M59L33R1r71k07J180p57n42J912Q09k199n75J574j51o1J050n30
1142E82m45R80j033j317K299J719l053j212K296m07j800J054R90o51r7l98j323
$$ plain form
1018 775 -437 -47 1481 748 -158 1146 1909 -839 -2149 -340 1104 -144 -672 426 -171 -1094 -1109
1035 -1109 17 598 389 -681 -1945 -976 266 -465 -881 1110 1555 -329 -826 1090 1437 1420 1837 275
1053 275 -725 865 -61 -1598 741 2037 -1057 -1983 -78 -231 -845 146 -118 -925 -422 -1423 -2037
1070 -2037 524 2147 -811 -1420 945 614 -323 148 1177 1511 833 -708 -497 1611 1529 -608 41
1087 41 1266 -238 -1285 -547 677 291 -380 -1553 -1347 -299 -1039 -1287 708 1046 -1045 -1412 -171
1104 -171 720 808 322 90 419 212 -638 -313 1130 1603 659 -384 -77 787 750 -297 66 466 -866
1123 -866 -1524 -833 -374 -41 50 -921 -1128 52 -705 -1247 665 1474 -725 -1300 274 123 62 1112 582
1142 582 137 1117 84 -1233 1066 2785 -268 -1480 816 409 -1391 -337 653 2 -95 -493 -1816
1159a816J399J302j810n92K281q89j814R19K383l44q61j53j60R53n0m48L10J085
1177A695j021j798N91J779n52r42J53N73j099o47Q37N66n1n17n29m93J040N92
1195A77j021L47J835r71j812J053J499k60l30P1o35J65P77r85K82J562l15k837
1213a398P14J395p33m54Q49o32p69J56m32O32J513p59j827J210J058j570P6J685
1231G14N06j036q26L41J002Q09j440j92J170o4j850K17J501K93p74j102j24J123
1249B68n29p23O91R74q67j333N57P86L83l42l61O16J5p00j51J337P64q36q31M29
1269A47L67J37l16K43M68m58j505J50Q97M56p82M8n13Q0J79m98j25J749l27j844
1289a447K38J495n45M0O37Mj95J14n77J23J838l46j844R4J980j594o31J048N45
$$ plain form
1159 -1816 -417 885 -925 -1517 764 -125 -1939 -1020 1363 1019 158 5 -155 798 748 300 610 1695
1177 1695 674 -1124 -533 1246 694 -248 -95 478 -621 -1268 -431 135 84 -433 -962 -1455 -415 177
1195 177 -844 -497 1338 367 -1445 -392 1107 847 517 588 -47 118 895 -90 192 1754 1439 -1398
1213 -1398 -684 711 -22 -476 373 -259 -1028 -872 -1304 -672 841 82 -1745 -535 523 -1047 -971 714
1231 714 1220 184 -642 -301 701 1510 70 -122 1048 984 -866 -649 852 1145 371 -731 -855 268
1249 268 -261 -984 -293 681 -186 -1519 -962 -176 207 -135 -496 120 135 -565 -716 621 1385 549 -282 147
1269 147 514 651 335 578 1046 588 -917 -767 130 586 -196 -148 -661 -581 -402 -900 -1025 724 397 -1447
1289 -1447 -1209 286 -259 -219 418 422 227 341 -236 -113 1725 1379 -465 -371 1609 15 -616 432 977
1308I77q73q71k1K19J003l12j106R57N71j591o75K261L27j580J79O12R9l54O07
1327D29k10Q11o1j147l5J132K49q77k67O78n01o64l91P82N25m81k86l59r2O65
1347a00Lm00N13K53r84o39J468Q92r56k98R4J20J21J50p11J575P27j658r87J447
1367F30N85j569K25R85o46j138J44J80P40K93j480j04J602m78j085J190J013j162
1385g5n43Q0L80L01K15l86L22O01q05p27J390P13p89o10K93j06m39O3k2K71k96
1406a69m39l40M76N89k13k33k34M31k83m33N81J023m60l16l89P34K5m2p9M31N74
1427A234r79p71N80J216o90q39L18k38k12k70j94N84O09j012r06J137R40j054
1445e47o5J352k25j115l8P39N39n3l50n87P83K66j293O92J532o71j417M20M36
$$ plain form
1308 977 104 -767 -788 -569 434 122 -984 -27 544 -1047 -1722 539 866 -714 -535 77 176 -178 429
1327 429 219 1030 969 -178 -213 919 1168 291 24 702 201 -463 -854 -72 453 -28 -314 -673 -765 -100
1347 -100 -97 -497 16 269 -715 -1354 114 1006 50 -248 -154 -34 87 237 -474 1101 1828 170 -817 630
1367 630 1215 -354 -129 856 210 -928 -784 -604 136 429 -1051 -1155 447 -31 -1116 74 1087 -75
1385 -75 -618 -538 -158 143 358 -28 294 895 90 -637 753 1466 677 67 360 254 -185 -122 -144 127 -169
1406 -169 -608 -948 -472 117 -96 -329 -563 -132 -415 -848 -267 756 296 -20 -409 325 350 308 229 660 1234
1427 1234 255 -516 64 1280 590 -249 69 -169 -381 -651 -845 -261 348 -664 -1570 -433 507 -547
1445 -547 -612 740 515 -600 -638 101 640 587 237 -350 433 699 -594 98 1630 959 -458 -38 398
1464C98j40jm67k14N72q31o89P08R64m12o26J93K69K06k19K05L62L56p01l57L02
1485a22J034k79m92J51N37p43l61L26O39m5p95k53J16K59q0k75K49M35p35r03
1505a337L59J356k26r39L71N89k14l20M93M63K41o35q86O58Q39p01j75Q78J62
1524I76j307j77P28L6L72n19q22N09M51r96k37J299J21j161l85J055j88K97j0
1543D2j54L67Jn97J91J150Q1j345K77L74k21j92m3P30p5l83o25j82P79K35r03
1564d93K6M02k77n01J35N71O71q58k19K10N46k4k21K66K85l1p52Q2J217J4j273
1585b24L30P69q70m78L44K64K62l42j100J32J091l31r16P68Q95j119k91O55M39
1604B78M4j88l33K83J38N1n09R97K74r50m66P52K6l13R5K41j68L4o96L6K22N79
$$ plain form
1464 398 258 257 -210 -424 148 -683 -1372 -664 300 -112 -738 -545 -276 -70 -289 -84 278 634 -67 -424 -122
1485 -122 912 633 141 292 829 86 -275 51 690 645 -150 -403 -287 -28 -108 -383 -134 301 -434 -1337
1505 -1337 -978 378 152 -787 -416 173 -41 -361 132 595 836 201 -685 -27 812 111 -64 814 976
1524 976 -331 -508 220 256 628 109 -713 -204 247 -749 -986 313 434 -727 -1112 -57 -245 52 42
1543 42 -112 255 256 -341 -150 1000 1081 -264 13 387 166 -26 -69 661 586 203 -422 -604 175 410 -493
1564 -493 -467 -65 -342 -843 -708 -137 534 -324 -543 -333 213 189 -32 234 519 488 -264 -182 1035 1049 -224
1585 -224 106 875 5 -473 -129 135 397 55 -1045 -913 178 -153 -1069 -301 594 -525 -816 -161 278
1604 278 322 134 -199 84 222 273 -236 761 1035 85 -381 371 397 84 179 420 252 286 -410 -374 -152 427
1626D27o88k94M17j53j67K11K12M17n49m38o1O02N17l52J20l0J9m63J25M41N87
1647I00o19o14L43K44K58p68K40K96m16m34n37Q82L88o26l18R25j45n06j74M98
1667a83P08m99j68n9Q19j63n96L15R70o69r09N92N83l4o28j12k80M57l62n08R33
1688B07K01n09q55O14L17l87J36K12j53M59m61k07M61R03o33l11K21L22m23l32
1708b18O64J09l8l47l26J76P34n54m17J3K60o08l18P59K83j10q31J99L40k96N80
1729E4k4K27j01m52j46R41M31q22k89J029k08r00j2J024n9m25l69j81Q0K52m69
1750d19j14O77j2j005kO08l3J32K17j99j23L08k18q0Q79j26o04k16Q08j81p7P3
1772B93J66k50k08O2k70M65j28m75l28O50p3k47n7K43Q7o61k48Q00N17m79k09
$$ plain form
1626 427 -261 -555 -138 -291 -458 -247 -35 382 -167 -605 -666 -64 453 101 221 191 210 -253 -128 313 900
1647 900 281 -333 10 254 512 -256 -16 280 -136 -570 -1107 -225 163 -463 -781 144 -1 -507 -681 -183
1667 -183 525 26 -142 -201 618 455 -141 174 1144 475 -434 158 741 707 79 -33 -313 144 -218 -726 207
1688 207 408 -101 -956 -342 -25 -412 -276 -64 -217 242 -219 -426 35 938 305 -6 215 537 114 -218
1708 -218 446 555 517 170 -156 20 754 200 -217 -204 56 -552 -870 -111 172 62 -769 -570 -230 -526 54
1729 54 30 257 156 -296 -442 499 930 108 -181 848 640 -260 -272 752 693 268 -101 -282 -202 50 -419
1750 -419 -533 144 132 -873 -875 -267 -300 -168 49 -150 -273 35 -183 -263 616 490 -114 -330 478 297 220 293
1772 293 459 209 1 63 -207 258 130 -345 -673 -23 -96 -343 -400 -157 -70 -731 -979 -179 338 -141 -350
1793c50L16J26J16m88N05N81k70o83M2M91Qo52O27L56m54p23p9O51n5l37j72J45
1815b99K86m92m45N59K45j60k46J24L60L05k59n7P41l11l40j77O60J67l29l65
1835c3p1K18Q6k49P8K79J85r13M6L37m9N8q9J35j91j8m02J9Q28J22p65J77M50
1858B38j6n05M29M84j35n41mK02M09k50n95L90J77k67k96Q2M34j91n12k51M66
1879b52J06m10K28O61K7q72m3M00O49l55j76J97K83pq26N19Q34m68n60J80j24
1900ip3J87k01J54L3m21k27L85M10l09q7L6j67K7r8k4N51J28l98k13N35J49j26
1923B42l26K91K74l63Q1k55L92L26p53oJ65J48l70l14Q38j66k73p01L12M18Rm87
1945e18M16L46j29p19M64M46r8r7m00M99M05m61J38J78Q1q6q25P35P7j10l65j66
$$ plain form
1793 -350 -34 92 208 -280 225 806 536 -147 -105 386 394 -258 369 725 271 -452 -531 120 65 -272 -444 -299
1815 -299 -13 -505 -950 -391 -146 -306 -552 -428 -68 237 -22 -79 662 351 11 -166 494 661 332 -33
1835 -33 -104 114 200 -49 29 308 493 -420 -374 -37 -86 -28 -117 18 -173 -191 -593 -574 254 376 -389 -212 238
1858 238 222 -283 146 630 495 -46 -50 152 561 311 -284 106 283 16 -280 -198 236 45 -467 -718 -252
1879 -252 -146 -556 -328 333 360 -512 -555 -155 494 139 -37 160 443 436 -390 129 963 495 -65 115 -9
1900 -9 -82 105 -96 58 91 -330 -557 -172 238 -71 -158 -122 -289 -262 -360 -384 167 295 -103 -316 219 368 242
1923 242 -84 207 481 118 199 -56 336 662 -91 -97 68 216 -154 -468 370 204 -69 -770 -458 -40 -31 -518
1945 -518 -102 244 115 -604 -140 306 208 111 -289 210 615 154 292 470 551 465 -360 375 452 342 -23 -189
1967a89J95q4o55J89P80k66o12K54K80j85Q8J86j68J57j72l5O3O10j06l08M04
1988D26M5k54N2j10R2M66m94k71J14J62j50j69j15P0K4l83K60K25K64n35j96L66
2010a11L69l39l22Q04L33o68l06K95O12j95n22J24L36ro11K60K93K30n42k36L10
2031A05M2k40l76L76J35n98j18L95M54N2l52q0M62l07j17J50L59J5l92LM34P4
2053D76k85L39l27j16L99r78J88N73n6k55j79O5k09J21k12L19J77o6q63M31L52
2074a06J4l5K27KL24m83o8L99L94l52l39M38Q9l33k39J99L24n85k61K45O4J66
2096H4l85k72Q24l94n13J58N64M28m06n17M35j08k63K19M86Q0m17j1L51K02k26
2117C19j38j35K04j90o1l16O69k73l90L6L35l33O1o5J65J24r7p0j21K59L84j88
$$ plain form
1967 -189 6 -78 -733 -544 236 -30 -642 -388 -108 -293 -205 -19 -187 -30 -202 -237 -174 436 330 22 426
1988 426 471 217 269 159 251 717 223 -48 66 228 78 -91 -206 -136 -112 -495 -235 -10 254 -281 -477 -111
2010 -111 258 -81 -403 401 734 66 -240 55 667 472 -50 74 410 401 -210 50 343 573 31 -205 105
2031 105 147 -93 -469 -93 42 -556 -674 -279 175 227 -125 -205 257 -50 -167 -17 342 357 -35 -32 402 476
2053 476 191 530 203 87 486 -492 -304 269 213 -42 -221 -156 -365 -244 -456 -137 40 -26 -889 -458 -106
2074 -106 -92 -127 100 102 426 -57 -125 274 668 316 -23 415 504 171 -68 131 455 -130 -391 -146 -82 84
2096 84 -301 -573 251 -143 -656 -498 66 494 88 -429 6 -102 -365 -146 340 420 3 -8 343 545 319
2117 319 181 46 250 60 -1 -317 352 79 -311 -275 60 -273 -212 -277 -112 12 -85 -155 -276 -17 367 179
2139A79n28N10l7j11rM31J23Jn23k15M14J12n56K79K99l33l10p6J24L29k75l93
2161e65L62K48l52l42N55L42l54j83K18L45P4o23N8O19L2n40k01Q84K47p95l4
2182ek9L08o5n12J25K96n9n48J22L33k01J04j28J18K42m24o0J51N32p4m86L05
2204D5L13j15RO1j04L9L6k34N8L26k29k05j95O01n15m0lR9J74k63l80K39K74l96
2228d05J52L16J76m31K5L03L77j6l79l8M22j64m78M16N7P6n63L43J67l16j56q1
2250a97R4J76n47J0N29K55m06k43L1M89k91j19q8M45q4m02L41M36K09m01j92K73
2272C18J06l56j45K84J39j59j95j94J53o9j28K12R0j41l5l16J87N85l43k40j94
2293d41N91j40j19M1J78J18l20p0J37O27k69k71J53J76k50m31N98k28M4l60r2
$$ plain form
2139 179 -349 161 124 13 4 435 558 559 36 -179 235 347 -209 70 369 36 -274 -350 -226 103 -172 -565
2161 -565 -203 45 -307 -649 -94 248 -106 -289 -71 274 348 -275 -217 402 434 -106 -307 577 824 29 -5
2182 -5 -34 274 209 -303 -178 118 59 -489 -367 -34 -235 -131 -259 -141 101 -323 -383 -232 300 226 -260 45
2204 45 358 243 252 313 209 248 284 50 108 434 205 0 -195 406 -109 -149 -152 -53 121 -142 -522 -283 -9 -405
2228 -405 -253 63 239 -192 -167 136 513 497 118 80 502 338 -140 276 333 409 -154 189 356 40 -116 -197
2250 -197 -103 73 -474 -464 65 320 -86 -329 -298 191 -100 -219 -307 138 54 -348 -7 429 638 237 45 318
2272 318 424 68 -77 207 346 187 -8 -202 -49 -118 -246 -34 56 -85 -120 -436 -249 336 -7 -247 -441
2293 -441 150 10 -109 -68 110 228 -92 -162 -25 602 333 62 215 391 141 -290 308 80 124 -236 -328
2314c28K67k30p2K81J1J21k99k98L87J82q6k20O62j86k16j37K54L83j90l03L4
2335A7K32j34p3K3K32l59k37J93L17k36J2k26J2p6J91k63j68M13K02k62RK8J64
2358A1L0J45k9j37k19K87k97N28K0j42k96L72j8n29N6L13K96n21j61K13J31j41
2380h8m11L81J89k21l80K56M13Pk59O1M62l67P7l14O04J46p91J11L82J14j26J82
2402D28j73n0l12k70J43J91K02l36k53K14J96k67j9K82L32l49k23J12J91n3k40
2423b54K87J74j31p2O6M3K28k37K8p5J11j28l80L55j41J30l01k38P29m9l57j7
2445b29O3j20j19r7N73k09j57J2L31J69P0k80K90K00k23n12L73M73j50k88j80
2466a0Q1k17k5k5M17Oo73j8L19R7k30L05k04N09n69J74J91R3L12n64K52L5r1Q
$$ plain form
2314 -328 -61 -291 -363 -82 -71 50 -249 -547 -160 22 -64 -284 378 192 -24 -161 93 476 286 -17 17
2335 17 249 115 42 65 297 -62 -299 -106 211 -25 -13 -239 -227 -303 -112 -375 -543 -130 72 -190 -181 -153 11
2358 11 41 186 157 20 -199 88 -209 319 339 197 -99 273 255 -274 -218 95 391 -130 -291 -78 53 -88
2380 -88 -499 -118 71 -150 -530 -274 139 146 -113 -52 410 43 120 -194 410 556 -235 -124 258 372 246 428
2402 428 255 205 -107 -377 -234 -43 159 -177 -430 -216 -20 -287 -306 -24 308 -41 -264 -152 39 -14 -254
2423 -254 33 207 76 4 70 113 341 104 132 57 168 40 -340 15 -126 4 -297 -535 194 145 -212 -229
2445 -229 -166 -286 -405 -502 71 -138 -295 -283 48 217 287 7 297 497 274 -238 135 608 458 170 -10
2466 -10 71 -146 -171 -196 221 227 -446 -464 -145 -48 -278 27 -177 332 -237 -63 128 221 533 -31 221 256 165 173
2490A73J4k02M38k37k88K7M33m45k5O7n8l00J57K1P4M24l85m87K28L97Q9m68K43
2513a10M93l73p3r4L51J99k66PM06k20m53PM89n9j17l76P7M43k70m76L31J99k0
2536I5o37K47L82q5k76LL15j11k11j02P45k7j60l59M25O4j67p8M9K28J14m28j07
2559h1M56k73m4k55J76l34K22l3J72p8O6o6j66J62N8j31j03L80or7kK14J5K00
2583D52n32%N03k36O0l42M07k08k00PJ36Ll41P5j19L46j81m69Q05j82J29o09J84
2606c12L37l0j60M7P08j93m99K49L75j13n60n9N37k12m99J12M17K20o36m5L81
2627F5l51J05L8R4N4j4j59k30M60j19M0k2K02j15k2K78Q1k16J08L6n17L02K90
2650C88l51jN3K0P1l00L25k39R6k79l27O10J09l93j4K08q8j58M8L52N9k42j08
$$ plain form
2490 173 187 -15 423 186 -102 -75 358 -87 -112 -45 -103 -403 -246 -225 -151 273 -112 -599 -371 26 115 -353 -110
2513 -110 383 10 -63 -157 194 393 127 134 540 320 -133 -126 363 304 187 -189 -112 331 61 -415 -84 115 95
2536 95 -542 -295 87 2 -274 -271 44 -67 -278 -380 365 338 178 -181 244 308 141 63 112 340 454 26 -81
2559 -81 375 102 58 -197 -21 -355 -133 -166 6 -72 -6 -72 -238 -76 -18 -149 -252 128 122 25 23 237 252 452
2583 452 -80 -80 423 187 247 -95 312 104 -96 -89 47 50 -291 -216 -335 11 -170 -639 166 -16 113 -496 -312
2606 -312 25 -5 -165 -118 590 397 -102 147 522 409 -151 -210 327 115 -384 -272 145 365 -271 -316 65
2627 65 -286 -181 -143 -49 5 -9 -168 -398 62 -57 -17 -39 163 48 26 304 385 169 277 313 -204 98 388
2650 388 37 36 89 109 180 -120 205 -34 62 -217 -544 66 175 -218 -232 -24 -112 -270 -222 130 189 -53 -161
2673a61K40K41l72j12M38J24j70m40K93K24l36j16K71o4j25l25K93L56J9n02j6
2694b40Q2R2j53O1K75o3l50J09m8K12J11J60j08O2J11q4k90K4K32j08j77m0K5
2717a05r9K76M6k05O6j19l33M93k61K22l10K45J55k67R9J38L0P5k6J9K61j63k39
2740bo0L86P4l52l43O14k45k07j66K15K19k30j23k0K35M8m31J13K20n5L4j29K46
2763D1L5l16J10J49L01k99K02J9j07N9J45o6J35n2k83k38K33J0l06K93m37L74
2785Bj9k98J83K9mM7M5R4j64J17k05N3J24k44M57Q0O7n0j78k1K76k03k88N4J08
2810F2K22n38K78j65L77m71j47K53K25m87j1O26Qp6m01K27J27o7O0J92J04J10
2832E08n19N6L50p3l53O1M42l01k53L4L13Lp2m24J56qo5q6O9J08o8m7L65l87K45
$$ plain form
2673 -161 79 320 -52 -164 274 398 228 -212 81 305 -31 -147 124 60 -65 -390 -97 259 278 -224 -240
2694 -240 -158 -66 -219 -158 117 54 -296 -187 -235 -23 88 248 140 202 313 229 -61 -37 195 87 -90 -130 -105
2717 -105 -204 72 118 -87 -21 -140 -473 20 -241 -19 -329 -84 71 -196 -97 41 71 146 120 139 400 237 -2
2740 -2 -62 324 398 46 -297 317 72 -135 -301 -86 133 -97 -220 -240 -5 43 -388 -275 -55 -110 -76 -205 41
2763 41 76 -240 -130 19 320 21 223 242 135 194 339 273 408 356 73 -165 68 78 -228 65 -372 2
2785 2 -17 -315 -132 -103 -107 -60 -15 79 -85 32 -173 -120 4 -240 217 297 364 314 136 115 391 188 -100 -46 62
2810 62 284 -254 24 -141 236 -235 -382 -129 96 -391 -402 224 232 156 -245 -18 109 42 102 294 398 508
2832 508 -11 45 395 322 -31 30 472 171 -82 -48 265 268 196 -228 -72 -80 -145 -231 -162 -54 -122 -169 196 -191 54
2857E4k2lK89k60k80J24J46j14O52n65N6R1M4l4k87K32ro1k03k59M35Rm12J47
2881b30J92L23n52p7M63o8l71P6K28RJ35K0n4K62j62k08R9M59l70j97Q4K23l02
2904a8nk39N98j03k12k69J72k25j3J19J51K08m73N2K34J68m59J80J17R2k83K85
2926G7J00J75k02j95J22L19m13R5j01M7rl5k48J67K59l04l1j05J86R6k97R0J2
2949a95J40L9k2k53K09O14m88J6J52l2j66j25K10K18l28j76J36K38j01k90J74
2970c0j60J58n34L88K00M1l80K75J5k91P1Q9L21L3k03j77M64k0k4l70M97l6k00
2993A27m6r3L34l54J3J03k37L01j5m11n3L24N4k81L69k47K32jk29l8J05L0N9J3
3017E9N5K2l4M0J51j98k33J75L11l2l26lK14n5k86j57L10R8m91K94J49l7j83J15
$$ plain form
2857 54 32 29 318 58 -222 -98 48 -66 586 21 77 168 212 178 -109 123 114 53 -150 -409 26 35 -377 -230
2881 -230 -38 285 -267 -344 119 51 -320 -244 -16 -7 128 148 94 356 194 -14 85 544 174 -23 61 284 -18
2904 -18 -23 -262 336 233 21 -248 -76 -301 -314 -195 -44 164 -309 -257 -23 145 -314 -134 -17 75 -208 77
2926 77 177 352 150 -45 77 396 -17 78 -23 24 15 -20 -268 -101 158 -146 -177 -282 -96 0 -297 -207 -195
2949 -195 -55 -16 -38 -291 -82 532 44 60 212 180 14 -111 99 317 -11 -187 -51 187 86 -204 -30
2970 -30 -190 -32 -566 -178 22 63 -317 -42 -27 -318 -247 -158 163 196 -7 -184 280 260 236 -134 363 327 127
2993 127 81 -12 322 -32 -19 84 -153 148 133 -278 -331 -7 47 -234 135 -112 120 119 -110 -148 -43 -13 46 59
3017 59 114 136 102 142 293 95 -138 37 348 316 -10 -13 201 146 -140 -297 13 111 -380 -86 63 26 -157 -42
3041d2L1o8q2j23L74m3l0k68N7K42n6J02mK80k80j86K1M66j29n3r1q2k32m3j64
3066d03K00K48n6l33M67l88J7J26Q8lq8K11M9j01K7J92L9k66J62L5p7kq1K02j12
3091A53R7l06J57J55l15MJ0J83j21k64J20K05l01J01K30R1l70J17K1L8R9j85o7
3114a48M50M5o01L77p1K38r1m81M20k83J77l75N28k94p2O3P8k59K2J01q7J20p
3137a50K44j65K3M0M8j65L08K6l23J32L40j87J17oj68J58l1qn4j45K24l22P7n2
3161c9K8N1j40r5L00j82j91J03L40j17m9p7K29J63l34k20O21l46Q6j27Q6K92k33
3184A49J32n2j30j50j82K05J7q7k3q6QL0r8J05J01n7k04L01K4m4R0N4J08M4q0
3209A75m5J47k04K34l25R2P6r3Lj33J86r8j05Q6o5j05J35N9k36K16K8np8L8O6
$$ plain form
3041 -42 -11 -79 -161 -284 90 47 17 -251 -194 48 -8 94 90 370 90 -96 -75 391 262 209 118 36 -196 -239 -403
3066 -403 -203 45 -11 -344 123 -265 -248 -122 -34 -37 -125 86 135 34 61 253 292 26 188 223 146 144 63 265 153
3091 153 250 -56 101 256 -59 -55 -45 138 17 -247 -127 78 -223 -122 108 199 -171 -54 -33 5 104 -81 -148
3114 -148 302 347 -254 123 52 290 199 -282 138 -145 32 -343 185 -109 -181 -118 -40 -299 -277 -176 -263 -143 -150
3137 -150 94 -71 -48 -8 40 -125 183 209 -114 18 358 171 288 282 114 272 241 233 179 34 258 -64 13 -39
3161 -39 -11 40 -100 -195 105 -77 -268 -165 175 58 9 -68 161 324 -10 -230 391 45 131 4 90 382 149
3184 149 281 229 99 -51 -233 -28 -11 -98 -121 -207 -199 -169 -267 -162 -61 -118 -322 -21 3 -41 49 103 211 255 175
3209 175 130 277 73 307 -18 74 150 57 60 -73 113 15 -90 -4 -69 -174 -39 20 -216 0 28 23 -55 -17 49
3234D9j23O8k10L39J16j64M3j28J90r6M1P5m8j60j26L19j68q4m4K39k18r0k2J67
3258c5R7k85J30O5K7L6k40L77k39J69J17j16J08J8l88L24L1p0Q9k93R1j43K4J16
3282A0Q2L5l51L06j39q2M1k30J42J30N4l62L56j23M2J92J7K8k02L18k07R8J25
3305B80j81Q0o2J36q4j38r1J08K1k48j62K71J88j81j38M5J9j76K08J93K48k05
3327A31l24J26P3k6K15j16L5J10k84O6J67K4n8k35P7J4R8j24p6k0n3Q9j07J71
3351b7J64l51J20m0K24L8j53j42L43K5l99J46J29j90K33k09J98k1m9j22K99n6
3373A60k83J63lP3l4l66L71J88l93n4j85J36J28j28J49M5K04k02Q0k58L66k3m6
3396H8j99J02L9j02nJ99N4Rk13j26K42k26m9J59L3k11J07lJ25j92k01M06j8r1
$$ plain form
3234 49 -74 -6 -216 123 239 75 118 -10 180 84 125 200 152 -8 -134 185 17 -67 -111 128 -90 -180 -202 -35
3258 -35 62 -223 -93 -28 -1 35 -205 172 -67 102 219 103 211 229 -159 165 196 126 215 -78 13 -130 -106 10
3282 10 92 127 -224 82 -57 -139 -98 -328 -186 -56 -2 -364 -8 -131 -89 103 120 148 -54 264 57 155 280
3305 280 99 179 117 253 169 31 -60 48 69 -179 -341 -70 118 -63 -201 -156 -137 -313 -105 88 336 131
3327 131 -193 -67 6 -20 195 79 114 224 -60 6 173 197 139 -96 -19 -5 93 -31 -107 -127 -180 -91 -198 -27
3351 -27 137 -214 -94 -134 90 128 -25 -167 176 201 -198 -52 77 -113 120 -89 109 88 39 -83 216 160
3373 160 -123 40 37 110 76 -290 81 269 -124 -178 -363 -227 -99 -227 -78 -33 171 -31 49 -209 157 134 88
3396 88 -111 -9 30 -72 -77 122 176 185 -28 -154 88 -138 -187 -28 5 -206 -99 -102 23 -169 -370 36 18 -73
3420g3NO5K28k5j93l00M76o2j37n4J31Q6p2j3Oj25P0j94J12J47J49j73k66l1J02
3445a41o1R2k0J24J1l1k04K47n4KJ26l3L04k69l42K62K20pk6k90RJ56k76m5J54
3470i2M92o09n6M13n0m5j27l5J65k89J16p0K36j35j37M20l31Q3k9l0L53l7k51
3493d5J27P2j17J68l66l7N33m14k5J69%j12j78J15L5j88J68k52L44n9o1l0M6K21
3517A14Oj27R3K1j5j74O7p2L34n0k11Q7m7p7J64k3j82J52j93J36L15l29j88k3
3541b22lK87j98j24L39n2j00J70qJ31k46Rkj16K67j15j7K75o5n76N82j89p9J28
3565G6K60m33O5j86J89J50l3j3p3j31r2J20kQ8J96k86j23K43J40lJ75j49k5J0
3589A63j20k3j45J79J21l15N6Q1P4L3o9k19J70j00k30K14J50k36P2O0P4q6o8K33
$$ plain form
3420 -73 -68 -3 225 200 7 -293 183 121 -16 -70 61 147 75 62 68 -57 13 -181 -69 78 227 54 -212 -243 -141
3445 -141 -202 -110 -130 -6 5 -26 -230 17 -37 -35 91 58 362 93 -249 13 233 226 200 -90 -81 75 -201 -246 -92
3470 -92 400 -209 -265 148 98 53 -74 -109 56 -233 -117 -187 49 -86 -223 197 -134 -51 -80 -110 243 206 -45
3493 -45 82 154 37 205 -161 -198 335 -79 -104 65 65 -47 -225 -110 -75 -263 -95 -347 -3 -62 -123 -153 -107 114
3517 114 120 -7 86 107 92 -82 -15 -87 247 197 -14 73 26 -51 113 90 -92 60 -133 3 318 -11 -199 -222
3541 -222 -225 62 -136 -260 79 27 -73 97 89 220 -26 -17 -19 -135 132 17 0 275 210 -366 216 27 -52 76
3565 76 336 -97 -32 -218 -29 121 88 75 2 -129 -221 -101 -103 -15 181 -105 -228 15 155 152 327 178 153 163
3589 163 43 20 -125 54 175 -140 -84 -3 71 104 35 -184 -14 -114 -344 -130 20 -216 -144 -84 -10 -96 -164 69
3613F9K73j84k9q4k5M2k26K28P3r1p2j17p9N04m34l5J93k05j00J12K12J1Q6j08
3637A4j53K10j50j10k3L45N2k01L19j32j29J40K5r5j33K27j4j03L6m6j50J31R9
3660A59k58m1J27O9j27K16l68M3R6J06j73N1J24m7P9j84r7Q1J13r8O2K10n2j16
3684b5J45l9R6l34M4K24j53J41j69M2Q9J3m6j8R5l33J15J79J92k17oJ8J61n06
3708b92L62J17J74l32q1l8L15k00o7K33k14m7Q5P8k75J3O1Q7r2J07j07K15l46
3731b44J86L5j62K47jl58N22j96O1J12k40L80m22K24J60j29k59J75j17j11J04
3752c3J59q4j24p2J61n7k3k77K26J23J23o6k34K41k01p8L5L54k74O7J57m4R9k64
3776h6K9K5K05j2l37k1K77n3k29k7J62Q5K0k32K30K3q1K7J5j21O0q7K78j28J81
$$ plain form
3613 69 342 158 129 45 20 62 -164 64 137 46 -26 -143 -222 282 -152 -187 6 -199 -299 -187 25 36 122 14
3637 14 -139 71 -79 -189 -212 133 185 -16 303 171 42 182 207 112 -21 206 192 89 125 79 -71 60 159
3660 159 -99 -140 -13 56 -71 145 -223 -180 -84 22 -151 -100 24 -23 56 -128 -225 -144 -31 -129 -67 143 91 -25
3684 -25 120 81 177 -157 -113 111 -42 99 -70 -28 61 74 28 10 105 -228 -113 66 258 41 35 53 214 -292
3708 -292 70 187 361 29 -52 -90 225 25 -42 191 -23 -70 15 93 -182 -169 -108 -21 -113 -6 -113 102 -244
3731 -244 -58 -23 -185 62 61 -297 225 29 90 202 -38 342 -80 144 304 175 -84 91 -26 -137 -33
3752 -33 126 42 -82 -154 7 -50 -73 -350 -124 -1 122 56 -178 63 -138 -216 -181 173 -101 -34 123 79 178 -86
3776 -86 -57 -32 173 161 -176 -197 80 27 -202 -229 -67 18 38 -194 36 59 -22 5 20 -101 -41 -128 150 22 203
3801B03k25R2N8R2l04l0L74l0l35J24o8J43q5K62l50K7m2N4j89J64J53j65J45
3824F8j67J73j88J17J1j15O1R2J07M7k09k33k6K12J39k28J68J42j38J79Lj44j07
3847c6r4K20k16j89K48K2L3J02k47J23N8j22J83k1K71j93k70j30K99q7J69P3j21
3870G5J11j92J96K25k97j1j54j40J48k36O2M18m17K22o6M6m6j63J51O3k3J4J53
3893A39m9j34j60L01N2jj14k0K9M0Oj99L61k38J10j18P9j00j96L5K00j25j46L30
3917H2J06k23Qp3o9L27j83J19m9J57p6k46L01J67n41K90l2j36K88n8k3k38K7J28
3941E3K45l03j32K30l5j27l0J1L16m96J60j01J51M6P9j94K55q2n8L37l74J52n00
3964c97N66j68R5Jj11L19m83P9K0J60Qj42J83j22p4%K65l50L17k98J41m1J38k08
$$ plain form
3801 203 -22 70 128 220 -84 -114 260 230 -105 19 -49 94 9 271 -79 -52 -94 -40 -229 -65 88 -77 68
3824 68 -99 74 -114 3 14 -101 -40 52 159 206 -3 -236 -262 -50 89 -139 29 171 33 212 215 71 -36
3847 -36 -130 90 -126 -315 -67 -45 -12 90 -157 -34 24 -98 85 64 335 142 -128 -258 41 -46 123 196 75
3870 75 186 -6 190 415 118 107 -47 -187 -39 -275 -213 205 -212 10 -56 -10 -56 -219 -68 -5 -28 -14 139
3893 139 90 -44 -204 97 149 148 34 14 43 83 89 -110 251 13 123 5 84 -16 -212 -177 23 -102 -248 82
3917 82 188 -35 -27 -100 -169 158 -25 94 45 202 126 -120 181 348 -193 97 65 -71 217 159 136 -102 -75 53
3941 53 298 -5 -137 93 58 -69 -99 -88 228 -268 -108 -209 -58 -12 67 -127 128 46 -12 325 -49 103 -397
3964 -397 169 1 96 97 -14 305 -178 -99 -79 81 89 -53 130 8 -66 -66 199 -151 166 -132 9 -32 106 -102
3988a02L29k73M7o2K45j17j6L58l45J36k05OmQ1j52J01k30J31J35j02j19J21J76
4011A39Q2o4j67k2N7J06j46n1P4Q7n0J09j41q9J00M8j70N9J07l30K95q0j53K44
4035D4n2j08K77j46O0o1l29L39l5j57K43k2j45j1J87N0L6k38K28J4k02J69mj28
4059IJ16j5N2K41m99N4j04K76j75K4M4j29L04j86Q2j61q3J55k0L3k52j73M54k07
4083a60L1M01n00K77l3J99k24p9O5K5Kk00J98J7J35l07J96k64M20l53K60j22K
4106a4P6j17j40K33Lk13J23J62J15l39K77k61J93p4rm5MJ48N4l44K85K9j18p6
4130d8m0o9j29M00K4j92k0Qj01Q2J76m4j56M7J04O9J14p8j46j3J00j4r5K20M7
4155B46j34j86J50n4Q9Q7k40j34L69m36L97o3l53J37K07l4l74N08k07O6Q5J48
$$ plain form
3988 -102 227 -46 1 -61 184 67 51 409 64 200 -5 1 -3 78 -74 27 -203 -72 63 -39 -158 -37 139
4011 139 221 157 -10 -32 25 131 -15 -66 8 95 45 154 13 -76 24 72 -98 -39 68 -262 33 -47 -200 44
4035 44 -8 -116 161 15 75 14 -315 24 -11 -168 75 53 -92 -103 84 134 170 -68 160 174 -28 141 137 9
4059 9 125 110 162 403 -96 -42 -146 130 -45 -21 23 -106 198 12 94 -67 -150 5 -15 18 -234 -407 47 -160
4083 -160 -129 272 -228 49 16 215 -9 -88 -23 2 4 -196 2 19 154 -153 43 -221 199 -154 106 -16 -14
4106 -14 62 -55 -195 38 41 -172 -49 113 228 -111 166 -95 98 24 15 -30 -26 122 176 -168 117 146 28 -48
4130 -48 -88 -157 -286 114 138 -54 -74 -66 -167 -85 91 47 -109 -62 42 111 225 147 1 -12 88 74 -21 199 246
4155 246 112 -74 76 22 111 198 -42 -176 193 -243 154 91 -262 -125 82 48 -326 182 -25 41 126 274
4177B74j05j54j86J47J3J20k3l5j36j07L06j30P4j69j37J40R4j98RK59M8k82L13
4200A35r0J44l06K5K06j24j33K1M51m04N55o11j9K32J28j23J43j38r8J03p6o9
4222d8J15l1o8L0R0j91J0k2K14j81J70j9J22k28J52l34L3K59L9J68n12MJ47M6
4246c5l7k1MJ78K46l45J65o5j34K25m73K21J67j11j29J49J0j49q6J71j05J46J12
4269A04q0j89L98r3M2j59M0j18J32R5j25q8L51m83q7J0K80j52N7N4k32L3L05j82
4293h7oj10J87L2k2O7n4o4O4jP4k25L22k88L15k53R6J01J20l55nj31M66k84Q1
4318D0n10M33J86l04J73r0J49j08J02k99M46l40J47m4N1l3O4j96M39k95J91k84
4340h2J08Ro6o1J4M21j55l23K67k34Q0m0j71K76j8k7j79J83M6r4k5o3qN2r7J70
$$ plain form
4177 274 169 15 -171 -24 -11 109 86 51 -85 -192 114 -16 58 -111 -248 -108 -14 -212 -203 56 104 -178 135
4200 135 45 189 -117 -92 114 -10 -143 -122 329 -75 480 -131 -150 82 210 87 230 92 -6 97 21 -48
4222 -48 67 36 -32 -2 88 -103 -93 -115 99 -82 88 69 191 -37 115 -219 -186 73 112 280 -232 -228 -81 -35
4246 -35 -72 -93 -89 89 335 -10 155 90 -44 181 -292 -71 96 -15 -144 5 15 -134 -220 -49 -154 -8 104
4269 104 24 -165 233 140 182 23 63 -55 77 172 47 -41 310 -173 -260 -250 30 -122 -65 -11 -243 -210 95 -87
4293 -87 -93 -203 -16 16 -6 61 7 -57 7 6 80 -145 177 -111 204 -49 47 148 268 -87 -92 -223 243 -41 40
4318 40 -470 -37 149 -155 18 -72 77 -31 71 -228 218 -122 25 -19 32 -1 63 -133 306 11 202 -82
4340 -82 26 35 -31 -92 -78 343 188 -135 132 -102 -22 -62 -233 43 25 -2 -181 2 48 -46 -71 -134 -142 -90 -187 -17
4366a7J84pj01M3j5l27L48k16k76M00J28j26M2J76k51j21K3J87l93K71n3q5L65
4389A79m44J69J43R0k23Q1J23k4j44j1k0M5J58j89J37J70l5J4j89J10Q1m50J43
4412h6J69m10K49L3J0m6j9O6n5K74k53o7M0L98j43l39K14J94m33J12J36k40L47
4435A51j0J05m25M20m01J20j00P8J7Q9OJ15p0k34j46L35j05L28k32j23j43J37
4457h8n1K25k00P9K67J07k61J36k57p6L03M7r0k45K92k68J22j08n5K95l89k53
4479d68K50J45R5l31J19J55J43o8k50L66l57J48J91J47j49m7j01N0P7j03j90J52
4501b6J18j34J15PJ05j37j6q8o2K28k42k02K88n9J41l07L01Q5q4j15R3j06J08
4524A1K12k54J70m11J09Q4J45r6j01J7M5J84j17j61O3rJ56j10M6j26O0N6N8o4
$$ plain form
4366 -17 167 160 59 102 87 -240 108 -108 -384 16 144 18 60 236 -15 -136 -113 74 -319 -48 -101 -186 179
4389 179 -265 -96 47 137 -86 -5 118 94 -50 -61 -81 -36 122 -67 70 240 205 219 30 140 221 -229 -86
4412 -86 83 -327 -78 -45 -35 -81 -100 -34 -89 185 -68 -135 -95 303 160 -179 35 229 -204 -92 44 -196 151
4435 151 141 246 -179 241 -160 -40 -140 -62 -45 44 50 165 95 -139 -285 50 -55 273 41 -82 -225 -88
4457 -88 -139 86 -114 -35 232 339 78 214 -43 -119 184 231 141 -104 188 -80 42 -66 -121 174 -215 -468
4479 -468 -218 -73 22 -309 -190 -35 108 40 -210 156 -201 -53 138 285 136 89 -12 38 115 12 -178 -26
4501 -26 92 -42 73 80 185 48 32 -56 -118 110 -132 -334 -46 -105 36 -271 30 115 31 -84 9 -97 11
4524 11 223 -31 139 -272 -163 -79 66 -30 -131 -114 -69 115 -2 -163 -100 -109 47 -63 -17 -143 -83 -27 31 -33
4548c3J99N6k54n7L8j11J88L3k67L15j89J50k03J74j37K29k01K54J08l66j12K73
4570H7j84m1J20j84K11J04M0j47k10K12m3J75j28J55j24Q2j92K28M4n8j62N3J6
4593E4n9K30j94o8N3j62K09o2J41j79o0K19l73J59j65L66k87J32L1J32j11j85
4615a79K55Q6l0N5M8Ll07j43J15pK19j50L3r8J44j82L11k40r9J3Q1N8J08m2j51
4640i9M0p1J04q5L27k11j45m4K15L10l13j91J38K90j94J98k57j17J46K20k79J32
4662A14k1j8j46l5K96k70R9l7K8j17j36J44l2j9M12k03j26k9K3J2K72k81K86k33
4686a7J9k35J92k59J41K00L9j51J79q0Q0k4M8k66RJ62k29p3L05k12O5J69n1j28
4710a17K65j66OQ1j9m7J48R3p4j68j02N2N2k84K58O5m0J5k28Q1M4k8K8O7m9J30
$$ plain form
4548 -33 166 222 -32 -89 -51 -162 26 59 -208 107 -82 68 -135 39 -98 131 -70 184 292 -74 -186 87
4570 87 -97 -138 -18 -202 9 113 153 6 -204 8 -35 140 12 167 43 125 -67 161 205 147 -15 38 54
4593 54 -5 225 31 -37 16 -146 63 1 142 -37 -97 122 -251 -92 -257 109 -178 -46 -15 117 6 -179
4615 -179 76 162 132 187 235 238 -69 -212 -97 -104 115 -35 -2 -100 44 -138 173 -67 -166 -153 -72 -14 94 52 -99
4640 -99 -59 -130 -26 -111 216 5 -140 -184 31 341 28 -163 -25 265 71 269 12 -105 41 261 -18 114
4662 114 93 75 -71 -106 190 -80 19 -18 10 -107 -243 -99 -131 -150 262 59 -67 -96 -73 -61 211 -70 216 -17
4686 -17 2 -233 -41 -300 -159 41 80 -71 108 28 108 84 132 -134 -125 37 -192 -265 40 -172 -107 62 11 -117
4710 -117 148 -18 -12 69 50 3 151 244 170 2 -100 -48 4 -280 -22 43 3 18 -210 -129 -85 -113 -85 -18 -67 63
4736F3K2j96J44q5L56k25M6J8N7m68J95k5J68q9PL72m01l3Q4j43K25j6j02j30
4760a56P5J35K7k8J80l80j53K77K60j24j55J75j89P1J07k42J11L3K7L80j95l02
4782f6l03L07K01k21j50K82k47J27QJ17N1j82l9R4k06J54J25k13L36o4j37K8n5
4805e3M5M56m15l24K00J64L1J16r2l83J02P1K07k14L53m12J4M6j03J93l8J34k11
4828a13Q5jJ14l57L41j58N9J64O5j61j36j11M53k46m5k64J15L24K8k16R1J78k81
4851g2J50j28J8l5J32k71J90ol7J74Lj45k2r2K08O2j49L24j66l8k19K67K8k61
4875h5r7K44m4j68l7K28j10NqK40n2k63J31J55q9J65l06L5Lr5L36k88M3j14R8
4900g3M7p3K42o1J71l22J04Lk2q6K9r7K35p9kl55K26j38K8M8K75Pj00P2j5N6Q4
$$ plain form
4736 63 85 -111 33 -52 304 79 125 143 200 -268 -73 -98 70 -19 -12 360 -41 -74 10 -133 92 76 -26 -156
4760 -156 -81 54 81 53 233 -147 -300 -23 237 113 -42 133 -56 15 122 -120 -9 24 51 431 236 -66
4782 -66 -369 -62 139 -82 -232 50 -197 -70 -62 55 106 -76 -115 -21 -227 -73 52 -161 175 111 -26 2 -53
4805 -53 -8 448 33 -291 -91 73 104 220 128 -255 -153 -82 125 -89 264 -148 -134 -88 -191 2 -36 98 -113
4828 -113 -28 -29 85 -272 69 -89 -30 134 199 38 -98 -209 244 -2 -47 -311 -196 128 156 -60 31 209 -72
4851 -72 78 -50 -32 -67 65 -206 -16 -22 -59 115 118 -27 -49 -141 67 129 -20 304 138 100 -119 148 176 -85
4875 -85 -182 62 18 -150 -187 41 -69 -64 -72 168 116 -147 -16 139 50 215 -91 -56 -53 -148 188 -100 -57 -171 -73
4900 -73 -26 -99 143 82 253 -69 35 38 16 -70 -41 -138 97 18 16 -339 -113 -251 -223 -175 100 107 7 79 64 120 204
4927B04r1j54j00Qj3K08j43J03q5J61L8P5k37r8L4K25j01K4j89J19q1m6K40j59
4951e8j8j36J84N2Q9O2m23J79K3J98j48j68K04n4N9j79J92k81l2L03m3Q8k8K1
4975H6K2j37j08J89Q7j70J1K8K65j71k75K86k51L03j52J26j31J45q6M5k5j04n0
4998f7N2R9j73L36l72Q0L3j57K4N7N8O5p9N3j65J25J97j69L6l4J0j7j61L8k5K14
5024E8q6K10J15k68M1j12J36j79K85j19k21K49j05q2J88q1j26K47j65j61K60k26
5046a42o5K81j20l19O39l24J00R1k17J85q4l7j20L88k36L7J7k70O4K65j14N5j13
5069c9m6R3Q0j94J90j9j92J63k36J14J31q3Q1j74J41j17J30LK14q9K8k74J46l8
5093A3p5K96j36k36K15j52J68j66J43k44M72j62q4k1j05L80l22R0R7r7k65J09
$$ plain form
4927 204 113 -41 -141 -133 -146 62 -81 22 -63 98 136 211 -26 -124 -90 135 34 58 -131 -12 -93 -139 101 -58
4951 -58 -76 -212 -28 24 113 175 -248 -69 -46 152 4 -164 40 -14 45 -134 58 -223 -255 48 5 93 65 86
4975 86 108 -29 -137 52 139 -31 -20 8 273 102 -173 113 -138 165 13 139 8 153 67 112 87 -17 -67
4998 -67 -15 84 -89 247 -125 -45 -12 -169 -145 -88 -30 35 -44 9 -156 -31 166 -3 33 -1 9 -8 -169 -131 -156 58
5024 58 -28 182 297 29 70 -42 94 -85 200 81 -140 109 4 -78 110 29 -97 150 -15 -176 84 -142
5046 -142 -207 74 -46 -365 274 -50 50 141 -76 109 25 -12 -132 256 20 57 74 -196 -132 133 19 74 -39
5069 -39 -85 8 88 -106 84 65 -127 36 -200 -86 45 -38 43 -131 10 -107 23 26 240 151 179 -95 51 13
5093 13 -62 234 98 -138 77 -75 93 -73 70 -174 298 136 52 31 -74 306 -16 74 171 74 -191 -82
5115h2K13R9j95j7K41J00l62P3M4n2n4k66K70M1j57K30m7Q3k76J70p6o9P0M8j70
5140a41J72k72J09J11R3k8J3k25J1J19k0K29j1l20K78j47K13p8j32j8j53J21N2
5163b4Q7p2L70m63N6j45O6q2J39Q7r0R3J01j98L09m0n3k69K49j34Q3pk22P1J96
5188A08j19k5J83j57m7J62k19L22l34J71j45J14o2J5j33m8J31L07k18l13L04M9
5210D6J04j60L5j27J93J14k61K13j97j75K69M2r2o9M9k10L95l22J86k51P5J62
5232A9l7R1N6o3M0K02l93J69O0l92Q9J90l93N61l25J10K10kj2l83K43j59J86L3
5256A00j56R9k40m7L12J23l65L74k49j72k3K18K03M8Q4k01K10j52j22O4j94J62
5278G6j43L53K3j61q9N6J95k91r2pm8ML42m55L14j50k21M07o1j80J65J17j41j93
$$ plain form
5115 -82 131 230 35 18 259 359 -3 70 114 62 8 -258 12 53 -104 126 79 162 -114 56 -20 -89 -19 29 -141
5140 -141 31 -241 -132 -21 72 44 57 -168 -157 -38 -58 171 160 -160 118 -29 184 106 -26 -44 -197 -76 -24
5163 -24 63 -9 361 -102 -46 -191 -125 -207 -68 19 -71 22 123 -75 234 194 141 -128 121 -13 70 63 -159 -88 108
5188 108 -11 -36 147 -10 -57 105 -114 208 -126 45 -100 14 -48 -33 -166 -214 -83 224 6 -307 -3 46
5210 46 150 -10 25 -102 91 205 -56 157 -40 -215 54 96 4 -65 -16 -226 169 -153 33 -218 -143 19
5232 19 -18 73 129 66 106 308 -85 84 144 -248 -159 31 -362 199 -126 -16 194 192 180 -203 40 -119 67 100
5256 100 -56 43 -197 -244 68 191 -174 200 -49 -221 -244 -26 177 225 309 108 318 166 44 108 -86 76
5278 76 -67 286 309 148 59 115 310 19 -73 -80 -128 -124 218 -237 77 -73 -294 113 52 -128 37 154 13 -180
5302a80K03L7j87o2J36r0J52j71K41M6J19k44j51K20r2j35J68o2j10K26j18PN8
5325A1J44J62l03K70m40o5M38k01K13q1j4k70P4J90k51K34Q0J23l81J09J24r4
5347G2J30Ol43J45N3j13J83j4M9j18O2k56J32O9K09l64J42L6N1j07j3rMo9l5K6
5373g2J1J65K2j92J42j85L1J92k6o4j27J27J21k09j27J99j13L10k32j57Q0k3J99
5396G2j05Q7Qj93K44R5l82L38j64Q9m4k52M46j65q0l06L35Q4j4j9l62M28kk26
5420h8J87J48j65l5K70k06k22P5k4J33j31O3J68l4j3Kk12Q4q2K14k79K01P1l41
5444b16K72j45m8J2J37O0r0jk83K58J4m8L3J74k47K42j70L41m67M07k5k76p1J94
5468E7n7J34j48J14p6j8j14O0j47Q3K56n3k42J06m0p7K40J04p8j93J11K2J65l33
$$ plain form
5302 -180 23 60 -127 -189 -53 -143 9 -162 79 125 244 0 -151 69 -23 -158 10 -52 -162 64 -54 -47 11
5325 11 155 317 14 284 -156 -221 217 16 229 148 134 -136 -62 128 -123 111 191 314 -67 42 166 72
5347 72 202 208 -135 10 63 -50 133 119 168 50 112 -144 -12 57 266 -98 44 80 131 24 11 2 6 -63 -98 -72
5373 -72 -61 104 126 -66 76 -109 -78 114 88 24 -103 24 145 -64 -191 8 -105 205 -27 -184 -104 -127 72
5396 72 -33 54 62 -131 113 208 -174 164 0 89 45 -207 239 74 -6 -312 23 107 93 74 -288 140 138 -88
5420 -88 99 247 82 47 317 111 -111 -36 -60 73 -58 5 173 139 126 128 -84 0 -82 132 -147 54 125 -216
5444 -216 56 -89 -137 -125 12 72 -18 -19 -302 -44 -30 -78 -45 129 -118 124 -46 295 -172 235 210 -66 -137 57
5468 57 0 134 -14 100 24 6 -108 -48 -195 -112 144 91 -151 -45 -85 -162 78 182 104 -89 22 44 209 -124
5492a24J94k48J69j37K05p7J47Lj86R9j53J91pj40kk5oj44o8J67rP6l31m1N40
5517I3k85M00l40l1J80q9J73j51K22n8k48K24r1P9J79P9o8k63o1J04Q4l70K67
5540B9j59J39k23L21k33J38r6J11J56k10o6J93k7J16j3M2l20N9J4J04j49P3J83
5563A82j4Po4p0J9pO1Q5k75p2p7J3K28m7j06Ln1K8K64p0q1L5j09J12M11o01J28
5590f8J14j9O4K04j40m6k11Q6k27L84k84J75o7Q4k43L48k81r7K80l73M77l29K89
5613A20l50j26L59J05j79j08K03N0N3Q0j18K73o21L01O2l44J86n8o5J09Kp6L9
5636a03K68k39K10l41L08j50j15j79M19R1j10J70n54L27o4J67O2j32j46K74j36
5657B7P8J63m85J20J17Qj37J08L5j65Q2j20K19n0p2k5o4J47j14J76o2Q8k09kJ38
$$ plain form
5492 -124 70 -178 -9 -146 59 -18 129 132 -54 45 -108 83 76 -64 -66 -91 -97 -241 -309 -142 -151 -75 -406 -447 93
5517 93 -192 208 -132 -163 17 -72 101 -50 172 114 -134 90 -1 78 257 336 268 5 -56 48 132 -238 29
5540 29 -130 9 -214 107 -126 12 -84 27 183 -27 -93 100 73 189 176 218 -102 -43 -29 75 -74 -1 182
5563 182 168 175 111 41 60 53 114 199 -76 -148 -225 -212 16 -31 -137 -134 -185 -157 107 37 -44 -9 -118 -6 405 -196 -68
5590 -68 46 27 91 295 155 109 -102 -16 -243 141 -143 32 -35 49 -194 154 -127 -224 56 -317 160 -169 120
5613 120 -230 -356 3 108 -71 -179 24 74 127 207 89 362 -259 42 104 -240 -54 -112 -177 -68 -66 -142 -103
5636 -103 165 -74 136 -205 103 -47 -162 -341 78 169 59 229 -325 2 -62 105 167 35 -111 163 27
5657 27 105 268 -217 -97 20 28 -109 -1 34 -131 -49 -169 50 0 -72 -97 -161 -14 -128 48 -14 74 -135 -137 1
5682AL4j07K88m09K52j38j97J09J22o8n9J61l2po9K59j86k1J08q9J97q9j52q4
5706a76L32k79R3j42K08O5J0J40j66Lj60J23q0r4L51j76Nl6o8j11L54j03n8J89
5730B24k64K4J35q8j22J10J8L6m1O6P0p4k39Q8k1J51O6l27L01n6K71l03p3J12
5754F4j10J38q4o3J8O9j94L08l41L95l73L2J81J23k71K6pJ2J07P0k4j31K24l29
5778a60L9K48j61j29ON6Pn3Q2l03K77NKQ6O6j37j8k06M56j61j1J93k01m4k8J53
5804F4J06l44K16kM92l36k13P5j43L0J62j26JO2j6j8l3J1l2r3J14o0O1M1j07j22
5830b10J52J55J58l68J28R2j31j8J75k20K30k9k9j8J9oQ1l68J0J75j31J46J4l0
5854b3p4j08j13K64K8J8J97l15k8K01k4j61J32J46j91K00k84J93pJ16n2J3j20
$$ plain form
5682 1 35 -72 216 -193 59 -79 -276 -167 -45 -113 -172 -11 -43 -50 -119 140 -46 -67 41 -48 149 60 -92 -176
5706 -176 156 -123 -30 -172 36 101 111 251 85 88 -72 51 -29 -123 228 52 57 21 -47 -158 196 93 35 224
5730 224 -40 -16 119 31 -91 19 37 73 32 98 168 94 -145 -57 -78 73 139 -188 113 57 328 25 -48 64
5754 64 -46 92 8 -55 -37 32 -162 146 -195 200 -173 -141 40 163 -108 -82 -89 -77 30 100 76 -55 169 -160
5778 -160 -121 127 -34 -163 -157 -101 -94 -147 -65 -368 -91 -86 -84 2 68 -69 -87 -293 163 2 -9 184 -17 -61 -89 64
5804 64 170 -174 42 40 532 196 -17 58 -85 -55 107 -19 -18 44 28 10 -23 -12 -44 -137 -23 -83 -22 19 -88 -210
5830 -210 -58 97 255 -113 15 107 -24 -42 133 -87 143 114 85 67 86 80 161 -207 -197 -22 -153 -7 7 -23
5854 -23 -97 -205 -318 -54 -26 -8 189 -126 -154 47 23 -138 -6 140 -51 149 -135 58 51 167 115 128 8
5877HK1ON8j08j6k00K50j02o3O9J10K42l51q6j27M68k78N8j98L12k24J26mL00
5901B71l40J1j4K84k3k6j15Mp9R6j06K67j38n1Qm7k87L3L35j12K65k31N2k22M3
5926a22K00j71J95M7j19o9N8j83J90R7j79q6J14l0L0J45J16k05JK05r5j24K9j69
5950a25J80J44j39J53l1j30m5P5j41L3O4k18K22R5k53J57l47M39j24k8l28K64
5972h3J94p6k07j23L37n6O8P3k36k63L12j86M79l68K2K22m1J00j47j54J97k5j35
5995i6j0J02p0K38k59L8j3j25J22J86l3o9k70K81k00P0O8K41j41l01K81j41K27
$$ plain form
5877 8 29 35 93 -15 -31 -231 19 -83 -146 -77 33 275 -76 -162 -289 179 -99 -41 -239 73 -151 -25 -29 271
5901 271 -69 -58 -72 212 189 163 48 52 -27 69 -37 230 92 41 49 2 -285 -252 83 -29 236 5 57 -165 -122
5926 -122 78 -93 102 149 30 -39 19 -164 26 123 -56 -142 -28 -58 -28 117 233 28 29 234 139 15 44 -125
5950 -125 55 199 60 213 182 52 7 82 -59 -26 38 -180 42 137 -116 41 -306 133 9 -19 -347 -83
5972 -83 111 35 -172 -295 42 -14 54 127 -109 -372 -60 -246 233 -135 -113 109 68 168 21 -133 64 39 -96
5995 -96 -106 -4 -74 164 -95 -57 -70 -195 -73 113 80 11 -259 22 -178 -108 -40 201 60 -241 40 -101 126
$$ [...]
8191A18
##END NTUPLES=NMR FID
##END=
