##TITLE=1H_SL30-DAu(A)
 CDCl3
 8 sc, 
 19.1.2022
##JCAMPDX= 6.0         $$ Bruker NMR JCAMP-DX V2.0
##DATA TYPE= NMR FID
##DATA CLASS= NTUPLES
##ORIGIN= UXNMR, Bruker Analytische Messtechnik GmbH
##OWNER= root
$$ XWIN-NMR		Version 3.5
$$ Wed Jan 19 11:02:10 2022 Russian Standard Time (UT+4h)  she@DPX200
##.OBSERVE FREQUENCY= 200.131346
##.OBSERVE NUCLEUS= ^1H
##.DELAY= (6, 6)
##.ACQUISITION MODE= SIMULTANEOUS
##.ACQUISITION SCHEME= undefined
##.AVERAGES= 8
##.DIGITISER RES= 18
##SPECTROMETER/DATA SYSTEM= spect
##.PULSE SEQUENCE= zg30
##.SOLVENT NAME= CDCl3
##.SHIFT REFERENCE= (INTERNAL, CDCl3, 0, 15.7039)
##AUDIT TRAIL= $$ (NUMBER, WHEN, WHO, WHERE, WHAT)
$$ ##TITLE= Audit trail, XWIN-NMR		Version 3.5
$$ ##JCAMPDX= 5.01
$$ ##ORIGIN= Bruker BioSpin GmbH
$$ ##OWNER= she
$$ F:/spectra/data/she/nmr/H-F/1/audita.txt
$$ ##AUDIT TRAIL=  $$ (NUMBER, WHEN, WHO, WHERE, WHAT)
(   1,<2022-01-19 11:00:58.56 +0400>,<she>,<DPX200>,
      <created by zg, POWCHK disabled, PULCHK disabled
       configuration hash MD5:
       00 E9 B6 7A A2 85 ED C7 34 08 36 98 17 FE 4E 26
       data hash MD5: 16K
       8B DB EE 97 B8 29 B4 41 81 27 0D 54 41 75 DD 66>)
$$ ##END=
$$ 
$$ hash MD5
$$ AC 6F 7E 0A 6F 0B 02 F0 A7 B6 6B C2 12 52 DC 33
##$RELAX= 
##$RELAX= 
##$RELAX= 
##$RELAX= 
##$RELAX= 
##$RELAX= 
$$ Bruker specific parameters
$$ --------------------------
##$DU= <F:/spectra>
##$EXPNO= 1
##$NAME= <H-F>
##$PROCNO= 1
##$TYPE= <nmr>
##$USER= <she>
##$AMP= (0..31)
100 100 100 100 100 100 100 100 100 100 100 100 100 100 100 100 100 100 
100 100 100 100 100 100 100 100 100 100 100 100 100 100 
##$AQSEQ= 0
##$AQ_mod= 1
##$AUNM= <au_zg>
##$AUTOPOS= <>
##$BF1= 200.13
##$BF2= 200.13
##$BF3= 200.13
##$BF4= 200.13
##$BF5= 200.13
##$BF6= 200.13
##$BF7= 200.13
##$BF8= 200.13
##$BYTORDA= 1
##$CFDGTYP= 0
##$CFRGTYP= 5
##$CHEMSTR= <none>
##$CNST= (0..31)
1 1 145 1 1 1 1 1 1 1 1 1 1 1 1 1 1 1 1 1 1 1 1 1 1 1 1 1 1 1 1 1 
##$CPDPRG= <>
##$CPDPRG1= <>
##$CPDPRG2= <>
##$CPDPRG3= <>
##$CPDPRG4= <mlev>
##$CPDPRG5= <mlev>
##$CPDPRG6= <mlev>
##$CPDPRG7= <mlev>
##$CPDPRG8= <mlev>
##$CPDPRGB= <>
##$CPDPRGT= <>
##$D= (0..31)
0 1.2 0 0 0 0 0 0 0 0.06 0 0.03 0 0 0 0 0.0002 0 0 0 0 0 0 0 0 0 0 0 0 
0 0 0 
##$DATE= 1642575658
##$DBL= (0..7)
120 120 120 120 120 120 120 120 
##$DBP= (0..7)
150 150 150 150 150 150 150 150 
##$DBP07= 0
##$DBPNAM0= <>
##$DBPNAM1= <>
##$DBPNAM2= <>
##$DBPNAM3= <>
##$DBPNAM4= <>
##$DBPNAM5= <>
##$DBPNAM6= <>
##$DBPNAM7= <>
##$DBPOAL= (0..7)
0.5 0.5 0.5 0.5 0.5 0.5 0.5 0.5 
##$DBPOFFS= (0..7)
0 0 0 0 0 0 0 0 
##$DE= 6
##$DECBNUC= <off>
##$DECIM= 32
##$DECNUC= <off>
##$DECSTAT= 4
##$DIGMOD= 1
##$DIGTYP= 9
##$DL= (0..7)
0 120 120 120 120 120 120 120 
##$DP= (0..7)
150 150 150 150 150 150 150 150 
##$DP07= 0
##$DPNAME0= <>
##$DPNAME1= <>
##$DPNAME2= <>
##$DPNAME3= <>
##$DPNAME4= <>
##$DPNAME5= <>
##$DPNAME6= <>
##$DPNAME7= <>
##$DPOAL= (0..7)
0.5 0.5 0.5 0.5 0.5 0.5 0.5 0.5 
##$DPOFFS= (0..7)
0 0 0 0 0 0 0 0 
##$DQDMODE= 0
##$DR= 18
##$DS= 0
##$DSLIST= <SSSSSSSSSSSSSSS>
$$ [...]
##$SUBNAM2= <"">
##$SUBNAM3= <"">
##$SUBNAM4= <"">
##$SUBNAM5= <"">
##$SUBNAM6= <"">
##$SUBNAM7= <"">
##$SUBNAM8= <"">
##$SUBNAM9= <"">
##$SW= 18.0517287032376
##$SWIBOX= (0..15)
0 0 2 0 0 0 0 0 0 0 0 0 0 0 0 0 
##$SW_h= 3612.71676300578
##$TD= 16384
##$TD0= 1
##$TE= 0
##$TE2= 300
##$TE3= 300
##$TEG= 300
##$TL= (0..7)
0 120 120 120 120 120 120 120 
##$TP= (0..7)
150 150 150 150 150 150 150 150 
##$TP07= 0
##$TPNAME0= <>
##$TPNAME1= <>
##$TPNAME2= <>
##$TPNAME3= <>
##$TPNAME4= <>
##$TPNAME5= <>
##$TPNAME6= <>
##$TPNAME7= <>
##$TPOAL= (0..7)
0.5 0.5 0.5 0.5 0.5 0.5 0.5 0.5 
##$TPOFFS= (0..7)
0 0 0 0 0 0 0 0 
##$TUNHIN= 0
##$TUNHOUT= 0
##$TUNXOUT= 0
##$USERA1= <user>
##$USERA2= <user>
##$USERA3= <user>
##$USERA4= <user>
##$USERA5= <user>
##$V9= 5
##$VALIST= <valist>
##$VCLIST= <CCCCCCCCCCCCCCC>
##$VD= 0
##$VDLIST= <DDDDDDDDDDDDDDD>
##$VPLIST= <PPPPPPPPPPPPPPP>
##$VTLIST= <TTTTTTTTTTTTTTT>
##$WBST= 1024
##$WBSW= 4
##$XGAIN= (0..3)
0 0 0 0 
##$XL= 0
##$YL= 0
##$YMAX_a= 238992
##$YMIN_a= -436097
##$ZGOPTNS= <>
##$ZL1= 120
##$ZL2= 120
##$ZL3= 120
##$ZL4= 120
##$ABSF1= 10
##$ABSF2= 0
##$ABSG= 5
##$ABSL= 3
##$ALPHA= 0
##$AQORDER= 0
##$ASSFAC= 0
##$ASSFACI= 0
##$ASSFACX= 0
##$ASSWID= 0
##$AUNMP= <proc_1d>
##$AZFE= 0.1
##$AZFW= 0.1
##$BCFW= 1
##$BC_mod= 2
##$BYTORDP= 1
##$COROFFS= 0
##$CY= 11.3945322036743
##$DATMOD= 1
##$DC= 2
##$DFILT= <>
##$DTYPP= 0
##$F1P= 2.36226072786647
##$F2P= -0.459571619588291
##$FCOR= 0.5
##$FTSIZE= 0
##$FT_mod= 4
##$GAMMA= 1
##$GB= 0.15
##$INTBC= 1
##$INTSCL= 1
##$ISEN= 128
##$LB= 0.24
##$LEV0= 0
##$LPBIN= 0
##$MAXI= 10000
##$MC2= 0
##$MEAN= 0
##$ME_mod= 0
##$MI= 1.114404
##$NCOEF= 0
##$NC_proc= 0
##$NLEV= 6
##$NOISF1= 3.799351
##$NOISF2= 2.8
##$NSP= 1
##$NTH_PI= 0
##$NZP= 0
##$OFFSET= 15.70392
##$PC= 1
##$PHC0= -15871.91
##$PHC1= 17.60078
##$PH_mod= 1
##$PKNL= yes
##$PPARMOD= 0
##$PSCAL= 0
##$PSIGN= 0
##$REVERSE= no
##$SF= 200.130013532006
##$SI= 16384
##$SIGF1= 3
##$SIGF2= 2
##$SINO= 400
##$SIOLD= 16384
##$SREGLST= <1H.CDCl3>
##$SSB= 0
##$STSI= 0
##$STSR= 0
##$SW_p= 3612.71676300578
##$SYMM= 0
##$S_DEV= 0
##$TDeff= 0
##$TDoff= 0
##$TI= <>
##$TILT= no
##$TM1= 0
##$TM2= 0
##$TOPLEV= 0
##$USERP1= <user>
##$USERP2= <user>
##$USERP3= <user>
##$USERP4= <user>
##$USERP5= <user>
##$WDW= 1
##$XDIM= 8192
##$YMAX_p= 0
##$YMIN_p= 0
$$ End of Bruker specific parameters
$$ ---------------------------------
##NTUPLES= NMR FID
##VAR_NAME=  TIME,          FID/REAL,        FID/IMAG
##SYMBOL=    X,             R,               I
##VAR_TYPE=  INDEPENDENT,   DEPENDENT,       DEPENDENT
##VAR_FORM=  AFFN,          ASDF,            ASDF
##VAR_DIM=   8192,          8192,            8192
##UNITS=     SECONDS,       ARBITRARY UNITS, ARBITRARY UNITS
##FACTOR=    0.0002768,     1,               1
##FIRST=     0,             0,               0
##LAST=      2.2672688,     0,               0
##MIN=       0,             -436097,         0
##MAX=       2.2672688,     238992,          0
$$ Real data points
##PAGE= N=1
##DATA TABLE= (X++(R..R)), XYDATA
0@%%%%%%%%%Qj6J6j6K4l2M0n4O2p2Q9j13J36j60J92k24K64l10L58m13M75n43O22
32C33p08Q00r04J020j148J290j446J615j800K000k221K463k726L012l323L666
48A923m042M453m904N404n956O567p252Q020q887R878j1023J2362j3953J5881
62H471j8272K1328k5395L1105l9768N4619q6861K79813k15499l53177N10617n7061
74A09920k56795R6502J53015j53924N367O5412q4574J4427J56898o2495p9758
85c6005J9188K3100m0649K6094L4423m1676k2719J5663K746L4236J760K4452j419
98C9194l4141k279l9028m35R3729Q440o6249r631K3764m9953o416O5022j8796
111C221N855K1228j05701j3882J40180J3372j12291M2234P0502j08193r905J02789
$$ y = [0, 0, 0, 0, 0, 0, 0, 0, 0, 0, 8, -8, 8, -8, 16, -16, 24, -30, 32, -40, 49, -64, 72, -88, 104, -120, 144, -166, 192, -221, 254, -289, 333, -375, 425, -479, 541, -607, 683, -763, 852, -948, 1052, -1169, 1294, -1432, 1580, -1743, 1923, -2119, 2334, -2570, 2834, -3122, 3445, -3807, 4213, -4674, 5204, -5819, 6543, -7410, 8471, -9801, 11527, -13868, 17237, -22531, 32088, -54773, 225040, 9541, -343636, 166981, 109920, -146875, -50373, 102642, -51282, -45915, 19497, -65077, -50650, 106248, 43753, -36005, -16817, 6283, -34366, -8272, 26151, -15525, -38244, -22581, -19835, 14401, 16161, 40613, 39194, 5053, 2774, -36254, -36689, 57040, 65480, -769, -10400, 13364, -36589, -43005, 22017, 3221, 9076, 30304, -75397, -89279, 50901, 64273, -48018, -5784, 64718, -43475, -53380, 49409]
123D9409k6428k8100K9277l1859l7660N2188M0995l9576Q957J7378o0237l0738
135e6394L2779M7732r778m5683K6592L5375l0560l2161L2714M8423j8418l7989
147g368l3684l848N1374j457k5878L6057J9229l7703k2454L6923L3153o462l1890
160E992l8058J7507K161m1484N1131N6603n8176l7996M7783Q070k3687M8390k783
173C5453o6832L0662J6338o1201K5364O7619l0084m1751K8235n676k1259M1024
185A7892l887l2283K5331K038l9617O999M7312J16k5079Q504p362j7555M598J1050
199a943J5982K531j5902k3019O63M6300R570l7826Q313K6432m5986m4110O1669
212B674L6417n7465j210K8866k8657L392L8252j8330j0704M4947l3653o6569O2066
$$ y = [49409, 22981, -5119, 24158, -7701, -45361, 6827, 47822, 8246, 17203, 34581, -25656, -56394, -23615, 24117, 14339, -31344, -4752, 30623, 63, -32098, 616, 49039, 30621, -7368, -41052, -44900, 6474, 5017, -20861, 15196, 34425, -3278, -25732, 11191, 44344, 37882, 5992, -32066, -14559, -12398, -53882, -2751, 53852, -4324, -42320, 5463, 13533, -10154, 38236, 35453, -31379, -717, 15621, -45580, -20216, 47403, 17319, -24432, 3803, -1873, -23132, 17892, 14005, -18278, 7053, 9091, -30526, -23527, 23785, 23901, -1178, 7326, -36, -17591, -12993, -1943, 14039, 16570, 668, -22351, -21688, 24612, 34182, -3644, 4669, 31101, -14885, -58995, 2674, 39091, -18374, -19584, 9282, -19375, -15983, 22269, 3939, -6765, 38182, 4529, -62040, 26]
225B6M7645o0826o684M7117j5943l1242K1936J0586q239J5445j6312k6394J8244
238d641L525j4544J9169K3670k2659l0666J0457J6453N624M12j1870m551L917
251e704L197n095M382L2476J59m3773o284K8895j409j3186K0270l605l3548J7966
265e259J6696k2032K0335K3737m1246k0245L9474p780l7099L1232K4477k8226
277e936q457Q499L709J3278L562j5891N193Q781l0799n488L6639K223j6765j546
291b998l883N512J2749p822o852K3872j955m6212k642M0673P761k2092n733J2575
305B953l847j2231J0389J5206m096j0844l495n696M547J8680j0234j1093K8114
318A8353n187m0943J6143L9714k0954k2189K5645l404k2895J8042P586j1706J3516
$$ y = [26, 47671, -13155, -19839, 27278, 11335, -19907, 2029, 12615, 4376, 19821, 3509, -22885, -4641, -1116, -15660, 3509, 27179, 4520, -26146, -15689, 764, 6388, 6800, -5070, -9621, -5704, -2507, -7602, -3220, 29256, 29415, -14358, -20642, 8253, 6844, -6342, 13928, 10323, -23225, -5259, 11437, -10595, 9740, 33477, -7769, -28014, 11460, 3680, -33419, -2187, 22290, -5936, -14393, -5894, -2185, 11093, 14655, -1236, 3957, 12738, -18061, -23549, 13090, 15313, -1452, -2998, -6881, -1369, 11380, 3558, -3294, 20578, 18623, -27589, -30231, 10442, 18203, -3889, -9622, 2953, -894, -13125, -2736, 12470, 8374, -2470, -5965, -11661, -7114, 11566, 1332, -9761, 18353, 13166, -27777, -11634, 28080, 7126, -15063, 10582, 7178, -15717, 2325, 9911, -1795, 11721]
331A1721J295k8181k468J9607l435r97Q128j1340m092Q244n562P286K1481j0524
345A1163k6556O740J3615j0282K611J3794n142r399j044L424N297J1116P10k0446
359d399n639J7361o681k2195J8468K6063k9792k3022L2571P677k3602J2088J6550
372A5448j6859m271N677j3663J2591K6763k3535j9665K6442J016k3554J2659K0860
385A9909j0852j1681l042m654J3852P811j5813L222J0187k0461r920K4921Q954
398A2433j6158R30M850q736K045J0686j758m798M949p0j5297M6K0626K380j4068
413a940K576Q041j3003k826J6449m678p785R338j3419j5136K4000J0350k4488
426a2521R674K5906k3637j9290K3641R708p985K39j1758r917J6881K875j7549
$$ y = [11721, 13016, -15165, -17633, 1974, -1461, -2458, 5670, -5670, -9762, -1518, -7080, 206, 21687, 11163, -15393, -8653, 4962, -5320, -2709, 11085, 5943, -3456, -4500, -1076, 4221, 15337, 16047, -4399, -10038, 7323, 642, -21553, -3085, 22978, -6814, -29836, 2735, 10412, -13190, -1102, 15448, -1411, -5682, -5, -13668, -1077, 25686, 2151, -17514, 8928, 9944, -13610, -951, 19909, 9057, -2624, -5666, -10320, 3532, 11343, -4470, -1248, 8939, -11522, -21442, 3479, 12433, -3725, -2795, 2055, -6681, -4636, 6050, 4292, -506, 4443, 4373, -10924, -10878, 9748, 12128, -1940, 636, 8677, -4326, -7152, 9297, 4619, -3166, 6172, -7247, -22383, 1617, 11967, -12521, -2847, 23059, -578, -19868, 3773, 13481, 5496, 5735, -6023, -15940, 941, 3816, -13733]
439a3733J5632J6283k3697q340K1558J716r569O358M42j1506j745N46j008J3211
453F148L775j7655l832J7291K455j5558O790K0619j1033k3909O849J4982q282
466a360m573J0174m352o819N196n799O19K0823p74k4441K432J6064p045j577J0371
481H939o108m587M432p717j546J6810J240j4919q4K269o032O079O178m753N13
496G14m33j0745K526J5503k475j0707O130M083r968m837Q923J0469k678q991j023
511c509N534L045j142J214L717m54j1778j0241J1193J1469j2055p385J1290k839
525a941j1808P133J2839J636j247r448o651J2804K947j3903P509J2504j5964r714
539a3304J5415L973l970Q529n081j1361R737J199j3709R532J2445j7754j0883
$$ y = [-13733, 1899, 18182, -5515, -13855, 7703, 9419, -150, 6208, 6650, -4856, -6601, -6055, -7063, 6148, 9923, -7732, -11564, 5727, 8182, -7376, -586, 20033, 9000, -14909, -8060, 6922, -1360, -5933, 4241, -111, -6930, -1734, -7533, -6914, 13909, 13135, -11306, -8874, 7190, 145, -1432, 8939, 2831, -1756, 2676, -5041, -6587, 10223, 11463, -3456, -3540, -1271, -7303, -1224, 4954, 201, 714, 281, -10464, -7938, 7565, 5090, -5617, 513, 4596, -5372, -10209, -1286, 9183, 6505, -2486, -3509, 2025, 5070, 3928, 5142, 8859, 8405, -3373, -13614, -2421, 9048, -3007, -10392, 898, -1941, -13749, -6616, 6223, 7859, 6612, -2836, -9487, 3317, 6264, -7639, -130, 12374, -3590, -13304, 2111, 6084, 2114, 10643, 5562, -5799, 3938, 5137, -8572, 960, 13405, -4349, -15232]
552a5232J3426J298p547R249N317q861k902M285l068J567J0753jj2741j511R345
567C377q98n128Q887M754j1658m025L632k583P317O476j4667o140J5875l917j6131
582a4829J6746J4834j8268p898R681k308o3P853p319l212J0063r103r697J9303
596E783Q640j7096J251J1449r823q793J1404N280o405l431m055k494P691M744
610D145m750n07P565k874j2924L300J6410k169j4739L405N933r769m98J1754J10
625D392m365J484m820k011J0883J114q179L313J212q460J554M778r92N029R21
640E853j1991R0J1219l934m253Q149o13q554j32l0J855Q895k778j1673N321P741
656E165q644l085J1315L218q585n835J794O764K417l268n81K440k875m645K850
$$ y = [-15232, -1806, -508, -8055, 1194, 6511, -2350, -5252, -967, -4035, -2468, 8285, 8284, -4457, -5968, 3377, 2479, -2649, 6238, 10992, -666, -4691, -1059, -3642, 3675, 10151, -4516, -10656, 5219, 1302, -14829, 1917, 16751, -1517, -9415, 266, -2042, -2105, 5748, -1571, -4783, 5280, -3823, -13520, 5783, 14423, -2673, -1422, 10027, 204, -8589, 2815, 8095, 1690, -1741, -5796, -8290, -599, 4145, -605, -1112, 6453, 3579, -9345, -6045, 10365, 8196, -6543, -3138, 2795, -6974, -7472, 4282, 4392, 27, 1511, -3309, -5320, 5563, 6677, -1502, 1811, 3023, -5437, -3883, 895, -97, 4932, 5853, -6138, -6048, 5171, 1237, -3016, 5133, 4520, -4034, -4166, -4196, -2341, 6554, 3776, -7897, -2576, 5165, -3479, -6564, 4751, 7969, -616, -6451, -4657, 2107, 4524, 1256, 675, 3115, 240, -4405, -1555]
671a555O806J753p244m457N284j96p819M688J1028n546r032J802K733K294L229
686C768m833j510Q172n634j0729J1205R916j1024k861P655n749k136R290k573
700B957l081N878n250r940Q138Q123p496r37M619n120m459M923L564j096J536
715B359j003n890q48O959J082n108K014O368o994o333R127N770n655j234j7m092
731c495M574K570q289M301J0891j2116j1552J4365O609j1330J894O352o546k514
745d286K369j501N683M852j0356l744J0272j103q026O343P810o559o435K482L873
760A674J970j940j942J284j86k695q46L519L550j380o543o82M806p72k480M694
776B031Q08n604p60J568r34M484K466o237k32N235l990j777P453Nl833L95l294
$$ y = [-1555, 5251, 7004, -240, -4697, 587, 391, -7428, -2740, 8288, 2742, -6290, -4488, -1755, 539, 3768, -1065, -2575, 5597, -37, -10766, 439, 10355, -669, -3530, 4125, -1624, -3760, 5530, 2957, -124, 5754, 504, -9436, -1298, 6825, -671, -1608, 3011, -2109, -6568, -1645, 1919, 823, 2359, 1356, -4534, -5382, 1577, 2659, -2449, -435, 5933, -1061, -7394, 1733, 7503, 1848, 614, 597, -3495, 1079, 3649, -4640, -339, 10552, -1564, -13116, 1249, 7858, -3472, -1578, 4774, -1772, -4286, -1917, -3418, 2265, 7117, -3239, -6983, 3289, 2186, -5840, 503, 8313, 1754, -4681, -2199, 1674, 3644, 1704, -238, 1046, 860, -1835, -2681, 838, 4388, 3008, -3535, -4217, 589, -183, -2663, 2031, 2839, -2765, -3525, -1957, -2891, 1593, 4059, -2178, -2410, 2825, -1165, -2942, 4511, 4516, 683, 1078, -2216]
793b216j381Q474k86q308L630N287q250k599Q113J503l803j282k899J486L880
808A349l585j744P412K67r231J0Q075J926l615j140K010O29k599k370M125M407
824E926k943o333l16N362J672n648j51P539l355q850L133O816k272j322L47k707
840c102J592K820l975J015P727m029p845O266L744n888K599M354n016k274K774
855G62k033J303M963l567n112L288J885l980r7L983K68k845k329k60L826L352
871C407j862l007J274K740k621l786M529N524n799n594L726K719r81M65m8M55
887A141K448l801n522P706N816r975l773P618j534o055M136M063j332K41k597
902a420k508O863K272p895J314O489n623o574N782M631k583j692l08Q48J300n20
$$ y = [-2216, -3597, 4877, 4591, -3717, -87, 5200, -3050, -5649, 2464, 3967, 164, -1118, -4017, -2531, 1349, -2236, -3980, 3432, 3699, -5532, -5522, 2553, 4479, 864, -276, 1734, 2363, -236, -2606, 1519, 5926, 2983, -3350, -3666, 1696, 3368, -2280, -2431, 5108, 1753, -7097, -3964, 2852, 580, -742, -395, -3102, -1510, 1310, -2665, -1650, 6077, 2048, -5797, 469, 4213, -1675, 924, 5278, 262, -2012, 762, -1271, 32, 4995, 1428, -3684, -396, 1489, -2491, -2588, 1395, 1663, -1182, -3511, -3771, 55, 3407, 1545, -1462, -188, 2552, -69, -3855, 674, 6198, 399, -5195, -1469, 1250, 269, 734, 686, 1141, 3589, -212, -5734, 1972, 7788, -2187, -5960, 1658, 124, -5931, -1795, 2268, 936, 1177, -1420, -3928, 2935, 5207, -2688, -1374, 5115, -508, -7082, -1300, 3331, 748, -944, -1252, -404, 896, 376]
918C76m65K817J033l701l018J772L100n94k472P78Q59k214j153K651Q51Q08K08
935A636m010j432N281J93m356L469K699n293r84L463m01Q73K199m318j753N399
951B665j782m289O116L887p984k362N010L76k093P45q54N54j94m941k41P416J676
968C705o613j855O133J625m710J036M907K37n342k034K336K435k87j758r91K340
984A164K16m208J591O359j950n799J920J575l129K71K590j391k22l21l095K106
1000b323N641j874k455L375o77l195K172J674j250P33o70l544P88L760q72j904
1016f21J413K1k309o46J183J575J001k116k346J509J746j506m57L122J477m562
1032a516k792M184L463k794j857K693P11k282j110J463L304J290n784l023N303
$$ y = [376, -89, 2728, 3761, 60, -2958, -1186, 1914, 1320, -1152, -374, 485, -1729, -2882, -231, 620, 1428, 1636, -2374, -3806, 1475, 1668, -2688, 781, 3480, -1813, -2797, 666, 265, 1138, 3337, -981, -2734, 2665, 883, -3406, 2710, 6597, -1387, -3749, 1261, 1637, -456, 289, -565, -11, -205, -5146, -5387, 2029, 3705, -2908, -4763, 1370, 2995, -1715, -679, 4228, 4465, -877, -2911, -575, 1860, 1573, -185, -1176, 1164, 1380, -2828, -1237, 5122, 3172, -2627, -707, 868, -2261, -1990, 600, -791, -1013, -1334, -4429, -2323, 3318, 1444, -1011, 2364, 1687, -1508, 664, 2338, 1088, 1821, 1151, -2393, -1605, 2155, 1283, -621, 792, 813, -1496, -2142, -959, 616, 1617, -499, -2845, -1336, 410, -1096, -1553, 1569, 3046, -1516, -4308, -124, 3339, 545, -1312, 1381, 2092, -190, -1300, 163, 3467, 4757, -1027, -4050, 1253]
1047A253J276n679J053M915k921l624J496J864J156J875k879j720L121n91l938
1062c343L000M292l973l201K642M87l26J543M97o19M97j188j782J722K695j497
1078A446k489J80L49j061M82K046l30r00N90j906r41L766J702m470o85L665k313
1095h69l119M939K541l338r45Q03o42J298J032k046J034K716m692l180O273K116
1111C921n042k01K648q75j824J60Q84J825j93m127r29M345M59k762Q74L071j140
1128A094l079J97L756J028k470q28R06n44p52O9J436J254q03k945J20K903n93
1145G49j377J145J67k280J67Q08j53J792K47l279J89K540o74n50K079m29j105
1162C6r7r68M18L071l96l097Q63K031k788m18L100J72j728j115n33P24J447j223
$$ y = [1253, 2529, -3150, -2097, 2818, -103, -3727, -2231, -367, 789, 2664, -215, -1935, 1186, 595, -3343, -343, 3949, -24, -3225, -583, -96, -422, 1121, 1618, 999, 1496, 308, -1474, 248, 2943, 1446, -1043, -863, -514, -1575, -1093, 953, 623, -277, 313, -1593, -2534, 1232, 2934, -1536, -2221, 1444, -869, -3988, 951, 3492, 154, -791, 12, -630, 668, 1700, -346, 688, 3404, -1288, -4468, 1805, 3921, -1121, -1322, 1326, 451, -1373, -1213, -329, 1496, 1303, -2824, -3753, 592, 1051, -1711, -837, 2234, 1094, -1985, -1788, 1968, 2996, 526, -302, 604, 60, -692, -623, 813, 2067, 1264, -1681, -1561, 1342, 749, -628, 517, 684, -1596, -1429, -621, -774, 1018, 1265, -2014, -1825, 715, 41, -509, 1570, 1141, 36, -61, -1029, -611, 2460, 2064, -1033, -170, 1861, -927, -1345, 1755, 1927, 199, -916, -1449, -725, 722, -501]
1180e01j133K525J24l687k03M487P51l157q07K164J09k032M28K647K06j333j725
1197a137l70L004R90l017L04L082k312l882K950K986l010n32J050j250j47J362
1213G1j078P34K301k325l136L073K421k745K01J893j665p63Q74K73L05J597o76
1230A355k560L6K550k34j225L85Q71j248j819R16J138J67L96j019k138K177Q50
1247E98k495J562L162l307k527L193J304k375Q72J725j336n63J09j118K509K209
1263C522l660j661L445l94l090J295K554j360j892l95M71J773j63j630K90J676
1279G81j495j401J920J807q68j536k15J568n45l89J302M65p98q22k6L86J181j76
1297A139j295k03P00j513j92J715k11p16N87r78p53K204M7j928J649R21k009j70
$$ y = [-501, -1634, 891, 1015, -2672, -2875, 1612, 2363, -794, -1601, 563, 672, -1360, -932, 1715, 1921, 588, -1137, -1507, 1497, 2487, -530, -226, 2856, 544, -3338, -388, 2598, -412, -944, 106, -1144, -1291, 71, -1007, -273, 2028, -297, -3433, -360, 2061, -684, -483, 1410, -255, -1018, -144, 129, 434, 2031, 1355, -1205, -1169, 1381, 1147, -78, 307, 1178, -70, -1889, -973, 165, 332, 728, -291, -2429, -252, 598, -1897, -335, 2827, -480, -3007, 186, 1490, -885, -13, 1712, 376, -187, -78, -1196, 1313, 3522, -138, -1799, 1646, 1252, -1838, -543, 2011, 651, -1241, -1636, -1165, 608, 445, -1185, -895, 781, -714, -2115, -195, 1612, 744, -792, -1007, 561, 16, -373, 929, 1394, 596, -226, -252, 134, 1315, 1139, -156, -359, 341, -1172, -1364, 351, 140, -576, 11, -967, -1720, 484, 531, -1397, 252, 1173, -836, -1006]
1315a006J561J17L58j82j583o1K459j490j502K645M95k714p61K192M84o43m40
1332g1M9J96m89j152L69K030l23k049n26J871O73j696O48K444o86k838J071J866
1350A387o18m26j6n05J65L26j651J489K262k101k048K350O01k050Q62J356j192
1367A91p86J59j205R31J673j420q60J269L76j363J086O31N8o3l73j016N55J334
1385A177m44r50O9Q73p61r30J183J132q04j272M16o7M78K27k42l91J057j503j586
1404b338K163J712k434o56K138o50j225R21Q54M57M06j379r04K508pk461R76J792
1422A873k238j736J533J185n03n5l15J08L69p65l50J634K53j850k64Q33L44o00
1440e44j24Q33L35p87j27R38O04j18l9o12o14R96o67p56J270N6j838K64P98n72
$$ y = [-1006, 555, 672, 1030, 848, -735, -796, 1663, 173, -1329, 1316, 1811, -903, -1664, 528, 1012, 369, -71, -22, 174, -315, -1467, -1098, 932, 609, -1440, -1966, -95, 578, -1118, -470, 1974, 1288, -1550, -479, 1387, 769, 343, 327, -178, -13, 313, -1338, 151, 2413, 312, -1736, 614, 1215, -835, 27, 1383, 191, -595, -436, -1641, -710, 963, -457, -1317, -48, 328, -1035, 51, 682, 740, 677, 304, -712, -157, 1177, 733, -217, -148, 725, -36, -966, 217, 1349, 545, -727, -311, -378, 100, 327, 85, -306, 751, -752, -2338, -175, 1537, -897, -1553, 585, -65, -1290, -369, 485, 942, 1348, -31, -935, 1573, 1566, -895, 81, 1873, -365, -2101, -568, 617, 114, 59, -256, -148, 221, -544, -894, 740, 993, -857, -1121, -288, 56, -544, -668, 165, 500, -287, -414, 524, 1128, 1010, 971, 359, -255, 741, 74, -682, 588, 644, -1194, -930, -132, -704]
1460g04J186L84j790M1J715r62j276K301N91k011l17P71k8L86J87j042J248M67
1478A147j984j28K322M09j766q25J543k36r85J91R80J73j369j306J013J064k58
1495a5q41N81R01j067r86J154J668r72r87Q43L60j068o4J037j4ml15j340J101
1514b8J249j017n69J347m87j471L97R68n33N69n80j280P41O00l90J97Q19m76m49
1533c93n5K65M48Q10p59o11M59Qj79j11R51J83j210p80P68R04p29l78L99M32n49
1554a27o93J84J176L40j509p37J559K55j805J013J527p64j342M47M71K96O05j035
1572a39L41J234j351j341J807J245j812q04R78q1o66K78L05M43l50q20m74J332
1590A25M76p20m31N64L5p61K20J170k73J94n44j72k90Q27M81o70l3O88j141n91
$$ y = [-704, 482, 866, -924, -883, 832, -130, -1406, 895, 1486, -525, -842, -71, -99, 287, 474, -568, 680, 1147, -837, -965, 1357, 1766, 0, -825, 718, 482, -503, -312, 668, 841, -528, -1834, -821, 243, -15, -856, -275, 626, -441, -1427, -273, 1395, 423, -564, 279, 639, -429, -493, 544, 530, 526, 211, -1129, -28, 1221, 204, -365, 982, 495, -976, -579, 389, -144, 425, -155, -1435, -694, -94, -484, -287, 532, 56, -393, -448, -183, 265, 1075, 316, -295, 164, 172, -7, -118, 833, 1016, -194, -974, -206, 698, -31, -409, -10, 422, -127, -820, -636, 540, 880, -629, -1366, 193, 448, -1357, -344, 1183, 419, -923, -476, -5, 291, 896, -139, 202, 1436, 85, -1256, 551, 1796, -16, -820, 158, 77, -589, -311, -6, 437, 87, -733, -1207, 125, 601, -119, -550, 14, 49, -712, -492, 678, 405, 599, 55, -117, -407, 420, 901, 231, 198, 886, -255, -846]
1610h46J303N74j122J76l04r1K86Lp26R25P16j819q08J799R33j432J03P34j02
1629C02k92n10K45J452k35j686k5J308J23j147M30R40l46j452K5J302J69q05j8
1648b20J66k49p24J24J103N17p10j130R26O45n63n03J679p6j090k39J38P15N24
1667A033p26p02N90L08q66l2J187j91o39k68k77L78L96m1o84K37K60p38J57P24
1687A06O09m46p03o5M12N61o33j09J143j16j466R3J139O07j110p45J040J06j137
1706g14k01J227M45p76j190J46J570j00j158L28J434r38j612R14J423m13n67J36
1724d6P1K18l71k02J020O33j618p00J233Q23j149k18J070p73l81K45M7L33k1l90
1744a76l59K23L8k21K98P52l71n56j60O37oJ19M34p79j46O26j44q07R43Q92j399
$$ y = [-846, 457, 1031, -91, 85, -219, -310, -24, -21, -747, 178, 894, -925, -1733, 66, 999, -433, -330, 404, 302, 10, -500, -255, 1197, 962, -724, -749, 559, 682, -465, -35, 905, 559, -893, -868, 434, 603, -202, -220, -54, -303, -1027, -903, 200, 717, 7, -1123, -197, 448, -115, -618, 1061, 985, -105, -344, -206, 509, 1033, 307, -395, 195, 503, -363, -395, 792, 601, -38, -306, -583, -205, 191, 150, -534, -297, -37, -775, -618, 106, 715, 269, -434, -499, -87, 474, -159, -268, 875, 759, -707, -614, 525, 1132, 22, -723, 317, 423, -714, -915, 312, 757, -19, -1209, -1063, 507, 407, -751, -423, 1011, 73, -1539, -625, 798, 385, -182, -46, 25, 243, -128, -330, 690, 1323, -295, -995, 238, 1061, -88, -306, 764, -9, -390, -145, -98, 235, 214, -176, -535, -312, -274, -495, -197, 555, 184, -372, -532, 105, 99, 218, 652, -127, -273, 353, 209, -598, 345, 1237, -162]
1765a62o73Q84M91q41J3O07nP1j049n41J371N50j168n77J017J40r87K05J288k6
1785F08n19q11O09Q29m7r97M23Q78j071p87Q12J124o86p25K04L21K0q72M19P15
1805D47l31n35l09N86L51n35j76N05J73q24M8Q17k34J35J16m4m61L74N31m72J64
1826C26J17n65p7J46K93j5k03n16J39O69o29p8N24L29r76k8K83N47p1p29N5N90
1848A31K69j135J87J077K93j117O3O81Q3m68j95R92l75r14l21O97N25o92j75K08
1868a86N26n09p19P00R11m76r77O13N42m76k67N38o4K35m50o51Q58L12m77j35
1888a52M35p7j87L4J18J21j35N4n07j91O10l31J67r8R7K8o00N08L57m2j86k45
1910b22J90J8L30l87K49L13m27o43L06R01n20o96R34L6m49l32K23P67k84j012
$$ y = [-162, -835, 49, 540, -301, -288, 319, 314, 385, -664, -1205, 166, 716, -452, -1029, -12, 128, -859, -654, 634, 608, 89, -722, -113, 716, 669, -328, 95, 973, -98, -885, -73, 1051, 365, -360, -156, 165, 185, -687, -268, 447, 116, -419, -728, -142, 209, -326, -502, 3, 176, -648, -600, 217, -17, 118, 234, 190, -271, 103, 634, 162, 326, 443, -122, -199, -53, 240, 225, 22, -494, -355, 314, -315, -393, 131, 460, -516, -544, -261, 286, 215, -514, -459, 131, 400, -735, -548, 529, 822, -295, -232, 449, 532, 64, -131, 861, 486, -428, -749, -52, 473, -219, -394, -186, 340, -169, -888, -188, 723, 247, -730, -117, 425, -51, -318, 220, 156, 391, -59, -710, 148, 460, -17, -152, 283, 206, 19, 53, 171, 292, 157, 211, -296, -487, 123, -208, -41, -139, -42, -14, -614, -106, 251, 209, 23, -222, -32, -14, 316, -71, 178, 491, 64, -579, -273, 628, 108, -588, 346, 382, -67, -399, -176, 591, 307, -705]
1930g05k88J075K64q00l0P08j19q71L06R33k21k80l10N58K88q12n9O87L33n93
1950F4m73M31L81m12j54O66j3n62k84K65K44J49l80j48K9M4j10j72M62L69p28
1971c32m1M89l3j6P9k42J00P3Qk86L20K69m34N8l26J28M58q4o58O52j07l42k97
1994e64O64K05n79k6K19L77n00n26O75N24n06m19J73O17p6n17L41K77j21n18M9
2015b31J299l40r00N1K62j62m4j84O25L4o59n38O39L97m42n1M57j2n38N9L48J43
2037B13k04j10J8K90q0k64J92M44l14l45K33n9l4K43N0l70L4j1j18j23O6K71J18
2060A40n74j46O09J46l41M36j05O6m58k62R54K83j016k93O98K13o34j0N28L99
2080F33o52l47M58L16K1o98K84M84p48m85N35O21l83m45J88N14l05k36K85L03
$$ y = [-705, -993, 82, 346, -454, -484, 224, 105, -766, -460, 473, 252, -28, -338, 220, 508, -304, -363, 324, 657, 64, -409, 22, 403, -9, -163, 503, 490, -72, -356, -91, 153, 302, -78, -226, -197, -153, -263, -435, 27, 396, -332, -373, 116, 83, 67, 146, -96, 4, 77, 85, -201, 119, 388, -46, 12, -314, -186, 272, 188, -470, 182, 75, -267, -564, 100, 305, -274, -300, -81, 296, -204, -730, -55, 469, -37, -456, -283, 334, 258, -259, 82, 359, 238, -280, -231, 1068, 728, -172, -121, 141, -21, -65, -249, 376, 410, -249, -787, -148, 249, -193, -244, 213, 201, -337, -278, 70, 213, 9, -101, -83, 207, 127, -137, 55, 499, 185, -160, 73, 14, -20, 223, 273, -97, -63, -74, -192, -315, -249, 22, 140, -434, -580, 29, 175, -166, 270, 165, 231, -227, -489, 465, 748, -268, -561, 137, 350, -284, -294, 234, 633, -19, -366, 92, 408, 429, -269, 15, 499, -249, -734, -199, 422, 39, -406, -218, 296, -9, -245, 40, 343]
2100C43q9l75O8L12J13k65J17J47m8k68l44O14K29n67j77L60l54k08O75p7m10
2121b04J32l0k19ML72n1J15M8k19O1J25j10M0O65o78k76K77Q2nj25J70m5k82m3
2145a96J06L49O6o93J13M12J02n03J85K52Q8n32j06O32Q8m65O8M3J34p4l03M55
2167B21J67Rp42L27J52j33l77L13K59k48l45R5M01oj73j25L22j57oj86N41l28
2189a9o7J44J10k60L33j21l7J89k61m2O8k20L83J06l15j68nL7K5K96m1Q9l30j35
2213b41j02P73k40k27q9L79m63QJ23K37l7j80j23M33q0n8N1J08L6l76J4L37j30
2236A53O6j24j47L96k65o17P85J0n58Q2J95K18m90K11L26k0n85o1M83r5K73l85
2258a49J7K20N2k12J51M05j92m91P2K17k65M26k3l25J93j98J41r0n3j18K61m74
$$ y = [343, 254, -121, -53, 259, 372, 107, 224, 371, 323, 55, -289, 325, 554, -13, -190, 170, -184, -392, 283, 206, -204, -72, -102, -321, -317, 55, 4, 119, 167, -52, 9, 134, 24, 64, 729, 51, -225, 52, 134, 129, 4, 174, 129, -153, -196, -90, 259, 325, -368, -255, 157, 259, -244, -59, 193, 281, -251, -357, 275, 363, -102, -34, 9, 143, 69, -234, 221, 388, 397, -345, -18, 134, 1, -376, -63, 196, -52, -397, -302, 99, 93, -80, -205, 117, -40, -46, -232, 309, -19, -86, 58, 168, -92, 241, 120, 83, 272, 11, -31, 37, -183, 200, 306, -9, -177, -182, -145, -120, 176, 135, 224, -106, -241, -343, 430, 190, -37, -126, 253, -210, -202, -79, 158, 121, -59, -182, 251, 171, 113, 164, 272, 308, -68, -54, 283, 153, 219, 95, -52, 344, 79, -538, 247, 257, -301, -219, -24, 194, -296, -85, 241, 221, -364, -425, 58, -37, 236, -149, -132, 88, 140, -72, 79, 484, 292, -199, -127, 90, -175, 251, 228, -97, 96, -102, 39, -51, -104, -222, 39, -435]
2280d35K01K88j76m6L6K24J23j27j17J21K00k22k82L79J51j65k94M08N6k91k92
2301b60L2O37l48l85L35J41J15m83J03N79o54j51K5M96J22n94L73K26P3o23o2
2322c03L76K16l09q2J06L22l65L6L85K7k52k21K00j46j02j54M25J15k63k09k7
2343b25M6J52m8L32k06K0k27L06l44N5L37j10k4j03P1j2p6J30r9J27l07J70J77
2366A42j18k28k05N63q5m05j11M63L33k75m46N59j41J8k10P4L90q8m35M68K59
2387E22l99l64M05M1j38k04P1K90O4n10o3M66l26K58l16K51k5j94p8J53M6n2K35
2410A33j22J46m52L83L21l01l15J41J8K4J0J2J06o3k48k3K90Q6nj78j00j72K53
2433e6j05Nr0K57J93k46k1o4J09J74m47m9M82K0k32J26J12N2m12l0K45M47m51
$$ y = [-435, -234, 54, -122, -168, -132, 92, 215, 88, -29, 92, 292, 70, -212, 167, 318, 153, -141, 267, 323, 32, -260, -228, 409, 61, -324, 11, 152, 267, -216, -113, 466, -188, -339, -314, 182, 304, -290, 83, 309, 382, -241, -303, 73, 289, -20, -102, 4, 326, -39, -3, 382, 409, 157, -64, 136, -10, -112, -266, 159, 274, 11, -198, -225, -179, -27, -75, 257, 51, 71, -156, 150, -194, -139, 198, 88, 64, -39, 32, 20, -56, 74, -25, 102, -205, -35, 142, 24, -204, -409, 154, 69, -336, -447, 16, 349, 74, -372, 187, 46, 64, -146, -72, 318, 230, -205, 263, 522, 123, -241, 164, 205, 67, -137, -66, 224, 288, -222, -285, 181, -145, 113, -203, 48, 23, -171, -249, -96, -50, -102, 133, 11, 157, -295, 88, 409, 108, -207, -66, -48, -24, -14, -2, 104, 41, -207, -230, 60, 146, 141, -37, -137, -309, -56, -161, -156, -246, 11, 204, -42, -63, -127, -18, 156, -291, -340, 142, 162, -70, 56, 168, 220, -192, -222, 23, 470, 19]
2456A9j59L29O4l80K62j51L43n13O4o6J60K02n99M51R3p4j41K17l52L80j45O2
2478F6K7j82k13R3L64Q2k84o9K08k13K07k03R6k10J6K65J65j59k12J76k07Q2L7
2501f8k8r9J31J12m5pQ4k6qK64m24K70M9N6k62M8no1j15m9L52j60q7J17n5J52
2527A36m1j86K45L36m84j98J31Mo1l1K61K89l11m46M27K6m1k30M42j13m1m63L36
2550a3K35k63l02K57J40k15J41k8P8N2j98m2M78m61L01m20M30l34J54J00K5j7
2572I8OK7j38j40P5J92J19j33o5K25K3o39L09J77m8k70j80L12j06K24j23L14n06
2595b47k4L8L14K53l85l6J90k6k48JK95K09m97L53O9J37o69J79L55j42l45K43
2617A7J7J93j66l21M21k53p5l70M16J08k25P7J52L1o2mJ94p1O4N1l89K88j33l1
$$ y = [19, -140, 189, 253, -127, 135, -16, 327, -186, -122, -188, -28, 174, -425, 26, 119, 45, -96, 121, -231, 149, 4, 66, 93, -89, -302, -209, 155, 237, -47, -116, 92, -121, 86, -117, -21, -231, -215, 50, 215, 56, -156, 20, -187, -105, -68, -96, -195, -64, 48, 3, -4, 80, 54, 46, 310, -114, 156, 205, 261, -1, 47, 42, -19, -134, -183, 169, 9, -78, 39, -16, 136, 95, -91, 154, 490, 6, -192, -61, -57, -118, -149, 112, 401, 90, -356, 71, 97, 56, -174, 268, 155, 114, -349, -13, 222, -41, -343, -86, 54, -161, -20, -48, 30, 82, -116, -158, 320, -141, 160, -260, 170, -164, -10, 90, 115, 98, 104, 131, -7, -147, -72, 120, 239, 106, 41, 266, 289, -350, -41, 136, 88, -182, -362, -50, -156, 68, -55, 259, -247, -271, -233, 81, 334, -51, -87, 103, 77, -171, -170, 125, 334, -163, 190, 259, 396, -273, -94, 261, 119, -226, 17, 34, 227, 61, -260, 161, -92, -167, -537, -121, -13, -238, -161, -9, 22, -40, -44, 150, 79, 143, 194, -195, 93, -40, -71]
2641g1N2L59m30J01J06l04Q8J40j79L69k60l61L56j20J08K19n3j19J67n32K69
2662i5k64K89M0J1N1j37K8K83m11r7K68Q3R2k16K16p0p6j10J28J32k90P8j07K32
2686E8n8j82J14J59q8j96K6N36l21k51r4K56L33K0l42L24j13k25J36o5J8m0J01
2709A06q3j92L82j58J14j69j06L99k33j63m3Q7J30J15n7k97P1p0MJ05Q5q3l3R7
2733HJ34n7q1K79j20j7j18j52M24n12O6K81m9j4ol28L99j17j51j31Q5L81j35m6
2757B3Q5k96J23L26r1m62J93Q5J44l19J63J05J25q3p4r7J21m2k38J37J68pk12
2780a23r1M08k73O4k0o3M5M1K73j2j97j3n8k80K85J83l34kJ82l1K76k72p0J09
2804B7pk81J47K65j89j24J81rk17r2K14P0k10J88J12j15k48M54ll44J22L84l60
$$ y = [-71, -19, 340, -90, 11, 117, -187, -99, 41, -138, 231, -29, -390, -34, -154, -46, 173, 120, 1, 168, -364, -95, -359, -70, -30, -19, 32, -105, -77, 206, -205, -302, -34, 49, 141, -75, 141, 71, -5, -115, 13, 145, -145, -67, -174, 58, 0, -182, -68, 91, 3, -193, -167, 369, 48, -203, -297, -41, 292, 312, -30, 294, 181, -44, 92, 27, 45, 5, 106, 23, -169, 213, 55, 169, 0, -106, 293, 60, -103, -146, -59, 71, 186, 129, -168, -97, -167, -163, -58, 27, -56, -89, 8, 142, 85, 4, 283, 163, 146, 28, -124, 300, -212, -146, 135, 86, 72, 66, -262, 137, 20, -131, -262, -177, 204, 69, 23, 108, -188, -65, 261, 170, -292, -99, -14, 130, -189, -26, 79, 204, 121, 47, -50, 71, 29, -209, -72, 96, 89, -123, -214, 194, -79, -15, -35, -98, -53, -12, 261, 249, 52, 39, -19, -299, -14, 169, -165, -167, 15, -16, 260, -12, -82, 27, 20, -261, -114, 151, -38, -162, 19, 10, -207, -299, -85, -15, -225, -37, 75, -40, -288, 166, 163, -181, -59, 325, -35]
2827c5K7M8L38j99j31N0J54l94J61qo7p9l1J47L20l10k68L05P2j49k3o8J88r2
2851d4n1N0L16j57q5Q8j60K59k92J15K8p3J4j24p6L37p7m04K40K3o6K59j84o3
2875a27K15j60J64Kn9n8J73l00L90l66K75pj00J3n3J41j64o0K3J33k9n8K8j47
2899a31q5K24J79l76L21Rrn0l64L75L24m08k03K83p5J71k73K64j8k92J16L20j86
2922A16l03M92o4l93J85n4K13k49M8j00J28J23j87j74J56n3M3J63K3j09nJ34l18
2945a85l4K77K64n47J4J19J45l5K5l1L40m35K21j69p7p6L23k40K21ml20J24O3
2968a7O7J1L9k89K66M0k75M17m14M99l02j94L12j60l0n7J82n5N9j60L22p2j84
2991Er9j02J41j96L32J60j76j0k91M5L35j1k48K27O1p8p3l0J60j57M3N6k2O3l89
$$ y = [-35, -8, 40, 378, 179, 48, 98, 252, -142, 19, 11, -56, -135, -166, -19, 301, -9, -277, 28, 100, -49, -72, -140, 48, -44, -95, -45, 271, 114, 29, 117, -43, 216, -76, 39, 67, -6, 8, -116, -192, 145, 68, -336, -96, -73, -139, 120, -64, -127, 88, -72, 92, 94, 35, -23, 150, -150, 240, -126, 149, 142, 42, 55, 2, 143, -21, -81, -58, 75, 46, -12, 16, -131, -216, 8, 187, -189, 132, 141, 132, 82, -282, 93, 417, 9, -194, 89, 14, 185, -88, 176, 158, -134, -18, 302, 116, -187, 305, 241, -152, 33, -21, 192, -57, -9, -109, 19, 142, -45, -219, -63, -116, -73, 90, 113, 4, -1, 133, -185, -219, 58, 322, -225, -211, -92, 53, 18, 43, 12, 352, -83, 138, -31, -108, -184, 139, -101, 120, 116, -204, -80, -17, 50, 61, 100, -189, 77, 117, -158, 259, -155, 344, 42, -152, 160, 0, -30, -87, 95, 40, 99, -61, 261, 189, 5, -94, -196, -55, -251, 81, 241, 65, 55, -236, -191, 144, 133, -115, 112, 173, 95, 22, -8, 152, -5, 38, 94, 72, 135, -254]
3016b54L04J40k97p9J83M6Qj58R6j78K42M5j24Q9M9o7R0j01k31M88m07J02j73
3039a87K73j00j21O5K76k79J17j4M5j46P8o4j53K27P5j85J93O4q5j60K09k1J23
3062B30k40O3op5K11l83L21n2j28L7o0J90l02K70j95J30l9J39j67p5J72q4J54
3085A11j92O1J6L6M5j05m4K5k61M16j94j13J60p1L6L3k2j39J55R5k9R0k60L0K01
3110H0j88JK98k61P9Q3j63O0%n0M0O6l69L34J88R0n48J85Pj72K60j20K44j02M7
3135H9j07r5J55j49K68k40K21j7j8k3j22K5o1M9K85K6l58l6J24o2p9o5J83r5L4
3160f8o4K32j59o5L10k05K30p8Jj09LJ28j40J22J17n64K37J25p6QN7k1k56K01
3184c4l0q1P0J49O1k07J26O4r3k59p7K44J65m7J17n7m3j72J13l10K28L02k90J55
$$ y = [-254, 50, 190, -107, -186, -3, 43, 51, -107, -11, -189, 53, 98, -26, 63, 112, 45, 135, 34, -197, 291, -116, -14, -187, 86, -14, -135, -70, 206, -73, 44, 30, 75, -71, 7, -57, -210, 17, 92, -93, 100, 164, 79, -81, 128, 107, 230, -10, 53, 47, -28, 183, -200, 121, 69, -59, -22, -82, 108, -194, 76, -119, 11, -28, 111, -56, -131, 41, -43, 111, -81, -20, -4, 32, 77, -28, -72, -47, -308, 108, -86, -199, -39, -110, -74, -41, -63, -202, -47, 48, 19, 109, -151, -121, 80, -108, -107, 191, -70, 9, 92, -71, -11, -11, -61, -21, 45, -324, 10, 198, 288, -260, -75, -68, -240, 20, -100, 144, 42, 89, -18, -113, 42, -107, 161, -79, 142, 125, 107, 84, -38, -13, -74, -25, 260, 286, -72, -108, 16, -46, -125, -190, -7, -102, -68, -132, 100, -59, -124, 186, -19, 211, 133, 134, 25, 28, 156, 16, 138, 255, -309, -72, 53, -23, -15, 42, 21, -235, -34, -64, -145, -75, 74, 135, -72, 54, 118, 25, -234, -311, -67, 98, 51, 168, 111, 68, -104, 9, -301, -73, 229, -61, 94]
3208I4j13k16M02k65J14l5k1k40M88j65p8L26m78K50j46JJ89J66j44j61L3j0J6
3231Gk12J32K84k51K9j62L11p7j65J75l34J14K23j51O2q4N6j38K91j44K00k40
3253g4J47ro2M5j20J21k69M77j01k34K46n5j49K5M7j45Q4J12k60L04j94J88m5
3276G9j5m5j76K97j50k66L20J37l49K75J96l75L17j03k36q5L5M00J4k40n4J54
3298A30l27J66J3Q2O2l1J23j95k30J10J86P6m15K63k7J5n1Q3j62J02K59m04J26
3321d6J32r9J50j38O6k19M6K99k13J96j65J01j76P4J69j25Nk4J1L1k32K06l5n5
3345d1j31L35o1k31M57k95j03J33q1n0R0r8N8l2N4j80J90K2k14J76n3p1Q9n5K2
3370g0j16Q8P9j8K27l35K68K4M0q7K9j48P7k4j4J79l47N4J97k90K91j60J82k75
$$ y = [94, -19, -235, 167, -98, 16, -19, -40, -280, 208, 43, -35, 291, -187, 63, -83, -82, 107, 273, 129, -32, 1, -9, 7, -205, -73, 211, -40, -11, -173, 138, 61, -104, 71, -263, -149, 74, -77, -15, -99, -43, -181, 110, -34, 166, -74, 73, 64, 2, 47, -73, 48, -221, 256, 155, -79, 167, 112, -37, -12, 35, -110, -26, 86, -174, 130, -64, 124, 79, 64, 19, -157, 140, -10, -276, 44, 181, -168, 107, 303, -72, 245, 142, -94, -179, -144, 256, 270, 30, -24, 130, -197, -31, -18, 64, 126, 95, 218, 23, -207, -97, 89, 165, -250, 13, -14, 1, -50, 33, -129, -27, 232, -172, -46, 86, -13, 137, -1, 65, -154, -108, 191, -22, 174, 9, 110, -66, 8, 177, 52, 57, 33, 44, 75, -157, 49, 14, -41, -172, 163, 102, -129, 328, 33, -70, 63, -18, -68, 22, -76, -18, -50, 4, -176, 14, 36, -178, -2, -55, -126, -37, -92, -70, -186, -98, -19, -37, 190, -145, 123, 147, 187, 100, 129, -19, 58, 34, 20, 199, -148, -94, 103, -187, 104, -56, 126, -149]
3394a49K35o4L1J4j89l6K48K16r7m8K02m79L36m23j4mN19l64j14K07J81k30J03
3417H1j74J84j16j44J98j85N9k0J91k30J40q5J2Q5O3j43J93o7q7o6J04l9j69L96
3441A81J7k38R2j09J41j06o0J13r1r7Q0Q9j49L58m22M1j4N5J3L13k46R6m8K26
3465B35k27j82K97k46Q1J46r2P8K12k78k01J34O2r5k3l66N57m27M81j03j24k07
3487b88K71J26j45k26J65J68P7k35M7k66L74j5N2J63k24J07j32k7n2k55O07l94
3509a02K03j44P1K12m39O2L34k03o8J36MJ15l17K99l54J83J46j24j3k6j0j79K71
3532E7N2j70j30K03O5K00j51j13n4O0J56o0k12J17L9n0O7l88K20K16j1J18k72
3555d1k38OM75l51K95o6j75L4R6R4Q3j67j33o7Q3J04J65j16J08k77J59j25L59
$$ y = [-149, 86, 22, 53, 67, -122, -158, 90, 306, 209, 161, 363, -116, 220, -203, -217, -221, 298, -66, -180, 27, 208, -22, 81, -93, 91, -25, -169, 29, -156, -97, -117, 74, -156, -16, -101, -89, -4, 59, -84, 109, 42, -45, -111, -7, -46, -215, 181, 198, -40, 52, -57, 84, -22, -82, 31, -60, -157, -77, 12, -137, 221, -201, -160, -174, -119, -106, 207, -39, 57, 9, 235, 8, -174, 123, -123, -42, 104, 12, 90, 302, 24, -177, -43, 19, -76, -99, -465, 92, -335, 146, 43, -81, -288, -17, 109, -36, -262, -97, 71, 148, -87, -40, -306, 68, 53, 105, 268, 44, 151, 19, -8, -60, -315, 292, -102, 101, -43, 28, 240, -199, -137, 197, -6, -74, 62, 66, 181, -136, 163, -191, -8, 138, 14, 1, -25, -35, -214, 57, 109, -61, -191, 12, 77, 277, 126, 13, -41, 19, 175, 115, -97, 20, 59, 9, 76, -312, -92, 124, 113, 231, -41, -279, -273, 202, -149, 146, 80, -95, -61, 35, 129, 212, 45, -88, -155, -72, 32, 197, 81, 189, -88, 71, -54, 305]
3578C05j51l60R8N4K99j15k4K24k47j02K28j97j3j77K75O4j49j14J57L3J07j31
3600F4j78lJ01k40L00o8j7j08l1K31M6k75o0m1J06L41k99k12L30LQ9j09K06j81
3624eK76j87k96K47MJ46k23j32K86L5j80j8K00O0k36J16J60Ok58k9j64M16O1l97
3648a12K55q3j75m1L7K31k64K26N6l7nJ03j81L5k15Q6J13j65J27m7j7L7r4k7J04
3673e3q3J67k13K94k41j06J76j45L3K92j05J65l97L31K4k66K58p4q9R0k21K62
3695I9K4j03l7k29L87Q0j12O6k40J19j07k50M79q1J61n18K57M6n8k21L25k10J41
3718A8j14K32J34l72k23M98K71n12K19m2J10j76l6l4O4r6J6p0J19J90j8j64L3
3741D7j79K65l77K75N2j26k9o2K61l75n6N2K49M9RNk72K81j12o0j07O7K44r4Q1
$$ y = [305, 154, -206, -108, -54, 245, 130, 106, 330, 83, -19, 209, 12, -1, -178, 97, 161, 12, -102, 55, 88, 195, 64, -114, -117, -16, -256, 44, -24, -41, -149, -180, 51, 97, -178, -238, -279, -173, 168, -131, -343, -13, -10, 79, -30, 176, -5, 271, 84, -212, 35, 39, 185, -38, -170, 116, 151, -29, -47, 153, 213, -23, 93, 253, 259, 1, -28, -192, 224, 285, -112, 143, 60, -115, -156, -119, 112, -152, 74, 130, 93, 88, 191, 10, 45, -170, -84, 29, -136, -9, -56, -73, -36, -130, -157, -53, -136, 31, -182, 112, -129, -235, -59, -204, -171, 121, 16, 181, -216, 115, 139, -127, 131, 57, -32, 58, -163, 99, 123, 20, -17, -246, 141, 221, 109, 175, -65, 54, -53, -303, 176, 95, 256, -262, -5, 41, -17, -238, 87, -123, 18, -96, 136, 270, -102, -325, 173, 444, -68, 151, 109, 219, 43, 7, -27, 37, -59, -43, -113, 6, 196, 178, 14, 47, -132, 133, -244, 31, 83, -43, -72, -134, 127, -248, -304, -252, -3, 46, 55, 60, -212, 69, -43, -103, -210, -143, 101, 7, 88]
3766H8lj54J35n2Q9j53J84J13l07nJ61k43J13l1K01j32r7J72j89qk06O4J68j14
3790b06J02J57k29L34j06l11J44J91k17R1K49n0k58J10J17j37j27J64J7K7k07
3811a45J60n8M38l34J80j15l18n5P0J16J60j8N1k81J83j05j70J90l6L24k31k04
3833a98J96k9j1Rj50K29j37K36k80M01k53O2J69j39O2k50q3L03Q6o3k83J16N0
3856D3k64J88J22l0P9k23k99K51J98K59k65j12O4o3L4J33n7j46r7M76L7j30j20
3879G8k41L06j65k4J07l3J6m73N95q0k0j10N7J3j31m1K9K28j75Lj11M25n52K91
3903hJ29N1j02l09P1pK16J6q2K48k18L98l65M7j03J60r1m1o5j17L76k86k2R3r4
3928a05N5J51l17M63l32J02k3J10j77j09M12Kn8m28K76k1L8K3j02r2K74k94R9
$$ y = [88, 85, -69, 66, 14, 103, -50, 134, 247, -60, -65, 96, -147, -34, -65, 136, 4, -93, 79, -110, -118, -324, -260, -92, -206, -104, 53, -176, 158, 52, -259, -115, 76, -141, -50, 199, 149, -109, 1, 118, -19, -146, 18, 35, 62, -145, 15, -43, 395, 61, 241, 126, -192, -247, -177, -61, 99, 81, 132, -149, 34, -71, -241, -51, -87, 237, 6, -198, -2, -31, -42, -33, -183, 46, -91, 145, -135, 266, 13, 75, 244, 105, 167, -83, -166, 137, 223, 160, -123, -7, 43, -221, -33, 89, 59, 138, -85, -384, -133, 65, 324, 59, -53, 11, -52, -18, 115, 58, -88, -185, 291, 328, 198, 78, -163, 143, -22, -46, 61, 28, 44, -429, 166, 86, 66, -44, 13, 26, -105, -146, -117, 111, -64, -61, -172, 253, -299, -8, 121, 172, 70, -239, -168, -175, 41, 57, -25, 223, 5, 403, 38, 85, -18, 142, 51, 10, -55, -172, 204, -82, -104, -11, -105, -50, 101, -216, 247, -85, 17, -6, 104, -73, -182, 230, 232, 174, -254, 22, 1, 39, 62, -40, -132, 142, -152, -53]
3951e3O9P2j41m5j58K50ln7R6k45L22m9O1j24m8K8K8L06l45r5K44k42K15R5l23
3976a42L4q2M03j99q3L67j57k82l0KJ18R3O5J2k26J82j8l4K6n5J18p8j7K48l08
4001d3K42l98R4J10qM7k2OPk29J6K27J45J2r6k29p7K00j14J03l3L0r5K67k54j34
4027b26J41J96J05o1l06L03l96K18M2j42j0J86p6o5J88l16M04j74J17j91J71q4
4049B4k22J5J94j60J33q7K29k66k1M25j78m8J17k3r2k8k34K51L0m07M31Kl66J84
4073i7K60j66M7m7P9J03j38j71K3J05p1Q7j85J22J08j12j9MJ16N6j90J97r0Q1
4097A02j68L59k50Mj89O2J19j5r3J71k09L53m99L54r6J0j12J18O1Oq7r8K08m3
4121F8P4K46l43J25r0j74j08K25l03L7M1K18M8r9J99j47m4j63K57j80j0P8k56
$$ y = [-53, 16, 88, -53, -98, -256, -6, -9, -66, 30, -215, 107, 58, 119, -5, -53, -25, 3, 309, -36, -131, 113, -129, 86, 181, -142, -108, -190, 213, 14, -69, 298, 141, -141, -171, -169, -51, 42, 107, 119, -107, 75, 57, 23, 49, -6, 112, 34, 17, 265, -43, 199, -199, -105, 5, -3, 44, 22, 28, 35, -194, -178, 49, 194, 206, 110, -119, -196, 4, -110, -7, -40, -10, -105, 162, -92, -226, -85, 111, 216, 155, -151, 152, -244, -26, 16, -126, -136, 50, -26, -91, 97, -219, 185, 11, 128, -63, 108, 24, -198, -183, 11, -149, -16, -103, 126, -140, -161, 264, 86, 38, 155, 132, 40, 12, -222, 29, 59, -348, 83, 85, -281, -97, 163, -3, 44, -3, 76, 179, 41, -130, -107, -2, -73, 14, -171, -49, 59, -53, -72, -68, 48, 104, -86, 111, 21, 102, -66, 293, 43, 47, -142, -80, 39, 24, -69, 102, -107, 246, -253, 101, 5, 15, -97, 21, 82, 88, 1, -97, 111, 68, 142, 388, 45, 170, 80, -94, -202, 23, -280, -243, -202, 16, 64, -35, 164, 17, -27, -190, 67, -113, -123, -45, -301]
4144c01N10K9m21K30o0n0lK24j82J8k62J75K86k8rm42K79K6K7j68L5M50k60k50
4168a47j0N5N1Q8M8j62k17J93m3n2P7K47k45n0R5J87j32k88L16J47J1k55J2N0
4192b4J52l45K87j49j18n9J74L7Q6l85J75N4K00j50Ol9K61k45k2K30k11P8o4J52
4216H1j36N0K21l01J79J38k98J46J35l61J1J90j55l3M16l32M5l3%K3N9k69K77
4239E3j38J84j09j3J06k75N3M1K56K4l53L08k9o4qj06J24K3k82J75R1l5k1j64
4263a59K16L3j33J33N9j34j13J24L5k35J91J16Q8n5k37Q5j59J07K38l23L13l04
4285a14J31Koj02M7K89l89k4J71rQ9m0mN0l33K16Q5n6J19j17rK10j59o6J28J14
4311B23q6k14L23qj79N9l85J06Q0m8K03r1J40p8r2p2K83k86j4P8Q8K53m51K1O1
$$ y = [-301, 209, 238, -183, 47, -13, -63, -66, 158, -24, -6, -268, -93, 193, 165, 156, -286, -7, 19, 46, -122, -87, 363, 103, -147, -157, -102, -51, 37, 85, -77, -294, -101, -144, -196, -119, 128, -117, -167, -72, 115, -17, -305, 11, 158, 169, -86, -74, -24, 128, -217, 70, -79, -197, -256, -82, -45, 41, -344, -169, -115, 85, -65, -59, -98, 163, -82, -104, 126, -85, -7, -71, 81, -55, -5, 216, -85, 94, 232, -66, 80, 215, -146, -135, 55, -100, -133, 283, -49, -4, -37, -37, -14, 45, -224, 53, -85, 99, -10, -23, 83, -192, -139, -98, 158, 182, -171, 137, 108, 44, 36, -70, 54, 77, -205, -30, 61, 26, 5, -159, 57, 90, -43, 90, 149, 15, -98, 26, 61, -174, 17, 133, 221, 166, -71, 14, -145, -38, 200, -123, 190, -114, 17, 19, 13, -89, -42, 247, -142, -166, 5, -4, 85, 45, 41, 91, -242, -26, 59, 3, 122, 5, -4, 206, 47, -19, 109, 223, 137, -77, 246, 238, 59, 118, -267, -161, -81, -129, 74, -17, 123, 45, -47, -119, 164, -122, -136, -58, 30, 283, -168, -147, -86]
4336h6mn9O4r1J08J78q1mM4L9L5j12K32o8j5k71j61L11Jp2M8j74J2J46J21k66
4362a25M5J2r2o4J33J28k89L20PJ94k93J50j96n7K78j72j88K63o2j52L10n5lk05
4386a13o3M52l59q0J91K57n34J65J32n9M55k54k2l29J22J39k16K18l9j30M06m24
4408h5K30l64L24r9m21L88M6J51k07K91k90R7k2O2J18p6k37J10L4j00l9L0J54
4431I5k30Q4N9K11j74L2K24l72J14j63R9q4K33j32j5QJ73l3P8j76m0nM5j2k44
4456b25j24K77K22j61p4J22o4J1J20Pk29J63j75RK08l38L72l15N10k84k12R2j24
4479b12Q3M85k61J71j85j04J8k01k28J99J97O8Jn8Q6k28K60k39j80Q4J00j95L36
4502cM9j92J83N1k46oL56l30L08k32k51L14k6J14j16R1r4n2K63o4m51J93J85j10
$$ y = [-86, -90, -149, -85, -176, -68, 110, 29, 25, 69, 108, 143, 31, 263, 195, 180, -91, -252, 59, 60, -12, 36, -138, -126, 20, 141, -125, -80, -68, -160, -224, -91, 37, -252, 68, 75, 269, -24, 126, -70, -127, 151, -21, -209, 54, -8, -160, 150, 95, 92, -113, -176, 276, -83, -163, 28, 285, -249, -84, 48, -11, 444, 190, 168, -161, -39, 100, -116, 102, 63, -67, 339, -85, 145, -219, 105, 6, -415, -27, 19, 170, -37, 254, -36, 61, 39, 101, 219, 143, -94, 16, 50, -50, -89, -59, 95, -135, -51, 8, 219, 45, 77, 301, -71, 43, -120, -21, -105, 128, -4, -19, -11, 162, 129, 207, 31, -9, -14, 31, 19, -225, -349, -72, 150, -11, -85, 37, -27, -16, 104, 111, -118, 45, -130, -121, 87, -251, 121, -194, 316, 32, -180, -88, -212, -129, 356, 95, 266, 81, -23, -5, -206, -434, -235, -38, 30, 31, -27, 59, -169, 91, -148, -328, -244, -144, -339, -3, 46, -146, 37, 88, -158, -164, 192, -138, 170, -62, -313, 1, -25, 89, -27, 64, -30, -82, 181, 117, -334, -141, 44, -66]
4526f6p6j7K38r3J2J11m04J46K65l03K15k33K17J55j64P8K04l52p3J69P0q5k77
4549b63K81K98m90J57K64m65L25k48N3L59k62J43r2mR2k59J80o5j13J51j44K84
4571A82k23l9O7K04l40J44k6J17j22o2m6K77P0j59K1k79J42J6j2j27J60N2Q2p9
4595B0m6QN8L3p5J33q6k25r2J72J13J19j90l9Q4j5m1J22O2j26j79K55J93j08j27
4620B3N8J74j96J27k69PK96j03l48K82Ok46K63r8N9R2j55R3j32o7J94r7N9q7k1
4645h6r8K32M7j06R8M4l17K35J33p9l34K20Q5j59J60j64j85J50K06j50L25k77
4667b0R8J9j90J82k14N6L13k88j99J08L87j70j55nK1j14K35k01Q3J74k49K92j51
4690A2J09l06K98k20J44k98K12j07M31k64P0j07K27k8l22K10k13J12J20J2m7j05
$$ y = [-66, -142, -159, 79, -14, -2, 109, -295, -149, 116, -187, 28, -205, 12, 167, 3, 81, 285, -67, -140, 29, 99, 14, -263, 18, 316, -174, -17, 247, -218, 107, -141, -88, 271, 9, 152, 60, 56, 148, -111, 69, 4, -109, 42, -102, 182, -41, -80, -13, 191, -149, -5, -31, 86, -36, -98, -144, 133, 203, 44, 65, -214, -72, -56, -68, -195, -35, 17, 99, 20, -26, -18, 40, 73, -2, 131, 45, -180, -272, -100, 13, 132, -58, -97, -13, -28, -69, 53, 115, -11, -190, 65, 258, 150, 23, 81, 255, 59, 186, -83, -76, 220, 117, -231, 51, 57, -189, 74, -24, 35, 127, -28, 65, -67, -134, 60, -37, 22, -65, -86, -184, 48, 95, -11, 87, 131, -186, 49, 182, 103, -231, -11, 74, -85, 75, -89, -274, -124, 82, -68, 257, -20, 78, 97, -93, 89, -125, -69, 244, -44, -243, -135, 252, 82, -73, -78, -57, -171, 64, -137, -54, 120, -129, 163, 12, 121, -185, 113, -107, 37, -261, -49, -156, 275, 11, 81, -26, 201, 173, -149, 61, -152, -40, 80, 92, 45, -60]
4712f0l2K43n2j59n5J28K92j03m13K12Q8l22K98J8p8J87m50K73O1l97R7J74k6
4735g6k8K93L1J8l09P2j57K09j92K02j37R6Qk62K41Q6j60K32q4J10J30o33J78
4758a32K13j75o4K18L6j18k44K61j15k7K05k04M39l18j51M48r8j71k07J33J60
4779H9q0m0K29m57K29J51l19J72m6N1J28O8p5m0M3j47j07o7J54J07o7j08J85J0
4803F3j91K84K1k47K03j04o5k55J83R4P2k04j7R3L07q3r6k11J31j78K55r1L27
4826B91j23l61J96l3M7J38j05K7m09J85K66p2l9p9j7k3J32P5j29J50j91j04lJ45
4850c6J31j06J25j55M39n46R1L11k33P7l8J57l62j3J47J10k1kl6n1L6j20k45K47
4874i3J68p6L82j45n44L20r3J16J48l73J74p1p2J77q8K27k81j53K23K22o2k01
$$ y = [-60, -92, 151, 99, -60, -115, 13, 305, 202, -211, 1, 89, -233, 65, 83, 5, 192, -258, 15, 76, -321, -224, -50, -76, -104, 189, 220, 238, -71, 1, -156, 53, -139, 63, -74, 22, 30, -232, 9, 95, -65, 167, 83, 193, 323, -310, -132, 81, -94, -158, 60, 96, -22, -266, -5, -120, -147, 58, -146, 293, -25, -176, 272, 174, 3, -204, -71, 89, 9, -31, 198, -259, -30, 121, -198, -26, -72, -21, 107, 175, 100, 60, 103, -44, -151, -218, -64, 43, -24, -132, 53, 63, -128, 156, 177, -70, 133, 29, -36, -291, -108, -14, 58, -146, -163, -70, 237, 154, 58, -153, -22, -200, 55, -36, 291, 168, -193, 3, -30, 17, 155, 50, 77, -332, -147, 119, 47, 8, -71, -88, -111, 21, 96, -33, 117, -74, -178, -181, -36, 95, -11, 114, -41, 398, -148, -57, 254, 21, 98, 60, 217, -145, -158, -11, 99, 78, 76, 40, -11, 25, -95, -340, -93, 75, -1, 381, 236, -308, 12, -81, 35, 183, -190, -16, -87, -159, 18, -70, 157, -124, -277, -54, 168, 106, -95]
4896i5R5n4O0j75J25Q0R1k90K53j02n1R0k05K65K8j51k37K22K9O6P0l7j3k02J30
4921hK6j42QM1L09j59l12J41N6J69k20Q1K73J80m64K81j83mO8k02J18J14l36j0
4945a75M39m97J54k1PJ99n4j55K0J78Mj00J11l22J90J24j89j19J22L61k68P4K4
4968A07J25j40m9K3j73J16k7r8J97k37L0K38rj7j12p5J31j6m30M22K11j98r8J01
4992B2j53L6K4pO5j27o9L12q4k31qK19r4J51k33Q5M4K56k55j53%K00J20k67K59
5017A12O4r6K2l1m1m6N5j45O8m0J92J15j33j07K06k20J04Q3j28J71n7j89k8J54
5041H5l1j14N14n46j27Q4K16j21k5K8n1j00L78j59J18l75J38M7M8j01mO4p1K09
5065A04pj93N2j73P8J04N2KJ12l06K69j72K13J25n72m0J68M9k29K11K72k01k3
$$ y = [-95, 0, -54, 6, -169, -44, 36, 127, -163, 90, -12, -63, 27, -178, 87, 115, -36, -273, -51, -22, 44, 114, 77, 64, -138, -8, 18, -124, -116, -75, 234, 75, -237, -96, -40, 129, -91, -10, 263, 443, -21, 260, 77, 73, 141, -61, 57, 171, -165, -175, 264, -233, -79, -100, -93, 106, 52, -103, -83, 95, 99, -1, 110, -212, -22, 102, -87, -206, -84, 277, 9, 83, 107, 232, 92, 43, 66, -107, 9, -18, -116, 81, -156, -126, 112, 103, 86, -26, -101, 30, 14, -416, 6, 217, 19, -79, 22, -131, -95, -71, -78, -13, -140, -209, 103, 19, -212, -220, -1, -95, 56, -177, -92, -48, 208, -47, -200, -200, 0, 120, -147, 112, 176, 80, 102, 71, 30, -16, 39, -106, -38, -78, 114, 229, 96, -11, 195, -25, 79, 162, 34, 205, 148, -41, -69, 85, 54, -60, 454, -92, -219, -135, 81, -40, -65, -37, -88, -188, 190, 31, 149, -226, -88, -41, 7, -94, -98, -34, -105, 104, 97, -96, -44, -217, -139, -35, 17, 19, 131, -175, 94, -78, 135, 260, -312, -352, -184, -135, -364, -153, 119, -82, -105]
5088a05L05j45R3k03q6K61p7o7n9J65k3OJ09k96J34M7k04j38K38K15k03J94l92
5111b31K09M4Jj85J73m3j76K00J12j26K20k11j20J08J25k92M15l15kp3LK15Q7
5134A38l0Mrj19kj10J41J10o0K2j88K84M8k54K19J22k68p8J97J63l17K3L6L0P4
5159A76n2j04J0j69J45L51o13K45l8J45j34J34k22J49M0M8r3M2j05P7k46J60j52
5182b06N6N0j40L70O0j40j09n6K4q4L53n6l27J84m1K16j33j06P6jJ63j20q7p4
5206a28J77l5J44K7j43q9R7k69J18O0K3O6R5Ko8k7j60O9K95k27k14K64l16L18
5230G9j73N4j8N0j23J88j09L6J85j43j34N0L4r7o9J75o6K3K5PRK77n79M23j70
5255f6K32k11j06K87j39K8j5n9J08p1n9Q1l46N44j95J65j08j8J18l62J92J59j87
$$ y = [-105, 200, 55, 148, -55, -141, 120, 43, -24, -83, 82, 59, 65, 174, -122, 12, 59, -145, -283, -45, 170, -33, 161, -231, -22, 22, 23, -162, 11, -32, -208, -8, 104, -22, 198, -13, -133, -25, 100, -192, 223, -92, -94, -167, -164, 51, 138, 108, 112, 103, -16, -18, -128, 13, 123, 63, 85, -103, 181, 229, -25, 194, 316, 48, -30, 167, 330, 13, 36, 72, 102, 176, 124, 20, 30, -139, 6, 357, -256, -11, -49, 96, -38, 96, -126, 23, 63, 111, 18, 60, -45, 32, -214, -54, -206, -150, -100, -240, 130, 190, 50, -59, -115, -91, -175, 178, 122, -205, -21, -62, 154, 21, -85, -9, -10, 153, 33, -54, -128, 49, 14, 158, 185, 42, -47, 50, -219, -101, -41, -18, 48, 143, 145, 77, 50, -110, -41, 254, 27, -187, 77, -239, 79, -94, -40, -58, -8, -131, 57, -52, -16, 169, 26, -108, -58, -24, -121, -190, -15, -81, -58, -33, -26, -17, 260, -319, 104, -66, 166, -45, -151, 136, -3, 25, 10, -49, 59, -12, -71, 10, -336, 208, 13, 178, 70, 52, 170, -192, 0, 159, -28]
5278b8J3j64L43k85o6N0K63k83qJ65R9r2k25J68q6J64j73M22k86p1r9L38j47J37
5302A49k48M4J53N9l62J84R4j91J83nj25N3m9j24R1P9M6O5o4q4m1O5R4J40j20
5327H6j49r2J83N8q4K0n9Q8k08K21l2p6N7o2j20R8j37J91Q2l05J34J69j01k85
5351c23L56M3Jk30L46r3m03K44M50m70L9j31J72k42K61j87r2L76j40j31K52o6
5373C2L5k97K30Oj36l2N9K58Q1j33m6P1k21qL14r1m8J8j67J61l20OL66k07q3M8
5399a04j7J68q6j19L5K01j92J53j30M0J96k63jJ39l19J95K77l6j77R5K1n21L58
5422h7J72r3J21l54L04L0j98J94l63L18J22q9l6j60Q5L25k64J95j40o6j5kj06
5445a07q5L07j8m9j3J44j94j09J09k79M12p1j65R5k2N7J33J78k86N2j24M5j74
$$ y = [-28, -15, -179, 164, -121, -187, -137, 126, -157, -165, 0, 99, 7, -218, -50, -136, 28, -145, 277, -9, -80, -179, 159, 12, 149, -99, -55, 98, 157, -205, -21, 73, -118, 65, 60, -65, -12, -61, -185, -94, -15, 31, 96, 32, -52, -93, -28, 66, 206, 86, -63, -155, 28, 86, 2, 22, -37, 51, -157, 64, 32, -44, 13, -49, -169, -71, -208, -17, 65, -240, -106, 63, -38, -323, 33, 76, 77, -153, 193, 100, -303, -59, 391, -79, -40, -171, 1, -241, 20, -167, -259, 117, -23, -154, 98, 32, 67, -230, 0, 6, -130, -162, -103, 155, 236, 103, 57, 128, -93, -101, 213, 122, 74, 92, -75, 86, -234, -228, 138, -69, -152, -104, -121, 47, -39, -158, -123, 78, -114, 39, -91, -51, 145, -118, -119, 20, -299, -104, 173, 137, -40, 55, 76, -445, -87, 85, -8, 113, -241, 63, 93, -105, 89, -274, 44, 166, 77, 41, -119, -34, 291, 27, 222, 82, 16, 1, -1, -107, -192, 115, 97, 48, 35, 179, -15, -124, -15, -294, 118, 47, -118, -23, -45, 12, 145, 323, 37, 89, -35, 10, -164]
5468a64K39k84L5L26l12K27M7l25J23J86j1Q8j37J5l3R2k95Q5L2J2pK89k09J19
5492A38l82M1K68j56r5P6K31Kk29J13k0L07j43j91j02J9K28o7P6k9j42q9M2Q7
5516a7K20k15J1J40j08L75n63J26p2J57J45k46k8L29k78J47j32p4J72j39J88j61
5538b3J21R5k85o9k5Q8J80k11J77k21L56l09L1K90M3q8k62l6J67J22k82P2M8q3
5562a04M10l54J77k3n4J61j00L48p04J38Q2j40L22r6O0q0J24k04J12M6j51K64
5584B34l84o0L43j78L06l46J83j10O7j16M9J05k62J10L33k95k3Q5K11l0j09j22
5606io5K61J31l36q8Q1J4q7J58q1p4l8O1J09j87qJ97J04k61J37j30L11j42j04
5630d6J04L40m14J90j19Mj04K15l9k69J42k19K23K19l03M7J10j20q7k2J44R7j71
$$ y = [-164, 75, -209, -174, 152, -160, 67, 114, -211, -88, 98, 87, 175, 38, 53, 20, 112, -183, -98, -66, -54, -61, 228, 19, 138, -244, -203, 65, -91, -186, -110, 121, 123, -106, 7, -13, 294, 151, -40, -142, -123, 105, 38, 114, 85, -57, -146, -104, -17, 203, -12, -1, 139, 31, 406, -157, -31, -103, 54, 199, -47, -75, 254, -24, 123, -9, -83, 89, -50, 138, -23, 98, 193, -92, -161, -186, -98, 82, -129, 48, -173, 183, -126, -95, 195, 238, 150, -112, -148, 19, 141, -141, -69, -21, -104, 306, -48, 129, 106, 52, 213, 113, 461, -243, -105, -23, -163, 159, 63, 123, 43, 167, -37, 75, 121, -30, 234, -150, -210, 133, -45, 261, -85, 98, -12, 55, -61, -12, 93, -169, -59, 274, -21, -44, 41, 252, 222, 113, -9, -74, 187, 318, -18, -106, -25, -11, -98, 60, -21, -95, -133, -72, 37, -150, -158, 39, 143, -118, 19, -111, 200, 58, -46, 58, 398, -16, 174, 55, 59, -45, 170, 131, -138, 4, -215, 8, 227, -76, -29, 81, -39, -126, -148, -4, 93, -78]
5653g8K31j93O7j61K36k80J56j31O5J62n9J03q3j55L34m33Q7L62j44j58O3k3k23
5676b55K82k52N60k20q7j64j08L82o7L8k24p7Q9J40K7r7J31n3k19l7K98m8Q6o0
5700F5Q9l02P7M3j02J50J84l72M09j96j2k46J56K19j61M4J50l02Q7j25o9L66j91
5723c9M24l31j25n2J06n2L08k4j28j74p2lJ81j99M5J00k0J63m82L09K56k55k74
5746c38L19J52N3N9p6J9k82r1R8PK2%J62j05k18J18O9j03J99j36N2K82k23l1k70
5771b62L94j62O1Q5P6j30J79m8m2m7N1r7Rm6j28J51R7Lk14K0P3j08J30k5K0k14
5797a74qJ80L8J0P6N4K0k13r6L44l5l70L74k53rJ11l34J31l2J34o6O9j33K43l
5822E8p0J12J4m1j68Mj30J03K08J1j45R1m04J86K30J5P5J0j93R7Q7k60J48J9j63
$$ y = [-78, 153, -40, 27, -134, 102, -178, -22, -153, -88, 74, 15, 118, 35, -120, 214, -219, -132, 230, 86, -72, -9, -32, -255, 27, -225, 335, 115, 28, -136, -244, 138, 71, 109, -115, -192, -103, 37, 64, -33, 98, 45, -174, -211, 87, 39, 125, 65, 154, -148, -71, -28, -130, 20, 204, -168, 241, 45, 33, -213, -57, 162, 1, 45, 195, -107, -20, -145, -214, 152, -39, 385, 54, -71, -123, -17, -69, 239, 215, 87, -87, -159, -162, 19, -180, -135, -35, -55, 108, -374, -65, 191, -64, -338, -19, 133, 186, 245, 169, 188, -94, -185, -87, -80, -58, -58, 104, -1, -219, -101, -32, -135, 64, -72, -20, 262, 39, 8, -262, 132, -30, 31, 116, 192, 62, 241, 193, 151, 104, 155, 58, 67, 21, -107, 44, 141, 144, -70, -50, 23, -85, 45, 20, 40, -174, -182, -2, 36, 46, 122, 176, 196, -17, -113, 231, 196, -174, 200, -53, -62, 49, -285, -154, -186, -52, -118, -49, -182, 61, 58, -12, 100, 114, 73, -95, -91, -221, -118, 90, 101, -44, 47, -357, -171, 59, 74, 149, 159, -34, 63, 150, -110, 38, 57, -106]
5847a06L02o7k19m2K34Kr1J03j71NKK01k6m0j98N7J20J17j07J77L2l84l1J16j28
5872a42M9M0o3L73l01M3l2Q3K8Q3l52J02m0Q0J56Lq9j30O5j00O0K0K59k31P8k6
5898A6k88J27O4J06K53l35J60k98L36r3J20j38J03Mp5j92K87o4J02m41J44K36
5920A34k28p0L71k04j61K20o5j97L66k10j0L11m53L55RK2J0q3j82K14j88J91k3
5943A29l54L46k87L35M2j21J15l26K94l29P7j1L16l70L12k24K7q3N7m5K28J2j44
5966dP3p5J05L3J04m39J37J11N9k0j13M8J71k82K61j96N7QP6j72J35j60P7J69
5990A63k14J54j41j70M26j96pk3K06l84K62J04k11R0n4N2K46k35j24m4j91K13
6012g8j45J18J12J66l47M07l67J36k9o4lL94m15J41j46J78r7J9J05J7l59l2M66
$$ y = [-106, 196, 129, -90, -132, 102, 104, 13, 116, -55, -50, -48, 153, 127, 87, -111, -54, 66, 183, 76, 253, 285, -99, -130, -14, -142, -93, -53, -116, 257, -44, -1, -33, 50, 78, 161, -191, -89, -129, -49, 107, 110, 21, -109, -44, -144, -84, -64, 195, -36, 42, 16, -272, -145, -81, 25, 278, -57, 103, -195, 141, 48, 168, 30, 133, 137, 62, -130, 157, 93, 195, -246, -102, 134, -94, -164, 207, 3, -158, 62, -3, -200, 166, -44, -54, 257, -196, 159, 168, 190, 200, 117, -65, 149, -39, 152, 129, -225, 121, -166, 169, 211, 90, 205, -121, 173, -156, -79, -90, 226, -144, 168, -56, -29, -112, -55, -100, 128, 140, -4, 69, -6, 99, 132, 236, -203, -66, 45, 104, 84, -29, 19, 190, -92, 169, -27, 30, 38, 114, -58, 77, -83, -6, 163, -51, 103, -38, -208, 218, 22, 15, -8, 198, -186, 76, 180, -31, 59, 5, 57, 303, 68, -56, -100, -291, -78, -223, -105, 7, 173, -174, 233, -134, 2, -27, -91, -94, 300, -115, 26, -120, 58, -39, -20, 85, 102, -257, -289, 177]
6035A77l28J42j11K9N4j24J56q9N8k4j82K53K04o5k71PK21j54k0J54k20q1M37
6058B23l74K05j47K08n4j23P2J96k21QJ43j85L53n70K69J60j6M6j74j21n2K22
6080F8k25K90lk82J30Q5N6j87j14J76R0l41J47J21Rl04K26K6M1j26M6l26N29m03
6104b71J10J06J91j90N4o8j03p4n8K90j5Ol3R5j84K02l80K65J18J58K3k01nl54
6128c18P6J71m0j01K41k86L74j83p0P9J5j51N1K33j86J34l46J44J96k57J91r6
6150a29PJ91J50r5k24l5L87j71k5K61l94M95m48J30j88J59m3J09j83J86j12j15
6172h7O9N8l7l7j20K55j21n3j14L99k62J24j42O5M1JJ1Q3o8k18m9K43%q5J34k64
6198a74j58Q1L1N31j96Ol16K80kj18J00J89j51j46J82j09k8l1L88j76n8j23k76
$$ y = [177, -151, -9, -120, -91, -37, -161, -5, -94, -36, -60, -242, 11, 215, 150, -121, -114, 107, -47, -67, 87, -133, -214, 223, -151, 54, -93, 115, 61, -62, 10, 206, -15, -7, 136, -49, 304, -266, 3, 163, 147, 193, 19, -102, -154, 68, -157, 133, 130, -152, -22, 63, 119, -68, -182, -6, 84, -257, -110, 11, 20, -284, -58, -32, 9, -117, -71, -397, 132, -271, -161, -55, 136, -54, 0, -68, -171, -245, -303, -13, -28, -22, -55, 40, -144, 58, -322, -57, 61, 219, 242, 41, 36, -318, -242, -71, -111, -212, 29, -257, 117, -66, -136, -57, -42, -193, -142, 91, -95, 39, -307, -163, 33, -224, -33, -129, -122, 69, 219, 124, -100, -135, 252, 81, 56, 317, -77, 418, -30, 100, -88, 71, 28, 137, -46, 140, 28, -87, -18, 40, 3, -34, -154, 101, -20, -73, -187, 212, -50, 74, -68, -3, 38, 39, 50, 133, 65, -153, -202, 41, 41, -44, 90, -174, -332, -251, -220, 311, 115, 121, -195, 85, 83, -35, 65, 254, 103, -43, 139, 30, 2, -29, 359, 183, 125, 2, -274]
6221b74J76j81K39J06P7k10n0J29j10m1K37j38J10n6j36K4L05j71J19o2Q3J73
6243C49o55K75K75k65j18k14L93j04rK76j0l12p0P4N2J89l70N6J30R7J02l12L23
6266A52n6l50K90l43L20K48k33M2j35l4mL4J36L3j36q8J21O4q8J05j41K54N4p1
6290A74q7Nk73L05m3J13k22pJ25j75J28Q7J4j00K4j80N4Q8r6J92k53K3J79M2k4
6315I3p9N8nl38M48j55M6J88l53m0L14k36j06LL6M02k16P3l21J59p8M17j52j86
6339b8o7R8N2J15l54J9L47l61L56j46j20L88l31l9j1q3L28Q0l07q5K92l20J25
6362e2J9l08J50J36M1j26J55p5j09L41k74k00J43J98J20k74K57k84K61k56J24
6383a3k71L71q0j16K59j74j55J80j70L69k59J43j86j24L73j65j6j31J60O0p3p4
$$ y = [-274, -98, -279, -40, 66, 143, -67, -117, 12, -98, -139, 98, -40, 70, 14, -122, -98, 207, 36, 155, 93, 176, 349, -306, -31, 244, -21, -139, -353, 40, -64, -73, 203, 193, -119, -189, -115, -63, 126, -244, -188, -58, 39, 141, -171, 152, 96, -254, 36, -307, 13, 261, 28, 70, -65, -99, -103, -69, 67, 100, -36, -124, -3, 61, -27, 78, -63, 191, 245, 174, 87, 92, -181, 124, 81, 194, -28, -35, 90, -85, 43, 130, 144, 44, 68, -112, -58, 30, -66, 126, -127, -104, 75, 117, 93, 14, 72, 67, -271, 177, 22, 68, 256, -97, -137, 177, -59, -165, -162, -126, 276, 60, 133, -188, -29, -107, 310, 158, -28, -95, 3, 55, 170, -184, -165, 182, -179, 177, 31, -89, 299, -32, -71, -82, -165, 163, 243, -64, -149, 143, -177, -52, -33, -341, -191, -55, -14, -140, 15, -60, -169, 172, -102, -302, -159, 39, 159, -115, 142, -142, 119, -137, -13, -284, 87, 7, -109, 150, -24, -179, 1, -169, 200, -59, 84, -102, -226, 147, -18, -34, -165, -5, 55, -18, -92]
6405i2K9J23J61Kj75L5j74k9L69j13j86j7J18P1j24RJ98k84Q2P7Nk89KL38j17
6430A9p5L31l84K33j54p0J43jL03k39j3k39J34k29L23j26N7N3qL23j59k44n6K40
6454A62k68K8J28r9R3M1j4J62j42P2op2K0k38M8K7q0J56rk1k70M25p6j13J86l46
6480b06J71J45Pk83j0Q9q6K47J22j76o5LK1M6L93l42j61J13k69J94J36k69j62
6503c42L67O6j37j66J53j12J68r7k12K35R0j14mo9J32O7J6j50P3l8K55l34J81
6526B8L3K7M6N3j53j7o2R6J5j07j15j53K26j8K8L04p3k08K5R8j30J59o0m1O8j30
6552f1m9J76k06O3J50l27M88k87J12l58K12J17n3J59rj78J23j36K04k38j38K03
6574c3j12M9J54n3j37J7L1K32k99K56L3m5j32Np6k1K18r6q6J6j09K12J48k66J02
$$ y = [-92, -63, 60, 221, 223, 48, 83, -91, -120, 249, 136, -50, -67, 51, 122, -2, 7, 205, -79, 3, 80, 85, -204, -202, 136, 19, -56, 275, -109, 124, -30, -100, 43, 42, 345, 106, 93, -146, -12, -241, 82, -44, 13, 66, 58, 381, 222, -22, -78, 162, -106, -78, 50, -49, 44, 85, 71, 233, 91, 163, 157, 85, 105, -133, -85, -58, -138, 18, 9, -12, -282, 143, 67, -46, 140, -206, -35, 110, 117, -166, -176, -87, -173, 74, 196, 20, -45, -42, -21, 25, 418, 76, -85, 28, -241, -47, 89, -180, -342, 25, 91, -46, -212, -59, -171, -3, -100, -312, -77, 13, -101, -105, -174, -42, 25, 41, -109, -36, -74, 181, -153, 28, 61, 88, 134, 187, 34, 17, -45, 51, 66, -41, -156, -309, -83, -101, -73, 231, 158, -50, -25, 73, -57, 102, 42, 1, 69, -61, -110, 66, -140, -77, 73, -254, 234, -53, 59, -299, -87, 30, -23, 136, 127, -51, 72, -64, 140, -98, -236, -33, -145, -96, 58, 5, -132, -115, -84, 148, -151, 105, 138, 93, -39, -34, -110, -131, 87, -9, -95, -79, -188, 24, 172, -94, 8]
6599HJ55qM8k25n3J17p3J12n4J21k06o7J62r9m3k97M37j79K57j25J43rj42J00
6623H0O0o3RR6j38J96k55k58j31M11K6M6k33L70n9k91Q4l5p4K42k16Q4K32j33
6647E0J26j08O3j2O2k48O7j58J71l9Rr5pL19j83l2L03j97j98K20o0q3K21j91J
6672AkJ01n3k15R3k4j00L45J24k71j2L1Mk80Q4O5N4J30J14J3j77O5r0PJ12k99
6698a80r9J37R3J6K20j48l6j5M1j11J03N4p6j7N9L9J21l85K49j54K87q2k7k31
6722a42J85l9Mj34k2RJ59R0l05R8K83j53N3j89J31p0P1j06M20m73O6r7K49J0J4
6747A12Q3l17K20Ll72J03K85k59O7p7L64k32K55k74K10m33J94P2m4O6j73J57K85
6770B95l94l6J00mO6K03l57J14j4J42n18L72J07K32k74O8j7k72K75j12J46j96
$$ y = [8, 163, 155, 203, -22, -75, 42, -31, 81, 27, 148, -58, -125, 37, -62, -105, -402, 35, -144, 113, -12, 131, 122, -20, 80, 140, 77, 86, 182, 44, 240, -15, -273, -404, 7, 33, 79, -154, 216, 157, -134, -50, -85, -159, 83, -133, -49, 183, 50, 176, 68, 131, 119, 181, -67, 0, -158, 13, -26, -17, -112, -119, 200, 17, -15, 288, 91, -107, 113, 53, -30, 191, 0, 1, -1, 100, 47, -168, -75, -99, -199, 146, 270, -1, -13, 18, 22, -258, -174, -109, -55, 75, 189, 202, 25, 90, 0, 7, 119, -180, -279, -142, -49, -33, 187, 39, 3, -12, 29, -82, 21, 75, -1, -18, 41, 80, 201, -184, 65, -89, 198, 116, 89, -142, 43, 4, 8, -126, -148, -139, 20, 110, -195, -97, 186, 33, 86, -103, 28, -42, 29, -77, 343, -130, -64, -161, 88, 98, 112, 195, -122, 98, 101, -271, -168, 117, -142, -75, -152, 212, -20, 235, -39, 171, -262, -68, 4, -40, 26, -147, 10, 295, -99, -135, -35, -39, 27, 230, -127, -13, -27, 115, -403, -31, 76, 308, 34, 102, 85, -187, 88, -24, 122, -74]
6792g4j5P5Q6o2J10j68K06j02j52L06k31P5o8J01k31J00n3N6NO8l00L96j21J3
6816B0J17k01J66j45J32J59j77n3j47j44M60l35R4J29k9p3J41k29qR9J79j7m8
6839I0k23K06J26K2l31Q0o5j16L37j78k06M4J74J26J68j98n3o4J68p4j6r5K66
6862A88k55j04Q8Q7n8NK7L6P9j93K56k09J8r2N2L34m42O3J12L8J80l14Q9M4r9
6887g0L2P4oR8k43j71K20R1Nj02J63j5J60n0r0J0l04J32j50K28k60K56R8N2k27
6912f9l2J17j90J43K20j20K8q4L3j12j19k9J06L25j96o3K6J01j25j07L29l89K96
6935H9j70q8O2m3K50K0n5J2%O2j69j55K75k85J58K6p5q5K16j46oj3J0L33j93m08
6961c78L76j12J57J51j97J50J45l96M4N3k73J00Q9J69J35l68J09q0P0k6m6K1J81
$$ y = [-74, -89, -14, 72, 10, 120, -48, 158, 56, -96, 210, -21, 54, -14, 87, -144, -44, -97, -41, -36, 32, -268, 128, 7, 20, 137, -64, 102, -43, 89, 248, 71, 18, -129, -273, 187, -148, -54, 75, 46, -27, 114, -115, -123, -24, 155, 138, 90, -133, 73, 199, 221, -110, -30, -95, -211, 126, -52, -258, -214, -40, 86, 254, 56, 3, -61, 107, 33, 17, -78, 188, -67, -171, -83, 4, -54, -49, -22, 14, 93, -100, 156, -53, -35, -127, -75, 259, -183, -120, -8, 30, 210, -104, -15, 29, -70, -38, 36, 30, 128, -115, -286, -66, 25, 30, -72, 91, 76, 236, 186, 96, 106, -198, -66, -216, 12, -248, 8, 106, 158, -69, -101, 16, -174, -31, 189, 69, 97, 13, 46, -66, -185, -214, -108, 217, 21, -42, -16, 85, -40, -147, 182, -207, 89, -81, -169, -107, -150, 100, 120, 65, 77, 77, 139, -30, -185, 90, -195, -37, -11, -86, -171, 45, -101, -107, -120, -110, 223, 30, -378, -2, -114, 43, 194, -3, 147, 292, -104, -60, -7, -280, -180, -91, 78, 213, -155, -46, -126, -56, -82, -128, -107, 74]
6984G4L0Kk95j8J81M67n14K06m6J6j08j70L05Q2o2l71J99N9j71J11l1o7o6J99
7008A2m1m3N4O4N8j47K22l50K02j44J98K1j72K70k68j44L77k38N9N2r2m1K5M0
7032b6Q7j06l0j31K97N7O9l35J56j29%j48M07m5k93J82l0K5R5k96L50k01L2j99
7056b12J16J38p2M9K3p7kl6J95j09J8r0J31J3k89L67j37q4j18J82k0J50j42j16
7080a22K19Pn17N57m5k86J88J06k49o2L41k57O2K5j70J85j60L82k26J39k96R6
7102h3k53L18K75j39k05q3J55N0n6j97L54n7k89K40j9J30k53K30K54l44J9p8j30
7125a61K94k64K1M24m52J69K0o7J39j1k09M13k65%J14l9m07J58N3J50K55k59K05
7148B81l71N6m9R3K28j83O5K41m98J7l7J93Q1K4j45j31nk23M22M2L0L6l36J16
$$ y = [74, 104, 106, -189, -207, -26, 441, -73, 133, 87, 103, -5, -175, 130, 212, 150, -221, -22, 37, -134, -23, -54, -121, -187, 12, -29, -72, -18, 46, 104, -43, 179, -171, 31, -113, 85, 106, -66, 204, -64, -208, 169, -69, -10, 42, -50, -91, -66, -26, 61, -45, -75, -206, 91, 148, 217, -118, 38, -91, -91, -239, 168, 123, -170, 12, -18, 7, 102, -194, 156, -45, -13, -212, -96, 42, -30, 19, 42, -35, -37, -73, 122, 13, 31, -59, 72, 85, -204, 163, 26, -58, -176, 6, -14, 136, -6, -122, 97, 104, -413, 144, 99, -187, 1, 107, -142, -204, 137, -120, -58, -33, -203, -18, -178, 204, -22, 117, -179, -83, -336, -18, 257, 118, -87, -170, -15, 35, -21, -218, 136, 79, -210, 30, 11, 141, -112, 118, 372, 28, 47, -31, -161, 133, -131, -110, 314, -138, 31, 51, -16, 123, 112, -97, 316, 51, 51, 165, 126, -281, -123, -70, 80, 335, 76, 281, -90, -34, -83, 10, 238, 55, 120, 361, -137, -120, -157, 36, 117, 141, -4, -135, -140, -363, 59, 101, 131, 167, -169, -53]
7172e3n2j19K72o6K74k66J4j50K42j09K5m5J24m8k25L22K28n73L84k97L67p8l04
7195a33N8L1j92J48j18M39k85K06l16Q5Q4p1K54l16J7kK26o1K28n51L38m1j00
7218g2J82j16K3l4j6O9j0o4k44K23J8k03O1N3J60l32n1M63j62J20j20J21j3J0
7242F6k25L43j28J18P5l20J47m4k45K62K63k17k95L80r6j14J62j8j06j42J11k2
7264d5N6K01n6k62J26J78l20L74k30p4l7j05L46r9j19K87k4j77K7r8N1J1k5J99
7288A85j57m5j83L14n8j5J2m1k02K26r2M7L6k30L25J8j24j16L13k44Q4j14M1j01
7312a21J27p8J56R1p8j00j46K61l52K13j31J41R4k19K67j46l3j40O2L69j16j95
7334g4J80m3k15L05k6Rj53j03K67k9k47K43P5p7J9J7Pl29K41k82J61J29j12N1
$$ y = [-53, -105, -224, 48, -18, 256, -10, 4, -146, 96, -13, 12, -33, 91, 43, -182, 140, 368, -205, 179, -118, 249, 171, -133, -75, -44, -236, -88, -206, 233, -52, 154, -162, -77, 7, -64, 190, -126, -109, -111, 115, 54, 282, -269, 69, 28, -72, 110, -6, 17, -17, -33, 36, 26, -38, -282, -59, -41, -244, -183, -130, 30, -302, -353, 110, -52, 68, -52, 69, 56, 66, -159, 184, 56, 174, 249, -71, 76, 32, -213, 49, 312, 95, -200, 180, 84, -30, 132, 114, 8, -134, -23, -45, 11, 212, 156, -106, 20, 198, -122, 252, 22, -52, -89, -194, 152, 53, -66, 221, 197, 20, 47, -51, 0, 11, -14, 185, 28, -17, -200, 114, 56, 41, 53, 12, -190, 36, -56, -9, 27, -203, 122, 140, 16, -100, 213, -31, 53, -61, -20, -121, 6, -72, 84, 175, 97, -3, -149, 112, -240, -27, -158, -17, 77, -142, 125, -21, -54, -194, -132, 237, 121, -74, 106, 63, -152, 153, 127, 136, -17, -120, 147, 118, -129, 114, 189, 112, 131, 148, 155, -174, 67, -215, -54, 75, -37, 14]
7358A4J65k29N2L14q9Mm14K21n4J4O2n5J27l80L40j6O7q4q8q3K7M3J81M9p9j80
7384g1Q5l9N8k8N4j44j50K67j25j71L30o6P3pj98J22k03QQ1K58j37m5Q5j80J5
7409a28J19K05k96p2K93J74j72j34j57N4J0K07k00J50J64k85K56Oj17k0j12j38
7431a93L73k2j73J44l35K68M7K6j5j46o3JJ27j49L94n22K65m7J4k1QM6o0R6l03
7456b40M05j73l6P9k17K43j8k2o0k37L53o1m6r5K85j86J19j93P8K28l97J3L65
7479A87l99JL44K3k56l0R0j43M08j61j5j46M5J85R3l21K37Q1l85K17K06l63o1
7502a63j6N4J25OJ03p9OP1L8M1j22oq9p8J87K7k08Q7j52L0J88Q3j17P5m2j2j19
7529h2J56L36m22m2J44j58K07n2J71l30K72l87J98n0j95K22J94l21J92O0j12J53
$$ y = [14, 179, -50, 2, 316, 227, 231, -183, 38, -16, -2, 60, 5, 132, -248, 92, 76, 143, 59, -29, -112, -85, -42, 139, 188, 109, -71, 14, -25, 33, 5, 59, -85, -235, 32, -93, -264, 66, 0, 73, 66, -132, -10, -213, -205, -124, 134, -3, -48, 37, -143, -128, -9, 196, -100, -172, 121, 295, 123, -11, -168, -114, -104, 103, -97, 53, 217, -68, 188, 194, 77, 57, -55, -193, 180, 158, -15, 129, -206, 62, 109, 135, 120, -26, -89, -88, 39, -110, 284, -238, 27, -20, -6, -27, -19, 27, -33, 63, -240, 165, -8, -44, 35, -182, 61, 43, 21, -39, -276, 77, 16, -30, -125, 160, -26, 93, -100, -22, 206, -191, -178, 187, -212, -211, 133, 156, -100, -130, -40, -183, 225, 64, 49, -97, -52, 133, 226, -95, 142, 223, -162, 55, 261, -102, -163, -179, -125, 0, 6, 109, 30, 36, 107, 145, 186, 64, 58, -31, -109, 78, 105, -103, -16, -168, -138, 50, 133, 16, 91, 49, 37, -82, 74, 410, -12, -54, 90, -68, 139, 87, 258, -72, 200, -187, 11, -39, -234, -12, 182, -139, 53, 113, 1, 154]
7551A54k38J14N0j23J38j3j21j15l3M89j66j59J44j66k15J37O6j9K63q6k8K7j41
7574d1r0K03J2k08N9J15K52n40K73LK06p6k9o6j59J58Pj05J3k34L60m9j75K36
7598A25k69ol7J18J37K7j58K37o5k3j24L1J05r7P4j84L5m9J11O8m0m2p4J66m8
7623A8j40K6N3p3J67k79K97P5o9q0P9j7l04J37j42K88K4J5l22K09m5J24O2J34
7647B37l43j2k06L15K20m14M25j25k0J34k08j87J83JR3J89k83Q8j40K7M4Q6j72
7670f8o0r7M35j82J12j67L8K16r8p4j08J06K0RJ05J8k00p7j9K52j7j36L6j73m1
7695a70K39Q3k51J12J37k52l03L56J68l4k89K44O5k79Q7O8O8J17k93J69Q6nj92
7718f9p3J44j22K13P3J14n53J06J38J42r7J6p3j24J57N6r9J69j88K94j39k99K73
$$ y = [154, -84, 30, 80, -43, 95, 82, -39, -154, -187, 302, 136, -23, 121, -45, -260, -123, -57, -76, 187, 101, 73, 100, -41, -131, 72, 84, -124, -65, 50, 302, -238, 35, 38, 244, 168, 139, 73, -86, 72, 79, -26, -13, -247, 113, 64, -111, 125, -144, -150, -187, -69, 68, 95, -63, 174, 109, 86, -38, -7, 98, 1, 75, -109, -74, -123, -12, 56, 16, -26, -100, 66, 18, -122, -96, -43, -116, 51, -228, 69, 144, 75, -5, 74, 57, -247, -110, -252, 36, 60, 75, -247, -38, -83, 41, 103, 237, -106, -118, -324, -9, 211, -203, 222, 97, 77, 211, 3, -184, -1, 0, 93, 282, -1, 87, -53, -26, 18, 104, -68, -128, -225, 210, 28, 140, -27, 11, 227, 129, 55, -53, 53, 73, 82, 187, 205, 5, -72, -91, 161, 144, 8, 44, -129, -170, 69, 152, -99, 13, 150, -102, -405, -49, 119, 85, -204, 40, 105, -174, -87, -19, 49, 166, -127, 42, 128, 123, -69, -142, 2, -120, 93, 166, 280, -273, -167, -29, 113, 16, 32, -41, -165, -8, 48, -51, 118, -70, 224, 85, -214, 59]
7741E9j27K35k4k41lJ90l7j34rK69l14J66N2k8l8J15p7N4o4m0j29P9J24r8J57
7766A37j06q8R2O8l6n3m2k6M9nR6O4j95j7O2K12l1l15L10k32J71j38q9r1J76L9
7792A2p1J90p5J7j62J44ol0j16K04m6mN2k61L27J09l83J48K3j61J61k04J81l0
7816A9r0r7R2J1J94k05R0J75k92l13M78j49K06r8J13q0j79L21k47K74k34p1K3
7839e9j1P8J18k9l8j85J70j40J49m8j53J9L11k74K53j89k83M57l30L60m8M4k40
7862f8K61j59M0MJ06k8l9N1j79R3j15P3K4j14J45Pk19R0qL29k95l42K77L41l16
7887d1J50q0o3K9J50n9J03q6k78K15J0J25m8O7p6l76M19l5j02J8k2j39m3L51m22
7912b33Q1K35L51m73r9J27k05R0m2K48m6n0j08k28N32O9l52R2l01M77m9k8J29
$$ y = [59, -68, 167, 143, -98, -101, 89, 52, -82, -91, 178, -136, 30, 82, 54, 16, 131, 54, 108, 44, 4, -125, -46, 78, -20, 137, 31, -57, 35, 103, 67, 14, -28, -54, -5, -10, 86, 150, -45, -62, 0, 212, 181, -134, 176, -56, 115, -23, -112, -203, -27, 12, -59, 131, 56, 73, -89, 55, 49, 19, -97, 107, 61, 57, 109, -152, 175, 284, -99, 49, 72, -89, 72, -132, 49, 19, -71, -168, -76, -65, 129, -76, 14, 189, -103, -416, 62, -87, 119, 21, 134, 54, -125, 196, -51, 223, -11, -82, -59, -70, 8, 126, 97, 59, -126, 44, -96, 53, 5, -148, -129, 182, -92, 161, -28, -311, 146, -184, 176, 128, 172, -68, 193, 34, 74, 78, 184, 156, 117, 168, -11, 82, -33, 40, 64, -50, 95, 102, -117, -27, -35, 294, -1, -343, -66, 275, -41, 109, 29, -34, -5, 145, 86, 189, 103, -175, 40, 50, 175, 127, 194, 118, -258, 161, 126, 24, 42, 20, -119, -162, 189, -233, -152, 83, 434, -39, -138, -11, -216, -126, -168, 80, 34, -16, -124, -352, 180, 249, -103, -11, -312, 165, 116, 88, 217]
7935B17k10J54n9N2k5l00L86k16J50j09j24R0J03L5l47K94k02P4J0M5j80K59O5
7958A62j81K50j93r5k07N69l16l23L67j61K30j71K59p3j07k27L08l55L70N9n0
7979A15r0j15j04J00J75j89K1J00l5K13k07j00k8L3L05j18l69L98k47m0K68l7
8001D9j49K32j08j43J00j71o3L60Mj00r8J03m0J39j72J3M7n2RQ6K65n05K17l7
8025a4k8K1k11J70k6J57j84L6m1M0M7k2J43l66J09K56k46Q9j80J30R7K1rj05J9
8050i7J26L4j44o8K84j24j32J43j77J46o6j4J0J37l93L83N5P3k55K08j64j71J65
8073d1k54M06p4J81%k08R9n33N82m58M09P4j16j37O2j43R2L25k47j48R9J62k43
8096a11J23o7J68l09K48l85K58J31Q3k85K75m23M4K36J4J83k75j39N33m95J54
$$ y = [217, 7, 161, 102, 154, 129, -171, 215, -1, 149, 40, -84, 6, 109, 144, -203, 91, -111, -37, -27, 18, -162, 97, 162, -19, 231, 38, -57, -264, 305, -11, -334, 33, -128, 102, -69, 190, 117, 10, -217, 91, -264, 106, 165, 115, 25, -90, -194, -94, 81, -108, -87, 13, -22, 191, -16, -116, -144, -111, 194, 76, -293, 105, -142, -182, 86, 49, -100, 132, 24, -119, -19, -190, -253, 107, 111, 11, -87, 16, -24, 115, -57, -44, 3, -49, -40, 46, 311, -194, 23, -14, -42, -21, -232, -62, -88, 69, -115, -79, -120, -80, -33, -55, 88, -278, -169, 87, -159, -70, -250, -120, -23, -2, -11, -116, -97, 29, 63, -81, -149, 135, 11, -121, 22, -155, -9, -75, -89, -79, 58, -335, 48, 103, 176, -79, 129, -35, -206, -41, -295, 111, 37, 218, 218, 10, 109, -424, 158, -300, 109, 183, 67, -70, -8, -151, -59, 266, 19, -129, -30, 132, -111, 12, -55, 113, -196, 52, -333, -75, 56, 139, -146, 129, -294, -250, -14, 0, 183, -92, -231, 302, -193, -39]
8117c9q4N3L8l3J57j4j84Q4K5l79M02k08N45k98l17K38J27j63J41m14J38J33J4
8140c8M3J82Q7k24j15L07k36j12j46J69K44j28j14J32j1J3k37K39L2j22J80l68
8162b23L07l9k92K77Q0o6N7Kj25k71K36J90r7J40j21Pj88O5L23l06M3R8q2k06
8186a91o0J97L8K04k15
$$ y = [-39, -123, -70, -32, -65, 92, 78, -106, -22, 3, -376, 26, -182, 363, 65, -252, -14, 113, -50, 91, -323, -185, -52, -38, 5, 187, 274, 50, -65, 242, 6, -106, -252, -83, 161, 33, -81, 51, 40, 53, -184, 55, 87, -35, 145, -223, 84, 45, -247, 30, 110, 44, 101, 103, -22, -293, -57, 133, 36, 176, 55, 62, -126, -61, 262, -44, -1, 97, 15, -191, -251, -54, -16, 188, -27]
8191b7
$$ Imaginary data points
##PAGE= N=2
##DATA TABLE= (X++(I..I)), XYDATA
0@%%%%%%%%%%%%Kj0J6j6J6k1K9l2M0m8N6o4P2q8J01j14J32j52J73j97K21k48K81
35A49l17L57m01M46m96N52o12O79p52Q30r15J009j112J226j351J487j638J806
53I47j995K206k443K717l034L403l841M374n035N876o993Q547j0856J4637k1837
68a3327M0074j65641k97203N05264J69825l55522N9648K53931j81145o3872J09873
79F1905p1787k1899J19645m9340j32423M7153N8491l8208L5883J8409k8110k1556
91b1837K126L7286o312q857J1159l5719j3860l091J48L1463O2207K3619q5420
104g088k1602N5070l5937m752N6468j0453l1425N773m2646k9089J31464K5807
116I1590j54709K3055P9331q5632k5655R7953O049p0163K9244J4927m1809O4796
$$ y = [0, 0, 0, 0, 0, 0, 0, 0, 0, 0, 0, 0, 0, 2, -8, 8, -8, 8, -13, 16, -16, 24, -24, 32, -32, 40, -48, 53, -61, 71, -81, 92, -105, 116, -132, 149, -168, 189, -212, 234, -262, 290, -322, 357, -395, 435, -480, 529, -583, 643, -708, 779, -859, 947, -1048, 1158, -1285, 1432, -1602, 1801, -2040, 2334, -2701, 3175, -3818, 4729, -6127, 8510, -13327, 26747, -138894, -436097, 69167, 238992, -116530, -56882, 197049, 15904, -47968, 61905, -9882, -31781, 87864, 38524, -93899, -46746, 11745, -26463, 9420, 27829, -281, -21837, -19711, 17575, 11263, 2406, 13565, -22154, -36014, -39105, -38957, -7494, 54713, 78332, -7088, -28690, 26380, -9557, -14309, 42159, 31706, 281, 6054, -36592, -65681, 65783, 91590, -63119, -40064, 39267, -46365, -72020, 25933, 31982, -38181, -8937, 5990, -35819, 28977]
128B8977M3385n3616j3120P313l7236l1443M4848M8079k9890l5274J4131M2860
140B9014j4789m0993M6944L5580l6462m1848k6652K0416L9903o82l0692R048L2951
153B1738l6275j7269N4579K1723j5444l7028k6112K9159J4286k1988J9767M4922
165E2058n4335o3016O2470K5202l7500L2382L922n5384J5710M3511l8864j434
177a5278P3574l4772o5001L5050R598k0483K7515Q110l2110R339K3648l4820N08
190a5122N1080j3966l6564o07K088o808M217K3024O977o500j0548j6988J4333
203e384L6913K373l9879j2949L2597k7738l7510O4582M0405n6764k0160M1666
215A8152j0877j9304L8322j4439l4812L3887j8859n6055N2641O0240n5649k9436
$$ y = [28977, 72362, 18746, 5626, 12939, -24297, -55740, -10892, 37187, 7297, -27977, -13846, 29014, 14225, -26768, 20176, 55756, 19294, -22554, -49206, -28790, 11113, 10431, -20261, -11213, 21738, -14537, -31806, 22773, 44496, 29052, -7976, -34088, -4929, 9357, -12631, 7136, 52058, -2277, -65293, -2823, 22379, -15121, 17261, 21183, -34201, -18491, 25020, -13844, -15278, 58296, 23524, -41477, -6427, 3171, -17312, 10203, 18313, -13797, -4458, 19190, -15630, -15122, 35958, 21992, -14572, -15179, -13091, -19899, -15682, 7342, 14319, 7819, -2729, -19717, -5384, 31529, 33902, -5977, -18926, 13671, -14067, -51577, 13005, 53410, -3354, -23514, 18152, 7275, -12029, 26293, 11854, -22958, 10929, -7930, -63985, -11344, 48896, -6753, -36189]
227c6189O0716m751m1806K7497J5601j5868J382r553k0142J4757K1166j4646O904
240E068K3602k8224k6052J8295K1389J866j3542j0224n422L723Q668n524M020
253b357J9663n220l6395o197M1519O381k3564J5203J694k8106J2080K5866j7150
266C417k300K4108l3210k6788M5766M550l7526K2274K8607k9931j9645K1074N424
279E820L56L273k0280j100J3885j9979k266L6080O154k6585l894Q528J225J1092
293A2309n372j4284J6791r77l5569J829M5289R416l2965o877J6446j455r314M463
307b70J3664q469j7413K012J292N324J5701q152j4652J6991L635l4503R757M5252
321C0169k0592l2264K4667P000k2841J2815J7691j5126J085Q436k4593j038K7587
$$ y = [-36189, 24527, 19776, -22030, 5467, 21068, 5200, 6582, -2971, -23113, -8356, 12810, -1836, 5068, 28670, 446, -25606, -7311, 14078, 15944, 2402, -7822, -13244, -9521, -853, -6377, -2357, 17306, 12086, -24309, -30506, 11013, 17394, -6170, 9033, 10727, -17379, -5299, 20567, 3417, 1117, 25225, -7985, -34773, 10993, 15543, -21983, 291, 28898, -1033, -20678, 396, 5820, 6176, 9449, -10831, -11931, 1954, -18025, -20291, 15789, 21943, -4642, -8536, -8, 1217, 12309, 6937, -7347, 9444, 8467, -27102, -25273, 20016, 29432, -3533, -10410, 6036, 4581, -4733, -270, 13394, 4925, -12488, -10476, -9184, -3860, 11841, 3689, -10963, 6028, 9663, -24840, -15083, 30169, 9577, -22687, 1980, 8980, -13861, -1046, 16645, 1519, 2604, 11040, -13553, -14591, 12996]
334A2996k041q956L923p549p569Q931J022k273J3587r411k7903J1311K1078p582
348d36k937J1460l538j3446K782Q849K169N317l913j6316k747J8756L806j9109
362i303J3144K5140k7860k5716L0295J4922k9855L89K0832j8132j1665J4772m984
375h021N807K2555j8511k4788K4639J2270k5954P380K4082j5076j5053M449L842
388b379J0828O931j4803m687J2550j2420j1958K4813Q715k2999m131R103m300
401d737k63J1199j023r632L050J114j0900J164J7994L141j7568k17J3405p754
415a027l080J6949j287j3580M606l435j5211J8712J4281k6811m21K5661j7486
428b129k1295K6226J6841j6901m520j661p937J5515P480j9588N819J5114k0631
$$ y = [12996, 10955, 1999, 5922, -1627, -9196, -265, 757, -1516, 12071, 2660, -25243, -13932, 7146, -436, -3373, 8087, 4549, -8897, -6115, 2734, 4903, 10220, 6307, -10009, -12756, 6000, 9806, -9303, 3841, 28981, 1121, -24595, 5700, 20622, -9233, -8844, 11988, -6144, -17809, -3037, -8021, -2214, 20341, 1830, -22958, 1681, 13951, -12003, -4623, 19459, 4383, -10670, -6221, -2379, 8449, 15380, 577, -4110, 8440, -3980, -15938, 8875, 17590, -5409, -9540, -437, -4737, -5000, 6199, 5176, -4456, -1406, -292, -11192, -10028, 7966, 11107, -6461, -6678, 6727, -1027, -4107, 12842, 11555, -2025, 2581, -854, -16065, 2647, 16928, -9883, -10304, 15357, -2129, -23424, 2802, 19643, 2742, -1778, -3439, -11376, 4139, 11619, -7969, -2150, 12964, -7667]
441g667j2788K4984P006j4953M764M757j0261p9O170O92N366L64j7375o433J8380
456B927M422j5666M390J8406p638k2425R488K1538q640r856Q241k519j0278M132
470c478J243k476J3665j08k4472K331K2115m312q229P952l456r175N976M48k436
485d412J5247J971j7643J57Q115k935K193N911o995n340K089o298J683J5222j910
500G055j3296M669O481p922n157R594O520p441j0744p05Q498L786j815J651L305
515D479Q32o453l272J2729J0428j2525j2653Q268q9j3427N423J2667k904o427
529b924n068j916J2854O708j2812J032J2420j3761j2829J6292O202r188L258N4
543C22r275R294R459j0575M397J3676j5699j3539J4900N107j1168L249N211j0609
$$ y = [-7667, -20455, 4529, 11535, -3418, 1346, 6103, -4158, -4237, 1933, 2625, 7991, 8355, -9020, -15453, 2927, 7349, -8317, -3927, 14479, 6841, -15584, -6096, 15442, 6802, -3054, 5187, 2668, -7610, -3478, -2235, -4711, 8954, 8846, -15626, -13295, 8820, 4508, -3721, 4231, 775, -8400, -2424, -1976, -4412, 10835, 12806, -4837, -4680, 3435, 500, 2693, 8604, 1609, -3731, -1642, -7940, -6257, 8965, 7055, -6241, -1572, 4909, -3013, -8170, 1424, 7944, 503, -10241, -10946, -2448, 1338, -477, 1174, 4479, 5311, -1142, -4414, 8315, 18743, 6218, -6435, 1833, 1744, -11683, -6260, 6407, 3503, -2924, -7992, -9908, 2946, 9654, -3158, -2126, 10294, -3467, -16296, -4, 6198, -2990, 268, 322, -8953, 341, 9800, -775, 3622, 17298, 1599, -11940, 2960, 8067, -3101, 148, 5359, -5250]
557e250m656P760R43k97P531j453j2847j521J1642J503p173N999N152j1390l331
572g388Q619K406J878M973j1602q742J5367Q43j6824J0944J5461j8464j2082J5457
586H46L164m529O578m703p367Q094l981j0681J4655R928j8950l955J5954m613
600D40q185J2623P470r248n657R0p48N438L929p063l112N447j388q782M056J5794
616A1104j720j5979K247R736o887l428J0307k79r428K1L02j418R263K445r290
631c004J101M802o337Q31P496k330p32P37r801o5J2967j002p244O220J103r135
647d393K91N102O41M467k527j1881L615J0046o871m715J0528K699j0482m638N521
662b597O100Q93n530k307L032j247k944M701O742r16p016l261O025K508o010J542
$$ y = [-5250, -9906, -2146, -1203, -1500, 6031, 4578, -8269, -9790, 1852, 3355, -3818, 2181, 7333, -4057, -7388, 1231, 3637, 5515, 10488, -1114, -9856, 5511, 6354, -10470, 474, 15935, -2529, -14611, 846, 4010, -519, 6059, 1356, -6011, 2083, -1898, -12579, 2076, 12004, -6946, -10901, 5053, 440, -7745, 4878, 12348, 3100, -2557, -2467, -3215, 2223, 6152, -911, -4023, 1424, 36, -8746, -4690, 11104, 9384, -6595, -4348, 5388, -1499, -4927, 5380, 5101, -4327, -4306, -4004, -5422, 3841, 6286, -3004, -1903, 2899, -3438, -2607, 4889, 2559, 1827, 2564, -7237, -7302, 5665, 4663, -2581, 3639, 4742, -4393, -4102, 1000, 1641, 6108, 3581, -8300, -4685, 5361, -1510, -6225, 4303, 7002, -3480, -8118, -2597, 3503, 4396, -1134, -3441, -409, -1656, -4600, 101, 6843, 5927, -1089, -4350, 1675, 4183, -1827, -285]
678b85R081o341j1472M024O454L53J105l400l346O336j793r790Q550J1070j2092
693a546p054R589j872m011R034Q9o736M493n52p843P376R487q554n026N671k814
709b69n025N629M481l859o97q11l773N01O572R45n970k21N225n043o119R043P052
726G661p714l797L413j870K709M871o347J99R387q725j1639J3937R499j3381k599
741d396R083n507m153N621K42J529L236q784m905J0090J537r121M119P279p021
756a151o534N054N900J03k231k595J230J085k129K08L504J925k268n497r8O276
772B782O3l241K815P63n934j074M217j58J021J808o201j980N991k021k899O531
788B483Q25o079M91R01j034P025Q72q914J555P028n917l794Q810J883o645j276
$$ y = [-285, 8796, 2455, -9017, -4993, 1461, 1814, 2919, -481, -3827, 2509, 716, -9074, -524, 10546, -1546, -8600, 989, -883, -4894, 4140, 4229, -2507, 1986, 1434, -6409, 967, 10454, 1900, -3126, 2545, -269, -5294, 335, 4816, 957, 260, -551, -4324, -3823, 2749, 3694, -2276, -2497, 2728, -2315, -8434, 609, 7661, -53, -3850, -437, -2307, 402, 5273, -1074, -875, 8512, -213, -11852, 2085, 11584, -1797, -4396, 4687, -820, -4973, 648, 890, 2419, 5655, -3129, -8034, 2056, 3593, -5528, -1409, 5870, -1151, -7685, -2631, 3269, 3372, 1141, -1454, -224, 861, -1268, -1060, 2444, 4369, 2101, -3396, -3494, 2782, 2845, -396, 2419, 3182, -2752, -3826, 391, 233, 1254, 3062, -3139, -5119, 872, -1149, -4048, 2483, 3308, -2771, -2280, -1379, -2413, 4612, 5484, -3430, -1875, 5153, -764, -4558, 4252, 6135, -510, -1786]
804a786J52P80M001j973l325M646L40q902l45R099Q40o154j437K963J223j568
820a446p03M213L440l725n655J418N657J205n188r70O138j862q175L574Q201k855
836C267m617P42j381J76L209k759j305O006k964q179N477O535n531j57N333m098
852b46l845M598M15l44L823k490n544L506M142l923p07L687n06m111k039J334
868b250L055J733k876l096J649K870r15k739L294M547n458n607M627L744k333
883B45j023L34j12J579j439l499O278O173q802n411Q963J82p529L304M697l869
899G1j999q25j239N883K505o562m69P362l765o661O128N039m460l778J078L53
915a339R57N2n56J771J190l229j761L303L639j575l318N20J370k069o02K800R47
$$ y = [-1786, -1634, -854, 3147, 1174, -2151, 2495, 2835, -6067, -6412, 2687, 3527, -2627, -4064, -1101, 122, -1446, -2149, 2064, 5504, 1779, -3876, -2458, 3199, 4404, -784, -1754, 4384, 2522, -5653, -2079, 6122, 3267, -1350, -608, -1989, -1813, 1396, -1363, -2668, 3338, 374, -7805, -2328, 4207, -1324, -1481, 3852, -246, -4091, 507, 922, 578, 4401, 1911, -3633, -127, 4015, 92, -615, 3072, 2566, -1545, -3584, -2250, 805, 2538, -338, -3434, -1785, 1085, 170, -2569, 725, 5272, -186, -5793, -1166, 2578, 245, -778, -444, -556, 1023, -416, -3915, 2363, 8536, -266, -5677, 3286, 3468, -4061, -757, 3940, 71, -1928, -2753, -3992, 1891, 4396, -2166, -2635, 4727, 962, -5699, 429, 5468, 1008, -2770, -1692, -1339, -382, -330, -886, 885, 2075, -1154, -2915, 388, 4027, 2452, -866, -346, 1024, -1045, -1647, 1153, 2100]
932B100j120q45k262r25M808R86m987J224L531m897j834N032N86j253J433k790
948a213k384N353M3n149M152M063p299k691P227J689l120N70K45l49K03k509q81
965b050N632K86p944k408O417J584m703K07N248q8m489p54M032K404j450k310
981c86r94J372Q60l139Q86N945j505o250K328M262k352m99K425j505k105m7k143
998b847O48M123j984m338K745J515k708K111L035j302p35M6k163P50L973o77l111
1015i19J110Q94j933K74J838R25k25k520k039K122J875j730j035K123O21l636
1031b255k293M612L727l672l078K872J088k491r43K274K882j14m239k127N979
1046B222K724n515n81N318k701n057K219K665n02J11k122j725L222R50l098K100
$$ y = [2100, 980, 135, -2127, -3052, 1756, 2742, -2245, -1021, 2510, -2387, -4221, 811, 1397, 144, 1577, -1213, -3597, 1756, 1799, -3350, 802, 4865, -2434, -5125, 2102, 3791, 671, 1241, 1486, 1137, 1340, -1169, -2050, 3582, 3868, -4076, -6484, -67, 1517, -3186, -2979, 2269, 2181, -2308, -3062, 970, 3374, 1924, -386, -1380, -8, 852, -2287, -1401, 4544, 3039, -3211, -883, 3379, 1027, 528, 2953, 1448, -657, -704, -2847, -2199, 1924, -60, -4398, -1653, -138, -2846, -735, 2300, 998, 263, 309, -1854, -1104, 2869, 2192, -919, 191, 1085, -848, -574, 1264, 2189, 1964, -556, -2595, -473, 1402, -328, -1363, 760, 1381, -2255, -4548, 64, 3791, 119, -2959, -87, 1001, -1490, -2433, -159, 2723, 2609, -1630, -3757, 2222, 4946, -569, -1150, 4168, 1467, -3590, -1371, 1294, 792, 903, -1219, -2944, 278, 1228, -1870, 230]
1062B30M050m100l930L019J488j616J027n2j137K31L64p99J888K507j581k616
1078a027O99J336r38J52J115o40j586J34p9m86K459J702l844j816M062q74l531
1095c162L560K897m309k182K550J60K37J547j348jK350l076k952N603K906n679
1111h99j574L950m85k105J100J230J023j069l336l93L969Q66l456m19K612r86
1127B8l182Q08M096M04k742j170J659M09j104Q95Q27N40j234k267P78L394K1k290
1145a30N85J094k240k00J699o2M3j39k865j36L214m43j354J357j37j972M02N87
1163f97M0K222j94l371Q21K671j831r65L193K59k311p36N67J021J178j409j638
1180a180J884Nk846Q2L808O83l889q94K696N01k148N17J777L7k148j221J271K231
$$ y = [230, 4280, 180, -3750, -731, 757, -859, 168, 116, -1021, -790, -426, -1225, 663, 3170, 1589, -1027, -328, 1008, 70, 222, 1337, 697, -889, -755, -834, -1320, 1139, 2841, -1003, -2819, 1243, 369, -3162, 398, 3295, -1014, -3196, -646, -486, -249, 1298, -50, -51, 2299, -777, -3729, 1874, 4780, -899, -2473, 1477, 992, -1113, -13, 1217, 2240, 1171, -2165, -2558, 1411, 2277, -1179, -1598, 1014, 28, -3154, -2346, 1750, 2154, -588, -1758, -99, 310, -794, 101, 928, 1468, 234, -2033, -1255, 2139, 2160, -130, 455, 1549, -691, -891, 808, 746, 789, 650, -2215, -2351, 863, 420, -934, 423, 286, -1686, -1284, -697, -657, 1565, 1371, -2000, -1179, 1492, -339, -1304, 1889, 2148, -163, -899, -332, 689, 1867, 458, -1180, 704, 709, -2137, -2055, 1753, 2436, -1453, -2347, 349, 850, -1298, -781, 996, 1033, -1115, -2336, -1065, 1166]
1198A166P75k816q5K929j075l298K796L262k937j882J659m35q21J520o97m03K093
1215A751k178k739K912K738l014j173K255j165j397J212J103j81Q99n63k610N97
1231a553K763K70j737M94J097j280j071J480J153m28n54q79j165J460J170k212
1247i92Q24K297k520l343L700K053k987l56K089j447p49R93k65J364K154l455
1263f40j976M180N38l475J320K824j565k458K77J098J253k07k135R0J714j197
1279c59j567J720J974j832j906M98J698j62p15N84P85j203m92L72R59J011k09
1296A156j409J28R79p02l41J349J80j626K93l06q18J695O59k213N15O27j367o40
1314a841K013N58j042O2p06O1K060p14j493J561J050k854m60K385Q42j225m93
$$ y = [1166, 1941, -875, -960, 1969, 894, -2404, 392, 3654, 717, -1165, 494, 59, -762, 758, 61, -342, 1751, -427, -3166, -254, 2484, -530, -1703, 552, -613, -2010, -798, 305, 124, 1023, 460, -2150, -1553, 1210, 1480, -257, 237, 1334, 54, -1017, 463, 1616, 1188, 634, -245, -1410, 50, 1220, -992, -168, 2129, -391, -3734, -34, 2019, -968, -1324, 765, -682, -1431, -438, -703, 661, 2815, -640, -2616, 1564, 2102, -1373, -53, 2771, 1206, -1252, -975, 123, 1376, 1169, -966, -876, 838, -359, -1926, -206, 1768, -64, -1970, -1472, 226, 64, -651, -67, 718, -485, -977, -605, 354, 1365, 1156, -253, -125, 854, 152, -189, 1160, 1340, -286, 7, -299, -1117, 578, 1237, -976, -461, 166, -1201, -1841, 172, 730, -312, -250, -956, -895, 1165, 451, -1042, 519, 1569, -1285, -1745, 640, 1482, 257, -236]
1331b36L33M77K2p06M39J392o10k529o9K123J71k057J26J943o77k217Q54K662
1349A441r04r98Q07m87P8J49l94K82J747j878k425K756J578k169L01J707r32r56
1367b97N76m78J02J626j283k124J278P45j263O82O91l69m98K1k27P42J171j44
1385I51j493J14J122o54o91Q58J170r95j137L59P73q7J48O9m48P97o44j685J569
1404I6J764k307j183J598K20k052J316R70j61l76q48p44K575P93k402R54J547
1421A760j384j785J784J425j201r09J18K38J17k77l40J161N00j535o30J335M40
1438H17q67m96N14q7j053k87J279K03j36J08n39K87J028K40j203J276K39j755
1456d32j79J460l16n9N79j715n43J735n37j115J599J282k603o03J285M40k51o2
$$ y = [-236, 97, 574, 596, -110, 329, 1721, 1111, -1418, -1487, 636, 807, -1250, -1124, 819, 142, -2075, -1221, 1441, 537, -461, 346, -141, -63, 86, -308, -26, 1721, -157, -2582, 174, 1752, -417, -116, 1591, 659, -297, 279, -199, -97, 1529, 246, -1878, -600, 145, -1118, -436, 255, -114, -612, -591, -818, -76, 1095, 951, -542, -428, 694, 40, -651, 207, 1377, 382, -755, -396, 377, 290, 438, 507, 59, 856, 212, -1473, 96, 1860, -447, -1630, -32, 188, -1864, -548, 422, 261, -115, -963, -1707, 868, 1661, -741, 213, 1760, 376, -1409, 375, 1800, 599, -310, -192, 46, 163, -114, -454, 707, 1207, -328, -958, 377, 817, -50, -546, -32, -119, -1172, -1459, -180, 23, -113, -5, -544, -257, 771, 1011, -192, 1084, 1323, -432, -611, 849, 533, 474, 1053, -662, -1205, 530, -7, -1122, 477, 1759, -844, -1447, -162, 278, 27, -35]
1474c5m40n0R33j404n91K528P30k655m2J874k96p92L48J048L6j420p21J060J097
1493A208q45q44O2R16r63r61R56J619j003j599R61R78r12J39R94l20m82n87l67
1512a050Q88J179o62j180J417P0j253P67J058l74m87o6j057M64P94l27m40L36
1530G7j21q74J91O40M58N5o63p08P41N17o60M39L63k2o52p24J053J516p47j075
1550a96M68O9l84l19k2J362R8j679o65J613N87k052O19J914j373j574P60R65N2
1569B43N2q76N7J058p07q37J668J182j805j192J587K60o69J49N28P3n69j031O1
1588g68J246K56q19l87M08k32m10L17P78k08n21l77K42l40J030L77o26j40N60
1607C86l86p33J615M99j239l65L05M3J86J19n44K48R63j769q63J747R27j751m87
$$ y = [-35, -475, -525, 408, -996, -1587, 941, 1671, -984, -1026, 848, 552, -240, 108, 1156, 1192, -228, -949, 111, 1208, 363, -481, -419, 497, -466, -1427, -471, 1148, 145, -1454, -493, 485, -427, -288, 706, 386, -96, -683, -1050, -162, 1017, 355, -825, 592, 662, -591, 176, 1234, 860, 373, 307, -750, -286, 508, 181, -259, 77, -44, -918, -727, -87, 371, 426, -237, -945, -204, 313, -347, 92, 455, 433, -219, -943, 110, 1626, 879, -196, 272, 341, -43, -362, -384, 978, 1076, -603, -1268, 345, 932, -1120, -501, 1413, 40, -1534, -774, 191, 243, 295, -581, -524, 534, -173, -1010, 658, 1840, 35, -1157, 430, 690, 21, 170, 698, 771, 202, -829, -768, 478, 734, -85, -472, -64, -296, -706, -389, 389, 181, -340, -717, -475, -815, 215, 592, -34, -174, 386, 0, -733, 882, 1381, 142, -223, 82, 125, 311, 430, -114, 134, 1097, -672, -1535, 212, 1139, -612, -1099]
1626a099J085J69p24k22O77Q86j81j666O8J593J0j017L62R39k96j412M50J318
1644I40L51j254l08Q27k55j029N53Q98J09j041r92O66J062n26o41P75M05j467
1662i27J7P71N01M4k18q55N32N45m32N2P44k31o62J14n4K02O16j67r04R4N58p91
1684d51m6P66L36p69m58k63O43L00l60k52Q50k26r92J45J568N92j349o35Q37L03
1704E39q01j70J051L14j057m70M59Q52o0j178L01R81p87j595J232J657j115q53
1722g00J49N90k03L4rN27L45q03j164J142J082r29j21Q86o25q80P39J12M75j32
1742E15l81n20K19N65m01j70O08k31q48J38O24k86J54K8l1n41R04k89l31P18N07
1763I51j009p60J114N59r50j09L18J14j37k20k69Q46O93j400o49J342J01r77R8
$$ y = [-1099, -14, 155, -569, -791, -114, 772, 591, -1075, -1007, 586, 596, -421, -59, 880, 584, -828, -378, 940, 1291, 37, -271, 556, 301, -728, -175, 723, 832, -209, -1201, -535, 527, 1, -640, 135, 540, -927, -910, -139, 362, 406, 188, -667, -135, 410, -22, 30, 774, 543, -119, -5, -59, 143, 759, 592, -312, -218, 340, -451, -497, 269, 605, -164, -622, -885, -242, 58, -302, -554, 296, 70, -922, -777, 791, 1383, 34, -601, 236, 539, -262, -432, 619, 933, -124, -594, -135, 717, 657, -521, -220, 761, -26, -1621, -389, 1268, 153, -700, -551, 39, -164, -130, -139, 388, 733, -70, -1234, -92, 990, 61, -60, 826, 201, -679, 60, 172, 647, 515, 134, -386, -167, 398, -3, -173, 435, 204, -644, -506, 118, -168, -14, 14, -17, -558, 346, 57, -274, 444, 951, -58, -818, 296, 855, -95, -204, 114, 228, 91, -129, -398, 448, 1141, -259, -908, 434, 535, -442, -344]
1782c44Q48j66r93l17Q40Q33o12q46O97M98p66p45J169R49q59n19L05M44R8r15
1802d01M15R78o82o66J55P18R3m24m72M81n7n30j43N93O9l74k17K0l0N02N6j67
1824h3K49J45m58j1O09J59k60k6n01K93L08m39j55M54M07q96j89J03N95n68K16
1845d8m25L58K60p54J26J071l46q13l49J081M14j025J49Q73Qj031J91J033J3p30
1865E6J42J6K77o75m48O02Q60r88q94O68Q03n52l08M97j28j48j27k28L42M50l75
1886a58j7K56kk11Q3N06l4l26k18O3P7L34r4j8k55R4l14J59R8mJ44o44J50K12
1910a19j54L05j94J61L05m24o78R29P24o99m74L34N96q55J61L71L03j63q40n0
1930d61R01J17q03P5O09m69p21L67O04j62l43m11O80J19k40l75O96N63q47n84
$$ y = [-344, 504, 338, -655, -972, -132, 701, 89, -757, -60, 438, -328, -1073, 96, 1045, 186, -333, -28, 416, 514, -401, 14, 992, 310, -356, -201, 517, 610, 186, -286, 195, 138, -392, -535, 58, 127, -247, -464, -444, -474, 28, 84, -83, 166, 311, -147, -158, 451, 610, 350, 324, -177, 116, 424, -15, -170, 284, 691, -205, -394, -291, 304, -264, -48, -473, -115, 145, -609, -483, 588, 242, -571, -920, 161, 575, -450, -301, 572, 580, -451, -260, 773, 786, 56, 198, 214, 491, -184, -632, -30, 830, -158, -1052, -384, 419, -133, -441, 56, -72, -220, -347, -575, -233, 217, -158, -175, 81, 79, -132, -49, 457, 423, 97, -121, -58, 19, 353, 259, 241, -14, 80, -234, -75, 23, 19, 163, -481, -331, -119, -273, 32, -162, -1, 304, -120, -798, 131, 855, 156, -318, 16, 612, -243, -82, 289, 592, 429, -411, -461, 440, 557, -246, -171, 438, -31, -752, -385, 219, 57, -286, -697, -17, 102, -138, -513, 183, 746, -101, -685]
1950f85P08M04k65m46M50J29m03j93O74l6q0k60N5j71K46k63M8M3p8j5j72L02
1972hn0LJ06j11k55K49m0q4K81L31m26r9O7J06L75j23m76K67K33n31m33Q26L14
1995E22o93k93M46K38m77J05N23j31l49n01J23O83j41l08j7N16l9p44N57O00k67
2016C53p82J47R22j56o86L36K03j2l69k80J78N41m04n09R02k70o81K88K50J64
2036A35k53k13L3J83P4K51j90K29l11QJ27j46P0r7M63n55Q5j26J42K82MJ26k59
2059F2k66r7M68j26k02o2J91p5l45Q8M66L32p58k18O06J56l67k61Q23j6p27K74
2081e4P8M31j97o94N45M91k65r21P23M53n99n08J96L13R7l02o0K76p9m52O0P18
2103B50Q3p23L09M01k07l38Q5O70k77l15r4J83l2O0K36k27j7R6j08m1J97j58K
$$ y = [-685, 23, 427, 162, -284, 166, 295, -108, -301, 373, 337, 257, -3, 52, -119, 127, -136, -88, -45, -123, -138, -310, -8, -58, -55, 51, -60, -315, -66, -106, -190, 91, 422, -4, -103, -36, 70, 445, 322, -154, 113, 346, -185, -618, 208, 522, -171, -464, -18, 220, -257, -152, 371, 240, -109, -610, -487, 196, 55, -253, -270, 246, 207, -537, 20, 620, 353, -429, -282, 640, 484, -202, 134, 337, 325, -44, -324, -146, 395, -9, -518, 384, 114, -567, -279, -29, 135, -118, -331, -298, -115, -41, 210, 20, 249, -62, -54, 73, -73, -3, -100, 363, -192, -107, -233, -91, 191, 195, 321, 62, -204, -301, 167, 41, -161, -223, -32, -107, -452, -364, 102, 434, -324, -542, 64, 220, -147, -408, 415, 399, -328, -54, 24, 455, 258, -436, 109, 600, 335, -586, 137, 590, -9, -517, -321, -8, 89, -213, -273, 3, -76, -528, -468, 250, 333, -390, -81, 320, 113, -225, -140, 530, 253, -62, -156, 27, -5, 55, 291, 64, 47, 143, 35, -6, 191, 33, 35]
2126C5j65j85p2K82M21n24K3K37k46j47L84K14LQ0m58K70J82l60j31J54N21n67
2148d9k99O55o8l89q1L26P1m71p8N52L06q22j67K29K70o8n38O23M99l40n96K78
2170a57M74j75k37J93K69m16l79N11L55l34O6n62N80m01J99K5J34j32k01N0K14
2191G6k35PL22K2j80k89J70J28K44k34p1M0k32M3L18j3j74K78j09k50K7rL39j7
2215B01l66P1L22k24l47L12J55P0m00j40O19M2l00k15M06n1m00l2M07K36m10j02
2237a46K31M14m86k38O08K3n60k61O02J69n40j03K39K40l67K7q4K06jl12J99K70
2259A30j68j36J28K69j81j95j42M77j83m3K40J17n31K7K46n5O1J1J42n10L65j47
2281g8R0J0j60k5J97r2j85J61L30k72k13l8M81k90l7J91J1m5l58L87m3J31k96
$$ y = [35, -130, -315, -387, -105, 316, -208, -185, 52, -194, -341, 43, 257, 260, 340, -118, 152, 334, -26, -157, -3, 518, -49, -348, 307, 239, -150, -231, 95, 166, -305, -383, 169, 475, -347, -514, -285, -15, -83, -621, 2, 501, 161, -435, -157, 317, 142, -95, 98, 367, -49, -428, 83, 438, 104, 170, -392, 188, -213, -14, 11, 145, 13, -188, -138, 76, -159, -152, 170, 192, 12, -277, -107, 21, 265, 31, -40, 0, -232, -189, 129, 116, -58, 220, 111, -139, -112, -121, 218, 201, -165, -94, 228, 4, -343, -31, 124, 194, -206, -346, 273, 315, 15, -200, 206, 155, -245, -277, 130, 366, -44, -146, 85, 499, 13, -225, 383, 406, -154, -415, 187, 356, -184, -287, -48, 192, -175, -148, -232, -26, -27, -339, -140, 130, -38, -174, -46, 223, 42, -153, -295, 182, -1, -44, 196, 313, -218, -191, 55, 0, 61, 72, 214, -296, 69, -78, 12, 22, -138, -163, 34, -58, -243, -82, 248, -24, -237, -275, 206, -84, -121, 70, 81, 36, -322, 65, 22, 153, -143]
2304a43K26O17k92o06K17M65m11n38J42M98l70O1N3K74J31k95l93K63L21l95r8
2325b73N02P4n13J14L83j39k30l27N83J16m3k40J72j22J02m36J57J81j64N8J48
2346A03k85J56N6j24J7p2K61n7R0k24K60K20l50k5K89k69K3l26L70m8j12j38J79
2369fJ45k92%L07L90p54m1K49K33k32l80N33j67k02k43L60N20m8o79J16M09O9
2391B87l53L9L43m21k40J15K58J48k16P8k4J19k73J20N06j28m42L6O8J3j82o6
2413b15K81K0j52j34J15K18Q2j93j13J96P0j79L11l42K34o4k83J48pJ40oj69J62
2436A20q1k4l6l73M2K47k75K10M9K81j97m04O39J09m19J49J33m1j06k12L53J6
2458A80q6j25J3J79J6l82P1J24K20o17P21Ql73j58M2M35j79k57P4K83j67m63K19
$$ y = [-143, 83, 700, 408, -198, 19, 484, 73, -465, -323, 175, -195, -134, -81, 193, 324, 29, -364, -101, 220, -175, -273, 229, 303, -210, -96, 287, 148, -82, -409, 174, 290, 247, 7, 179, 57, 159, -277, -120, 61, -103, -45, 103, -182, -26, 30, -94, -77, -149, 112, 55, 145, -79, 181, 401, 51, 26, 315, 46, 69, -257, 113, 65, -47, -185, -6, 139, -153, -153, 154, 544, -210, -251, -2, 231, -1, -381, 152, -15, -217, -460, -100, 420, 372, -307, -191, 218, 287, -66, -27, 316, -105, -345, -230, 28, 176, -40, 38, 14, 133, -140, -20, 486, 358, -84, -48, 20, 33, -149, -215, 66, 86, -66, -200, -85, 133, 215, 22, -91, 105, 175, -4, 307, -35, 199, 135, -148, 0, -7, 133, 127, -42, 120, 39, 15, -21, -394, -352, -105, -380, -170, -121, 160, -37, -441, 198, 307, -112, 37, 170, 129, 23, -189, 164, 180, 94, -31, -18, 161, 177, -205, -134, -10, 210, -407, 314, 322, -51, -209, -167, 268, 89, -168, -94, 189, 22, -441, -222]
2481b22L58j37k05R8J57j60q1L39n6l21L64pj09j98K44Q8M0m21J16K46J44k15
2503F2j11K02l14L2j96M79N1k26j76L60j85J2n6K64j81k89K31o6K92l37K2J16
2525a4P4j48N6K86J63m40k29L75n9J3l99K47J08k10j99L05J58p7O0L6J32m75K6
2548b11K72P1k18pJ14J42J7k61j65P53l02n82K35J81Q5j02O4K5p5J44l10J43Q3
2571I6l65J96L1j32J10N2K2k19M93k07K67m40K92l2m1j42r8K61j37j39n5L75l0
2594A58k92L33k45K54k90j3K18k51j18J04K09N4m3j13K5J14j06j29M76j22j16
2615A07k51K20J24j06k76J43J65n5M2l2J26j58k46R6K12l8m9j47L14l59m0L74
2637A66j74MJ3L08l14J57j50O0Pj56J04R6o2RK87l11j37J23j10J80j77J89jn9
$$ y = [-222, 136, -1, -206, -108, 49, -111, -192, 147, 91, -230, 134, 127, 18, -180, 64, 152, 192, -229, -113, 133, 277, 62, -49, 153, -161, -129, -325, 154, 205, -21, -197, 163, -22, -10, -66, 198, 17, -272, -41, -107, 185, -152, -130, -14, 60, -88, -32, 254, 417, -23, -252, 123, 64, 77, -322, -75, 33, -177, -376, -71, 87, 10, 70, 106, 238, -237, -211, 61, 132, -86, -93, 21, 163, 180, -81, -246, 507, 205, -377, -142, 39, 124, 22, 86, 111, 36, 180, -130, 13, 96, -269, -73, -42, -174, -64, -12, 10, -209, 284, 77, 344, -96, 196, 164, 123, -19, -117, 144, 7, -132, -187, 188, 158, -134, 199, -46, 208, -82, -95, 123, -128, -246, -142, 67, 121, 78, -35, -10, 104, -2, -131, 345, 223, 107, -144, 76, 200, 94, -182, -39, 126, 71, 113, 81, 207, 49, -197, -101, 111, 73, 24, -123, 191, -168, -208, 166, -8, -4, 9, 317, 3, 160, 10, 70, 77, -79, 25, 121, 59, 68, 355, 44, -93, 30, -80, 100, -77, 112, 111, 52]
2661E2J5j81Q8L64l29m8n8L60k55j54lM24l68R2R2K4m9k59M06M1j63k47J25n7
2685h8K01l30K02J13j46k67M13q4j65M9j6J74k4j43j32Q8p7M9j51M95J06k89K71
2708B49m3l7l01J57R5j22O6l80L7M79j32k04KM1J62M9m6m60N3N74m15J40J76l32
2732a92K41J60l68K07J1M1lj65O3J58l31J48K67j8j72Q2J09k34j39J16J0K8M4
2755F3kK8q9M4j56p5K52k05J9R0o1q2pJ30K52m97J37K02n8J38k82L42n3j72K4
2780a8l5j00m8L97l18n4Q6N1j75J44J94j66J48j33J21k01J80R7j79L39k60J12
2802A82l07N07j58j01j34k8k22L89j5j72K71m64J85K49k25j08j71O14j20k30j80
2823b38M59j99k11J3L14J07l91j67L10J03K0j62N1J74l14j09J22m9pN8J6J95j53
$$ y = [52, 67, -114, -26, 338, 9, -39, -97, 263, 8, -146, -149, 275, -93, -1, 91, 115, 66, -193, 213, 254, 91, -156, -31, -88, 113, -217, -15, 98, -48, -315, 98, 14, -151, -102, -118, 56, 32, -111, -243, -155, -232, -183, -334, 161, 267, -22, 249, 206, 169, -132, 25, 120, -2, 64, -316, -279, 200, 68, -136, -134, -93, 69, 118, 72, -388, -335, 239, -176, -36, 140, -192, 49, 209, -159, 48, 59, 100, 97, -68, -5, 153, -178, -30, 237, 219, 47, 129, 238, 4, -135, -19, -9, 19, 63, 61, 89, 0, 44, -112, -187, 65, -140, -121, -31, -92, -174, -181, -51, 201, -296, -159, 43, -15, 123, -159, 183, 130, -42, -18, -53, -153, -201, 196, -122, -176, -90, -39, -214, -70, 124, -42, 106, -27, 94, -107, 73, 170, -9, 330, 70, 182, -125, 382, 224, 123, -11, -39, -261, 128, 113, -59, 212, -252, -67, 182, -43, -151, -322, 292, 172, -58, -238, 221, 22, -189, -176, 138, 245, -146, -313, -3, 100, 120, -42, 9, 183, -131, -240, -118, -167, -174, -116, -100, 95, -58]
2846e8K33k02J80p2j98J57j3p5q0r6N8J2K23k49K40j31j9J16o7J59%m7q2J4Nj00
2872i2j17J23J39j54R3o3j41M6J02M8k30R2K86l58L9K92j00j07NJ48l5J66j76
2895Fl5L6m5m3q1J63k09J14J68mj03q3J89k6j30l0L26j64j35m2J63k9n7Q8k4l5
2921b2J73K1k43J76K4jj69L00k30%N2K02l36J23p6K65l04j0M5Q9l18J44J9q3J98
2946C9m7j11m4L76j97K04j50n1J37l31l7K77k16O6J54k24J60J23j47k77L31J84
2968B19l05N8k03L92j35O3k75K74j08J39r5L5j76M5N2o8J67l56L36j06%N7M5j51
2992i6K01J94n57J46M09l97n9K8K19q8k86N03k44j61K16J1r5K2m7k79L76m1OJ69
3016A50j76K27j75N8j58K28r6k05K65p0O1M9p7K08l42J84k01K27k80RQ7l0J7m3
$$ y = [-58, 175, -27, 153, 81, -117, 40, 27, -48, -128, -224, -166, -154, 69, -180, 60, -71, -90, 26, -41, 118, 118, 71, -11, 3, 8, -92, -209, -86, 53, -101, -8, -71, -212, -166, -64, -16, -246, -154, 132, -226, -187, 105, 5, -102, -97, 51, 16, 182, 6, -29, 7, -38, -81, -162, 1, -208, -94, 74, 70, -33, -116, 73, 47, -83, -113, 213, 49, -86, -128, 35, 6, -51, 37, 13, -22, 151, 172, -71, 105, 129, 128, -41, 259, 29, 29, 81, 283, -53, 70, -6, 259, -45, -55, -10, 79, -239, -95, -76, -159, 39, -8, -119, -163, 213, 16, 220, 70, 19, 156, -175, -212, 65, -151, -85, 69, -155, 5, 128, -19, -296, 35, 219, -86, -28, -231, 161, 26, 89, -186, 88, -20, 119, 24, 59, -117, -72, -20, -88, 79, -277, 59, -47, -47, 10, 55, -96, 105, 299, -258, -112, 297, -100, -159, -131, 88, 0, -286, 217, -27, -188, 28, 39, -56, -34, -81, -360, 16, -25, -19, 150, -26, 201, 26, 84, -74, 154, 58, -147, 118, 48, 109, 158, 81, 289, -53, 131, -70, 157, -123, -114, -27, -57, -40, -83]
3040h3O1J82k42R3j95K81l67K40R1o8K32j57K4k41J04K57k07M4L1j91P9J65l29
3063a96lL69k35L67j98P5k26k28K23L5jN8Q7m9k80K70n2q7J22l44O09l05m7j79
3087b15k6K11M8j00J39j65K84o5J47l19J57k71K29Q6l02L30j22R3%j13K7m0M6
3110E9k85J17j1K10J00n7n9kp1ol4O2Qj48J98j54l0P1j15J65j18R2J36l99M53
3135A82k36K70Mk96m0M8ON7j98j1J16j33L11p8%J30l12K25j69J1P9K83m42M21
3159B28j63p7M9k85nK03J9R9l8o6K95l31l0L25o2k48o0N5l4K7P6n7M6L7r8K72
3185A77l03N5K08r7j01j56L75j32k9jj91J57j96J66L27k64L3k21K05k1j96M29
3207B24j33k9j46m5J18J24j2r9J46j13O5j73r6K70k16K61k36PK20n7J37j58Q1
$$ y = [-83, -22, 160, -82, 11, -184, 97, -270, -30, 61, -7, 225, 68, 92, -149, -45, 212, 5, 49, 80, -111, -32, 133, -196, -199, 170, -65, 302, 104, 179, -47, -275, -52, -17, -18, 40, 127, 78, -202, 68, 16, -71, 51, -293, 316, 11, -36, -215, -241, -30, 18, -82, 57, -108, 176, 111, 258, -61, 96, -175, 54, 140, -162, 168, 46, 139, 139, 26, 53, 13, 59, -226, -109, -120, 90, 190, 133, 74, 72, 1, -5, -39, 23, 31, -117, 81, -73, -103, -32, -147, 18, -100, -8, 128, -271, 182, -54, 216, 220, -76, -116, -68, -62, -5, -203, -214, -98, -231, 80, 2, 2, 132, -180, 45, -124, -113, -34, 249, -193, 228, 65, -12, 37, -248, -253, -50, -31, 68, 30, -36, 259, -72, -102, 223, 161, -87, -147, -92, -126, -99, -23, -80, -34, 3, -95, 177, -126, -71, 137, 40, -61, -217, 158, 26, -3, -4, -195, -38, -234, -68, 259, -5, 28, -193, 12, -9, -205, 224, 91, 62, -84, -129, -11, 113, 101, 2, 148, 35, 100, -73, -169, 101, -115, 146, -90, -83, 137, 80, 217, 59, 140]
3230A40j81j39K19K44j93k08K59q7l42L3m7K84j21L45j63j29J94n8J1n6o9J1J60
3253A07k79j5K34j99K65j67P9j11O7K84q3l28K61j33j37J10N4jp8jK23J25k67
3276A0o1P9k35L48k99K78j13j31K38K7j75J1L3m1J63J0l66M91k94k39J74K49J5
3299A72j10k55J0L08j60k93R4J61QK16M7k9k14o2k04M48l23K18j5N0J15k5k40
$$ y = [140, -41, -180, 39, 283, 90, -118, 141, 54, -288, -255, -302, -18, -139, 206, 43, -86, 108, 50, 61, 5, -64, -53, 107, -172, -187, 47, -152, 113, -54, 25, -86, -19, 265, 182, -146, 115, -18, -155, -45, 9, 8, -70, -71, 152, 277, 10, -51, 28, -207, 141, -158, 120, 7, -124, 114, 141, -34, -23, 10, -31, 132, 142, -224, 267, -27, -266, -92, 157, 172, 62, -193, -183, 125, -35, -328, -234, -73, -65, 151, 198, 169, -45, -107, -311, 137, -186, 32, 17, 67, 182, 157, -83]
$$ [...]
8191g9
##END NTUPLES=NMR FID
##END=
