##TITLE=1H_SL30(pure)
 CDCl3
 8 sc, 
 19.11.2021
##JCAMPDX= 6.0         $$ Bruker NMR JCAMP-DX V2.0
##DATA TYPE= NMR FID
##DATA CLASS= NTUPLES
##ORIGIN= UXNMR, Bruker Analytische Messtechnik GmbH
##OWNER= root
$$ XWIN-NMR		Version 3.5
$$ Fri Nov 19 12:53:55 2021 Russian Standard Time (UT+4h)  she@DPX200
##.OBSERVE FREQUENCY= 200.131346
##.OBSERVE NUCLEUS= ^1H
##.DELAY= (6, 6)
##.ACQUISITION MODE= SIMULTANEOUS
##.ACQUISITION SCHEME= undefined
##.AVERAGES= 8
##.DIGITISER RES= 18
##SPECTROMETER/DATA SYSTEM= spect
##.PULSE SEQUENCE= zg30
##.SOLVENT NAME= D2O
##.SHIFT REFERENCE= (INTERNAL, D2O, 0, 15.7039)
##AUDIT TRAIL= $$ (NUMBER, WHEN, WHO, WHERE, WHAT)
$$ ##TITLE= Audit trail, XWIN-NMR		Version 3.5
$$ ##JCAMPDX= 5.01
$$ ##ORIGIN= Bruker BioSpin GmbH
$$ ##OWNER= she
$$ F:/spectra/data/she/nmr/H-F/1/audita.txt
$$ ##AUDIT TRAIL=  $$ (NUMBER, WHEN, WHO, WHERE, WHAT)
(   1,<2021-11-19 12:52:43.45 +0400>,<she>,<DPX200>,
      <created by zg, POWCHK disabled, PULCHK disabled
       configuration hash MD5:
       00 E9 B6 7A A2 85 ED C7 34 08 36 98 17 FE 4E 26
       data hash MD5: 16K
       7F 46 FF D0 44 C1 33 DE E2 92 30 04 A5 4B A0 16>)
$$ ##END=
$$ 
$$ hash MD5
$$ A8 FD 0E 89 A8 06 E4 0C BD 3B C0 F1 DF 24 F0 9E
##$RELAX= 
##$RELAX= 
##$RELAX= 
##$RELAX= 
##$RELAX= 
##$RELAX= 
$$ Bruker specific parameters
$$ --------------------------
##$DU= <F:/spectra>
##$EXPNO= 1
##$NAME= <H-F>
##$PROCNO= 1
##$TYPE= <nmr>
##$USER= <she>
##$AMP= (0..31)
100 100 100 100 100 100 100 100 100 100 100 100 100 100 100 100 100 100 
100 100 100 100 100 100 100 100 100 100 100 100 100 100 
##$AQSEQ= 0
##$AQ_mod= 1
##$AUNM= <au_zg>
##$AUTOPOS= <>
##$BF1= 200.13
##$BF2= 200.13
##$BF3= 200.13
##$BF4= 200.13
##$BF5= 200.13
##$BF6= 200.13
##$BF7= 200.13
##$BF8= 200.13
##$BYTORDA= 1
##$CFDGTYP= 0
##$CFRGTYP= 5
##$CHEMSTR= <none>
##$CNST= (0..31)
1 1 145 1 1 1 1 1 1 1 1 1 1 1 1 1 1 1 1 1 1 1 1 1 1 1 1 1 1 1 1 1 
##$CPDPRG= <>
##$CPDPRG1= <>
##$CPDPRG2= <>
##$CPDPRG3= <>
##$CPDPRG4= <mlev>
##$CPDPRG5= <mlev>
##$CPDPRG6= <mlev>
##$CPDPRG7= <mlev>
##$CPDPRG8= <mlev>
##$CPDPRGB= <>
##$CPDPRGT= <>
##$D= (0..31)
0 1.2 0 0 0 0 0 0 0 0.06 0 0.03 0 0 0 0 0.0002 0 0 0 0 0 0 0 0 0 0 0 0 
0 0 0 
##$DATE= 1637311962
##$DBL= (0..7)
120 120 120 120 120 120 120 120 
##$DBP= (0..7)
150 150 150 150 150 150 150 150 
##$DBP07= 0
##$DBPNAM0= <>
##$DBPNAM1= <>
##$DBPNAM2= <>
##$DBPNAM3= <>
##$DBPNAM4= <>
##$DBPNAM5= <>
##$DBPNAM6= <>
##$DBPNAM7= <>
##$DBPOAL= (0..7)
0.5 0.5 0.5 0.5 0.5 0.5 0.5 0.5 
##$DBPOFFS= (0..7)
0 0 0 0 0 0 0 0 
##$DE= 6
##$DECBNUC= <off>
##$DECIM= 32
##$DECNUC= <off>
##$DECSTAT= 4
##$DIGMOD= 1
##$DIGTYP= 9
##$DL= (0..7)
0 120 120 120 120 120 120 120 
##$DP= (0..7)
150 150 150 150 150 150 150 150 
##$DP07= 0
##$DPNAME0= <>
##$DPNAME1= <>
##$DPNAME2= <>
##$DPNAME3= <>
##$DPNAME4= <>
##$DPNAME5= <>
##$DPNAME6= <>
##$DPNAME7= <>
##$DPOAL= (0..7)
0.5 0.5 0.5 0.5 0.5 0.5 0.5 0.5 
##$DPOFFS= (0..7)
0 0 0 0 0 0 0 0 
##$DQDMODE= 0
##$DR= 18
##$DS= 0
##$DSLIST= <SSSSSSSSSSSSSSS>
$$ [...]
##$SUBNAM2= <"">
##$SUBNAM3= <"">
##$SUBNAM4= <"">
##$SUBNAM5= <"">
##$SUBNAM6= <"">
##$SUBNAM7= <"">
##$SUBNAM8= <"">
##$SUBNAM9= <"">
##$SW= 18.0517287032376
##$SWIBOX= (0..15)
0 0 2 0 0 0 0 0 0 0 0 0 0 0 0 0 
##$SW_h= 3612.71676300578
##$TD= 16384
##$TD0= 1
##$TE= 0
##$TE2= 300
##$TE3= 300
##$TEG= 300
##$TL= (0..7)
0 120 120 120 120 120 120 120 
##$TP= (0..7)
150 150 150 150 150 150 150 150 
##$TP07= 0
##$TPNAME0= <>
##$TPNAME1= <>
##$TPNAME2= <>
##$TPNAME3= <>
##$TPNAME4= <>
##$TPNAME5= <>
##$TPNAME6= <>
##$TPNAME7= <>
##$TPOAL= (0..7)
0.5 0.5 0.5 0.5 0.5 0.5 0.5 0.5 
##$TPOFFS= (0..7)
0 0 0 0 0 0 0 0 
##$TUNHIN= 0
##$TUNHOUT= 0
##$TUNXOUT= 0
##$USERA1= <user>
##$USERA2= <user>
##$USERA3= <user>
##$USERA4= <user>
##$USERA5= <user>
##$V9= 5
##$VALIST= <valist>
##$VCLIST= <CCCCCCCCCCCCCCC>
##$VD= 0
##$VDLIST= <DDDDDDDDDDDDDDD>
##$VPLIST= <PPPPPPPPPPPPPPP>
##$VTLIST= <TTTTTTTTTTTTTTT>
##$WBST= 1024
##$WBSW= 4
##$XGAIN= (0..3)
0 0 0 0 
##$XL= 0
##$YL= 0
##$YMAX_a= 232659
##$YMIN_a= -337074
##$ZGOPTNS= <>
##$ZL1= 120
##$ZL2= 120
##$ZL3= 120
##$ZL4= 120
##$ABSF1= 10
##$ABSF2= 0
##$ABSG= 5
##$ABSL= 3
##$ALPHA= 0
##$AQORDER= 0
##$ASSFAC= 0
##$ASSFACI= 0
##$ASSFACX= 0
##$ASSWID= 0
##$AUNMP= <proc_1d>
##$AZFE= 0.1
##$AZFW= 0.1
##$BCFW= 1
##$BC_mod= 2
##$BYTORDP= 1
##$COROFFS= 0
##$CY= 11.3945322036743
##$DATMOD= 1
##$DC= 2
##$DFILT= <>
##$DTYPP= 0
##$F1P= 2.36226072786647
##$F2P= -0.459571619588291
##$FCOR= 0.5
##$FTSIZE= 0
##$FT_mod= 4
##$GAMMA= 1
##$GB= 0.15
##$INTBC= 1
##$INTSCL= 1
##$ISEN= 128
##$LB= 0.24
##$LEV0= 0
##$LPBIN= 0
##$MAXI= 10000
##$MC2= 0
##$MEAN= 0
##$ME_mod= 0
##$MI= 1.114404
##$NCOEF= 0
##$NC_proc= 0
##$NLEV= 6
##$NOISF1= 3.799351
##$NOISF2= 2.8
##$NSP= 1
##$NTH_PI= 0
##$NZP= 0
##$OFFSET= 15.70392
##$PC= 1
##$PHC0= -15505.48
##$PHC1= 4.400813
##$PH_mod= 1
##$PKNL= yes
##$PPARMOD= 0
##$PSCAL= 0
##$PSIGN= 0
##$REVERSE= no
##$SF= 200.130013532006
##$SI= 16384
##$SIGF1= 3
##$SIGF2= 2
##$SINO= 400
##$SIOLD= 16384
##$SREGLST= <1H.CDCl3>
##$SSB= 0
##$STSI= 0
##$STSR= 0
##$SW_p= 3612.71676300578
##$SYMM= 0
##$S_DEV= 0
##$TDeff= 0
##$TDoff= 0
##$TI= <>
##$TILT= no
##$TM1= 0
##$TM2= 0
##$TOPLEV= 0
##$USERP1= <user>
##$USERP2= <user>
##$USERP3= <user>
##$USERP4= <user>
##$USERP5= <user>
##$WDW= 1
##$XDIM= 8192
##$YMAX_p= 0
##$YMIN_p= 0
$$ End of Bruker specific parameters
$$ ---------------------------------
##NTUPLES= NMR FID
##VAR_NAME=  TIME,          FID/REAL,        FID/IMAG
##SYMBOL=    X,             R,               I
##VAR_TYPE=  INDEPENDENT,   DEPENDENT,       DEPENDENT
##VAR_FORM=  AFFN,          ASDF,            ASDF
##VAR_DIM=   8192,          8192,            8192
##UNITS=     SECONDS,       ARBITRARY UNITS, ARBITRARY UNITS
##FACTOR=    0.0002768,     1,               1
##FIRST=     0,             0,               0
##LAST=      2.2672688,     0,               0
##MIN=       0,             -337074,         0
##MAX=       2.2672688,     232659,          0
$$ Real data points
##PAGE= N=1
##DATA TABLE= (X++(R..R)), XYDATA
0@%%%%%%%%%%%Qj6J6k4L2m0M8n6P2q6J02j20J36j60J92k24K57k95L40l91M45n04
33b68N73o49P32q24R25j035J156j290J435j591J765j954K159k385K631k901L197
50A676l521L877m273M713n203N752o375P088p907Q864j0000J1373j3074J5246
64H236j8127K2153k8223L8533o0550J90520k10497j76478M67092j61643l07281
75b36265K14204J79232k49733J880J80442l4909j30695L4588P7372J7378q5238
86c1744j2217Q2584k8800r8978O9348K3715r9809N4705J06637q9394j5355J04505
98F5197n2116o3626R6946j4149j01811O7640Q3202p1685l8380N3522J7037m3354
110a577k7795L8222K6824o7382j054J11240l5581j20572Q3549Q6356j13427k6812
$$ plain form
0 0 0 0 0 0 0 0 0 0 0 0 0 8 -8 8 -16 16 -24 24 -32 40 -46 56 -64 72 -88 104 -120 137 -158 182 -209 236 -268
33 -268 305 -344 388 -436 489 -546 610 -680 755 -836 929 -1025 1134 -1251 1380 -1521 1676
50 1676 -1845 2032 -2241 2472 -2731 3021 -3354 3734 -4173 4691 -5309 6064 -7010 8236
64 8236 -9891 12262 -15961 22572 -37978 152542 -57955 -234433 232659 71016 -236265
75 -236265 -22061 157171 -92562 -90682 89760 54851 -75844 -41256 36116 53494 -31744
86 -31744 -43961 38623 9823 -89155 -19807 3908 -95901 -41196 65441 -23953 -39308 65197
98 65197 13081 -50545 46401 32252 -69559 -1919 81283 9598 -28782 24740 41777 -1577
110 -1577 -29372 8850 35674 -31708 -32762 78478 42897 -77675 5874 92230 -21197 -48009
122d8009J02039k9492n7833M6095m904m6787O913q99J6132L9630m1823o171R6438
135G1329k7465r6013O2447L1942j00087K1424P2585p1027k4301P6144k3112l5189
147d1323N0348l182j8310N4852k169m9183K2520R381l9264M110P767j4410K0486
160A623R511p526L0176j2214m1894N1726K3738q2160J1171P3181n5041m2356O5925
173B5860j1938o1842L7174L1276l7298o956J7086P113M989k8232q033M7753j5551
186A401m2785N7479J7889p5920K9128O1693p2923k7410P5949k1239m4215N9493
198A8540R859m7815L5170K7708m0298K403K0440k1611k65N032k0997N151L353
211c330j8892K3901J3416l5943K6188M5042m9191j6191N6409l0125n1607M6917
$$ plain form
122 -48009 54030 24538 -33295 12800 7896 -38891 -31978 -32877 -16745 22885 -18938 -25109 71329
135 71329 43864 -52149 10298 42240 -57847 -36423 36162 -34865 -59166 16978 -6134 -41323
147 -41323 9025 5843 -12467 42385 40216 -8967 13553 22934 -16330 -12220 -4453 -18863 1623
160 1623 11134 3608 33784 21570 -20324 31402 55140 -27020 -15849 57332 2291 -40065 25860
173 25860 13922 -47920 -10746 20530 -16768 -23724 -6638 475 5464 -22768 -30801 16952 1401
186 1401 -41384 16095 33984 -41936 -12808 48885 -24038 -51448 24501 3262 -40953 18540
198 18540 28399 -19416 15754 43462 3164 5567 26007 4396 4131 9163 -11834 -6683 -3330
211 -3330 -22222 1679 15095 -20848 5340 50382 1191 -15000 41409 11284 -40323 6594
223F594R356n8455J8069M0825k6594j1447K3546M596q81o129n135K1991r678l6181
237b9523L0211K0201n8063N267O0096l5743l2333N8885R65m6463L2638K3018l9377
250a0221O785K7150j8521l111J3129j0018K035L131j3531J1228K982k6963J8792
263B867K1632m2480L830N1140l4415l2257N6834k175o0279K8133L3004n0687j2526
276c7379L9663p296k2558J1574J6275O187j1957n628L2668k0m4752K1534L7116
289C5427n2871j7100O0279j9465m5973N0113J8975m8487J9913L5541l3720n478
301b846K7815j7285j2246J2164j0016k979P162j5053R072J8359k6519K710L7275
314B7613k7719k2511M7161p576m7184L4244K2563m9850N236L7741k7468j6140
$$ plain form
223 6594 15950 -42505 -24436 16389 -10205 -21652 1894 6490 5609 -520 -5655 16336 6658 -29523
237 -29523 688 20889 -37174 -31907 28189 -7554 -39887 18998 19963 -26500 6138 29156 -10221
250 -10221 -3436 23714 5193 2082 15211 5193 7228 10359 -3172 8056 11038 -15925 2867
263 2867 24499 -17981 -14151 36989 2574 -29683 27151 24976 -35303 -7170 25834 -24853 -37379
276 -37379 2284 -5012 -27570 -15996 279 6466 -5491 -11119 21549 21529 -23223 -1689 35427
289 35427 -17444 -34544 25735 6270 -39703 10410 29385 -19102 811 36352 2632 -2846
301 -2846 24969 7684 -4562 7602 -2414 -5393 1769 -13284 -4212 14147 -12372 -9662 27613
314 27613 -106 -22617 24544 16968 -30216 4028 26591 -23259 -18023 19718 -7750 -23890
326b3890K8525m334j4816J1542p3p14P636j1565M381J8337k0166p126K8472j5208
340A001k3128L0633Q3l1151K4538J5932l0167J3603K5092k5958M28K6422k0065
353G263j0576K0962j4126j2625J6763j1412j0221K0423r727j2766K7648n463k3812
366a7669K7104N744l5032J4832J8949l2119l36K4957j7921o403K0166q978j448
379h154J7126j2959K18K3600j8492j1595L2289j3090k9904L1981O740l8775J8412
392b603K4892l2646L75K9503j8528j0181K2534o788j0308J2119n849m270Q967
405G217j3724j284J8106j9353q360L2673j3873k6676L7526O407m2323K3180K9155
418B8671m1279l457L8498k3236k2938K8327r41k1186J1774O477o583O330k666
$$ plain form
326 -23890 4635 301 -14515 -2973 -3046 -3760 3876 -7689 -3308 15029 -5137 -12263 16209 1001
340 1001 -22127 8506 8589 -22562 1976 17908 -12259 1344 26436 478 906 27328 7263
353 7263 -3313 17649 3523 -9102 7661 -3751 -13972 6451 -3276 -16042 11606 6143 -17669
366 -17669 9435 15179 -19853 -5021 13928 -18191 -18527 6430 -11491 -17894 2272 -6706 -8154
379 -8154 8972 -3987 -3769 19831 1339 -10256 22033 8943 -20961 11020 17760 -21015 -2603
392 -2603 22289 -10357 -9982 19521 993 -9188 13346 6558 -3750 8369 2520 -1750 7217
405 7217 -6507 -7791 10315 -9038 -17398 15275 1402 -25274 12252 18659 -23664 -484 28671
418 28671 -12608 -16065 22433 -803 -23741 4586 3645 -17541 -5767 710 -5873 457 -2209
431b209J102J3406j3457p123K5418j1054k5319K7551P025l5167J5586K5141l0419
444i519j042L1805j6168j4650K4776l715j6332J2592j506j0331Q221o978o845
457i692J4501j0112j1457K3634l878k3217K5174R160l2144J3995K3439l1355j718
470a3670L0694k0526j4509K7240p333j7974K0560L37j4797J6444K040j3929J5395
483I972J71j8841J5401N446k5188J1749J5683k4828J691K2776j9160p561K3838
496A1149q850j1589J9285k736j2731J2938l053j2897J2237k170j4393J6298K517
509F005j9057J4107R949k3313Q136J8317k1163j322K4136j5813j2953K0571o252
522A348j7095J4390K855j1433R789L557o729P385k495o463J3652m433j3959K0286
$$ plain form
431 -2209 -1107 12299 -1158 -8281 17137 6083 -19236 8315 15340 -19827 -4241 20900 -9519
444 -9519 -10561 21244 5076 -9574 15202 11487 -4845 7747 6241 -4090 4131 -2847 -9692
457 -9692 4809 -5303 -16760 6874 2996 -20221 4953 14113 -18031 -4036 19403 -11952 -13670
470 -13670 17024 -3502 -18011 9229 1896 -16078 4482 4819 -9978 6466 8506 -5423 9972
483 9972 10143 -8698 6703 12149 -13039 -1290 14393 -10435 -8744 14032 -5128 -12689 11149
496 11149 2299 -9290 9995 7259 -5472 7466 4413 -8484 3753 1583 -12810 3488 6005
509 6005 -13052 1055 11004 -12309 -4173 14144 -7019 -8341 15795 -18 -12971 7600 1348
522 1348 -15747 -1357 1498 -9935 -146 3411 -3318 4067 1572 -4891 8761 4328 -9631 10655
536A0655L134k6320J4123J6321l0284P99L0009k0660j3516L2031n079k5082J9507
549E638P248k3295O190J1439j2456J633O030p731L266R48r418R292M776j4286
563a0726J1726J3898k1436R60K1448j8695j1665K4891o546j7846K0525L339k0730
576a0857J1483Q309j7441P252J0361j3404N601J0703j6030N92J2731j5816l943
589a0459J7790r184p680J8089m710j2825J3578k33j1908J0703K461j0187J0845
602F280P77j5537J0008N787j9691O965J5826j7294m73K0580j3786j0553J9855
615H744o123j5526J6201L471j5114R286N355j3708M582P070j0767L691R021p513
629a330K158P488r323L69Q397j0606q33J1738q544m638J3199p761j0094J3911
$$ plain form
536 10655 13789 -12531 1592 17913 -12371 -11572 18437 -2223 -15739 16292 11213 -13869 5638
549 5638 12886 -10409 -4219 7220 -5236 -3603 2427 -5304 -2038 -1090 -10508 -1216 3560 -10726
563 -10726 1000 14898 -6538 -5578 15870 -2825 -14490 10401 3855 -13991 6534 9873 -10857
576 -10857 626 8935 -8506 -1254 9107 -4297 1304 12007 -4023 -3431 9300 -6516 -10459
589 -10459 7331 -1853 -9533 8556 3846 -8979 4599 4366 -7542 3161 5622 -4565 6280
602 6280 7057 -8480 1528 7315 -12376 -5411 10415 -6879 -7352 13228 -558 -11111 8744
615 8744 2621 -12905 3296 6767 -8347 939 6294 -7414 -2832 4238 -6529 -2838 6183 -1330
629 -1330 828 8316 -1007 -638 7759 -2847 -3680 8058 -486 -5124 8075 314 -9780 4131
643D131j838j3112J2478N071j3175P125O752j3281K601Q344j0440N07R383p308
657b762l32Q641q216r40J0292q297l259J4037o486q847J4352k804j4286J1500
671B593L657j5463P886Q904j3475K781J0395j1884J45J1159j0816j855J4188r571
685a356o827J5857n753j2288J4907O47j5050J1896P078j4989N286R951j2739O59
699b721R994r225j210R924q290k566J0216q292m815J3161o315r358J4773r23j3712
714i359J0887N211j3800N497Q190j1222K042Q940r173n07R202p947j890J0131
728F202o106m303J0234m670o688J0014k646q697R157R35j0606P922M172j1529
742f609N091P772j0787J457R480q612j854R774o223l681R256l641n327Q692k357
$$ plain form
643 4131 2293 -10819 1659 6730 -6445 680 7432 -5849 -3248 5096 -5344 -4837 4546 -2762
657 -2762 -3094 5547 -2669 -3609 6683 -1614 -4873 9164 2678 -6169 8183 5379 -8907 2593
671 2593 6250 -9213 -1327 7577 -5898 -3117 7278 -4606 -4461 6698 -4118 -5973 8215 -1356
685 -1356 -8183 7674 1921 -10367 4540 5187 -9863 2033 9111 -5878 -592 9359 -3380 -2721
699 -2721 7273 -1952 -3162 6762 -1528 -4094 6122 -2170 -6985 6176 -139 -9497 5276 4353 -9359
714 -9359 1528 6739 -7061 -1564 6626 -4596 -2554 6386 -2787 -3294 5908 -2039 -3929 6202
728 6202 96 -4207 6027 1357 -5331 4683 2037 -6660 2497 3432 -7174 748 4920 -6609
742 -6609 -1518 6254 -4533 -3076 6404 -2208 -4062 5712 -511 -4192 5064 1423 -3904 4788 2431
757B431o215P884j097p372P728M58q872O160L119r735M598N230r505K828P014
772D654r223K1R470q586j918J0261o671m100J0949m676p087J1931k058j0073J1721
787D615K566j3936P887P929j3785K061J1343r706k523J0141o049m195Q277m962
801c37l607R131n889n672J2069l676j0762J1965K099j4214Q071Q016j2723J742
815c787J0001r074r09Q920p236j740R414o917l371J0942n477p549J0821j570j0315
830g847Q931K821j0439O203N194r212L112O380p772Q50O515n910N11N966o782
845a479q0P432q290j387J1804p443o567J4603k913j3988J1269N241j5713M325
859c186J0841j1091j865R162n593l817O101m044j141P211m870j717Q573m893n762
$$ plain form
757 2431 -3784 4100 3003 -4369 3359 3817 -5055 1105 4224 -5511 -913 4317 -5188 -2360 4654
772 4654 -4569 -4548 4922 -3664 -5582 4679 -1992 -6092 4857 181 -6906 5025 2967 -7106 4615
787 4615 7181 -6755 1132 9061 -4724 -2663 8680 -1026 -3549 6592 543 -3652 4625 -337
801 -337 -3944 5187 -702 -6374 5695 2019 -8743 3222 5321 -8893 -822 7194 -5529 -3787
815 -3787 6214 -2860 -3769 5151 -2085 -3825 5589 -1328 -4699 6243 766 -6783 4038 2468 -7847
830 -7847 1084 3905 -6534 -331 4863 -4349 -1237 5143 -2629 -1779 4736 -1174 -663 5303 -1479
845 -1479 -1559 5873 -2417 -3804 8000 557 -6010 8593 5680 -8308 2961 8202 -7511 -3186
859 -3186 7655 -3436 -5301 3861 -1732 -5549 552 -3492 -4633 2578 -2292 -4009 4564 -329 -6091
874f091Q640j227p483P640K223p188N195K409p352M431L186q214M536O804q418
889i09R68Q240q474l863Q989n165n477Q882j608o194P141o25p705O457J764p356
905d935N613L842p073L071L343q651K125M821p876K298Q792p781j591J0919p060
920a43p099J1499j811r531R490K861j0220M681M373r172K334N405o544K889O908
935E920o646L74P615p299k757Q195m557m417R436k400o825O814p35q479O598K234
951C071p924N299N061q013J162M987p496j073O013m975j092O806m287k321O348
966A566l730m043Q195j265m645P743J117p221M764J729q105L312M550o553K447
981a39N682n910KO216o244j796P628m184l480P672k590o863N537n76o791M281
$$ plain form
874 -6091 2549 1322 -6161 1479 3702 -3486 1709 4118 -3234 1197 4383 -3831 705 7509 -909
889 -909 59 8299 -175 -4038 4951 -214 -5691 3191 1583 -4611 2530 1905 -5800 657 2421 -4935
905 -4935 678 4520 -2553 518 3861 -4790 -2665 2156 -5720 -3422 5370 -2411 -4002 6917 -143
920 -143 -7242 4257 2446 -7085 2405 5266 -4954 -273 4100 -5072 -2738 2667 -3877 -988 5920
935 5920 -726 -352 7263 -36 -2793 5402 845 -3572 5864 3464 -3361 3453 2718 -5761 837 3071
951 3071 -4853 446 5507 -2506 -1344 3643 -3853 -4926 1087 -3888 -4980 1826 -2461 -4782 1566
966 1566 -2164 -6207 1988 723 -3922 3821 4938 -2283 2481 4210 -3895 -583 3967 -2586 -139
981 -139 5543 -367 -365 5851 -393 -2189 5439 1255 -2225 5447 2857 -4006 1531 955 -5836 -1555
997a555K248m584M203J658n032M143J455p117L895N097q281J385Q590p865m634
1012f394R107l047p123P878J796o021N181K076n749L141K145o376K949M190o324
1027b571J243N875n246j803N376k955j259M962j840j148N412l500l776O016k912
1042A874o326O256R67p781M350L331p065J906M344o597J653O770n645j827P165
1057C375m045n168N743m59n259L713K412j867J955p43p94N408k119m824P068J981
1073F377r309M220O642r586j963Q587l953n006O275m57l202M131j128l393M527
1088B762j342m898N312M62o890L118L888o356r0M789l362M7M805l885mN573m028
1105i9k514N443k866m247N714q23m908L669J124l886L982P52m740N465L106p348
$$ plain form
997 -1555 693 -3891 312 1970 -3062 1081 2536 -4581 -686 4411 -3870 -2485 6105 -1760 -6394
1012 -6394 2713 -334 -7457 421 2217 -3804 1377 3453 -2296 845 2990 -3386 -437 3753 -2571
1027 -2571 -1328 4547 -699 -2502 2874 -81 -1340 3622 1782 634 6046 2546 -1230 4786 1874
1042 1874 -4452 1804 2771 -5010 -660 2671 -4394 -2488 1856 -4741 -3088 3682 -1963 -3790 3375
1057 3375 -670 -5838 -95 -554 -5813 -2100 312 -1555 400 -343 -1137 4271 2152 -2672 4396 6377
1073 6377 -2932 1288 7930 -1656 -3619 4968 1015 -3991 2284 1827 -1375 2756 1628 -1765 2762
1088 2762 1420 -3478 1834 2296 -4594 -1476 2412 -3944 -4034 755 -2607 -2560 2245 -1640 -1644 3929 -99
1105 -99 -2613 2830 -36 -4283 1431 608 -4300 -631 493 -3393 589 1341 -3399 2066 5172 -2176
1121b176K616O045p111j659P432m475m792O494O4m346L651K7l219M952m85m791
1137a773M548R32o712K901L729p744q4N658m416j706M281k469p85N075k497k385
1153c447N718j908l537N312q89n506M592J676n174K217K803l341K807K728m741
1168f90K123M710n321m90N204m408l172N476k204m668M067l39l065L999r46l475
1184c199N413J68n666M408K114p224K357M884o984q27O343l889k498O231k350
1199g19l003O080p96m377M735R44n453L361J553n373J566L296m502J308L466m112
1215b026J530M561m032j17N144l235k340N300k656m539N096n54n069L242J618
1230A923m419K094K894m105J766K355l813R54K185m405K04L247m210r87M428k982
$$ plain form
1121 -2176 440 6485 -626 -2285 5147 672 -4120 2374 2438 -1908 1743 1770 -1449 3503 3018 -1773
1137 -1773 2775 3707 -3005 -104 3625 -4119 -4203 1455 -2961 -4667 -386 -2855 -3640 1435 -1062 -3447
1153 -3447 2271 363 -3174 2138 1249 -4257 335 2011 -3163 -946 1857 -1484 1323 4051 -690
1168 -690 1433 6143 822 332 5536 1128 -2044 3432 1228 -3440 627 288 -2777 1222 276 -3199
1184 -3199 2214 2382 -3284 1124 3238 -3986 -1629 3255 -3729 -4556 1787 -2102 -4600 1631 -719
1199 -719 -3722 2358 1562 -2815 1920 2864 -2589 772 2325 -3048 -1482 1814 -2688 -1380 2086 -2026
1215 -2026 -496 4065 33 -84 5060 1825 -515 4785 2129 -2410 2686 2132 -2937 305 1923
1230 1923 -2496 -402 2492 -1613 153 2508 -1305 -351 1834 -2571 -2367 880 -3330 -4317 111 -2871
1246b871j914N440j474k823N203K22l655M288N41n006L445J761n812K191M412
1261C948n807M07N459l167k313N165j150k727L559r86k654K196j143k661K611
1276G37j053l596L265J028m059L199J929m192K704L330n411Q60M958n077j963
1291c341N395l101l613M802J73l861K978J514k306K826J34k755L321K22m710L096
1307G74K269o179J204N648m956j553N140j044k290L462n94j007K699j627k005
1322e9L320k492m266N071K02p163M214M071o396O39N918m389k077N630j922l398
1338c097L326m92k437J907q91j672K414Kr52L234p20k105M327M68m402L037K560
1355D507n562J111M806n224k570N832k059m027M139Q44k416K475Q7k317J758m60
$$ plain form
1246 -2871 -4785 655 -819 -3642 1561 1783 -1872 2416 2957 -2049 1396 3157 -2655 -464 3948
1261 3948 -1859 -1452 4007 840 -1473 3692 2542 -185 3374 2388 -266 1930 787 -1874 737
1276 737 -316 -3912 -647 381 -3678 -479 1450 -2742 -38 3292 -2119 -1259 3699 -1378 -3341
1291 -3341 2054 -1047 -4660 142 315 -3546 -568 946 -1360 1466 1600 -1155 2166 2388 -2322 774
1307 774 3043 -3136 -1932 3716 -1240 -2793 2347 1303 -987 2475 1881 874 3573 1946 -59
1322 -59 3261 769 -3497 1574 1776 -5387 -1173 2898 -3498 -2859 3059 -1330 -3407 2223 301 -3097
1338 -3097 229 -263 -2700 -793 -1684 -3356 -942 -940 -1892 1342 622 -1483 2844 3312 -1090 1947 4507
1355 4507 -1055 56 4862 -362 -2932 2900 841 -3186 953 1797 -619 1856 1943 -374 1384 924
1371I24k665K448J69m351K628J947m197J27L446k277k14L902j690m91K556j857
1387D05j061K052k834j654M573j679l125L911K92l920K988J816l656K130L468
1402C706l259L45K726l812o68L132k892j657L652p44j258K895j160k155L065q3
1418A833l068L525N0l934K475J038n668R11L506l884k63M447k146j125L909j562
1434D4k326K776n63j796L070k00l272K684N57l771K015J843k464J908L133l117
1450E21P08K834l259j034K920k660j508L395j298k566K631r71k391K820M45k504
1466a917K943J304k985J241J072l912P66K411l438M94K889k000j036L504k153
1481h17j579L739m65k332L684l77l293K255O06m535J104L034k886K25L654j904
$$ plain form
1371 924 -1741 707 876 -3475 -847 1100 -3097 -2970 476 -1801 -2015 1887 197 -294 2262 405
1387 405 -656 1396 -1438 -3092 1481 -198 -3323 588 880 -3040 -52 1764 -1892 238 3706
1402 3706 447 792 3518 -294 -962 2170 -722 -2379 1273 529 -729 2166 1006 -1149 1916 1833
1418 1833 -1235 2290 2340 -1594 881 1919 -3749 -2838 668 -3216 -3479 968 -1178 -2303 1606 44
1434 44 -2282 494 -69 -1865 1205 1005 -2267 417 974 -2797 -782 1061 -1403 505 3638 521
1450 521 1229 4063 804 -230 2690 30 -1478 1917 619 -1947 684 -287 -2678 142 587 -1917
1466 -1917 1026 2330 -655 586 1658 -2254 -1488 923 -2515 -2021 868 -1132 -2168 1336 -817
1481 -817 -2396 1343 878 -1454 2230 1853 -1440 815 1421 -3114 -2010 1024 -1862 -1637 2017 113
1497A13o99K552j352o98K004j145n9J732j659j394K124j688k242K929K76k621
1513a827K915J128k887J093J438l247P08K072l155J67K353k566r84K516j646j170
1529c092L317j39j643L103r1k320K183J11k438J590R12k879K035J161l163J386
1545C3K249l469K66M215k281j913M325j585l613K894K6l698J800J061k144R74
1561h60J438k163J148J107k129J397K135k804jK931k885j608L064j425k096K781
1577C0N29k405K323N87j909J471O17j768J526L34k624J864R37l775J368K540l131
1594a486m19M533j955k272M259m43k908J875P10k405Q25M22j782J109m3k066J634
1611d12J153k999J831K415l283K6L329k507j824L229j176k463K361J45k198J829
$$ plain form
1497 113 -586 1966 614 -84 1920 775 716 2448 789 -605 1519 -169 -2411 518 794 -1827
1513 -1827 1088 2216 -671 422 1860 -1387 -679 1393 -1762 -1595 758 -1808 -2792 -276 -1922 -3092
1529 -3092 225 86 -1557 1546 1455 -865 1318 1429 -1009 581 1493 -1386 649 1810 -1353 33
1545 33 2282 -1187 -921 3294 1013 -900 3425 1840 -1773 1121 1147 -2551 -751 310 -1834 -860
1561 -860 578 -1585 -437 670 -1459 -62 2073 -731 -732 2199 -686 -2294 770 -655 -2751 30
1577 30 559 -1846 477 1064 -845 626 1243 -525 1001 1335 -1289 575 1512 -2263 -895 1645 -1486
1594 -1486 -1905 2628 673 -1599 2660 2217 -691 1184 1894 -511 314 736 -1046 63 20 -2046 -412
1611 -412 741 -2258 -427 1988 -1295 -1269 2060 -447 -2271 958 -218 -2681 -320 -175 -2373 -544
1627e44R59j557J339J033j671J682P75k136J333R83k876P16K045k913k96K942
1643A814k320j186L382j320j848K748J20k477J520P58k779R78J225k302P71J156
1659B40k179J158J879k428R34K515k403m70L342k236j838L261j051l104K662P71
1675A053l575K004J747k440N72K067j409j56J430j179n0J163k079K31J690k265
1691a196j51K986j682j892L590M5l107K357J468k930M71J996k365q1P79j235j41
1708a088Q82j200O15J178j683L77K377k001n87K783j323k208K609J95l104J861
1724c17J635k787J063J954j748J53J723j332N1J406j413m46J761k015q59K357
1740A186j563j815K774j30k515K182J005k468J308J443j871l2J352j587K95O93
$$ plain form
1627 -544 415 -1142 197 1230 -441 1241 2016 -120 1213 2196 -680 36 2081 -832 -1128 1814
1643 1814 -506 -1692 1690 370 -1478 1270 1390 -1087 433 1191 -1588 -610 615 -1687 -916 240
1659 240 -1939 -781 1098 -1330 -396 2119 -284 -754 2588 352 -1486 1775 724 -2380 282 1053
1675 1053 -2522 -518 1229 -1211 -639 1428 19 -137 1293 114 64 1227 -852 -621 1069 -1196
1691 -1196 -1347 1639 -43 -1935 1655 1700 -1407 950 2418 -512 -41 1955 -410 -491 288 -947 -1088
1708 -1088 -206 -1406 -791 387 -1296 -919 1458 -543 -1130 1653 330 -1878 731 926 -2178 -317
1724 -317 1318 -1469 -406 1548 -200 -47 1676 344 395 1801 388 -58 1703 -312 -1171 1186
1740 1186 -377 -2192 582 452 -2063 119 1124 -1344 -36 1407 -464 -496 856 -731 -436 257
1756B57j211M22Q35j312M48K017j900m59K869j123j940K509n3k941J420J399k683
1773a446L79J809j407m01J503n98k38Q90m49L54P84j356K24J342k101m56K591
1790A424j262j886K931l5k732K058J651k912N78K286k092q15J703j022j055R90
1806a90m55o22J264r48Q5J609q14r55K128k76k164K037Q28k390Q36J036j606K43
1824c54J238j400L57J121j197K16J496j525n59K185j718j274K254o55j906J795
1840G4N61k745J723J415k042O0K157j155n32J665o66n99L50m26K87K40j074M35
1858b72J380j537n23K277o62k037K650K14k864J160J883k633n28K242j462o20
1874a332J648m72n95J081l29j26O03k09n45J463q17j037J649m32j906J559N56
$$ plain form
1756 257 -954 -532 303 -1009 -561 1456 -444 -903 1966 843 -1097 1412 1359 -1582 -162 1237 -1446
1773 -1446 -1067 742 -665 -1066 437 -161 -399 491 42 396 1180 -176 48 1390 -711 -1167 1424
1790 1424 162 -1724 1207 1172 -1560 498 2149 -763 -185 2101 9 -806 897 -125 -1180 -190
1806 -190 -645 -1267 -3 -951 -866 743 -71 -1026 1102 826 -1338 699 1527 -863 -27 1009 -597 -354
1824 -354 884 -516 -159 962 -235 -19 1477 -48 -607 1578 -140 -1414 840 185 -1721 74
1840 74 635 -2110 -387 1028 -1014 -954 1203 48 -484 1181 515 -84 266 -160 127 367 -707 -272
1858 -272 1108 -429 -952 1325 663 -1374 1276 1490 -1374 -214 1669 -964 -1492 750 -712 -1332
1874 -1332 316 -156 -751 330 1 -125 478 269 -276 1187 370 -667 982 550 -1356 203 759
1891G59k026J026K018k436l69K188j223p14J388l43j081J038n05n37Q36l81n47
1908i09J458j97j549J908N01k075J086J302j861J20J468j433n96J428q86o01J078
1925B42m06k57J128q00o32J124l81q96J426l69j344J488L68k049Q55J579j530
1942d54n05K319j376m92J575m22r87J142p3q11R06m54r52J220n21j095J224P8
1960C22j765J436R60k016O08J349j626m71J685o42j102J390K74j318Q29N64j053
1977e76Q19L4l07P93l31o68R95J18j634J002P14j907N79J428j599m84J990q45
1995A21j366J850Rj067N80M77j075N00K76r21P81J78j175J324P1j338J187P09
2013A121j951L57J816j844l69J856m63j902J619K67j525N79P07r15M37N16m92
$$ plain form
1891 759 -1267 -241 1777 -659 -1028 1160 -63 -777 611 268 -813 225 -280 -817 19 -362 -909
1908 -909 549 352 -1197 711 1212 -863 223 1525 -336 -216 1252 -181 -777 651 -235 -836 242
1925 242 -164 -421 707 -93 -725 399 18 -878 548 179 -1165 323 691 -1358 -503 1076 -454
1942 -454 -959 1360 -16 -508 1067 645 -342 800 727 -84 822 368 -584 636 115 -980 244 322
1960 322 -1443 -7 953 -1063 -455 894 -732 -1203 482 -160 -1262 128 402 -916 -87 477 -576
1977 -576 243 277 -30 763 432 -236 759 877 -757 245 959 -948 -369 1059 -540 -1024 966 121
1995 121 -1245 605 614 -453 127 604 -471 29 305 -616 165 343 -832 492 563 -775 412 1121
2013 1121 -830 -473 1343 -501 -870 986 523 -1379 240 507 -1018 -439 268 -647 -210 306 -186
2030a86M16j17n55N46K40p23K39J112j302J80J501j339o26J730m46j211J234M94
2048A187j758O39Q44j104n0K49j79o0q3m78Q95J57j595J056J403k387J66K269
2066A171j108j595K098J93j944J219Q75j144j87J035o89J07M52m71O5M99j003
2083d27K40Q28r82J79J151j528r4J535j005j038J695M01j950O79J429j476n48
2100i11J342n1o43J38J41M32m76p48J116L18j783L87J645j499r11K092J05j916
2118a222R74P83j179L03P05n01j07N90n77M27N01j107O15O30j051M47R21r28k34
2137a0J239q24r25J480m49j438J192M71j670J47J354j128l11R48m18k11L59j62
2155c56N8M12j068L16J375j166n01J491p6j379J030N81j275N31O97o63K73L80
$$ plain form
2030 -186 230 113 -442 104 344 -379 -140 972 -330 -150 1351 12 -614 1116 670 -541 693 1187
2048 1187 -571 68 912 -192 -242 7 -172 -232 -315 -793 102 259 -1336 -280 1123 -1264 -1098 1171
2066 1171 63 -1532 566 759 -1185 34 909 -235 -422 613 -76 31 483 12 77 576 -427
2083 -427 -187 641 -341 -162 989 -539 -633 902 -103 -1141 554 955 -995 -316 1113 -363 -911
2100 -911 431 380 -263 -125 16 448 -28 -776 340 658 -1125 -738 907 -592 -1503 589 694 -1222
2118 -1222 -248 535 -644 -341 364 -137 -244 346 -231 196 697 -410 205 835 -216 231 1152 224 -10
2137 -10 1229 405 -520 960 511 -927 265 736 -934 -787 567 -561 -872 76 -342 -553 -194 -356
2155 -356 -298 114 -954 -638 737 -429 -930 561 485 -894 136 717 -558 -27 670 7 280 660
2173F60r19N91L33j176J24R62q11j28R33p31m42J012l63k88Q35k61q48R30P0j245
2193g62O05P88j203l7J354q86l27P85k37j98L70o38K11O17p62o67J589o23j235
2212a256J163O08j421L97P91p80R8O29k15l59P42k54n8N67j31m62M51k69m19O45
2232D67r9n76P44k23p28R56L1q81L75M13p31J3N11j039L9N17k26l24P49k14q5
2253c11N00k16m48M90r7k43O88n16m47Q67K20j291Q02P42j026J95J128r19m83
2272c65R56k66q14O89J13p78O73j04m99M19J75m73N12J13n86O55J68o20L51N6
2292C75p78k22P81o22j84Q64l6j083P04L52p69M53P0Q2N03p42m06N84Q5q79M48
2313d20Q28r53L40J102n75n82R14M00j161N19K91q1k44m11L37j78o46k25J060
$$ plain form
2173 660 -259 332 665 -511 -387 575 -236 -364 569 -162 -604 408 45 -243 592 331 -517 413 483 -762
2193 -762 -157 631 -572 -609 745 -141 -468 317 80 -118 252 -386 -175 442 -320 -987 602 -21 -1256
2212 -1256 -93 515 -906 -509 282 -498 -400 229 14 -345 397 143 85 652 521 59 510 241 -178 467
2232 467 368 -208 536 313 -415 541 572 -309 66 479 -252 -239 272 -767 -728 -211 -437 -761 -12 -226 -311
2253 -311 189 -27 -475 15 -82 -325 363 -153 -600 267 487 -804 -2 740 -286 -91 1037 118 -365
2272 -365 591 325 -489 200 313 -465 208 104 -395 24 199 -274 238 351 -235 420 588 -32 319 375
2292 375 -403 -625 156 -466 -650 214 178 -905 -201 151 -618 -165 -95 -13 490 -252 -658 -74 11 -868 -420
2313 -420 408 -545 -205 897 322 -260 654 1054 -107 412 703 622 378 -33 304 126 -520 -745 315
2332C15Q7r38Q20L79j159J96R71r99n52J229m13r90Q51k1o07K49N81m35K97l9
2352a78L48L32j96l39M49k71q06R55O09j420N6J022r86p7R30k83l58Q73O9k77
2372D52l4k32k32L87m07m04Q69j12p21P32L58j178K36R13m34m03P94j80o19L26
2392A11m88k25j0J34k38L03j8N7O84k17k09R5J71n52Q62J57j038K34J124j288
2412c51j73R04n3m63P61L83p34L47N6k90J59l31l67N18q0r20N16M1n60O1P27m65
2434c14m25J073k50k42K20k04k89K71r1k3j18K52k32J39M29k18K87L4P1K42J23
2455G35n30J19M5n40j62O95p06k42Q38l86j65N24J68k17m3K57k78K07k6n37O58
2476D14m12n28M44J92k45l18R07n57q8O47k41o70L51J31o82P65k76m62k6M08l31
$$ plain form
2332 315 402 -536 284 663 -496 -300 671 -328 -880 349 -64 -1054 -203 -224 -831 -582 -1 -436 -139 -178
2352 -178 170 502 306 -33 416 145 -661 294 903 -517 -461 561 -425 -502 428 145 -213 660 729 452
2372 452 418 186 -46 341 -66 -470 399 287 -434 298 656 -522 -286 627 193 -210 584 404 -215 111
2392 111 -377 -602 -612 -478 -716 -413 -431 -374 310 93 -116 -21 150 -402 460 617 -421 -187 937 -351
2412 -351 -524 380 327 -136 625 1008 274 621 677 387 546 215 -152 366 286 -634 -118 -77 -637 -576 151 -314
2434 -314 -739 334 84 -158 62 -142 -431 -160 -251 -274 -392 -140 -372 -233 196 -22 265 299 370 612 735
2455 735 205 324 369 -171 -333 362 -344 -586 252 -134 -299 225 393 176 133 390 112 319 293 -244 414
2476 414 2 -526 -82 110 -135 -453 454 -103 -191 456 215 -455 -104 27 -655 110 -166 -628 -654 -246 -577
2497e77J37L77l40L02L91l21R4M66k47k71N51m86k04N35k50l79M01q8J45p3M67
2518F30n09L48Q1n91L0j46j24P8N6o12K49M36n72j8N85o4q5N59l3n49M00K83o75
2541b43J68J70n44K88J46r5j12P11m77J42M97l69k85N77m43o8R6l34l94M09K63
2562A03o72M96J24j6o5L78k12K61Q8n95Q9K82m55q9M08l09k31J70K85k53k6M61
2584B22m28L19J65k59M0n8k01L54r7m37K33j02j78L38M98k14m4L51J19r3q1M7
2606D94k08p7J68l42L06k97l59L94n8l53N73J48o87K78N08o14k85M12k99l26K63
2627c61O2k38P5L20J67j17K33q7M34l14K5K7J54l54r5L82p66K77M03p8m26M92
2649B15ql16M29L4m00L17m17J49P2J00n60L78M0l82M89O0l83K89M37p05J55N58
$$ plain form
2497 -577 -440 -63 -403 -101 290 -31 63 529 282 11 562 76 -128 407 157 -222 179 91 236 163 630
2518 630 121 469 550 -41 -11 -157 -281 -203 -147 -759 -510 -74 -646 -664 -79 -143 -228 331 298 -251 149 432 -243
2541 -243 -75 95 -449 -161 -15 -110 -222 489 12 154 651 282 -3 574 131 63 159 -175 -569 -160 103
2562 103 -569 -73 51 35 -30 348 136 397 485 -110 -21 261 -194 -283 125 -184 -415 -245 40 -213 -239 222
2584 222 -206 113 278 19 59 1 -200 154 57 -380 -147 -249 -427 -89 409 195 151 502 621 528 447 494
2606 494 286 209 377 35 341 44 -315 79 21 -332 241 389 -298 -20 488 -126 -411 1 -298 -624 -361
2627 -361 -299 -537 -462 -142 25 -92 141 54 488 174 199 226 380 26 -69 313 -453 -176 227 149 -277 215
2649 215 207 -109 320 354 -46 271 -146 3 75 175 -385 -7 33 -349 140 200 -183 106 543 -162 -7 551
2671E51m71j63M41l60l37K76k88Q9k79L29q4M35N6j48j85K20k66j7J80k6l97N82
2693A38k05j56N88k16k03M48K1K9K89k27l8k90p4j55m5J53l85L06P5m30R7N36
2715B56p45M51K77l64M9J39k18M0K04k03j66K84J34m63M68q4pJ45K57k63j06J48
2737B33k00j48N80o11k52N57l19l65O19Nl54M99L7l33J81K96l92m4M15m68R9j25
2759i0r3K53k53k06M26L64l17J30J70k72K1J74j94l22N3j39k07K67q8j72M18J07
2781C0n6qJ78n5L6L52m11P1J8Kj54k19K20k68M64J87l57J13J01l9K54k16l77N7
2805g7L70o73k41N59k63j32Q5K23j0J00J9j81L65J01l09L09q3j94l6R4k12J68
2827a8j24J24k5K77O3K6Q7k11m28M79k18j12J35J1k04q1j85K83k65M66j10l9M25
$$ plain form
2671 551 80 -83 358 -2 -339 -63 -351 -262 -541 -212 -296 139 195 47 -138 82 -184 -201 -21 -47 -444 138
2693 138 -67 -223 365 149 -54 394 415 444 733 506 468 178 104 -51 -96 57 -328 -22 53 -377 -280 256
2715 256 -489 -38 239 -125 -76 63 -155 -115 89 -114 -280 4 138 -325 143 59 52 197 454 191 85 233
2737 233 33 -115 465 -146 -398 159 -160 -525 94 99 -255 244 281 -52 129 425 33 -11 404 -64 35 -90
2759 -90 -183 70 -183 -389 37 401 84 214 384 112 133 307 113 -209 -156 -295 -502 -235 -323 -495 -77 30
2781 30 -26 -34 144 89 125 477 66 137 155 157 3 -216 4 -264 200 387 30 143 244 205 459 243 -134 -77
2805 -77 293 -380 -621 -62 -325 -457 -372 -149 -159 -59 -40 -221 144 245 -64 245 162 -32 -68 26 -186 -18
2827 -18 -142 -18 -43 234 297 323 410 199 -229 250 32 -80 55 66 -138 -219 -404 -121 -386 80 -30 -69 356
2850C56j97Q3J07j93k79M43n01j02K54k15N9J62k41L57J48k56kJ13m6l42J61M6
2872h5j9j38J32j14J7L86l62K54j90j9L74j74L34j74K28k60k1l38J09Q6j83J92
2894C5l96K79J44m47O37lk96L0L21m45J55m7k79J3J80n8k3J56m6j18K48K33o2
2917B11j29K10m13j7M27Ol91pm9K0l9Q3R1J42J61k14K1J1l04J52L20m43J58k4
2941a7j36m4K19q2k83K61O7L58j38q3J38K10m76m1J47l25J03N7j68j77K98K02
2963I0k72J96N1p3l95M65r8k6J9m9N8Mp5J32J51m19K64L52j23M1m5M2m36L06k
2988A58k46q0J90k31R4p9J23J77r7RJ10Kj30p3K90j72k60K41Q4j21L4j98J99k2
3012BJ26j60j5q8K89o8kj58K14n1k68J7Q5k35N1K05L5j22J06P2O5k58L42k52N5
$$ plain form
2850 356 159 242 349 156 -123 320 -181 -283 -29 -244 -185 -23 -264 93 241 -15 -17 96 50 -292 -131 -85
2872 -85 -104 -242 -110 -224 -207 179 -183 71 -119 -138 236 62 396 222 450 190 169 -169 -60 26 -157 35
2894 35 -361 -82 62 -385 252 249 -47 -17 304 -141 14 -33 -312 -299 -119 -177 -200 -44 -90 -208 40 273 211
2917 211 82 292 -121 -138 289 295 -96 -103 -152 -132 -171 -88 3 145 306 92 113 124 -180 -28 292 -151 7 -17
2941 -17 -153 -197 22 -60 -343 -82 -15 343 205 122 260 470 -6 -47 100 -225 -122 -65 -233 -410 -112 90
2963 90 -182 14 65 -8 -403 62 -36 -62 -43 -92 -34 -30 -105 27 178 -241 23 375 252 293 248 290 -146 160 158
2988 158 -88 -168 22 -209 -115 -194 -71 106 9 18 128 130 0 -73 217 45 -215 26 110 -11 23 -175 24 2
3012 2 128 -32 -47 -135 154 86 84 -74 140 89 -179 -162 -77 -312 -261 -56 -21 -143 -37 35 100 -158 184 -68 -13
3037a3J02l1Q7k7j26L0k01J35l9M67k95J66p8j54p3J04j56k25P3L88n38J27kL4
3061b45J79k97M27k6Q1j53K13J38m75L08r6j24k05J24J62q7K35Q8m0j85N4kL96
3084D70l87j1j07L4n6k13J94n8J89k17O5P5K6KJ42j25R9m5K9NR4j54k43J94M9
3109E1P6Q8k97J75p9j4L34l87j15L39M5k46N8P2m80L30j18J3L24k85J79K24k00
3132H7j96L36o4l07K58K58l35M0J88k18L8k19qK20n3j24J39K62j67k91q0K67j11
3155h0j46J87j54M5N6O4M7J03j22j7M28k09j86J5q5p1K38L4k48J11m5J24p6j54
3179a41J31n3J76j31J14J45k95K78n27K32j33Q3J59nL2jj48M40k19k36J40J29
3201A70k56J36L4j8j35QQ6Ok64J00QR1j63P7K26l67LJ86q6PJ03K13j71ql3P7L3
$$ plain form
3037 -13 89 58 145 118 -8 22 -179 -44 -83 384 89 255 177 23 -50 54 -102 -327 -254 134 -404 -277 -279 -245
3061 -245 -66 -363 64 38 119 -34 179 317 -158 150 54 -70 -275 -151 11 -76 159 247 207 22 76 74 470
3084 470 83 72 -35 -1 -57 -270 -76 -134 55 -162 -97 -22 4 6 148 23 122 77 106 111 205 51 -192 2 51
3109 51 127 215 -82 93 14 0 334 -53 -168 171 216 -30 28 100 -380 -50 -168 -155 169 -116 63 287 87
3132 87 -109 227 163 -144 114 372 37 77 265 47 85 -134 -142 78 25 -99 40 302 135 -156 -236 31 -80
3155 -80 -226 -39 -193 -148 -92 -28 19 122 0 -17 411 202 16 31 -54 -125 113 147 -101 10 -35 89 13 -141
3179 -141 -10 -63 113 -18 96 241 -54 224 -303 -71 -204 -121 38 33 65 64 -84 356 137 -99 41 170
3201 170 -86 50 84 66 -69 -61 25 31 -233 -133 -125 -34 -197 -120 106 -261 -258 -72 -158 -151 -48 165 -6 -14 -47 30 63
3228F3K85k09j12P0O0j97o5K34j60j85P2l7J62M6k32J90o7Q0J50j73oM1K48l39
3252h1j32J28j77K04J81j14j8o0J09l36L77l70M82L2J09l86K35k43J40j45p9r
3274a53M3K40m07P0N2J68k26J64m1J02j86L09l19K34j18K92j92j45J97M0r9N5
3296H0Q8j77J14j64R0Q5k30L19l00Q3j52J9k5p9K84k05r7K67j32K45m5O1j32K9
3320B6J6o8J31j80R1J89l5R6k5m6p0j50K79j83J64j79j69K00j58J34k01J31q3
3343i0p0Ll9L13q1k64K52K07j61lj9J4l22N04j07l58J07L8R9k71K08p1L8mj02
3368a79J64J58l16M09k37j8pK5J1j69M30l69J16J2L20k69k42J25J77J0l5J60l27
3391e1K55k0k40K16q6j21P0p7l96N30k5l76J85J77j85j26K39J33Q9k48J14j24
$$ plain form
3228 63 348 139 27 97 157 -40 -105 129 -31 -216 -144 -181 -19 27 -205 -15 -82 -2 148 -25 -31 10 258 -81
3252 -81 -213 -85 -262 -58 123 9 -9 -69 40 -296 81 -289 193 225 334 -52 183 -60 80 -65 -144 -153
3274 -153 -110 130 -277 -207 -155 13 -213 -49 -90 12 -174 135 -184 50 -68 224 32 -113 84 124 25 80
3296 80 168 -9 105 -59 31 116 -114 205 -95 -12 -164 -145 -170 -249 35 -170 -267 0 -132 113 68 129 -3 26
3320 26 42 -26 105 -75 16 205 170 266 241 195 125 -25 254 71 235 56 -113 87 -71 63 -138 -7 -90
3343 -90 -160 -157 -196 117 36 -228 24 231 70 67 48 62 -260 244 137 -221 -114 -76 23 -248 -40 -111 -73 -77 -179
3368 -179 -15 143 -173 236 -1 -19 -26 -1 10 -159 271 -98 18 30 350 81 -161 -36 141 151 116 276 -51
3391 -51 204 184 -56 160 74 -47 23 -54 -450 80 55 -321 -136 41 -144 -270 -31 102 191 -57 57 -67
3413f7M13m80K78l28L10k13M27j72k9j70K63q8j62mK16k34M6j09k08L29n3j28
3435a63J83J21l36J56OM3l4k4J65k66P6j8P5k10L00j92R7N8p3R5p2J90r9Lk00
3460a19R4j7q5j68J3j1J53PJ23O7j08j89L70k09K34L5Rj00m9jj10P2o2j34J31
3485e4J41K01l58N2J07M9K4k66J66l4j96l5p9J41o1K1K96n1k09K00Q6j59LJ07
3509I2o6J8R3K01l51P7q1j00Q7j69K36j03O0J72j88r2nQ9KR6j11J03j77M8l5Q8
3535a6L0o6J70J2j8j75O9J03j4Lr4J27n7J21l09KO5n7P2LjJ82j63j08K00j13J7
3562a5l51K84j26J64r5L9J38ol8Q3N5k4lj27P8nJ17k44J77k97J32J47J1j79l05
3587c90L93J16m0k81M7K1j99J71J53j43M1j87L43K16k88K47j28J90k04L2p3O9
$$ plain form
3413 -67 346 -134 144 -184 126 -87 340 168 139 -31 232 144 -18 -22 194 -40 6 -103 -311 18 -35 -163
3435 -163 20 141 -195 -39 -33 10 -24 -48 117 -149 -73 -91 -16 -226 74 -118 -21 37 -36 59 -13 177 78 81 -119
3460 -119 -25 -42 -127 -295 -282 -293 -140 -133 -10 57 -51 -240 130 -79 155 190 199 99 50 49 -61 11 -51 -185 -54
3485 -54 87 288 -70 -18 89 138 162 -104 62 28 -168 -203 -282 -141 -202 -181 115 64 -145 55 141 -18 -15 92
3509 92 26 44 137 338 -13 64 -17 -117 -30 -199 37 -66 -6 166 -22 -114 -119 -30 -28 68 -43 60 -117 -69 -104 -16
3535 -16 14 -52 118 130 112 -63 6 109 95 98 4 131 74 195 -114 -112 -47 -104 -32 -29 -30 152 -11 -119 81 -32 -15
3562 -15 -366 -82 -208 -44 -139 -100 38 32 -6 77 132 108 105 -22 56 51 168 -76 101 -196 -64 83 94 -85 -390
3587 -390 3 119 79 -202 -155 -134 -333 -162 -9 -152 -111 -298 45 261 -27 220 92 282 78 110 37 106
3609A06Nk67J74l7J22k44Q1K38k8r4J09R1m51J12K21k32q0q8K35J12n4Q1j05n7
3633e0M9M0P0j22j4N77m99R2j48O2l4J48p5k57q4K15k41J01K31N0k24nJ77q3j19
3658a43K02r9J65J6K2k24K4l2K6L24l38R9L14j01j36K7k3n6k67L60k16r6O6K85
3682A99l15l0J91j16J17L9r6p2J49n7j46jK2J67l9N9o1J09j8k17K21j4Q2n6p7
3707D0K34l17N2l8k68K02K21k81Q3J38K00m27K69J35l65L7J15J27r6rk10M0J08
3730a0O6L9J39l57J26M1n9Kq9J11J59j36j50J92q6j15k7r7K66j8o0%J35K6o2j42
3756a06L34k41j69K00J31j9k76K30P0k39P6N5mJ64j60R6r3J67l35J14k2k02J36
3779i3P3j27o1l1K21k12J21Q1r9J17L0m0J48r9j41J27M2k5jj0J82k18j78K38j
$$ plain form
3609 106 111 -156 18 -19 103 -141 -60 178 150 56 165 256 -195 -83 138 -94 -174 -262 -27 85 31 112 7 -50
3633 -50 -1 39 109 -13 -27 550 51 143 -5 57 23 171 96 -161 -245 -30 -271 -170 61 111 -113 -118 59 -24 -143
3658 -143 59 -40 125 141 163 -61 -37 -69 -43 281 -57 42 356 255 119 146 123 67 -200 160 -56 -152 -86 199
3682 199 -116 -146 45 -71 46 85 -11 -83 66 9 -137 -138 -116 51 12 71 10 119 101 -116 105 91 173 117 40
3707 40 274 -43 9 -29 -297 -95 126 -155 -72 66 266 -161 108 243 -122 -85 30 157 61 52 -158 -118 -10
3730 -10 56 95 234 -123 3 44 -15 -13 -102 9 168 32 -118 74 -12 -127 -154 -251 15 -3 -63 -63 72 98 36 -106
3756 -106 228 -13 -182 18 149 130 -146 84 154 -85 -9 46 42 206 46 142 49 216 -119 -5 -27 -229 -93
3779 -93 -20 -147 -208 -239 -18 -230 -109 -28 -127 -10 20 -20 128 29 -112 15 57 32 31 21 203 -15 -193 45 44
3804D4J50l80J75j31J00j7P5j90J44q1RJ74Np2l8K55j46J59j33J75k39j18J67
3827H7j25M6J76j84O3k73J8J23K58k51m8L26k77q4K12R5j53l05L31K4l20M69k33
3850b5j98M19o5K4k12P7rm6p0K28j00j33K50l34J07J93k36j52L14P5j81J92j56
3873c8L3k31J17J48m4j54j7K13Om4Q1l6k08L17j62MR5J9m0j5M2j98NL8j05J90
3899A6Q3Nl0j75L15j58j3J07k47k3K52m6n35K87K69k39Q8Q8lK8J4k87L71m41J45
3924a29J5QJ70N8l53Q8l7K14ol4K17j63r3o6K88K5r2l52K70K2Q2j81P7n8m5J14
3950C9j74M64o4k67K05k69M5K45m13J06J99j84k8L8J00j2J8J15k34K18k44n1J44
3973dl39L74J2L5j26J49l45K05O2J05j78j2K64j69m8j67J78k05L49j7n01J87l4
$$ plain form
3804 44 194 -186 -11 -142 -42 -59 16 -174 -30 -111 -102 72 77 5 -33 222 76 235 102 277 38 -80 87
3827 87 -38 8 184 0 63 -210 -192 -69 189 -62 -110 216 -61 -145 67 162 9 -296 35 59 -261 208 -25
3850 -25 -223 196 131 155 -57 20 11 -35 -105 123 23 -110 140 -194 -87 106 -130 -282 32 107 -74 118 -38
3873 -38 -5 -236 -119 29 -15 -169 -186 27 33 -11 70 34 -174 143 -19 -15 80 99 59 44 86 -112 -107 -69 -174 16
3899 16 99 104 74 -101 214 56 43 150 -97 -120 132 86 -449 -162 107 -132 -44 44 41 69 83 -204 167 -274 -129
3924 -129 -114 -106 64 122 -231 -143 -180 34 28 -6 211 48 -45 -111 177 202 110 -242 28 50 132 -49 28 -30 -75 39
3950 39 -135 329 265 -2 203 -66 -21 224 -189 -83 116 -68 -96 -58 42 30 48 163 -71 147 -97 -148 -4
3973 -4 -343 31 43 78 -48 101 -244 -39 23 128 -50 -62 202 33 -15 -182 -4 -209 140 123 -378 -191 -225
3996b25p5L73R2l18p0J25K50j81J49r5J26k55J60J28m47K18J96j84o2O3p1K48
4018A45k40J73Q0l38J94j29K0J48j88j6N4k03L86j02Nj95R1M24k16n9n7K52m14
4041a85J72L09l6j25l05O3R1K01k65J5K42j18J38j24K8r7k6k9rl32J69k09L56
4064g6L7q8J86j39P7K82j85N2P4k58P0q9O3j25K89j16o1K53m82L24j76J39j02
4087e1L8K26k73j90J67J00l01O9K48o5j5Q1K2M2P7l18qL53j33j22Q2O6M5j20o3
4112d3J64j99O6j5q8K56l83J82J60Q9j66P5lj47L1j00K1K25q1K8j16j08K05J3
4136F6o8O4p2M3K06l37o6K44j28K02k13m4L46m69K37Q2K8j35J1J25j89K8j26J81
4160A6N7J0m76M13K6j85K05Jj65L86j69j83p6K32J66k78j04J94k49j83J62k1J36
$$ plain form
3996 -225 -300 73 165 -153 -223 -98 152 -29 120 25 151 -104 56 184 -263 -45 151 -33 -95 -32 -103 145
4018 145 -95 78 158 -180 14 -115 -95 53 -135 -151 -97 -300 86 -16 -11 -206 -115 309 93 34 -23 229 -185
4041 -185 -13 296 260 135 -170 -107 -16 185 -80 -65 177 59 197 73 101 4 -22 -51 -60 -392 -223 -432 -76
4064 -76 -39 -127 59 -80 -3 279 94 146 220 -38 32 -57 6 -119 170 54 -7 246 -236 88 -88 51 -51
4087 -51 -13 213 -60 -250 -83 17 -284 -215 33 -32 -47 34 56 98 175 -143 -151 202 69 -53 29 95 140 20 -43
4112 -43 121 -78 -12 -27 -115 141 -242 -60 100 189 23 98 95 -52 -21 -121 -100 125 44 72 -44 -152 53 66
4136 66 -2 62 -10 33 239 -98 -164 80 -48 154 -59 -103 243 -226 11 93 121 -14 -3 122 -67 -39 -165 16
4160 16 73 83 -393 20 46 -139 66 67 -98 288 119 -64 -140 92 258 -20 -124 70 -179 -362 -200 -221 -85
4183h5K76j89k3j1o2J37nJ98j18j56p8Q4j21K00n7M3M1j67J09Q6L0j59K9J36j98
4208f0r4k5J10K8m1J3J91j19l9j57K81k68J67j41j27J69K15k53M1J74k16J30q
4231b9P0m8m5J52n0l7M0r4mj68K11j05L02j34j33j33J86M5j29R3K45m6j72K09
4255B26k96q0K41q9j81KL48kj81J41o9j78M10j79j47Q1o7M0k7j94N36l53N5p5
4279c8knj03J63N4j21K12j54L3k00K47k45J35Q5o2j12L77k85j49L35Rm7n8J95
4303B64k63k03J34j0k0n5j32K12m4j38K15j5m9K68j20j19K57n4J4l35L95j0k46
4326e4J09J02k83L5k2J55Q6k61J13k43R2J41J23l85M49l61K90j42M9L6M9l4q7
4349d3L6K35l14o5K4L53l57K72j50j67K48k51K04Rk01L37O2k92R2j12j70K84l
$$ plain form
4183 -85 191 2 -21 -32 -94 43 38 236 118 -38 -116 -32 -153 47 -10 33 74 -93 16 102 132 -27 2 138 -60
4208 -60 -154 -179 -69 -41 -82 -69 122 3 -36 -193 88 -180 -13 -154 -281 -112 103 -150 -109 65 -151 -21 -29
4231 -29 41 -7 -52 100 50 13 53 -41 -45 -213 -2 -107 195 61 -72 -205 -19 26 -103 -10 235 189 17 226
4255 226 -70 -150 91 2 -179 -177 171 169 -12 129 60 -118 292 113 -34 47 -20 20 -7 -201 335 -18 37 -38
4279 -38 -40 -45 -148 15 69 -52 160 6 39 -161 86 -159 -24 61 -1 -113 264 -21 -170 165 174 127 69 264
4303 264 1 -202 -68 -78 -98 -153 -285 -73 -117 -255 -40 -55 -104 164 44 -75 182 128 142 -193 202 192 -54
4326 -54 55 157 -126 -91 -113 42 128 -133 -20 -263 -171 -30 93 -292 157 -204 86 -56 -7 29 78 44 -43
4349 -43 -7 228 -86 -151 -127 226 -131 141 -9 -176 72 -179 25 34 -167 170 232 -60 32 -80 -250 34 31
4372C1K8j40N5o9J24k72K90k58J54N9j4k55K31N8k6J50k04K77j00j4k68J66o1
4395e8N1L40j19k59m0N6j73J00j09P6M8j96M8K81j32Ml6P3j04L03n2p2J27q0j68
4420i1J11k19K89k17K00N4k35M14n28J57mJ53N4oj26R4m6q4k4J05j00J74l9o3
4444B3j07J66Q6o0K93m36J79j4R8q4k36K30k06l5J67j17n5K97k43P4k09K97j51
4467d3K9j05J36n1Q9k08P5K7N0j40N8L00l50K8o9K16mr5K40k67J23N4j14j93k8
4492b42J40J65L6k73K27N5j18q3K13j24M5k42J10j58K29M0n9K5N5n5J85k45K6
4515d8r8l7M36m53K45j82J34r5J53R7n84M07J13l1K2k02O4r4L40m2l90J09L04
4538A68k69O3K43j02n5L3j45J09q3M2j48K6O6J31k40P8j41K92J76k61R1Pl7l06
$$ plain form
4372 31 59 -81 -26 -95 29 -243 47 -211 -57 2 -12 -267 -36 22 -4 146 -58 219 119 105 -163 3 -58
4395 -58 -7 333 214 -45 -85 -29 -202 -102 -211 -135 -87 -283 -235 46 -86 -82 -118 -45 -149 154 102 30 157 77 -91
4420 -91 20 -199 90 -127 73 127 -108 306 -222 -65 -69 84 138 132 6 100 54 -30 -54 51 -49 125 86 23
4444 23 -84 82 168 108 401 -35 144 130 228 144 -92 138 -68 -103 64 -53 -108 189 -54 20 -189 108 -43
4467 -43 -14 -119 17 -34 55 -153 -78 -51 -1 -141 -83 217 -133 -105 -174 42 38 -57 183 -84 39 93 -21 -214 -242
4492 -242 -102 63 99 -174 53 108 -10 -93 120 -4 41 -201 -91 -249 -20 20 -39 -14 41 -14 171 -74 -48
4515 -48 -146 -183 253 -200 45 -137 -3 -98 55 152 -432 -25 88 57 79 -123 -59 -153 187 145 -245 -136 168
4538 168 -101 -38 205 103 48 81 -64 45 -38 4 -144 -118 -52 79 -161 -83 -224 68 244 -17 74 81 44 -262
4562b62O7J99J47j23J69k98J79L0j91K01m0o2OR8k18j53K71j6J39M8j41j42J4
4585g8J27K0Q2l19L75l28j9L84l31J15o8Q5J2O3k76j45K39J64m0k19J56J4j8P7
4609G2J3k4p9L7J64j31k5J49k99K59p0q8p3k8j08L11j91R3n6K5JR0N2k49r3L82
4635A34m9k88J14Nl4L33k86J10M9j96O0j12J28j82J64j69L3k0N5oJ73J52l68K62
4659F2k57N9K12n2n9J0K39m69K30K21k39K19RK6k80j02j0L69j99J00j51j30J54
4682c8j03J14J90l40L22l58M6Q2l4m6rJ81J64j60J3j05J1J16j56J17L4M9j40Q8
4706C8O5q4j05Q9J9o8k8L19j96j98Q8j79K56R8k28J08O8j10q5J06J2K4j03K46
4730A52M6j23k05Q2J37l25J59K42j59o0P7M8m1J12r6K0J06k23R2q8J68l3j69K61
$$ plain form
4562 -262 -195 4 151 28 197 -101 78 108 -83 118 78 16 22 120 -98 -251 20 4 143 191 50 -92 -78
4585 -78 49 69 151 -168 207 -121 -140 244 -87 28 -40 45 57 120 -156 -301 -62 102 62 -157 -1 13 -5 72
4609 72 85 61 -18 19 183 52 27 176 -123 136 66 -22 -95 -123 -231 80 -111 -18 -74 -49 -48 42 94 -155 -248 134
4635 134 85 -203 -89 -84 -118 215 -71 39 88 -108 -48 -160 -32 -214 -50 -219 -186 -206 -151 -157 16 168 -200 62
4659 62 -195 -136 76 24 -35 -25 214 -255 -25 196 -43 176 185 211 -69 -171 -181 188 -11 89 -62 -192 -38
4682 -38 -141 -27 163 -177 145 -213 -167 -85 -119 -165 -174 7 171 11 24 -81 -70 46 -110 7 41 90 -50 38
4706 38 103 19 -86 3 22 -46 -74 245 49 -149 -61 -240 16 114 -114 -6 62 -48 -133 -27 -15 9 -94 152
4730 152 198 75 -130 -48 89 -236 -77 165 6 -54 23 71 30 142 46 66 172 -51 41 -47 121 88 -81 180
4754A80k40J8J03O9k25P9J06j19Q7m9O0j67J22k04L81Mm15J14L8m2m4R7M8LJ33
4779A37l37l3M35j90n6J11j11j3P7K0j07PON7J11j82M6L9j0K5k9J16m03M02p2
4804D6N4j96K97j29j98J6j55R5J72k35L26k10J34j4L7J0R8p9Qo3m7J50j96k5J67
4829F3L07k93J18k98K28l23K06j49J90K2k67J44J98j54m4k05J71J44j01Q4Rk61
4851b11K08o1L34k7k88R5J87Kl07O0j86K16N4O4J07l75J45j04J69k13J67r8om1
4875a09O7M9j38M1P0K24k07Q0k3K3J66j57J37j31m5oK01k15m4J47k27Q8m3j39
4899a91K70j49J95j54J60l9q4j51Q9J2K8m4K47J48n01M40m40J60j7J84r7K7k16
4922a23J04J70j62j5k9k10L81j11j76K54Lr2j9J66j36k56K60J18r7Q3m31K70q5
$$ plain form
4754 180 -60 -42 61 130 -95 -16 90 -29 58 9 69 -98 24 -180 201 205 -210 -96 -58 -100 -144 -47 1 4 137
4779 137 -200 -233 202 12 -44 67 -44 -57 20 40 -67 -60 -54 3 114 -68 -22 17 7 32 3 119 -284 118 46
4804 46 100 -96 201 72 -126 -110 -265 -170 2 -233 93 -117 17 3 40 50 148 69 77 14 -33 117 -79 -104 63
4829 63 370 77 195 -103 125 -198 8 -141 49 71 -196 -52 146 -8 -52 -257 -86 58 -43 41 50 -211
4851 -211 -3 -64 270 243 -45 50 237 239 -68 -8 -194 22 76 140 247 -128 17 -87 82 -131 36 -62 -68 -109
4875 -109 -42 7 -131 -90 -20 204 -3 77 54 77 243 86 223 92 47 41 242 27 -17 130 -97 -9 -52 -191
4899 -191 79 -70 125 -29 131 92 8 -143 -54 -42 -14 -58 189 337 -164 276 -164 -4 -21 163 66 93 -123
4922 -123 -19 151 -11 -26 -55 -265 116 5 -171 83 86 -6 -25 141 5 -251 9 127 30 113 -318 -48 -133
4945a33Q9J32O4j37N6K38j54j21K12j51J04j77R5k13J38K7l04K18m8J2J9j88N2
4968a70K00Pk27K45J0n4J43j89J32K34l37p5%J37on0j97K84j05p4n2K21l8J11
4992A50n8o4M0l7j71R1J44j24R9j4m24J99L03j60o4J97k2N6j38qj39J69m1P2Q0
5017A36k92J64L2P0J19j07m70L09K55n6k60mK27j12q8L13k56l9Q6J48l62J81J1
5040EJ09j11j1K20J06j49l38K72K06l95K19p8N3j05O3k30K19J82l57J40j04J17
5062C3k0J83k96K62P5j77k06L87m36R1L56j44j76J10j70M1m6J64j21M9O1N5k57
5085a82R8L30k58K20j73J31l46q6J98q3K49k02L97j66k44J20J27k16J93O1l91
5106b23M77k18N6q1J55J2j75J35j00o1J39P7j81k9N9k3J48j68n4p7J83o4j87K76
$$ plain form
4945 -133 -44 88 152 15 71 309 155 34 246 95 199 22 117 -96 42 69 -235 -17 -65 -53 -34 -222 -170
4968 -170 30 37 -190 55 65 11 154 -35 97 331 -6 -81 -81 56 50 0 -197 87 -18 -92 -144 77 39 150
4992 150 92 28 68 31 -140 -49 95 -29 70 56 -368 -169 134 -26 -90 107 85 141 3 -5 -144 25 -16 56 136
5017 136 -156 8 40 110 229 122 -348 -39 216 160 -100 -104 123 11 -77 236 -20 -59 27 175 -187 -6 5
5040 5 114 3 -8 212 318 169 -169 103 309 -86 133 55 108 3 66 -164 55 237 -120 20 -84 33
5062 33 13 196 -100 162 237 60 -146 241 -195 -104 252 108 -68 42 -128 -87 -133 31 -90 -41 20 75 -182
5085 -182 -84 246 -12 208 35 166 -180 -266 -68 -151 98 -104 293 127 -117 3 130 -86 107 168 -223
5106 -223 254 36 92 11 166 178 3 138 38 -23 116 193 12 -17 42 19 167 -1 -55 -132 51 -13 -200 76
5130G6j73J02J10n7j76J73j81J87o3k2K0QPK9Q6J12k51O8K66k04p1k62J11m6L85
5155B34l56J8L2r0J09J13j01J92j37j26J44K2K52m80R2P0N8k0k9o9J03m9r6M8
5179f6O8J06k08j15L1K9J77j34Q5N9J26l14N9j28J14J33p3L67n41L34j11j12K74
5202A60j84L7o2P4n3K50k83M7L3j33N8o3K81j14j96N7M0k75K59L6K85l47J6l6
5226a13J19j38J20J20j85P3M3P7k8r8Q8J96n8j85J39j1j44P7J18j05j01N0j47
5249i3k6k4n1K9J11L6J85j86J97J36k38j86k0j60L63M6j62J53Q4p6k24P8K17j98
5273iJ06k73J58l2j07o5L42k05q6K10J86l67P4R9j23P7jJ68k97K72k13j70L80
5296A24j66M9L42m03L30k13L3n9pR3m42K95L14l62k1K18o8j96M3J26J4k69K90
$$ plain form
5130 76 -97 5 115 58 -118 55 -126 61 -2 -24 -4 4 11 40 126 238 -13 55 321 117 46 -216 -105 -151 234
5155 234 -122 -104 -72 -162 -53 60 -41 151 14 -112 32 54 306 -174 -82 -12 46 26 -3 -72 31 -18 -114 -66
5179 -66 2 108 -100 -215 -184 -155 22 -112 -27 32 158 -156 -97 -225 -111 22 -51 316 -225 109 -2 -114 160
5202 160 -24 13 -49 25 -28 222 -61 -14 19 -114 -56 -119 162 48 -148 -91 -51 -326 -67 -31 254 -93 -77 -113
5226 -113 6 -132 -12 108 -77 -4 39 116 88 -10 78 274 216 31 170 159 15 92 210 105 4 54 -93
5249 -93 -119 -143 -194 -165 -54 -18 167 -19 178 314 76 -110 -130 -290 73 119 -43 110 194 118 -106 -28 189 -9
5273 -9 97 -176 -18 -50 -157 -222 120 -85 -171 39 225 -142 -68 31 -92 -15 -16 152 -145 127 -86 -256 124
5296 124 -42 7 349 -54 276 63 96 37 30 123 -319 -24 290 -72 -93 125 57 -139 -96 30 44 -225 65
5319F5j52k6k8K32j83P1R7J8j48K2O1K22j63j13j18J06O4jk36O0K96j91Nl0J58
5344H8j80R8l04J87m1J90j97M19l76J20j41l6j0K97O7k67P1q2K34l34P7J94n1
5367B3k20K52O3l64M05k06N9M9j59L8K84k73Q4J6k56J90J30Lp6L5j94J45j17j
5391i0K84j47J85k84L3k23K66j93O5j2L63j05k78O2K17n77N09J01k16qP4n1l55
5414c80L78l9P5l6j03k0K27n6k43J31K74m5l93J88Q7k76O5L3J89n7l0M9Nj5O0
5439F8k36J67j27Q4P6k87L20J1l11L61l2m1R5k31m6j50L48k4J53k00L6j5j06M5
5463d2J00j1j40K78j76J09l54L54k2l52K46k87K86J80p9k53J22P9k62J06K77j17
5485D2o8K22N5k74%J15k29P6j10J75M2o1j0o7M3j49K47j20J85J11l12L29j02k75
$$ plain form
5319 65 -87 -113 -141 91 -92 -21 76 94 -54 -32 29 251 88 -25 -143 -37 27 26 -210 -150 146 -45 -40 -70 88
5344 88 -92 6 -298 -111 -152 38 -159 260 -116 4 -137 -173 -183 114 181 -86 -15 -97 137 -197 -120 74 23
5367 23 -197 55 118 -246 159 -47 12 61 -98 -60 224 -49 35 51 -205 -15 115 118 42 77 -117 28 -89 -90
5391 -90 194 47 232 -52 -19 -242 24 -169 -104 -116 247 142 -136 -74 143 -434 75 176 -40 -48 26 -25 -380
5414 -380 -2 -41 34 -2 -105 -125 102 46 -197 -66 208 163 -230 -42 45 -231 -166 -133 56 -1 -31 18 23 8 68
5439 68 -168 -1 -128 -44 32 -255 65 76 -235 126 94 53 148 -83 -129 -279 69 45 198 -2 34 19 -87 -42
5463 -42 58 47 -93 185 9 118 -236 118 96 -256 -10 -297 -11 169 90 -163 -41 38 -224 -118 159 42
5485 42 -26 196 251 -23 -23 92 -137 -61 -171 4 46 -15 -25 -92 -49 -198 49 -71 114 225 -87 242 140 -135
5509a35L2l3J12K01l3l87J41j49L41k02K53k55K80l18N4K16k04K65m88M53k45
5530a01k9J77j48k08L38K4j66P5R8J65j06j53J01k01J31m8m0Q8J3j28n2K42J41
5553B13m09J31p8k6K05j72J27J17j67J14j24J71k0j32K6n8J62q9J57p2Qj86j31
5576b33K24K81m47J05j01K92r6L5P8p0K00k12J33m27J06K76k08J6j15J65j01J26
5598B7j74K31r6L8O2J21l14p5J62m6J25k22R4m8L51j28mj24P1j10K09o2K7k93
5622a78J73J76k25n1J80j78Q3m5K83j32l11M76k72%K52k78l4Q5J6j78L76o5j94
5645d1r3L16j07r7Pp7J00K8mq0K7j12QR7J54k59J17j12K67m3k21J19N5K9j45m
5671g1Q9J49r1k9Lj10N9M5p4J49j32q9K02m6k40K97j76j26J75nJ23j37J4m5K39
$$ plain form
5509 -135 -103 -136 -24 177 144 -243 -102 -251 90 -112 141 -114 166 -152 -98 118 -86 179 -309 144 -101
5530 -101 -130 47 -101 -309 29 53 -113 -38 60 225 119 -34 67 -134 -3 -51 -91 -3 10 -118 -170 72 213
5553 213 -196 -65 -143 -169 36 -136 -9 108 -59 55 -69 102 82 -50 -24 -82 80 -9 148 76 84 -102 -233
5576 -233 -9 272 -175 -70 -171 121 25 60 138 68 268 56 189 -238 -132 144 -64 -48 -163 2 -99 27
5598 27 -147 84 -12 26 88 209 -105 -180 -18 -64 61 -161 -67 -115 236 108 104 -20 51 -59 150 88 115 -178
5622 -178 -5 171 -54 -105 75 -103 -20 -65 218 86 -225 251 -21 -21 231 -47 -81 4 20 -158 218 153 -41
5645 -41 -134 182 75 -22 -15 -92 8 36 32 -48 -21 -133 -125 -28 126 -133 -16 -128 139 96 -125 -6 49 78 -67 -71
5671 -71 18 167 76 47 50 -60 -1 44 -30 119 -13 -102 100 54 -186 111 -65 -191 -16 -21 102 -35 -21 -66 173
5696A73k00J43k99M58l19J74k04N4p4J91k89J55J5k9R1k25L4L49j13j41K8j5J68
5719A25j82J42n41N45j12j61K60p2J96j64p5n9k95L21JP5kk25J49K22j27J18j62
5742b3R3J67O2l91J73j98J89Rl04R3J19j0j83K34M1K0j18Q6j89P1J57j2n9M4j13
5767d2j06nJ79K9p5P9p5m0J39k57R7P5n6J11l04K31l4QQ0R6q9m3o6O6L5k34M3
5794a58L40j66n0j39K20j44L17j26R9j74mK1O5q5n2j30P0J92p0k6j43L0J43K06
5818B36l16r2J56K6j19r7J38K93j1k41p4k5q9L20j30J00j4j80k21M30q5n6J43
5841I2k58QJ05O8N3Q2k75J10K19k65j08K06p6Q4M4K25k27j94M04l45k1J67l2k48
5865a82O1J45Q2q7o7j01K50J09j48o8N2j99L35k01K30l05J63Pp1k02j8K63k5O9
$$ plain form
5696 173 -27 116 -183 275 -44 130 -74 -20 -94 97 -192 -37 -22 -51 40 -185 -151 198 85 -56 -28 -43 125
5719 125 -57 85 -456 89 -23 -184 76 4 200 36 -39 -98 -393 -72 -71 4 2 -223 -74 148 21 139 -23
5742 -23 70 237 299 -92 81 -117 72 81 -223 -130 -11 -21 -204 30 71 91 -27 59 -130 -59 98 86 27 71 -42
5767 -42 -148 -153 26 55 -20 59 -16 -56 83 -174 -77 -2 -58 53 -251 -20 -54 -46 34 130 41 -2 -68 -2 33 -201 -158
5794 -158 182 16 -34 -173 47 -97 220 94 193 19 15 36 101 16 -36 -166 -96 96 26 0 -143 -113 30 236
5818 236 -80 -172 -16 10 -109 -206 -68 225 214 -27 -101 -126 -215 105 -25 75 61 -119 -340 90 5 -51 92
5841 92 -166 -158 -53 15 68 150 -125 -15 204 -61 -169 37 -39 45 89 314 87 -107 297 -48 -69 98 66 -182
5865 -182 -121 24 106 19 -48 -149 101 210 62 -6 46 -153 182 -19 211 -94 69 76 5 -197 -215 48 23 92
5889I2R4o3j25q0rQ7J57k03J18j72J85j43M4j61R6k0L06j30j56J87k5j05j63J70
5913a9k2j86J58J11j04j1J49k35K08l8l8j43l2K01J71k68N0m8p9J88K55k43J74
5936A99k65Q9j67J60p6O3p6K2K42k11P3J26k10n8K87j59m4J27q0jq3k88K63K9
5960c8Jj6m9p6K91m5Q2K6k06J13k41L54j83j27Q9J21j55K0l1j22J53R3J44j22
5984G6j47O6L74m05K7j17K44Pk14o6M7N6R2j43K22l07R6J0n8K28n5J77p8l32L10
6009A10p9O5k19L43j91j55O7J42j03O0l7nN0rKq6J76n4k19J62m0m2O8j04K32M6
6035A80p3l07K63P6k7j30j02K30j90J38K8m1L8j51O7mK02k25o0L4P6J4j10R8j16
6060i2J13j08j56K23k10L26l4K05m16L60m61K60j86J11JK45k00j60NK40k70L32
$$ plain form
5889 92 186 123 -2 -82 -91 -4 153 -50 68 -104 81 -62 -18 -179 -83 -103 203 73 -83 104 79 -26 -189 -19
5913 -19 -41 -227 -69 42 -62 -73 76 -159 49 11 -27 -170 -202 -1 170 -98 -48 -96 -175 13 268 25 199
5936 199 -66 23 -144 16 -60 3 -73 -51 191 -20 53 179 -31 -89 198 39 -5 122 42 41 -42 -330 -67 -38
5960 -38 -37 -53 -102 -178 113 68 150 176 -30 83 -158 196 13 -114 -25 96 -59 -39 -70 -192 -39 54 198 76
5984 76 -71 -5 369 -36 -9 -126 118 125 -89 -155 -108 -52 40 -103 119 -188 -92 -82 -140 88 33 210 132 -200 110
6009 110 31 96 -123 220 29 -126 -59 83 -20 40 3 -2 48 39 41 -45 131 77 -142 20 -20 -62 6 -98 134 180
6035 180 107 -200 63 139 112 -18 -120 110 -80 58 86 45 83 -68 -1 -5 197 -28 -88 -54 22 36 -74 24 -92
6060 -92 21 -87 -243 -20 -230 96 62 267 -149 211 -250 10 -176 -65 -64 181 -19 -179 -174 66 -204 128
6082A28j63n8q5LK33m9M2QQ8l74K66j3k2o5J05N2L2l57R1K69j70N6K0j04M9l3
6108e1J69l5K5M1r7m5j60L26k12N1O4p8q8JJ42M9j30j5M9l3p4J93k7j33k25M08
6134A15Q7j63jj45K93o0k67J56j23o8R5M02n3k37n1j44K03K2j73n7o0J06p9K86
6158H4Ml56M95k91Q3R0k79j79M96k29j60K10k50J25K9J66Qj69K42j86J76p3j07
6181g1j72K59J30l28J08j7K89j41q8j26K51R9j45m9J4J37j36J0K5k5Mp9K49k29
6205c1k7Q0J76m44m8J02M71n34J05K27L3j0O1ol95J42l1q4J50K09l28K75Q4o5
6229A12M8k24jK72k78R7j32J89k6P5j46N1P9j19k33k1L45qjJ70l60R1k17J29j07
6254b15L56j81j8q6J85J14j50J08Jj25k10K45r1K08K30l98P9O5j76J09n2J06p8
$$ plain form
6082 128 -35 -93 -178 -175 58 9 51 59 147 -227 39 26 4 -61 44 96 128 -229 -138 131 -39 17 37 -67 -18 -51
6108 -51 118 83 108 149 52 7 -153 173 -39 12 76 -2 -90 -89 53 102 -28 -43 6 -27 -101 92 65 -68 -293 115
6134 115 202 39 38 -107 186 126 -141 15 -108 -176 -81 321 268 31 -20 -164 39 61 -112 -169 -229 -123 -202 84
6158 84 88 -268 227 -64 19 109 -170 -349 147 -82 -242 -32 -282 -157 -128 38 46 -123 119 -67 109 36 -71
6181 -71 -243 16 146 -182 -74 -91 198 57 -31 -157 94 193 48 -1 13 150 14 24 49 24 28 -51 198 -31
6205 -31 -58 22 198 -246 -294 -192 279 -255 -150 77 110 100 161 155 -240 -98 -129 -213 -63 146 -182 93 177 112
6229 112 160 -64 -65 207 -71 26 -106 83 57 132 -14 37 116 -3 -236 -257 88 80 79 249 -111 -20 -237 -108 -215
6254 -215 141 -40 -58 -144 41 155 5 113 114 -11 -221 24 -67 141 371 -27 52 117 -59 50 -2 104 26
6277B6J38j57p0J42j03k70L04p8J33J12j00jl04J91p7J06k99L51j04J58j22q1
6299a05K79j64k3J58j42Rk9k7K48j83p4J07l6Q2k43R0K34j29m0j00K37o8J49k55
6323b5p1j04K84K1p1J09j75k0J12j18K57j53O4k77J37Q1o8r9P9J75k82P0J24k28
6347a78n1L74n7j70j21J47O5R5P9k20j35K23J4j79K57J89j31k84o1L7K44l3P3
6370A77j27j46J22j47L54J13p5n05K53l49M21J0n4p6J1P7j16J03j33O9J16k12
6392a14o8J69R3L2n27L71J07k29J30j94L42q5J07j25j93J34j13O8j20L34j65j63
6414b09o5o3J58M9R7K46r8l8M9o3l2j24oqO3l8j37oL01M6j25L04l09P0L6j85L84
6441B97l10q1n4K86N4k17Jq1J70n4Q7j21PJ00L4p2J41k70p8R8J3J38j03l8K9N1
$$ plain form
6277 26 164 7 -63 79 -24 -294 10 -68 65 177 77 76 -228 -37 -114 -8 -307 44 -60 98 -24 -105
6299 -105 174 10 -13 145 3 12 -17 -44 204 21 -53 54 18 100 -143 -53 181 52 12 -88 149 81 230 -25
6323 -25 -96 -200 84 105 34 143 -32 -52 60 -58 199 46 110 -167 -30 51 -17 -116 -37 138 -144 -74 50 -178
6347 -178 -229 145 88 -82 -203 -56 9 104 183 -37 -172 51 65 -114 143 332 201 -83 -144 -107 137 104 177
6370 177 50 -96 26 -121 233 346 271 -234 19 -330 91 101 47 -29 -18 59 -57 46 -87 -18 98 -114
6392 -114 -182 -13 80 112 -415 -44 63 -166 -36 -230 112 27 134 9 -184 -50 -163 -95 -215 119 -46 -209
6414 -209 -274 -337 -179 -130 -33 213 115 77 126 63 31 -93 -99 -107 -44 -82 -219 -225 76 122 -3 301 -8 62 98 -87 297
6441 297 -13 -94 -148 138 192 -25 -24 -105 65 11 98 -23 -16 84 118 46 187 -83 -161 -63 -50 88 -15 -53 -24 27
6467B7k09J24j04J30K45k61j1J4J0J02L3j83K20j08j22K78j51K36k28j62O7J27
6489G4k20K93L1k05J32j25p5p6P9K6P4j8N1K5q2n7J2Q8n9l0N2j32Q8N2l56OL89
6516C7J10j06O6j60K43k0k60J79o4J91p8q1K7N5k98P9M7j6P7j49J49Kj40K31r5
6541B6L4j76L89l25K6K15l64M46j99j3Mj77K07k09J05j30J18l4J35lj18p6k31
6564c50J23M47l71L09p2l21L89m06L42K0j07rK02k91O9K20Rn0j81N8J4j26K82
6587B00n2K0j56o9K13j25n0q7L59l31Nm8K89j63O5J11m40L56j21N4N0l1l4L9K8
6612H2J6l04M35k38L4j7j04J94K0j19k3K30j56m4j2J82k49j5p4J55r7K57j25j13
6636h5N8K33m00J85O5m6k8p2J78J53l35K19l47O8K57QJ0n1J38ll04L99Q5p18M06
$$ plain form
6467 27 -182 -58 -162 -32 213 -48 -59 -45 -35 67 100 -83 137 29 -93 185 34 270 42 -120 -53 74
6489 74 -146 147 178 -27 105 -20 -95 -171 -92 -66 8 -10 41 66 -16 -73 -61 27 -32 -62 -10 -142 -54 -2 -358 -352 37
6516 37 147 41 107 -53 190 170 -90 89 25 216 138 57 84 139 -159 -80 -33 -49 28 -121 28 30 -110 121 26
6541 26 60 -116 273 -52 -26 189 -175 271 72 59 63 -114 93 -116 -11 -141 -23 -57 78 75 -43 -119 -350
6564 -350 -227 220 -151 158 86 -235 154 -252 90 110 3 -6 196 -95 -26 194 203 153 -28 30 44 -82 200
6587 200 148 168 12 -57 156 31 -19 -106 253 -78 -73 -121 168 5 70 181 -259 97 -24 30 80 49 15 54 82
6612 82 98 -206 229 -9 25 8 -96 98 118 -1 -24 206 50 6 -6 176 -73 -88 -162 -7 -104 153 28 -85
6636 -85 -27 206 -194 -9 56 10 -18 -90 88 241 -94 125 -222 -154 103 111 121 70 208 205 -99 300 385 -333 73
6661G3j97k0P0J20n7jr8Q9J65k39m1J89n1k62K33k05L16j42n0J19N4j13O6q5P5
6686HJ22j40O6J24r3j9n0j2P0o6j07k3q5J99J05pk7M9J11r2k96K55J7j64P5k24
6712b04L44k40%q4R3j36M7q3M55k08J88j29k05J87m7qJ80j78K05l04J09p8J72
6735G6j12j97L60j82n7K68n5r3J25r8k32o8L47l34J71Q8j80K20O8l2k71K94m8
6758E8p6R6j14Q5J1o9l3j42L09k62K73O9j46j72J8l6L9K35k80j59K07J33j67J69
6782D6j23k0K15l27L46j84J58l25J97p0q6M5P4Kl0K0J31j91K59q2J59j43j34Q1
6806A8M4R5k25l6j92K55O3j27l2j2K18J23k25K0N8j25K03j11j27oK5R4j37J35
6830dJ0Q3O0k75K31j2r0L0M9j50l1P4l5P6l19J11M39l30K25l09L9K57j24N8k37
$$ plain form
6661 73 -124 -144 -74 46 -11 -12 -110 -21 144 -95 -136 53 2 -260 -27 -232 84 -58 -108 11 65 -48 18 -67 8
6686 8 130 -10 56 180 87 68 18 6 76 10 -97 -120 -205 -6 99 92 65 114 225 133 -163 92 109 -55 20 -204
6712 -204 140 -100 -100 -184 -91 -227 -180 -263 192 -16 172 43 -162 25 -22 -30 150 -28 177 -127 -18 -96 76
6735 76 -36 -233 127 -55 -112 156 101 8 133 35 -197 -265 82 -252 -81 7 -173 47 115 83 -188 106 58
6758 58 -18 78 -36 49 60 -9 -42 -184 125 -137 136 205 59 -113 -95 -131 -92 143 -137 -296 -89 44 -123 46
6782 46 -77 -97 118 -209 137 -47 111 -214 -17 -87 -173 -128 -54 -52 -82 -62 69 -122 137 55 214 71 -63 18
6806 18 62 157 -68 -104 -296 -41 22 -105 -137 -149 69 192 -33 -13 45 -80 123 12 -115 -121 -96 -2 -139 -4
6830 -4 6 89 149 -126 105 93 3 33 82 -68 -99 -25 -60 16 -303 -192 247 -83 142 -167 -128 129 5 63 -174
6855a74K36K2k25jJ30l0K22j11j70OK71q3p8p9j51K04L28l93o9K6J61j20p7J39
6879a6O3j76N3L30l79K15k1J3r8j27K6N4K1o2J44L4j00O8mL1J71q0j60J5l02J83
6905a04K35k07j37J58J01L2l3q2l2j27J18L3J04k9j60l1K08k88K22J27m15K92
6927a5K3j94M47j05j95o9K04k4l8k0k67L44j74L40j66k44r0M48k13N1p0O0Q7k3
6951I7j37K17j75J75l77L86k20OJ92j82K9j65J46N2K78k99r6J56k7l25K26m2Q0
6974ej48K11j7R5j15P6K1k47L06j31j62k2J90J02k49j70J28L05k16N8j73K77j89
6997g5J39j05O8k03J79O3q7q9R7n1p3j12K89L92n07J1L6q8j21K89J16k18k5K30
7021A55k20K5j3L5K2l3J7O4j01L18j33l11K2M94n76L90l12l9K30j36J9L77k66
$$ plain form
6855 -174 62 84 -141 -142 -12 -42 180 69 -101 -95 176 93 15 -64 -215 -11 317 -76 -145 -119 42 -78 -155 -16
6879 -16 47 -129 -76 254 -125 90 69 82 -16 -143 -117 -63 -42 -104 40 74 -26 42 38 69 240 160 0 15 -287 -104
6905 -104 131 -76 -213 -55 46 78 45 -37 -69 -196 -78 -45 59 30 -130 -161 47 -241 -19 108 -307 -15
6927 -15 8 -186 261 156 -39 -108 96 72 34 14 -253 91 -83 257 91 -153 -243 205 -8 43 -27 33 120 97
6951 97 -40 177 2 177 -200 186 -34 -28 164 -18 11 -154 -8 44 322 23 -73 83 56 -269 -43 -85 -5
6974 -5 -153 58 41 136 21 97 118 -129 177 46 -116 -138 52 154 -95 -265 -137 168 -48 10 -163 114 -75
6997 -75 64 -41 27 -176 3 66 -21 -110 -13 -64 -137 -249 40 432 -75 -64 -28 -116 -237 52 168 -50 -75 155
7021 155 -65 -40 -53 -18 4 -29 -12 52 -49 269 136 -175 -153 341 -235 155 -157 -196 34 -102 -83 294 28
7044B8k88J86R6j3N0n6k06J44m8J72j92J36K75k53p2p7J58L7j92K67j70k40K22
7067c6l8M3m1M19k48K4k16j37K58k90L87j05O0j17m8J24J2k6O2j91k8Rl1K62j50
7092d2L9j03K68o6q2J43m07M44l64K36l75L53Q6L2j31l44L85Q1j94J66j84J45
7114H6k14K40Kj63j1J44o4l2q3R1j93J22L13k43n1RL5L4M1j5j54k9K72j94n8k4
7140a39K63q3P2M8j73k7K61j28O3k25P3j34J27q5L32l7k46K0oP4q4K89k60M6j25
7165h4Q3jK28j89k43J59l9kJ46l04M0J30K0j62L41j74OJ61k91K63j80j43l4K77
7189Ho2PK10j87j78J23J81k05J13P0q3Q0J90k58J20p9J62k19j41Q4j64K57M8l36
7213b59K06R6j84Q1K22q5j55RK62k47J80J2m3j00m0q4J26m2K4k37M30k60J70j41
$$ plain form
7044 28 -260 -74 22 9 59 3 -203 -59 -107 65 -127 9 284 31 -41 -118 40 77 -115 152 -18 -258 -36
7067 -36 -74 -31 -72 347 99 123 -93 -230 28 -262 125 20 80 -37 -85 39 51 25 87 -104 -132 -123 -154 108 -42
7092 -42 -3 -106 162 96 14 157 -250 194 -170 66 -309 44 130 162 31 -313 72 153 -41 125 -59 86
7114 86 -128 112 114 -49 -60 84 20 -12 -95 -4 -197 -75 238 -5 -56 -47 -12 22 63 48 -106 -135 137 -57 -115 -139
7140 -139 124 41 113 161 -12 -39 222 94 157 -68 5 -129 -2 -87 245 208 -38 -18 -24 50 -34 255 -5 41 -84
7165 -84 -1 -2 226 37 -206 -47 -86 -88 58 -246 -206 -76 -56 -218 123 -51 -45 116 -175 88 -92 -235 -269 8
7189 8 -54 -47 163 -24 -202 -79 102 -103 10 80 -3 77 267 9 129 50 212 -7 -148 -64 -228 29 77 -259
7213 -259 -53 43 -141 -60 162 77 -78 -69 193 -54 126 138 95 -5 -45 -129 -3 -45 -21 -258 172 -88 82 -59
7237e9r8m8j0K12J4M8J6n0K9k42J96P1n6n8j22O2J5J31j36K32j62O0j8j12q3J09
7263e9r1R2K5J14n8o0j81K92k78K56K5l1N2j36J20k76J67P2J45j07q3K5k43L61
7287A43k44K9M2O2m7p0K5K70j65k68J83j02J46J05m0J49j25r2P9o0p5K23j84o
7311b2j52j59K43J85M2j23j19p8K77o3J45j79J50J01l28O7j1kL9j29N6J10j18
7334f8k56M01j63L5K8m5k40J44K35j3q6n9%j15J68J47R4k65K07l54J38K28l33
7357a72J38J86j24J7j37J57J55k36Q4M7j66K09j66J30J98r5j60J5l2j08j9O2O6
7380D9m25L66m7K20j70J75r4no1q9J34j27p1J37J20k58K48j98J64j0q3K61k02
7403C4qJ11j58n2K42j35K30l52J45j24K28N1m6j25o8q2K35k0j33K67l98L82j37
$$ plain form
7237 -59 -157 -205 -215 -3 11 59 75 25 54 -188 8 79 23 -35 -157 -95 -80 51 -85 147 -15 45 27 -85 -168 -59
7263 -59 -150 -58 -33 81 23 -37 -218 74 -204 52 77 46 98 -38 82 -194 -27 45 190 83 0 25 -218 143
7287 143 -101 -72 -30 32 -15 -85 -60 210 45 -223 -40 -142 4 109 69 218 93 1 80 20 -55 168 -16 -22
7311 -22 -174 -333 -90 95 137 14 -105 -183 94 31 176 -3 147 248 -80 -13 -24 -26 13 -116 -60 50 -68
7334 -68 -324 77 -86 -51 -23 -68 -308 -164 71 58 -28 -87 -87 -202 -34 113 207 -58 149 -205 -67 161 -172
7357 -172 -34 152 28 45 -92 65 220 -16 68 115 -51 158 -8 122 320 225 65 80 48 -60 -79 -17 49
7380 49 -376 -10 -57 163 -7 168 74 69 8 -81 53 -74 -145 -8 112 -146 102 -96 68 58 -25 236 34
7403 34 26 137 -21 -73 169 34 264 -88 57 -67 161 212 166 41 -27 -109 126 106 -27 240 -158 224 87
7426H7o2qQ0r3J3oj50k0K71K6j24l42N53o6j19n0J01k52p3L98m27L68kk00J00
7451Co5K1j55L53l10Q6J73j83Q2J3J2O6k11K05k27NK61n0r2o8L04j67q8j07L86
7476B47J71p80L67J59l36J22K43j58j06J22l79L78N7l92R4L60l70J75jj52L59
7497A80l4j88K8M4k33K43J14k09J60jq8j9J67j59R0o9L2J19j97j31NK69N9q7Q4
7522A79l49K49j04J4p7J38o5PK7J06k24O7q3K27l71K86O8k0j88N4K0p9K48k15
7546h5l8M4j00K46j68K89k46J47j48o2J28J38l37J59K2n3J08J03n0R4j75K6J03
7569A45j69J66Q7j66k1M3j89M0mJ19j78K24k56j7J34J0j15J00O2p1n0N3LJ47j2
7594H5j80L5Ok25N15m8l28K94j77q8L72k96p3K06o9m1J57j11j65L59p7k49K8J55
$$ plain form
7426 87 25 17 97 4 17 11 -139 -159 112 138 14 -328 225 159 40 -10 91 -161 -234 164 -263 105 103 -97 3
7451 3 -62 -41 -196 157 -153 -67 106 -77 5 18 30 96 -115 90 -137 -132 129 79 -13 -81 223 56 -32 -139 247
7476 247 418 -362 5 164 -172 -50 193 35 -71 51 -328 50 107 -285 -191 169 -201 -26 -27 -179 180
7497 180 146 -42 -14 30 -203 40 154 -55 105 104 16 -3 164 5 95 26 58 177 -20 -151 -146 123 182 95 179
7522 179 -170 79 -25 -11 -88 50 -15 -8 19 125 -99 -32 -115 112 -259 27 95 75 -113 -59 -39 -118 130 -85
7546 -85 -123 -79 -179 67 -101 188 -58 89 -59 -121 7 145 -192 -33 -11 -64 44 147 97 191 16 42 145
7569 145 -24 142 229 63 42 85 -104 -64 -68 51 -127 97 -159 -176 -42 -32 -147 -47 15 -56 -106 -53 -50 97 85
7594 85 -95 -60 -54 -279 236 188 -140 154 -23 -111 261 -35 -108 98 29 -12 145 34 -131 228 151 -98 -70 85
7618H5j46l2o2j7J82J97p2j69j9l3J62P0l20J54J69k57k6K24j55j19Q7J28L25
7641C56k94Mj23K19K99n71J1K56M7j72r4n2j35K00P7k00o0J07j23O6K43o6n0K43
7665A88k61j24J33p8L67k87P8L3k6l5K44m23J38j0j5L3J44j53J25oj46J65j53
7688f9p5L61j26J06l66J79k1Oo2r7J00J60J08k02M3l27K76PR3k09O0Q6r3p8K49
7713A09r3k7K67l39K4K94m6l13J17j72L18K7j80J36k49j00R8K82k60J3K77K7l0
7736A80o2k55l0R8N2k7M6J11O4o5r2O2k14K2P1N5N8J44l80J22L3J12m9k3j47r1
7762b05J5J32qj5n4n8K04J94k84n0J29O4j1j31K84m91L23O3l23K0L73k31J23j86
7786a23k73L27J3L67l01K58k14J4j12M2p5m8K57J2R3Nl19nR1N8j81J45N0J56l19
$$ plain form
7618 85 -61 -93 -155 -172 10 207 135 -34 -53 -86 76 146 -174 -20 149 -108 -134 90 -65 -184 -97 31 356
7641 356 62 66 -57 162 461 -110 -99 157 204 32 -62 -114 -249 -49 28 -172 -232 -125 -248 -182 61 -5 -55 188
7665 188 -73 -197 -64 -142 225 -62 16 49 23 -12 232 -191 -53 -63 -78 -45 99 -54 71 65 -81 84 -69
7688 -69 -144 217 91 197 -169 10 -11 -5 -67 -164 -64 96 204 2 45 -282 -6 1 94 -115 -55 31 -62 -140 109
7713 109 16 -11 256 -83 -59 235 189 -124 -7 -179 139 166 -14 122 -127 -227 -129 153 -107 -94 183 210 180
7736 180 118 -137 -167 -69 -17 -44 2 113 177 112 20 82 -132 -110 -39 16 74 218 -162 -40 -7 105 56 33 -114 -205
7762 -205 -190 -58 -66 -81 -135 -193 11 205 -79 -129 0 64 53 -78 206 -285 38 101 -222 -202 171 -60 63 -123
7786 -123 -396 -69 -56 311 10 268 54 68 -44 -2 -77 -125 132 144 237 242 -77 -82 9 67 -114 31 81 237 -82
7811h2O4j71K91m0j10K8J86Kj06q5j36K46p3ol1k1KJ37R6j44l5J83l44J85Q0m8
7837F8q5n5J13j8J55k51J03O7q9J5Q0o4K9J28j07k37J33Q4j18O2j2r0J95R8k44
7862d0%K40j70j00l81L24J84K94j32l32K67j86j03L22j08l28K07%K34k44O1M9
7884E8k28K21j29N4j46L19j63KJ37K2j06l34M27k07j91L01J3j28J44M5n0n6o6
7907f1j48L02j91k3J23M7rj37J04J33k02P7J29l76J34m1L7K23j74j70J78k22M59
7930A92j30n3K9j76J35O0r5n9J19M3j78K11j05k57K32o1N4p4J07M9l22J14nJ48
7954b2j19K53k6o3J3q0n9P0J05j92K51j99N4R3R4j55j83J26J27J00l06j20J64
7977g4L02j44n5j20K7Q2Jj71K35k72J25K35J05q4m15K51j25J99m5j3R8m5k83K95
$$ plain form
7811 -82 -18 -189 102 62 -48 -20 166 168 62 -23 -159 87 14 8 -23 -44 -42 95 191 47 12 195 -149 36 116 68
7837 68 -17 -72 41 23 178 -73 30 97 8 23 103 39 68 196 89 -148 -15 69 -49 13 1 -89 106 204 -40
7862 -40 -40 200 30 -70 -451 -127 57 351 219 -113 154 -32 -135 187 79 -249 -42 -42 192 -52 9 58
7884 58 -170 51 -78 -24 -170 149 -14 -12 125 147 41 -293 134 -73 -264 37 50 -78 66 111 61 5 -61
7907 -61 -209 93 -98 -121 2 49 40 -97 7 140 -62 15 144 -232 -98 -139 -102 121 -53 -223 -45 -267 192
7930 192 62 9 38 -138 -3 57 -38 -97 22 65 -113 98 -7 -264 -32 -93 -39 -113 -6 43 -279 -165 -170 -22
7954 -22 -141 112 86 23 36 -44 -103 -33 72 -120 131 -68 -14 79 173 18 -165 -39 88 188 -118 -238 -74
7977 -74 228 84 29 -91 -64 18 19 -152 83 -189 -64 171 276 192 -223 28 -97 102 57 44 142 97 -186 109
8001A09k89K08j18J2J4J34l05J25q0J07J50nJ54k70l8j7J26j75J27M2j50j6K54
8024I9K35j90k54K47k8j00p2K33j75lJ56k4r0r7J66l6j2j93K68j22k3J46k59K94
8048A66l10J61j29K88rj42j06J87l1Q5j20o8n7K7j7J8N5J25k67O4j60L01j05J4
8072c0M5K9L8j57J55q5k4k6J3N9j74P2j11J93J29l70K10J04j25l7J05N9j25J52
8096I9j02n3Q0J23L0j64j69K68j24p3J57p6N0QJ4r5L0n4O5K03l26J88l20J81M
8121e6j00j36J79J10O8R0j26j19J85N7j83J5q3K10k08l6K22j88L6J74j76k86M37
8144H6QO0N5k04NK94k74J1J44j11k09K33l00K06q2k2P7L8j07j09J19K11l8j44
8168e3m0K91m5k21J95j98J3J9Q2L0j39P3n4n5M25j16j00q6J8Q2p2k54J59
$$ plain form
8001 109 -180 28 -90 -78 -64 70 -235 -110 -190 -83 67 62 216 -54 -92 -109 17 -158 -31 11 -139 -155 99
8024 99 334 144 -110 137 109 9 -63 170 -5 -8 148 124 34 -63 103 67 55 -138 130 8 -15 131 -128 166
8048 166 -144 17 -112 176 167 25 -81 106 75 160 40 -28 -85 -58 -75 -57 -2 123 -144 -80 -240 61 -44 -30
8072 -30 15 44 82 -75 80 -5 -29 -55 -42 17 -157 -85 -196 -3 126 -244 -34 70 -55 -92 13 72 -53 99
8096 99 -3 -56 24 147 177 13 -156 112 -12 -85 72 -4 46 54 68 -27 3 -51 14 217 -109 79 -241 -60 -56
8121 -56 -156 -292 -113 -3 65 155 29 -90 95 152 -31 -16 -99 111 -97 -133 89 -99 -63 111 -65 -351 86
8144 86 94 154 209 5 10 304 30 41 185 74 -135 98 -202 4 -78 -100 -23 15 -92 -201 -82 129 91 -53
8168 -53 -93 198 153 -68 127 -71 -58 -39 43 73 -66 7 -47 -102 323 207 107 21 39 121 49 -205 -46
8191d6
$$ Imaginary data points
##PAGE= N=2
##DATA TABLE= (X++(I..I)), XYDATA
0@%%%%%%%%%%%%%qJ6j6J6j6K4l2L7m5N2o0P2q5R5j08J26j46J66j89K15k42K72
35A44l07L44l83M27m76N31n90O52p22Q00q82R72j070J177j296J429j576J738j919
54a007K122k352K615k918L274l697M209m845N657o731Q222j0437J4041k0844L7796
69B5105j50515k11664M75991k4759l75738J97787K61903k44168p0970K15718k6165
80G2525j59055M3980R5339o431q2411k1998P8554m721r7939N3178P0106q1734
92d0607K1586J16714p5062o4393J01107k2419r2753P9039K5846j02867M6669R6434
104H9294p5578o0354O2099K2987m8365k1049L7934L0737m8929j6642Q9096j7369
116D3861j23474N7671J05737j05077o0614J10711o878q5896M0627K3470m9683
$$ plain form
0 0 0 0 0 0 0 0 0 0 0 0 0 0 0 -8 8 -8 8 -8 16 -16 21 -24 28 -32 40 -45 50 -58 68 -78 88 -101 114 -128 144
35 144 -163 181 -202 225 -251 280 -310 342 -380 420 -462 510 -560 617 -679 750 -826 912 -1007
54 -1007 1115 -1237 1378 -1540 1734 -1963 2246 -2599 3058 -3673 4549 -5888 8153 -12691 25105
69 25105 -125410 -337074 138917 114158 -261580 -63793 198110 -46058 -117028 98690 72525
80 72525 -86530 -42550 52789 46358 -36053 -58051 20503 15782 -82157 -28979 41127 -40607
92 -40607 -19021 97693 22631 -41762 59345 36926 -55827 23212 49058 -53809 -7140 89294
104 89294 13716 -46638 15461 38448 -9917 -30966 6968 37705 -11224 -27866 61230 43861
116 43861 -79613 -21942 83795 -21282 -81896 28815 21937 -63959 -23332 138 -49545
127d9545J5002K9939O956L0323k3530k7364P0093j2651j06749M2816O6868q5243
139d3085k720R5071m6378m6630Q2767J938n6706M3270J6916l8795K9458L243o2993
152b4644Q442K6768l6299m45K7760q803J2131J7004j7056R870j352m1327K9995
165B044L4439p1372r248Q1336l5223o1580O4600J5301o6085K9396M9107l9519
177f804j6093K8885L739m615j6486r946M0432l91m8602L6719L3195p1166M099
190b7034P2207n3470m5322Q1742N784o0211M7012K8833n7714J4703L7587m4213
202i6j4205K9449j7275j1641J4247j3590K08J6269j2196J2112K0433l1642M309
215c618M1591m2661l7345N2171r742n8804M0947L3509n3760R581N5589k2069k2960
$$ plain form
127 -49545 -34543 -4604 2352 32675 9145 -18219 51874 39223 -67526 -24710 42158 -43085
139 -43085 -45805 49266 2888 -43742 39025 40963 -15743 27527 44443 5648 35106 38349 -24644
152 -24644 -16202 10566 -25733 -26178 1582 -7221 4910 21914 4858 14728 13376 -27951 2044
165 2044 36483 -34889 -44137 37199 1976 -59604 4996 20297 -45788 -16392 32715 -6804
177 -6804 -22897 5988 9727 5112 -11374 -21320 19112 18721 -29881 6838 40033 -31133 -27034
190 -27034 45173 -8297 -53619 28123 33907 -26304 20708 49541 -8173 6530 44117 -96
202 -96 -14301 15148 -2127 -13768 479 -13111 -12903 3366 -8830 3282 23715 -7927 -3618
215 -3618 37973 -4688 -42033 10138 396 -58408 -17461 16048 -37712 -28131 27458 5389 -17571
228a7571K9559O503j1734l822n349J2763r16l2042J9286L1667m5130p803O3913
241C9324j9501m8055N0353J6827n6569J6464L5091m0523q111L4134j6117j6242
253a2925J6951o047o684Q150r474L733J1447j9992P982K7810l0959j0107M9324
266B9209j9543m5071M6049J4218o3148J5283M7963m2139k1717M9051K757k8709
278a5797J3303J9586k068j2305q111K0974L565m1837Q194M3322l7811k8219O1063
291B3859J329n3918L9003L5883n2080J155M3372l1274k3037L0403j0230k2966
303a8501J5487j154q898J1408o418L47J9561j8230r829L4342j5973l3540L9018
316G620Q055n0822K2247L7308m4210p350M7186j6858k6383L2217N641k1709J1296
$$ plain form
228 -17571 11988 18491 6757 2935 -2414 10349 9433 -22609 -3323 28344 -16786 -24589 39324
241 39324 19823 -28232 22121 38948 -17621 -1157 33934 -6589 -14700 19434 3317 -12925
253 -12925 4026 -2021 -8705 -555 -10029 -6296 5151 -14841 -6859 20951 -10008 -20115 29209
266 29209 9666 -35405 10644 24862 -38286 -23003 24960 -17179 -38896 10155 12912 -15797
278 -15797 -2494 17092 15024 2719 -5392 15582 19147 -22690 -14496 28826 -8985 -37204 23859
291 23859 25188 -28730 10273 46156 -5924 -4769 38603 7329 -15708 14695 4465 -18501
303 -18501 -3014 -4168 -13066 -1658 -8076 -7729 11832 -6398 -16227 18115 2142 -31398 7620
316 7620 15675 -35147 -12900 24408 -19802 -27152 20034 3176 -23207 9010 14651 -7058 4238
329D238P382p022O015o086l624J5778j3265j6086K5098m136k8552K3983J2762
342A6485l2568J3744K6467k9502p96K9880k2786j4073K7324j2944k0893K1534
354A872l173j8402J8221J329j4343J9028J986j8058K0526M544k8851J6322J5247
367A6248l4825L585K8492k5732r526L1725r254j4899K2662j123j1320J6240n506
380F767j0159J9925r981k0179K6949q35l3653K3970K0124l7498P109L4042k7378
393g97j2496L3091j1304k1619K1748k77j8949J0026L98j0700Q172n098o927J7696
407B964q462j4150K8553j042l1084K7883J8536m2274R076L8059l4742j7045M2166
420A8438j1008l1521K8028J1792k5708R350J4351j0150J962J836m667Q242p923
$$ plain form
329 4238 11620 4598 10613 4527 903 16681 3416 -12670 12428 8292 -20260 3723 16485
342 16485 -16083 -2339 24128 -5374 -6170 23710 924 -13149 14175 1231 -19662 1872
354 1872 -1301 -19703 -1482 -153 -14496 4532 6518 -11540 8986 13530 -15321 1001 16248
367 16248 -18577 -14992 13500 -12232 -21758 9967 713 -14186 8476 7353 -3967 12273 6767
380 6767 -3392 16533 6552 -13627 13322 12487 -21166 2804 22928 -14570 -7461 26581 -797
393 -797 -13293 19798 8494 -13125 8623 8346 -10603 -577 -179 -10879 -2707 -7805 -14732 2964
407 2964 -5498 -19648 8905 7863 -23221 4662 23198 -19076 -10000 28059 -6683 -23728 18438
420 18438 7430 -24091 3937 15729 -9979 -629 13722 3572 5534 7370 2703 10945 3022
433C022j3641J9037j716k7804J9545J7470l2868M934L2964k3890j3172L3748q272
446I357k4673K2428L993k2048R224O310j3232O107J926q900J1822k58j3786J7926
460F196M912k5011J4868J7444l1620K125K9228k4867j3333L3359j0141k4161K6636
473E635M049k3671J7095J0757j8956R994R712j7265P027P525j9444P139J3162
486A2759k2225K798K2124j9944p315K5253j1477j6283K3077j064j9523J5136L634
499F950j8588Q515M530j5284R217O494j4493J1123J0736j8568O866J6684j9844
512e662p94K2874j5443j0698K4293q449k0228J8909L105j9869J1556J0732j3970
525c644M835P924r966K424K079q884Q223J944j5825J2341R787k5046N003K3528
$$ plain form
433 3022 -10619 8418 6702 -21102 -1557 15913 -16955 -12021 20943 -2947 -16119 17629 9357
446 9357 -15316 7112 11105 -10943 -1719 4591 -8641 -2534 -608 -9508 2314 2056 -11730 6196
460 6196 11108 -13903 965 18409 -13211 -11086 18142 -6725 -20058 13301 3160 -21001 5635
473 5635 9684 -13987 3108 13865 -5091 4903 14615 -2650 4377 11902 -7542 -403 12759
486 12759 -9466 -6668 15456 -4488 -11803 13450 1973 -14310 8767 7703 -11820 3316 6950
499 6950 -11638 -3123 1407 -13877 -4660 1834 -12659 -1536 9200 -9368 -2502 14182 -5662
512 -5662 -6456 16418 975 -9723 14570 6121 -14107 4802 7907 -11962 -406 10326 -3644
525 -3644 1191 9115 -851 1573 3652 -5232 2991 4935 -10890 1451 11238 -13808 -8805 14723
539A4723k3265q014L3225j0585k2679K8727M137l1214J3296J6128k3447q2J7937
552H887j0611m474R759o355j344N806p443M487R183j2666L025J5407j8057p909
566a2305K2801j0420j7698K3757L590k2074J5061J1807k2389M862J6003j5728
578b733j29J5909j2177k832J2907j3158o871J5666r640r040J8114k540j3571J4960
592D865R75j6903R939O431j3927O682Q204j1894M747O312j4709M713J2605j5852
606g812J438K0362j2877q132K0501p979j6933J7925K200j9509J1951R867j7493
619f491L441J0420j3331m53J1588q492q79J1323o656l252Q269p527l998R992n745
634a791n116J2633l392r255J2212j502j2652J1780M783j4276P966R669j4280Q02
$$ plain form
539 14723 -8542 -16556 16669 6084 -16595 12132 16269 -14945 -1649 14479 -8968 -9050 8887
552 8887 -1724 -6198 3561 -2794 -4138 1668 -5775 -1288 7895 -4771 -1746 13661 -4396 -12305
566 -12305 10496 76 -17622 6135 9725 -12349 2712 14519 -7870 -3008 12995 -2733
578 -2733 -2862 13047 870 -1962 10945 -2213 -9084 6582 -3058 -12098 6016 3476 -10095 4865
592 4865 5840 -11063 -1124 5307 -8620 -1938 6266 -5628 -881 5431 -9278 -4565 8040 -7812
606 -7812 -6374 13988 1111 -7021 13480 5501 -11432 6493 8693 -10816 1135 11002 -6491
619 -6491 -3050 7370 -5961 -6414 5174 -3318 -4197 7126 470 -2782 5487 -2040 -6038 3954 -1791
634 -1791 -6907 5726 2334 -6921 5291 3789 -8863 2917 7700 -6576 1390 11059 -3221 -2419
648b419J0202j1940k485J1302p459m106J1160m399n316Q987m612n022J0440l409
662I24p649J2562j227j2628J0847L546j5518P901J0164j4412K671J3580j1834
675a073l008J2830q802n764J2513o177p454J3405m613j1904J3549O09j5618J1587
689H0P215j6111O238J2456j4610o38J3937r863n278J2950n275n909J0672m098
703A766o841J0285l107q903J2025m95j2152J0744M735j5589N722R679j3799K29
717e701J1796r621k913J1095o426m908J0698l817n986J0203j581q228R354K88
731D253r679Q070K750j0237O317N239j0764M136P792j0859L61J0171r007l214
745d671J0429n909o398J0134k517p726Q737l26p868P085J457q151N981L224q326
$$ plain form
648 -2419 7783 -4157 -6642 4660 -2799 -6905 4255 -144 -5460 3527 -1085 -6107 4333 924
662 924 -6725 5837 4610 -8018 2829 6375 -9143 -1242 8922 -5490 -2819 10761 -1073
675 -1073 -4081 8749 -53 -5817 6696 519 -6935 6470 1857 -10047 3502 4111 -11507 80
689 80 7295 -8816 -2578 9878 -4732 -5370 8567 -1296 -6574 6376 1101 -4808 5864 1766
703 1766 -5075 5210 2103 -6800 5225 4730 -7422 3322 8057 -7532 -1810 7869 -5930 -5701
717 -5701 6095 -3526 -6439 4656 -1770 -6678 4020 203 -5783 4420 2839 -5389 3965 4253
731 4253 -5426 2644 5394 -4843 1474 6713 -4051 85 7877 -2982 -2621 7550 -1457 -4671
745 -4671 5758 -151 -6549 3585 1068 -6658 2079 1753 -6115 970 2427 -5724 257 3481 -4845
760d845M578N038r157L268O699q743R61Q437p644j731R263o715m051R967m865
775D60o202J0031k464q228R493L0j0085R457K754j2218P577P021j3692K714J2204
790H852j1578l407J4008o513p153J1118k103p872Q142j101o668P925j456q311
804f117R073J444j2933Q273O885j4312K744J2204j1557l228J2417n918n854J0267
818C388l011n561R304k468o952J0070r46j0067R273L123j1327N892P464j0414
832b232J733Q596q645j642Q560o787k944P978m491l734O260m240l838Q025m462
847a863m682J1380l265r945J1927K345j5603P742R981j4445J45J4279q130o622
861f756J1018k506o797O911j79l764O233k250n045P068j809q421P276K968q962
$$ plain form
760 -4845 -267 4771 -4386 -1118 5581 -3162 -2201 6236 -1408 -3139 6124 -591 -4642 5325 460
775 460 -5742 4289 1825 -6403 3090 3120 -6965 2492 5246 -6972 605 7626 -6066 -3352 8852
790 8852 -2726 -6133 7875 1362 -5791 5327 3224 -4648 3494 2393 -4275 3650 2194 -6117
804 -6117 2956 4400 -8533 -260 6625 -7687 -4943 7261 -4296 -7524 4893 -1025 -6879 3388
818 3388 377 -5184 4120 1652 -5300 4770 3824 -6243 3030 6153 -5174 718 8182 -2232
832 -2232 -499 8097 -548 -2190 6370 -417 -3361 4617 126 -3608 2652 -1588 -5426 2599 -1863
847 -1863 -6545 4835 1570 -8375 3552 5897 -9706 -1964 8017 -6428 -6283 7996 -134 -6756
861 -6756 4262 1756 -5041 1870 1691 -2073 4160 1910 -3135 3933 2124 -6297 979 3947 -5015
876e015N047N814q390J852M903o958J233O645p032Q90Q574p068l666Q858n105
891E82o917R362j172p832P783K207q506M684K798q453L912M859p464K043N856
906C742p211n08N732o617o66Q006m967j024J0076n442n358J0535k974r615R715
921C424L240j1170O252O579j0700N74P672p892p34P970m949j199P408n434m504
936c463P506m781o153Q578j115o940P841J115r096N107L384q212M317O628p387
951b671J609P278p682k277O828m996l216P341j842l639O522j419n421O031j080
966A366n366O665J502o347M776K808q574J988M620o937P08P273m700r02O861m434
982A307l521O555l410m359P387j494o301N790K77q302L734K999o184K571N163
$$ plain form
876 -5015 32 5846 -2544 -692 4211 -2747 -1514 5131 -1901 -1011 7563 495 -3171 5687 582
891 582 -6335 3027 1855 -5977 1806 4013 -4493 191 2989 -5464 -1552 3307 -4157 -2114 3742
906 3742 -3469 -3977 1755 -4862 -5528 2478 -2489 -3513 6563 1121 -4237 6298 3324 -6291 3424
921 3424 6664 -4506 1746 8325 -2375 -1801 5871 -2021 -2755 5215 266 -933 6475 1041 -3463
936 -3463 4043 -738 -6891 1687 572 -6368 1473 2588 -6508 -1401 1983 -6229 -1912 4716 -2671
951 -2671 -1062 6216 -1466 -3743 3085 -1911 -5127 2214 372 -3267 3255 1836 -3585 2446 1366
966 1366 -4000 2665 4167 -2180 2596 5404 -3170 -1182 3438 -3499 -2791 4482 -218 -1120 5741 1307
982 1307 -2214 4341 931 -3428 3959 2465 -3836 1954 2231 -6071 -2337 662 -5522 -2951 2212
997B212m664J350L514n233O48L953n872P71O986n976k301R529m699p095R534J261
1013C918q222O354N303p193J839M460o489R0L903n535J91N840n018j828O164l978
1029b01l843N605m87l857M784m70l835L826j301n583M661N40o610N449M142p447
1045d627K002O458n990o58O719m431j892P430l897m850O569j339p060N395K705
1060B534n918K598M642l037L51P02j523L097m45n694M771L598q831Q94Q042p327
1076a546m512R909p86p210N391K841n463K165J052m918L053Q71n471L136K588
1091A100o892J685O088n265j613O390j812j999N039k223k486N325k298m216N195
1106B018n44m893M959K105n666K701L817m114J813K697n024K032M048p315p51
$$ plain form
997 2212 -2452 -1102 2412 -2821 -2173 1780 -4092 -3321 3665 -2311 -4612 4917 218 -6877 2657 3918
1013 3918 -4304 2050 7353 160 1999 6459 -30 60 3963 -1572 -1381 4459 -559 -2387 3777 -201
1029 -201 -4044 1561 1074 -2783 2001 1531 -2304 1522 221 -5362 -701 -161 -6771 -1322 2820 -4627
1045 -4627 -2625 3833 -2157 -2815 3904 -527 -2419 5011 1114 -3736 2833 1494 -5566 -171 2534
1060 2534 -3384 -786 3856 819 1170 1872 349 3446 3001 -2693 2078 5676 -3155 -2261 5781 -1546
1076 -1546 -6058 3851 3065 -4145 1246 4087 -1376 789 1841 -3077 -24 847 -4624 -1488 1100
1091 1100 -5792 -4107 1981 -3284 -4897 1493 -319 -2318 2721 498 -1988 3337 1039 -3177 2018
1106 2018 1474 -3419 1540 3645 -2021 680 4497 383 2196 4893 -131 1901 5949 -1366 -2117
1121b117O616n674m136P550j942o260N677K417n715K677K180l550K784J431n268
1136c330K734K896o384J216N310n870j293P295k387l397N237m26k604M031q46
1151B182m283M656n4n367L475J599n638K558M287n085P23M620l097J03M063m190
1167E52p42N128m299l219N316k366m777N263J26m980L478J887l777K520J198m183
1183b875L303J838n996K034L751o867M92O484n090k994P908j260m189N892L61
1198B792m648M732J751n921K913K551n514J291L692m970J68M730l512p83M192
1213C464k866p47M679l410l031M680k159m618M472o20n558M407K244n442K345
1228b160L973l912P90M099l487m38L451k955j308L106k981j237M442k400k407
$$ plain form
1121 -2117 4499 -1175 -5311 2239 297 -5963 -286 2131 -3584 -907 1273 -2277 507 1938 -3330
1136 -3330 -596 2300 -4084 -2868 2442 -3428 -4721 2574 187 -3210 2027 1601 -1003 3028 2182
1151 2182 -2101 2555 2501 -2866 609 2208 -3430 -872 3415 -1670 -947 3673 576 679 4742 552
1167 552 -190 4938 639 -2580 2736 370 -4407 856 982 -3998 -520 1367 -2410 110 1308 -2875
1183 -2875 428 2266 -3730 -1696 2055 -4812 -4320 2164 -2926 -5920 1988 728 -3461 2431 2792
1198 2792 -1856 2876 4627 -1294 1619 4170 -1344 -53 3639 -1331 -1163 3567 55 -728 3464
1213 3464 598 -149 4530 1120 -1911 2769 610 -4008 464 -156 -5714 -1307 937 -4505 -2160
1228 -2160 1813 -2099 -1309 2790 -697 -1135 2316 -639 -1947 1159 -1822 -3059 1383 -1017 -3424
1243c424N213p32l144M399Q19m592L574J620n206K405J925n057J702L547n272
1258b223J00N980m051k004O345j753m113N007j56m644K739N90m100J511O58l258
1274c372K007R94l382K359K457l648J155L784m242K19M065m399j605N496k910
1289a022l262N697m65m643M804K488m584K443K893l162J216J099l400J450J283
1304B835m370R67L552n013o68O030k867m008N466j0l874K672O26l014J856m64
1320b84l066K976o26m142M382K699o274K403O417n739j269O625l072l856N558
1335B732k12n273K592J395l331J238J139j869J860J690j784J518Q42k998K443
1350A982J482n184J451L815m899r27N551l909l506N937L54m871L488K554l765
$$ plain form
1243 -3424 1789 1057 -2087 2312 3131 -1461 2113 3733 -1473 932 2857 -2200 -498 3049 -2223
1258 -2223 -2123 3857 -194 -2198 4147 2394 -1719 3288 3132 -1512 1227 1817 -2283 -772 -114 -3372
1274 -3372 -1365 -371 -3753 -1394 1063 -2585 -1430 2354 -1888 -1669 2396 -2003 -3608 1888 -1022
1289 -1022 -4284 1413 948 -3695 1109 3597 -987 1456 4349 1187 2403 3502 102 1552 2835
1304 2835 -1535 -568 2984 -2029 -2697 3333 466 -3542 1924 1914 -1960 712 1338 -1676 180 -284
1320 -284 -3350 -374 -1000 -5142 -760 1939 -4335 -1932 4485 -1254 -2523 4102 1030 -2826 2732
1335 2732 2520 -2753 -161 1234 -2097 -859 280 -1589 271 1961 177 1695 2537 -461 1982
1350 1982 3464 -1720 -269 3546 -1353 -2280 3271 -638 -4144 1793 2147 -2724 764 3318 -447
1365d47Q61J236l272M75Q15k629J407J572l730J281L483l819o23M582j179j114
1381a101L291o61k083K011p75k241K306j082j783M069N30l968L067K085m170J418
1397I13L121l763L8L837l485j903K587k692k076L860j178k722M069L93k782K344
1413E61J62k656K153R53l278J949J439m060J124L003m658N2N253k041j884M827
1429B899n95l168L142l84l873K373J105k999J894Q25l395J537K193l488J111L059
1445B236k003M84L365k904j552K711k124k591L160n94k641L626R0l382J768J370
1461A019l112K356J615l061J201J876l527l64J931l120jL276j490r15L610j042
1477B52j496K864n67k165L238N20l117K148J100m149J192J959l329M74L609k054
$$ plain form
1365 -447 414 1650 -1622 -1147 -332 -2961 -1554 18 -3712 -2431 1052 -2767 -3390 1192 13 -1101
1381 -1101 2190 1529 -554 1457 682 -1559 747 -335 -2118 1951 2481 -1487 1580 3665 -505 913
1397 913 4034 271 309 4146 661 -1242 1345 -1347 -3423 437 -741 -3463 606 999 -1783 561
1413 561 723 -1933 220 1173 -2105 -156 1283 -2777 -1653 1350 -3308 -3256 1997 -44 -1928 2899
1429 2899 2304 -864 2278 1894 -1979 394 1499 -1500 394 1219 -2176 -639 1554 -1934 -823 2236
1445 2236 233 717 4082 1178 -374 2337 213 -2378 782 188 -2453 1173 1263 -2119 -351 1019
1461 1019 -2093 263 1878 -1183 18 1894 -1633 -1997 -66 -3186 -3187 89 -1401 -2316 1294 252
1477 252 -1244 1620 1053 -1112 2126 2646 -471 1677 2777 -1372 -180 1779 -1550 -1076 2533 479
1493D79q60L388j421k274K135o36j818J537l31j338J383j227k068K048J81k248
1509c070K930J444k552J659K036l303j07K579k857j95K602k016j082L168j593
1524c57k013L183l17j961L361L90k493J428J091l311R67R67k770Q21K383k462
1540a093M85K536k613j40L446k324j296L979j348l088L152k39m589K119J752l611
1556b872J242K654k171J14K120k043j59K201j827k36K813k740j210L125j618k446
1572c053L515K98k936L155J543k797J174J853k119L09J165k213O72Q91k606N32
1588f17J904k956L4L795k487j646M143r05l504L088O75l670J213J632k694L55
1604a640J296j079M01J150j599J101J911k278P72K696k523j516L661j734l033
$$ plain form
1493 479 -381 3007 1586 -688 1447 811 -1007 530 199 -1139 244 -983 -3051 -1003 -822 -3070
1509 -3070 -140 1304 -1248 411 2447 -856 -963 1616 -1241 -1436 1166 -850 -1932 1236 -357
1524 -357 -2370 813 496 -1465 1896 2286 -207 1221 2312 -999 -32 935 -1835 -1014 1369 -1093
1540 -1093 -608 1928 -685 -825 2621 297 -999 2980 1632 -1456 1696 1457 -3132 -1013 739 -2872
1556 -2872 -1630 1024 -1147 -1033 1087 -956 -1115 1086 -741 -977 1836 -904 -2114 1011 -607 -3053
1572 -3053 462 760 -2176 979 2522 -275 899 2752 633 942 2107 -106 566 1457 -1149 -617
1588 -617 1287 -1669 -1635 2160 -327 -1973 2170 1265 -2239 849 1524 -2146 -933 699 -1995 -1640
1604 -1640 -344 -1423 -1022 128 -1471 -370 1541 -737 35 2731 208 -1308 2353 619 -2414
1619b414L238K13l303J816J445k135J169J661k058N46J528j859M83J018j943J63
1635d32J471j909p89L116k253n42L062j011k072L053J13k803J650J157l073N61
1651g01J550k530J14J939j689j2J802j208r1K152j609n34K825j985j554L120j046
1668E43l052L086O18l360K055K309l121P55K973k095q13K145j108j510J709j019
1684A15p34R63j457m90J983j395p56K817p36k552L184P09l267J338K127k811l84
1701a346K329j476q57J546m38o22J243l32l43J759j106o10K055j364j689K298
1717A047m30k962K230J081k801O36K597k330K41K516j368q12J953j046j170J911
1733A293j376j044K058q93j773K511j5k428K343Q75k849J402J841k657k57K079
$$ plain form
1619 -2414 824 1037 -2266 -450 995 -1140 29 1690 -368 178 1706 -153 330 1348 -595 -432
1635 -432 1039 -870 -1659 1457 -796 -1338 1724 713 -1359 1694 1807 -996 654 1811 -1262 -701
1651 -701 849 -1681 -1567 372 -1317 -1329 473 -735 -826 1326 -283 -817 2008 23 -1531 1589 543
1668 543 -2509 577 1195 -2165 -110 2199 -922 -167 2806 711 -102 2043 935 -575 1134 115
1684 115 -619 344 -1113 -1603 380 -1015 -1771 1046 310 -2242 942 1651 -1616 -278 1849 -962 -1346
1701 -1346 983 -493 -1350 196 -242 -864 379 47 -296 1463 357 -253 1802 438 -1251 1047
1717 1047 617 -2345 -115 966 -1835 -1199 1398 -932 -691 1825 457 -355 1598 552 -618 1293
1733 1293 -83 -1127 931 38 -1735 776 761 -1667 676 1551 -1298 104 1945 -712 -969 1110
1749A110j753j022J902r07n85J106o60k64J644n19m37J750r51r47K260m77k803
1766a553K046R54k820P84K277j959p66K548q82j369J505k31p43R43n64p49Q22
1783B43q85n91J616j154j264K540k1k233K326J091l215J218K563k546o97K732
1799A723j425j840K232k97j578J198N93j045J093L2j068J334o76j201J380N61
1815A016k539R97J448k168R7J892j094o32J691p72k80J657r99n82J465q06j423
1832a032J856k49j850J558N05k152J285J109k053L26K145j914l81J995r32j416
1848a200J333j22q03K43O3N2O67n29J47J202q60q78K281k27k469J814J612l272
1866i46K06K288k093p78K173n94j598J611L04j554J260J06r73O74l7o66P16k37
$$ plain form
1749 1110 -643 -1665 237 -670 -1255 -149 -809 -1073 571 52 -385 1365 414 -533 1727 1250 -1553
1766 -1553 493 1447 -1373 -589 1688 -271 -1037 1511 629 -740 765 534 -209 734 170 -579 243
1783 243 -642 -1233 383 -771 -2035 505 484 -1749 577 1668 -1547 -329 2234 -312 -1009 1723
1799 1723 298 -1542 690 393 -1185 13 606 -439 654 686 -382 952 276 -925 455 1016
1815 1016 -1523 -526 922 -1246 -1149 743 -351 -983 708 -64 -344 1313 314 -268 1197 391 -1032
1832 -1032 824 575 -1275 283 788 -1364 -79 1030 -1023 -697 1448 -466 -847 1148 216 -1200
1848 -1200 133 11 -792 -549 -486 -434 233 -296 -149 1053 193 -685 1596 1369 -1100 714 2326 -946
1866 -946 -740 1548 -545 -1323 850 256 -1342 269 573 -981 279 385 -588 86 49 -617 99 -138
1884a38j084J211O19j931J467J364k371N36K231j883p60K437q27j867J715Q4j642
1901h39N22K24o79P72N2p97J030K50j497R29R72j976K91J950j712p05J779n59
1919Gj034J403p8r22J014J71q59J036j34p58Q96l34j166J225J87j706Q59J184
1937I91j883K35J955j832m03K029n38j745J937j0j752J288K58j145P45L00p77
1954c47N94M23j583J230O51j712Q09J519k017n29K102j088j386J513J18j678J505
1971A24L95j500P05Q08o54j02N19n62M73K29r14R25J30j158L68J495j496k09J792
1990A368j084j168J872k83j728J270N70j580M61Q16j582L48O90o61K31M69o84
2007f75P47L14j409N87J426j617k30K346j146j408J965K5j846J227P52j505M09
$$ plain form
1884 -138 -1222 -11 608 -1323 144 1508 -863 -327 1904 21 -739 1698 871 -996 719 803 -839
1901 -839 -317 -93 -772 0 52 -745 285 535 -962 -33 939 -1037 -746 1204 -508 -1213 566 7
1919 7 -1027 376 298 -624 390 561 -298 738 604 -154 742 408 -758 467 654 -1052 -193 991
1937 991 -892 -657 1298 -534 -937 1092 554 -1191 746 736 -1016 272 530 -615 130 430 -347
1954 -347 247 670 -913 317 968 -744 65 1584 -433 -962 1140 52 -1334 179 297 -1381 124
1971 124 519 -981 -276 532 -122 -224 295 -267 206 435 -479 446 576 -582 -214 1281 -215 -424 1368
1990 1368 284 -884 988 705 -1023 247 817 -763 -302 514 -1068 -720 -30 -691 -460 9 -675
2007 -675 72 386 -1023 -436 990 -627 -857 1489 343 -1065 900 925 -921 306 1058 -447 -38
2024c8J436j370m6O85m92k29M00q15L08N79p82k07J099r95l05J614o85j133J609
2043F33K07j859J200Q39j558M25Q82q52l66Q10l95j53L80p36N34N00j307K02J810
2062A196j472j202K367l38k023J497J000k193O23J653j191n20J393o66l03J063
2078H84o00qM67p23m2R79o38p01J279p26j248J767k24j874J570Q53k019M2J531
2097E69q68j309J498K50j138M07L58K02m1p01P28R21j581L04J768q96j473J873
2115H71M19j891N95J063q87m94P35p3m38L77k66k31N15n65m5R33r03k59J236p88
2135i6n86J231n31j063J329L24j641J090Q54j730Q3J587q98q03J163J64p74K08
2153h9J35l82J59l82p8J124q48o23J263J59j459N65J352j081R4R58k62m87M55
$$ plain form
2024 -38 1398 28 -18 667 175 -54 346 -469 -161 418 -364 -571 528 -467 -772 842 157 -976 633
2043 633 840 -1019 181 1020 -538 -113 769 -83 -449 361 -34 -187 193 -543 -9 491 -816 -614 1196
2062 1196 -276 -1478 889 551 -1472 25 1025 -1168 -545 1108 -83 -603 790 124 -179 884
2078 884 284 276 743 20 -22 957 319 -382 897 171 -1077 690 466 -1408 162 1015 -1004 -962 569
2097 569 -299 -1608 -110 140 -998 -591 -233 -31 -72 -773 -45 876 -705 -401 1367 471 -1002 871
2115 871 1290 -601 -6 1057 170 -324 411 338 -100 277 11 -220 295 -270 -315 618 -285 -544 692 -96
2135 -96 -682 549 18 -1045 284 608 -1033 57 911 -819 -736 851 -47 -850 313 477 -297 -89
2153 -89 46 -336 -177 -559 -637 487 -361 -984 279 438 -1021 -456 896 -185 -91 867 605 118 573
2172E73n11n9N94n99j92J070n53n82R39k70q35O09m4r34P53J39j296J076N57j755
2192a320M97J339j300l82J485m00p05Q82K17m81L15%m55O20M5r09J048Q8j025
2211d41O13P60j198L31R00p20o34J241o33l99L82j59o06O56k65o13P69J50n28
2230c94N69J26o10N11Q7o66L87M47r73L41P15j046k18Q63k88n36Q06j6q56P24
2250b7J29n64K78M58q10L51N5l48Q39j25q82Q17L70p19N12R57q38m46J220p59
2270D68o50O33J56j274P15M55p67P6M33m15k4J49m06J70J90m37K68K50q29P4O58
2291a07m52l23J523p32p05R01K97n46O5N25l75L28L36o53M57k68n19M27L46j172
2311f47N48R74q42k90R73l44r92P05N27j182J03P29m02q1k57J48J47J1l76Q86
$$ plain form
2172 573 62 3 597 -2 -194 876 323 -259 680 410 -425 184 140 -794 -41 98 -1198 -122 435 -1320
2192 -1320 -823 516 -784 -1166 319 -81 -786 96 313 -168 147 147 -308 312 357 -552 496 584 -441
2211 -441 172 932 -266 65 965 245 -389 852 219 -180 202 43 -563 93 -172 -785 -16 134 -394
2230 -394 175 301 -309 202 289 -377 10 457 -516 -175 540 -506 -724 139 -149 -685 121 105 -751 -27
2250 -27 102 -462 -184 274 -536 -185 -130 -478 361 236 -646 171 541 -178 334 1291 453 7 1227 468
2270 468 -182 451 607 -667 48 503 -264 -188 245 -170 -194 -45 -451 -281 -91 -528 -260 -10 -839 -765 -107
2291 -107 -559 -882 641 -91 -796 105 402 -144 -79 446 71 399 735 82 539 271 -248 179 525 -647
2311 -647 -99 875 33 -257 716 372 -620 85 612 -570 -467 262 -140 -221 -478 -330 -183 -172 -548 338
2331C38J41q88Q06K42j177l27J366p46m88N59M17r94L77O44o11j04O00j2L8K58
2351D39j91Q3j98n72P50J34r29Q64L56q51K63P25o75l41R79N4j048O12L75r21
2371i2j47J76p47M76r4m19P22P2o09K64P19r82j09J133l47o15P77L6q11J99K52
2392a46n64N74L05k38N43K71l87J61q1l03K65J42p43K83M22p77q3P32o03m52J138
2413D59k7o38M88K35o86m7L82m81O5R4p3J71K83q05J56N51l72N8O69k20m58P31
2435E35m81n65L48l9l71M42L6k87J89K83m01N42J45l41J17M60k78k3L56n17n32
2456c82L51j99j53P67l33n8M75j25o58M56J69o34L69n3l22o1L60n94j80M69k81
2477f17P2O24j22k28N54j17k86N18l4p77N53J38n27L49m3j90K85K65l99J44K20
$$ plain form
2331 338 479 -409 397 639 -538 -865 501 -245 -733 -174 243 -751 -374 270 -341 -445 155 143 181 439
2351 439 248 331 133 -439 311 445 -484 380 736 -115 148 873 198 -143 836 890 -158 454 829 -92
2371 -92 -239 -63 -810 -334 -428 -847 -125 -53 -662 -398 321 -661 -770 363 16 -599 178 214 -597 -398 -146
2392 -146 -710 -136 169 -69 474 745 358 519 438 135 400 542 -201 82 504 -273 -356 376 -227 -679 459
2413 459 432 -206 282 517 -169 -216 166 -315 -250 -156 -229 -58 225 -580 -424 127 -245 -187 482 262 -196 535
2435 535 54 -511 -163 -202 -573 -131 -95 -382 -193 90 -311 231 376 35 152 612 334 311 667 150 -382
2456 -382 -31 -230 -383 384 51 -7 468 343 -315 141 310 -324 45 -8 -330 -391 -31 -625 -805 -336 -617
2477 -617 -545 79 -43 -271 283 166 -120 398 364 -413 140 278 -249 100 57 -133 152 417 18 162 382
2498C82j74L1L01l44j71P9k98j62O54o19r1P33l31k16K37L75m67L73K71n97K94
2519B60j0l46l10N23o23J56K74n45K17N52j70m17P06j20o19P97p5n38n6M75m73
2540c42J17L54k17R4N85l96j55P34l58j70L65N5o80M75k18q32N66K07p26M99o1
2561a04R2j58K19l4m12L32j06j94K50m68j00M16o4m07N57R1l45M77K97m46K57
2582A50J51j12R8M5m85M21q6l29kK40l93J47M15k23q3L73o0l85N74l96l04q9K87
2605d6l35p6J55k3J44p1K17O0L67l82J28M44n97l62O12l14n73N53Rm86M75L10
2627B09o75L71K34L5J52Jk92P7M1k06qL41m38K32M65n22q4N44j4m56P19k26l60
2650A40K18j19l72n6L2l30j8K26j38J68J75l26J76N82n54R3K51o9m43N41k14n81
$$ plain form
2498 382 208 239 540 196 25 104 -194 -356 298 -321 -412 321 -10 -226 11 386 -81 292 563 -34 260
2519 260 250 -96 -406 117 -506 -350 -76 -621 -404 148 -22 -439 267 147 -472 325 250 -288 -344 131 -342
2540 -342 -225 129 -88 6 591 195 40 774 416 246 611 666 -14 461 243 -589 -23 184 -542 -43 -104
2561 -104 -12 -170 49 15 -397 -65 -171 -365 -115 -583 -683 -267 -331 -738 -181 -90 -435 42 339 -107 150
2582 150 301 189 287 332 -153 268 182 -147 -149 91 -302 -155 260 37 -46 327 267 -118 456 60 -244 -333 -46
2605 -46 -381 -457 -302 -325 -181 -252 -35 25 392 10 138 582 -15 -377 235 -79 -652 -99 -90 -576 -101 209
2627 209 -466 -95 139 174 326 327 35 112 153 -53 -61 280 -158 74 539 17 -67 477 463 7 726 500 140
2650 140 358 239 -133 -189 -157 -487 -505 -279 -417 -249 -74 -400 -224 358 -196 -103 148 79 -364 177 -37 -618
2672f18N28L44j63J7J60Lj28M16m52L06K57n81k5J81n04k09M69j09m26M78j7j75
2694b48K56K39l08K34k2j16J0K3n46L93l7j75K76k7j59Q0N96o76Q2L12K47n45
2716a11J93n2l77R3K98m20j27N68m71J87L56j63M9J37J54P3j69q1j61M51l64j83
2738a20K34j45l66P07m08K76J17O8l50K52J23m36j84K39m11o5K46k24J9N5J71
2759b02J2pK72J20J85k87O1K09l9m32J16K00n60N96J00n40K67P8q2K3L88j55j77
2782A46L7K3l69K41o1n37M40n7k60J68J89R8M2L49k13l49M77j23k7j4n06J96J80
2805G0k25j69Q8P2m7M40j10j74Q0N7J19k31L91n65J37P7l80jN4K06MJ95J66K7
$$ plain form
2672 -618 -90 254 91 108 268 271 143 559 107 413 670 89 64 245 -259 -468 1 -108 -534 -56 -73 -248
2694 -248 8 247 -61 173 151 35 45 68 -478 -85 -122 -297 -21 -48 -207 -127 469 -207 -125 187 434 -111
2716 -111 82 30 -347 -254 44 -376 -503 65 -406 -219 137 -26 23 160 314 387 218 137 -24 427 63 -120
2738 -120 114 -31 -397 310 -98 178 295 363 13 265 388 -48 -232 7 -404 -469 -223 -447 -428 -373 -202
2759 -202 -190 -197 75 195 380 93 154 363 324 -108 8 208 -352 244 344 -196 71 149 67 90 478 323 146
2782 146 183 206 -163 78 17 -520 -80 -137 -397 -229 -40 58 100 449 236 -113 364 241 214 200 -306 -110 70
2805 70 -155 -324 -236 -164 -211 229 119 -55 25 82 201 -30 361 -204 -67 10 -370 -371 -317 -111 -107 88 254 281
$$ [...]
8191b0
##END NTUPLES=NMR FID
##END=
