##TITLE=1H_SL3-DAU(forC13)
 CDCl3
 8 sc, 
 26.10.2022
##JCAMPDX= 6.0         $$ Bruker NMR JCAMP-DX V2.0
##DATA TYPE= NMR FID
##DATA CLASS= NTUPLES
##ORIGIN= UXNMR, Bruker Analytische Messtechnik GmbH
##OWNER= root
$$ XWIN-NMR		Version 3.5
$$ Wed Oct 26 13:48:51 2022 Russian Standard Time (UT+4h)  she@DPX200
##.OBSERVE FREQUENCY= 200.1313499994
##.OBSERVE NUCLEUS= ^1H
##.DELAY= (6, 6)
##.ACQUISITION MODE= SIMULTANEOUS
##.ACQUISITION SCHEME= undefined
##.AVERAGES= 8
##.DIGITISER RES= 18
##SPECTROMETER/DATA SYSTEM= spect
##.PULSE SEQUENCE= zg30
##.SOLVENT NAME= CDCl3
##.SHIFT REFERENCE= (INTERNAL, CDCl3, 0, 15.7039)
##AUDIT TRAIL= $$ (NUMBER, WHEN, WHO, WHERE, WHAT)
$$ ##TITLE= Audit trail, XWIN-NMR		Version 3.5
$$ ##JCAMPDX= 5.01
$$ ##ORIGIN= Bruker BioSpin GmbH
$$ ##OWNER= she
$$ F:/spectra/data/she/nmr/H-F/1/audita.txt
$$ ##AUDIT TRAIL=  $$ (NUMBER, WHEN, WHO, WHERE, WHAT)
(   1,<2022-10-26 13:47:16.59 +0400>,<she>,<DPX200>,
      <created by zg, POWCHK disabled, PULCHK disabled
       configuration hash MD5:
       00 E9 B6 7A A2 85 ED C7 34 08 36 98 17 FE 4E 26
       data hash MD5: 16K
       52 BA 23 8E 10 85 EF 6B CF 05 A2 CC AA 30 68 1F>)
$$ ##END=
$$ 
$$ hash MD5
$$ 2C 20 15 00 9A 84 CB 86 EB AE 99 01 75 06 3A 20
##$RELAX= 
##$RELAX= 
##$RELAX= 
##$RELAX= 
##$RELAX= 
##$RELAX= 
$$ Bruker specific parameters
$$ --------------------------
##$DU= <F:/spectra>
##$EXPNO= 1
##$NAME= <H-F>
##$PROCNO= 1
##$TYPE= <nmr>
##$USER= <she>
##$AMP= (0..31)
100 100 100 100 100 100 100 100 100 100 100 100 100 100 100 100 100 100 
100 100 100 100 100 100 100 100 100 100 100 100 100 100 
##$AQSEQ= 0
##$AQ_mod= 1
##$AUNM= <au_zg>
##$AUTOPOS= <>
##$BF1= 200.13
##$BF2= 200.13
##$BF3= 200.13
##$BF4= 200.13
##$BF5= 200.13
##$BF6= 200.13
##$BF7= 200.13
##$BF8= 200.13
##$BYTORDA= 1
##$CFDGTYP= 0
##$CFRGTYP= 5
##$CHEMSTR= <none>
##$CNST= (0..31)
1 1 145 1 1 1 1 1 1 1 1 1 1 1 1 1 1 1 1 1 1 1 1 1 1 1 1 1 1 1 1 1 
##$CPDPRG= <>
##$CPDPRG1= <>
##$CPDPRG2= <>
##$CPDPRG3= <>
##$CPDPRG4= <mlev>
##$CPDPRG5= <mlev>
##$CPDPRG6= <mlev>
##$CPDPRG7= <mlev>
##$CPDPRG8= <mlev>
##$CPDPRGB= <>
##$CPDPRGT= <>
##$D= (0..31)
0 1.2 0 0 0 0 0 0 0 0.06 0 0.03 0 0 0 0 0.0002 0 0 0 0 0 0 0 0 0 0 0 0 
0 0 0 
##$DATE= 1666777636
##$DBL= (0..7)
120 120 120 120 120 120 120 120 
##$DBP= (0..7)
150 150 150 150 150 150 150 150 
##$DBP07= 0
##$DBPNAM0= <>
##$DBPNAM1= <>
##$DBPNAM2= <>
##$DBPNAM3= <>
##$DBPNAM4= <>
##$DBPNAM5= <>
##$DBPNAM6= <>
##$DBPNAM7= <>
##$DBPOAL= (0..7)
0.5 0.5 0.5 0.5 0.5 0.5 0.5 0.5 
##$DBPOFFS= (0..7)
0 0 0 0 0 0 0 0 
##$DE= 6
##$DECBNUC= <off>
##$DECIM= 32
##$DECNUC= <off>
##$DECSTAT= 4
##$DIGMOD= 1
##$DIGTYP= 9
##$DL= (0..7)
0 120 120 120 120 120 120 120 
##$DP= (0..7)
150 150 150 150 150 150 150 150 
##$DP07= 0
##$DPNAME0= <>
##$DPNAME1= <>
##$DPNAME2= <>
##$DPNAME3= <>
##$DPNAME4= <>
##$DPNAME5= <>
##$DPNAME6= <>
##$DPNAME7= <>
##$DPOAL= (0..7)
0.5 0.5 0.5 0.5 0.5 0.5 0.5 0.5 
##$DPOFFS= (0..7)
0 0 0 0 0 0 0 0 
##$DQDMODE= 0
##$DR= 18
##$DS= 0
$$ [...]
##$SUBNAM2= <"">
##$SUBNAM3= <"">
##$SUBNAM4= <"">
##$SUBNAM5= <"">
##$SUBNAM6= <"">
##$SUBNAM7= <"">
##$SUBNAM8= <"">
##$SUBNAM9= <"">
##$SW= 18.0517283424941
##$SWIBOX= (0..15)
0 0 2 0 0 0 0 0 0 0 0 0 0 0 0 0 
##$SW_h= 3612.71676300578
##$TD= 16384
##$TD0= 1
##$TE= 0
##$TE2= 300
##$TE3= 300
##$TEG= 300
##$TL= (0..7)
0 120 120 120 120 120 120 120 
##$TP= (0..7)
150 150 150 150 150 150 150 150 
##$TP07= 0
##$TPNAME0= <>
##$TPNAME1= <>
##$TPNAME2= <>
##$TPNAME3= <>
##$TPNAME4= <>
##$TPNAME5= <>
##$TPNAME6= <>
##$TPNAME7= <>
##$TPOAL= (0..7)
0.5 0.5 0.5 0.5 0.5 0.5 0.5 0.5 
##$TPOFFS= (0..7)
0 0 0 0 0 0 0 0 
##$TUNHIN= 0
##$TUNHOUT= 0
##$TUNXOUT= 0
##$USERA1= <user>
##$USERA2= <user>
##$USERA3= <user>
##$USERA4= <user>
##$USERA5= <user>
##$V9= 5
##$VALIST= <valist>
##$VCLIST= <CCCCCCCCCCCCCCC>
##$VD= 0
##$VDLIST= <DDDDDDDDDDDDDDD>
##$VPLIST= <PPPPPPPPPPPPPPP>
##$VTLIST= <TTTTTTTTTTTTTTT>
##$WBST= 1024
##$WBSW= 4
##$XGAIN= (0..3)
0 0 0 0 
##$XL= 0
##$YL= 0
##$YMAX_a= 145246
##$YMIN_a= -276805
##$ZGOPTNS= <>
##$ZL1= 120
##$ZL2= 120
##$ZL3= 120
##$ZL4= 120
##$ABSF1= 10
##$ABSF2= 0
##$ABSG= 5
##$ABSL= 3
##$ALPHA= 0
##$AQORDER= 0
##$ASSFAC= 0
##$ASSFACI= 0
##$ASSFACX= 0
##$ASSWID= 0
##$AUNMP= <proc_1d>
##$AZFE= 0.1
##$AZFW= 0.1
##$BCFW= 1
##$BC_mod= 2
##$BYTORDP= 1
##$COROFFS= 0
##$CY= 11.3945322036743
##$DATMOD= 1
##$DC= 2
##$DFILT= <>
##$DTYPP= 0
##$F1P= 2.36226072786647
##$F2P= -0.459571619588291
##$FCOR= 0.5
##$FTSIZE= 0
##$FT_mod= 4
##$GAMMA= 1
##$GB= 0.15
##$INTBC= 1
##$INTSCL= 1
##$ISEN= 128
##$LB= 0.24
##$LEV0= 0
##$LPBIN= 0
##$MAXI= 10000
##$MC2= 0
##$MEAN= 0
##$ME_mod= 0
##$MI= 1.114404
##$NCOEF= 0
##$NC_proc= 0
##$NLEV= 6
##$NOISF1= 3.799351
##$NOISF2= 2.8
##$NSP= 1
##$NTH_PI= 0
##$NZP= 0
##$OFFSET= 15.70392
##$PC= 1
##$PHC0= -18401.81
##$PHC1= 19.6007
##$PH_mod= 1
##$PKNL= yes
##$PPARMOD= 0
##$PSCAL= 0
##$PSIGN= 0
##$REVERSE= no
##$SF= 200.130013532006
##$SI= 16384
##$SIGF1= 3
##$SIGF2= 2
##$SINO= 400
##$SIOLD= 16384
##$SREGLST= <1H.CDCl3>
##$SSB= 0
##$STSI= 0
##$STSR= 0
##$SW_p= 3612.71676300578
##$SYMM= 0
##$S_DEV= 0
##$TDeff= 0
##$TDoff= 0
##$TI= <>
##$TILT= no
##$TM1= 0
##$TM2= 0
##$TOPLEV= 0
##$USERP1= <user>
##$USERP2= <user>
##$USERP3= <user>
##$USERP4= <user>
##$USERP5= <user>
##$WDW= 1
##$XDIM= 8192
##$YMAX_p= 0
##$YMIN_p= 0
$$ End of Bruker specific parameters
$$ ---------------------------------
##NTUPLES= NMR FID
##VAR_NAME=  TIME,          FID/REAL,        FID/IMAG
##SYMBOL=    X,             R,               I
##VAR_TYPE=  INDEPENDENT,   DEPENDENT,       DEPENDENT
##VAR_FORM=  AFFN,          ASDF,            ASDF
##VAR_DIM=   8192,          8192,            8192
##UNITS=     SECONDS,       ARBITRARY UNITS, ARBITRARY UNITS
##FACTOR=    0.0002768,     1,               1
##FIRST=     0,             0,               0
##LAST=      2.2672688,     0,               0
##MIN=       0,             -276805,         0
##MAX=       2.2672688,     145246,          0
$$ Real data points
##PAGE= N=1
##DATA TABLE= (X++(R..R)), XYDATA
0 0 0 0 0 0 0 0 0 0 0 0 0 8 -8 8 -8 16 -16 24 -24 32 -40 47 -55 64 -72 87 -100 116 -135 152 -175 199 -228
33 -228 256 -291 328 -368 411 -460 515 -572 636 -706 782 -864 957 -1055 1164 -1283 1412
50 1412 -1556 1714 -1888 2084 -2303 2547 -2827 3147 -3516 3952 -4475 5114 -5913 6949 -8352
65 -8352 10365 -13513 19162 -32445 134498 -30335 -218905 115218 65648 -90617 -16197
76 -16197 79691 -31722 -37287 12579 -47355 -40135 80813 35897 -35678 -11132 13990 -31434
88 -31434 -12497 39289 23 -47264 -22053 2813 10932 -5946 13874 36757 16981 -11905
100 -11905 -30262 -4116 41550 38164 222 -31936 -4731 9224 -27041 -13665 35566 34174
112 34174 -29306 -65148 -15503 29439 27909 3578 -7465 882 -17978 -30855 471 36426
124 36426 34494 -4933 -19708 -5902 5471 6934 544 23915 28655 -29694 -48615 5260 24997
137 24997 -21238 -18884 28603 4697 -21846 8486 14713 5966 17419 1449 -36063 -18245 13789
150 13789 -6812 -1999 29334 1718 -29323 -4976 22392 20735 17581 8176 -15995 -20475 -18315
163 -18315 -16947 5666 16831 6624 -10356 -27446 -9718 33054 26491 -16783 -219 30370
175 30370 -18053 -38674 22309 31018 -11735 -740 14303 -19004 -16065 17671 986 -11688
187 -11688 11593 -2459 -29135 -3732 20692 918 -3933 10776 -1018 -13632 -6186 658 11064
200 11064 13616 -10045 -25366 -785 22488 11019 5607 19214 10235 -19656 -21661 7835 19772
213 19772 -2306 -17807 -8938 -4421 -12119 -7843 8535 17961 10822 -10723 -16731 3601 10332 -3496
227 -3496 -1247 8625 -3347 -12504 -326 5378 8604 15840 -867 -13826 8650 8802 -18915 1220
241 1220 31253 -2875 -31475 -6108 4091 -4052 11881 7415 -21604 -6152 15308 -10198 -7281
254 -7281 30616 11209 -27946 -8322 14797 -5170 -9052 14285 12452 -9007 -16274 -5624 14224
267 14224 21773 2462 -11195 2147 6601 -9090 -14083 1622 15385 3377 -19541 -11112 13118
280 13118 5076 -9054 11061 18382 -12846 -19196 5288 3628 -4391 7093 -1455 -18502 -2654
293 -2654 12372 307 3892 17942 1988 -16433 -4239 9977 5320 -1804 94 1965 -5440
306 -5440 -13145 -1623 18128 9699 -8795 -8781 -3597 1317 5062 -4338 -6528 10717 6174 -23455
320 -23455 -14429 18604 10071 -8780 4365 7539 -8366 -5494 7893 9045 8121 2117 -9543 -4878
334 -4878 3536 -2358 -1308 8259 635 -11265 -7789 -607 6386 12829 -552 -13416 -355 3103
348 3103 -9543 -288 13187 -973 -10980 -1437 -1827 925 15614 6857 -7590 6020 6362 -16601
362 -16601 -6235 18800 3369 -14375 -2376 1601 -5648 -360 4530 2995 7513 438 -15610
375 -15610 -6290 12448 6275 -3416 -190 -1038 -4281 -3537 818 9069 10451 -5658 -13429 -474 3942
390 3942 -2628 2371 6327 -3323 -5901 -1906 -776 7003 11425 -3677 -11680 1865 3301 -7271
404 -7271 202 13277 4585 -10591 -5776 6856 6291 -627 -166 4729 412 -9786 -10272 -2486 5225
419 5225 6970 -4224 -12900 -1389 7850 -1686 -250 13647 5598 -10978 -3123 7093 846 3288
433 3288 8312 -3376 -7462 1890 -1792 -2918 12105 7362 -14371 -11412 5326 2579 -4291 339
447 339 1111 -2344 -3868 -7591 -1031 10976 3266 -7479 1366 5196 -5015 -1539 10369 7981 1785
462 1785 -1571 -5505 1096 10885 1509 -7025 4329 3316 -15578 -11638 6156 4248 -5414 -4054
476 -4054 -1865 -3683 300 6049 5108 4208 3538 -3984 -8501 1272 11306 1697 -9937 -899 6326
491 6326 -4794 -3883 12088 9755 -3074 63 583 -6259 -85 3833 -6273 -6083 1100 -8818 -12362
506 -12362 8293 12124 -5066 -2921 9796 3423 -5135 332 7169 5785 -1706 -9140 -6170 3227
520 3227 3750 -811 689 1389 -1386 -2904 -2770 2556 9402 1249 -10603 -2724 5336 -2887 -3206 7738
536 7738 4617 -5632 -4440 -921 1051 6289 2281 -6937 -49 4823 -6081 -4724 9676 7476
550 7476 -5154 -5842 -1425 -318 339 -1440 -1289 3931 -1303 -10374 -91 12113 4562 -1383 3878
565 3878 1813 -3115 522 1425 558 4519 -2058 -13661 -5670 7659 604 -4869 4245 3794 -5677
580 -5677 -4061 2371 4516 4399 -707 -7521 -3666 3320 351 -3247 5044 9387 -1719 -9364 1415
595 1415 11144 3283 -3980 1886 2163 -8330 -5926 3566 2026 -778 -101 -6761 -6701 4970 2057 -5912
611 -5912 5581 9224 -10471 -11064 9890 8503 -2565 3062 3311 -4986 -198 3443 -2247 3257 8084
626 8084 -5583 -10630 2271 4404 -2479 1310 4069 -1731 -4309 -4651 -1403 6681 4818 -7029 -5518
641 -5518 2827 -1461 -4889 4155 8480 1420 -3520 -3258 358 6492 4439 -2087 538 2435 -5846
656 -5846 -7526 3705 8325 547 -5256 -2694 556 370 71 2152 3081 -870 -4777 -4479 -1169 2912
672 2912 4048 -251 -3788 447 28 -4305 2314 9934 1120 -7986 -1982 3232 -536 -374 3759 2273
688 2273 -130 -2157 -5079 407 9273 3809 -6771 -3500 2780 -2728 -5670 3556 7358 -1773 -7804
703 -7804 -2145 2791 1186 443 2504 927 -3033 -2898 -1876 295 5938 4295 -4830 -3561 4709 988
719 988 -3155 4793 6571 -2834 -5214 -729 -76 2250 3313 -2508 -2683 1993 -3355 -6353 4139 7919
735 7919 -1778 -6086 -1539 878 592 384 425 3590 2304 -6917 -4786 7261 6215 -3018 -824 2328
751 2328 -2153 -2876 1774 2948 2773 447 -4945 -4087 2970 2258 -2104 1086 2902 -2744 -5652 -593
767 -593 4120 3160 -1011 -2298 -779 -544 -751 167 2329 2862 -16 -4896 -3719 4570 5168 -2991 -1845
784 -1845 4509 -516 -6673 80 6699 3076 -1489 -2578 -2193 1093 2281 -1315 281 4273 -1676
799 -1676 -7475 -524 5017 504 -1874 499 -304 -2973 -1824 1003 3247 2407 -2566 -3905 274 2148
815 2148 658 1208 2375 1587 -509 -2971 -704 5654 3843 -3938 -3102 2085 -1298 -4436 566 3199
831 3199 199 -2433 -4435 -2672 4402 3451 -3323 -983 3702 -1851 -5318 1665 4966 1500 -951
846 -951 -1357 -368 1702 1498 1496 4602 2217 -4589 -2796 2367 658 -1017 -408 -2232 -2259 -1238 -2972 -1530
864 -1530 4738 3173 -5045 -3384 3188 1960 -117 1119 1618 476 -1175 -2536 -7 5022 2787
879 2787 -2332 -1385 1366 194 -1773 559 3545 1440 -3897 -4219 1431 2802 -2647 -945 2584 -1306
895 -1306 -5072 -990 2341 2133 1461 -745 -2553 784 2903 -293 481 4797 773 -4784 -2378 1412
911 1412 1083 29 -641 -1664 -915 -301 -1303 1787 4670 966 -2551 -1371 1023 1053 -138 -1677 598
928 598 1179 -4305 -5137 3434 5622 -1491 -2107 2750 666 -2315 -82 1897 1492 335 -3313 -4148 959
945 959 2559 -785 86 2853 -161 -3452 198 4253 3280 -281 -1537 -1048 -616 -1261 -423 916 1268
962 1268 -1054 -3863 -3183 1315 3495 -443 -2390 1025 1082 -2125 -1031 3570 3764 -347 -2129 -990
978 -990 1123 1121 -274 505 2441 -678 -4284 -860 3880 2490 -618 -631 322 -626 -2551 -2324 1591 2559
996 2559 -2759 -5462 -995 1881 -294 941 2838 1020 -195 210 221 2055 3992 182 -3902 -1015
1012 -1015 1228 -2211 -1162 3359 1559 -2465 -2059 29 1398 1832 -187 -1265 314 -1046 -3887
1027 -3887 -1953 3202 2406 -2179 -2672 1092 2210 -443 -349 3613 2741 -2472 -2559 699 1447 1406 743 -1372
1045 -1372 -881 343 -1558 -1097 2929 2553 -3059 -2853 643 179 -304 1198 1241 247 -629 -2120 -884
1062 -884 2997 1933 -2079 -1698 471 -90 -1520 253 2614 2515 -957 -3059 826 3984 177 -1787
1078 -1787 1467 1283 -2907 -2882 912 1699 282 -1289 -1279 296 832 -866 -90 2742 509 -2925 -2225
1095 -2225 598 1002 561 -388 -629 632 -127 -1618 706 3896 812 -2008 -637 387 156 785 186
1112 186 -384 1129 -189 -3521 -305 4113 550 -3907 100 1449 -2455 -1868 1726 1394 -24 -1618
1128 -1618 -1867 690 2599 53 -1173 1935 1597 -2384 -1831 2339 2564 -323 -1131 -244 983 -126
1144 -126 -465 1249 1359 -697 -1453 -1437 -529 1311 429 -1677 -753 890 -1486 -1995 2246 2282 -438 -1296
1162 -1296 -463 88 1040 -3 -428 1817 1358 -2901 -2014 3228 2494 -1030 -1219 658 86 -834 -470 498
1180 498 1891 175 -3010 -1641 1865 374 -1113 393 1048 -1448 -1890 -279 907 860 58 -1313
1196 -1313 -605 716 318 -433 1384 2323 -121 -2058 -454 1906 1244 -677 -732 662 -37 -1477 -814
1213 -814 1796 2248 -377 -2572 -1460 1142 263 -1569 5 1920 -1108 -3410 223 2739 509 -776
1229 -776 441 485 -365 264 691 1329 2391 -251 -2445 221 1819 -106 -704 1114 651 -1217 -1589
1246 -1589 -403 859 1436 -402 -2154 -691 368 -652 -927 734 1696 -447 -2008 -419 2481 1222
1262 1222 -666 506 1519 -875 -1852 518 2614 1363 -1110 -1900 265 1517 -704 -697 1755 1243
1278 1243 -2346 -2316 495 1081 305 -662 -984 -120 -71 -1351 -28 2551 1019 -1538 -644 641 58 603
1296 603 987 392 327 -134 -1645 -751 2462 1541 -1585 -894 1047 -260 -1271 486 1831 1015 -1645
1313 -1645 -2319 270 1495 -377 -1133 389 757 -1617 -1606 858 1957 769 -1243 -880 1054 696 -990
1330 -990 799 2127 -82 -1981 -679 748 867 360 -255 -418 242 -97 -1403 33 1943 246 -1287
1347 -1287 -1076 -36 265 -484 -688 -200 186 -1374 -1947 828 2550 411 -983 292 785 -83 -682
1364 -682 618 1945 421 -2257 -1373 1088 536 -808 13 1293 -142 -1483 -489 1133 1471 -75
1380 -75 -1612 -768 217 -534 -654 827 663 -467 -954 -771 498 1469 803 -257 496 877 -774 -724 1572
1399 1572 1592 -453 -1073 -920 83 428 -687 -475 1206 651 -2478 -1673 1937 1358 -1028 -475 386 -159
1417 -159 -1020 -524 848 1330 -384 -1902 -315 1479 365 -84 883 909 -156 -662 174 896 1125 -610
1435 -610 -1518 -480 -190 -972 -516 606 373 -406 -840 -674 540 1346 -135 -1091 640 180 -1553 -769
1453 -769 1636 1260 -872 -967 71 1223 520 -320 770 1430 -462 -1718 25 1542 305 -895 -300
1470 -300 0 -208 -941 -218 1206 876 -1315 -1373 280 434 45 186 785 -121 -475 -583 -171 1123 1008
1489 1008 -494 -992 183 670 -344 -19 1226 1138 -614 -1183 307 1410 588 -1113 -210 175 -722
1506 -722 -1786 -267 1422 680 -1259 -1169 587 690 -500 -130 1259 604 -1270 -1199 804 1218 287 -124
1524 -124 -116 487 -146 -702 669 1602 154 -873 -630 -256 266 287 -392 -261 257 -674 -1514 498 1757
1543 1757 -14 -1467 -137 63 -350 -94 156 839 1142 -891 -1826 749 1798 -60 -920 1121 516
1560 516 -1408 -903 1261 1204 265 -717 -490 -91 -143 -432 524 1022 -154 -1699 -1002 305 559 58 -379
1579 -379 -36 -156 -622 -138 950 1245 723 -606 -793 142 1262 2 -213 602 303 -1060 -752 875
1597 875 1044 31 -516 -396 -95 -496 -959 37 1312 -149 -1945 -668 1003 123 -576 584 601 -520
1615 -520 -932 -497 682 1358 142 -674 376 629 -257 -235 1259 828 -431 -838 -792 -1 729 163 -688
1634 -688 -237 321 -732 -764 815 942 -53 -813 -758 305 366 -260 45 825 124 -1483 -554 1106 996
1653 996 -167 -304 363 268 -546 -49 1005 1306 -637 -1465 -132 469 -504 -461 599 243 -761 -811 -146
1672 -146 152 761 -139 -432 -246 166 -447 -62 682 678 -79 -810 -227 777 1006 167 -132 327 191 -665
1692 -665 -332 976 1005 -389 -1500 -55 457 -593 -602 859 695 -1140 -1143 385 636 157 -349 -228 289
1711 289 323 -734 129 1312 432 -722 -244 731 369 326 382 333 424 -114 -810 -520 440 231 -441 -477 -331
1732 -331 -146 -302 276 628 351 -408 -1333 68 684 251 -631 -307 881 -373 -1111 556 1282 517 -732
1751 -732 -188 666 138 -578 283 658 54 -711 -826 58 598 -133 -402 -114 236 -400 -602 525 494 240
1771 240 -265 -320 25 92 -114 -86 216 336 -196 -597 231 1310 195 -322 69 439 138 -211 -31 647
1791 647 516 -1012 -1213 481 636 -725 -526 248 236 -888 -746 637 649 -165 -528 -324 231 -87 -499
1810 -499 523 918 -19 -562 -87 378 619 258 182 22 192 -320 -200 285 418 -139 -716 -519 -9 133
1830 133 -176 -199 527 91 -861 -588 671 718 -79 -375 -248 366 -203 -528 380 989 -51 -748 -48 954
1850 954 339 -155 400 658 -93 -594 -473 362 337 -489 -490 67 -124 -313 -313 260 160 15 -359 -148 523 580
1872 580 -125 -278 311 -51 -312 6 440 638 88 -543 -423 413 232 -197 221 983 -308 -923 -271 355
1892 355 325 -295 -487 -91 -111 -726 -552 820 509 -449 -530 405 473 -65 66 556 189 48 -426 -144 488
1913 488 534 -200 -397 250 319 -335 -89 348 295 -26 -507 -305 187 417 -267 -257 132 -28 -644 -232 517
1934 517 776 -217 -871 -17 572 98 -137 421 802 -333 -685 109 825 171 -207 291 314 -119 -317 -87
1954 -87 631 229 -413 -468 200 298 -289 -286 135 -4 -536 -723 -53 385 94 -88 -492 147 267 298 -73 630
1976 630 548 -430 -543 132 683 18 -260 207 263 -223 -493 -84 468 272 -729 -584 279 43 -504 108
1996 108 653 141 -578 -88 505 393 -100 139 80 251 -176 -356 351 645 -233 -274 135 -121 -83 221 -197
2017 -197 245 99 -236 -623 -64 416 -48 -471 -135 321 -69 -321 -10 476 82 -540 -526 314 281 -198 -225
2038 -225 437 479 -268 -291 373 813 -80 -465 222 186 -23 -177 166 144 33 -551 -339 435 209 -346 -160
2059 -160 0 109 -255 203 173 279 -122 -153 -254 616 562 -307 244 736 244 -503 -30 370 355 -9 -262
2080 -262 -235 559 -73 -608 -188 765 -297 -775 52 242 -414 -166 13 92 -198 -155 -260 300 462 -500 -486
2101 -486 426 213 -252 134 383 79 163 14 -247 194 464 38 -311 318 33 -436 -292 639 106 -492
2121 -492 -721 -240 161 313 -18 -61 454 -74 -549 -197 765 605 -312 -236 546 195 -389 -52 281 414 -211
2142 -211 -527 204 203 77 -422 55 310 -289 -374 -20 283 -203 -266 -167 -524 27 -368 124 63 293 40 -560
2164 -560 40 465 166 -64 309 167 -132 -182 6 467 482 -349 -550 -72 554 -402 -88 368 334 -505 -493
2185 -493 85 576 83 -364 42 -69 -190 -142 117 566 57 -356 69 215 28 114 33 -149 134 -178 -448
2206 -448 41 473 256 -14 -118 -19 -42 -53 -201 25 22 -333 -739 -179 196 -122 -309 -8 297 -340 -342 33
2228 33 711 111 -334 -145 221 -112 -223 160 178 305 -511 -100 729 376 -104 -330 211 7 -431 -109 76
2249 76 51 -332 -188 -362 81 280 114 -80 293 257 -15 -116 209 412 153 -177 -382 181 183 -264 -62 509
2271 509 107 -498 -139 403 58 -223 -98 402 183 -456 -626 -97 298 -176 -438 79 77 -146 -310 205 66
2292 66 -27 -314 -224 94 51 12 -73 -50 -9 -71 -136 421 146 37 -160 -278 143 -93 -121 -6 287 151 -366 -297
2316 -297 311 86 -161 -523 -148 14 -251 -274 523 666 -217 -357 317 411 -14 -99 56 274 -51 -366 -154
2337 -154 373 94 -252 -336 320 5 -31 -107 333 63 -140 -193 98 70 284 -279 -156 -57 -115 -139 -186 546 309
2360 309 79 -186 6 269 64 -92 138 343 44 -316 5 722 48 -419 -17 171 124 -208 -290 629 249
2381 249 -187 -55 128 146 -188 -202 66 343 -152 -338 51 184 123 -73 43 8 190 -182 115 327 58
2402 58 -6 -421 -114 283 -39 -158 -113 39 -42 -351 -187 417 129 -303 -491 -23 200 21 63 402 10 -181
2424 -181 -171 269 337 -167 -166 41 197 -41 -339 192 232 -123 -153 -208 129 -55 -59 133 89 -115 -239 -484 -157
2447 -157 295 -25 -77 -79 68 257 159 -137 300 198 -182 -369 79 304 109 -83 24 46 -222 -235 225 286
2469 286 186 -435 -73 77 50 -402 -205 62 1 -384 5 55 -69 55 -159 -4 124 -150 -124 232 199 -45
2491 -45 -204 -87 -87 -94 -92 41 -242 75 -69 -310 -257 15 55 -210 -100 95 -241 -86 151 136 -144 -399 -235
2514 -235 119 246 -117 -161 473 85 -209 -100 404 333 23 -47 -60 -87 -194 115 -11 25 59 -310 -98 102
2536 102 68 -125 299 79 38 -221 -52 -4 112 155 -315 -367 105 -4 -203 282 341 -149 -116 -153 30 106 90
2559 90 -292 -116 136 -240 -330 95 324 -266 -338 -35 143 62 -196 -20 94 -128 -273 -244 285 150 -84 -298
2581 -298 147 36 -210 70 183 131 -109 149 71 156 198 144 -125 287 523 -272 -175 199 18 -136 18 127
2603 127 109 158 -229 61 305 122 -346 -375 317 104 -308 -219 235 -84 -181 3 160 225 -205 -146 427 388 55
2626 55 -105 462 7 -233 -298 -36 68 -242 -22 -70 16 -183 57 3 -32 251 -47 -62 -120 252 9 -179 -77
2649 -77 174 50 119 -158 331 511 25 -33 100 66 -456 -186 287 -173 -27 -35 270 -39 -382 -89 -101 -8 -208
2672 -208 -306 95 241 -7 -158 -10 33 -21 -48 -63 340 57 -158 -102 23 221 144 23 -100 214 150 -159 -58
2695 -58 67 -140 -301 -168 -55 48 -317 -343 130 -46 -289 -144 147 301 37 -138 222 321 149 -44 194
2716 194 328 235 -75 -45 200 235 -48 -108 257 260 -118 77 150 85 -49 -319 -284 100 130 -201 -190 164 208 -224
2740 -224 177 149 250 255 -265 -81 107 -31 -243 263 111 -152 -92 102 434 97 -371 -104 184 118 -338 -18
2762 -18 92 354 -227 -76 107 125 -208 68 3 -142 -201 -117 120 -60 -176 -175 -175 207 -103 -163 -11 184 168 9
2786 9 -290 -302 136 88 -91 -121 123 -153 -185 86 77 162 -98 -306 10 295 -148 -74 -20 115 -83 -187 20 189
2810 189 277 -69 273 231 20 -100 -92 -116 221 258 -13 38 28 -114 95 37 -105 -57 -203 -121 145 -240 -19 -105
2834 -105 -137 -30 -27 35 88 204 2 -43 46 91 -65 -80 -94 273 -102 -241 62 217 -207 -43 -176 -12 -180
2857 -180 -179 11 231 86 51 -196 371 -17 -42 62 123 -22 -194 -461 5 133 275 46 -19 153 14 63
2879 63 -20 109 270 -184 -120 -219 265 141 -93 187 -224 -42 -244 41 6 14 -26 1 -133 -3 -317 35 45
2902 45 -91 -205 -7 -47 172 -67 93 293 -24 -196 49 -6 15 -158 -72 312 58 -174 -132 90 63 -43
2924 -43 -15 -176 -365 -96 -53 21 39 -5 72 342 -107 281 132 -191 329 -63 36 -45 197 15 203 -3 -83
2947 -83 -95 63 10 -79 113 -41 119 -225 70 19 -104 -193 -27 -243 -30 -90 0 -50 -150 -291 41 -12 -142
2970 -142 -356 -278 26 18 -143 271 100 -159 -36 -192 -113 142 -42 -69 -305 -74 -180 374 -68 -31 85 -137
2992 -137 -211 -228 59 -128 38 -255 -19 -32 -31 -116 339 111 -249 6 96 85 -80 13 8 5 -191 -114 -253 68 220
3017 220 -45 -157 131 -27 23 -81 -41 -98 179 -83 35 63 71 -56 88 77 87 -42 241 213 117 14 74 162
3041 162 119 252 324 186 145 -128 -35 208 88 -300 10 135 5 -145 -28 48 173 -143 173 -122 76 -110
3063 -110 -170 20 11 73 -61 157 -102 0 234 -205 -31 30 239 -34 176 251 60 -31 -200 62 -88 -124 55
3086 55 -35 -186 19 -12 96 -182 66 -155 190 -57 -92 82 180 106 145 -194 192 152 43 25 -50 82 91 -151
3110 -151 -86 192 5 -135 -86 -183 68 103 311 147 -28 111 -153 -301 8 129 20 -52 -173 33 -35 -315
3132 -315 37 315 -211 -97 -44 132 178 28 150 211 -43 -35 -23 291 237 142 61 21 139 185 86 159 48 -294
3156 -294 -52 -58 -58 -42 218 -36 -118 96 7 2 -26 298 110 -138 72 33 -121 -85 97 -141 160 174 24 47 8
3181 8 166 -485 -23 -76 -14 -18 58 167 -186 -433 -224 -15 -220 -278 137 123 311 -158 65 215 65 -143 102
3204 102 132 -144 84 161 -57 97 -58 -58 213 21 -191 -47 149 161 196 -232 -59 -8 145 -174 47 -13 128
3227 128 -254 -57 246 125 118 -28 158 11 295 59 116 72 265 -269 235 233 45 154 -149 -7 180 -45
3249 -45 147 -6 51 -78 -30 -121 -183 10 71 -117 223 -100 6 56 22 62 98 -28 86 219 104 -7 2 28
3273 28 103 -51 36 75 160 -385 57 35 96 92 44 18 -89 -325 10 -70 115 127 -14 183 -25 -257 -92 76
3297 76 55 86 -287 20 60 118 -243 82 60 69 191 -238 267 26 110 44 -159 -4 137 -141 9 83 -63 40
3321 40 188 22 -16 38 -39 233 -66 202 -6 131 160 -179 -133 167 51 -184 -81 -84 144 53 -74 -31 312
3344 312 -117 -77 -72 -150 123 -269 -168 99 -132 -159 174 -95 89 -23 253 211 147 330 62 34 -191 -161 -87
3367 -87 -35 64 -89 7 -229 -203 8 151 69 -58 112 -62 -191 -20 249 146 -292 -102 -74 75 -4 -29 53
3390 53 -174 -280 29 226 9 -139 -35 133 175 -78 113 129 245 24 26 209 -87 -26 -6 -195 -96 -84 -67
3413 -67 42 -144 -13 63 -170 37 -9 232 -90 168 127 -251 -179 22 -9 48 -133 236 22 -106 -50 -238 253
3436 253 186 -24 -245 292 176 -1 132 238 -95 -188 35 -249 -69 61 -28 -58 -37 -11 -18 -101 -35 9 -85 59
3460 59 289 38 374 -59 -77 -142 10 -154 -53 -73 -133 -94 90 54 -3 -51 -93 7 -30 149 -72 -5 104 74
3484 74 -165 108 93 -50 -188 82 96 -179 -300 -171 127 171 -34 -129 -154 38 -211 40 -94 -88 167 -186 -117
3507 -117 86 153 262 6 -207 -71 -225 -102 -19 43 -6 -65 -55 -122 21 50 -283 -40 110 -41 -19 0 69 -266
3531 -266 -203 44 40 -119 -71 291 137 -141 66 -2 56 -260 -88 -88 74 -121 92 201 102 158 -73 -223 11
3554 11 -80 -1 239 333 124 192 18 -82 358 46 321 -102 -31 223 -39 -252 134 25 -122 -74 120 3
3576 3 -61 -20 -66 151 -74 -251 -131 31 152 -43 25 225 -184 -111 -158 -57 29 103 15 -23 -49 22 -27 -233 -96
3601 -96 -49 -368 -135 370 -117 30 -55 87 -92 -63 -2 64 -10 124 15 -150 -13 -69 -15 -198 450 -83 203
3624 203 207 32 -131 182 263 -35 9 188 -172 -33 203 -406 -27 28 -323 147 63 8 122 -3 57 -168 -86
3647 -86 37 -96 -11 21 -57 -27 -36 77 -215 44 86 -49 227 117 44 -90 19 -157 4 -265 184 -10 -138
3670 -138 68 286 130 -152 -148 72 -164 -48 19 47 67 -46 179 -104 -26 -72 136 172 84 -47 -15 4 -10 97
3694 97 276 -99 85 -133 -199 199 -231 -92 141 -309 -180 -181 42 193 7 -48 34 223 109 -96 112 -117
3716 -117 -34 -92 -25 78 -6 36 -59 -57 16 -134 -7 -67 -90 7 130 -80 -280 -186 -77 -140 -79 -10 -421 -75 -360
3741 -360 -236 246 82 194 -47 -66 -87 -116 -57 36 -85 119 -91 134 -60 78 -144 53 -65 -76 47 -133
3763 -133 115 19 -165 -176 118 -82 -62 -51 -111 -8 -86 35 -31 206 266 102 16 52 -33 16 178 -45 25 396
3787 396 -17 -115 -104 -82 263 -17 -144 14 -26 -141 -200 104 194 -179 65 67 121 -67 1 30 -60 -321 101 85
3811 85 -94 -49 34 -235 -9 -154 141 67 274 149 -29 -61 28 165 -25 31 -105 -109 -31 -61 232 -76 -141 -109
3835 -109 43 -22 -5 -85 -38 87 -165 7 8 -12 -174 17 -34 2 156 -4 168 231 -108 -202 94 7 108 -41
3859 -41 -57 0 246 -143 -1 -121 -147 -56 -149 -113 -133 125 -136 -292 110 -78 8 9 1 -78 200 48 263 -204 2
3884 2 119 -108 -138 -153 -137 -107 141 -105 -116 2 119 -114 -10 -75 78 -82 370 -229 142 -103 71 -28 81
3907 81 -176 180 52 73 138 2 -96 71 229 190 48 -44 24 -10 -140 -55 92 126 127 35 187 -161 -110 -5 -234
3932 -234 2 -42 -282 -157 -119 -136 38 -157 58 80 16 -294 -182 -12 35 137 146 79 -254 -102 36 -185 256
3955 256 -37 -131 -21 205 -73 -112 141 -43 -112 -47 226 -72 -89 -52 54 -32 -42 -35 113 -33 98 42 109 -133
3979 -133 124 -189 -82 56 -63 -96 -45 -130 49 66 -329 -134 -13 -50 -53 -32 124 280 134 310 -268 -75 -60
4002 -60 -159 15 -201 -211 -77 133 6 -73 -24 258 222 1 -78 -47 78 102 -99 -16 140 -144 126 3 -72 -69
4026 -69 132 -90 -145 7 -7 -19 57 -123 -102 -81 65 -171 105 97 -115 172 -10 114 -132 44 49 85 -43 -144
4050 -144 -71 162 -183 -73 -31 -28 -239 -44 175 -7 -117 -35 109 227 261 -151 104 -234 -103 -10 -41 -153 59
4073 59 235 97 32 -34 -60 5 -56 -9 59 244 223 122 219 -308 132 -158 -123 -45 3 121 -19 9 -28 14 61 18
4099 18 -63 44 106 -372 -58 59 -139 -38 3 115 94 19 129 -151 326 149 -161 -114 187 151 -47 -48 -284
4122 -284 -362 47 148 138 109 175 221 -224 64 98 -36 17 -107 57 -59 91 -61 296 -153 -65 -33 -33 -33 -104 -66
4147 -66 72 79 -65 -283 114 -194 270 -58 201 -200 -152 73 113 75 -328 -243 82 75 -161 43 65 -89 372
4170 372 13 120 -10 -60 38 -130 244 -21 170 129 -83 -108 8 -20 66 -121 177 -98 66 185 -81 -248
4192 -248 39 150 -152 -394 144 51 -159 118 -102 141 143 35 -152 -60 54 -129 -4 -39 -36 -46 50 -117 21
4215 21 -35 -57 55 -303 81 -129 37 99 -66 -58 188 -52 14 184 -179 -229 12 -6 -192 -27 121 -258 90
4238 90 -47 105 112 -46 48 70 27 -260 73 106 -4 32 -289 -40 -170 -96 -164 -124 -207 139 -140 -45 331 -57
4262 -57 113 -58 -35 -11 -76 -95 46 -55 112 21 57 160 16 -53 166 100 90 -154 19 71 -167 -137 -305 203
4286 203 -30 -3 -38 -135 -86 -150 -103 99 -129 50 -58 -298 115 58 101 76 -48 -71 -30 -64 -46 76 -246 -79
4310 -79 31 47 2 -40 162 193 -50 -90 -152 -133 -176 -226 82 151 165 78 56 -81 -34 274 -81 155 232 -362 45
4335 45 -292 88 152 -143 124 100 -102 42 109 184 14 94 66 -72 -174 -181 110 7 -161 -325 -36 -89 -11 -98
4359 -98 87 -216 16 -148 197 -11 -55 -38 -88 45 -127 84 200 78 31 174 95 -12 129 -159 112 101
4381 101 -95 -152 -111 -98 108 20 118 103 -105 184 -135 106 206 101 195 11 10 269 295 -168 -28 100 56 158
4405 158 22 -14 -220 167 121 -151 194 -89 -53 -160 -71 -86 85 107 -86 -203 -39 222 -104 4 203 -218
4427 -218 51 120 340 -39 36 -44 -142 27 -326 -333 -94 86 64 250 29 26 -317 -192 -96 92 118 235 -165 -152
4451 -152 -98 26 -102 9 24 -270 -14 202 -202 25 -94 -52 33 165 15 -36 89 166 -117 -82 -199 -214 -23
4474 -23 -79 144 266 -255 52 -68 -166 -69 -246 41 -83 -36 -134 257 137 38 -195 -109 -105 -261 -128 -234 -162 14
4498 14 -99 -299 -100 -88 -77 -46 -242 18 -139 -39 -93 71 118 85 -82 -166 -204 -28 66 266 21 -238 190
4521 190 201 146 -174 71 258 183 -115 -48 87 89 -174 -25 111 28 39 47 126 -187 83 -120 -30 -12 -133 -248
4545 -248 -128 -86 98 24 125 -235 2 -205 -82 259 27 -191 -192 213 -165 -59 62 320 171 131 38 -130
4567 -130 217 -95 68 -34 -63 37 16 -43 44 117 -68 -63 -41 33 89 -136 -114 -27 182 161 170 97 -161 -61 -137 -48
4593 -48 -91 -130 -219 -33 31 -69 -125 34 -106 98 -24 46 12 -269 -127 1 -193 -212 153 -264 65 243 -113
4616 -113 78 13 -180 72 105 -138 -74 371 77 -21 -206 358 -12 36 330 -6 -204 -85 153 -283 116 -36
4638 -36 64 23 39 -74 265 167 28 -88 81 -16 163 -153 107 139 -90 132 132 135 -40 37 -120 -71 -105 50
4662 50 113 150 -5 120 -136 -179 -119 120 -253 64 -44 -192 -134 -116 -48 83 -28 -62 3 116 159 353 -37 -79
4686 -79 6 42 111 32 161 49 152 260 -139 44 55 -63 10 98 -72 0 277 -26 180 107 16 -76 -92 -210
4710 -210 -90 20 -12 -59 53 -95 6 -220 -120 187 -260 -11 229 292 -76 32 -164 -4 -267 -30 32
4731 32 -36 -169 104 14 -89 82 -186 235 54 185 -193 -208 -89 232 -54 -25 -89 -219 264 -82 -18 22 -142
4754 -142 -15 -124 94 53 -4 235 201 -169 -321 -33 -9 -150 -101 -351 77 -5 -84 -94 243 -206 230 15 13
4777 13 93 236 -88 -32 -52 -117 2 -56 -63 118 1 -82 49 120 9 -224 112 176 99 -172 89 10 -102 5
4801 5 -135 2 -41 2 -144 -91 93 -93 -301 -79 118 218 112 -176 73 88 -128 -47 106 35 -54 -40 7 206
4825 206 -81 -278 -116 30 78 -307 -4 270 -21 -18 75 -18 49 -137 -63 100 -66 -157 207 243 188 48 35 -12
4849 -12 185 139 146 9 5 24 52 152 98 -103 138 -77 13 164 8 -176 34 172 2 -195 -47 -33 -119 -211
4873 -211 31 275 211 -38 -95 19 -53 -80 122 231 41 -50 77 81 28 24 -63 104 51 -141 -197 50 -105 -93 -69
4898 -69 -5 -64 137 93 186 34 -116 55 25 -39 -342 -191 74 96 -192 -187 193 290 121 75 44 -154 142 -8
4922 -8 84 -94 38 21 -275 -16 141 64 -227 114 83 -47 -3 -127 106 -5 -29 5 -9 48 40 118 27 208 167
4947 167 142 -115 78 56 -161 58 58 -32 48 36 -42 -58 -34 -107 -7 246 67 -35 224 234 -249 -55 -151 -201 126
4972 126 75 11 103 4 -197 -1 -137 -37 234 -207 140 67 -23 119 83 42 -274 76 69 72 63 74 104 113 11 -34
4998 -34 -7 -67 -130 -81 160 43 191 164 -76 -374 -106 252 -113 135 -25 -114 -266 153 -38 345 60 -202
5020 -202 49 -51 -98 -74 -82 -47 171 67 80 -72 232 -92 -85 129 285 -249 -123 1 -257 -72 -8 94 -138
5043 -138 -133 -29 24 317 46 409 30 76 -30 -111 -1 -143 151 7 91 -195 81 122 -161 143 166 -85 -56
5066 -56 -138 -73 140 75 -100 -190 375 -77 -170 -112 12 189 -87 218 184 147 50 136 66 111 44 81 115 11 47 241
5092 241 -69 88 42 -125 -42 -101 209 4 -272 87 5 122 111 9 54 164 -36 92 90 -6 -32 221 7
5115 7 -112 15 -166 -389 -161 -56 -42 -41 -83 -132 96 -121 274 133 171 -62 -17 89 -26 77 63 -16 210 -101
5139 -101 72 -64 -358 -21 -59 61 9 -24 -246 -37 -56 -8 31 -122 21 33 -144 75 156 18 -256 -251 321
5162 321 50 139 -194 257 -81 -210 209 65 6 169 235 10 100 20 63 -155 -51 -17 142 51 -59 238 -16
5185 -16 49 128 -141 -130 -166 -243 255 -115 -109 -10 169 -126 -36 26 177 124 -248 34 27 232 -82 150 231 -20 35
5210 35 -35 -44 3 6 -177 -60 -49 -41 -109 46 168 13 64 -136 -58 -68 -16 -267 30 16 -58 -87 84 -112 -26 15 -11
5237 -11 -217 -227 74 66 32 -175 -91 74 90 93 143 -9 -50 181 -38 -43 112 -96 -93 180 208 161 -34 -147 132 85
5263 85 -8 123 105 24 49 -287 21 39 115 189 143 49 -35 55 2 -105 56 -136 305 82 82 -52 144 169 138 -172
5289 -172 109 -85 4 270 -179 -96 -3 62 55 74 58 316 -193 134 12 88 40 -157 -205 -153 162 130 -69 43
5313 43 83 -179 -270 360 78 34 -210 -124 92 -159 54 -272 -136 -33 -8 -77 64 176 0 -52 -72 -138 -102 54
5337 54 -3 31 -90 132 56 112 2 23 213 297 209 158 -66 -57 -151 158 291 84 -38 146 -304 34 173 -51
5361 -51 154 74 110 137 89 44 4 57 -118 12 180 -7 -16 28 -24 -33 -179 -157 -109 -64 -154 -23 33 96 115 -155 -47
5388 -47 82 94 74 61 146 -157 -199 37 -108 -33 117 60 17 -21 -14 82 -108 -113 8 -38 105 63 -18 -169 25 30 -111
5415 -111 295 -41 -138 117 27 -8 81 -104 62 51 5 -55 154 -198 -150 -74 99 97 34 202 52 144 70 235 -85
5440 -85 19 151 -77 -1 159 -41 165 -49 250 -143 -47 119 9 -36 15 132 41 184 -194 -39 35 -60 31
5463 31 -89 -181 153 38 64 -55 -7 -223 -62 164 79 -213 50 134 46 238 -60 -153 96 -99 129 -11 79
5486 79 24 -66 -7 156 111 214 -102 -3 121 -61 34 126 -221 -115 -194 13 174 -74 -48 -112 -100 -31 139 -70
5510 -70 -154 56 -84 0 147 199 257 -232 -50 2 78 37 -153 78 131 -22 30 87 148 49 -263 63 228 -188
5534 -188 54 -104 137 31 -104 -199 -80 -228 -122 -163 -85 -277 99 -172 95 -64 23 -50 199 -106 91 212
5556 212 1 -15 -329 -75 -101 87 153 -18 -78 6 -35 -43 -192 91 22 -101 -91 157 -81 13 -47 -98 132 -261
5580 -261 -89 -42 127 140 3 75 -316 -19 -249 -174 -74 86 -88 216 -175 137 124 -111 172 57 311 -245
5602 -245 -89 -58 -189 -112 -205 -26 -155 137 -19 -287 132 -63 107 -276 112 198 -56 76 -6 127 100 -50
5624 -50 -58 38 136 34 36 3 55 -79 -38 -167 88 81 145 174 -124 256 -117 -37 -101 -131 40 -284 -13 15 -169 -60
5650 -60 -53 75 109 90 -73 -291 -43 147 -29 -68 24 -92 -27 110 165 243 115 18 -189 -200 93 -23 -9 -10 -21
5675 -21 -152 23 -48 -28 -97 -276 1 110 102 -243 79 52 134 -42 253 107 17 16 72 -45 -20 162 13 -206
5699 -206 66 -33 31 -86 5 -110 -24 -246 -146 33 221 104 128 160 -353 -118 -27 63 231 -64 24 -97 132
5722 132 -192 117 -105 5 -93 -23 -142 157 93 -234 62 144 -68 -44 -72 -206 22 -272 120 -124 27 298
5744 298 -278 37 161 -203 26 201 -84 -32 137 114 51 4 45 211 155 -9 33 -87 -218 -12 -25 69 -52
5767 -52 189 -47 -195 -136 -15 -76 -27 -136 -40 19 -75 -107 -88 -83 -208 -282 -120 2 -125 92 -119 91 -97 -84
5791 -84 37 -57 -37 -177 26 -252 88 70 172 -94 -12 -54 72 3 115 28 -87 -14 -170 109 -23 -179 101
5814 101 -15 55 -156 -83 88 86 -92 -111 -131 49 150 -60 -61 83 50 -386 29 -12 -33 -43 24 -139 -37 -102 -144
5839 -144 -263 11 204 114 162 -275 -35 -13 95 261 -111 67 148 190 60 41 233 -246 -58 -303 -38 58
5861 58 -75 1 170 -23 -88 -298 -72 209 113 -66 -152 35 -22 47 -13 106 -305 14 -255 -259 56 179 168 77
5885 77 65 19 212 -69 -53 -54 6 -240 92 -125 -100 87 -93 -62 -147 42 71 25 -6 -53 73 159 73 -225 -35
5910 -35 52 8 46 -6 -25 243 188 52 145 -52 13 -85 -161 78 -19 -69 -37 278 -119 -46 -57 -31 -25 -285 31 123 -174
5937 -174 -66 -262 -64 -20 84 -27 -107 -102 -324 -29 150 76 156 -171 88 67 166 185 31 -96 119 140 -52
5960 -52 78 -27 -138 -8 68 28 -138 -9 60 304 -103 -54 90 -213 21 206 -28 -101 81 222 -162 -40
5982 -40 -92 -169 -116 34 -116 106 160 -321 -151 -99 88 -63 -86 114 11 28 111 235 -151 137 198 -51 -36 -59
6006 -59 -141 167 -127 155 21 -284 302 -106 17 -85 25 -108 159 -69 -167 88 -71 45 230 -246 -250 166
6028 166 -92 -242 249 -19 -271 -211 13 112 155 127 234 -14 -166 -35 16 -161 -123 136 -16 -55 -211 -99
6050 -99 -90 -102 -230 138 -188 134 135 16 -108 -137 -119 -311 -111 -278 -52 -45 102 11 82 -154 -6 -49 -83 -29 -76
6075 -76 -270 100 -138 185 -55 -47 -73 -142 19 -164 194 72 -162 32 -158 83 -16 42 -43 110 45 -227 -70
6098 -70 -260 44 -222 -172 32 -124 -172 89 -105 57 -237 -20 -14 20 172 -7 -30 -136 55 363 53 -57
6120 -57 14 -213 159 42 -124 100 -140 120 6 -31 -7 47 -325 -10 69 158 139 -62 96 -6 190 237 -18
6143 -18 -53 -79 82 -91 -45 150 226 92 -62 -5 0 -312 -7 53 -359 -123 -115 -79 -13 -2 -43 -156 -250 -164 279 168
6169 168 90 -13 192 -12 -122 -211 78 98 39 -2 93 77 -89 122 80 -100 100 218 241 43 -103 -65 -142 37
6193 37 63 81 103 146 -310 -153 63 -165 129 -145 311 9 57 96 206 49 -218 160 130 -39 -51 49 167
6216 167 151 31 60 36 5 -63 113 -118 -136 -40 17 113 73 157 -6 22 206 154 192 29 91 151 -132 -30 160
6241 160 -42 -12 281 60 89 38 102 154 34 71 1 117 -274 -233 101 -25 -81 -241 43 -5 149 295 48
6264 48 119 69 -68 113 -135 -8 -175 118 -32 -50 45 -69 103 -46 -119 -72 -79 -178 218 253 187 136 -109 -167 319
6289 319 126 1 -150 178 -172 -38 79 31 46 23 -121 158 6 -6 -127 -61 1 167 118 48 50 -154 -85 -136
6313 -136 -139 21 146 -1 -73 -132 -307 -114 13 24 -138 -135 108 23 66 -16 -195 -57 116 4 271 -118 -102 -115
6337 -115 38 177 -123 -54 223 -165 -110 75 11 176 -234 40 -185 -99 204 -47 133 -45 -62 58 21 28 -299
6360 -299 -9 86 32 55 -45 38 28 197 132 -165 43 -31 -70 25 172 125 -231 -72 -72 -86 -249 -153 -9 47 -204
6385 -204 -70 268 -195 67 80 -74 -49 162 -175 416 -52 -94 -160 -110 -108 -122 264 103 -245 183 -177 -39 39
6408 39 -100 -277 -65 -70 132 -258 118 6 -49 -114 23 -28 -316 -6 -159 30 -185 75 -125 -279 57 68
6430 68 -38 31 -13 44 243 22 111 -263 -179 -68 -35 -23 -20 -50 50 213 43 -229 42 -294 88 23 3 176
6454 176 -126 -77 137 -94 -16 24 54 -120 -91 53 304 -60 -191 76 -81 152 -261 140 45 135 -319 -32
6476 -32 98 111 -107 -83 100 195 -38 -182 34 -188 56 149 261 95 85 5 263 -188 -287 -8 119 257 120
6499 120 -322 -79 -204 173 17 -182 21 -116 -84 0 146 -155 -47 -19 -34 10 -180 2 -141 -31 186 -30
6521 -30 -61 -75 115 -127 -29 -65 -41 -158 9 112 75 66 53 92 -59 -69 37 -159 209 21 -14 106 42 100 -168
6546 -168 21 107 148 129 55 -246 58 -199 -41 -395 -191 182 -166 -60 -76 4 -39 213 50 -46 -21 -64 9 -199
6570 -199 -106 -25 77 -183 41 38 -183 138 92 -139 97 -39 -111 150 -30 -199 67 101 -91 -80 -19 187 105
6593 105 89 160 221 231 220 106 -279 26 43 -340 256 180 -32 101 224 -194 90 166 83 -122 8 -320 -129
6616 -129 -110 0 67 179 78 46 -181 28 -87 -265 91 -178 126 -94 343 54 173 120 28 4 -235 -82
6638 -82 6 -307 -195 -120 -133 127 -84 -43 66 -73 24 -262 -49 -215 91 -11 -196 -19 -29 47 -352 24 8
6661 8 113 171 -85 -226 117 -128 6 5 120 222 2 -102 -132 -270 -448 -98 -117 26 163 -55 -14 -62 2
6684 2 243 -225 302 124 30 216 45 39 44 29 -26 -105 -36 -12 146 161 -21 111 127 -97 132 -37 91 -224 296
6709 296 -20 5 114 -33 -62 -37 16 74 109 99 35 -43 87 -87 -291 -222 -33 2 82 120 -48 -162 38 37 -152
6734 -152 82 55 -55 -36 -5 -5 20 -135 61 4 55 -126 -259 9 39 -97 79 -19 71 228 42 53 -105 -4
6758 -4 -244 -53 93 -80 -20 -180 3 10 -91 -62 -52 191 -67 -353 59 130 -98 -153 -101 -61 9 207 90 301
6782 301 145 -125 -208 11 107 294 -71 57 30 -36 -142 116 35 -177 158 137 72 89 -4 -49 -36 -58 -21 -130
6806 -130 107 165 64 322 206 -93 40 -60 -148 32 54 -88 106 101 216 -203 18 -73 123 135 -126 123
6828 123 173 179 128 -203 -280 86 141 16 -141 64 -103 53 -117 108 67 158 176 54 -197 -179 -116 59 333 -7
6852 -7 -64 83 -90 -122 -174 -177 79 -239 -41 26 118 76 -71 -161 -55 120 -97 55 67 102 144 -82 -148 -59 151
6877 151 -57 -69 103 -150 83 34 83 30 296 168 123 -158 -93 114 47 -149 36 -48 -35 -266 64 -156 55
6900 55 138 -199 128 142 61 13 91 137 92 -61 14 -133 -23 7 183 99 39 87 74 -99 -53 -1 90 -76 118 -12
6926 -12 -282 102 46 17 -326 -116 -156 113 101 -22 -157 -66 -158 154 21 -190 -60 -105 -242 -19 360 -165 -67
6949 -67 -46 25 -107 39 117 174 126 -23 -69 -18 21 -5 -46 -82 -175 33 113 -155 220 142 -327 -145 -63 -4 78 -52
6975 -52 -5 -110 208 51 213 -115 19 168 66 7 -137 50 2 16 -51 -34 57 -279 -50 86 -346 -104 -179
6998 -179 14 82 175 127 38 31 130 22 -218 240 107 3 40 243 80 97 68 -134 109 17 157 -180 -33 -195
7022 -195 274 -203 -38 -191 -85 142 -65 148 -44 -216 -218 -25 89 -42 1 90 229 1 22 -110 67 62
7044 62 193 -48 102 -105 -174 -117 -290 29 151 -130 -4 219 -182 -18 -63 -14 36 49 73 -86 -110 -204 80
7067 80 144 52 93 15 222 -74 51 51 -35 152 199 174 -55 151 155 214 -93 150 86 85 -21 -35 83 -142 -15 -48
7093 -48 -2 166 -362 139 58 -94 -72 59 48 94 101 -109 -41 64 224 -126 -109 26 -79 -127 -8 -32 6 -18 47
7118 47 0 -229 91 282 17 -130 100 30 95 -186 -2 -40 -104 37 -300 -42 41 -188 220 73 -99 130
7140 130 -78 -106 -116 35 -137 245 174 -388 -212 -39 -27 -65 -185 143 103 40 -123 225 -103 -37 131 80 -191
7163 -191 85 145 292 -107 142 -48 -75 220 192 101 -43 -236 327 38 -146 -85 91 24 -125 207 40 34 -198
7186 -198 -60 -164 -99 -30 55 -155 -143 128 115 6 -157 -84 51 129 -75 -45 32 -135 48 193 135 -104 -36 121
7210 121 -82 -27 113 -4 -15 -170 -202 249 215 148 -173 351 111 -139 18 35 -44 -119 49 3 -1 -15 -22 -17 -132
7235 -132 98 -101 166 104 -170 -92 112 -134 35 183 107 -72 123 196 1 -203 144 25 -81 -64 13 66
7257 66 -29 -103 30 148 -24 -141 38 46 -4 -96 50 181 -217 32 -120 -88 -5 46 -94 71 85 -19 -196 -79
7281 -79 -129 -55 1 -144 10 180 21 -68 -101 -48 2 81 217 248 143 -150 -76 -122 -124 -37 154 -40 58 -70 -37 40
7307 40 27 -56 69 -59 16 -4 27 -115 27 2 -114 -72 13 141 151 98 -74 -67 41 198 -113 54 -49 2 37
7332 37 59 -10 -106 68 -269 77 49 156 -85 -38 14 66 143 4 38 -109 -27 -57 15 -18 -185 1 134 81 -31
7357 -31 -160 -37 55 -37 -79 -47 -15 -21 -36 45 185 74 -149 80 116 78 -97 -13 -118 -118 -139 -50 -68 -107 145 82 -80
7384 -80 -21 -3 199 41 190 77 11 -95 -126 177 -133 -60 13 186 -81 187 38 -95 390 46 19 -50 -154
7407 -154 -154 78 106 -19 -212 -39 14 -22 -59 19 -77 107 -20 59 129 -108 128 128 -127 127 -147 209 112 -7
7431 -7 4 -272 4 20 41 21 25 -14 159 -35 46 176 -34 145 -17 94 55 50 -85 4 -81 -57 12 173 -64 -233
7457 -233 -6 50 79 -104 -68 124 110 71 73 142 148 -93 72 -15 171 -23 328 114 205 -91 -85 27 125 -8 -179
7482 -179 270 -126 -49 -105 -43 -86 14 -159 -93 -63 24 159 153 125 38 -124 -40 249 30 -57 -142 -273 -105 -170 -64
7507 -64 -251 34 18 -9 -58 -131 -112 -78 24 -19 172 268 63 -165 10 -37 -75 -4 96 -75 260 92 11 231
7531 231 165 61 48 -134 -101 -96 138 126 -266 210 -134 -23 -55 -67 -119 -310 32 221 -162 -42 22 5 197 75
7555 75 182 -75 -37 -223 -23 34 35 -173 14 108 -199 -49 66 134 50 102 -53 -141 193 137 25 -168 48 -28
7579 -28 48 36 -11 -193 135 33 -38 -26 172 1 73 -203 229 -88 183 41 46 -123 -50 -122 174 190 48 89
7603 89 0 -84 -74 -139 -24 -229 -17 27 29 66 -65 -72 -112 34 74 -159 -45 -57 -129 147 -112 86 -244 -49 142
7628 142 -157 51 40 50 23 67 -19 10 172 90 -8 -136 210 -40 -11 9 62 -72 2 -57 -23 -188 -13 -25 -4
7653 -4 290 -36 -86 53 -11 47 -69 -1 -29 -103 -167 75 196 123 166 -119 -147 -42 -130 -157 -192 -105 112 -45 -60 -168
7679 -168 -151 -47 -337 -89 277 128 -66 132 101 128 165 112 -62 81 -28 -75 -16 193 149 -23 176 -40 -33
7702 -33 8 -40 -103 -130 40 134 105 19 -111 264 -4 -31 -98 29 155 -295 -26 59 -64 66 149 146 -66 428 -70
7727 -70 262 -278 -173 55 -98 162 122 237 -10 12 193 -96 -72 -238 186 -2 -135 -66 74 204 -155 -44
7749 -44 -8 210 -55 75 105 -5 -38 -156 100 -127 -63 -113 -1 148 165 68 1 196 -117 53 38 -43 -78 26
7773 26 44 -102 -134 -41 -69 -8 -106 -75 -184 136 174 108 105 21 46 51 -55 30 -177 -94 130 -8 154 28 -277 -145
7799 -145 6 -175 238 -1 -69 10 6 82 221 64 38 -19 -40 76 18 -59 10 -168 90 4 25 152 214 -141 -49
7824 -49 -41 -43 39 89 59 204 166 -23 -169 -227 24 84 -143 -50 -282 -74 60 127 -11 75 48 130 162 -31 90 104
7850 104 167 -30 -15 172 26 146 50 84 -10 54 16 -206 -20 27 -134 21 -81 8 204 -57 93 102 -145 84
7874 84 -64 -1 -140 9 8 -27 141 28 187 41 -32 -7 16 78 12 136 124 141 201 -123 -13 -66 -184 81 -223
7899 -223 6 157 77 -72 23 -55 -65 -63 23 144 -206 -14 35 16 131 -43 15 -21 35 -236 37 73 248 122
7923 122 47 54 210 122 -279 -41 -1 128 -78 -88 73 208 122 113 260 303 -43 48 -4 14 -100 39 -115 -82 111
7948 111 -34 100 225 -124 5 180 -127 -112 113 -1 42 -118 41 8 -51 -314 -5 146 -172 -8 -358
7969 -358 -32 -9 18 -122 -72 -2 -15 -106 -49 -68 -51 -46 -51 166 -10 -168 232 54 9 181 -2 -139 -148 62 191
7994 191 57 139 87 -80 130 112 71 -179 159 -232 109 -41 95 31 14 29 115 -26 -193 -118 -59 -5 -16 10
8018 10 -48 -89 132 -72 -147 -84 -48 84 -251 183 207 -146 201 -26 165 -23 -69 3 37 19 41 -37 112 117 24
8043 24 62 -72 3 188 166 134 -91 143 124 69 -131 -139 -94 -35 62 49 44 -41 -103 -96 114 -120 -71 218 -204 -62 52
8070 52 -149 102 -45 -48 119 101 344 -88 -165 169 40 -25 -163 21 -119 -126 57 8 -24 -81 214 40 -156 -77
8094 -77 -133 91 85 -95 -86 -120 341 -19 -31 145 -52 3 -13 103 90 127 206 -9 -85 121 -14 174 -41 -2 153
8119 153 70 -35 140 -49 245 -51 41 -152 -182 -113 182 272 -262 209 89 -58 165 -15 -28 22 -77 -142 -12
8142 -12 2 -182 107 8 -61 -49 2 3 -65 -154 -57 -85 -218 146 41 13 -234 102 -56 -84 -39 54 95 100 160 176 -169
8169 -169 127 210 53 -58 -86 62 21 346 -6 -73 -157 44 -2 -107 282 -116 52 -85 95 -145 46 -108
8191a08
$$ Imaginary data points
##PAGE= N=2
##DATA TABLE= (X++(I..I)), XYDATA
0 0 0 0 0 0 0 0 0 0 0 0 0 0 0 -8 8 -8 8 -8 16 -16 16 -24 24 -32 33 -40 48 -56 64 -72 83 -95 107 -121 136
35 136 -152 171 -192 216 -240 266 -294 327 -362 401 -442 487 -536 591 -651 719 -791 874 -962
54 -962 1064 -1182 1314 -1466 1647 -1862 2121 -2444 2858 -3411 4186 -5355 7304 -11143 21502
69 21502 -106464 -276805 68007 145246 -73181 -25588 132212 1603 -40498 36764 -3932
80 -3932 -21930 64306 34998 -71743 -38106 23334 -21501 -2327 38589 7155 -37356 -19033
92 -19033 27699 12766 -13106 604 2192 -8321 -37964 -33580 11238 38693 34613 -12444 -33311
105 -33311 6605 21904 1336 -2612 36434 30782 -38541 -46963 10103 52025 31031 -18750 -24901
118 -24901 -18036 -23840 -24915 -2995 32540 14313 -24924 -23033 1540 26835 23162 12408 21750
131 21750 13235 -29403 -48442 6084 31513 -23135 -25657 22760 11714 -18253 9516 32168
143 32168 7281 5642 605 -35173 -16301 17518 -4147 -15399 7383 -4693 -33769 -18
155 -18 39054 24497 12138 2940 -14415 -11668 -1627 3214 11026 12211 -7257 -26026 -24150 -4302
169 -4302 29240 22224 -24010 -12794 24122 -9019 -33088 22703 39422 -17436 -18186 12756 -12160
182 -12160 -13223 23896 14146 -9255 8549 7860 -19792 -32 26455 -335 -16431 -846 -6221
195 -6221 -18210 -6160 6612 8010 5759 -11138 -20960 5922 26522 7995 -7515 1482 -939
208 -939 -21558 -14431 19413 27813 2377 -13491 343 9689 869 1027 10903 9540 -5176 -22792
222 -22792 -22081 1294 11051 -3667 -5876 6860 -619 -9682 3745 11075 5327 4772 -6358 -17934
236 -17934 3066 12569 -11367 4 29746 819 -30109 1343 21641 3220 5041 5068 -21251
249 -21251 -11016 17000 -2900 -12206 20187 7643 -32811 -11497 21509 1486 -11082 10092
261 10092 8882 -14477 -15395 2733 17481 17146 -3945 -16678 -500 8199 -5523 -8998 7050
274 7050 15943 1036 -17911 -7344 17754 10908 -9456 3768 13339 -14255 -20837 8558 11535
287 11535 -5724 529 -96 -15751 -1870 15908 2014 -3714 7931 -3061 -19458 -3741 14299
300 14299 6104 -4245 -1802 1257 -1905 -5863 5017 19137 7639 -13058 -9487 2884 5648
313 5648 5522 -1346 -6048 6039 4366 -20302 -12559 19912 11373 -15572 -5517 5666 -9158 -6385
327 -6385 10185 8633 1754 -2645 -8709 -3087 7952 3504 -945 6578 1167 -10544 -2979 7102
341 7102 9256 8613 -3367 -14625 -1812 7496 -5544 -3098 10079 -3567 -15712 -2156 3388
354 3388 1598 10530 4589 -11527 -686 8206 -10636 -4908 20265 5501 -17243 -3234 8027
367 8027 -1487 448 7309 1965 968 -2182 -13542 -4253 14136 5865 -9112 -4915 -674 -3278 43
382 43 5021 8177 6926 -6456 -11944 3124 9505 -667 -1459 2668 -5849 -9340 -351 2443 5063
397 5063 7583 -4766 -11363 3576 8636 -3229 -653 9982 -90 -15232 -7048 7267 6913 -1634
411 -1634 -624 5772 3567 -3555 -1485 7149 9626 4349 -7472 -15108 -4448 5668 -4028 -7556
425 -7556 4943 1058 -13373 -3602 12705 5738 1385 6454 -2795 -8417 2746 3540 -1569 7709
439 7709 5636 -12973 -8516 12708 9711 -2023 991 2105 -2832 -4496 -5091 -1478 6761 -239 -13256
454 -13256 -4359 4408 -4511 -3314 8372 4754 -5086 -4933 -2570 3176 11778 4580 -4982 5062 8091
469 8091 -7091 -4914 12745 8475 -8017 -7803 -2815 -4571 -2204 2503 565 -1767 -1822 -4017 -4722
484 -4722 4671 12042 1227 -11699 -3624 5745 -3976 -6509 8226 7133 -6489 -2626 5128 1434
498 1434 4662 10071 -45 -4479 3007 -3704 -10136 5250 8377 -11100 -11647 4633 1690 -7244
512 -7244 836 8890 4586 -2568 -6153 -1253 6830 5655 -2038 -2388 -32 -2587 -2800 -110 3612 6820
528 6820 -596 -10695 -2281 7861 321 -4219 5649 3447 -7559 -4609 3228 3272 4748 720 -7415
543 -7415 -2568 4480 -3404 -4599 8630 6854 -7087 -5594 3409 4409 2931 787 -1580 537 -2895
558 -2895 -10822 -2957 8985 499 -8401 -622 2241 -1541 3428 7353 4518 4904 487 -8754 -2230
573 -2230 10314 1915 -8467 -945 1707 -7145 -4400 5537 5764 2360 -1679 -6117 -2411 4676 916
588 916 -4823 407 3796 -5885 -10802 2152 12225 4051 -5086 1849 5558 -3109 -1619 8365 5121
603 5121 -2493 -2093 -4722 -4887 4865 4102 -6245 395 6094 -10282 -11786 9584 9241 -7159 -3444
618 -3444 2243 -5029 -1324 5905 1024 1751 6799 -3644 -9174 4756 8487 -1841 -1380 2978 -2538
633 -2538 -4577 -685 2185 6936 4051 -7226 -6337 3952 853 -4954 1719 4731 -4009 -8279 -3735
648 -3735 2122 6092 4150 -2868 -866 3332 -2444 -3787 6259 8378 -2085 -7833 -2804 2115 1843
663 1843 967 1829 2012 -1220 -4215 -1645 2530 3854 2527 -2546 -5620 -1413 1069 -2728 1512 7401
679 7401 -674 -9310 -2047 6016 995 -1535 2654 779 -3029 -2938 -2643 1880 8785 2787 -7321 -3167
695 -3167 5521 1120 -3424 4053 6866 -3311 -8515 -1179 4817 2008 -1259 627 -449 -3878 -2471
710 -2471 230 1779 3750 851 -6690 -5466 4140 2210 -3378 2810 5854 -3466 -5417 2214 4024
725 4024 3027 2975 -1709 -3309 2131 -126 -4002 3831 7362 -3956 -8273 -438 3247 1099 -77 -459
741 -459 522 5 -5968 -4217 7405 5823 -4996 -3615 2443 -912 -1900 3169 3764 937 -1222 -3993
757 -3993 -2123 4802 4020 -2127 -411 2343 -2590 -4673 1491 5400 1844 -3121 -3547 -602 474 -5
773 -5 598 1761 1017 -1809 -4428 -2149 4725 4703 -3400 -3870 3235 272 -5673 860 7304 1676 -4302
790 -4302 -2799 -340 2010 3188 -45 -482 2760 -945 -6002 896 7049 541 -3849 -416 40 -2416
806 -2416 -959 2294 2404 82 -3952 -4278 448 2651 -140 -757 529 -415 -1683 -2021 683 5746
822 5746 3855 -3762 -2425 3922 1807 -2161 2095 4120 -513 -3641 -3482 -941 3991 2897 -4473
837 -4473 -3084 2822 -989 -4887 1733 4847 -804 -4185 -2863 -1237 855 1173 464 2257 1494 -3639
853 -3639 -1108 5585 3911 -31 658 -221 -1571 349 -329 -961 2962 1370 -6380 -4694 3208 2358
869 2358 -2068 -415 626 -1159 -1828 -1848 715 4196 1408 -3613 -1995 2011 1353 -659 1094 3545
885 3545 936 -3750 -2522 3354 4584 -1609 -1754 2435 -761 -4567 -467 3577 893 -1674 -2569 -3455
901 -3455 -543 2576 35 -760 3127 865 -4150 -616 4471 2660 3 -665 -1791 -919 -453 -1200
917 -1200 527 2394 -709 -3604 -376 2810 2788 1229 -390 611 1160 -3217 -4165 3328 4674 -3742
933 -3742 -5157 1388 1272 -2173 907 3809 1582 -415 -2292 -2490 2010 3058 -1909 -2617 751 -1280
949 -1280 -4007 82 4279 2522 -1529 -1393 488 1503 1418 1376 1855 981 -1587 -2907 -1223 2504 2835
966 2835 -1573 -3441 -356 615 -2319 -1571 2735 1953 -2423 -3090 48 2182 1798 -89 40 1431 -783
983 -783 -3495 -71 4671 1821 -1941 -1391 991 563 -162 864 2943 2939 -2267 -4935 -684 2435 -981
1000 -981 -2451 -156 -1475 -3054 -848 1229 1996 3334 277 -3146 306 3429 -11 -913 2777 797
1016 797 -3894 -2110 1118 1916 1612 216 -544 426 283 -1890 -186 3377 1395 -3727 -4164 216 1611
1033 1611 -1190 -1648 1748 1557 -3145 -2270 2266 3084 1071 39 -1199 -1115 929 168 -369 2817 2192
1050 2192 -3387 -3128 1669 1221 -844 571 533 -1042 -1252 -1376 178 3096 1430 -2673 -2201 1053 490
1067 490 -1505 44 1502 403 -2499 -3081 1006 4210 608 -1923 1394 2082 -1957 -1352 2528 2323
1083 2323 -465 -2106 -1400 248 790 -163 -113 2019 461 -2636 -1156 2166 1500 -91 -1334 -1385 -193
1100 -193 -284 -1660 296 2762 233 -2865 -591 1870 878 840 543 -530 326 277 -2074 385 4394
1117 4394 559 -3841 160 2897 -1118 -1505 2368 1297 -1845 -2330 -1693 585 2011 -566 -1791 874
1133 874 1056 -2075 -1467 2626 2359 -1328 -2047 -91 863 381 -83 1176 1154 -557 -707 284 745 1775
1151 1775 668 -1835 -1348 698 -695 -2020 1515 2009 -1660 -2483 -305 964 748 238 -761 567
1167 567 623 -2661 -1990 2928 2432 -1953 -1886 1216 691 -380 39 1148 1424 -327 -2625 -795 2978
1184 2978 1425 -1523 -268 990 -1391 -1631 689 1440 237 -708 -1684 -1048 585 224 -897 638
1200 638 884 -1169 -2207 -12 2520 1467 -819 -1123 818 370 -1044 -88 2194 1855 -1011 -2253
1216 -2253 -358 2089 1329 -1031 -106 1527 -1087 -3513 281 2828 -257 -2318 -602 125 -879 -170
1232 -170 292 771 1081 -772 -2056 662 2655 446 -774 1095 652 -1102 -892 785 1729 1437 -315
1249 -315 -1812 -362 837 -77 -872 416 682 -1403 -2438 -408 2463 583 -1604 -458 1038 -710
1265 -710 -1463 920 2782 467 -1783 -1516 949 1782 -314 -752 1708 962 -2127 -1545 1399 1801 -193
1282 -193 -875 -1112 -409 22 -893 -577 1478 211 -2452 -1419 994 75 412 668 -19 -473 -114 -634
1300 -634 -175 2430 1187 -2073 -1341 1150 449 -842 568 1660 478 -1754 -1559 1077 2202 -86
1316 -86 -1240 48 480 -1189 -1206 1173 1714 -340 -2013 -1393 1051 614 -692 308 1701 -513 -1829
1333 -1829 308 1476 1136 106 -5 -414 -151 -200 -668 480 1812 325 -1512 -677 1295 1094 318
1350 318 24 6 342 -1459 -1895 425 1599 -701 -2138 -442 656 -469 -122 1117 1664 279 -2070
1367 -2070 -613 2063 1296 -992 -573 833 -188 -1571 36 1822 1431 -254 -1122 -44 1180 148
1383 148 -242 568 413 -1246 -1445 -661 386 736 -249 -988 -353 863 -344 -535 1336 1414 -364 -606
1401 -606 56 821 1180 -167 -506 777 310 -2287 -1019 2229 1451 -1558 -1218 697 -2 -430 -123 541
1419 541 905 -787 -2115 -691 1138 56 -1237 -90 159 -648 -589 741 1433 1114 59 -896 367
1436 367 945 -254 -9 695 7 -1088 -1257 -616 748 1037 -534 -883 554 747 -1082 -556 1539 869
1454 869 -1501 -1610 -127 715 -155 -539 29 866 -592 -1367 699 2084 707 -839 -175 345 136 -309
1472 -309 196 1070 442 -1600 -1210 373 888 -256 -276 131 -323 -967 -450 371 860 436 -1054 -1380 476
1491 476 917 -278 34 604 448 -1018 -1053 648 2027 693 -436 -14 836 -153 -880 243 1381 371
1509 371 -1680 -1446 691 760 -605 -167 1089 230 -1624 -823 1093 1124 -320 -778 -528 -73 96 -329
1527 -329 519 1386 4 -1043 -136 860 680 616 142 -38 9 -334 -678 598 1726 -360 -1731 -456
1545 -456 403 -202 -64 189 503 -79 -1255 -1558 589 1991 -171 -1138 796 531 -1126 -389 1716 1326
1563 1326 -500 -580 -321 498 751 45 582 991 -246 -1188 -314 1032 760 -409 -832 -441 -280 -492 -15
1582 -15 710 324 -414 -865 -916 459 1386 171 -498 313 276 -1122 -391 1333 1359 -224 -488 -59 242 467
1602 467 -134 184 1198 -473 -2081 -342 1535 365 -708 21 224 -986 -976 57 884 926 -229
1619 -229 -1252 -21 619 12 -217 1106 584 -720 -846 234 716 988 271 -662 -519 263 -354 -267 791
1638 791 769 -560 -1379 -244 285 426 -275 -180 232 -280 -1686 -435 1171 510 -1055 -553 384 11 -292
1657 -292 -20 939 1156 -621 -1068 150 1253 30 -571 751 155 -762 -709 294 667 445 -456 -1019
1675 -1019 -511 217 -370 -335 527 164 -658 -889 -145 691 744 -171 -212 273 174 -434 66 842 752 -315 -794
1696 -794 164 936 108 -522 588 584 -1027 -1179 375 943 -89 -537 -483 37 -112 -843 76 985 270 -1462
1716 -1462 -663 731 120 30 437 -65 308 -113 -253 -2 945 504 -800 -399 70 99 -20 94 494 -88
1736 -88 -473 -916 74 928 174 -749 -429 321 -542 -774 429 1387 139 -1119 -673 790 662 -177 340
1755 340 1199 261 -652 -341 802 979 359 -280 -185 576 -385 -604 503 772 -263 -664 -345 104 147 69
1775 69 -110 -270 -147 -531 -600 4 1047 -26 -805 103 542 392 176 383 639 430 -594 -338 939
1794 939 1131 -379 -736 359 62 -860 -477 491 724 -173 -614 -392 240 148 -366 423 339 -591 -1176 -434
1814 -434 769 371 -446 -316 19 207 71 5 658 739 112 -383 -455 404 596 -335 -423 121 -93 -600 -541
1835 -541 721 616 -318 -696 -37 315 -51 -571 154 542 -392 -1174 80 856 103 -354 129 662 137
1854 137 -337 222 1245 756 -448 -222 364 631 -304 1 392 -9 -250 -487 -362 414 685 -426 -419 -27
1874 -27 387 -241 99 511 560 -204 -649 -135 662 511 -139 217 685 -117 -743 279 1032 494 -218 -283 -10
1895 -10 160 -400 -379 532 305 -713 -995 203 619 -421 -287 258 63 -366 -356 -123 585 344 -373 -489
1915 -489 186 64 16 104 643 349 -40 -264 75 584 700 -437 -439 104 35 -392 -334 605 432 -416 -855 -1
1937 -1 462 -103 -314 451 463 -332 -496 492 735 -18 -568 -241 425 87 -260 218 702 9 -442 -422 240
1958 240 461 -58 75 177 183 -150 -693 173 462 -299 -363 -600 -42 67 -95 31 455 218 -96 -657 407
1979 407 636 -30 -179 260 286 -256 -342 73 789 365 -753 -286 412 318 -363 -85 393 -187 -844 -475 412
2000 412 238 -122 -257 -122 -38 -39 -370 247 579 -339 -478 -7 522 44 301 -162 178 412 -52 -257 267
2021 267 595 355 -513 -9 351 23 -481 -1 344 49 -597 -487 366 419 -454 -336 528 64 -492 -431 625
2042 625 517 -345 -302 311 429 93 205 178 573 88 -156 183 333 320 -420 -134 70 -52 -387 -173 144
2063 144 12 -82 -707 -199 150 431 -311 -262 469 90 -443 -109 359 299 -234 -223 -36 550 198 -160 288
2084 288 684 -15 -700 211 593 -237 -465 -152 5 -332 -455 -127 114 270 -288 -429 248 478 -448 -72
2104 -72 338 -6 -443 28 189 100 530 -234 -313 131 407 -137 -108 372 15 -176 -450 -103 210 -58 -222
2125 -222 -439 120 -224 -466 -275 497 297 -270 -473 447 160 -297 198 583 97 -321 -554 203 323 148
2145 148 -47 113 206 -18 -165 214 502 -229 -26 -119 -132 -93 100 13 -269 44 -165 -634 112 545 169 -224
2167 -224 103 81 -150 -234 80 345 407 -346 -486 -19 732 -161 -408 364 75 -491 -300 436 112 -227 -526
2188 -526 -6 130 -23 -460 117 513 -166 -426 -195 68 60 23 244 -64 -139 -163 -141 227 599 4 -82 -101 49
2211 49 179 51 252 375 96 -345 -268 -35 597 289 -550 -302 79 -302 -347 163 291 -369 -699 -3 309
2232 309 154 -160 -77 543 126 -376 -195 334 374 -69 -125 328 7 -15 100 94 153 144 -211 -308 68 158 -101 9
2256 9 -118 -150 -170 -76 21 296 120 -417 -133 248 36 -307 -175 516 312 -434 -200 402 269 -259 -253 255 29
2279 29 -76 40 437 483 -400 -445 44 -108 -273 -271 1 41 -321 -583 -331 183 42 -142 88 30 -243 -174 28
2302 28 378 356 -247 -135 82 321 217 -75 9 94 -147 -418 -87 547 388 -139 -435 150 189 -263 -478 107
2324 107 153 -220 -515 40 367 -132 -131 233 -11 19 -316 77 457 183 -219 -445 294 -33 -106 152 349 -6
2346 -6 -266 -288 88 272 33 -229 -242 70 43 -280 -9 178 124 -49 -190 33 252 -5 -237 204 -18 -88
2368 -88 -291 0 675 171 -432 -101 293 214 -451 -165 438 204 -435 -333 46 265 -211 -271 23 233 -344
2389 -344 -472 -268 182 -76 -199 158 1 -20 -19 35 79 403 234 132 82 388 207 -89 22 -17 -43 -291 -108
2412 -108 422 -152 -201 -194 -117 207 -184 -204 -245 55 -107 -312 -49 328 -10 -168 -58 399 37 -104 361 504
2434 504 -193 -134 50 32 93 -346 72 150 77 -160 -245 239 94 -172 -173 -85 -159 -26 -144 -129 190 141 -224 -112
2458 -112 192 271 4 -302 107 86 -265 97 167 431 87 -20 -137 339 338 -172 169 111 -302 -370 -143 95
2480 95 199 44 -127 -151 -202 -102 -169 73 324 -33 -136 115 98 189 87 91 170 33 304 -50 174 424 -112
2503 -112 -279 -103 336 -34 -419 316 288 -78 -256 -93 267 438 -273 45 48 46 -355 -167 388 266 -166 -121
2525 -121 -102 366 105 106 -77 57 -90 -283 -71 83 104 -88 1 -44 -124 -217 226 -11 175 162 80 -293 -22
2548 -22 265 -108 -30 139 -266 -279 -150 259 239 -14 -52 -93 186 116 -493 185 416 -166 -143 135 380 85 55
2571 55 -58 76 -98 -153 -41 226 96 -50 -166 298 89 -237 -160 381 -117 -195 -203 -62 -44 194 -89 -129 114
2594 114 34 -200 75 420 362 -234 -192 168 121 -134 -188 284 -1 -132 -415 -52 234 -85 -313 -12 23 -32
2616 -32 -341 268 289 86 -239 -167 47 60 126 -217 370 157 -110 -120 250 154 -25 34 -174 -280 -326 40 -45
2639 -45 -97 41 -62 -158 -179 424 -25 -189 220 36 -214 -64 78 214 192 -187 -159 -214 255 -76 -93 366 -34
2662 -34 -226 113 114 49 -230 33 -77 -89 -152 428 45 -98 -179 -262 -136 -108 -199 -250 28 -190 -246 132 -77 273
2686 273 334 -186 -103 -19 560 369 -163 31 131 175 -108 -187 24 14 -152 -168 223 145 -104 -447 -97 458 -217
2709 -217 -307 -85 254 -61 -231 40 157 49 -335 -45 84 -55 19 -326 154 250 -120 166 272 -126 -119 70
2731 70 -74 -79 -59 -204 108 31 199 -202 13 165 140 201 -220 -7 84 29 -28 182 172 68 -86 -79 399 104
2755 104 -59 195 104 168 -149 148 260 113 -60 -183 236 -120 -129 15 193 174 -213 -91 138 51 -13 -78 -191
2778 -191 -200 109 -184 -45 287 78 74 58 -15 184 217 -44 -72 -58 94 39 62 194 229 -165 -111 16 -147 -131 -9
2803 -9 -4 -76 -209 -428 41 202 14 -165 -73 93 7 -47 61 264 -153 -479 -32 176 42 -195 129 158 -37
2826 -37 -13 -200 145 26 335 -3 -74 -114 -89 -100 12 93 21 -229 -170 -9 243 -52 -211 82 87 47 43 214 12
2851 12 113 -106 91 99 97 46 -20 226 215 -176 -100 78 65 56 101 30 108 -327 -208 288 -48 -201 -87 58 -133
2876 -133 46 31 179 165 -81 -26 177 133 379 -232 -127 126 -66 -127 -36 81 55 30 -63 -4 -22 13 45 -103
2900 -103 102 160 -319 -167 -86 -117 17 -58 -62 -22 -275 61 143 28 -36 61 -14 178 16 -129 104 35 -7 -125
2924 -125 361 74 127 -23 -21 -270 -373 192 23 102 107 22 -169 27 184 36 -215 -18 230 -193 -21 78 27
2947 27 155 5 -115 387 263 -87 -5 -8 139 -120 -174 145 139 48 -196 -134 -116 -56 -268 -41 26 -67 -241 -32
2971 -32 -48 33 11 -9 -126 -214 126 -166 76 60 370 80 -384 102 -82 -165 81 -17 38 -5 -103 -7 514 106
2995 106 -155 164 159 -186 -55 49 115 163 -213 181 162 -32 -178 -27 89 -109 -199 -145 -64 16 114 45 -15 -199
3019 -199 -109 131 276 37 201 10 30 -283 -107 101 -166 -376 10 89 -257 11 239 36 -52 -78 53 41
3041 41 -7 -157 202 -33 -110 54 170 268 -84 145 150 114 56 95 -61 233 -32 -51 -80 180 89 -56 180 -160
3065 -160 198 -209 -198 -71 -19 -45 17 -154 -201 42 -238 29 221 11 -133 63 165 178 -23 171 32 -145
3087 -145 -117 113 -42 191 -94 -272 209 101 -45 -210 35 -165 -147 -222 -67 28 194 -105 -94 20 256 -335
3109 -335 128 169 243 59 -48 103 40 51 137 -18 -161 237 -21 -121 239 363 97 -98 35 -99 -128 26
3131 26 2 -36 -44 -68 96 52 -1 -135 19 120 -25 215 -12 275 147 88 24 117 -157 -65 77 86 110 -304 -123
3156 -123 -187 133 -229 58 -81 -54 -352 -111 -94 -14 21 -187 -93 -77 261 -138 57 -97 210 19 -46 -83 186
3179 186 110 50 51 66 209 -200 108 129 23 -71 -107 173 -18 -433 -39 24 8 -95 130 100 -75 -96 -103 76 -73
3204 -73 173 41 41 60 82 18 -246 -150 24 136 -89 23 12 -218 121 244 108 103 -260 -152 -69 -138 -176 -235 -77
3229 -77 -15 -239 -62 286 -18 79 -43 -96 172 39 -131 53 445 52 -273 66 128 226 -100 62 -62 82
3251 82 30 -249 19 118 -28 90 191 -131 12 -53 -154 80 127 -60 79 75 56 -59 -312 -224 239 -64 -161
3274 -161 240 261 189 15 -53 274 -29 -300 -232 36 -64 -95 83 -164 10 48 -112 -15 330 14 -22 -44 135
3297 135 -25 -83 30 183 -73 62 -65 139 218 -146 82 219 -10 48 106 -210 -184 -8 -31 7 -201 122
3319 122 -83 -107 161 -74 -369 70 159 145 -143 -179 87 100 -30 176 125 31 -123 20 200 136 22 -308 66
3342 66 110 98 -147 -414 71 33 3 153 195 161 -106 44 -241 -62 -152 -150 -186 35 -109 22 -281 112 154 71
3366 71 14 2 -26 -149 -178 149 45 -20 58 211 123 -162 98 67 68 9 -13 -58 -182 165 182 -183 -24 -118 -53 135
3392 135 76 -93 -102 -164 181 239 95 -45 -201 51 54 -76 104 -42 369 -258 -164 52 169 -135 -325 308 -123
3415 -123 93 -155 104 -37 -28 -102 -31 -356 95 -130 41 -2 -144 120 -159 114 33 -95 -13 129 -133 -203 91
3438 91 117 -43 -74 -289 127 -66 166 -18 -6 -23 252 -204 -125 99 -33 -149 10 -38 -35 -92 -275 -84 45
3461 45 205 60 98 121 38 -146 53 40 175 -15 -87 173 217 90 -208 146 -119 5 129 -161 -83 0 -606
3484 -606 -209 -151 13 10 -176 26 -104 -47 47 16 -11 53 244 -23 162 97 67 115 -84 83 -170 -108 -4 40
3508 40 202 155 -120 -1 -82 -131 -121 211 155 -148 -2 262 -146 -153 117 21 196 -122 -271 69 -97 -80 -138 259
3532 259 -39 -265 128 -4 127 -289 -43 90 -145 52 -101 39 -94 29 -167 29 -114 -81 -113 -152 -160 18
3554 18 16 -200 -36 217 62 -40 -132 -69 -160 -88 271 153 214 -155 55 237 93 -25 -42 -187 -99 -120 -97 -16
3578 -16 19 -88 -160 -258 -280 -48 -68 -299 206 28 -163 5 -11 5 99 24 243 6 158 208 -102 -83 71 -26
3602 -26 -141 292 2 -260 64 61 117 -110 290 -51 -48 -98 -36 -72 -11 -27 -7 -54 -2 -133 -105 267 81 -119 -175
3627 -175 130 -40 92 210 -224 61 -86 -111 -13 184 -45 -176 -205 -6 -281 69 -26 -152 -45 174 -14
3648 -14 217 23 38 -90 -46 35 40 -82 -358 171 212 -98 -226 -74 248 363 -75 241 61 28 39 -118 195
3671 195 -90 -60 208 -67 -130 151 265 171 58 -41 173 -148 298 159 -31 198 161 -69 1 80 60 68 261
3694 261 -19 -51 185 -147 6 268 -13 10 226 93 55 70 65 -87 -362 -303 15 3 253 183 -323 -86 -67
3717 -67 -310 32 31 87 12 -47 75 125 -84 -64 -106 -73 190 204 15 -183 -104 96 -133 154 -36 -97 -9 75 82 101
3743 101 -14 -120 296 204 -161 -60 44 -17 68 -97 77 54 41 -107 206 336 -148 -101 -65 -108 247 -62 -225
3766 -225 -81 184 130 -238 157 112 -8 -189 67 -42 205 46 -102 -30 -96 -143 -252 40 -139 -70 117 -2
3788 -2 164 -29 -35 143 -108 56 128 96 -6 -23 183 -132 192 14 24 -15 -171 -174 -144 -279 28 -274 -131 -5
3812 -5 -229 60 -30 -112 77 16 404 53 22 -8 -195 154 249 -24 -135 115 194 -33 133 86 173 -62 66 79
3836 79 37 59 -12 -178 -44 -270 42 26 -35 -93 115 -67 12 186 -56 -99 206 -7 -172 58 178 -128 145
3859 145 125 247 99 -172 113 181 -77 92 -25 75 -103 -198 -26 15 -153 57 -29 137 -210 51 45 68 208
3882 208 -2 100 -9 -181 -152 31 -171 79 -11 -233 -22 155 -100 70 180 -43 -55 177 146 144 111 -94
3904 -94 8 -126 113 149 -192 33 -172 -137 75 109 -31 33 72 1 218 20 103 298 11 318 -13 -177 -125
3927 -125 -253 -162 52 191 90 82 155 -92 -8 -21 -80 -67 -143 188 104 27 39 96 49 225 22 145 171 43 229
3952 229 -155 346 23 -167 230 156 143 -144 226 147 -53 22 -36 101 -150 -24 146 -7 -168 -150 146 -253
3974 -253 -99 -118 -177 68 -134 21 -60 -250 178 357 -77 1 152 98 -47 -163 230 -83 9 -62 34 -28 -127
3997 -127 -21 -153 165 7 -293 -219 -112 -71 21 -60 -7 -83 94 85 84 -155 -43 124 -69 -55 113 -46 -171 60
4021 60 264 35 166 48 142 66 -64 105 -111 88 -34 83 25 -113 -316 159 -119 111 12 -89 54 -56
4043 -56 -20 134 67 -22 92 32 -66 -49 -165 -22 266 -88 76 -254 68 -4 41 286 -19 -89 -348 11 70 148
4067 148 172 -44 244 125 1 -55 76 -136 -134 175 160 61 -42 -52 84 155 22 -244 47 162 77 -308 147
4090 147 77 196 -83 -137 119 -28 32 139 90 -78 -137 237 116 -26 -91 112 92 96 18 -213 -29 179 27
4113 27 -43 0 -101 41 63 -4 102 193 -159 -77 163 -48 108 -40 43 -107 59 17 -184 62 52 -229 134
4136 134 -124 -82 80 19 152 16 148 187 28 355 -22 33 50 181 136 -114 201 -3 -103 -101 -20 -141 133
4159 133 -9 51 -4 -231 -81 73 37 48 -116 -14 -163 -32 -253 68 11 110 -11 -43 33 73 152 -13 -174
4182 -174 -132 -80 -92 6 27 -175 155 127 112 -35 -86 97 -92 -1 140 -43 -252 -14 132 94 133 121 77 -20 -121
4207 -121 -13 91 -86 -27 -80 -82 -47 206 220 -144 56 220 85 -188 12 19 48 0 -148 17 -7 81 -103 217
4231 217 -4 89 -18 -235 -104 18 144 -11 89 27 27 -30 16 71 -10 19 -21 -143 138 -73 148 134 -22 -92
4255 -92 125 -152 203 -70 -112 -36 -142 -24 96 -102 -41 -178 60 -72 -41 72 -19 -8 102 145 -107 0 286
4278 286 -24 -113 -118 201 134 179 125 110 11 -105 83 -84 -218 -203 -18 26 124 -27 50 -16 18 -3 15 114 -24 -20
4304 -20 -104 127 -171 68 157 32 138 111 108 -11 172 -64 44 -28 -261 35 25 -23 313 -72 -66 43 24 129
4328 129 -192 -168 -140 55 -139 -22 60 57 -157 -26 -36 -81 -55 -96 -81 82 -13 -167 69 51 108 3 -76 35 189
4353 189 -80 -96 288 -210 -103 -88 3 135 25 -395 167 -217 127 -42 -40 -312 141 59 1 -44 -237 -17 87
4376 87 -11 154 129 -202 114 80 -40 -27 -36 -24 -142 -128 -126 -12 42 -5 -39 43 181 51 -25 166 41 158 77 15
4402 15 223 -2 -158 -201 -84 75 57 -91 52 50 -79 -145 -163 -54 -119 217 30 -87 50 171 -133 7 -137
4425 -137 51 -100 12 10 -8 -34 -3 332 -156 230 -85 -169 36 202 48 207 -106 24 -19 33 189 -141 16
4448 16 25 -32 31 18 -133 -159 -118 -166 27 119 -43 -110 84 -30 114 11 -246 50 -185 84 -98 -55 65 97
4472 97 -14 -24 218 -284 -71 62 -171 -46 121 -75 77 159 -124 30 125 39 148 -332 72 -48 -149 -4
4494 -4 -115 -114 13 -124 142 -9 121 1 73 7 -345 0 -30 210 28 -280 67 45 -187 416 112 119 -12
4517 -12 -44 -40 131 357 120 -21 -124 -193 116 -11 -51 127 6 -61 -156 -154 164 111 -182 -146 -180 85 74 150 143 -50
4543 -50 -107 93 -286 -215 -12 -14 175 -53 -36 -6 -74 37 27 -225 92 -106 63 -80 -29 -224 -55 148 114 40
4567 40 66 194 -31 -15 -113 -48 -166 103 15 -231 -249 90 25 -80 -108 144 174 -128 -216 17 -182 258 115 94
4591 94 -79 -101 42 -292 235 124 -116 -149 296 94 -51 -25 -5 238 5 -192 -236 -8 -53 -175 -99 96 220
4614 220 152 -34 188 22 -48 -79 4 8 -6 101 -22 21 -83 70 -20 -70 -251 181 34 275 -92 -39 18 86
4638 86 -118 -186 -31 -1 252 -151 -135 218 -210 -32 -66 -29 79 -117 198 4 138 36 149 -112 35 103
4660 103 28 -68 12 1 -33 -154 26 123 -62 86 -49 149 153 -51 -250 -23 140 62 -241 -203 192 -201 -72
4683 -72 -147 2 139 54 68 199 130 -129 129 25 4 -308 119 152 24 35 243 -230 17 -90 -304 -120 51
4706 51 94 -199 -1 87 -182 -110 138 38 -22 -93 -172 92 154 -41 103 -235 84 -184 -26 -93 -44 -40 -74 -100 -33
4731 -33 38 -46 118 130 -63 -110 -119 93 -21 42 107 -91 -120 -292 -144 117 -125 -326 -201 -143 -176 -162 -115 -269 -112
4756 -112 -69 -151 195 -13 237 100 56 108 56 41 46 -427 -249 -32 -123 -6 -54 138 43 108 217 132 -31 15 77
4781 77 -179 -112 60 10 166 -169 13 -228 -102 -28 -184 -4 152 -159 -190 215 -108 220 26 188 90 45
4803 45 104 -43 -79 284 -234 -84 -18 20 48 -66 -332 -23 99 -89 -11 -84 274 50 26 5 123 -26 96
4826 96 -164 83 91 -248 -91 -31 -92 72 -127 80 -35 -31 65 104 -155 -103 186 -140 3 -269 -56 -61 81 34
4850 34 96 219 90 102 -48 -179 13 29 -111 136 82 -20 -39 31 -42 -2 -79 -162 -198 111 -46 102 -169 31
4874 31 -29 -81 34 115 72 12 -95 -36 59 -108 -34 -71 -115 66 -34 77 7 -150 -8 -2 218 28 95 -3 -18 -134
4900 -134 -78 -164 172 162 -93 174 -15 -133 -61 -160 42 -226 66 -72 19 296 129 86 -182 236 -19 -111 2
4923 2 258 50 -4 25 -299 -100 -91 140 74 6 40 -88 -204 -88 -83 -130 -106 109 42 -222 203 -148 161 -187 -13
4948 -13 142 211 76 -111 -153 255 220 262 7 -4 198 40 52 -143 12 -131 122 -21 36 -223 44 -104 124
4971 124 224 -40 26 38 96 -197 132 -67 -94 -192 -70 161 64 -52 116 -72 -97 -233 99 209 -173 77
4993 77 43 -169 -136 30 46 -153 -57 -246 -21 -159 44 76 35 24 89 20 -277 -97 100 27 119 -38 -104 48
5017 48 74 88 41 131 93 -2 -240 205 155 -42 119 164 13 -81 34 81 109 -1 37 106 -92 0 -212 59 -97
5042 -97 -83 -141 -264 -39 -49 43 -7 -77 276 -128 -35 -10 191 122 -101 100 226 18 28 73 -166 81 -73 -16
5066 -16 -96 -103 -277 11 51 176 108 -32 76 -6 227 -23 -155 -97 9 -25 -4 20 -105 -159 -147 -4 -114 -9
5090 -9 103 -201 -148 -169 154 -172 27 -123 49 -1 33 20 78 44 359 38 48 -73 52 102 50 69 -110 26
5114 26 111 -122 -83 19 8 168 -260 -18 -129 -160 -1 174 28 -20 8 214 -46 -50 27 -272 59 -109 -26 -49
5138 -49 -208 1 171 -109 -109 115 -27 94 313 5 59 -116 -301 -40 104 12 13 -246 -38 251 33 -52 -67
5161 -67 -130 -242 215 -65 -123 98 -15 -28 -110 -137 -65 -113 -113 -180 141 12 234 11 80 -184 -117 172 -89 -221
5185 -221 71 -84 -48 118 228 -113 238 191 -40 -106 -395 -199 -64 -52 -54 3 65 -33 19 144 23 149 -126
5208 -126 124 73 6 168 -64 -51 120 175 212 24 118 -121 -67 -80 -15 -166 163 168 -61 159 -92 -21 -200 103
5232 103 -191 -106 87 14 -134 83 -20 -156 3 73 45 -45 116 -10 -174 -68 106 -52 98 142 7 8 43
5255 43 -153 32 163 -267 22 95 -170 -55 -3 -37 -103 -120 94 148 -61 109 16 -6 -109 112 -105 -100 62 -122
5279 -122 315 -23 -186 259 97 24 71 78 256 142 -150 58 -30 -162 133 118 -173 31 -89 -77 -326 -47
5301 -47 -50 -36 -20 -82 -184 88 103 229 -147 146 -23 174 208 -73 -264 -237 66 -113 33 156 129 -128 -88 155
5325 155 -101 -105 -23 75 -69 57 167 -126 232 -156 -119 -63 91 -33 49 119 177 207 -100 27 53 18 -132 -19
5349 -19 -101 55 -69 -60 -38 20 -139 -18 -207 -182 17 215 397 -280 87 81 -16 15 151 107 -155 203 232 99
5373 99 150 205 16 -157 -44 33 222 72 -366 9 -59 58 0 82 129 -89 155 221 123 30 -70 65 1 -76
5397 -76 17 146 199 -40 -127 69 101 134 -3 -17 74 106 -73 -33 -166 -84 76 -5 139 -30 -121 -48 24 10 27 161
5423 161 43 -77 -208 81 80 -36 -33 228 82 -64 -182 -88 159 111 -75 125 124 -40 41 -106 -368 50 108
5446 108 252 -60 47 -158 119 55 -331 -174 -106 -142 -176 101 -50 -369 -46 -164 -127 18 -89 235 -21 -70
5468 -70 27 -135 207 -82 113 47 31 18 22 113 243 -197 125 326 128 52 -253 3 -89 41 135 86 -24 47
5492 47 93 13 -39 16 75 179 -61 136 -199 -58 -54 -25 2 -208 -27 239 110 -83 100 213 -42 46 54 45 130
5517 130 112 36 24 139 73 47 -211 31 -73 -295 -125 245 80 77 50 -167 100 3 157 -88 -300 -35 -26 45
5541 45 208 73 -80 -157 -55 201 -28 -139 -30 65 93 155 159 -93 84 -29 -116 12 171 -74 130 -236 -139
5564 -139 -62 76 43 38 176 245 -103 -161 -144 -206 -176 -8 92 70 28 -5 -1 152 -75 161 145 -3 -394 106 198
5589 198 -141 146 -9 -168 150 13 -155 142 27 -199 -69 -171 16 -262 46 -28 183 28 -63 116 110
5610 110 17 -158 246 -293 -141 -100 22 80 -81 -79 -43 -13 185 -10 20 233 -227 -123 167 117 -11 38 155
5633 155 -8 155 -16 113 -9 -18 -83 166 86 270 -26 54 441 -18 -124 -77 216 83 293 182 -17 -41
5655 -41 8 -155 -85 -193 117 -39 112 -6 222 -84 -44 -19 -8 -94 32 262 102 104 -76 -104 16 -83 86 -120
5679 -120 -42 -169 -159 -10 -129 11 139 -173 -171 38 -34 -247 103 14 -142 -80 52 261 -40 -38 -30 132 251 -172
5703 -172 -202 70 220 -60 -137 84 26 -170 85 -104 -114 46 35 -157 11 -33 -9 -43 -4 50 -190 -201 -31 67
5727 67 -80 -139 -135 -119 -72 -9 -34 3 -136 -183 64 39 -44 -44 -98 -79 34 -15 205 -19 -120 246 7 29 181 -127
5753 -127 -31 55 145 94 43 3 171 -9 -11 89 135 -3 -2 -327 -3 190 135 81 -15 -127 62 85 316 163 36
5778 36 -117 28 -21 -292 171 39 -29 -5 -4 -38 -18 -222 -75 207 44 140 51 4 40 -42 -58 -153 -198 -158 -3 -118
5804 -118 -31 -159 -65 167 -14 36 73 -252 -84 -113 81 207 -91 -242 151 43 -26 -68 31 -119 66 -132 296
5827 296 -62 -212 38 134 -44 39 4 36 170 -2 -135 -19 -63 -84 -173 -89 -28 -1 -98 -95 41 118 167 117 -26
5852 -26 43 16 -229 -79 137 140 -113 62 251 70 -288 54 13 -33 83 42 -57 4 53 -127 -174 -240 -243 -276 -320 31
5878 31 -208 -45 25 4 -12 -25 -6 71 52 155 0 -101 86 29 116 24 80 52 -120 17 145 -24 -52 -119 19
5903 19 -113 -105 30 40 -155 -104 208 141 -164 65 94 112 177 -99 92 70 -54 271 66 168 -75 122 111 52
5927 52 -13 -58 151 97 94 130 105 16 171 -98 -234 122 -38 -158 -77 186 -134 33 53 54 239 80 47 124 23
5952 23 1 170 57 113 118 108 -149 -11 159 -80 -25 17 100 64 -79 308 -183 -12 -151 174 48 -95 142
5975 142 107 -98 -4 -6 56 48 153 5 61 28 30 -310 175 95 -25 135 -52 -107 -69 103 -138 60 74 -137 118
6000 118 -28 -104 -35 -108 41 -45 104 -42 -33 66 -72 68 -163 109 119 237 260 -31 -123 -72 -103 -107 -202 30 -165
6025 -165 107 287 58 204 74 44 -205 -93 93 228 -169 90 -129 -128 -169 -115 150 44 -26 195 -48 -74
6047 -74 147 -46 33 96 -128 -16 -156 58 198 -102 199 -154 83 43 -393 -9 -130 -265 -105 98 -366
6068 -366 -185 6 -101 -104 68 195 44 148 16 201 255 19 -32 63 103 -114 239 -13 33 -69 -159 -169 -33
6091 -33 -100 -4 -9 32 -220 -168 192 -123 -56 0 99 -193 -208 15 -41 -53 38 -4 -70 -2 262 48 -93 131 -5 -164
6117 -164 82 -204 31 -187 146 -188 -3 245 -432 -243 -14 22 -38 -214 100 166 -51 -30 192 -144 49
6138 49 61 -162 194 -163 52 -224 -76 -234 -232 -58 86 115 -82 237 -121 -34 58 -150 -143 224 39 125 -139
6161 -139 146 74 42 -175 -125 10 -169 -158 -132 -144 -194 -414 132 237 -16 -158 -190 -177 -93 -76 38 93 20 -96
6185 -96 89 -11 197 -102 -3 45 -108 -36 -1 67 -86 -16 89 64 -146 25 -58 -195 118 97 52 -118 -124 55
6209 55 77 14 161 -18 170 9 62 -148 100 101 -204 -89 -20 162 78 47 12 -99 165 -66 -217 -129 116 92
6233 92 -80 -73 13 127 -14 20 -19 -64 -53 -22 35 79 -3 -170 41 9 -43 -16 55 136 12 88 213 -169 -29 -35 27
6260 27 240 -111 158 -91 8 -131 33 -74 -125 -161 159 -40 -1 45 73 164 192 -188 -91 77 48 64 31 -43 100
6285 100 -4 156 208 108 -81 57 53 -34 -234 -51 22 -136 -37 295 -33 24 85 -6 -17 13 33 61 80 -46 52
6310 52 -7 175 161 -280 64 41 -63 212 145 96 -119 -56 112 184 21 93 93 -17 -59 105 67 -84 -64 -127 -13
6335 -13 186 -203 113 -182 40 159 16 100 6 283 17 137 -106 40 -266 62 81 -225 215 -6 58 -50
6357 -50 -111 86 31 -109 54 -3 -151 -38 -227 -290 184 44 318 -23 115 -197 -154 34 29 71 -34 -73 136
6380 136 -173 -65 -196 -204 -25 -27 190 19 -34 -294 26 -86 -27 -45 -84 -89 130 2 -113 -157 -108 87 56 35 -23
6405 -23 -80 281 -172 134 169 218 -149 -32 -3 217 56 -178 -28 24 161 -38 45 46 235 -70 156 169 -3
6428 -3 18 -168 -34 217 41 -50 112 46 143 208 46 143 -59 55 62 80 39 -93 79 -62 -183 222 -17 22
6452 22 171 157 -215 276 121 20 -270 -91 45 -8 -30 -197 69 -163 -106 147 85 188 -11 72 107 20 62
6475 62 15 -11 214 -177 -72 61 -41 57 35 141 -156 56 54 15 -101 -146 15 -5 155 -277 -39 -180 245
6498 245 -293 214 -113 -184 174 -137 101 -229 -37 269 41 196 208 130 0 -327 133 -69 -113 49 20 -30
6520 -30 -172 176 -106 -55 -184 -19 138 -44 148 108 11 -18 194 178 254 -121 96 139 41 110 158 -38 70 28
6544 28 337 91 31 20 215 -28 194 -35 -237 22 62 -56 28 133 -111 30 10 222 -56 -133 270 205 251
6567 251 -74 -87 44 158 153 -204 201 66 32 95 83 -79 -167 48 -43 -41 95 -4 133 -97 -104 103 -40 -146
6591 -146 49 29 -68 56 -32 -85 82 21 -172 -30 -102 179 -165 -56 -127 -332 26 20 43 151 -30 33 41 278
6615 278 -65 -120 7 42 12 65 -14 -39 -211 181 -80 -13 -130 109 29 28 -178 -23 48 26 45 106 325 23 56
6640 56 10 194 71 51 -269 118 -187 -3 -71 -152 -76 -108 120 84 38 -56 -197 201 58 49 12 126 -79 25
6664 25 91 0 196 135 17 -116 20 -15 -46 186 307 -174 -92 90 248 -113 -92 -67 87 138 101 0 148 -112
6688 -112 -171 118 -26 40 -163 114 120 305 189 -137 101 -63 109 -98 49 -142 -62 -17 -166 -52 -10 152
6710 152 177 -29 -216 88 -122 93 -1 -114 -165 121 66 -161 -178 -37 -36 132 174 -256 23 270 -221 32 -159
6733 -159 -71 76 -88 125 -63 37 25 -95 367 -180 -25 -7 -53 136 -2 -31 -158 -99 -18 53 -15 201 38
6756 38 -133 -102 -51 -10 -18 89 6 -27 -130 -58 -115 -89 -1 152 40 66 33 -7 114 149 137 15 -11 170 101 -23
6782 -23 136 -127 -113 -65 -70 -187 46 99 181 138 165 12 -342 -294 -280 24 -128 -12 -99 196 -8 -87 -6 -226 164
6807 164 -115 108 9 -125 -60 104 -70 -184 -181 -91 -157 -62 -188 -10 153 -144 260 23 76 109 36 47 -142 -46
6831 -46 123 -37 -86 -114 -200 21 252 139 -152 98 -7 -69 -167 85 -39 -253 28 -66 -290 -111 467 36
6853 36 7 -167 -195 -77 32 -5 44 26 30 125 138 -1 127 -55 72 229 71 -139 -260 -174 -100 89 -86 13
6877 13 34 258 -45 -61 -93 97 4 77 -99 125 178 -224 -222 74 -15 -49 76 -136 235 -93 177 68 -66 -23
6901 -23 26 -106 -99 66 66 43 -157 -182 159 76 -171 169 111 47 114 -103 122 -66 40 159 -74 -60 143 66 140
6926 140 115 63 -93 192 119 -179 27 -120 -25 40 -33 36 -75 198 18 -71 29 -52 8 20 -32 58 63 -118 83
6951 83 -19 12 19 38 7 276 -59 -159 308 -74 -13 -49 267 124 -40 -20 -80 62 -182 151 43 -125 -125 108
6975 108 15 12 98 1 -168 -105 16 -51 -9 -35 157 6 68 -98 -102 208 9 -22 54 111 7 -85 -2 -87 -119 -31 -9
7002 -9 41 -151 17 -196 142 -14 37 -82 32 -52 111 -97 101 -55 -101 67 1 -4 179 -91 -1 -3 275 125
7026 125 -64 141 -93 -31 75 25 -258 35 -84 7 110 -156 -154 -23 86 95 16 -102 -173 -27 175 157 -23
7049 -23 -37 -14 -119 -109 -120 43 -18 132 -87 -271 -27 117 -3 -10 140 -3 -131 -55 -119 175 144 111 -81 60
7073 60 20 47 178 -112 -107 292 3 0 -14 124 -131 -164 94 16 43 -12 -4 -125 24 51 84 -80 -64 100 16 -29
7099 -29 -185 159 -153 61 121 -64 191 99 -216 13 -102 -161 -6 98 -35 11 28 -8 -52 -172 42 153 62
7122 62 -208 112 -34 76 53 -32 -26 -211 -61 -23 -224 79 -95 -55 -104 29 227 115 -65 -105 236 161 -126
7145 -126 -29 -76 103 80 -72 16 148 -312 23 90 14 110 -76 -32 33 5 8 -53 22 -27 290 -109 -5 -198 190
7170 190 -40 -32 -189 -59 223 243 -154 17 270 -144 15 148 -177 9 158 -57 51 -228 -11 -23 -178
7191 -178 76 169 19 -8 145 42 -252 -32 -101 207 -76 -73 -9 61 2 -248 -58 82 -142 6 -45 162 213
7214 213 67 9 -21 -162 102 124 -93 -25 -50 -89 -132 -102 154 -71 113 -143 115 45 14 137 -10 117 -191
7237 -191 7 -59 95 -224 -354 -37 -124 -10 -5 239 41 132 -86 -79 112 248 54 -163 59 22 31 -171 -27
7260 -27 -149 -290 228 -24 -72 -26 70 -60 143 194 -40 -130 -111 -217 -96 -56 -115 61 57 -48 67 -16 -60 -82 -176
7285 -176 12 70 -86 -40 -207 -185 -193 69 262 -74 -364 11 -89 -174 -175 -124 78 -128 187 24 -65 -126 -40 -127
7309 -127 -147 -55 -22 90 -118 -237 1 62 -38 22 61 212 -147 -137 272 -118 -67 33 -81 -14 -43 -96 87 -7
7333 -7 -166 112 141 -14 -63 -84 118 176 70 11 141 -86 -105 103 -149 -113 -100 -33 144 68 83 33 -76 15 147
7358 147 53 -23 61 179 -57 44 -30 10 78 70 132 81 4 74 -117 -62 138 -279 274 -58 223 108 325 99
7382 99 -404 -7 26 -78 -145 62 -201 -75 22 129 16 -171 101 -128 -91 44 164 64 8 192 29 -66
7404 -66 28 3 36 134 30 21 -96 219 -7 -126 -61 -169 45 303 -23 -126 -33 171 -229 103 171 106 40 -6
7428 -6 97 73 122 136 189 -106 15 -229 170 58 -20 229 286 -31 75 49 -37 104 124 133 -141 -156 16 45 45 16
7454 16 -34 -183 -156 -74 -48 -114 -48 211 -174 55 87 73 61 -65 -143 -197 -178 71 25 -21 -64 117 22 131 -16 205
7480 205 362 -123 107 -95 -134 -274 131 169 149 -116 4 -70 12 94 -166 -3 131 -28 -28 -169 -74 100 -145
7503 -145 -279 81 89 203 105 -111 38 124 -1 112 -154 -313 -52 10 -106 -264 85 44 11 -114 -53 108 105
7526 105 -314 -66 -130 33 171 -54 -132 -45 -41 -179 -29 45 -130 19 73 -166 -87 8 -182 -54 -101 44 87 -232
7550 -232 -102 -3 13 84 8 -54 264 145 -161 14 110 151 174 119 -103 -102 -89 99 -96 -103 121 76 -61 211 195
7575 195 -119 -105 -313 -44 -2 -127 162 135 -146 52 -3 -31 -105 153 77 -93 40 -39 -5 213 114 24 39 -181
7599 -181 68 91 -110 -87 -16 91 216 105 -87 133 167 33 -16 129 12 27 220 -148 -42 40 -247 -74
7621 -74 -222 46 -154 -67 -112 213 -149 -4 91 89 181 28 -57 419 5 66 -57 118 227 90 37 -122 -148 208
7645 208 66 177 -250 48 217 -102 -141 -29 162 96 -44 283 120 -2 -147 -124 -61 80 -92 -40 151 -40
7667 -40 -30 196 284 66 229 128 -253 -1 -15 -4 -13 -150 60 -321 9 -29 -151 254 213 -44 211 43 96
7690 96 -90 -57 -232 -50 260 -137 -42 53 213 109 28 28 76 -123 33 127 266 230 -112 -156 -150 142 38 -193
7714 -193 -71 -184 -253 -65 -4 171 -45 -133 212 -63 115 65 165 -7 -258 -15 -134 36 125 -133 -1 -219
7736 -219 -319 97 -421 -62 -7 -189 -114 145 -96 -89 205 263 129 92 -329 37 14 -23 50 -100 -212 147 6
7759 6 75 -91 -138 -72 235 10 126 -22 91 98 -2 -25 27 -104 -59 10 -137 3 89 -270 51 -74 45 44 14
7784 14 -5 202 -9 -68 248 -1 -250 -112 154 -200 -52 46 -157 27 127 -88 36 44 -1 -73 -288 -189 -187 218
7808 218 -5 50 -227 160 254 -20 -207 157 -198 61 -72 -209 18 -11 39 16 40 67 -33 92 24 -17 -81
7831 -81 -11 264 -15 151 -167 -66 6 -25 -113 -95 173 144 -194 -2 -62 -93 -90 -91 -14 19 -36 87 -125 134 114 -22
7857 -22 -113 -21 66 -36 31 -114 43 -143 -27 34 -80 -61 -90 22 9 140 158 -18 -143 -9 23 90 -33 182
7881 182 162 21 -30 140 -139 -198 44 174 96 360 -8 -210 104 64 25 74 45 -21 115 146 49 230 280 -9
7905 -9 83 -8 62 86 -209 79 -187 325 86 -60 -89 42 -341 119 -119 -124 -20 -44 194 121 50 144 87 -194 246
7930 246 -234 -85 139 51 -110 99 19 -278 -1 59 -21 14 -39 -110 -104 2 159 -146 9 -164 96 -50 -16
7953 -16 261 9 -54 43 -126 83 -159 -36 82 -141 96 -182 157 30 95 -38 36 -213 260 -141 -148 121
7975 121 39 -50 -372 155 -40 -141 31 -51 -92 -118 -160 -256 -116 115 45 -2 -244 29 -24 132 22 -84 71
7998 71 190 -91 46 32 13 -36 -35 23 14 123 -84 -15 120 53 23 -43 9 64 85 -21 88 -154 -115 -207 160 65
8024 65 46 109 -39 -202 140 104 -59 27 -275 -142 -114 65 -94 -123 -46 -82 -80 60 -122 -60 -95 20 215 -23
8048 -23 -255 -21 117 19 48 -23 118 36 113 106 -155 124 233 5 -187 231 -112 -295 9 -87 -138 -206 80 -101
8072 -101 132 -8 -123 -217 -104 27 4 135 -81 -23 -92 171 97 -105 -211 155 -168 -151 161 -67 16 -58 22
8095 22 -216 30 200 -148 122 -129 -65 181 -31 -77 -241 -9 -51 -135 62 -73 -184 -69 -16 0 103 -90
8117 -90 -86 99 27 -113 167 -83 -58 -284 -142 -51 -284 114 -154 6 -127 -156 -107 99 -132 71 139 100 -220
8140 -220 130 -50 100 -1 -27 -17 32 36 146 77 -18 -2 83 -128 -118 123 -120 155 170 31 50 110 -34 -222
8164 -222 -50 -30 -217 8 -52 111 -35 -1 125 -39 -77 171 -14 117 179 -181 180 22 -29 -40 110 -117
8186 -117 82 -66 100 36 15
8191A5
##END NTUPLES=NMR FID
##END=
