##TITLE=1H_SL3(21.12)
 CDCl3, 8 sc, 
 22.12.2020
##JCAMPDX= 6.0         $$ Bruker NMR JCAMP-DX V2.0
##DATA TYPE= NMR FID
##DATA CLASS= NTUPLES
##ORIGIN= UXNMR, Bruker Analytische Messtechnik GmbH
##OWNER= root
$$ XWIN-NMR		Version 3.5
$$ Tue Dec 22 10:56:07 2020 Russian Standard Time (UT+4h)  she@DPX200
##.OBSERVE FREQUENCY= 200.1315066352
##.OBSERVE NUCLEUS= ^1H
##.DELAY= (6, 6)
##.ACQUISITION MODE= SIMULTANEOUS
##.ACQUISITION SCHEME= undefined
##.AVERAGES= 8
##.DIGITISER RES= 18
##SPECTROMETER/DATA SYSTEM= spect
##.PULSE SEQUENCE= zg30
##.SOLVENT NAME= CDCl3
##.SHIFT REFERENCE= (INTERNAL, CDCl3, 0, 15.7039)
##AUDIT TRAIL= $$ (NUMBER, WHEN, WHO, WHERE, WHAT)
$$ ##TITLE= Audit trail, XWIN-NMR		Version 3.5
$$ ##JCAMPDX= 5.01
$$ ##ORIGIN= Bruker BioSpin GmbH
$$ ##OWNER= she
$$ F:/spectra/data/she/nmr/H-F/1/audita.txt
$$ ##AUDIT TRAIL=  $$ (NUMBER, WHEN, WHO, WHERE, WHAT)
(   1,<2020-12-22 10:54:53.03 +0400>,<she>,<DPX200>,
      <created by zg, POWCHK disabled, PULCHK disabled
       configuration hash MD5:
       00 E9 B6 7A A2 85 ED C7 34 08 36 98 17 FE 4E 26
       data hash MD5: 16K
       89 87 39 D2 97 A1 16 4C 68 FE 51 57 F6 B0 27 C5>)
$$ ##END=
$$ 
$$ hash MD5
$$ 51 9D FD 88 E1 C6 BE 39 8D 10 2C 7F EE ED AE 32
##$RELAX= 
##$RELAX= 
##$RELAX= 
##$RELAX= 
##$RELAX= 
##$RELAX= 
$$ Bruker specific parameters
$$ --------------------------
##$DU= <F:/spectra>
##$EXPNO= 1
##$NAME= <H-F>
##$PROCNO= 1
##$TYPE= <nmr>
##$USER= <she>
##$AMP= (0..31)
100 100 100 100 100 100 100 100 100 100 100 100 100 100 100 100 100 100 
100 100 100 100 100 100 100 100 100 100 100 100 100 100 
##$AQSEQ= 0
##$AQ_mod= 1
##$AUNM= <au_zg>
##$AUTOPOS= <>
##$BF1= 200.13
##$BF2= 200.13
##$BF3= 200.13
##$BF4= 200.13
##$BF5= 200.13
##$BF6= 200.13
##$BF7= 200.13
##$BF8= 200.13
##$BYTORDA= 1
##$CFDGTYP= 0
##$CFRGTYP= 5
##$CHEMSTR= <none>
##$CNST= (0..31)
1 1 145 1 1 1 1 1 1 1 1 1 1 1 1 1 1 1 1 1 1 1 1 1 1 1 1 1 1 1 1 1 
##$CPDPRG= <>
##$CPDPRG1= <>
##$CPDPRG2= <>
##$CPDPRG3= <>
##$CPDPRG4= <mlev>
##$CPDPRG5= <mlev>
##$CPDPRG6= <mlev>
##$CPDPRG7= <mlev>
##$CPDPRG8= <mlev>
##$CPDPRGB= <>
##$CPDPRGT= <>
##$D= (0..31)
0 1.2 0 0 0 0 0 0 0 0.06 0 0.03 0 0 0 0 0.0002 0 0 0 0 0 0 0 0 0 0 0 0 
0 0 0 
##$DATE= 1608620092
##$DBL= (0..7)
120 120 120 120 120 120 120 120 
##$DBP= (0..7)
150 150 150 150 150 150 150 150 
##$DBP07= 0
##$DBPNAM0= <>
##$DBPNAM1= <>
##$DBPNAM2= <>
##$DBPNAM3= <>
##$DBPNAM4= <>
##$DBPNAM5= <>
##$DBPNAM6= <>
##$DBPNAM7= <>
##$DBPOAL= (0..7)
0.5 0.5 0.5 0.5 0.5 0.5 0.5 0.5 
##$DBPOFFS= (0..7)
0 0 0 0 0 0 0 0 
##$DE= 6
##$DECBNUC= <off>
##$DECIM= 32
##$DECNUC= <off>
##$DECSTAT= 4
##$DIGMOD= 1
##$DIGTYP= 9
##$DL= (0..7)
0 120 120 120 120 120 120 120 
##$DP= (0..7)
150 150 150 150 150 150 150 150 
##$DP07= 0
##$DPNAME0= <>
##$DPNAME1= <>
##$DPNAME2= <>
##$DPNAME3= <>
##$DPNAME4= <>
##$DPNAME5= <>
##$DPNAME6= <>
##$DPNAME7= <>
##$DPOAL= (0..7)
0.5 0.5 0.5 0.5 0.5 0.5 0.5 0.5 
##$DPOFFS= (0..7)
0 0 0 0 0 0 0 0 
##$DQDMODE= 0
##$DR= 18
##$DS= 0
##$DSLIST= <SSSSSSSSSSSSSSS>
$$ [...]
##$SUBNAM2= <"">
##$SUBNAM3= <"">
##$SUBNAM4= <"">
##$SUBNAM5= <"">
##$SUBNAM6= <"">
##$SUBNAM7= <"">
##$SUBNAM8= <"">
##$SUBNAM9= <"">
##$SW= 16.9725356469052
##$SWIBOX= (0..15)
0 0 2 0 0 0 0 0 0 0 0 0 0 0 0 0 
##$SW_h= 3396.73913043478
##$TD= 16384
##$TD0= 1
##$TE= 0
##$TE2= 300
##$TE3= 300
##$TEG= 300
##$TL= (0..7)
0 120 120 120 120 120 120 120 
##$TP= (0..7)
150 150 150 150 150 150 150 150 
##$TP07= 0
##$TPNAME0= <>
##$TPNAME1= <>
##$TPNAME2= <>
##$TPNAME3= <>
##$TPNAME4= <>
##$TPNAME5= <>
##$TPNAME6= <>
##$TPNAME7= <>
##$TPOAL= (0..7)
0.5 0.5 0.5 0.5 0.5 0.5 0.5 0.5 
##$TPOFFS= (0..7)
0 0 0 0 0 0 0 0 
##$TUNHIN= 0
##$TUNHOUT= 0
##$TUNXOUT= 0
##$USERA1= <user>
##$USERA2= <user>
##$USERA3= <user>
##$USERA4= <user>
##$USERA5= <user>
##$V9= 5
##$VALIST= <valist>
##$VCLIST= <CCCCCCCCCCCCCCC>
##$VD= 0
##$VDLIST= <DDDDDDDDDDDDDDD>
##$VPLIST= <PPPPPPPPPPPPPPP>
##$VTLIST= <TTTTTTTTTTTTTTT>
##$WBST= 1024
##$WBSW= 4
##$XGAIN= (0..3)
0 0 0 0 
##$XL= 0
##$YL= 0
##$YMAX_a= 196830
##$YMIN_a= -239743
##$ZGOPTNS= <>
##$ZL1= 120
##$ZL2= 120
##$ZL3= 120
##$ZL4= 120
##$ABSF1= 10
##$ABSF2= 0
##$ABSG= 5
##$ABSL= 3
##$ALPHA= 0
##$AQORDER= 0
##$ASSFAC= 0
##$ASSFACI= 0
##$ASSFACX= 0
##$ASSWID= 0
##$AUNMP= <proc_1d>
##$AZFE= 0.1
##$AZFW= 0.1
##$BCFW= 1
##$BC_mod= 2
##$BYTORDP= 1
##$COROFFS= 0
##$CY= 11.3945322036743
##$DATMOD= 1
##$DC= 2
##$DFILT= <>
##$DTYPP= 0
##$F1P= 15.9154993809931
##$F2P= -4.1035820241983
##$FCOR= 0.5
##$FTSIZE= 0
##$FT_mod= 4
##$GAMMA= 1
##$GB= 0.15
##$INTBC= 1
##$INTSCL= 1
##$ISEN= 128
##$LB= 0.24
##$LEV0= 0
##$LPBIN= 0
##$MAXI= 10000
##$MC2= 0
##$MEAN= 0
##$ME_mod= 0
##$MI= 1.114404
##$NCOEF= 0
##$NC_proc= 0
##$NLEV= 6
##$NOISF1= 3.799351
##$NOISF2= 2.8
##$NSP= 1
##$NTH_PI= 0
##$NZP= 0
##$OFFSET= 15.70392
##$PC= 1
##$PHC0= -10759.79
##$PHC1= 9.400949
##$PH_mod= 1
##$PKNL= yes
##$PPARMOD= 0
##$PSCAL= 0
##$PSIGN= 0
##$REVERSE= no
##$SF= 200.130013532006
##$SI= 16384
##$SIGF1= 3
##$SIGF2= 2
##$SINO= 400
##$SIOLD= 16384
##$SREGLST= <1H.CDCl3>
##$SSB= 0
##$STSI= 0
##$STSR= 0
##$SW_p= 3612.71676300578
##$SYMM= 0
##$S_DEV= 0
##$TDeff= 0
##$TDoff= 0
##$TI= <>
##$TILT= no
##$TM1= 0
##$TM2= 0
##$TOPLEV= 0
##$USERP1= <user>
##$USERP2= <user>
##$USERP3= <user>
##$USERP4= <user>
##$USERP5= <user>
##$WDW= 1
##$XDIM= 8192
##$YMAX_p= 0
##$YMIN_p= 0
$$ End of Bruker specific parameters
$$ ---------------------------------
##NTUPLES= NMR FID
##VAR_NAME=  TIME,          FID/REAL,        FID/IMAG
##SYMBOL=    X,             R,               I
##VAR_TYPE=  INDEPENDENT,   DEPENDENT,       DEPENDENT
##VAR_FORM=  AFFN,          ASDF,            ASDF
##VAR_DIM=   8192,          8192,            8192
##UNITS=     SECONDS,       ARBITRARY UNITS, ARBITRARY UNITS
##FACTOR=    0.0002944,     1,               1
##FIRST=     0,             0,               0
##LAST=      2.4114304,     0,               0
##MIN=       0,             -239743,         0
##MAX=       2.4114304,     196830,          0
$$ Real data points
##PAGE= N=1
##DATA TABLE= (X++(R..R)), XYDATA
0@%%%%%%%%%%%Qj6J6j6K4l2M0m8N6p2Q8j04J20j36J58j82K08k40K76l16L60m11
33b19M67n25N90o61P38q26R22j027J140j262J398j547J708j883K075k286K518
50A320k774L056l368L716m106M547n050N629o302P094q047R220j0695J2616j5229
65h373J8993k4881L5353n9126J98130L997l86720M19457j81792j77045L09095
76A47088j87263m5177K09327j93182M3841J54631j45305m9296J34031n4208n6906
87d2419J28319m9400r2301R4902p7053R276Q6611j22976P0304O0511j00572J09812
99G5014m0176q7639R0202q9781J7212R9717j18175M6013M8014q8300P7923J691
111C1715q0182N5888R262l7182L0670L2079p1118l8085R2677n1080k6672J17286
$$ y = [0, 0, 0, 0, 0, 0, 0, 0, 0, 0, 0, 0, 8, -8, 8, -8, 16, -16, 24, -24, 32, -40, 48, -56, 64, -72, 86, -96, 112, -128, 148, -168, 192, -219, 248, -277, 313, -348, 390, -436, 486, -541, 599, -663, 735, -812, 896, -987, 1088, -1198, 1320, -1454, 1602, -1766, 1950, -2156, 2391, -2659, 2970, -3332, 3762, -4285, 4935, -5760, 6856, -8373, 10620, -14261, 21092, -38034, 160096, 164093, -222627, 196830, 15038, -162007, 147088, -40175, -85352, 123975, -69207, -25366, 129265, -16040, -65336, 68695, 14487, -42419, 85900, 36500, -55801, 39101, -37952, -28676, 57935, -65041, 5263, 65774, -34798, 75014, 34838, -52801, 37401, -52380, -35168, 64549, -53626, -7613, 40401, -47899, 30024, 31715, -48467, 7421, 16683, -20499, 10171, 42250, -28868, -66953, 25724, -25356, -52028, 65258]
123F5258r6094J1302J11560j46040O1451N9500j92258J15919O9032j36923J02855
134B5562J5519q9868N8093K003k7342K5088O60k9235K9627L7837q4750J8113M6126
147B7433j02251P2819M9038p6651P7704l8706k8544P3441r8264L6726L0545r1193
159f7903J06058k6197m6014R7339j05942J8180Q3841j08014O6692K8053r0354
170d4261O7299q757n1491L6589j0914j7637K4755L4235k5517n007L9627o5743
182b6822J1070M6662q4107N2333K2818p6129Q9220k2456n7601Q1892n7163j869
194b2152O5553o2606L1725R089n6262M5040k3261k0133M2530k3103J8358K1809
206B6587j5008P245j8137n4r986p921L2563l1693J9247K7647n8395N1241l692
$$ y = [65258, -30836, -19534, 92026, -54014, 7437, 66937, -125321, -9402, 59630, -77293, 25562, 41081, -48787, 9306, 11309, -16033, 9055, 9715, -19520, 10107, 47944, -36806, -18693, 27433, -74818, -1999, 47039, -29612, 48092, 9386, -19158, 54283, -43981, -7255, 23290, -67903, 38155, 11958, -34056, 63283, -42659, -24479, 59362, -48652, 18040, 46093, -44261, 23038, 14281, -37210, -621, -11535, -29172, -4417, 29818, 4301, -706, 38921, -26822, -15752, 30910, -53197, -864, 21954, -54175, 35045, 12589, -45012, 36880, -20283, -22152, 43401, -19205, 12520, 21609, -34653, 10387, -12874, -33007, 9523, -13580, 4778, 26587, 11579, 18824, 687, 633, -9353, -17274, 15289, -16404, 2843, 30490, -27905, 23336, 19644]
219A9644o0593Q4522l4307l3064Q5613p0281j0328N2113p0248K5737L1109l5766
231a5849L4255J0215j7117r21O722j5756k9277M4048k0784k6887P5982n6870p506
244a9745P0730q9686L9619M2890r1709P9499n669p1876P9774m6072l0291O0461
256A7925m1791J4597K9845k2529J3367m060q749j1745J421P547k6914L5682K62
269D858l3668N5168l5353j8191N7165n9804K5668L8180p1533N4578m476o2879
281e0287O6480k8513k4944O4996l4104K855L6471l9529L099R708k1678J069J6133
294A756R19j4513K6191l134l2817M0613j7359k4943N7574l8666m509M8418o3470
307b3940J7522K6538n7614M5588O126l0208M6304k2519q892K0209l2099J1145
$$ y = [19644, -40949, 43573, 9266, -23798, 61815, -8466, -18794, 33319, -36929, -11192, 19917, -15849, 18406, 28621, 11504, 10583, 17305, 1549, -27728, 16320, -4464, -31351, 44631, -12239, -19745, 50985, -38701, 918, 43808, -47901, 31598, 25929, -45947, 33827, -12245, -42536, 17925, -23866, -9269, 20576, -1953, 11414, 7354, -1395, -13140, -11719, -4172, -31086, 4596, 4858, -28810, 26358, -8995, -27186, 29979, -29825, -4157, 34023, -37510, 17068, 12592, -50287, 16193, -12320, -37264, 27732, -6372, -3517, 32954, -6575, -3476, 6232, -15446, -14377, 1756, 2675, -11838, 14353, 11219, -21598, 19015, 1656, -23287, 34287, -4379, -8888, 39530, -23940, -6418, 20120, -37494, 8094, 14220, -15988, 30316, 7797, -1095, 19114, -12985, -1840]
319a840P55p310J4764j0402J4526r512q541K1956k9383J8533J0277k9121M1528
332B6230k8071j3886M0580n7607K3510K7817n2919N5038n080l4047N0781l9261
344f915p823L1271l7410J4950J3826j3429O338q96Q561k0684R153K1619l7419
357a8858L4373M794m4172N0113l1887k7424O1546n1443P587N5909n6345K6020
369A0213J9377m8521L0751r277k2417L4007j7199l694K0874j3297l841M892L899
382E767q289M374J5982k1905J0398M494l4534L2051j2212k5541N5538l1316o833
395a2026N1713n4112J0151K6426n5536L4754O120l4441L9667j3587j3486K2979
407H622j4613L9L618L889j750o588K0801k6482m516K7064l9344K3775J9390l8905
$$ y = [-1840, -1085, -8395, 6369, -4033, 10493, 981, -7560, 14396, -14987, 3546, 13823, -15298, 26230, -1841, -15727, 24853, -32754, -9244, 18573, -34346, 20692, 15612, -18435, 32346, -6915, -14738, 16533, -20877, -5927, 7899, -5530, 808, -88, 8473, -12211, -3058, 18561, -18858, 15515, 20309, -23863, 26250, -5637, -33061, 28485, -22958, -15371, 40538, -15807, 10213, 29590, -18931, 11820, 2543, -19874, 14133, -3066, -6760, 14114, 817, -3024, 1868, 5767, -2522, 1852, 17834, -4071, 6327, 10821, -23713, 8338, -3874, -29415, 26123, -5193, -12026, 39687, -14425, -4274, 22152, -33384, 1370, 7490, -26951, 12716, -871, -14357, 8622, -5991, -5952, -2334, 1555, -195, -6783, 14018, -12464, -16980, 10084, -29260, -5485, 13905, -25000]
421b5000M3585j1402k6317M4299l9528m649L1242l4051K1406Q390j9121J9663
433H517j4015K103R210j0480J0959r728R255L068k0811K3738j9904j0065L5660
446A7507k8984J7806J8910m0473L2788n864k9541L6006k4691m937K8685k3754
458f542J5907L601k2121J6724p444J646R000j2200J2163r928l824J5600k1389
471h807N921M282j0977K4874j0875l794J5857k8602J1637P598j9433K0094j5254
484g479Q93K3673k9927J7822L691l2741L3637o824j1020K7268k9761M631J4892
497H755k5567J8524j648j3165J5163j97P871r749k848Q224k3188K1576M472k4193
511a5970K9081k1093k270L3973m1511J7515J5895m0678M0122j052k6816K7782
$$ y = [-25000, 18585, 7183, -19134, 25165, -14363, -19012, 12230, -21821, -415, 7975, -11146, 8517, -5498, -3395, 5815, -4665, 6294, -3434, 5821, 8889, -11922, 11816, -8088, -18153, 17507, -11477, 6329, 25239, -15234, 17554, 11690, -17851, 18155, -6536, -11473, 17212, -6542, 9365, 12966, -9155, 7569, 125, 1771, 10771, -1429, 10734, 806, -3018, 12582, -8807, -2886, 1396, -9581, 15293, 4418, 624, 16481, -12121, -484, 7114, -12319, 7775, -7479, -6586, 17087, -12840, 4982, 8673, -24068, 9569, 2745, -8275, 18993, -10768, -6137, 8755, -16812, 1712, 64, -13101, 2062, 1865, 9736, -13, -2861, 5363, -17825, 3751, 8223, -15970, 13111, -7982, -10252, 23721, -17790, -275, 15620, -25058, 15064, 14012, -12804, 14978]
523A4978k5837O31K1636k3661J5173M155j5094J3811L381l002j2675L575O929
536D000j8678K5340k800k4708L0326k1950j761L5488m3717J3972K6467m4397L1399
549H981Q362m1300K4845l822j1874K4443r510m961R114m670l045N535K554k1690
563a7038R326K0979k9526J8897J3171m2469L1364M251k9233M1004k3544j7238
575b0056M4787l5653k73L1251m0021J0724K2771j8983J1793J159j0832L782K482
588B931j778m727J0853j3000j996L1070k9505J399K7109m2006K3473J8621l9296
601a6852L4682j2404k4716M3699k8459o702L1396l1668J0559J8151j7913N416
613E189k920l509L79K568M472j2151J2034l546j1879K7669k2063q894L0218k9884
$$ y = [14978, -10859, -10228, 11408, -12253, 2920, 7075, -8019, 5792, 9173, 6171, -6504, -2929, 4000, -14678, 10662, 7862, -16846, 13480, -8470, -10231, 25257, -18460, -4488, 21979, -22418, 8981, 17343, -23957, 888, -2934, -14808, 9635, 125, -4836, 4278, -392, -3437, 2098, 4652, -17038, -7712, 13267, -16259, 2638, 15809, -26660, 4704, 8955, -20278, 20726, -2818, -20056, 24731, -10922, -11195, 20056, -19965, -9241, 13530, -5453, 6340, 7499, -3333, 449, 2931, 1153, -3574, 7279, -5721, -7717, 23353, -6152, -4753, 22356, -19650, 3823, 22444, -16852, 17830, 5426, -19290, 24409, -4050, -10752, 20644, -11024, -465, 17686, -227, 5189, 2269, -1240, -861, 1707, 6179, -5972, 6062, 2516, -9363, 18306, -3757, -12651, 17567, -12317]
627a2317R674K1569l4060J8018J676k0734K5878j1452q452J7792j3137M658M881
640C994p686J953p334Q859q9p083J4804j3987j38J4489j9619J2992J627j8492
654a5710K3977r283p761K0650k2190M899J1553j7954J7373m925r221J7697j4686
667e581M911P340j6172J2307l324k571J1313j2770O852o33p915J3631j0891L708
681B05N955j3858J7533q865p702J8580k2042R287J1662k2886K1694o584j3419
694a0440K3835j8855K654J3386k1240J4586M71j1249J3754j0216O02N696p463
707d479Q056m790Q74K931p864J0987r930q88J3516j9829J4243O026k3019K4378
721A0212r190j4274K7776k1140k90K1026k5007J1389R874k0530J3317L07q626
$$ y = [-12317, -2643, 18926, -15134, 2884, 4560, -16174, 9704, -1748, -10200, 7592, -5545, -887, 3994, -3692, -1739, -9073, -214, -303, -7386, 7418, -6569, -6707, 7782, -11837, 1155, 2782, -15710, 8267, -1016, -8777, 11873, -10317, -5418, 6135, -11819, 5554, 629, -8592, 9105, -5581, -670, 6670, -9502, 2805, -519, -3090, 8223, -4547, 2305, 1672, -6243, 7388, -3503, 205, 6160, -7698, 9835, 970, -6732, 11848, -10194, -907, 10755, -12131, 9563, 2979, -10440, 13395, -5460, -2806, 10580, -10660, 3926, 4397, -6852, 6902, -3314, -2712, 2984, -4479, 3577, -1213, -339, 2592, -5272, 5715, -4215, -5103, 8413, -11416, 2827, 8853, -14166, 10212, 1022, -13252, 14524, -6616, -6906, 14120, -10887, 502, 10376, -10154, 3163, 3470, -5156]
734e156Q973k134q52m68K123r80n275J1006q451l318J7051j8058N233J3956k4755
749a1105J5549M771k1195K3602q782j0998K1971j7016O87J2946j6370Q137J641
762C838o265O748n603L601k648j166P576j1948R649L27j4990K0869j2837p680
776a0529K3496k4062P496J5122k6266K0204q01j9590K3965j2007p365J7456j4078
789f959K183O433o355K815q07K904m517K362O086j4191J2184j53j7071K3267j1051
804b870r627K5438k1355L953J6659k4670J5926K279j9391K1667q248q364J6817
817H214j2461K246P074q072O423j465k510M084l015J172k961K610O23o710J1381
832F633m379n931J3890j2392K289J0105j8130J2759J428j6579K0436q588r271
$$ y = [-5156, 3817, 1683, 831, 363, 2486, 1506, -3769, 7237, -1214, -4532, 12519, -5539, -306, 13650, -11105, 4444, 9215, -11980, 11622, 2840, -8158, 13813, -3203, -2516, 10430, -5940, 2197, 3838, -2427, 4321, -1282, 2319, -329, -1495, 6081, -5867, 3782, 4109, -10881, 9988, -2849, -10529, 12967, -11095, -3599, 11523, -14743, 5461, 4660, -14930, 9035, -2972, -10337, 7119, -6959, -4776, 1657, -4698, -1883, -2690, 214, -4303, -1941, 4145, -10046, 2138, 1985, -15086, 8181, -2870, -12497, 12941, -8414, -4461, 12198, -12472, 3454, 5733, -13658, 8009, -239, -8603, 8214, -4247, -2001, 5073, -2999, 3424, 1959, -551, 3533, 518, 1690, -1271, 1339, 1962, -4748, 6633, 2254, -3677, 10213, -2179, 110, 10215, -7915, 4844, 6272, -10307, 10129, 1541, -7730]
845g730J8259j3393J513R519j2072Q226j738n888P426o860K796n13j967P773j0399
860e048P885L630j5750J6255o193r463J8126j6068L706J1340j9617J4357J072
873D232j4493J6538n902m103R186p651K400l98k474K346k867N769n356K679P663
888G569j5470J2397J733j7844K1386r208j0687K3338j9800K372J6852k4749J3947
901A836Q296k0468J7792j417j3850J4065n892n159P595l934j275L399K038m459
915a433K763L653j1481Q174L627j4690J4218l186j2201J7919j0751m178J5432
928G866j5837P113Q152j4269J0887l099q754R861o994K063L203n963P817m560
942b514J653M689j0450Q253k901m893J2987j2600J807Q334j4216J2080K99r889
$$ y = [-7730, 10529, -2864, -1351, 8168, -3904, 4322, 2584, -3304, 4122, -2738, 58, -455, -2422, 5351, -5048, 2837, 6467, -9283, 6972, 779, -8684, 9442, -6626, -2920, 8420, -11197, 3160, 4232, -10261, 6277, 375, -3728, 5458, -2193, 207, -191, -2665, -319, -3186, 2583, -2773, -94, 7569, -7901, 4496, 6229, -11615, 9771, 563, -10124, 13214, -6586, -4214, 12638, -12111, 1836, 10132, -10336, 7456, 6039, -7811, 6254, 362, -4797, 2798, -1136, -2411, 988, 3026, -1433, 1330, 4983, -6498, 1676, 5303, -9387, 4831, 1645, -10556, 7363, -3388, -7566, 7866, -7971, -858, 7294, -6975, 3912, 813, -7941, 1920, -5074, -3011, 192, -5771, 2046, -2514, -861, 3828, -6622, 1631, -1270, -6163, 6824, -5776, -3969, 4365, -9851, 2229, 2528, -7361]
956g361J4061p973k83R662j1785M138q25n173Q349m706L375J287m693P764n544
971B93K371K965j1778J1225j943p655J3612j2027K81R558j2386J2534n62j1172
985d684J4633q447k447R029j3608N660P66o113J4106p508k871Q480r348M240K710
1000D598p148M646l512m13M807m196L46k032J967K053k661Q056o468m744J0835
1015F134j2195L062P481j6652J2508K747j1438J8030j0037q496J6422j2695J601
1028c528R838j3030M783K109m149N023l870M18J053J491L938n182N922n264q403
1043h851J4636q969l998J4319j4072O929Q785j4666J2181m417j1428J6786o865
1056C70m019Q666p952O80K072j26J041k602M579l013K867N114j3507P428j24j4013
$$ y = [-7361, 6700, -1273, -1556, 8106, -3679, 459, -366, -5539, 2810, -1896, 1479, 2766, -1927, 5837, 293, 2664, 5629, -6149, 5076, 3133, -4522, 9090, -2937, -2656, 6902, -5484, 7050, 6488, -4684, 9949, 1502, -945, 8084, -5524, 136, 902, -5211, 8895, 1387, -1484, 6996, -2352, 1888, 4598, -2550, 2096, -1416, -1829, 2978, -1218, -872, -2904, -937, 1116, -1545, 6511, 43, -4701, 6134, -6061, -2999, 4482, -12170, 338, 3085, -8353, 9677, -360, -8856, 7566, -5129, -3528, 6310, -6720, -1937, 172, -3977, 1046, -2824, -2406, -1353, 138, 4076, -1106, 4816, -448, -8851, 5785, -3184, -7182, 7137, -6935, -6, 8779, -5887, 6294, 1877, -9551, 7235, 370, -3649, 5017, -2935, -2255, -183, -309, 732, -1870, 2709, -304, 2563, 7677, -5830, 1598, 1474, -12539]
1072a2539J9381n819j0880K0202j3473j359J5976j8437N238P409j4762J1819J923
1085D679j1365O737q57m626M590L798l847q98P763o884m24P170j4359N151P190
1100C818j3854J5132L98j4740J7152o307q008J5222j1964K98Q969j0396O434Q40
1114B994q178O046r30P92K509k69K184n448L192P27q740Q044m793k601J2640r665
1130a496L858O149j3896R581K93q814J0698o712j247N913p275M383j942k276O175
1145C392m308N882r45n466O910r660J160O013j1621R625J198p920J2417p002k941
1160c266P906j0265N398K509p670P100m228j576L992n506M836n48j719P649n995
1175a383J598K141q450N098k358k991P628m986L295L968o329N138k944k167M925
$$ y = [-12539, 6842, 1023, -9857, 10345, -3128, -4487, 11489, -6948, -1710, 5699, -9063, 2756, 4679, -6686, 51, -806, -5432, -842, 2956, -891, -1789, 5974, -910, -1334, 5836, -8523, -3372, 3818, -10036, 5096, 5494, -9246, 7906, 1599, -6409, 8813, -3151, -2853, 6116, -4280, 2154, 2994, -5184, 862, -68, 724, 3233, 2964, 5148, -300, 2892, 3619, -5121, 2923, -1870, -4471, 8169, -1496, 2362, 8511, -5385, 4196, 4489, -4325, 6373, -339, -1586, 4327, -2948, 1435, -507, -2783, 3392, -916, 4966, 4021, -1445, 5465, -4195, -3035, 2978, -8643, 982, 2180, -5740, 6677, -325, -3266, 4640, -5625, -227, 2282, -5388, 1712, -2516, -4092, -100, -5606, -770, -1318, -3037, 4612, -1383, 215, 2356, -6094, -996, -3354, -6345, 1283, -3703, -408, 3560, -2769, 2369, -575, -2742, 2183]
1190B183n718M920p2n935P730o505l67P698q498P065L118q329R578n768n290P845
1206C655q241K310N108n569O181p82j815K925m784K884j584j124M797o329M351
1221A983J78p958R710n624j752J1180r656M492M498j2110Q198l639o689J0062
1235B873n829J672N506n496L805j633j879K672m521N025k485j942O388r084L444
1250a484L839r964J0968o42o567J2311q324j975O955j1109L881L254o325P743
1264B561j023j262L268l195J362k289N58K969m960M534j010n122P319p136P35
1279b691Q217q657O524L833r936P765m479n654Q011p220K231N841o438N537m38
1294B446l645L090l560K342j66k749M824m874O71J657o066O946k353j885Q813
$$ y = [2183, -3535, 1385, 1313, -4622, 3108, -3397, -3764, 3934, -4564, 2501, 5619, -2710, 6868, 1100, -4190, 3655, -4586, -2276, 2832, -2737, 3444, 2662, 847, 3772, -1012, 1872, 288, -836, 3961, -2368, 1983, 2161, -5797, 3913, -1711, -3463, 7717, -1939, 2553, 7051, -5059, 3139, -500, -7189, 2873, -2956, -1284, 4222, -1274, 2531, 898, -981, 1691, -2830, 2195, -290, -2232, 4156, -4928, -1484, 2355, -7609, 3359, 2717, -3850, 8461, 137, -1838, 5117, -5992, -2111, 1143, -5182, 2561, 1538, 276, 3544, 349, 1711, -578, -20, 2949, -2011, 2523, 1513, -3609, 3710, -3426, -2691, 5526, -3131, 3393, 7226, -2710, 5055, 576, -5078, 2933, -4287, -2056, 3785, -2653, 2884, 2446, -1199, 1891, -1669, 673, 507, -2242, 2582, -2292, -1621, 36, -6030, 916, -1437, -3322, 5491]
1309E491p437K412L606j0101N963k308m979R238n533J818N410o981M851j193l932
1324c675N181m566K661J418m843N091m608l74M584m928N899M18l176O416p213
1339a715J86L904q998O086J440m269Q353n291J115M802r122N872J069n974O174
1354C632k771o94K382n196L673n29j916N038j952K798j047l920N413o965q72N981
1370C055p145N814K026o073Q692n988k816P725p909K403M118o553M724j633l718
1385c278L666l204K594J765j503M148l898J024l50o057N459l507j610Q630p263
1400c384L750M598r145N851q95m455O347m919J115L869o081K494k17j603K957
1415B82k083M952o28l131M423n836J50K678p007P743p13m223R798o207j972O541
$$ y = [5491, -1946, 466, 4072, -6029, -66, -2374, -7353, 1885, -3648, -1830, 3580, -3401, 1450, 257, -3675, 1506, -3060, -399, 1019, -3824, 1267, -3341, -3715, 869, -4059, 1840, 2258, -918, 5498, -1715, -1529, 2375, -6623, -537, 903, -3366, 4987, -304, 811, 5613, -3509, 2363, 3432, -2542, 3632, 861, 167, 2549, -2647, 1026, 497, -1419, 3619, 1667, 4465, 3418, -502, 4911, -2054, -2926, 3055, -4090, 1724, 3750, -2323, 6369, 381, -2435, 5290, -2619, -216, 3902, -2651, 2073, 440, -3278, 388, -2816, -222, 1543, 40, 4188, 290, 1314, 964, -5093, 366, -3141, -4751, 3879, -3384, 366, 4964, -4181, 1670, 775, -3680, 2667, -2252, -1137, 2732, -3349, -855, -1072, -2675, 282, -1801, 3151, 2523, -608, 3815, -2021, -1871, 807, -6200, 1543, 830, -3393, 6405, 198, -1774, 4767]
1431D767q033L786K264n924O121l239j689L227m196J962L88M70L974m047K848
1446B679l93o066N540m577j589O658o306M391L669o890N671k722m061O140m077
1461a933J309K474m862L346k304p21K927m143M789P09k701O364n905j562L721
1476A508p729N777J377n645P934l009j174N444o012R39J487k607L899k031O10
1491G68P1l401L863k689J085M152n438N556P80o325O637n777l270P300o041M106
1507A377L244o253N544j747k665L918m160J748M13j410L811m553N00R46m871O463
1523B305j153j936O555o096Q29L400p970L815n24m126O902j892o75K809l666J141
1539b82n13o7J686l495L207j027k024M220o739J925N005p443Q041J100p818P892
$$ y = [4767, -3266, 520, 2784, -3140, 2981, -258, -1947, 1280, -2916, -954, -566, -96, 3878, -169, 2679, 2286, -3780, 1760, -2817, -4406, 2252, -4054, 337, 4006, -2884, 2787, 65, -3996, 2144, -1933, -624, 1850, -3012, 334, -1970, -2691, 236, -3907, 882, 1591, -1110, 5254, -651, -2213, 1508, -6221, -444, 933, -4712, 3222, 213, -961, 4483, -1529, -590, 897, -1710, 2189, 158, 768, 839, -2562, 1301, -1388, -303, 3849, -1589, 3967, 4747, -1578, 5059, -718, -3988, 3312, -2729, 1377, 4621, -1632, 3912, 2165, -500, 3418, -742, 1006, 1419, 9, 3820, -733, -233, 713, -4158, 2305, 1152, -784, 5771, -325, 504, 3904, -4066, -251, -775, -4901, 2001, 109, -566, 2243, -1423, -282, -795, -862, 824, -2671, 536, -491, -2515, 1705, -5034, -3109, 1896, -5547, 2494, 3594, -4224, 3668]
1555C668m814m031P417p359K005M820n397N326O61l853J958k002J299K6j91K032
1571A565l514K302K41m592N639l201q31P895o318K316L266q656M540k29m544O036
1587A915k785L65L379k505J909j693j025J284k735M571k107k319N472p164J696
1602a742M751p489N947J696o151Q224m170m027N865o610R90M362m064L234M91
1617A307j306Q86r50N32k428J864J312l320M884k737l802O435n451J71O985p003
1633b621M250K833o990N265k432m185N414l203J097L778l686K860j636q89J566
1648A421k915L052p62j509M539m682M93K793o096N205L41l670O592l525j493L883
1664C667n506J212R51k422L469j286R91M92k651K811l116K54L151m893M636o66
$$ y = [3668, -1146, -5177, 2240, -5119, -3114, 1706, -3691, 1635, 2296, -1557, 401, -1601, -302, -276, -467, 1565, -1949, 353, 594, -3998, 1641, -1560, -2391, 5504, -814, 1502, 4768, -3888, 652, 423, -4121, 1915, -870, -505, 2874, 369, 2278, 585, -440, 844, -1891, 2680, 573, -1746, 3726, -3438, -1742, 3009, -4480, 1467, 3163, -2988, 5236, 1066, -2961, 2904, -3706, -2716, 1646, -2418, 816, 1307, 1, 887, -63, 469, -1959, -95, 1217, -2103, 2781, 44, -3758, 2677, -2774, -2603, 4382, -2621, 1629, 4462, -2528, 2737, 305, -3880, 1534, -1669, -572, 3206, -480, 2380, 744, -145, 1421, -1494, 1558, 796, -713, 3826, -856, -363, 2430, -3666, 1539, 1880, -1790, 4802, 1277, -216, 3667, -1839, -627, 324, -2098, 1371, 85, 1076, 1568, -1083, 1728, -1388, -1134, 2017, -2876, 1760, 1094]
1680A094m644N899m891j206N677n389L557K444n034M617k718k493L469m216J791
1695b043J861k190L720k396k95J811l544L546j180k163M984l795M54J860m717
1710d087L508o56j374M658k564J328J040k622K122k907K81K108l023L315R90k844
1726g27M189m129l06M504o310M476J409n261N293k933k290M752m066J643K551
1741B795k339K547j461r54O39k691K267j335k40L538l635K354J078m634M219k231
1757h3k151N357m129J028K390m906L224j168k063L941k131J171J555k788J918
1772A165k394k97J626l184L669L8k343M660l944k87L513n070L521P50m030M860
1788B253k071j669K894l147J262R48j190L034k015O24O34k952J736j506k4K802
$$ y = [1094, -3550, 2349, -2542, -3748, 1929, -3460, 97, 2541, -2493, 2124, -594, -3087, 382, -3834, -2043, -182, -2372, 1348, -1048, -1343, 468, -3076, 470, -710, -2873, 2111, -1684, -1230, 630, -4087, -579, -1235, -2609, 2049, -515, 813, 1853, -769, 1353, -1554, -1273, 835, -2188, 1127, 2117, -727, 3462, -667, -973, 3531, -2779, 1697, 3106, -2155, 3138, 205, -2085, 2667, -1399, 244, 2795, 456, 3003, 1542, 588, 1227, -1464, 803, -532, -772, 2766, -869, 1485, 2563, -2071, 2148, -83, -2234, 3123, -1006, 22, 2412, -2494, 730, -438, -2501, 1440, -691, 480, 2035, -753, 1165, -1229, -1526, 100, -3084, 585, 623, -1720, 2940, -1004, -1291, 2222, -2848, 673, 1423, -2607, 2253, 182, -1487, 1407, -1740, -478, 470, -720, 2314, 299, 923, 1557, -1395, 341, -1165, -1189, 1613]
1804A613l224L102O56m069M185k899j229M116l726K189J211l967L511j747j925
1819b203L423k801J875J266k195K975l172n84K024l541K706K24j762L428k891
1834a228N07J879m081K823k34j886M015l049N95R08l612L848j675j555M406l080
1850a419J490J292l633L292k485j471M378l643K070J761k950K420j481j13J875
1865A383l057K710L07j951K541k507N56J214l276M036m33k560M699l165j31K188
1881B554m237K618N8k021M096k177l42J746k764J964j007m54K171k695K133j13
1897A530k622K996k490n70L274l528L049N19l861L739k136k221L502k548P27J674
1913A034k097K231j254q78J102j704J515q93Q4K172l566K405L06l855M079j269
$$ y = [1613, -1611, 1491, 2147, -1922, 2263, -636, -1865, 2251, -1475, 714, 1925, -2042, 1469, -278, -2203, 1220, -1581, 294, 1560, -635, 2340, -832, -1416, 608, -2933, -227, -3, -1765, 1663, -1228, -721, 1158, -2923, -100, -334, -2220, 1795, -1254, -659, 249, -3363, 485, -1190, -2745, 1661, -1419, 71, 1363, -2270, 1022, -1463, -2934, 1444, -2199, -129, 1632, -1318, 1102, -379, -492, 1383, -1674, 1036, 1343, -608, 1933, -574, -18, 1196, -2080, 1956, 1523, -1037, 3662, 497, 366, 2554, -1683, 935, 993, -1028, 3068, 891, 549, 2295, -469, 1495, 488, 34, 2205, -490, 1643, 1530, -1092, 1904, -586, -1156, 2118, -1410, 1639, 2158, -1703, 2036, -100, -2321, 1181, -1367, -640, 1034, -1063, 1168, -86, -964, 138, -1566, -51, -944, -860, 1312, -2254, 151, 457, -3398, 681, -588]
1929e88j622M537l771Q33K461m846L093l43k449L830j441l7J211j885J524j349
1945h42p6J378k035K378m25j710L481l494N17K537m056L476N29l508L735k026
1961a41p36K485l234J750N98j447K256j602M76q8j623K382j724n2L094l821J917
1978D90J242m099L736j849j871M437l516J003K332m344K728R1k227K632j419O05
1994b9M64j076J713j871j6Q23j793K854q09j791L679l369N64K614m307K768K10
2011F28k333L725j511q57J704k487J808p8p13K088k249J472l5k011K747k531J62
2028d71L156l660K442Q97l711L387j528j570L258k691N35K057k437J527l26j078
2044b13R49j301J587p60k46J641l102J786N72l328L907j823j717M332l673M55
$$ y = [-588, -2210, 2327, -1444, -611, 1850, -2996, 97, -246, -2695, 1135, -306, -343, 868, -1017, 507, -842, -918, 460, -1575, 803, 378, -1332, 2149, -1345, -828, 1709, -2347, 1129, 1658, -1850, 1885, -141, -877, 1608, -1626, 124, 722, -725, 1531, -71, 405, 317, -1306, 1076, -648, -700, 2394, -1427, 490, 1732, -2367, 1369, -480, -2351, 2086, -1430, -427, 1905, -2439, 289, 380, -1847, 785, -634, -29, 435, -641, 1072, -799, -815, 8, -1785, 1069, 260, -1531, 2148, -1221, -657, 1957, -2350, 418, 628, -1705, 2020, 509, -348, 1356, -1131, 677, 599, -114, 1974, -275, 1197, 1162, -849, 1898, -633, -471, 2685, -975, 1467, 2364, -1347, 2040, 512, -1058, 2200, -491, 44, 2101, -336, 1191, 865, -213, 736, -565, 1022, 262, 16, 1657, -1445, 341, 913, -2415, 1492, -331, -2048, 2284, -1389, -934]
2060i34K597m404K385K70k266L131j785m29J620j432Q39q16l99J665j578K182
2076F46j057j310K620k815R2K727l319K682O19l427L760j749j301K744k308R26
2092d70J238j830J011j22Q3Q06j457K275k624N12K320l043K143k29k736L956j295
2109E38k219L998k702J41K563l225K437j99j705J700j197o6R94j540J010q15R13
2126F26L78j987K632j130j215L045l428J93K567l505K352N99k757L466j777p99
2142g40J991k306P75K95p27J121r23M91K66j302K277j797K36J975k914J954j15
2159E57k803L577j830j123L467k693R08J696k597J896q39r36J571j588Q92K95
2175D50r30J674j611N53J225k495K513p19j783K917k447M17J429k832K129L35
$$ y = [-934, 1663, -2741, -356, -86, -2352, 779, -1006, -1435, 185, -1247, -408, -1224, -1623, 42, -1536, 646, -411, -1721, 899, -1916, -1824, 903, -2416, 266, 885, -2542, 1218, -531, -1832, 912, -1396, -470, 768, -1062, -51, -173, -90, 716, -741, 1534, -1090, -578, 1742, -1301, 842, 613, -2123, 1833, 538, -1681, 2317, -385, -244, 2319, -906, 1531, 1332, -373, 1327, 130, 64, 1058, -482, 528, -287, 626, 1004, -983, 1649, 519, -696, 2349, -1079, -886, 1681, -1824, 528, 1127, -1630, 1836, 59, -740, 1251, -1055, -280, 15, -712, 409, -514, -23, 243, -1059, 1218, -579, -343, 1632, -1282, 672, 557, -2246, 1331, -499, -1622, 1845, -848, 60, 1756, -841, 1055, 216, -720, 851, -737, 155, 450, -480, 1194, -417, 136, 1361, -1134, 1379, 660, -1123, 1794, -653, -236, 1193, -1639, 490, 825]
2191H25k030K566j429p9Q83j245J095q25n01J169j862J477p1j281K128j806K11
2208g75K026l143J853K19k245K379q85j378K397j834O76J008j445J635r30l68
2224h10Q65j562J455p70m30K203k214Q69J191k552K577q98j417L042k288pJ862
2241A116k196J460k4j199J877j125M87N15r04J104j048J67J051j856J791m21j640
2258h45K903j963L28J867k824J595L99j910K103j222p18J767j925J141J65r13
2274e2J303j035M79L12j201J269j104n59J724k274J302O88k075K019n31r92K222
2291A495j882R2Q86k100J684o13p12J151j296J135M89j158J866j529j72J308k160
2308a516J486m40j077K129j186k6J739j780J039o5j014J364j414L49M22j274J871
$$ y = [825, -1205, 1361, -68, -147, 736, -509, 586, -239, -740, 429, -1433, 44, -27, -1308, 820, -986, -775, 1251, -1892, -39, 180, -2065, 314, -571, -1949, 448, -1386, -710, 298, -1147, 488, -442, -810, 55, -1507, -52, -822, -1252, 951, -1263, -394, 797, -1755, 822, -76, -1493, 1549, -739, -746, 1116, -1080, 380, 356, -843, 1034, -91, 396, 911, 7, 1111, 63, 230, 1281, -575, 1216, 795, -845, 2058, 95, 423, 2290, -534, 1061, 1460, -450, 1653, 431, -287, 1480, -445, 696, 861, -52, 1251, 216, 695, 1007, -194, 1075, -29, -588, 1136, -1138, 164, 852, -1223, 796, 265, -727, 1495, -387, -295, 591, -1509, 175, -438, -1150, 1, -1295, -160, 329, -829, 1037, -492, -664, 644, -1516, -30, -470, -1547, 582, -604, -630, 1109, -671, 368, 303, -711, 653, -761, -412, 10, -1264, 607]
2325F07q01l54J576j910J286P24j910K084j663n87J666j688O03J044j573J521
2341F25k16p88J529j632L88K91o89J090j211K41O09j263J563m79r32J838j473
2358e09L16Q56k112J705o73j359K466j430L2J092j001R56m62m45J218j440N74
2375b16N08j442J422j017L44J242j876J445L37j904K224o28j080J883j993O17
2391a34P10j416J752k48n54R15p03M93n7m37J040j755R65N54j564J533p57n09
2409a72K200j983N83J224k407J404k96r60J166j117K59Q47j006J220n43k14P66
2426I71j521J065l65j282K025j523j24J453j977R47O52j497J688o73o50J173j445
2443a083K65J51o30Q33n36P12K86q69J253r75l09J196j928J211M96j729J931j011
$$ y = [607, -194, -548, 1028, -882, 404, 1128, -782, 1302, -361, -948, 718, -970, -367, 677, -896, 625, 409, -379, 1150, -482, -94, 197, -492, 598, -613, -372, 237, -1026, 537, 58, -874, 964, -509, -193, 663, -1449, 256, -417, -1776, 690, -740, -708, 384, -617, 339, -123, -568, 650, -790, -216, 292, -1150, 272, -745, -401, 841, -1035, 410, 747, -1157, 1067, 439, -641, 1242, -751, -134, 576, -840, 912, 664, 110, 1025, 322, 815, 758, 321, 1361, -394, 571, 1125, -439, 1094, 337, -172, 2028, 45, 628, 1852, -555, 849, 553, -407, 759, -358, -99, 748, -258, 962, 419, 205, 971, -550, 515, 150, -1132, 893, -630, -754, 699, -1278, -331, 321, -1176, 512, -161, -811, 362, -1083, -818, -667, -1297, -464, -1000, -288, -2, -871, 382, -593, -902, 294, -1634, -423, 73, -1656, 275, -736]
2461g36m27J882j564N08R78j660J372m27p04J022j155M72L26n67J549j082N68
2478C55P55j591J467n38j416J953j460R0J906k428Q92O89j139J502n09l73L81
2495E36n09K28m42n7M19j070J634k99p50J653j399j04J456k312J364J59k063K188
2513F32n56j230K175j284P8J018j249O93n0n79M86o67L81l52q6J108r04R38K56
2532H08j234J193j103n52K016j896N55J170j844J457J42j242J403q21J44P77q24
2549A49M68q11LN43p58P96j41r34K111r78j98J192k442J407L79j672J620o21q12
2568f99J360j158L78M56r02J210l29j65n0n34O05q38j76Q50q84O82O77j149J092
2587D26r11o11J389j340L84P86j490J364n39l59P34p01M35N54p84J124j136r7
$$ y = [-736, -1163, 719, -845, -337, 641, -1019, 353, -74, -778, 244, -911, -439, -113, -680, 869, -213, 355, 1110, -481, 986, 448, -968, 985, -475, -385, 1521, -907, -15, 674, -465, 1037, 528, 155, 536, 27, 255, -187, -244, 175, -895, 739, 440, -310, 1343, -56, -160, 1296, -1016, 348, 507, -1556, 632, 76, -1154, 1021, -263, -185, 833, -416, 277, 227, -352, 134, -533, -152, -504, -590, 518, -386, 552, 808, -426, 767, -336, -888, 1128, -768, -213, 957, -887, 570, 712, -530, 873, 52, 196, 973, 149, 617, -194, -191, 352, -406, 390, 249, -685, 1426, 448, 250, 1442, -1000, 407, 786, -886, 734, 113, -699, 661, -497, -119, 337, -565, 645, 316, 151, 101, -433, 172, -666, -842, 8, -876, -194, 483, -666, 426, -485, -1096, 293, -1047, -663, 123, -1367, -3, -542, -901, -167, -868, -433, 121, -663, 461, -675, -772]
2605g72O90j294J249k66q25J747p15r6J119j082K12J96j055J091j08l41Q49j007
2623d08O06J54k09N39p87J081q6j152J288j113j97J180j619J228P53j567J625
2640A316n57j055J494j340pP55n66N00k02j23K89n62N36j59j15J013j180J89J95
2659D21j869J883o75r08K166j203o4J379j772Q74K70j395Q68k65k38N14j31J7
2677a28j75J96L61p17J000n01l82J071j266j12J076j613J083O17j412J856o45
2694C09p60J130j111j93Q29q04R19k47k81L24l75M87l09M2R53j212O35K37j258
2713f85J200j014j44J545j417N43R05j532P15J08q73Q52q86K76N03n46N96k31
2731h5n04N75o21O23J90q33J178q76j33O49j327Q62m0o25J687j090M00K99r63
$$ y = [-772, -82, -1376, -127, -393, -1218, 529, -186, -282, 837, -245, -33, 163, -892, 199, 91, -250, 599, -408, 198, 352, 143, 682, -105, 976, 890, -262, 1026, -87, -284, 896, -723, 505, 1258, -309, 1316, 759, -296, 1198, -142, -149, 606, 40, 540, 338, 215, 504, -58, 478, 319, 204, 1217, 37, 226, 421, -1448, 435, -240, -1148, 1018, -185, -249, 1130, -642, 232, 502, -893, -25, -290, -528, -14, -145, -128, -303, -107, 254, -463, 537, 36, -346, 725, -541, -653, 423, -1190, -107, 510, -902, 954, 309, -451, 679, -432, -625, 204, -600, 319, 72, -209, 115, -260, 227, -82, -40, 913, -299, 336, 573, -685, 515, -499, -643, 902, -515, 28, 933, -599, 116, 224, -649, 203, -683, -407, 96, -450, 146, -85, -589, -14, -635, -12, 178, -655, 523, -353, -486, 163, -1164, -302, -342, -967, 720, -370, 30, 329, -634]
2750f34M57j66m74J171r08J87R53j572J229l69l16Q53m73J61P75r28M64l21l91
2769c02M84n84O97K81k80P41n29J30N0j036R06j40o86J283q61l5J032j163N61
2788E49M91j553J748m75o11O68p31j52j3j23N98j12L95N3o02M17p32l1N97j124
2808g43P93L16j147J253q03n26J292j101L18Q56j077Q01m48l41J93l56j97M30
2826d87J17M76l21M53l26p99J007n39m76J268j086M59P12j710J350O4q59J035
2844C38j79m09N36o89L87l43l92L96M03jK89k30O04j075K31L58r17Q97n3l83Q18
2865E86o06k48J013j644J166L11n57N46k21m89L92n66L34J92l90M10j61K55N3
2884C76o32K26k47j93P18o48L18O04j070Q62j80q56R01m62O10N6n75O41o56k51
$$ y = [-634, -177, -343, -817, 354, -554, -367, 586, -986, 243, -126, -442, 411, -62, 99, 874, -54, 410, 89, -302, 182, -402, 295, 576, 296, 1037, 508, 638, 688, -348, 558, 418, -268, 1015, 154, 119, 1151, -12, 549, 1040, -513, 1235, 760, 149, 817, 86, -66, -79, -202, 396, 284, 679, 732, 130, 547, -185, -216, 381, -743, 50, 366, -781, 472, -331, -857, 435, -666, -348, 508, -569, 232, -216, -557, -364, -720, -917, -487, -370, 106, -215, 238, -88, -887, 120, -419, -895, 373, -713, -254, 458, -1252, 98, 162, -697, 338, 159, -250, 286, -403, -16, -359, -751, -355, 48, 47, 336, 106, 710, -365, -134, 224, -693, 204, 151, -232, 586, -20, -268, 745, -899, 267, 578, 21, 567, 346, -143, 249, -317, 17, 209, -181, 229, 68, 323, 376, -256, -30, -277, -470, 248, -400, -82, 522, -548, 314, 134, -722, 179, -283, 327, 383, -192, 449, -207, -458]
2904d58L90m75O85K13o52J050n37m26P47r00M41L50o35Q81m29l49Q13r35M58J93
2924D25m81P59n03K20K52q17O21m80k44Q40n43M11N33r97L35N7o29P81n12k74
2944b46O71o59O55m32j28L88p58R41l59l38Q25r39Q3L49j121R29R5q37J138n43
2964b86q1M49j012M31J89o65P17J69m56M12l26J50j63j13L52m51Q67l25m71P22
2984A09p96j15R74j193P57P16j029R92O3p96O19o09j19R36n30K57j61j42L39j3
3004B59j26O4j23Q56r86O29j57j002J064j34o58J344q38j13P74r55L74J1n58P38
3024D63j53l0K06l43J03j70J52K2o53J137n85k30R18j194J21N69j130R26L40j080
3044f11J069k60n79P13o59L11K72p59O61j52QK49n54K21k49K04L05m56L78J23
$$ y = [-458, -68, -543, 142, 355, -297, 753, 216, -210, 537, -363, 78, 428, -207, 674, 245, -104, 709, -226, 232, 425, -56, 703, 200, 420, 672, -145, 476, -4, -248, 592, 49, 460, 993, -4, 331, 388, -241, 540, 28, -246, 425, -234, 421, -11, -139, 249, -509, 432, 73, -265, 560, -379, -296, 53, -1068, -139, -44, -881, 257, -286, -367, 82, -930, -499, -310, -975, -258, -89, -545, -133, -459, -309, -472, -585, -233, -684, 183, -142, -613, 109, -687, -802, 172, -1021, -264, 452, -577, 415, 478, -318, 301, -308, -427, 509, -21, 236, 75, -67, 272, 259, 133, 197, 74, 930, -56, 573, 416, -586, 478, 344, -314, 1030, 192, 79, 853, -102, 272, 283, -275, 463, 310, 280, 486, 143, 246, 76, 228, 250, -403, 734, 149, -81, 837, -357, -236, 333, -797, 129, 469, -611, 458, 198, -381, 332, -327, -16, 256, -503, 158, 6, 14, 263, -291, -70, -319, -115, 190, -266, 112, 235]
3064B35p48O22l16k04Q80n17J29M52o01M66j88m14N93n18K58O9l80O60n58j9N45
3085D46n55K92K54m17O24n12k22J30m68M17N8n56J001o68J17J42n27L37p6j38
3105c21M12n38L13O9m00K98j76k73O21l08K38K97r74P33l50j69K79k84K51M49
3125A67n45M08m00K81j76n16P52k2j71M65l49j01K69p92O57M11o84Q68l28k22
3145b8K65j90j61L28J03j90K13J66k24PK48n56K46M71q31Q75N8o67P04n36k96
3166EP15q29K30R75r75M26j38k63Rr2o2M79k93K06l69L35l59j55K76k50p9P37
3188E29r27K34M00q13P54j77n81J076o33J1M70p28J46K39n46L34J69Q4L8j46K21
3209A54n37J61L24p68P42k01k48P18o24J28M45q98M86L11m28N10J11p37O12m42
$$ y = [235, -513, 109, -207, -411, 469, -48, 81, 533, -68, 398, 210, -204, 389, -129, 129, 198, -182, 478, -80, -99, 446, -109, 183, 437, 20, 644, 132, -90, 40, -428, -11, 47, -509, 492, -176, -59, 83, -444, -107, -183, -321, 91, -447, -134, -65, -465, -167, -343, -616, 5, -303, -65, 232, -742, -9, -359, -528, -249, -533, -282, 167, -378, 30, -370, -89, -265, -781, -29, -51, -222, 243, -106, -207, 62, -730, -73, 338, -346, 522, 194, -28, 237, 47, -114, 214, 317, 127, 340, 506, 282, 289, 537, -19, 227, 698, -133, 742, 800, 133, 837, 301, 5, 720, -109, 121, 1096, 121, 547, 409, 146, 155, 63, 1, 480, 187, 393, 24, 359, 0, -155, 121, -129, -208, 529, -398, -164, 236, -577, 177, 0, -581, 495, -138, -127, 343, -385, -239, 0, -546, -212, -43, 41, 79, -67, 154, -383, -222, 102, -666, 76, -125, -373, 345, -279, -151, 294, -604, -118, 193, -235, 275, 386, -351, 261, -181]
3229a81q1M97j97K98l46J57k65k23N40m34J69L01k89K75K8o85P04j57n76M24j63
3250b04L48L20o47M79m28k63P02m66J20L21m12L35l05l22N25o26M03P9p2K50k14
3271g7k03K11l42M24j14J1L13j40r0M00j066P92l25k04R54o48R2O60q19L34J75
3292C38m54M86p8j03kn7L98l88j93K08l3K30k48K82J99n76J40K44n91P47q2o19
3314a52Q69n57m1M91r95K81K94o4m9L15m90L39j63j90q1K87j45j76M66k77l29
3335c67L10q00M44P48r63L54M15n90N39k02o52R94n08l68Q65n10j32L90m37J80
3355b90l3L3j31L3L81k08L68j63m73N68j99k83R90q64j97R00j037Q68k9n67O71
3376C38j41l83L62j88L0j2O0J3K3J67l81m3N80o10L71J04n05M89n6l66P72l39
$$ y = [-181, -262, 235, 38, 336, -10, 147, -118, -341, 199, -235, -66, 235, -54, 221, 249, -436, 268, 111, -465, -41, -204, 144, 464, -183, 296, -132, -395, 307, -159, -39, 282, -130, 205, -100, -422, 103, -523, -120, -41, -113, 137, -77, -280, -69, -411, 13, -101, -90, 223, 83, -7, 393, -673, 119, -206, -410, 544, -104, -12, 648, -171, 163, 338, -116, 370, 292, 189, 187, 130, 528, 140, -53, 155, 122, 352, 104, 386, 585, 9, 149, 393, -198, 549, 467, -152, 717, 160, 119, 610, -385, -104, 190, 126, 77, 392, -98, 241, 78, -112, -193, 94, -51, -227, 239, -38, -367, -57, -857, -413, 335, -628, -274, 141, -449, 90, -112, -764, 230, -278, -646, 219, -291, -423, -33, -470, -290, -323, -290, -421, -388, -7, -215, 153, -10, -483, 85, -114, -397, 593, -271, -468, 432, -605, 263, 234, -333, 338, 197, -186, 176, -12, 18, 6, 66, 79, 102, 269, -112, -155, 425, -185, 186, 290, -215, 274, 218, -148, 624, 285]
3398B85m72N83m72J43L02n08N93m27k59M64m30J59l1K9J12NM0j9k61K62j34j20
3420a56K22m27M81m08R6L77n07j10N64k35K18K5m35N70o6l55L61j88p3L84m96
3441a58M50P0l39J48k57L46m9k55K27j59j7J38j95L67rk60M35n79N02K88r86M82
3463A90pl32N95n90K74J99p10M93J72m08J10j1o2K65j99p2j26K39m6n35Q01j81
3485E9m54N45o67L49J09n14N73k30o04O31k20j5N67o08J35L41k54J68M4J18k72
3506a99j98L86m11M26q6k37O12k57m43P28n52o7Q64q72K00P11o35M94j09m31M68
3527C92N6l18L08k07m5O3N8j7n7K1j01N8K48n31N85no29O71m39m28Q27n13j9M33
3551D11n42L33K13m56K47k73J78L4r7m9k1J00j62M6P1j79M2M81p66N57J63q43
$$ y = [285, -187, 396, -76, 67, 369, -139, 454, 27, -232, 232, -198, -39, -70, -41, 71, 76, 116, 97, -164, 98, -36, -156, 66, -361, 120, -288, -192, 185, -322, -432, 132, -103, 115, 140, -295, 275, 209, -146, 215, 27, -46, 338, -158, 292, 362, 23, 171, -86, 260, 211, -44, 183, 24, 7, 145, -50, 317, 308, 48, 483, -96, 406, 694, -292, 190, 183, -149, 446, -144, 130, 329, -381, 112, 284, -124, -14, -25, -87, 178, -21, -93, -219, 20, -26, -561, 240, 59, -395, 150, -517, -168, -59, -573, 0, -230, -834, -203, -423, -438, 129, -479, -344, -3, -257, -89, -45, 73, -199, -397, -11, -422, 4, -82, -319, 293, 36, -407, 321, -231, -298, 566, -306, -106, 605, -30, 464, 355, -76, 392, 448, 130, 438, 231, 186, 249, 307, 290, 233, 254, 153, 211, 459, -72, 513, 508, -121, 550, 111, -317, 510, -3, -22, 411, -131, 202, 415, -41, 206, -67, 111, 145, 48, -1, -22, 78, -84, -38, 33, -146, -104, 377, -389, 168, 331, -512]
3573e12N96P7p84Q91m59q2M09l72N61l84p5m4K41m43K08oR8R0q8L04l37K46k12
3596g7K7K03l19R1K26m06K23J84l09L88j02m50P04n85J15L49o57O97r7l07M12
3617C10o79L03M12l39q6mj34j47J66K94l86J43k6j57L07M0m28M47j55o4L24l55
3639b14r2J70k88N26n9m24M10l17J06K24k77J77J05k7O3r6M0j14O5J49l39M57
3661B45k5o78N06N6k49O50o34N5O02p63L52K13n06L21M50o43K31K34k5j30K73
3682E35j31q8O6l91L45J98l16J89j38r0O5n9l56L25n6r5N27n71L5L09n51M30k5
3705A57k08J22N9j53K70l48L5l15P18n87L01J95o23K14K72l58J84j61o20O99O6
3726h1j57L53m95M6K40k69K15O9m13K24q8J60J81l56L15k34K89R3k68M18l56j12
$$ y = [-512, 84, 161, -623, 268, -191, -273, 136, -236, 325, -59, -134, -178, 63, -380, -172, -178, -80, 10, -78, 226, -111, 135, -77, -50, 153, -166, -75, 151, -255, -32, 152, -157, 231, 129, -321, 383, -202, -87, 262, -395, 302, 205, -102, 310, -369, -66, 346, 7, -79, -83, -217, -364, -198, 96, -290, -147, -173, -330, -23, 17, -411, 36, -119, -183, 141, -214, -306, -136, -424, 102, 43, -381, 29, -288, -182, 42, -235, -58, 47, 20, 83, -13, 27, -87, -22, 127, -212, 245, 220, -458, 48, 104, -145, 505, -129, -74, 528, -235, 117, 330, -176, 145, 595, -48, 183, 417, 392, 262, 535, 404, 316, 382, -9, 336, 534, 218, 407, 269, 179, 244, 185, -171, 154, 98, 3, 530, -41, -6, 303, -248, 182, 157, -51, 71, 130, -23, 247, -101, -66, -381, 337, -250, 51, 246, -377, -163, 109, -249, -65, -226, -846, -147, -81, -238, 115, -380, -334, -94, -363, -148, -79, -492, -268, -356, -196, -15, -371, -56, -290, -1, 92, -176, 242, -114, -226]
3748b26L91m38L78l8j74L48j53j78K61j60K76j75p5J94J16n61M10l48O3M21k67
3769F5J02j8K00l98o8K26j03J9J07k87J68J34k13J18j5k06M45m61N5K00k39K82
3791A13j90k69M39p9l95O46k37R6J72l89O1l4J37J4m5L64q24M78K18m66L91k31
3813c0j0K09l01J97K62l17K15Q7l59L77j87l74P67m11k58N24j25j36PK03q3j84
3835G3K12l93L11ql91M20M3o32N35j85m12N85k73j5M47j67j48qk68K36L4k64R9
3858a69L2k15K02J15l37p5N71n89J46K84m04k08P28n25l0J8QN30l44l46O82j94
3880a20R0j80j54J49M8k32P1L41j41m5K44l4k29M21k81j25M09m31J74J21q5l8
3902b7M21o43K24K06M3J97j20l35J89K06j80p4J21Qk43L90j38k70K70l48L42j2
$$ y = [-226, 165, -273, 105, 67, -107, 241, 88, -90, 171, 11, 287, 112, 37, 231, 347, -214, 196, -152, -89, 332, 65, 167, 149, 349, -49, -117, 109, 6, 25, 132, -155, 13, 147, -66, 52, 37, -169, 276, -185, -130, 70, -169, 113, -77, -346, 93, 14, -381, 265, 28, 124, 296, -93, -32, -66, 71, 85, 40, 404, -420, 58, 276, -190, 201, -30, -40, 169, -132, 65, 327, 10, 225, 312, -47, 330, 143, -231, 536, 125, -133, 391, 266, 130, 137, 340, 257, 73, 285, -108, 203, 195, -196, 224, 267, -365, 170, -15, -427, 158, -115, -130, 317, 150, 2, -6, -274, -38, -4, -268, -169, -137, -352, -150, -35, -372, -447, 124, -465, -319, -35, -439, -647, 81, -444, -474, -456, -448, 82, -262, -608, 74, -120, -30, -210, -364, -215, -167, -399, -328, 13, -128, -173, 71, 37, -192, 229, -52, -177, 232, -199, -25, 96, 11, -27, 394, -249, -25, 181, 224, 421, 301, -34, 155, 361, 181, 107, 228, 236, -7, 383, 245, -25, 245, -103, 239, 227]
3924B27m57K26J34l68M89j95K62J35o09N70k94k27M7j17L24j47k9k38J12Q9l67
3945d33J30L8L85K2j70J9K24m59K40m37N99l41M57m80N37j38o55M62J07n39N04
3966G2j36M58m21L80o43O44o51N08p6J15J57n93K44J49J11l1J29n56k25O14L55
3987F04J56j329P2M17n7J57k5n8K18r61J173n88J23j77l47R25n97M39o43L2N50
4008H4k06l72M22K0j09o7K4O53r11M73n3q73R58o4k10N10p21j99N11j06k21M53
4030dJ49m91J77j38j20K82K22j24K66k2k78J57L5m7P5j12j04M97l85P7L40l52
4052A00L68n2l96J27r4K32j63M7r7J09K64m83N72k42j68K38j85j23N8J6l41L14
4074A01j13n4J56n3J04J8j11L01k55j75J33Kn0L56m83j64M17k89L30k65j29k7
$$ y = [227, -230, -4, 130, -238, 251, 56, 318, 453, -156, 414, 120, -107, -60, -177, 147, 0, -29, -267, -155, -66, -433, -303, -265, 120, 142, -28, -9, 215, -244, -4, -441, 158, -183, 274, -206, 331, 193, -462, 0, 107, -432, 72, -64, 394, -27, 353, -290, 354, -297, 211, 135, 250, 407, -186, 58, 207, 318, 287, 416, -140, -365, 249, 604, 760, -569, -497, -80, -137, 20, -5, -63, 155, -806, 367, -221, -98, -275, -622, 303, -294, 145, -498, -466, 84, -122, -494, -72, -52, -161, -228, -204, 449, -462, 11, -42, -915, 43, -21, -231, 279, -442, -641, -130, -236, -457, -4, 145, -346, -169, -307, -427, -145, 77, -47, 219, 197, -81, 76, 111, 64, 139, 27, -77, 420, 35, 112, 452, 100, 468, 416, 20, 147, 53, 285, 122, 169, 72, 181, 445, -38, 534, 292, 124, 362, 177, 54, 112, 128, -213, 101, -12, -66, 90, 37, 141, 159, 48, 349, 94, -81, 52, 54, 4, 360, -123, -287, 130, -159, 171, -94, -223, -250]
4096b50r7J21J11j58L42l32qL23m21M01p6j93K82j96k6K40m53L69J0k22oN3K18
4119C2m9o6K13j93Q3j05L38l03K73l00M1P5K17q3o26N93j06l02K51k26J18K93
4141A68m75M76m4k89K31J99n77N41k72k7J73j16q0J49p0p4J08k23J26MJ86m26
4163c12L83j25j92M93k80k13K89l11L9M83l22K40p7k24L49k33n4nkJ11r5L68j41
4186A69k02k3kK9J50k21N19k55l20M62l83N4L33j36j50K85l15K82O0j95K01K6
4208C68j86JJ45k41J51j5j99P7K12j29r9J47k33L85l31j41L35l23j04M59k62k46
4230b29L90m33J80P0k21K03l0mN6r0q1J21J0l63O3K70K2k96K83l21O1K44K0k08
4254b83k7J70P6L2l6N2j90N6q2m3K62J80l95L29k53K00N0j88J49r2Q7J1j95K95
$$ y = [-250, -347, -226, -115, -273, 69, -263, -271, 52, -369, 32, -44, -237, 45, -151, -177, 63, -390, -21, -11, -233, -239, -186, 32, -17, -83, 130, -63, 20, -85, 253, -50, 223, -77, -36, 39, 256, 173, -453, 140, 34, -268, -17, -243, -125, 168, -307, 169, 125, -164, 67, 266, -311, 230, -42, -69, 104, -12, -92, 57, -13, -87, 21, -202, -76, -72, 114, -312, 71, -54, -246, 247, -33, -246, 43, -268, -229, 254, -68, 172, 95, -129, 220, -13, -67, -72, -74, 37, -58, 310, 169, -33, -56, -58, -29, 121, -100, 419, 164, -156, 306, -77, -23, 310, 174, 24, 309, -6, 276, 336, 141, 342, 368, 182, 183, 328, 87, 238, 223, 24, 101, 313, 184, 85, 232, -1, 384, 53, -88, 247, -76, -180, 279, 17, -229, 161, -272, -92, -22, -243, -40, -70, -74, -18, -108, -189, -68, -58, -421, -358, -88, -66, -362, -79, -400, -339, -95, -75, -283, -310, -140, -64, -32, -68, -16, -206, -150, -232, -275, -13, 167, -228, 101, -152, 48, 98, -90, 59, -33, 54, 65, -130, 165]
4278A65k86K78L01o66J38K73K9j73K15o9Q1m81K57J36j15j05q3K87R4k38k6J58
4300A70j04K62k72j5J5q1P3j21L8J13k4J55k77k88N23l79L10R9j45po7l61N20
4323A37K4l76K13K3l12M29l3j59J05M6J8OL0k13J39r0O3QJ33k20J38p7j16K65
4347A81j91m6N46o57J24L8p7K1K81k68P5n8J49J46%k45k71M94j96J25n0k45K72
4370A48m3j35J55J24l18J07j03l22L92J6k21J83k48J31n9N9M7r8j38J40J38k05
4392b50J48m1j06k44M61l47K29L1j4N5J13k26Q2p3J56j49K87k71J60J22j52m3
4414g2Kj96L60j38K7j19O2M7J47K43l37J16l3k23K48M4j57lJ07J25o7L1J77l14
4438G7j36K75k69K33j15q2K07L7j63J7j9J71k53k7J37J3K04l28j43K02N7k52K63
$$ y = [165, -121, 157, 458, -208, -70, 203, 232, 59, 274, 205, 286, -195, 62, 198, 83, -22, -105, 182, 276, 38, 12, 170, 66, 328, 56, 41, 56, -25, 48, -73, -35, 78, 54, 209, -68, -356, 167, -212, 98, 197, 52, 45, -22, -383, 137, 161, -215, -2, 21, -291, 138, 105, -54, 51, 97, 115, 121, 151, -62, 77, -13, 50, 58, 191, -29, 109, 32, -84, 181, -10, -56, 490, -167, -43, -5, -82, -61, 220, -48, 27, -31, 118, 264, 264, 19, -252, 242, 46, 171, 121, -124, 148, 105, -30, 125, 249, -69, 38, -65, -387, 5, 21, -200, -17, -265, -134, -193, -134, -87, -185, -323, -183, -45, -250, -102, -143, -249, -493, -32, -379, -150, -119, -133, -78, 35, -191, -109, -182, -26, -175, 112, -159, 1, 123, -29, -72, -70, -266, 94, -44, -17, -136, -74, -27, 120, 363, 26, 142, 109, -114, 134, 178, 21, 18, 125, 250, 183, 214, 391, 77, -59, 216, -53, 180, 65, -17, 190, 227, 64, 81, 62, 233, -20, -47, 90, 103, 307, -21, -164, 38, 95, -157, 106]
4461A06J51o2k0j82n8j08J37M0p5P2j57N6J21o4mK0k1J36m3k17J50j22k15K74
4485h5P3j9N6ok3k83M01j66J6J02k0j39J73j89%J45Q3j31K29k18P0j15j18K00
4509C6k59K68J01j86O1K70j53j67m7K53l64M29j81j38L16k24l74M68p5k75L44
4530A03j54j45J92j0j56Q6o9J87J84k07j11J27p3kJ56l5Rk26j05K71j01J03N4
4553G8J61n91K59J53j18R8P8o7r5K46j82j50L96k00p5L39j07o3j64J38M1j02l
4576G0O1k94N83r5j40m9J40l02K30k6j21K61j8k77J59k5j54L60m55L67n03K71
4598D3L1O4J48m61K06J24j53K31l02j04J22l94L26j36K93j26J80k42L19m28Q2
4619a77O0P0k61N1J35R4J43l72J60p4j54J46J04Q5j65k%L0j7q4J65j64qK33k14
$$ y = [106, 257, 195, 175, -7, -65, -173, -36, 4, -71, 1, -156, -100, 21, -43, -47, -27, -48, 88, 45, -172, -22, -144, -359, -85, -12, -31, 25, 19, -4, -287, 114, -52, -36, 66, 46, -93, 80, -109, -109, 36, 119, -12, 217, -1, 69, -46, -164, 36, -223, 45, 146, -40, 21, 291, 138, -29, -76, 177, -187, 242, 61, -77, 239, 15, -359, 109, 34, -241, 103, -51, -196, -4, -14, -170, -84, -153, 34, 218, 11, -100, 27, -46, -48, 108, 73, 82, -144, -249, 22, -79, 24, 78, 239, -352, -93, 60, -58, 40, 118, 51, -44, 202, 20, -130, 266, 66, -9, 330, 223, 160, -4, 134, 175, 73, 70, 131, -163, 420, 325, 185, 136, 276, -26, 204, 178, 57, 318, 300, 23, 182, 157, 3, 363, -92, 275, -228, 43, 74, 138, 286, -175, 31, 155, 2, 233, -69, -173, -51, -445, -119, -255, 38, -88, 92, -150, 169, -259, -177, -117, -47, -308, -257, -122, -28, 115, -257, -97, -171, -325, -179, -75, 10, -155, -157, -157, -127, -144, -228, -63, -227, -235, -2, -216]
4644b16J57M4r8j4K20o5Om8K9R3j18k0m0Q0r3j55M11k48MJ63j7j27L38k70J9K
4670C7q4J07P4j71M9K15k25J9K56j30j29M0j3n8m2K5k7L41m57L9R6J07M9j7k6
4695G5p9J45m35M78k30o4L13j36m2Q5k57J42N2j31j3L07k59O4r6N5O1K9K06k38
4719C2J0NLJ00P3j16l0j85L28j47l1K78j71j17n8K22j87n2Q9J14j6mj28N4J70
4744B36l69P3N2n5M4J83m9j14l81N83k25M0o5j10P5m5R7rj21J39k54j40L10L1
4768g4J73l37L21j73J26k74J19K3N5j94J30k0m0oQ2l1j5j39Q7L47M1k91J57j06
4792c9J6L45k35k87K13K05k94L04l70L41l27R8O8J22k49K80k15J57j95J18P5j21
4814A0K69k96J04n2j23Q8L07j99L8j52J05p3K5j81N21l09k17L96k15q9%q4J68
$$ y = [-216, -59, -15, -113, -127, 93, 28, 34, -14, 15, 108, -10, -30, -70, 10, -83, -238, 173, -75, -71, 92, 75, -52, 286, 16, 35, 37, -47, 60, 134, -37, 12, 227, 2, 21, 277, 147, 18, 58, 45, -13, -55, -30, -57, 284, -173, -134, -38, 69, 118, 101, 75, -4, 141, -294, 184, -46, -110, 203, 67, 25, 110, -147, -5, 47, -84, -97, 210, -49, 15, -81, -26, 35, 64, 270, 32, 42, 47, 50, 150, 223, 107, 77, -108, 220, 73, 42, 320, 149, 32, -26, 196, 9, -43, 46, 160, 144, 140, 12, 66, 236, -133, -60, -8, -63, -19, 164, 115, 1, -380, 203, -22, 18, -47, -157, -82, -127, -30, -39, -160, -21, -275, -415, -105, -74, 99, -238, 83, -90, 36, -238, -119, -96, -41, -235, -105, -125, -165, -171, -89, -120, -135, -274, -187, 160, 201, -90, 67, -39, -23, 322, 87, -200, 13, 218, -76, 228, -142, 199, -128, -30, 38, 160, -89, 191, -24, 133, -62, 56, 131, 10, 279, -17, 87, 35, -88, 0, 307, 108, 146, -6, 99, 26, 51, -130, 391, 82, -135, 261, 46, -43, -43, -127, 41]
4837D1J7JO2l05J59l8j94L37N0j02m22K33J38j93L33o8j84M8R8K2J23k91J64j99
4861a70J14L8J50j79o8K15k78K58o8J18j31L2j47j16M09J7j69qJ33j74J15O5J26
4884B82k01j0j72L66k94M3J81m6j93M3j93K58J34l19j28M20k18k95J9K49p8J04
4906d8j07J20K93l74L0J32j66J2L05l86J15j35J11j16K18o1j57L62j60J19j62
4927e5M1K6k94L51j3j78j17J32j26M37N7k65J18k48L36K8j17k01j81J64R8j96
4949b03L17j04k2J4J78k54J00rJ2K69m1J07k70J30j13J86K6j29l8L4j73J1M14
4972D42m34jJ51k90M05k68J23j86j44L23P7j60j95M5M3kO8r3l7J33J30j86K54
4995A98l58k9J7K72l15Q9k19K73Ok69K02l5J56k95l0K89P0j07R9O6k57j26J41
$$ y = [41, 58, 59, 121, -184, -25, -63, -257, 80, 130, 28, -394, -161, -23, -216, 117, 49, -135, -87, 11, 33, 156, -135, 29, -170, -56, -18, 132, -47, -115, 100, -178, 80, 12, 130, -1, 31, -116, -232, 177, 194, 25, 17, 150, -24, 91, 156, 282, 81, 71, -101, 265, -29, 14, 195, 149, -44, -1, -194, 64, 198, -121, -249, 171, -47, -342, -323, -74, -152, -48, -155, -35, 258, -116, -86, 46, -120, -108, 197, -189, -74, -209, -98, -214, 4, -57, -214, 148, -12, 107, -55, -14, 12, -282, 69, 56, -122, -239, -107, -233, 204, 261, -4, 114, -134, 202, 230, 113, -88, -269, -105, -7, -203, 114, 10, -12, 2, 180, -74, 26, 17, 29, 298, 257, 364, 94, 224, 111, 297, 323, 194, 156, 190, 17, 28, 442, 8, 7, 158, -132, 273, 5, 128, -58, -202, 121, 198, 38, -157, -112, -69, -71, -3, -96, -133, 0, 130, -56, 198, -160, -189, -172, 100, -215, -126, -345, -72, -66, -335, -133, -168, -12, -307, -337, -48, 22, -85, 14, 80, -177, -303, -162]
5018a62J38J94j07j98R3K0K7m2j11K13k25K23j10p2M07k20J16j08J82j66k57K20
5040E5j11L5n4L0K05j13K3j44k5j05K83J41J1k48J64j87L1J53M3l50K27l86K0
5063c02J98J78L26l41K84k72j19k29N58l58O29J09J30o46j72J01j05J39J74l50
5083f8P4j9r4L4L21l75J34O8j5o3L5J54J11n07L04N3k70L75l39J83J70L1k82j52
5107a37K8K86k61L75P8n59J90J05J4j12LjJ2J5J83k60J12j26j52Q6L36j93R2o3
5131E1l01J40k20J04J92j75J77M9o7%N8n6j29L7Q6j34j13L05j65j34J20Q9oJ53
5155F1k45P5Nr8K81m14M29q8m5O3l69M31k11P6o6p7qK38K1j4J84j13Jj08j56K18
5181G1R5k4O6k74l7J28j8K3m4J95l42K41j19l5J42r3qK66l50K39Kj17M27j66k31
$$ y = [-162, -24, 170, 63, -135, -42, -22, 5, -37, -148, 65, -160, 63, -47, -119, 288, 68, 184, 76, 258, 92, -165, 55, -56, -21, -75, -45, 160, 47, 70, -74, -99, -204, 79, 220, 231, -17, 147, -40, -9, 144, 187, -163, 64, -322, -302, -104, 74, 400, 59, 343, 71, -48, -277, 281, -77, 552, 661, 791, 145, -27, 74, -31, 108, 282, -68, 6, -13, -107, -73, 248, -127, 7, 75, 60, -3, 32, 186, 297, -210, 94, 147, -123, 252, -87, 96, 266, 297, 15, -137, -109, 177, -84, 291, 369, -190, 0, 105, 119, 7, 10, 9, 21, 36, 219, -41, 71, -55, -207, -121, 215, 22, 114, 51, -250, -110, -330, -226, -34, -209, -32, 17, -50, -50, 8, -48, -177, -140, -54, -188, -301, 4, -161, -295, -175, -86, -92, 61, -184, -109, -104, -202, 79, -335, 94, 6, -39, 24, -345, 86, -125, -49, -115, -192, -200, 38, 59, 45, 229, 116, 117, 9, -147, 71, 166, 142, 208, -66, -103, 25, 7, 30, -14, 181, -161, 80, -39, -74, 68, -25, -33, 233, -117, 122, 124, 7, 434, 268, 37]
5206C7k45L12K8jk32K15q4k9K54j48j05M02l57p1P2m5J33l6k71K07p5J69l66J91
5230d5J2q5L9R8q2J08r8O8O7q3M5l15M29j09k48M20p6l86N04k25j09k42K20L49
5254B56j93K30j76p5k7Rj21L6L11m63L19o2j17j52J97j47J93K59l45n3k3L65l91
5277a70K01J02k55L37j65j18m9q2L4n4L02j93q0J14K78k08N7j46j40J95j8J9O1
5300B2Nj86R0j30K01r8qJ32r1r6R0n5L17l06jo7J2K80k91K01M0r3o3J03j83L52
5326A77P0l50O4J32m3J62j19j84N8K86lJ9k59P2K40l82O6J4K11j58m7J01j60R8
5350F5l9k83K95J28M9l20K66l3R2k39J10l82K36J55k64M3l7J94k04K00J10k18
5372g6K01j16p2O9j31PP8K8k18K91j85M7J8%L1m7np9OM8J49p6m5J35O7j53K76
$$ y = [37, -208, 104, 132, 131, -101, 114, 30, 1, 255, 107, 2, 404, 47, -24, 48, 3, 136, 100, -171, 36, -39, 130, -236, -45, -33, -118, -79, 19, -63, 45, -53, 15, 82, -1, 44, -271, 158, 49, -199, 221, 145, -241, 263, 38, -71, -313, -93, 256, 63, 293, 117, 42, 15, 24, -97, -61, 250, -213, 106, 44, -73, -225, -28, -175, 18, 277, -68, -121, -144, 221, -170, 31, 133, -122, 215, 50, -68, -117, -199, -165, -219, 83, -110, -190, -76, 202, -6, 51, -95, -235, -40, -58, -39, 22, 27, -159, -69, -199, 2, -96, -104, 28, -63, -159, -69, -124, 193, -113, -114, -181, -169, 111, -180, 21, 61, -32, -95, 8, -175, 177, 247, -103, -39, 93, 50, 212, 93, -91, -33, 253, 250, 269, 10, 82, 322, -60, 6, 20, 231, 73, 26, 127, -33, 65, 26, -257, 38, 166, 215, -105, 161, 128, 220, -19, 91, -291, -55, 100, -164, -121, -158, 36, -168, 32, 142, -76, 125, 9, -63, 6, -125, -118, -40, -12, -230, 61, -124, -77, -59, -59, -28, -75, -80, -159, -153, -105, 44, -32, -77, 58, 125, -28, 248]
5399B48j70J70m20J77n0m2J60j07j61M55k09L2q1l6J74J1l4j02R9j29J6j18J02
5422a5J69m39M28o5k6r0J07m9j08L6k81J66K14Lj44j67J99m2j97J06K14pr2M2
5446c8K68m84J53J24l4k52L45r8r0J82p0k02J12R9K11l06k1o5K1J52J22m02K12
5469f1N6kJ28Qrk12l41M43J52r2j54L69j02J47j39O9j62k05J50o4Q5J08q4K00
5493B88j63j22j50K21J9l0J95j66K67l09J8LK35j61k35j35K30RM7j97L2M51l01
5516D6O1k34R2n9k15K75M9J95l05k49N17l89lR8o4N5K15k42K39k91O9O9j27M7
5540a51j22K83k61L08k0j39l4nK25j36P0JJ9n1Mn4j28j42K34M2l4J03K05k00K24
5565B41j77k57L65k17R9P5j5k50J22L09k34lK90m03l8q4o4N04j98J23k34j8K58
$$ y = [248, 78, 248, -172, 5, -45, -87, 73, -34, -195, 260, 51, 83, 2, -34, 140, 151, 117, 15, 114, -15, 1, -117, -15, 154, -285, 143, 78, 52, -38, 69, 20, -88, -52, -333, -167, 47, 50, -94, -261, -62, -104, -301, -195, 19, 12, -80, -38, 230, -254, -101, 23, -11, -263, 82, -16, -106, 76, 6, -196, -84, 15, 226, -80, -101, -166, -145, 7, 129, -273, -61, -5, -7, 121, 129, 120, -92, -433, 10, 162, 70, -84, 285, 183, 330, 191, 260, 98, -107, 43, -21, 64, 172, 88, 288, 125, 3, -147, 74, 93, 63, 258, 92, 359, 50, 68, 71, 306, 145, -90, -225, 5, 14, 61, -136, -104, 347, 46, 107, -127, -35, -94, -309, -34, 15, 210, -95, -344, 173, -216, -219, -121, -185, -130, 85, -157, 82, -209, -140, -71, -198, -151, -273, 10, -251, 57, 37, -102, -136, -141, 84, -52, 18, 19, 38, -13, -9, -63, -191, -333, -99, -57, -91, 12, 217, 17, 241, 64, -193, 172, -45, 54, 129, 114, -136, -14, 295, 61, 58, 348, -55, -93, -177, -241, 263, 65, 188, -46, -64, 194]
5588A94l35R9L11l56K43k25J71l01M54k50k2K15k71J87k32k3p2k1L99j01L4J45
5610B43k72K46k36o4m4J88m2o0J84j58J65j61n0p6P4K27n74L31P8k72L12j56K23
5633A06j68r4K18j95L15k31%K16l41L36N2l10m6n3P8L28l63K93k53P1J73r9J42
5656A75k27R3qj44Q8R2L6l40K17J48l20R5J26k1o5K39pk44q9J64q1R3r1L8j63
5681a96J9K66k50o7KJ85Q2l6k3J8j01J51j36P2j7M5j12L05R5m23K3J63o9K83m86
5706b07L63j53J3Q3M9p0k91M07K0l37J56nK57j99K10j60j26q7n9J36o2M74o54
5729b42L02J16k67J97J36j27r4J43k3k21oQ3J72l48L11l10L6J23mp2L8m6R5J4
5753Fr0j22K01n6O9j49J97j78L9J3J69k07M8Rr2J12K8K52j79Mn7J34j86j41K00
$$ y = [194, -141, -42, 269, -87, 156, -69, 102, -199, 255, 5, -17, 198, -73, 114, -118, -141, -213, -234, 165, 64, 98, 243, -29, 217, -19, -83, -127, 61, 19, -41, 143, -15, 150, -11, -61, -137, -63, 164, -410, -79, -1, -273, 39, -117, 106, -62, -156, 62, -133, 182, -49, -49, 167, -174, 162, 214, -96, -142, -195, -117, 211, -152, 141, -112, -41, 132, 33, 175, -52, 41, 33, -111, -23, 69, 105, -235, -18, 130, -190, -95, 31, 10, -55, 184, 177, -67, -156, 8, -73, 20, -71, -33, -196, -177, 89, -161, -228, -226, -41, 41, 5, -18, 0, -101, 50, -86, -14, -31, 14, -98, 207, 302, -121, -98, 65, -4, 279, -207, 156, 3, 16, 99, 148, 78, -213, 194, 214, -123, 33, 28, 285, 86, 296, 136, 10, -77, -136, 0, -62, 412, -242, 60, 176, -91, 106, 242, 115, 21, 164, 141, -80, -86, -3, 169, -179, 132, -178, -142, -19, -23, -95, -57, -103, -8, 6, -84, -206, -5, -61, 8, -141, 56, -122, -83, -70, 99, -108, -60, -51, -143, -31, -3, 249, 70, 74, 17, 151, -35, -176, 24]
5778B4M6p1K51m97K69RM9K71n45M16k67k14J91q7J84R1j31j36P9J20J63j79J02
5801A38p2l1j94Q3o9K75p9j10oJ8L2l8j09R2K07j69j0J56O3k67j46M6K4o6J29
5826a03k4L7J61j12O1J27j83l4j75J09K46r6j42J64M1p0j28n0M06m71K38j24q0
5849b02N21m98K41r8p0J29ML0LO4J05j93j21O9m9L21k76Q9Q8k08L33k90l1P8J29
5874A68j00oK9K24n49M95p3k04p5L1M4J63k51L37k49j34M53m46K07k5l3R6j39
5897c7o7j00J89k21o9K72k34L04j09j79J66O0j45J14Qj89J27K81j05j79j41J21
5919a33L10l47n6K02J8r7J35N6l3j32J27N4J55k23J14l53M14j83m1K10k27J5j17
5942a32J71JL37m95p1J99J20k34L4K23j78j6r6R3L2N4j12K12j9k84j01K36J77
$$ y = [24, 70, -1, 250, -247, 22, 31, 80, 351, -194, 222, -45, -259, -68, -155, 29, 120, -11, -147, -68, 52, 215, 36, 138, 66, 35, -159, -76, -145, 130, 51, -59, -65, -47, -15, -53, -162, -70, 137, -32, -42, 114, 177, -90, -236, -190, -166, -232, -103, -127, -90, 71, -41, 20, 147, -36, -70, -245, -136, 110, 14, -128, 36, 77, 7, -121, -171, 235, -236, 2, -122, -202, 319, -179, 62, -36, -106, 23, 27, 57, 60, 124, 229, 36, -85, -16, -65, 256, -20, 69, 157, -51, 282, -8, -39, 39, 168, 68, 62, 91, 315, -234, 261, 188, -16, -91, -60, -16, 147, -104, 233, -16, -150, 303, -143, 64, 39, 6, 102, -37, -104, -204, -15, -236, -305, -33, -267, 37, -72, -251, -85, -25, -170, -56, -48, -237, -110, 171, 66, -113, -254, -133, 177, -170, -226, -24, -6, -103, 32, 88, 55, -77, 50, 104, 259, 36, 150, -203, 211, 28, -13, 197, -30, -15, -132, 39, 40, 377, -118, -189, 10, 130, -104, -70, 153, -25, -41, -137, -44, -12, 42, -70, 142, 123, -161, -262, -26, 151]
5965A51j26m2K8J1j15K19l32R0O4O5J66k58n0K19l8L5k71K72l28M58j91k10M03
5988B20k02O6Km8J15j84J1J76k06J43k51N6J54l0K80J7m85J85J30j3mm7J7R6k09
6013a1Q5L6J01l9m32L33k04J4L61l27K12k00R5k2R7n5J3MN4j40l5J49J39l56k4
6038a52j10M46n17P7L35k82K88n5J43k59r1J93j21K17l61J83j53J34K30m06K37
6059b4k44o2K65J15k83K86k63k04M68J01j03J32j86J76k79L5j06K25K06m13K97
6080A39q3p8j0J68j66J12m7k00K82o3j3N1J4j54K8m0J55l3j21J92R1l91M39P3
6104C45r6m93O4K66n0P6j86K03k84J42K10j55m1M1l9K3m6J87j57P4k35K13j02
6127d0j1j34L82q7lk55L32j33j06J84k40J98m2P5qN1k63J3oO3J72m3j03p5K21
$$ y = [151, 25, -17, 11, 22, -93, 126, -206, -116, -52, 13, 179, -79, -129, 90, 52, 87, -184, 88, -240, 218, 27, -183, 220, 18, 84, 86, 38, 153, -31, -20, 156, -50, 93, -158, -102, 52, 22, 302, 319, -166, 19, 149, 136, 132, 85, 102, 198, -11, 74, 110, 211, 172, -260, 73, -131, -117, 244, -83, 129, -71, 24, 2, 99, 44, 57, 61, 115, -25, -60, 89, 228, -128, -152, -262, 184, -333, -256, 79, -203, 85, 30, 173, -86, -177, 16, -105, 112, -249, -66, -219, -85, 145, -261, -24, -268, -330, -65, 50, -233, 53, -210, -414, 54, 155, 52, 184, -2, 174, -105, -70, -176, 49, 255, -158, 139, 56, -22, -32, 136, -30, 82, 35, -165, 117, 54, 41, 92, 106, -48, -20, -60, 95, 62, -59, 133, 224, -167, 272, 345, 249, -244, -180, 86, 36, 112, -74, 129, -155, -13, 197, 42, 1, 42, 3, 26, -20, 167, 10, 84, -151, 62, -40, -51, -185, 197, 110, 107, -148, 184, 51, -55, 129, -111, 87, 45, 120, 112, 163, -100, -87, -93, -30, 142, 99, -4, -79, 142]
6152A42j01L9J27k28O8P7q9J5N1L0k32K9R3J58m9k65J19k46L06k79K59J24Q4j98
6176C4j26P8l0J31L8k26k01L45j9p5K11k17%l3j56j20L70j92j64L06o3J31P9o04
6200e03M81L7K5j22L2q6j22K66r6J6J83p4n7M7k48J05m7J29M2l4J57l75M27k00
6224a7n6J18r6J20M2k36J63J76l09n3N60k83j44J90k51R7l3N1P2N4N6j09n2N5
6248A15J89m36L98m09L09Q4k92L16m1k49O3q6J86l97L90k98%K45R6k66J92q4j24
6271i9j5n1P9RJ8r9j7K92j54L3J51%k48J11l3l36L54j07j17P5N5o7p6K35LL8L6
6298G0k71K94n9K12k93J06j0j59J40j54K81j01l00K89J10k59K86J13j22l84K93
6319H2j02j55K49j04j06J91kK2K08k45J83j83j63k7K16n3Kp1P3J7O3j75JK15l7
$$ y = [142, 41, 80, 207, -21, 47, 124, 35, 50, 101, 131, -101, -72, 21, 179, 130, -135, -16, -262, 44, -235, 24, 148, 232, 34, -92, -14, -44, 87, 125, -101, -302, 43, 24, -51, 160, -57, -57, -90, -246, -366, 4, -188, -352, -46, -109, 22, 101, -503, -22, 15, 40, -82, -50, -136, -258, 8, -88, -72, 111, 37, -20, 27, -221, -116, -163, -34, 8, -26, 131, -244, 183, -17, -73, 45, -51, 69, 111, -125, 38, 214, -95, -148, 412, 129, -15, 175, -76, 21, -12, 39, 111, 165, 221, 112, 60, 115, 304, -132, 266, -143, 166, 250, -42, 274, 233, -16, 47, -39, 147, -250, 140, -158, -158, 87, 183, -83, 109, 25, -99, -114, -165, -86, -77, -59, -158, -175, 117, -37, -4, 147, 147, -101, 10, -23, -359, -5, -112, -229, -154, -99, -166, -242, -7, -4, 34, 70, -201, 93, 34, 246, -47, 59, 49, -110, 30, -124, 157, 56, -244, 45, 155, -104, 182, 295, 173, -211, 82, -20, -175, 74, -30, -136, 55, 53, 75, 283, 38, 221, 38, -125, -152, 64, 11, 13, -58, 15, 32, 95, -80, -79, 136, 99]
6344I9j05J43j80k44K86%j39M2l9j32J92J03M3P1j88n5J5J17J5r9J63k09j43L36
6368I2j70L85k11P9k94Q0J31J80l45P9M4J65j93kK72m13K33J66k06j10P5l1L37
6391C43l37L4J57n8j20J4r0J04n3K02j88J44q7j18K28l52R1J74n0N7J85l78j50
6414b48J99K45L8k26k08L04j73k00N28m23P9k4j26L47l40J98k46M5J97j60J32
6435f2m4J06l6l28O3M79l20j5mj44N99m06J11l75P42l51K64j60k84L63l27L02
6457A73m65j26K42K71k32K96J31m67J96K6J54n12L06K99J51m47L50l49J40P5P6
6478B88l30J58p9N38n56O51r16j11L60m17L10K30J7J61%j94K56k74R9l03J02J7
6500GK13k63J59m06K76J0m6q3J24p9K43l33L3J36l39L57J17k15j13J18m8J12J7
$$ y = [99, -6, 137, -43, -287, -1, -1, -140, -98, -137, -269, -77, 26, 69, 140, -48, -103, -88, 29, 44, -55, 108, -101, -244, 92, -78, 307, 96, 175, -119, -39, 92, 272, -73, 6, 50, 215, 22, 20, 292, -121, 112, 278, 72, -38, 37, 6, 343, 6, 40, 197, 139, 19, 33, -57, 47, -6, 196, 8, 152, 65, -53, 175, -177, -86, 88, 38, 95, 280, -98, -248, -49, 196, 234, 8, -200, 104, -69, -269, 259, -164, -85, -109, -235, 112, -228, -30, -276, -231, -34, -194, -62, -106, 0, -36, -364, -301, 178, -142, -157, -161, -305, 294, -112, -1, -376, 366, 15, 279, 119, -165, 198, -129, 173, -292, -418, -176, 95, -137, 159, 290, -177, 19, 45, 199, -313, -7, 292, 443, -4, 346, -3, 137, 212, 288, -42, 116, 37, 575, 19, 670, -246, -357, 3, -414, -104, 126, 143, 304, 304, 110, 366, 92, 191, -112, -10, 7, 220, -43, 116, -290, -14, -4, -50, -133, -9, -88, 155, -178, -145, -9, -348, 9, 126, -89, -202, -84, -132, -20, -3]
6523clL21m98k3J60R0R7j44j29J80Q3q8K8qo0O4j09Qmk1J90L69k61l36J24j57
6549a30K65O9j71k53J82oK18l64J29j67j2M60j69O7j50m1j16J12k98N12k9m7j64
6572a03Q7j16J76j57R3l2n0k8lp1K66j00n7N3K27k42j05N1K13k93k7J40K2K88
6596B32k66J80k75O7J06j17O0N6O0j14J58Kj27p6L0J94J8l32O9M3r0m5K09k5J
6621A8J60m4q6j3M3j93K48l41o9L85nk33L90l53J12O5J73k88N1R7k60J41q8J55
6645F5k98J03J90k55L61l09K03j73n9J73k42K53Q5k28j7Q5j08J25q7KK20j97j7
6668a25k08M23j05J28j47j16Q2j71K39j71j15K74N3l6k53K56M6K26k60j24K50
6689A46j71L14m47M4j6M9R6j61J4M08j58k19L0J60Jk4j55l4lL01m57K21J60Lk15
$$ y = [-3, -6, 315, -183, -206, -46, 44, 141, -3, -132, 48, 131, 43, 71, 63, 3, 67, -42, -34, -38, -59, 131, 500, 239, -97, 27, -130, 135, 204, 33, -220, -38, -44, 174, -190, -61, -228, -240, 220, 51, 118, -32, -73, -189, -77, -375, 137, 108, 61, -103, -16, -132, 44, -113, -20, -52, -102, -130, -133, -204, 62, -38, -95, -42, 185, -57, -162, -111, 102, -191, -218, -78, -56, 232, -34, 146, -129, -62, 44, -73, -13, 43, 103, -11, 147, 149, 22, -54, -24, 170, 188, -144, -75, -32, -122, -167, 42, 17, 18, 178, 134, 48, 35, 78, -115, 133, -208, -277, 108, 103, -130, 260, -93, 19, 84, 257, -31, 20, 117, -143, -2, -90, 65, -233, -130, 60, -195, 166, -143, 60, -113, -172, 1, -241, 12, 97, -131, -148, -63, -171, -46, -133, -131, 89, -108, -125, -333, 90, -15, 113, -34, -150, -68, -239, 0, -171, -286, -12, 41, 5, -248, 8, 54, 280, 20, -104, 146, -25, 289, -158, -114, -130, -81, 15, -146, -132, 276, 118, -101, -71, 89, 90, 66, -89, -123, -126, 175, -282, -61, 99, 102, -113]
6714a13L20j70k26J59P2K3j63n9K28j89k03K57p2K21o7K11k46L9m7K8K3Pm6J85
6738A72j17n6m3K71j22j46J89k65J62j01L6P1k80L93j33J3Mq1K80k34m3mj91L07
6762H2J61Rj84m4K6J33k18L79k88j38k4Q9l5J52j10r6j72J81Q4J34j82L04l28
6785h5J50p6oK09j83m4K88k08J60l66k0K5o6K52j30J39Mk27K35m7L4j48j16MK6
6810a96M2k02L10J76j89J08j42K87j23J00k50J94k26J94J39l44p3K12j47J83M2
6831I5q5r2K93j52n9M9Kj02J17l11n4K2L93j19n1K07O0k04m5J18N0J6r1J81j68
6856G0J09l11M8R5j27J49j18J41m9Qn7O3j25K95k01J72j01k56K32j87K51L2k65
6879a32P7j8R4J73k51J90o9Jm48M02j1J0k84N06j44k31J81l0j93J46O1k79K59
$$ y = [-113, 207, 37, -189, -30, 42, 65, -98, -157, 71, -118, -321, -64, -136, 85, 18, 229, -17, 22, -25, 3, 26, 33, -13, 172, 55, -1, -44, 227, 105, -41, 148, -117, 45, -56, -20, 51, -229, 164, 31, 44, 48, -33, 247, 13, -30, -34, -225, 82, 243, 252, 68, 24, 50, 183, -35, 344, 56, -82, -106, -17, -52, 100, -10, -106, -278, -97, -13, 121, -61, 243, -85, 65, -11, -17, 192, 9, -35, 253, 45, 205, -161, -181, -156, -222, 30, -100, 39, 43, -184, 51, 4, 38, -110, -226, -222, -196, -154, -356, -46, 130, -59, 49, -93, 194, 71, 171, -79, 115, -111, 83, 222, -122, -195, 17, -130, 53, 95, 10, -82, 211, 59, 0, 49, 51, -51, 66, -245, -299, -277, 116, -3, -54, 153, 213, 9, -36, 82, 132, 148, 57, 238, 70, 179, -132, -84, 11, -116, 33, -85, 56, 7, 15, -42, 21, -104, 191, -10, 162, 61, -195, 37, -150, 101, 133, -132, -55, -73, 21, 194, -57, 133, 64, 65, -383, 19, 8, 18, -266, 240, 96, -135, 46, 16, -177, -31, 30, -249, 10]
6902A0q3NJ18j39K22k8n9j77J94j07p0L25k32J46J61j44J25l66mJ09j94N8J57
6925B7j54j37J78R5q8Q2l1J00kj9P0K4o1k80K30J2J32o2m47M7K86o4l7N5m1k7
6951a12K15k14J5O2RP5j54n7K1P5k5j27M7M5K25l66J60P6m1J47j86J89l66M71
6975A84j49M7P5k6l24J72J34J82j93k30Q9R2J04k09J27K9j90k4Q4j81K02qk01
6998b14J15L82j64N3j14k0r6r8K47K6k00K42l52L13m24N50o7j87r1J00j2r2j5
7021a18Oq6J06J96l5m2kl2N7j11n6r4k9J12K28J17k53k4L5K8k5P0j67j3K7M3J25
7048F3k6J26J4l38P9J57k22J39k10N4K5M4L95k15Q3k64J90j31j50R3L14q2K00
7071C38l63R2n0J02k74M1M22k28m4kj0k51M26rl82K12n3n2N5K7p9O4L0O1k19O
$$ y = [10, -73, -68, 50, -89, 133, 105, 46, -131, 63, -44, -114, 211, -21, 125, 286, 142, 267, -99, -103, 6, -188, -130, 27, -127, -264, -86, 9, -79, 3, -28, 72, 70, 51, 121, 145, 84, -196, 34, 46, 178, 116, -331, -284, 2, -62, -99, -44, -85, -112, 103, -111, -96, -34, -25, 50, -104, -161, -140, -65, -90, -217, -170, -125, 100, -266, -106, -30, -71, 76, -110, 79, -287, 184, 35, 82, 157, 131, -193, -21, 113, 295, 102, -128, -39, 53, 157, -52, 75, 104, -86, -110, -26, -207, -5, -13, -214, -99, 283, 119, 172, 58, 38, -58, -156, 91, 117, -83, 159, -193, 120, -304, 246, 179, -8, -99, 1, -11, -103, -118, -112, -198, -92, 104, 69, 27, 25, -7, 50, -61, -117, -211, -240, -128, 100, 217, -36, -60, -25, 3, -22, 48, -119, -132, -105, -62, 63, 37, 163, 177, -161, -82, 75, -147, -8, -218, -164, -139, -95, 300, 85, 168, -96, 94, -37, -187, -94, 220, 138, 338, -25, 67, 17, 119, -155, -114, 308, 80, 36, 34, 24, -227, 199, 190, -192, 20, -33, -85, -30, -3, -82, -18, 12, 73, -146, -140]
7097a40J4j95L90k40J88k6r6O1k8K55k8r2J36j19P1k72J44r3K54p2l08K67k90
7120b19n5J69P6jL7NP1N6j65L7J0K81m54L71q4l7N9j13K1L0J2k9l8o8J16J74P3
7147C35O5m28J45N7k63N4J10p6Q3p0J45j2j62J08m6l2p5J24n3j5n0l15L93J73
7171A95l61J37j51L19k82q8n6L05K41l19R5j35J85p1p8L2L5N6k51P6J55k08K36
7194F7k6Q9k17n0p1J5K52j3j44O4j3J10q6j02J19N3j8o3J8M6k03J4J63l3j69L16
7220A18l20L34n6j01K35j35R2j89j75qJ29K33k31q5O8J7q7n7K29j22M6K4j58K01
7244BNoK3j15l6K83j95P5Q5j79n2L2j49L18o0j06J24j31K85l01J08P5j05j20K20
7269H0j03j6P0L5q8L5M1k2P1n2j83K68j74M6j09J14k1L2J92k7k99K41q8j09P5
$$ y = [-140, -126, -321, 69, -171, 17, -9, -105, -44, -72, 183, 155, 63, 199, 80, 151, -121, 23, -70, 184, 112, -196, 71, -219, -274, -105, -29, -30, 7, 12, 83, 139, -26, 11, 21, 302, -152, 219, 135, 98, 157, 44, 65, 95, 107, 78, 40, -28, 88, 262, 335, 400, -28, 117, 174, -89, -35, 75, -1, 82, 12, 157, 145, -17, 91, 45, 13, -62, 62, 9, -6, -56, -371, 22, 195, -166, -29, -180, 139, -143, -231, -287, 18, 259, -60, 35, -100, 85, 14, -64, -32, 3, 59, -192, -116, 39, -169, 67, 41, 130, -87, -137, -208, -193, 59, 46, -98, -34, -47, 63, -23, -125, -6, 47, 29, -34, -16, 30, -173, -159, 4, -29, -198, 118, -202, 132, 76, -25, 210, 75, 167, -22, -197, -205, -76, 157, -74, -159, -91, -74, -161, -218, 11, -111, -65, -41, -199, 2, 7, 1, 24, -91, -127, 156, -39, 36, 121, -58, -110, -78, -227, 91, 31, -75, 49, -82, 203, -98, 10, 85, -20, -140, 80, -23, -39, 31, 66, -22, 13, 54, 32, 103, 51, -132, 136, -38, 8, -101, 13, -8, 24, 216, 189, -110, 131, 43, -66, 9]
7294Ij8j7J48j5j39j49L41N3l46R7qr6M2L7j8P9j60K18kMj70K38m1o5j41j08K99
7321G2J26j59j39mj3L5q8j08M32j19m6K16j74P7o2j69Q6M5j10J13K9K4J26l27
7345a37r6K14K10l34j1R6J57J9k6p9j7q9J6J42j87K05J9j38nJ74l00J86j93K50
7369G6K0o9J25j29P2j35Q0j43J70L5L6k62K3K63j7k4k67K72n4J7NJ14m60K82M1
7394G1k14K33lK9j63O2r0k1K3J74j18m5J87k45K76j13j72K38j44J42j19K71k75
7417a6J84m16K17Q4j85L7K14j31J7%R6j78L9KM7J03P9k37J06K7o4j12K10k44L68
7442B47P0k96K17p6k19R4N7o4O2j25j55M24o0k63J85r3L3lj69O8J33j09J52k62
7466a52L04j28j85K62Q0k75k1P5oJ55j07o8k58K38J31m3R0j93L79m34J72j25N9
$$ y = [9, -9, -26, 122, 107, -32, -181, 160, 213, -133, -36, -44, -140, -98, -61, -79, 0, -160, 58, 56, 60, -110, 128, 87, 22, -119, -227, 72, 198, 39, -100, -104, -117, -82, -170, -278, 154, 35, -11, 205, 31, 108, 46, -123, -37, 8, -102, 11, 40, 64, 190, -137, -233, -19, 191, -143, -154, -58, 99, 118, 92, 13, -4, -93, -77, 65, -122, 83, 102, -36, -41, 133, -167, 19, -174, 76, 96, 27, 152, 23, 95, -40, 40, -103, 67, 102, 138, -124, -101, 162, 145, 121, -146, 126, 72, 89, 94, 208, -252, 30, 71, -143, 90, 87, 116, -47, 15, -75, -96, -73, 101, -17, -62, 125, -120, 156, 43, -129, 109, -35, 107, -12, 259, -16, 168, -248, -31, 53, -132, -95, 119, -12, 5, 5, 101, -77, -38, -36, 11, 114, 193, -44, 62, 89, 25, -87, 123, -121, 247, 317, 21, 238, 162, -57, 37, 94, 30, 92, -33, -188, 236, 176, -87, 98, 5, 38, 35, -134, -66, 67, -42, 110, -152, 152, 24, -161, 101, 181, -94, -115, -40, -46, 109, 2, -66, -324, -86, 45, 2, 92, -101, 278, -156, 16, -109, -50]
7489e0j37Q9K5j0J74J00k79L54j21j87J10m44M44r8K01n5k54P8Q5k64K02K36j8
7512A81j7pl1m8j78K51j10J87k92o3L70k83Q1M2k2m5J19j51N7j08J61J22m3Q9
7536B62k43Q1k5q3J35k65K12k74L30k1j44K8k5m0P9J1j58J92J80j95l1J62l36
7559a68O3j29J5L88k21p6l2K08%k06J32j36N2K76j61J7k00R3J09j13J69j27J07
7582F0o8r7k1n1L81q7J83j14o8J12j96j16J40j44P1jj1o8Q3J98l44J88K22j72
7606H0k04RL63j60j15L20l64N1J9j35r0J65q8J07P8k2Q3k19J77%J41k70J85mj2
7631I5k15P3m9n8K99k39K41j91K26m42J66M1j7J29Ql8J14j60k6J79l39J58r1o0
7655a96J17N4m9J31J99k15k06J15J18K14n1m12R0J46n5K5PK17l11J34j24J36K82
$$ y = [-50, -187, -98, -73, -83, 91, 191, -88, 266, 145, -42, 68, -376, 68, -30, 171, 116, -138, -60, 25, -239, -37, 199, 181, 164, 157, 126, 78, -100, 151, 41, 228, -64, -127, 243, -40, 41, 83, 61, 16, 135, -16, 41, -67, 94, 216, 173, 262, 19, 100, 75, -8, 127, -138, 74, -200, 130, 109, -35, -7, -32, -72, 7, 18, -140, 52, 232, 37, 6, 168, -168, -105, -234, -219, 169, -52, -128, -160, 48, 48, -158, -26, -162, -110, 166, 5, 22, -178, -85, 24, -89, 80, -47, 60, -8, -105, -126, -177, 204, 117, 300, 186, 118, 230, 34, -82, 58, -86, -15, -16, -27, -95, -12, 186, -158, 30, 252, 80, -124, -115, 248, 88, -27, 293, -71, -20, -1, -136, -226, -61, -149, -42, 36, 14, 97, -122, 55, 55, 196, -74, 111, 107, 95, -120, -47, -96, -154, 145, -94, 147, -44, 182, -260, -94, -53, -70, 59, 67, 29, 143, -17, -43, 136, -203, -45, -136, -196, -79, -25, -74, 57, 256, 41, -165, -50, 68, 282, 231, -181, -91, 55, 0, 25, 32, 249, -62, 72, -52, 84, 366]
7678C66l96q8J33J38K7k35K7L8m3R0J10p7j78K4P4k7j83L63k12k0J31j78K90k74
7702a00j09K46J58p5j6l15M7J76l4k30J03J32j16M5J7J73j42p2M3O7j66l8K62
7725E6M0k21j81L38p3l7K20o6N0K7l01J13jj53O7M4J51q1J30p7jk21K64o0K0k8
7751A9j32M39k80j95Q4O9j14P4J00N9l0j46MK38k91KJ54Kk08J66P7l38J89R6L8
7776G6l7oK32o0j87J05l02J23JJ3K3Q4l62L44J14k88K87J35k36M4N3j37m3J01
7800G7q9r1P0L10k53p3J34j39Q7J65l9k65N0K6j01L05p9l17M94l09n3n8K17r8
7824b9J39o2J48m00L04k33L14k28J83mk57K56l70K84J16j04m1k28J55J17Lk52
7846a89L33j61k34J42k6o8N2K8R7L1q3J17k37j1Q5L4K07k1j88j43K50Jr9K10k6
$$ y = [366, -30, -118, 15, 153, 180, -55, -28, 10, -33, 57, 167, 90, -88, -64, 10, -17, -200, 163, -49, -69, 62, -116, 174, -100, -209, 37, 195, 120, 104, -211, -164, 12, -22, -252, -149, -17, -133, -88, -71, 102, -40, -112, -69, -2, -168, -206, 56, 96, -125, -306, 32, -41, -78, 142, 76, 126, 153, -148, -35, -36, -189, -122, -78, 73, -8, 122, 45, 44, -177, 87, 27, 47, 19, -113, 326, 46, -149, -65, 4, -110, -36, 64, 123, 93, -53, -49, 189, -102, -100, 54, 56, -152, 14, 91, -247, -58, 38, 76, 39, 33, 265, 205, 18, 123, -179, -56, -55, -42, -19, 65, -297, 47, 161, -127, 160, 295, 59, 103, 156, 19, -24, 77, -12, -103, -33, 277, 24, -49, 85, -54, 33, 198, 159, -106, -56, -30, -131, 174, 95, -222, 272, -37, -90, -148, 69, -29, 110, 48, 196, -204, 100, -133, 181, -47, 136, 132, -125, 131, -239, 45, 161, 57, 16, -212, -57, 60, 63, -189, 144, -17, -251, -109, -135, -203, -151, -123, -26, 5, -78, 39, -198, -209, -124, -90, 117, 96, -92, -235, 15, 16, -83, 127, 101]
7871A01k26Q5L29l68K10k60L9J48k24R3L12l01J28j7k89Q5K85j79K18k13J24P6
7893A56j95K09n18O42m74K14J4J99k21JJ09j90MJ69j85J53rk01J92j35K89j92
7915C1oP4j23j79J88O4l0j57Q3L4j62L08k19M8J93J29l25L22k74N7o7LR2j55o5
7940a36O8J63k33K25l95M63p3o0j09K09o0P7k05J5j18K75j48P7k0k80R9k6J79
7963a3K87n37J63K60r6K4j7j46M4j33J76Qm0R6O9q3M1o1r3K50l53Q3K38j76l19
7988c28K02M21m06K69j75j4o9j22K73J1j61M1n8o5K80j97K45q3n9k50K6J87o7
8011i9M9j0p0J92k2k17Q8M3L12k32j3k37J82j84J41K2L3J26m4J68l96K38j65L00
8035B05k18Lk25K23p9p8Q1J89P8K8o1o0J05O9k07L3J15J1L9l62l9L2M24k58m0
$$ y = [101, -125, -40, 289, -79, 131, -129, -90, 58, -166, -73, 239, -62, 66, 49, -240, -155, 130, -49, 169, -44, 80, 156, -39, 170, -348, 294, -180, 34, 48, 247, 26, 27, 136, -54, -50, 119, -66, 87, 78, -123, 69, -66, 223, 31, 25, 99, -24, -203, -15, 49, 19, -138, -55, -21, -183, 125, -94, -46, 147, 276, -49, 273, -1, 56, -11, -8, 84, -71, -136, -68, 95, -138, 87, -308, 155, 82, 22, -87, 122, 62, 139, -66, -51, -169, 106, -42, 35, 15, -265, -166, -192, -13, 274, -263, -100, 160, 64, 88, 71, -75, -31, -164, 12, 20, -20, 76, 145, 62, 103, 42, -51, 199, -154, -71, 167, -9, -328, -126, 295, -111, 158, -17, -31, -100, -222, 51, 62, -99, -58, -116, -181, 99, -98, 147, 64, 5, -245, -219, -32, -99, -50, -60, -130, 62, 40, -177, -89, -46, 266, 34, 21, -216, -34, -218, -77, -55, -22, 104, 60, 228, -168, 70, -95, 205, -13, -10, -235, -12, -91, -169, -88, 101, 179, 207, 146, 86, 191, 260, 53, 86, 201, 212, 251, -111, -150, -118, 306, 48, 8]
8060Hj20J09K3j18JR1j96j7K95j32O9K3j14J13rr4M9K9M0QL7l69L23k6m5j47J36
8087c3k2J83m8L2r6j62J13k58M74k29k2P7n9K72j54n4j08M5m1N0K60k32k35K10
8111c7k4K3QJ05j57J1J05k86K77J78l22Q7R3K01p7j10l95L46M2o8l88M89K1j66
8135d4M9q6q7Qm8M31j54l9j46J50n8j43J27j51K95l43K63j06N8J45O8l33K23m5
8159C4j19j08J22J57j22lP6J8j85P8j82N12m46K34k18P8K33k2p7k46O5k16M01
8182F4q0N7P4r4J72n3q5k36M88
$$ y = [8, -112, -3, 20, -98, -97, -6, -202, -219, 76, -56, 13, 36, -78, 35, 26, -68, -19, 10, 50, 58, 95, -274, 49, 23, -22, -169, -33, -55, 128, 80, 112, 16, -146, -33, -291, 183, -46, -68, 9, -50, 222, 68, 14, -94, -49, -90, -40, 220, -12, -247, -37, -61, -38, -30, 75, -82, -71, 34, -252, 25, 203, -119, -32, 61, 262, 185, 75, -320, 26, 68, 0, -388, 101, 122, -44, 5, -81, -168, -160, -208, 223, 69, 30, -116, 34, -24, -167, -40, -191, 104, -239, 24, -82, -24, 121, 189, -144, 79, 34, -85, -193, -71, 86, -36, -39, 37, 55, -130, -52, -234, 278, -168, 66, -152, -74, 159, 137, 60, -186, -121, -337, 64, -16, 41, 115, 21, 193, 140, 55, -181, 307]
8191C07
$$ Imaginary data points
##PAGE= N=2
##DATA TABLE= (X++(I..I)), XYDATA
0@%%%%%%%%%%%Qj6J6j6K4l2L4m2N6o8P7r1J11j33J56j81K10k44K83l25L70m23
33b26M83n48O18o95P81q75R79j094J218j353J502j665J842k034K244k476K729
50A430l004L309l646M016m428M893n414O002o678P459q375R470j0803J2462j4602
65g909J7479k1572K7944l9703J00355k82057K20474J33485l88239L39497m5980
76E3774j88091K42308r5885r3037K05461j26199r5749J41179J147j07739J00567
87C7736K99j30980Q5644J0357n9815J16381q0994r761J17052j13941K9131L6799
99C7908j34859Q9219l932m8992J26145q2738k8689J04604q9750K3290N1734r6743
111e2803L8365M4431n1805J4839K8239m8872m1431Q9782N628p1388J03392l5866
$$ y = [0, 0, 0, 0, 0, 0, 0, 0, 0, 0, 0, 0, 8, -8, 8, -8, 16, -16, 18, -24, 32, -36, 41, -50, 61, -72, 84, -97, 113, -131, 152, -173, 197, -226, 257, -291, 327, -368, 413, -462, 517, -577, 641, -712, 790, -875, 967, -1067, 1177, -1299, 1430, -1574, 1735, -1911, 2105, -2323, 2570, -2844, 3158, -3520, 3939, -4436, 5034, -5769, 6693, -7909, 9570, -12002, 15942, -23761, 76594, -205463, 15011, 148496, -239743, 99754, 53774, -134317, 107991, 12106, -80931, 124530, -1669, -97418, 43761, 44908, -62831, 37736, 38035, -92945, -7301, 3056, -56759, 59622, -21372, -31133, 85919, -28022, 1109, 37908, -96951, -7732, -11664, -60656, 65489, -17249, -45938, 58666, -31084, -7794, 43940, -52803, -14438, 29993, -21812, -6973, 21266, -27606, -69037, 20745, 26373, -45015, 58377, 22511]
123B2511p3866J29192r8896m0554J30843j53850L5709J58910j51868L2853Q3042
134G4026j18973L6940M2895m9542J9684R930k5616R015L6787o0152k0930Q3189
146C7253o7594J5716R7943r7295K3504K2375q0923P7096m7307k7798R1863q6296
158d1463N0784M5869j03817Q5368l8950n4978J23521q3286p416Q3484j03115L0246
170a3753M1927p2511L6639J8027k3882K4406K4741k2093l0298L5317l3663k5480
182d0623P2403n6713K268P2936q2080M2705L5711r5211O9919k609n4010Q1649
194D6345m4750j9368M6354o1930K6836K0902m0391M8721m532j1812K9417k8391
206G401o377o470r003J0748r241K9202r305j3266M1727m8429R831L9657p3369
$$ y = [22511, -51355, 77837, -21059, -61613, 69230, -84620, -48911, 109999, -41869, -9016, 74026, -44947, -8007, 34888, -14654, 5030, 14960, -10656, -1641, 35146, -25006, -45936, 37253, -30341, -14625, 83318, -13977, 9527, 31902, -49021, 28075, -19232, -47030, 44833, -41463, 9321, 55190, -48627, 36741, -2209, -57187, 66334, -16952, -24368, 59116, -43999, -13753, 28174, -44337, -7698, 10329, -13553, 10853, 35594, 13501, -16797, 18520, -15143, -40623, 31780, -24933, -22665, 50271, -31809, 10896, 46607, -48604, 21315, 18706, -35304, 46345, 1595, -17773, 28581, -33349, -6513, 14389, -26002, 22719, 18187, 6375, 35792, 7401, 1024, -5446, -14449, -3701, -12942, 16260, 6955, -6311, 35416, -13013, -3182, 36475, -36894]
219c6894N3491J8857p7737P5101k6358o0416P8321m1217j0129O4912m1054R523
231F400K1890l3980m249L384m779k1615L0503J4940m6055N8902j2948n6922Q1967
244C7438n1636k2963Q7387q6346K3026N3805r8878N7675J2125o6806P3568j2341
256F054k2409M6747k9897m812N625j6871J10l53J7091j4103J3651K4132m5003
269b0038L3512K157m9841O0986k6540k3221O5748o4118R163M4020p5431M7628
281D025K1325n5168O3230r667l6254M2624l1878j7445K6582j6618P87J9922K323
294A3788j4761J0428R583l5929K3456J2763m2878M6005o791m2801N5444l8115
306i808k0553N9308m8803J5742M0663n0187K9374K75l7192K9335k0181l128K1975
$$ y = [-36894, 16597, 35454, -42283, 32818, 6460, -53956, 24365, -16852, -26981, 37931, -3123, 6400, 28290, -5690, -9939, -6555, -11334, -32949, -2446, 12494, -33561, 25341, 12393, -44529, 37438, -14198, -37161, 50226, -36120, -13094, 40711, -58167, -492, 11633, -55173, 18395, 6054, -16355, 30392, 495, -4317, 1308, -15563, -15453, -15806, 1285, -12818, 833, 24965, -20038, 13474, 15631, -34210, 26776, 236, -22985, 42763, -21355, -12192, 31828, -43603, 4025, 25350, -29818, 33412, 23745, -12509, 30115, -1763, -19208, 7374, -9244, -8457, 11465, 13788, -973, 9455, 19038, -16891, 6565, 19328, -23550, 22455, 15664, -27137, 28307, -9808, -30361, 28947, -19856, -4114, 36549, -13638, 15736, 16011, -21181, 8154, -12027, -15155, 6820]
319F820j4884J5083m107j474M538j9126K1742j2372n196K9532l4343J9400L343
332H956m0701M6152k6633j2371N8730m9152J8951L1098o0268L7684o724l8100
344c2378M6841k1934n641L1827k0412K182L320O57o945n378K9192k7934L525L0116
358B7038n2759K6991J0975n1946O1314j2920l4086O9314m2724j6803M5429n1471
370b1648J0151K3015l4866L0438J400k1534K4757r425j1313R394K359m277k948
383d497J4614j5164p739J8449k9020J5360J9029l6739M2863r21m1479N2136l1383
396d491k7540N1411m3809P386L9478m4659K5518J0798l2910K6020n686j0305J1823
409C034k221J840r369J1596q353j9112L5488j9313l349M1090m0492J5433J8122
$$ y = [6820, -8064, 7019, 2912, 1438, 5976, -13150, 8592, -3780, -8976, 20556, -13787, 5613, 8956, -31745, 14407, -12226, -24597, 34133, -15019, 3932, 35030, -25238, 12446, 5722, -32378, 14463, -7471, -13112, 18715, -1697, 485, 3805, 4462, -2483, -7861, 21331, -6603, -3078, 27038, -25721, 1270, 12245, -39701, 21613, 8693, -25393, 43921, 1197, -15606, 29823, -21648, -11497, 11518, -23348, 7090, 8490, -13044, 11713, 2288, -9025, 369, 2728, -1549, -4497, 10117, -5047, -12786, 5663, -23357, -7997, 11032, -25707, 17156, 16235, -25244, 26892, -4491, -32031, 19380, -24429, -17043, 22435, -22224, 3294, 14092, -18818, 7202, 1516, -8789, 3034, 813, 2653, -6716, 4880, -3473, -22585, 12903, -6410, -9759, 31331, -9161, 6272, 24394]
422B4394m7984L6132r112l1673M7701k1173k735K8107k8895J1656P53j1878J7441
435A2734j1851M131O01n546J1958k1737J2099M166k3741L7336j0926j3226L2854
448B8852l9539P631K1963m2100K8307K203k5918L6543j4981o591J8318k6976J0932
461a356P370j1418J3375j1710K196K575j3450J7525j1033o133J8819j3002J4184
474G942J319k1128J8216j6511m184K4286k1984J0580M088j5445K7395j9499n224
487a0149K3541l3319J9328J6913l0166K3948j3150j4947K9425k1377N039J5608
499A0694k0708J4516M234m657k755j1166J3166j2376N489K0586k9983J7092L771
512G903k3905L6791k4289j1750L8518l8383J5868K4436m4667K1677j901j8243
$$ y = [24394, -23590, 12542, 3430, -28243, 19458, -1715, -4450, 23657, -5238, 6418, 7171, -4707, 12734, 883, 5014, 5615, 69, 12027, -9710, 2389, 6555, -17186, 20150, 9224, -4002, 28852, -10687, -3056, 18907, -23193, 5114, 7317, -18601, 17942, 2961, -3630, 14688, -12288, -1356, 6014, -5404, 7971, -3739, -1543, 1032, -12418, 5107, -5926, -12059, 6760, -6242, 7942, 9261, -11867, 6349, -10162, -14346, 9940, -12044, -1464, 2624, -12821, 14574, -4925, -10149, 13392, -19927, -599, 16314, -13852, 10096, -3054, -18001, 11424, -9953, -4914, 10694, -10014, 4502, 8736, 4079, 1324, -9842, 3324, -9052, -3563, 17023, -12960, 4132, 7903, -16002, 20789, -3500, -15250, 23268, -15115, 753, 25189, -19478, 2199, 298, -17945]
524a7945L3107j7791j320J7795k0936R293O546j0305o921l68J4416j3264Q700
537A007J3631l2531K0566L592k3507L7930k4838j5576M4433l7277L165L1742m5714
550b3377J3951K0723k2670K1117r94j6410J1759k971m845L404L039j2315Q90K7132
564A8433k1004l763K7740l7294J0256L0353l9336K3956M290l8040M3190j2194
576F587k7613M2695k6098r631L8090k0590k706J0059j5215L292N162j740m722
589b430O376p60j0717K5994j3432k1524L5902k6908l844L9592m1475J0769J8055
602A5598m0395L6477k925l1733L9578j7966j0595K9923k0977m162P094p252M701
615b634O77M302q080K305Q346j7116J8017l311k4791L3396j3106j3507L3268k9082
$$ y = [-17945, 15162, -2629, -3949, 13846, -7090, 2203, 8749, -1556, -8477, -8845, 5571, -7693, 1007, 14638, -17893, 2673, 6265, -17242, 20688, -4150, -19726, 24707, -12570, -9405, 22337, -23377, -9426, 11297, -11373, 9744, 8750, -7660, 4099, 1128, -3717, -313, 2726, -9589, -8699, 18433, -2571, -6334, 21406, -15888, -5632, 24721, -14615, 9341, 13631, -24409, 18781, 6587, -21026, 21669, -4429, -14060, 24030, 3440, 734, 10793, -4422, -1130, 4032, 2292, -2430, 3946, 3186, -7531, 18463, 5031, -16493, 19409, -7499, -11343, 28249, -13226, -2457, 15598, -24797, 11680, 8755, -22978, 16600, -1366, -11961, 17962, -3015, -7177, -83, -7335, -2634, -1957, 2345, -5735, -3430, 4916, -12200, 5817, 2506, -22285, 11111, -1995, -15502, 17766, -11316]
629a1316r18K2731k6296J7383N039k1526K0645n407o774J1168j0066J318m40K527
643a932P686j1497R734k806j1061J9243j2607j952J5664k1121J4706O689k1556
656a0810J9887r654r680K2481j6222N414Q655j8549J6039m492q957J5586j4525
669d827M385P830j0932J1455q195k647R043j1809J0752k130p496J3426j3694P413
683B574M770j8773J8871q976p211K3272k1738O480J1164k3960K0700m658j3772
696a1257K2050j6609J948J3714j8156J0533n82q716J2128p440L121K063o369P074
710C502p368N011N58r676J6403j1607j028J8374k4284J1112R679k5521K4615m870
724D900j7804K7524j7089n159K2156k1309M540J1467j4463P888J770n598J953
$$ y = [-11316, -12234, 10497, -15799, 1584, 6623, -14903, 5742, 335, -6439, 4729, -5337, -4019, -4459, -1932, 5754, -5743, 3991, 1185, -9876, 9367, -3240, -5192, 10472, -10649, 4057, 10746, -10810, 9077, -577, -10257, 12224, -3998, 1416, 10071, -8478, 7561, 3069, -5888, 9698, -4827, -442, 7388, -3544, 7911, -284, -2931, 6112, -5697, 5055, 2925, -4571, 8855, -4839, 2574, 7344, -11429, 7442, -1534, -8745, 14527, -7211, -731, 10433, -13527, 7173, 2515, -11257, 10793, -5816, -3868, 9846, -8310, 2223, 1641, -7075, 5053, -2387, 734, 2797, -3572, 3502, -3866, 1145, 1703, -7973, 8430, -3177, -4205, 14169, -10115, 997, 10676, -14845, 9770, 4900, -12904, 14620, -2469, -7628, 14528, -6781, -2241, 9226, -5237, 2651, 4421, -1177, 776]
737G76J82J554n363O103Q0j0587J5957q008r510K1051j8796L60J9041k4049J2329
752A120P966k2797K0719n287j3058J9479j2714j416J0872j0338N447j294k115
765c416L441n523Q203o680o77J0072j6809J2096L452j9912K3913j0247j0822K6538
779A3629k2809L491J7478k6829J6684L878j9380K0224o266p670J3134p315O55
792a096K197k97k77k783Q214j0129K374J0405j9062J4709N335k1921K4405p189
806D885j4683K5141j9268k71J7937k3402J3034O292j8778J7396m266p867J2604
819H754q291J015M046p149M530k026r20N81m86L924o211N640L020j1862J1365
834E930l874r215J5586j3330O46J3732j9512J1965N629j8755J7359l818j0169
$$ y = [776, 958, 2512, -2851, 3252, 3332, -7255, 8702, 694, -8816, 12235, -6561, -6201, 12840, -11209, 1120, 9086, -13711, 7008, 1721, -11337, 8142, -4572, -5988, 4884, -5454, -7, -1301, -3416, 25, -5498, 2705, -3975, -4652, 5420, -11389, 707, 4159, -15753, 8160, -2087, -12909, 13629, -9180, -5689, 11789, -15040, 1644, 5522, -13858, 6366, 100, -7570, 5564, -1751, -1096, 1101, 804, 527, -2256, 5958, -4171, -1797, 8608, -10454, 4255, 9590, -12331, 12074, 4885, -9798, 15343, -3925, -4196, 13741, -9661, 3373, 9665, -9113, 8283, 4017, -3850, 8754, 463, 1478, 5524, -1625, 2905, 879, -41, 540, 54, 3978, -2233, 3407, 6427, -5435, 5930, 2056, -7159, 8427, -4903, -4257, 9475, -10037, 1928, 7557, -11198, 6161, 2343, -7826]
847g826J5208j0491L15O090j0244P507j609k775N511n010O633m442k082J0430
861G215j5225O703P243j7352J6210m014r963J8817j5503K260J3612j8880J1020
874B143M334j3397J1090m407l166M573l947L560j511K458N19m414R258j0962J027
889b842J2385j9876J1604O860k1200K0942n199j4069K4053j7353k152K0888k2343
902h302P166J0833j9936J0635K591j0926R102n68l821M400J075l583j039N313
916B940p986J289R999j3898N817P711j7052J3637J227j4165J7408p802n166J5779
930I738j4652K105P335j3594R689L00m696P873o049M228J026n455P433q360K002
945a077N744j0268J1379m553p570J4293j0721K603R961j4380R677R14j0100J1911
$$ y = [-7826, 7382, -3109, -2794, 3296, -6948, 559, -1050, -3825, 1686, -3324, 3309, -1133, -3215, 7215, -8010, -1307, 5936, -11416, 4794, 780, -9183, 9634, -5869, -3609, 10003, -8877, 2143, 6477, -6920, 4170, -237, -3403, 1170, -2777, 783, -728, 1730, 2249, -2165, 7093, -3869, -2842, 9543, -10333, 1271, 8131, -13069, 7873, 2674, -11395, 12658, -4695, -6847, 14041, -8302, -1136, 9697, -10239, 396, 2987, -7939, 1163, 595, -3226, 1174, 2249, -1334, -2373, 2940, -5046, -3757, 6242, -7656, -1839, 5872, -11180, 2457, 3684, -10481, 6927, -875, -6041, 9738, -4914, -2809, 4526, -9068, 621, 921, -3775, 4098, -1951, 2277, 3303, -2152, 5281, -3079, -1077, 4667, -5601, 5778, 1225, -6345, 7948, -2773, -170, 9791, -4589, 5088, 6002, -4098, 7813]
959G813q675k924P404o919P630l60l228N308o921M794o91n022P010r660M411O818
975F788j2601J0499l005q595J4654r254K091Q174j6197J0131O91j1668J2137q534
989d689j284J0147q908R236m91j1188J0417n140k469P591q704K710K112l930N929
1004A339l096j749J388L81M041l742L396j306r756J1157m524n714J3573j2007
1018f619L274J3059j5597R875J098j6850J6543l663q880J5027j0390j939R355
1031D293o631L915n62k586M065r06K926m291m98J601j0065J1892R89j2226J6030
1046G946o830m975J5428j4985K246P360j6227J3728K123j2578J0463m220l774
1059d295O314j531J043j701J780O71l387N794r927n87R999j3912J1883O892j9337
$$ y = [7813, -862, -3786, 3618, -3301, 4329, 3969, 741, 6049, -872, 3922, 3231, -1791, 5219, -4441, -30, 6788, -5813, 4686, 1681, -6914, 7740, -1514, 577, 8751, -7446, 2685, 3376, -8292, 3845, -4689, -5973, 4174, -4734, 4502, 4011, -7177, 3240, -1900, -4369, 3222, -5482, -2772, -660, -4590, 1339, -1757, -3506, -2118, -1737, 2304, -1438, 1958, 652, -9104, 2053, -2471, -8185, 5388, -6619, -3345, 9714, -5883, 3992, 5090, -11760, 4783, 1120, -7760, 7267, -3123, -5062, 4293, -2338, 1577, 1015, -1571, 2494, 1588, 4514, 223, -275, 1326, -8739, 3153, 4142, -8084, 7946, 1116, -3859, 11569, -3416, -1170, 6190, -10037, 3691, 5814, -6764, 3699, -521, -4295, 2019, 488, 1531, -170, 1610, 2281, -1106, 4688, -5239, -5826, 4173, -9739, 2144, 9036, -10301]
1074a0301J6822j856j3944J8926j1866o328J6377j3312L815R256j4284N046M772
1087C123n875M271L666l874k923N827k942o174Q652p488k341J4855j2027M740
1101A490J0286j9188J0337M841j5958J4124l534r363J3987p799r51P321r842M609
1115C60L930l290L585k519J9l144j191M815q244M602L847p399J1454m318n995
1130c488J0472j2040J965Q463j2044P368O83p596Q773n388k16M169n146O443j893
1145E25j065L065q531N162k534m744J1115q210K376R316j1483P549J97j0551J0324
1160B511n574j744Q816q872L648J943n661O436l039R81M140m910N855l321m322
1175c113N474p501K742M430n674P675j095l232O359o618J028J983n261O025l147
$$ y = [-10301, 6521, 4665, -9279, 9647, -2219, -8547, 7830, -5482, -1667, 7589, -6695, -1649, 3123, -2752, 1519, 5185, 1311, -1612, 4215, 1273, -4901, 3751, -3737, -6078, 8777, -3250, 1490, 11776, -7412, 2925, 7766, -8192, 5932, 2398, -6965, 7022, -777, -1728, 5593, -4249, 360, 4290, 1000, 4585, 2066, 2085, -1059, -2250, 2565, -5679, -1077, 2770, -4629, 6825, 2507, -3488, 6984, -5056, -3091, 5372, -6672, 696, 1379, -6217, 2556, -2832, -3048, 1121, -4025, 2418, 525, -540, 2525, -6006, -844, -3378, -8122, 2993, -5217, -2841, 6475, -5008, 2541, 2738, -7813, 2511, -3063, -4807, 4009, -4863, -1215, 728, -4933, 1503, -1536, -555, 3585, -1325, 4530, 1209, -3113, 2361, -5140, -2398, 2032, -3642, 4033, 2938, -294, 6065, -553, 475, 2458, -2803, 3222, 75]
1190G5l36M654p361N042K67n777R797n043j029Q130j0911L882J656j0410R120
1205A756k229k968R382n301J188K667n792L223l204qK541l436M679l525j175M975
1221B773q072O040K692p875J0767n059m592R080j1628K261N670r746R576O86n115
1236b542Q122n776l25K361n007L771k389J273K427n589N888l670k538R081q405
1251c318M397O389j1721Q702j643r726R851o197j587R427o718M039L244o184L528
1266B483k401j038J253k154L854l379M41L041o854N730o43m714J0439n754j608
1281a304Q037j1781K661L348r330Q606r02l214R007n892J34L705o920K879o99
1296a665q52L127l940L470j241l001M771m101L361K919o027P885l942n154P304
$$ y = [75, -261, 4393, -2968, 2074, 2341, -3436, 6361, 1318, 289, 8419, -2492, 1390, 3046, -7364, 1756, -473, -3441, 5941, 640, 1828, 4495, -1297, 1926, -1278, -1286, 1255, -2181, 2498, -1027, -2202, 2773, -5299, 741, 3433, -4442, 6325, 1266, -3326, 5754, -5874, -3613, 2057, -7689, 1887, 2573, -2542, 5580, -196, -521, 1840, -3167, 604, -1785, -512, 1915, -3674, 2214, -1456, -3994, 5087, -3318, 1079, 7468, -4253, 4449, 2806, -6920, 2931, -3266, -4853, 4574, -2144, 1895, 5139, -1045, 2483, 82, -956, 297, -1857, 1997, -1382, -941, 2100, -4754, 976, 333, -4381, 6058, 304, -1304, 6733, -5048, -2387, 961, -8369, 237, -665, -3879, 5128, -764, -630, 3075, -3845, -966, -1665, -2517, 610, -3330, 140, -1101, -4102, 669, -3432, -71, 2848, -3179, 4706, 764, -4390, 2914]
1311B914q278J323N722o877Q510p91m415P435o549L70L269o120N245r17k253M747
1327C335n222K833R5l498O980l460Q92M164o748M127k893m891P783o512J855P463
1343F303o983N375r33n195O402o562N57O094p592L890J355m724M289l922J169
1358d77L368l593M364j087k003J041n206L606j472m721R251m388M10O345q153
1373b715L816Q50p627P875l225l914Q481o587Q27K683n190M828p68n94M191l093
1389a62J976k366k803K949m262K736K755m258P451k182l929P601q419P68N132
1404B987p041N590n56m541O454m872k89L677k634L554q60K48J845o592M158k129
1420a001m107P030m710L036M989q069O882j195p687Q062m452j364O181o462L109
$$ y = [2914, -5364, -4041, 1681, -5196, 3314, 2523, -1892, 5543, -1006, -636, 2633, -3487, 1758, 841, -1412, 3335, -1887, 946, 1041, -2457, 4523, 1063, 1955, 6119, -629, 3498, 605, -4286, 3497, -3015, -1160, 6303, -680, 4695, 3762, -1433, 4969, -1593, -1036, 5058, -2534, 1356, 2711, -2013, 2276, -1646, -477, 2891, -702, 3662, 2575, 572, 1613, -3593, 13, -1459, -6180, 3071, -1317, -907, 5438, -2715, 1101, 1951, -5676, 2199, -1026, -4940, 3541, -3046, -2219, 464, -4726, 102, -666, -1260, 2931, -162, 1814, -552, -3355, -406, -4668, -1932, 823, -3435, 4016, 1834, -2095, 5506, -2913, -2145, 2987, -4054, 1536, 980, -3561, 2893, -1979, -2268, 1409, -1225, 2329, 1469, 1717, 3562, -3030, 1128, -1001, -5108, 1922, -2788, 248, 5237, -2832, 4050, 2855, -4832, 3230, -1222, -2586, 3595, -2867, 242]
1435B42J294n328M803k167l40L584k002L223k953j633K272o064L485J360m383
1450d607P748k915j224O465p692J623K281o344O285r64l187N097m777J334J719
1465H42l165M610k462J147L891n583L545k247n390O577m037J152O667p180M802
1480C169J355o606N672l323k554M859k873K242K19k620J962l194K561J208k294
1495b17N060m473N83L721p980L279K79o434Q877j852j709O270p130J740K500n708
1511c194M173j798j480L450k876K235j804k486M291l503L438K588n894N009k882
1526g33l832N998o179M44N454n288N389J282m916L376k830l58J869j725K431k146
1542a764P67J739l936L996k214k405Q357n789J650O064j0729M221J666p692P983
$$ y = [242, 1536, -3792, 1011, -1156, -1496, 2088, 86, 3309, 356, -1277, 995, -5069, -1584, -224, -4607, 3141, 226, -998, 5467, -2225, -602, 1679, -4665, 1620, 656, -2531, 2566, -2211, -877, 842, -2323, 2287, -175, 972, 4863, -720, 2825, 578, -4812, 1765, -2272, -1120, 5547, -1633, 3169, 4524, -2082, 3590, 267, -2287, 2572, -301, 1941, 2160, -460, 1502, -1692, 869, 2077, -217, 4843, 370, 953, 4674, -3306, -27, 252, -6182, 2695, 843, -866, 5404, -1726, 14, 2514, -3194, 979, -819, -2299, 1151, -1725, 510, -1294, -3780, 511, -2992, 446, 3034, -2860, 2149, -733, -4565, 1433, -4746, -4302, 1152, -4136, 1253, 2535, -2381, 995, -1835, -2193, -324, -2049, 382, -1764, -997, 742, -3194, 802, -1412, -3817, 4540, -1249, 401, 6465, -4264, -43, 1623, -6069, 1914]
1557A914k203l031Q646m864L78L421n988J531O23m69J705j880J981k158k74K938
1573B270m353L403J456m714P515l410m065N984p874J444N038o046M870J167l610
1588i25M359k968p79O18k251K755j756J654J125n341N240k686l029Q088n700P17
1604h79O159q012M242N26p766O454j912k717P510l643K16K683l029L40n51O1k92
1621f10J6K675l182J583J437n874N520m72m138Q560m711j967O431p883J660K868
1637A913o537N913L31k796M967l548K13P94k843K571j911Q77K015m080L928j933
1653a26l093N216m037J089M471n844M191k50n483M839l451j202M573k802K161
1668B52O33j505J326k943J581l94k088M642l517N03L588o453L951M63m803P292
$$ y = [1914, -289, -3320, 5326, 462, 840, 4261, -1727, -196, 427, -42, 1663, -217, 1764, -394, -668, 2270, -2083, 1320, 2776, -1938, 5577, 2167, -1898, 4086, -3788, -2344, 2694, -3352, 1518, 2685, -925, 3434, 466, -313, 305, -1946, 809, -947, 707, 1832, -3509, 1731, -955, -3984, 4104, -1596, -879, 5280, -2732, 1510, 2036, -5730, 724, -1188, -3905, 3605, -38, 178, 2861, -168, 172, -379, -318, -610, -594, 2081, -1101, 482, 1919, -3955, 1565, 1093, -3045, 5515, 804, -1163, 5268, -2615, -955, 1913, -4624, 1289, 1620, -1176, 3791, 243, 456, 1250, -1593, 978, -933, -56, 1959, -2121, 1807, -126, -3219, 1997, -2040, -951, 3520, -2324, 1867, 1617, -3866, 973, -2478, -3680, 893, -1909, 252, 885, -620, 706, -2237, -656, -1050, -3138, 1504, -2013, -1510, 2078, -4375, -424, 39, -4764, 2528]
1684B528k883j229N565n970J097J675n256M646j350o64M521k908J620l39k469
1699a416K775k624Q28K592l871L415p85j991L481m001J474K971l442L882p48k483
1715E7K599l844J662K59k262L169j074R57J721m035K706m30l700N429l425m67
1731f78M781o541L028J321n319N282j214j561M611l624K15N07k820J657j540Q31
1747a064J973k168L228j996j010K751m475K415J125m103N082j731k761M539m280
1762b475R21L060l890L651l71j516K483l149L79M20k235L505j975R61L101m503
1778a633K876p60l087M598l297L23L904m864K704P19m354M163j682l78L007k723
1794d84K030l15k490J892k334J163Q62j781L323k118j39K891m776K113J076l929
$$ y = [2528, -355, -1584, 3981, -1989, -892, 783, -4473, 173, -1177, -1841, 2680, -228, 1392, 1053, -1416, 1359, -1265, -437, 2155, -1716, 1699, 914, -1077, 2404, -1597, -123, 2848, -594, 3288, 2540, 57, 2656, -1188, 474, 733, -1529, 1640, 566, 1523, 3244, -791, 1915, 1485, -2215, 3214, -211, -678, 4103, -2438, 590, 1911, -3408, 1874, 660, -901, 3710, 86, 301, 808, -2012, -355, -1895, -1064, 909, -1259, 1969, -27, -1037, 1714, -2761, -346, 779, -3324, 1758, 27, -2734, 1805, -2475, -1554, 1506, -2384, 1267, 896, -620, 1863, -1286, -907, -487, -2722, 783, -1192, -231, 2870, -1633, 1243, 483, -2604, 1994, -1303, -980, 2924, -1940, 764, 1483, -2871, 1292, -390, -768, 2239, -484, 1546, 1231, -1259, 633, -1701, -538, 324, -1457, 1866, -252, -391, 2500, -2276, -163, 913, -3016]
1810c016M949k030j522L874m669J775J275l570M023j175p12K705l020J385o40
1825c68k460L430k162N46K782l310K513o48j944K967l372R07K987l457K906o34
1841F83k140K813l256J898J461k989M038j277j557K938l876J415P44l060M887
1856B722j426j784L683l178N25J095k275K667j696q4K541l387J898m66j878L147
1872B104l010K096K094m494L405q11l404M117l256J48L228l652K647P8k971K807
1888A126k401J30J478j673K109j376n52K175l629K314K12k358M014k303k81K864
1904A849m677J999R78l917M174r10j187K754k047Q75K31k304K357j405K21J141
1920A32j174J785j956k45K944m136K711J756m012M392j725k198M060m315Q47L293
$$ y = [-3016, 1933, -97, -1619, 2255, -2414, -639, 636, -2934, 1089, -86, -798, 1907, -1113, 272, -368, -2828, 602, -1560, -1014, 1768, -1542, 971, 323, -1621, 1346, -2026, -1119, 1868, -1589, 1317, 683, -1457, 1356, -1900, -2, 1459, -1530, 2508, 1231, -326, 2612, -1264, 151, 895, -2165, 2722, 1296, -488, 3195, 17, 542, 1637, -638, 2029, 333, 249, 2790, -597, 1301, 835, -1043, 2104, -906, 1190, 3284, -1210, 2195, 1384, -2020, 2097, -1159, -1011, 2217, -1435, 1212, 1290, -1681, 1126, -1275, -1145, 333, -1340, 769, -607, -1159, 1016, -2613, -299, -87, -2445, 1569, -734, -1015, 1849, -2828, -829, 149, -3768, 406, -504, -1691, 1063, -984, -109, 122, -2182, 175, -1230, -1009, 132, -1042, 743, -1213, -1458, 1486, -2650, 61, 1817, -2195, 2197, 472, -1726, 2334, -1981, -1134, 2159]
1936B159l883K655R08k593K190j812K40J027j746K327j475L95J410k912K526j161
1952B55k176M388k842K14L045m278K106J64k962L641k025m21K751k704J610j79
1968E87j715J636k049J856M00k016K984k059o59K970m178J792J712l948M456j425
1984C44k265M111l349K15K506k992K175p5j038J439j481R29m44j366K338j496
2000d49J151J154l330L117j162k054M008l114K63K888l655K677J22k671K376j582
2016b61J96J565j760J333j111j71J575k716K062M5k403L867k028j122L154m201
2032a976J392J539l586L422q45j619K978k241J58Q54j799J396p50O03K44j378
2048a608J938j617m81K615l390J770J519l266L782j547k536L816k398k48L091
$$ y = [2159, -1724, 931, 1839, -754, 1436, -376, -136, 891, -855, 1472, -3, 392, 1802, -1110, 1416, 255, -1921, 2467, -375, -161, 2884, -1394, 712, 876, -2086, 1555, -470, -891, 1860, -844, 766, 587, -1128, 508, -1541, 315, 715, -1301, 1683, -376, -1035, 1935, -2243, -451, 1261, -2687, 1769, 344, -1921, 2190, -1159, -944, 1562, -1430, 745, 670, -368, 1071, -410, 519, 75, -1291, 1047, -449, 702, 1856, -1474, 1643, 481, -1573, 2435, -679, -416, 2472, -1183, 1494, 1616, -1055, 1321, -261, -65, 1500, -260, 1073, -38, -209, 1366, -1350, 712, 757, -1646, 2221, 193, -929, 2225, -1976, -584, 955, -2631, 791, -54, -1673, 1305, -936, -778, 76, -1723, -327, -1077, -474, -230, -1608, 330, -1287, -1768, 847, -2543, -773, 746, -2520, 1262, -285, -2821, 995, -1403, -1651, 1440]
2063A440l279J966M15k004J869j368O19N86j189J609j162Q03R46k653K252o02
2079B48j967M090k557J3K993m403K122J471l807L160p52j709L195k197O02N30
2095A032j046P81j24N11l80p61K190j973j71K081l104J167J704l545L924j881
2111D05k161M303m104O16K394k616J773M98j769J163j099O40m41k68J562j682
2127g86R69O51k731K479j196j652L863k748M55K618l635K060P48l046K941j537
2143e47o66J902j130N12Jm23J042j506J599p6j795K427j872n7K185l493K162Q88
2161A153l118L830j117j717K750k487N70P94k014J857p85K06Q78j299R58m18r55
2178i14K233k312R68P52k519K524r71j781K972k192O08J984k709J460M18j858
$$ y = [1440, -1839, 127, 542, -1462, 407, -961, -342, 244, -945, 664, -498, 305, 1251, -1402, 850, 248, -1719, 2371, -186, -173, 2820, -1583, 539, 2010, -1797, 1363, 611, -1098, 2097, -100, 502, 1032, -14, 767, 643, 1154, 774, 13, 2203, 230, 59, 2140, -964, 203, 1907, -1638, 2286, 405, -1756, 2547, -1557, -941, 1453, -1163, 610, 1108, -661, 502, -597, 43, -398, -666, 896, -786, 183, 834, -1897, 582, -614, -2266, 1597, -1151, -696, 1922, -1713, 347, 1095, -1951, 990, -547, -1213, 689, -441, 71, 72, -351, 691, -815, 784, 708, -1087, 1340, -532, -589, 1596, -1897, 265, 1153, -1965, 1865, 748, -969, 1781, -706, -136, 658, -1356, 501, -284, -78, 800, -499, 459, 41, -914, 1319, -993, -25, 727, -1792, 732, -239, -2020, 952, -1240, -632, 1352, -1357, 103, 521, -1337]
2194a337J471j175K12N04r16J238o63j05J360j858J330j5j639K419j643l21K363
2211A225k989J562R61k108K273o28q76J907j542O27J33j189J490j204N12P25j473
2228e94K166j096p09K319k608J380R93k721K409m27j763K716k013J65J558j790
2244a5J088n5r23J366j190N54j09j119J438j276M00J250k340J747Qj837K553j901
2262c61o1J898k920J544N52k284K075q41m00J421j414J051j06j156J360j366L06
2279g02M24j288K064j165p28K516k206R33O59k268K046n25j191J751j687M18J427
2296D78j704J911r54o6J292j567P40J5j289J828j330o8J553k104J728J16j180
2313f01J956j426l19J125j493J044k72m58Q51j107J007P90j681J566r07m14J615
$$ y = [-1337, 134, -1041, -829, -325, -1241, -3, -666, -771, 589, -1269, 61, 46, -1593, 826, -817, -1138, 1225, -1764, -202, 759, -1349, 924, 296, -580, 1327, -215, 412, 545, -644, 846, -358, 154, 879, -594, 1572, 476, -233, 2086, -522, 858, 1851, -870, 1539, 1112, -651, 2065, 52, 217, 1775, -15, 1073, 1018, 95, 1461, 271, 825, 716, -403, 1035, -241, 159, 1409, -931, 816, 824, -1013, 1540, -361, -422, 1476, -1444, 100, 652, -1632, 443, -398, -798, 623, -791, 260, 154, -1002, 358, -1008, -702, -278, -1566, 498, -667, -1395, 1121, -1085, -152, 507, -1761, 285, -240, -1431, 320, -1367, -949, 478, -1226, 685, -269, -335, 957, -610, 130, 145, -1144, 684, -646, -714, 839, -1265, 463, 579, -601, 1355, -71, -390, 735, -758, 286, 14, -444, 407, -700, 307, 1097, -584, 982, 75, -339, 1276]
$$ [...]
8191a7
##END NTUPLES=NMR FID
##END=
