##TITLE=1H_SL2-5ID-B(f8)
 CDCl3,8 sc, 
 23.9.2021
##JCAMPDX= 6.0         $$ Bruker NMR JCAMP-DX V2.0
##DATA TYPE= NMR FID
##DATA CLASS= NTUPLES
##ORIGIN= UXNMR, Bruker Analytische Messtechnik GmbH
##OWNER= root
$$ XWIN-NMR		Version 3.5
$$ Thu Sep 23 13:48:30 2021 Russian Standard Time (UT+4h)  she@DPX200
##.OBSERVE FREQUENCY= 200.1314
##.OBSERVE NUCLEUS= ^1H
##.DELAY= (6, 6)
##.ACQUISITION MODE= SIMULTANEOUS
##.ACQUISITION SCHEME= undefined
##.AVERAGES= 8
##.DIGITISER RES= 18
##SPECTROMETER/DATA SYSTEM= spect
##.PULSE SEQUENCE= zg30
##.SOLVENT NAME= CDCl3
##.SHIFT REFERENCE= (INTERNAL, CDCl3, 0, 15.7039)
##AUDIT TRAIL= $$ (NUMBER, WHEN, WHO, WHERE, WHAT)
$$ ##TITLE= Audit trail, XWIN-NMR		Version 3.5
$$ ##JCAMPDX= 5.01
$$ ##ORIGIN= Bruker BioSpin GmbH
$$ ##OWNER= she
$$ F:/spectra/data/she/nmr/H-F/1/audita.txt
$$ ##AUDIT TRAIL=  $$ (NUMBER, WHEN, WHO, WHERE, WHAT)
(   1,<2021-09-23 13:47:05.57 +0400>,<she>,<DPX200>,
      <created by zg, POWCHK disabled, PULCHK disabled
       configuration hash MD5:
       00 E9 B6 7A A2 85 ED C7 34 08 36 98 17 FE 4E 26
       data hash MD5: 16K
       C1 0E FF 2C C7 99 F6 24 B9 5A 50 92 1C DA 7F 26>)
$$ ##END=
$$ 
$$ hash MD5
$$ A2 88 20 84 53 42 C8 5C B4 86 B8 70 B5 79 A9 7F
##$RELAX= 
##$RELAX= 
##$RELAX= 
##$RELAX= 
##$RELAX= 
##$RELAX= 
$$ Bruker specific parameters
$$ --------------------------
##$DU= <F:/spectra>
##$EXPNO= 1
##$NAME= <H-F>
##$PROCNO= 1
##$TYPE= <nmr>
##$USER= <she>
##$AMP= (0..31)
100 100 100 100 100 100 100 100 100 100 100 100 100 100 100 100 100 100 
100 100 100 100 100 100 100 100 100 100 100 100 100 100 
##$AQSEQ= 0
##$AQ_mod= 1
##$AUNM= <au_zg>
##$AUTOPOS= <>
##$BF1= 200.13
##$BF2= 200.13
##$BF3= 200.13
##$BF4= 200.13
##$BF5= 200.13
##$BF6= 200.13
##$BF7= 200.13
##$BF8= 200.13
##$BYTORDA= 1
##$CFDGTYP= 0
##$CFRGTYP= 5
##$CHEMSTR= <none>
##$CNST= (0..31)
1 1 145 1 1 1 1 1 1 1 1 1 1 1 1 1 1 1 1 1 1 1 1 1 1 1 1 1 1 1 1 1 
##$CPDPRG= <>
##$CPDPRG1= <>
##$CPDPRG2= <>
##$CPDPRG3= <>
##$CPDPRG4= <mlev>
##$CPDPRG5= <mlev>
##$CPDPRG6= <mlev>
##$CPDPRG7= <mlev>
##$CPDPRG8= <mlev>
##$CPDPRGB= <>
##$CPDPRGT= <>
##$D= (0..31)
0 1.2 0 0 0 0 0 0 0 0.06 0 0.03 0 0 0 0 0.0002 0 0 0 0 0 0 0 0 0 0 0 0 
0 0 0 
##$DATE= 1632390425
##$DBL= (0..7)
120 120 120 120 120 120 120 120 
##$DBP= (0..7)
150 150 150 150 150 150 150 150 
##$DBP07= 0
##$DBPNAM0= <>
##$DBPNAM1= <>
##$DBPNAM2= <>
##$DBPNAM3= <>
##$DBPNAM4= <>
##$DBPNAM5= <>
##$DBPNAM6= <>
##$DBPNAM7= <>
##$DBPOAL= (0..7)
0.5 0.5 0.5 0.5 0.5 0.5 0.5 0.5 
##$DBPOFFS= (0..7)
0 0 0 0 0 0 0 0 
##$DE= 6
##$DECBNUC= <off>
##$DECIM= 32
##$DECNUC= <off>
##$DECSTAT= 4
##$DIGMOD= 1
##$DIGTYP= 9
##$DL= (0..7)
0 120 120 120 120 120 120 120 
##$DP= (0..7)
150 150 150 150 150 150 150 150 
##$DP07= 0
##$DPNAME0= <>
##$DPNAME1= <>
##$DPNAME2= <>
##$DPNAME3= <>
##$DPNAME4= <>
##$DPNAME5= <>
##$DPNAME6= <>
##$DPNAME7= <>
##$DPOAL= (0..7)
0.5 0.5 0.5 0.5 0.5 0.5 0.5 0.5 
##$DPOFFS= (0..7)
0 0 0 0 0 0 0 0 
##$DQDMODE= 0
##$DR= 18
##$DS= 0
##$DSLIST= <SSSSSSSSSSSSSSS>
$$ [...]
##$SUBNAM2= <"">
##$SUBNAM3= <"">
##$SUBNAM4= <"">
##$SUBNAM5= <"">
##$SUBNAM6= <"">
##$SUBNAM7= <"">
##$SUBNAM8= <"">
##$SUBNAM9= <"">
##$SW= 20.0188988654967
##$SWIBOX= (0..15)
0 0 2 0 0 0 0 0 0 0 0 0 0 0 0 0 
##$SW_h= 4006.41025641026
##$TD= 16384
##$TD0= 1
##$TE= 0
##$TE2= 300
##$TE3= 300
##$TEG= 300
##$TL= (0..7)
0 120 120 120 120 120 120 120 
##$TP= (0..7)
150 150 150 150 150 150 150 150 
##$TP07= 0
##$TPNAME0= <>
##$TPNAME1= <>
##$TPNAME2= <>
##$TPNAME3= <>
##$TPNAME4= <>
##$TPNAME5= <>
##$TPNAME6= <>
##$TPNAME7= <>
##$TPOAL= (0..7)
0.5 0.5 0.5 0.5 0.5 0.5 0.5 0.5 
##$TPOFFS= (0..7)
0 0 0 0 0 0 0 0 
##$TUNHIN= 0
##$TUNHOUT= 0
##$TUNXOUT= 0
##$USERA1= <user>
##$USERA2= <user>
##$USERA3= <user>
##$USERA4= <user>
##$USERA5= <user>
##$V9= 5
##$VALIST= <valist>
##$VCLIST= <CCCCCCCCCCCCCCC>
##$VD= 0
##$VDLIST= <DDDDDDDDDDDDDDD>
##$VPLIST= <PPPPPPPPPPPPPPP>
##$VTLIST= <TTTTTTTTTTTTTTT>
##$WBST= 1024
##$WBSW= 4
##$XGAIN= (0..3)
0 0 0 0 
##$XL= 0
##$YL= 0
##$YMAX_a= 123734
##$YMIN_a= -240152
##$ZGOPTNS= <>
##$ZL1= 120
##$ZL2= 120
##$ZL3= 120
##$ZL4= 120
##$ABSF1= 10
##$ABSF2= 0
##$ABSG= 5
##$ABSL= 3
##$ALPHA= 0
##$AQORDER= 0
##$ASSFAC= 0
##$ASSFACI= 0
##$ASSFACX= 0
##$ASSWID= 0
##$AUNMP= <proc_1d>
##$AZFE= 0.1
##$AZFW= 0.1
##$BCFW= 1
##$BC_mod= 2
##$BYTORDP= 1
##$COROFFS= 0
##$CY= 11.3945322036743
##$DATMOD= 1
##$DC= 2
##$DFILT= <>
##$DTYPP= 0
##$F1P= 2.36226072786647
##$F2P= -0.459571619588291
##$FCOR= 0.5
##$FTSIZE= 0
##$FT_mod= 4
##$GAMMA= 1
##$GB= 0.15
##$INTBC= 1
##$INTSCL= 1
##$ISEN= 128
##$LB= 0.24
##$LEV0= 0
##$LPBIN= 0
##$MAXI= 10000
##$MC2= 0
##$MEAN= 0
##$ME_mod= 0
##$MI= 1.114404
##$NCOEF= 0
##$NC_proc= 0
##$NLEV= 6
##$NOISF1= 3.799351
##$NOISF2= 2.8
##$NSP= 1
##$NTH_PI= 0
##$NZP= 0
##$OFFSET= 15.70392
##$PC= 1
##$PHC0= -14075.24
##$PHC1= 10.40088
##$PH_mod= 1
##$PKNL= yes
##$PPARMOD= 0
##$PSCAL= 0
##$PSIGN= 0
##$REVERSE= no
##$SF= 200.130013532006
##$SI= 16384
##$SIGF1= 3
##$SIGF2= 2
##$SINO= 400
##$SIOLD= 16384
##$SREGLST= <1H.CDCl3>
##$SSB= 0
##$STSI= 0
##$STSR= 0
##$SW_p= 3612.71676300578
##$SYMM= 0
##$S_DEV= 0
##$TDeff= 0
##$TDoff= 0
##$TI= <>
##$TILT= no
##$TM1= 0
##$TM2= 0
##$TOPLEV= 0
##$USERP1= <user>
##$USERP2= <user>
##$USERP3= <user>
##$USERP4= <user>
##$USERP5= <user>
##$WDW= 1
##$XDIM= 8192
##$YMAX_p= 0
##$YMIN_p= 0
$$ End of Bruker specific parameters
$$ ---------------------------------
##NTUPLES= NMR FID
##VAR_NAME=  TIME,          FID/REAL,        FID/IMAG
##SYMBOL=    X,             R,               I
##VAR_TYPE=  INDEPENDENT,   DEPENDENT,       DEPENDENT
##VAR_FORM=  AFFN,          ASDF,            ASDF
##VAR_DIM=   8192,          8192,            8192
##UNITS=     SECONDS,       ARBITRARY UNITS, ARBITRARY UNITS
##FACTOR=    0.0002496,     1,               1
##FIRST=     0,             0,               0
##LAST=      2.0444736,     0,               0
##MIN=       0,             -240152,         0
##MAX=       2.0444736,     123734,          0
$$ Real data points
##PAGE= N=1
##DATA TABLE= (X++(R..R)), XYDATA
$$ [...]
1793A80J2j41j00l00M91l26j9K98j19K5k44K9K55m1j51J48M5j61N3j06K11k7K6
$$ 180 192 51 -49 -349 142 -184 -203 95 -24 1 -243 -214 41 0 -151 -3 42 -119 -66 -172 39 12 38
1816C8k40K22P1k8J23k49L27j27l40K9J98K47k22j07m4P8K00k82K09O3j04N3j34
$$ 38 -202 20 91 63 186 -63 264 137 -203 -174 24 271 49 -58 -102 -24 176 -106 103 166 62 115 -19
1839a9n5K99r1k30J53rn4M40m83K18m3K1k17k98K20L64m36j72M41k51k2K73l09
$$ -19 -74 225 134 -96 57 48 -6 434 -49 169 126 147 -70 -368 -148 216 -220 -392 49 -202 -224 49 -260
1862b60L17m09J64J32r8L59l91J24K34j91L4j22l6L08k96l9K62l5o4p6q7J95%
$$ -260 57 -352 -188 -56 -154 205 -186 -62 172 -19 15 -107 -143 165 -131 -170 92 57 -7 -83 -170 25 25
1885B5J4j40j35M07j78k05L72n4Nq0l10L10N4J2q0N3j76J55L83l72k3o7K72j60
$$ 25 39 -101 -236 171 -7 -212 160 106 111 31 -279 31 85 97 17 70 -106 49 432 60 37 -30 242 82
1909H2j24r8K68l16J72n9J17K2n7l7o9R9P9lk0K61n27K42L3k9Oj25J43K7k84K59
$$ 82 -42 -140 128 -188 -16 -75 42 64 7 -30 -99 0 79 76 56 317 -210 32 65 36 42 -83 60 87 -197 62
1935F2j22J59j04m2l25M75J01j85L3J16j08j28L4j48J99j57J37J12j62M6Q2k15
$$ 62 -60 99 -5 -47 -372 103 204 19 52 168 60 -68 -34 -182 17 -140 -3 109 -53 -7 75 -140
1957a40KK2J35k2m1Q3o0k9J51Pr0l8K16j22q9J84j65L3M4M4K28j88l65L09k48
$$ -140 -138 -116 19 -3 -44 39 -21 -50 101 108 18 -20 196 74 -15 169 4 37 81 125 353 165 -200 109 -139
1982a39L87N9m30L09j08R3k92r8O32m14k47J48K27l66N01o55L05J35k27j70L04
$$ -139 248 307 -123 186 78 171 -121 -219 413 -1 -248 -100 127 -239 262 -393 -88 47 -180 -350 -46
2003d6J67j46Q2j6k17L69k02j63J11R9J39k75K08J49l49j75o5L22K0L7J72J09
$$ -46 121 -25 57 41 -176 193 -9 -172 -61 38 177 -98 110 259 -90 -265 -330 -8 12 49 221 330
2025C30m83J19K44l06L95j29j56O1j16j64N7K57k70L43J5l54L5J94L1N5l82Q5
$$ 330 -153 -34 210 -96 299 170 14 75 -41 -205 -148 109 -161 182 197 -157 -122 72 103 158 -224 -139
2047a39L97j40k99L92L7k36j12N9n1K6mp8l3J39O0k92J55J28J29j21Q1k70k00
$$ -139 258 118 -181 211 248 12 -100 -41 -92 -66 -70 -148 -181 -42 18 -274 -119 9 138 17 98 -172 -372
2070c72M08k24M4l2K2K42m5%o2K02j62Q4k20K66p8j96K51k74L13l70J39PK22k71
$$ -372 36 -188 -144 -176 -154 88 43 43 -19 183 21 105 -115 151 73 -123 128 -146 167 -203 -64 -57 165 -106
2094a06k3J84K89j84Mr1o8M5O6q4J22l89K29J42j42L66j34j74L4J70k48J66oj69
$$ -106 -129 55 344 160 164 73 5 50 116 32 154 -235 -6 136 -6 360 226 52 86 256 8 174 168 -1
2118aK55m19K61j99j75K86R2l38J27L0j20K02L6J48k55r5J43k3J36m12L40M1R7
$$ -1 254 -165 96 -103 -278 8 100 -238 -111 -81 -201 1 37 185 -70 -165 -22 -45 91 -321 19 60 157
2141A57j37k26J95j41J96K9k17J17L0j57J41j2k40K43o5L5p8L76j60j23K46J44
$$ 157 20 -206 -11 -152 44 73 -144 -27 3 -154 -13 -25 -265 -22 -87 -52 -130 246 86 -37 209 353
2163C53k95o6P6j70L28k20P7j38K14k34K6n1N6J34J29l63J55k21M88l38L21L3
$$ 353 58 -8 68 -102 226 6 83 -55 159 -75 -49 -100 -44 90 219 -144 11 -210 278 -60 261 294
2185B94l92M4k61L50J28o12L91J14j07J89n9j34K07m3k25J11l2j9P4j19j86K22
$$ 294 -98 -54 -315 35 163 -449 -58 56 -51 138 79 -55 152 109 -116 -5 -37 -56 18 -101 -287 -65
2207f5l9J60k76M3q5J65k66J32K44j03K69j44R2k57K13J57o9J6l0j46l2P5J47
$$ -65 -104 56 -220 -177 -262 -97 -363 -231 13 -90 179 35 127 -130 83 240 171 187 157 11 -21 54 201
2230B01j53r5QP2k27J85J37k18L17J21k24r1j39J66o8j05M24k14l9Jl5P4n3q1
$$ 201 48 -47 -39 33 -194 -9 128 -90 227 348 124 33 -106 60 -8 -113 311 97 58 59 24 98 45 -36
2254c6P2M0j01k80M2K16M93l14mk70l8M7o7j61L24kK46j85O0j3Q4l53J85r7N7
$$ -36 36 76 -25 -305 -263 -47 446 132 128 -142 -180 -133 -200 -361 -37 -39 207 22 82 69 153 -200 -15 -112 -55
2279e5nm1P3j21J13N5QOo3k37J33J76m2M5o0K0J17L4p5j61L66o5k20Q7q3L92k19
$$ -55 -60 -101 -28 -149 -36 19 27 33 -30 -267 -134 42 0 45 -15 5 122 156 81 -80 286 221 1 88 5 397 178
2306A78k30L6K10n7r4k03L35j14q4J16j67Q8k66J27J13k3J47j69J25K09m14M0
$$ 178 -52 -16 194 137 43 -160 175 61 -23 93 -74 14 -252 -125 -12 -35 112 -57 68 277 -137 -97
2328i7n0J57J00k59J46k5J2j5j85J50J85k44J84m1j70J57J65m2k37J16K82k05
$$ -97 -147 10 110 -149 -3 -28 -16 -31 -216 -66 119 -125 59 18 -152 5 170 128 -109 7 289 84
2350H4j69J44L1n8j04K23j26R3j99L60o3k98J9m4L04%O4l35M4J63q8k7Kj15r2
$$ 84 -85 59 90 32 -72 151 25 118 -81 279 216 -82 -63 -107 197 197 261 -74 -30 133 45 18 20 -95 -187
2375a87M53j64q1j05P6l2k21K94j70K30o3j55O4K32k15J8n7K35l19L52l21J33
$$ -187 266 102 21 -84 -8 -40 -261 33 -137 93 30 -125 -61 171 -44 -26 -83 152 -167 185 -136 -3
2397cL16l70r2k03N33l22l6J31K87l05P6m1J6K1k14j41M69q0k15L34k94J27J74
$$ -3 313 -57 -149 -352 181 -141 -177 -46 241 -64 12 -29 -13 8 -206 -347 122 42 -173 161 -133 -6 168
2420A68j74pJ57j82j48l1J81m0K58l54K42k95K31L01k06j30L84n03K11N0m44M04
$$ 168 -6 -13 144 -38 -186 -217 -36 -76 182 -172 70 -225 6 307 101 -29 355 -148 63 113 -331 73
2442G3J86l36J28j33J14L88m38K31l34J34K3o4Mq8Q8n1J08q0N7m4J81k92J15K34
$$ 73 259 -77 51 -82 32 420 -18 213 -121 13 36 -28 -24 -112 -24 -75 33 -47 10 -34 147 -145 -30 204
2466B04k97m9k0j56O4N50m50mJ01k22L88l5J98k05r3J81M1J6k12L11l02o2K43
$$ 204 -93 -142 -162 -318 -254 296 -154 -158 -57 -279 109 74 272 67 -26 155 196 212 0 311 9 -53 190
2489A90k67J31k19K36r9J31J9p8J53k46K58k06J1O4j05O4J67r1k17j05O9L8o4
$$ 190 -77 54 -165 71 -28 103 122 44 197 -49 209 3 14 78 -27 37 204 113 -104 -209 -140 -102 -166
2512a66K81k80J64K5k7l7K34k15On3J18j12J96k14k22M49k99K07l62J67Q4k12
$$ -166 115 -165 -1 24 -3 -40 194 -21 -15 -68 50 -62 134 -80 -302 147 -152 55 -307 -140 -56 -268
2534b68L3L16k41K08n4J36P7j14J46k32K3K58l61K11l16J78K6K25j46j37J20j04
$$ -268 -235 81 -160 48 -6 130 207 93 239 7 30 288 -73 138 -178 0 26 251 105 -32 88 -16
2556a6Q3p5K1J5j72J66q6K27k60K40Nj36J05j00k65K65l4K24j9j55rQ8m43K68
$$ -16 67 -8 13 28 -144 22 -64 163 -97 143 148 12 117 17 -248 17 -17 207 188 33 24 112 -331 -63
2580f3K16l94J11J9l2O8J93k37J02K13L7m06L30l81L72k58Q1k9j64nM38q8j10
$$ -63 153 -241 -130 -111 -143 -75 118 -119 -17 196 233 -173 157 -224 148 -110 -29 -58 -222 -227 211 123 13
2603A3q8P2k2J06j40j43P6K33J52l02Pq8Q6O4K2L5n1m1J13j01L5j18K24q0PQ1
$$ 13 -75 -3 -25 81 -59 -202 -126 107 259 -43 -36 -124 -38 26 48 83 32 -9 104 3 38 -80 144 64 71 152
2629A52k34j94M11P0j51n8L28L8l17O5k22M60l20j87J13N6l22K52K75k74J20L4
$$ 152 -82 -276 135 205 54 -4 324 362 45 110 -112 348 28 -159 -46 10 -312 -60 215 -59 61 95
2651I5k28j59L35J45l33J5r4N4J53j01K97k79m3K35L9k20N2K34K9j81q0j69J57
$$ 95 -133 -292 43 188 -145 -130 -224 -170 -17 -118 179 -100 -143 92 131 -89 -37 197 226 45 -35 -204 -47
2674d7M6M3j29L00k87J44k98J41R7j43J68Ol6k2P4L9j50M0O9o3N5j63R7j89L69
$$ -47 -1 42 -87 213 -74 70 -228 -87 10 -133 35 41 5 -17 57 96 -54 -14 55 -8 47 -116 -19 -208 161
2699A61j16j29K62j25J63j56l89M14O1n2M2n7k2j47j7J56kl1m4m8K94l50M2N2
$$ 161 45 -84 178 53 216 60 -329 85 146 94 136 79 57 -90 -107 49 47 16 -28 -76 218 -132 -90 -38
2723c8J23j67n1J68j94p7M6L50k51m7L36j30oj86L83l57n0K23k05L58mp3j41K44
$$ -38 85 -82 -133 35 -159 -236 -190 160 -91 -138 198 68 62 -124 259 -98 -148 75 -130 228 224 151 10 254
2747B54k96K52m31L3L54m17K01J11m6j03J52j17M14k61k05K18j4p1j69J29Pp0
$$ 254 -42 210 -221 -188 166 -251 -50 61 15 -88 64 -53 361 100 -105 113 99 28 -141 -12 -5 -75
2769g5J48l1m6J89l47J86L9J29n2k17r0L66j47k3N2j0r9%J5Q9j50k36K74k70J72
$$ -75 73 42 -4 185 -162 24 63 192 140 -77 -167 199 52 29 81 71 -28 -28 -13 76 -74 -310 -36 -306 -134
2794a34M27l52l2L31k99K58l94P3P4k24L07j29N0N4K11k71J71m5mn1O8J05j20
$$ -134 293 -59 -91 240 -59 199 -195 -122 -48 -272 35 -94 -44 10 221 -50 121 76 72 21 89 194 74
2817G4Q9k18j85J34KK14j28K25j36j2K61m62K15K45l43J3j19J26M63m26k3j13
$$ 74 163 -55 -240 -106 -104 110 -18 207 71 59 320 -142 73 318 -25 -12 -131 -5 458 32 9 -104
2839a04K09k95K79j1k83R4R9k31K78jO6k25l1K83j26j15o2R0P4o5J06l43K75K4
$$ -104 105 -190 89 78 -205 -111 -12 -243 35 34 100 -125 -156 127 1 -114 -176 -86 -12 -77 29 -314 -39 -15
2863a5K12j32j25L0J22l66K89M2k43o7M51J1l59j6N6J09l7lQJ73j23K9j47K30
$$ -15 197 65 -60 -30 92 -274 15 57 -186 -253 198 209 -150 -166 -110 -1 -38 -41 -33 140 17 46 -101 129
2887A29m8j83j14M42l80j20J71L31N1k69K37k70J70m91J11J7J88L7m6k6J15k11
$$ 129 81 -102 -216 226 -154 -274 -103 228 279 10 247 -23 147 -344 -233 -216 -28 9 -37 -63 52 -159
2909a59J20j65P7J08J16O2k77J54j22jj53K66q8K05N2j98O3j76L73k93j22P9q2
$$ -159 -39 -204 -127 -19 97 159 -118 36 -86 -87 -240 26 -62 143 195 -3 60 -116 257 -36 -158 -79 -161
2932a61J00L82n34q7L67J63r3j44r9K28j34J7r9J08j3K31j16j61P3O8m5k6J12
$$ -161 -61 321 -213 -300 67 230 137 -7 -106 122 -12 5 -94 14 1 232 116 -45 28 96 51 25 137
2955A37j58K9JK07o4Jk23L3K74k50n1K90l95L21k39O7j16L11k23o2K36L83n16
$$ 137 -21 8 9 216 152 153 -70 -37 237 -13 -64 226 -169 152 -87 -20 -136 175 -48 -110 126 509 -7
2978gm6%n3k0p6J02J6L4K7L84l42n7J18K45k70M0m3j10n7J04Q6j09M7J19J28m06
$$ -7 -53 -53 -106 -126 -202 -100 -84 -50 -23 361 19 -38 80 325 55 95 52 -58 -115 -11 75 -34 13 132 260 -146
3004a46R2J89j61j41J20j08R5j36L34m3j81J40k77J53K32r0J17k27j91K42k5Q4
$$ -146 -54 135 -26 -167 -47 -155 -60 -196 138 95 -86 54 -223 -70 162 72 189 -38 -229 13 -12 72
3026G2m9%J71J47k06k66J46m9k40L64k95K86j30J40%k26L74p0n60M12kKj62K45
$$ 72 23 23 194 341 135 -131 15 -34 -274 90 -205 81 -49 91 91 -135 239 169 -391 21 19 21 -141 104
3050A04Q8l60K14l31M14j41J68j80J94m75K38K89l58Q4J4j4J18m7p9J7R9r5o9
$$ 104 192 -168 46 -285 129 -12 156 -24 170 -305 -67 222 -136 -52 -38 -52 66 19 -60 -43 56 -39 -108
3073a08N2p6Q4K25j91kK9k0j25pM16j86j49J15n1k25m5K79K37k75K40l97J99k03
$$ -108 -56 -132 -48 177 -14 -16 13 -7 -132 -139 277 91 -58 57 6 -219 -264 15 252 -23 217 -180 19 -184
3097a84K05k27L33j73Lq5Q8O6j40K03k44J0J24L9k8m4j95R4N0K19q3j93R5k10
$$ -184 21 -206 127 -46 -43 -128 -40 26 -114 89 -155 -145 -21 18 -10 -54 -249 -155 -105 114 31 -162 -67 -277
3121b77M11k65K36m71K56J07j99Q5l2J93j59J13P9Q4Kj12r6J38j47n1K39k26P7
$$ -277 134 -131 105 -366 -110 -3 -202 -117 -149 44 -115 -2 77 161 163 51 -45 93 -54 -105 134 -92 -15
3144a5j72L73m14J70L35k40lJ16p6K25k73k80J73N9R5j8k5j67%o4J94o1K60l06
$$ -15 -187 186 -228 -58 277 37 34 150 74 299 26 -254 -81 -22 73 55 30 -137 -137 -201 -7 -68 192 -114
3168a14K1L57k35k2r5Q1K6j23J17q1J6K32k27J74j37K6l1p4j46J52j67J53L45
$$ -114 -93 264 29 7 -88 -7 19 -104 13 -68 -52 180 -47 127 -10 16 -15 -89 -235 -83 -250 -97 248
3191B48l36K61k40J78o7O7q9n3Q7J63r2R9k36j08M8J94j51NL9J10j41P3J36j3
$$ 248 -88 173 -67 111 44 111 22 -31 56 219 127 226 -10 -118 -70 124 -27 -22 17 127 -14 59 195 182
3215A82r8j70K27r7m6J5K5JkJ6j63K02n06L09J11p4N5K30j67j06K47O1n89M57
$$ 182 84 -86 141 44 -2 13 38 39 37 53 -110 92 -414 -105 6 -68 -13 217 50 -56 191 252 -337 120
3239A20j59l6j13K50j57J10j35J71k16o6J61K17k17k98N64j72o2k49J44K92k47
$$ 120 -39 -75 -188 62 -95 15 -120 51 -165 -231 -70 147 -70 -368 196 24 -38 -287 -143 149 -98
3260i8l8K40j94J4J66j28J7j87J30p9K15m8J00j99M20l70R0r4O5j4o1K4J23P3
$$ -98 -136 104 -90 -76 90 -38 -21 -208 -78 -157 58 10 110 -89 331 -39 51 -43 22 8 -53 -29 94 167
3284A67j68k53K20L21l6j1l00P2m3K77m30L91j62j78j37K11j75K6N3N1K75r4l45
$$ 167 -1 -254 -34 287 251 240 -60 12 -31 246 -184 207 45 -133 -270 -59 -234 -208 -155 -104 171 77 -268
3307b68K70R0j20l7p3nL88k42K40k66P6n2O3j12J70l60M5L55nj70j37K79p2j40
$$ -268 2 92 -28 -65 -138 -143 245 3 243 -23 53 1 64 -48 122 -238 -193 162 157 -13 -150 129 57 -83
3331h3Q5J92k00rJ19r7j18K85m25M58qj40Q3j56J81JL02m75j81o7J5O2J98k3o8
$$ -83 2 194 -6 -15 104 7 -111 174 -251 207 199 59 142 -14 167 168 470 -5 -186 -253 -238 -176 22 -1 -69
3356f9p4J71J40k39rJ13M4p8J54k85L47k49J12k44j78L57o5P6j11R5K82l18k0
$$ -69 -143 28 168 -71 -80 33 77 -1 153 -132 215 -34 78 -166 -344 13 -52 24 -87 8 290 -28 -48
3379d8J9L4R7J09j04j34J0J56r1M9p4L2j44J70n1j34R3K17l04j21M18Kk11j36
$$ -48 -29 5 102 211 107 -27 -17 139 48 97 23 55 -89 81 30 -104 -11 206 -98 -219 199 201 -10 -146
3403a46K21k71K21KJ02j4l20K16K79m31N9J24J34k7kk4m3q1j16J89j30j03K87
$$ -146 75 -196 25 27 129 115 -205 11 290 -141 -82 42 176 149 147 123 80 -1 -117 72 -58 -161 126
3426A26k47q5K33j55L45k49n7l5K23j17J78l20J75J86k91j43R3j00J26J13j18
$$ 126 -121 -206 27 -128 217 -32 -89 -124 99 -18 160 -160 15 201 -90 -233 -140 -240 -114 -1 -119
3447a19j6l2J11p0J91k36K71Q8l88J59J60o0j62j6K31r5j43O1r9M07m97K92q8
$$ -119 -135 -167 -56 -126 65 -171 100 188 -200 -41 119 59 -103 -119 112 17 -126 -65 -164 243 -254 38 -50
3470e0J99O3k68J60j88J66n6r0o6R4J20J69j60R9l49J96j87JQ7L2K60m36M42p2
$$ -50 149 212 -56 104 -84 82 26 -64 -130 -36 84 253 93 192 -157 39 -148 -147 -60 -28 232 -204 238 166
3494A66j98k3k2M8j73K63L5j97P0J13p0p1k42P1m7J89K32P2j59L18k60l16K61
$$ 166 -32 -55 -77 -29 -202 61 96 -101 -31 82 12 -59 -301 -230 -277 -88 144 216 57 375 115 -201 60
3517F0k61L03P9R8n69L47l3n3r1L99m14K61n1J56l85K93M5r4k04K85k46M77j85
$$ 60 -201 102 181 279 -290 57 24 -29 -120 279 -135 126 75 231 -154 139 184 90 -114 171 -75 402 217
3540B17k68J68j07k53M08N9k56j60J76J62q0l13J78j86J99L8j37J92m5j70L59
$$ 217 -51 117 10 -243 165 224 -32 -192 -16 146 66 -247 -69 -255 -56 -18 -155 37 -8 -178 181
3561A81l14K68l1k50O7J77j67o7J24k18J76J70q1j61K24j18o8J52j94R9L7q2K04
$$ 181 -133 135 104 -146 -79 98 -69 -136 -12 -230 -54 116 35 -126 98 -20 -88 64 -130 -31 6 -76 128
3584A28j53r2J00j49K12Q0O5k16j67K53K9j13Q9NJ27l26M00P8m71L22n4l27MQ5
$$ 128 -25 -117 -17 -166 46 126 191 -25 -192 61 90 -23 66 71 198 -128 272 350 -121 201 147 -180 -176 -91
3608i1M8k83L56J70k51K5p1j39J99j5P0j21J32J03k41J10m7K98k50J15l09K95
$$ -91 -43 -326 30 200 -51 -26 -97 -236 -37 -52 18 -103 29 132 -109 1 -46 252 2 117 -192 103
3630A03m7n2J19l7j75JP7j73J32n4j46K96j79J32J55j30r7K05k05n1N28m75J0
$$ 103 56 4 123 86 -89 -88 -11 -184 -52 -106 -252 44 -135 -3 152 22 -75 130 -75 -126 402 -73 -63
3653f3J48n9k19L53L7l17K65j3l4k59L83l30L33k09K07l69J69Q0J47l17N1n3J1
$$ -63 85 26 -193 160 197 -120 145 132 98 -161 222 -108 225 16 223 -146 23 103 250 -67 -16 -69 -58
3676e8J62K3j57L0Q0k62N8L3l4R2K1J95k30NJ74k72L94k67j48l2L49l01K50k77
$$ -58 104 127 -30 0 80 -182 -124 -91 -125 -33 -12 183 -47 -42 132 -140 254 -13 -161 -193 156 -145 105 -172
3700a72j7L04k12o0J06J8j21K41L1k51K85l04K28j47j34J64M0j72J49Q8p3j57
$$ -172 -189 115 -97 -157 -51 -33 -154 87 118 -133 152 -152 76 -71 -205 -41 -1 -173 -24 64 -9 -166
3722a66M7L3k4J92L5M1k27K61O0q6J1l14J86Q0o3rl3jj5K7n4n9J52r2Q1q4Q9Q7
$$ -166 -119 -86 -110 82 117 158 -69 192 252 166 177 -137 49 129 66 57 24 23 8 35 -19 -78 74 -18 63 -21 68 155
3750A55j65j66K45j48J65k65J79N2J03l39L8qJ04L19l62J60k23J46n7p5m5K42
$$ 155 -10 -176 69 -79 86 -179 0 52 155 -184 -146 -154 -50 269 -93 67 -156 -10 -67 -142 -187 55
3772E5m5L2J11j11J26l01K91k0l21K30m0L5J86J01m85K53L0K8RL2j86m2J26k64
$$ 55 10 42 153 42 168 -133 158 138 -183 47 7 42 228 329 -156 97 127 155 164 196 10 -32 94 -170
3796a70K74J06k76M6O0r2K18Nj48k08L73k60J85l62N13j83j53R2K41k87n9k61
$$ -170 104 210 -66 -20 40 -52 166 171 23 -185 188 -72 113 -249 264 81 -72 20 261 -26 -85 -346
3818c46N43k43j12K11L2p0J13K4j74L2O3r9J24l4k33n2J86J10j35J66o6k21J93
$$ -346 197 -46 -158 53 85 15 128 152 -22 10 73 -26 98 64 -169 -221 -35 75 -60 106 40 -181 12
3841A2L9J64k54J66m7p2R5l31L43j05J05k91m6J46J47M0J03j57J19l30K98r4K32
$$ 12 51 215 -39 127 80 8 103 -228 115 10 115 -176 -222 -76 71 111 214 57 176 -154 144 50 282
3864B82j88M4M6n3k87K03J00J2l17J78k06J74K64J0k58J65l18J18L29j35q0k72
$$ 282 94 138 184 131 -156 47 147 159 -158 20 -186 -12 252 262 4 169 -149 -31 298 163 83 -189
3886a89J43Q3R5q7j15J35J2l08m9N50k85n0J46k36k02K24J42j92M30l03lJ6m3
$$ -189 -46 37 132 45 -70 65 77 -231 -280 270 -15 -65 81 -155 -357 -133 9 -183 247 -56 -59 -43 -86
3909h6J22j99K53O7l32O2N04o97M3L85j38M9Q0k74J55k9J77l38L12p0m4j16p7
$$ -86 36 -163 90 157 -175 -113 391 -306 -263 122 -16 33 113 -161 -6 -35 142 -196 116 46 2 -114 -191
3932a91K13J71k49J75J5P2J19n30j0J97J32j15m9n7K89k20j23L63k9m3j33q0R3
$$ -191 22 193 -56 119 134 206 325 -205 -215 -18 114 -1 -50 -107 182 -38 -161 202 173 130 -3 -83 10
3955A0J7k17j05L23j32o8J09o3P3l7j47L46j79k8L4N4p6J70j48n5J15M0O4k64
$$ 10 27 -190 -295 28 -104 -172 -63 -126 -53 -90 -237 109 -70 -98 -64 -10 -86 84 -64 -119 -4 36 100 -164
3979a64J19O7J11lk37J10M8J48Rj94m3J91j51j88K96P1l03L6R1J08l85L33n9j7
$$ -164 -45 22 133 130 -107 3 51 199 208 14 -29 162 11 -177 119 190 -113 -77 14 122 -263 70 11 -6
4003fK24l10P6r3K05k37M1J34k66K65k93K39J97j9l37L14l2l24K35k94L51j5j17
$$ -6 218 -92 -16 -109 96 -141 -100 34 -232 33 -260 -21 176 157 -180 134 102 -222 13 -281 70 55 -62
4026f2j45L22J23j77l09K94j2J7J65l0j98r1J75k21JJ97k6L9p7J48k16K52m32
$$ -62 -207 115 238 61 -248 46 34 51 216 186 -12 -103 72 -149 -148 49 23 62 -15 133 -83 169 -263
4049b63L51j38q6J43N1j07K39k38oO0j02J25J9j65J22L9R1k26J31oJ8N7K99l32
$$ -263 88 -50 -136 7 58 -49 190 -48 -54 6 -96 29 48 -117 5 44 135 -91 40 34 52 109 408 76
4073G6j44J39k09j02J94M5N2N5k24K04j47q5Q5J24k50K22j27p3J87J02M8j28N
$$ 76 -68 71 -138 -240 -46 -1 51 106 -118 86 -61 -146 -61 63 -187 35 -92 -165 22 124 172 44 49
4096D9J9QM1q3j49qK15n1L14n43J73l7r4O9o2K16K1k08M18qj90k08M13m29K32
$$ 49 68 76 117 34 -115 -123 92 41 355 -188 -15 -52 -146 -77 -139 77 98 -110 308 300 110 -98 315 -114 118
4121A18o5Q4r2j19k1q0J87J2P2j06j75K97n0j68K18k27K39j12m3K73k37j6n8J84
$$ 118 53 137 45 -74 -95 -175 12 24 96 -10 -185 112 62 -106 112 -115 124 12 -31 242 5 -11 -69 115
4145A15p5k3j46J10J11l8J37n07K62Q9n6K03q9K5j08p1K45m19L45o7K74k74K7
$$ 115 40 17 -129 -19 92 54 191 -316 -54 35 -21 182 93 118 10 -61 184 -235 110 43 317 43 70
4168G0K3j98J89J03l3j44L41n03K94j77N9N8K5k18J39Rj93J04qL9Q7j02j17N3
$$ 70 93 -105 84 187 154 10 351 -152 142 -35 24 82 107 -111 28 37 -156 -52 -60 -21 66 -36 -153 -100
4192a00M05l82j18M70j29j62j0J50j26r7J78Lj16P2j00j43M4Q6L30l10M8O9k1
$$ -100 305 -77 -195 275 146 -16 -26 124 -2 -99 79 82 -34 38 -62 -205 -161 -75 255 -55 -7 62 41
4215D1O3k57J58k36K07j2J46q6jm2J49k86J70%j78J41j7J29j15j20J04p2K97l0
$$ 41 104 -153 5 -231 -24 -36 110 24 23 -19 130 -156 14 14 -164 -23 -40 89 -26 -146 -42 -114 183 153
4239A53k41J76r0m6k4J40j0j33J41Q3j83J21j05Q7K1L5j47j10M17j08j26O7k90
$$ 153 -88 88 -2 -48 -72 68 58 -75 66 149 -34 87 -18 69 90 125 -22 -132 285 177 51 118 -172
4262a72L46Oj18J15k50O9r1K2J51J30m17K13J10M0k50M0J12J06k27R5o4o0K6K43
$$ -172 174 180 62 177 -73 -4 -95 -73 78 208 -209 4 114 154 -96 -56 56 162 -65 30 -34 -94 -68 175
4286A75j14L3q4K1n6M3j09R8P6k29J49J55j64m9P8k7r9M62n00K43l9j97J61lk70
$$ 175 61 94 10 31 -25 18 -91 7 83 -146 3 158 -6 -55 23 -4 -103 359 -141 102 63 -134 27 24 -246
4311b46O45k43l69J53N2J19j87K0K24k8O8j21k63k6K0L41l36J23J40O9m3o1j39
$$ -246 399 156 -213 -60 -8 111 -76 -56 168 140 208 87 -176 -202 -182 159 -177 -54 86 155 112 51 -88
4334h8J93P6l07oL7R5J36k19j0j63K24mj95O0Q5p4L13Nk16O1j74L55O2m6m10M1
$$ -88 105 181 -126 -132 -95 0 136 -83 -93 -256 -32 -36 -231 -171 -86 -160 153 158 -58 3 -171 184 246 200 -210 -169
4360a69J84K41l02K32k30j5N3R3p3p0K96l83Q5Ml20M25o2R6Q4r8p2j47K97r1j40
$$ -169 15 256 -46 186 -44 -59 -6 87 14 -56 240 -143 -58 -54 -374 51 -11 85 169 71 -1 -148 149 58 -82
4385h2rO2J82r1O1k96K57j63K41j53j39J83R5j86L38j06k47K0M7NK5kl17J78K11
$$ -82 -91 -29 153 62 123 -173 84 -79 162 9 -130 53 148 -38 300 194 -53 -33 14 19 44 42 -275 -97 114
4410A14qm1J61m87K32n0K72j33m2K50l10J97k25J25k73K05K63j48j89k3Q4J86
$$ 114 106 65 226 -261 -29 -79 193 60 18 268 -42 155 -70 55 -218 -13 250 102 -87 -110 -26 160
4432A60l56r4K24J22k21Q6J97K6k72L5J27J38J3n10L32oN3Q4j86J92j38J45k33
$$ 160 -196 -290 -66 56 -165 -79 118 144 -128 -93 34 172 185 -325 7 1 54 138 -48 144 6 151 -82
4455h2K64k02o2J78j05j92J23J53k05K03j52J71M1j45r4N4j68K58k75L30Ml4j86
$$ -82 182 -20 -82 96 -9 -201 -78 75 -130 73 -79 92 133 -12 -106 -52 -220 38 -237 93 97 63 -123
4478a23K8m5j22R1K43k60K72j68K64o14M31k0J61J19j73M8q5K55l84J25j25J48
$$ -123 -95 -140 -262 -171 72 -188 84 -84 180 -434 -3 -23 138 257 84 132 47 302 -82 43 -82 66
4500F6J84j14Q9p0m03K75Q3n28O57j60J13J3l59J68M07p18J53K79j34k39J35L9
$$ 66 250 136 225 155 -248 27 110 -418 239 79 192 205 -154 14 421 -297 -144 135 1 -238 -103 -64
4522f4l8J11k00M46n84O93l10k72J44K9K24j75m1K2J3n7k11L21M9j31L07j73l13
$$ -64 -102 9 -191 255 -329 364 54 -218 -74 -45 179 4 -37 -15 -2 -59 -270 51 100 -31 276 103 -210
4545b10J21J09j80J06K79j21L1q7k15L29k07K42k37M5k0K03O4l05o1K65j13j56
$$ -210 -89 20 -160 -54 225 104 135 48 -167 162 -45 197 -40 5 -15 188 252 -53 -114 151 38 -118
4567a18q0L37J50k22m9k58N08k84r2J6L1j70L28J5q6n1q6r3Q3K35J0l01J46J01
$$ -118 -198 139 289 67 18 -240 268 -16 -108 -92 -61 -231 97 112 26 -25 -111 -204 -121 114 124 -177 -31 70
4591G0J80o8k55r3Q8L03l44l1J73n1j7L7j70L58K06n64L2J92k31J00j43M3J60
$$ 70 250 182 -73 -166 -78 225 -119 -150 23 -28 -45 -8 -178 180 386 -178 -146 46 -185 -85 -228 -185 -25
4614b5J74k05O7j64qL33q6m0j17J67M9k59L50k50L1j60K76j82K00l5j83N1m6k
$$ -25 149 -56 11 -153 -161 172 86 46 -71 96 145 -114 236 -14 17 -143 133 -49 151 116 -67 -16 -62 -64
4638f4Q2QM7J78l31J54m8n8K6j36L2J86j20J82j92R1J8J6jJ23O0n58K32L4r5R1
$$ -64 18 26 73 251 -80 74 26 -32 -6 -142 -110 76 -44 138 -54 37 55 71 70 193 253 -305 -73 -39 -134 -43
4664d3J11l6J38j36Q1P3k63K13k32K17mk81J61P5q4K54k39O8k35K25J2k59k2M72
$$ -43 68 32 170 34 115 188 -75 138 -94 123 119 -162 -1 74 -10 244 5 73 -162 63 75 -184 -206 266
4688B66j96k78K45J8j03j62J87J54p9L1J91l93J2P5r0J72P8L9j38m3j01K66k97
$$ 266 70 -208 37 55 -48 -210 -23 131 52 83 274 -119 -107 -32 -122 50 128 167 29 -14 -115 151 -146
4711a46K27k42K69l03K06J86l03Q9K41j51j55j5J67j65Q3J96m31J44N15j00n48
$$ -146 81 -161 108 -195 11 197 -106 -17 224 73 -82 -97 70 -95 -12 184 -247 -103 412 312 -236
4732b36M27Ok12K48l08j44R5J86J17j30l16M15q6J72j98J15R4j57l1J97j47j83
$$ -236 191 197 -15 233 -75 -219 -124 62 179 49 -267 148 62 234 36 151 245 88 57 254 107 -76
4754g6J24j24J72J61j67k00pj74M88m90J46L54k62J25j14j63M9O03m40p9L9o0
$$ -76 48 -76 96 257 90 -110 -117 -291 197 -293 -147 207 -55 70 -44 -207 -158 445 5 -74 -35 -95
4776i5M8j96L59k56J19l22K95J36k01M4J89j58J07P8j27l4j33o7P3J54L7j33k2
$$ -95 -47 -243 116 -140 -21 -343 -48 88 -113 -69 120 -38 69 147 20 -14 -147 -214 -141 13 50 -83 -105
4799a05P1j7O9r9J96j84Q4L4k8o8j8l1K96o15M52j50J96P8j88m3Mn5J31N7mr1
$$ -105 -34 -51 18 -81 115 -69 15 49 21 -47 -65 -96 200 -415 37 -113 83 161 -27 -70 -66 -121 10 67 63 -28
4825b8R9k47K20k74K75J1j77K08k21K25l71M91l28ORJ62j40p7J37l24L23Mj10
$$ -28 71 -176 44 -230 45 56 -121 87 -134 91 -280 211 -117 -111 -102 60 -80 -157 -20 -344 -21 -17 -127
4848a27J82Jr0O1J02K3l71K69o0j6J04J14j84r7K41j67O4J04j44lK03J47l78K6
$$ -127 55 56 -34 27 129 152 -219 50 -10 -26 78 192 8 -89 152 -15 49 153 9 6 209 356 -22 4
4872Dq4k4P4J42k36J65j11p2J37k30J24rN33l46J9k47J91K7P8L9j17o3Q8l40L72
$$ 4 -80 -104 -30 112 -124 41 -70 -142 -5 -235 -111 -120 413 67 86 -161 30 57 135 174 57 -6 82 -258 114
4897A14j00n8J35k57Lj38L10j36n3M1K82R4j09R9k61O7j09L29k27J79k94K77o5
$$ 114 14 -44 91 -166 -163 -301 9 -127 -180 -139 143 237 128 227 -34 33 -76 253 26 205 -89 188 123
4920A23Ml5o8k04Q0J71k25K35j5m6R0lj38j0M5L7J28qo8J39j09J9j40m7n2r4N0
$$ 123 127 92 24 -180 -100 71 -154 81 66 20 110 107 -31 -41 4 41 169 161 93 232 123 142 2 -45 -97 -191 -141
4947a41J90j76L3K04R1l46K19m3K77k80J7k3J1jM9j16j1j13K22l1J0n3j56O2J64
$$ -141 49 -127 -94 110 201 -145 74 31 308 28 45 22 33 32 81 -35 -46 -159 63 32 42 -11 -167 -105 59
4972E9j21J68K2J3l3j91R8N0j52j64K38J38PM9l20K61j44L7M8j66J93n8K57m04
$$ 59 -62 106 128 141 108 -83 15 65 -87 -251 -13 125 132 181 -139 122 -22 15 63 -103 90 32 289 -115
4996a15P9J20o8L55m51R7K58k06n5K6K0j23K59k98O4K25j35p3j08qJ78k09J29
$$ -115 -36 84 16 371 -80 17 275 69 14 40 60 -63 196 -102 -38 187 52 -21 -129 -137 41 -168 -39
5019c9J30J22r1l42J05k3l8L72n50K26K41m4J71k19j03j9j21M11l79J21J5K9n
$$ -39 91 213 122 -220 -115 -138 -176 196 -354 -128 113 69 240 21 -82 -101 -222 189 -190 -69 -54 -25 -30
5042c0m2q4q1n1L12k27K10j04m5N16m53K99k52J19j13J24N6j38q0P1m2Q0k7j18
$$ -30 -72 -156 -237 -288 24 -203 7 -97 -142 374 -79 220 -32 87 -26 98 154 16 -64 7 -35 45 18 -100
5066a00k9J86NJ19j77k9N2q8M73l96R6j02m0J01L1k77M57j98j5k30K1M55j45k22
$$ -100 -129 57 62 181 4 -25 27 -61 412 16 112 10 -30 71 102 -175 282 84 69 -161 -140 315 170 -52
5090e2M0J69L9j22j50J25q8J6r7P8J42N5k59N8N6j13m9pn0K56k4L0J34l30L59
$$ -52 -12 157 196 74 -76 49 -39 -23 -120 -42 100 155 -104 -46 10 -103 -152 -159 -209 47 23 53 187 -143 216
5115B16k61L64k78j7K00k73n7j05J63L12j16Q6J4k94K1R6RMJ44m81K34J54k56
$$ 216 -45 319 41 24 224 -49 -106 -211 -48 264 148 234 248 -46 -25 71 80 84 228 -253 -19 135 -121
5138a21k0p3j56M26j03k98L76j77K4k4L22k88J22K11j8k15j17o0K57J47n5j43
$$ -121 -141 -214 -370 56 -47 -345 31 -146 -122 -146 176 -112 10 221 203 -12 -129 -189 68 215 160 17
5160A7j1J47k26M4n0J55k03O4l3N1j9M5l4K11k22J72M2j07o1J13p3p7J3J76k41
$$ 17 6 153 -73 -29 -79 76 -127 -63 -96 -45 -64 -19 -53 158 -64 108 150 43 -18 95 22 -55 -42 134 -107
5185a07M7J6J67o3K9j22K68j37n2k40O1j45K16J08p2Q2r5J24J54n12J70KJ52p4
$$ -107 -60 -44 123 60 89 -33 235 98 46 -194 -133 -278 -62 46 -26 56 -39 85 239 -273 -103 -101 51 -23
5209b3J29o9o5J08j36J91k73J91j28RJ32j46M3n2Q9p2J88m3q2k6k13K45m2MJ78
$$ -23 106 37 -28 80 -56 135 -138 53 -75 -66 66 -80 -37 -89 0 -72 116 73 -9 -35 -248 -3 -45 -41 137
5234A37r9J45K6j23mk58L14j71M2l3K3n0j00K19j67J02N5l4r2l8K43j63M4k57
$$ 137 38 183 209 86 82 -176 138 -33 9 -24 -1 -51 -151 68 -99 3 58 24 -68 -106 137 -26 18 -239
5258b39J1K40O6K09j43j43j06Q6j67J81k73J68o6J75j94M72k07j09O0p9M2J98
$$ -239 -228 12 78 287 144 1 -105 -19 -186 -5 -278 -110 -176 -1 -195 277 70 -39 21 -58 -16 182
5280A82l50L95j4P1k61o2p0J48j51j60L32p9p4N9J80k07j4q0R2J88q6k21J25R7
$$ 182 -168 227 213 284 23 -39 -109 39 -112 -272 60 -19 -93 -34 146 -61 -75 -155 -63 125 39 -182 -57 40
5304D0j04L2O0j20J66Qm7k00L32r7P5m33K21M1L8l26K08k4J67j93j23K97O5j9
$$ 40 -64 -32 28 -92 74 82 35 -165 167 70 145 -288 -67 -26 12 -314 -106 -130 37 -156 -279 18 83 64
5328F4k72J25P9K01j15J1N7mr1j51M25j30j55j52m7K40q8K11k43j11k0J75K5j25
$$ 64 -208 -83 -4 197 82 93 150 146 55 -96 329 199 44 -108 -155 85 -3 208 -35 -146 -166 9 34 -91
5352i1N9Kl11N04k19M7J54k8m01M34j46K0k1J89m6j42K34k77L2p9J87j33q0L6
$$ -91 -32 -30 -341 163 -56 -9 145 117 -284 150 4 24 3 192 146 4 238 -39 -7 -86 101 -32 -112 -76
5376g6J51k66M01j32J14j3P5l47K8n9K32M6l34K82R3j56J06k97J81K1m3K23k61
$$ -76 75 -191 210 78 192 179 254 -93 -65 -124 108 154 -180 102 195 39 145 -152 29 50 7 230 -31
5399c1m46P18l15j8J18j32k09M84j59n6K51k78J30N3j08K72l34R6j84RJ76k04
$$ -31 -477 241 -74 -92 26 -106 -315 169 10 -46 205 -73 57 110 2 274 -60 36 -148 -139 37 -167
5421a67K49j31K27j45k32K64k08M1J70M3j99j37K03j08J75k32L05j04J69l14j51
$$ -167 82 -49 178 33 -199 65 -143 -102 68 111 -88 -225 -22 -130 45 -187 118 14 183 -131 -282
5442b82J37J32J03k08J40r3J20kj27j03L98l41L59l64J59k14pL27j64R3j3J52
$$ -282 -145 -13 90 -118 22 -71 49 47 -80 -183 215 -126 233 -131 28 -186 -193 134 -30 63 50 202
5464B02j37J8r6J20J21l14j11J92j0N0r6J28j74k8J18K27k57j19J89m2k06J61
$$ 202 65 83 -13 107 228 -86 -197 -5 -15 35 -61 67 -107 -135 -17 210 -47 -166 23 -19 -225 -64
5486f4L6J10O7j63J88j14k01J78K1k44K71M4K0m41M09j15j42L05j16J77j37k33
$$ -64 -28 82 149 -14 174 60 -141 37 58 -186 85 129 149 -292 117 2 -140 165 49 226 89 -144
5508a44j50M20j02j52J21J23m32J40L64j58j22M9J32j72L51l24J80n1j09J11j5
$$ -144 -294 126 24 -128 -7 116 -316 -176 188 30 -92 -43 89 -83 268 -56 124 73 -36 75 60
5529F0kk1n6Q9r9r3j0J5m9J08J19l6J86j33J29j20k50L42j51r2K74l10Q3J23j49
$$ 60 58 37 -19 70 -29 -122 -132 -117 -166 -58 61 25 211 78 207 87 -163 179 28 -64 210 -100 -17 106 -43
5554d3J24j55K35k09j55J72J72l93K79j80n5m6J73Q0m3J47j22Pk02J43n4K63l27
$$ -43 81 -74 161 -48 -203 -31 141 -252 27 -153 -208 -254 -81 -1 -44 103 -19 -12 -214 -71 -125 138 -189
5577a89K96k4m96N86K1o1j84L00k36j10K90l37Q1p4O1M43l52J83q9q5J48p9QJ74
$$ -189 107 83 -413 173 194 133 -51 249 13 -97 193 -144 -63 -137 -76 367 15 198 109 24 172 93 101 275
5601B75l67K03J75n4k13m6k02J66K58o8j45Q2k06N3j0n8K28j61m9K23K02r0m26
$$ 275 -92 111 286 232 19 -27 -229 -63 195 127 -18 64 -142 -89 -99 -157 71 -90 -139 84 286 196 -230
5624b30J35J70l42L00l12K97Kk14K93J63l07j26N5M8j6J2J65N8j59j69K70q3m2
$$ -230 -95 75 -267 33 -279 18 20 -194 99 262 -45 -171 -116 -68 -84 -72 93 151 -8 -177 93 10 -32
5647c2J28r7k4q9K68j53m8L90l40j50Q0K28j05J74l57J12j63J62m1K33m1m46N14
$$ -32 96 -1 -25 -114 154 1 -47 343 3 -147 -67 161 56 230 -127 -15 -178 -16 -57 176 135 -311 203
5670B03m09R5O3J24J23l7j45rKO1k20J36k4M0k1N6n1J62l15L2K46j71J00J2j51
$$ 203 -206 -111 -48 76 199 162 17 8 10 71 -149 -13 -37 3 -18 38 -13 149 -166 -134 112 -59 41 53 -98
5695i8L72j09l56L84j90N6k5M4k0p3k64L63j04j76M7J71p8k38L50j21K23j08j19
$$ -98 274 165 -191 193 3 59 34 78 58 -15 -279 84 -20 -196 -149 22 -56 -294 56 -65 158 50 -69
5718f9O5j05j2M4O6Q0j07Q9k25J7J42J68j32O4P7j59q2j41Q0M8jJ85n1R4j42l5
$$ -69 -4 -109 -121 -77 -11 69 -38 51 -174 -157 -15 153 21 85 162 3 -79 -220 -140 -92 -93 92 41 135 -7 -42
5744d2j2L2J40k6N5k25J77p9J56l33J90K51n10K83m85K17N3J94j61K3j22J28O9
$$ -42 -54 -22 118 92 147 -78 99 20 176 -157 33 284 -226 57 -428 -211 -158 36 -125 -102 -224 -96 -27
5767b7J47J96j58k8k87J85n4m5l1O1J12j33l4k90M93p2j95L11r7k35O3J5J53K65
$$ -27 120 316 158 130 -157 28 -26 -71 -102 -41 71 -62 -96 -386 107 35 -160 151 54 -181 -118 -103 50 315
5791C15n01l8M24k90j85K83l2m3J04J0q0k66J41K24lq9j42L48j91j14L0P7N6J70
$$ 315 -186 -224 200 -90 -275 8 -24 -67 37 47 -33 -299 -158 66 63 -26 -168 180 -11 -125 -95 -18 38 208
5815B08m3j36j54j21L67p8j49J68m6n2Q1O7O1m95K58J71l18O7J37j40J39l09K03
$$ 208 165 29 -125 -246 121 43 -106 62 16 -36 45 112 173 -322 -64 107 -211 -144 -7 -147 -8 -317 -114
5838a14J95k47J44p6K93R6k98J48m21J85k8K09j86j1Q8p8J48k23K00Q3o6k14L23
$$ -114 81 -166 -22 -98 195 291 -7 141 -280 -95 -123 86 -100 -111 -23 -101 47 -176 24 107 41 -173 150
5861A50k72L43j05M3l33J01K8l0M9m6K38k79n5L78j33m5k00L15l15Q9J55O4OO
$$ 150 -122 221 116 159 -174 -73 -45 -75 -26 -72 166 -113 -168 210 77 32 -168 147 -168 -79 76 140 146 152
5885A52j39J89l23K92k82kQ9J32l08J71P5J55j35k83K56j25K75k96K25j44k40
$$ 152 13 202 -121 171 -111 -113 -24 108 -200 -29 46 201 66 -217 39 -86 189 -107 118 -26 -266
5906b66L37J8J98j98j57J26j93l6J36k7K41k07J13l39L66K5j91J96j1k25L82k22
$$ -266 71 89 287 89 -68 58 -135 -171 -35 -62 179 -28 85 -254 112 137 -54 142 131 -94 288 66
5928F6J32j56l10K14KJ22j56K77j35r5J11j47%J77l61J96j27L69Q7l17J7k87M01
$$ 66 198 42 -268 -54 -52 70 -86 191 56 -39 72 -75 -75 102 -259 -63 -190 179 266 -51 -34 -321 80
5951H0k1k28J11p0K26O2o7J13k39L7Rn7q4K15o3k14Q9R5K48J9l07J41l55J57R0
$$ 80 59 -169 -58 -128 98 160 93 206 -33 4 13 -44 -128 87 24 -190 -101 -6 242 261 -46 95 -260 -103 -13
5976a3P2o8j08l9N8Q5o0k53M84k16l5L57l86L4j37L51j77K69J61k91K6N3k46J98
$$ -13 59 -9 -117 -156 -98 -13 -73 -326 158 -58 -93 264 -122 -88 -225 126 -51 218 379 88 114 167 -79 119
6000A19R1k37J00j48J12q1L7m9j36L63k61J01J62k97J46j27J45N1j88n6J73J2
$$ 119 210 -27 73 -75 37 -44 -7 -56 -192 171 -90 11 173 -124 22 -105 40 91 -97 -153 20 32
6022C2K2Q4o6r1r4L25j10Q9j26J9k16L07k82L5J05q4k57L71m0J1j95j61N19l41
$$ 32 54 138 72 -19 -113 212 102 191 65 84 -132 175 -107 -72 33 -51 -308 63 23 34 -161 -322 197 -144
6046a44J71q0j95K02R1m16L92P7Q3j52o7k51R7K49r9L4L67k03k28N3k4K76n4l79
$$ -144 27 -53 -248 -46 45 -371 21 98 181 29 -38 -289 -192 57 -42 -8 359 156 -72 -19 -43 233 179 -200
6070b00K7k50O59m59J39J71m7j27J0O8k3k12J47P4J12j72K06p6K6J9k24J75j80
$$ -200 -173 -423 236 -223 -84 87 40 -87 -77 -9 -32 -244 -97 -23 89 -83 123 47 73 92 -132 43 -137
6093a37L40r2R6l97L3J7J42j44J13lj21K8J51L9o6q7m2p5J38j54J30r1K7K93O4
$$ -137 203 111 207 -190 -157 -140 2 -142 -29 -32 -153 -125 26 65 -1 -88 -130 -205 -67 -221 -91 -182 -155 138 202
6118B02k28K52m72K10J99j02K28m06j8K76k4m02N37m43K85M3k33J09k13L64k35
$$ 202 -26 226 -246 -36 163 61 289 -117 -135 141 117 -285 252 -191 94 137 -96 13 -200 164 -71
6139g1J53j70J86j17n5K18j57j21P8j21P1K99l42K30j48P8J26q3J9p7n0j35K65
$$ -71 82 -88 98 -19 -74 144 -13 -134 -56 -177 -106 193 -149 81 -67 11 137 54 73 -4 -54 -189 76
6162G6l2k1J40k71L03m19J74M35l11r3oK0l79L3M85l3l62N37K7k79J5K5K5j38
$$ 76 44 23 163 -108 195 -224 -50 385 74 -19 -25 -5 -384 -351 134 101 -261 276 303 24 39 64 89 -49
6186d9J38l6J18n2K8q9o8K5j81K83q1N3l47K32O7P5l22j04K66%L2k11R2J94K85
$$ -49 89 53 171 119 147 58 -10 15 -166 117 36 89 -258 -26 41 116 -206 -310 -44 -44 -12 -223 -131 63 348
6211C48m34R2l53L10l6L4P2k3P2k6j23K69m03J21j4L10K6m3j55J33p9l12Q2K52
$$ 348 -86 6 -347 -37 -73 -39 33 10 82 56 -67 202 -201 -80 -94 216 242 199 44 177 98 -214 -132 120
6235A20k52N6K88p8k26J53l4J11N3k63K28j95o5J71K30j99r9m3j44O5O0J34q6
$$ 120 -132 -76 212 134 -92 61 27 138 191 -72 156 -39 -104 67 297 98 -1 -44 -188 -123 -63 71 -15
6258a5K53l91K03J31O9l40r2j44J62K79k53L11k19j3K47o0j55K21k58k45L13J20
$$ -15 238 -153 50 181 250 -90 -182 -326 -164 115 -138 173 -46 -59 188 128 -27 194 -64 -309 4 124
6280A24k89K33O1j04j3k67L2K92J1q7K23j96N9k1L2n4j51n8L90j80jj32J8K67
$$ 124 -165 68 129 25 12 -255 -223 69 80 -7 216 20 79 58 90 36 -115 -173 217 37 36 -96 -78 189
6304A89m06J09J19K8j67k1J92J34k9q7j69J97l76L57k90J7L52j48N1N8m4q0j83
$$ 189 -217 -108 11 39 -128 -149 43 177 148 61 -108 89 -287 70 -220 -203 149 1 52 110 66 -14 -197
6327a97L03l03K33Rk50M06q8l07L18J26o9k69q1On0J62N4M8j34K11k61K69K84
$$ -197 106 -197 36 45 -205 201 113 -194 124 250 181 -88 -169 -163 -213 -51 3 51 -83 128 -133 136 420
6350D20n44K73j71J18l57K08Q4K47p3k11j1m0L9J08j42npK07j81K9j61L77n8k6
$$ 420 -124 149 -22 96 -261 -53 31 278 205 -6 -17 -57 -18 90 -52 -57 -64 143 -38 -9 -170 207 149 123
6374A23j16l0K73j47j97R0l0j24K85l56K13O9j26M04k61j23K94J30n84k7K06P7
$$ 123 7 -23 250 103 -94 -4 -34 -158 127 -229 -16 53 -73 331 70 -53 241 371 -213 -240 -34 43
6396D3j39J01J17o7j44L60k55J64l37K83J41l18J91j70P3k73J49k0J68o8L08l71
$$ 43 -96 5 122 55 -89 271 16 180 -157 126 267 -51 140 -30 43 -230 -81 -101 67 -1 307 -64
6418f4J50n6p5n6pK87k16k62L46M6K70l85J23o2o6R5n6Q3j08J0o7j56K15j79J3
$$ -64 86 30 -45 -101 -108 179 -37 -299 47 93 363 -22 101 39 -27 68 12 95 -13 -3 -70 -226 -11 -190 -177
6443a77K30J08l10L93j05j62P9m3O4j22J68r8m4M2L5n0p0J42L1k6k80M22l4j81
$$ -177 53 161 -149 244 139 -23 56 13 77 -45 123 25 -19 23 58 8 -62 80 111 85 -195 227 193 12
6467A2j91J56Q8l03K16P8q8K64j94Jk32r2M11j38k13k5K20n2L6j40J22J85p5O
$$ 12 -179 -23 65 -238 -22 56 -32 232 38 39 -193 -285 126 -12 -225 -250 -30 -82 -46 -186 -64 121 46 52
6491E2j2j29j41J32K35N9k04p5K24j28j46J44j46k06M5M32j22q5N4Q0p5j42P9
$$ 52 40 -89 -230 -98 137 196 -8 -83 141 13 -133 11 -135 -341 -296 136 14 -71 -17 63 -12 -154 -75
6514g5j4J29K6j31o2p0P4q6K37J3o7J5n1J09l9k40L47l68j0N30n05J22K82j67
$$ -75 -89 40 66 -65 -127 -197 -123 -209 28 41 -26 -11 -62 47 8 -232 115 -253 -263 267 -238 -116 166 -1
6538aO7j31L35k02K8j60J40P8j09k26J71K6l31L45J24J0l37J52k8j43O7J83p4
$$ -1 66 -65 270 68 96 -64 76 154 45 -181 -10 16 -315 30 154 164 -173 -21 -49 -192 -125 58 -16
6561a6j78K18j9n7J52j89J05K9k83L62j45j50K99j35K57j29j17p4Q5j47N2K58
$$ -16 -194 24 5 -52 100 -89 16 45 -238 124 -21 -171 128 -7 250 121 4 -70 15 -132 -80 178
6583A78o6k12L49m53k8L11k91L1L04j19K63j47l4j97p9M03n6j50J79m04K97L0
$$ 178 112 -100 249 -204 -232 79 -212 -181 123 4 267 120 86 -111 -190 213 157 7 186 -218 79 109
6605A09k7j12J75o5k2j54J32l1k13K67J34k00J65k01m7J84j75J76Q4K2j73P1j07
$$ 109 82 -30 145 80 58 -96 36 5 -208 59 193 -7 158 -43 -90 94 -81 95 179 201 28 99 -8
6628hk9L00m55K45m8K7K02q8j65Nl4m8K63k82J58j38n0J31L4j94M78k92OK6j10
$$ -8 -37 263 -192 53 5 32 234 146 -19 -14 -48 -96 167 -115 43 -95 -145 -14 20 -174 304 12 18 44 -66
6653f6L02l78L71m51J7K59M4J12j67k5m2q1j6m9P5J67Q7l79L97q6j82m9q8K14
$$ -66 236 -142 229 -222 -205 54 98 210 43 18 -24 -105 -121 -170 -95 72 159 -220 177 91 -91 -140 -228 -14
6677a4j42L7k13L69J46l93J97J26K4o2j06L66l92P2j91J36K78l89J75KqR7q8K54
$$ -14 -156 -119 -332 37 183 -210 -13 113 137 75 -31 335 -57 15 -176 -40 238 -151 24 26 18 115 27 281
6701B81j98k91M59l85J1J51J86k41l5L46m14J0J19p9J43k6l11K56Q7l39J64J68
$$ 281 83 -208 251 -134 -123 28 214 -27 -62 284 -130 -120 -1 -80 63 37 -274 -18 69 -270 -106 62
6723F2j48j43L04K34k38J15l73j2N04j85m23K42L5J9j35P4M0J09j58K29k22K50
$$ 62 -86 -229 75 309 71 186 -187 -199 305 120 -303 -61 -26 -7 -142 -68 -28 81 -77 152 -70 180
6745A80j27k24N5J60j74K86p7mm0j16K65l33P1J32K5j60J51n8pJ44l36K07j22
$$ 180 53 -171 -116 44 -130 156 79 75 35 -81 184 -149 -78 54 79 -81 70 12 5 149 -187 20 -102
6768a02m4K26l27L01j10J24j92K21q3j45K43r3j04J3j7m0K00M9k00J12j13L42
$$ -102 -146 80 -247 54 -56 68 -124 97 14 -131 112 19 -85 -72 -89 -129 71 120 -80 32 -81 261
6790B61l28Q3R6j0l65Q8J31J73k70Q4L10k62J20k22J58j68K27l58L09o3J78m2
$$ 261 -67 16 112 102 -263 -175 -44 129 -141 -57 253 -9 111 -111 47 -121 106 -252 57 -6 172 130
6812A30k21O5k04K18Q6j39K31j72n7j0k0q1K64L2l44J47M61k77j15OJ02L2j5q4
$$ 130 -91 -26 -230 -12 74 -65 166 -6 -63 -73 -93 -174 90 122 -222 -75 386 109 -6 0 102 134 119 35
6836C5N5o7k02J1J59j14K56k2k30J09K48j90m4O%J6k4j24K1j01K44K19k29J70
$$ 35 90 23 -179 -168 -9 -123 133 111 -119 -10 238 48 4 10 10 26 2 -122 -101 -202 42 261 32 202
6860B02l19J50M1q5l62J88L2M3m2n2L29j20M1J29l31K92k59Q1L5K39j67j39j28
$$ 202 -117 33 74 -11 -373 -185 -153 -110 -152 -204 125 5 46 175 -156 136 -123 -42 -7 232 65 -74 -202
6883b02J77R6R3l37J73R0m8R6j60L61k63kn3k51J91L00n75N02k9n31N32j22K24
$$ -202 -25 71 164 -173 0 90 42 138 -22 339 76 74 21 -230 -39 261 -314 188 159 -372 160 38 262
6906B62k03j07K13l29K84j14k59L59n7j87N9KJ28k18J80oj14N5R3k51J59p9L0
$$ 262 59 -48 165 -164 120 6 -253 106 49 -138 -79 -77 51 -167 13 7 -107 -52 41 -210 -51 -130 -100
6929a00J25N0M8k13J54k19K85K9k78K09r6k56M94j11j71j7J56j80K15j40J77j80
$$ -100 25 75 123 -90 64 -155 130 159 -119 90 -6 -262 232 121 -50 -67 89 -91 124 -16 161 -19
6951a9P9J93k82K31k64rL03k53K64j92j70L28j24m8j18J27Q3L72o14K90l65lK96
$$ -19 60 253 -29 202 -62 -71 232 -21 243 51 -119 209 85 37 -81 46 129 501 -113 177 -188 -191 105
6974A05o4J93l75K57k16Q2J48k10J16J11j81j73J26K47l09j05K16K20j34k45J55
$$ 105 41 234 -141 116 -100 -18 130 -80 36 147 -34 -207 -81 166 -143 -248 -32 188 54 -191 -36
6995c6P1r9J6R0Q7k95K90k5L51m25n8L4J27O6m04L6M43m23lJ56k6J0M5j76Q6N6
$$ -36 35 -64 -48 42 129 -166 124 99 450 25 -33 1 128 194 -210 -174 269 -154 -157 -1 -27 -17 28 -148 -62 -6
7021fJ47m4j2o8n6K02l43M44k18K97j53L2Q0l48N8l8k37J81J2j97J48O9o1L2L07
$$ -6 141 97 85 17 -39 163 -180 264 46 343 190 222 302 -46 12 -26 -263 -82 -70 -267 -119 -50 -111 -79 228
7046B28j59r0P0lJ34j0k14k95J35L38J23j42k96j89J82J37j6QJ96j70M9J33k46
$$ 228 69 -21 49 46 180 170 -44 -339 -204 134 257 115 -181 -370 -188 -51 -67 -59 137 -33 16 149 -97
7069i7q7K91l2N4k94nL74l96L73k54OJ78k33Q5p7J80j99k24O0L39k44J56o0J86
$$ -97 -184 107 75 129 -165 -170 204 -192 181 -73 -67 111 -122 -37 -114 66 -133 -357 -297 42 -202 -46 -106 80
7093H0n2j75J40j60K93j11J33j70j58J57K09k41K06qm15M70j98o0R6K1J1k22J09
$$ 80 28 -147 -7 -167 126 15 148 -22 -180 -23 186 -55 151 143 -272 198 0 -60 36 57 68 -154 -45
7116d5J82j5K06j66L9m6J38l15N5k14K89j25n9J52kl8J17k36K21p2o6Q1J26j71
$$ -45 137 122 328 162 201 155 293 -22 33 -181 108 -17 -76 76 74 36 153 -83 138 66 0 81 207 36
7140C6j05O6J02M6k68K35k74J21m1l8j10L74J17l74l9P4j47J92J64k58K53j46
$$ 36 -69 -3 99 145 -123 112 -162 -41 -82 -120 -230 144 261 -113 -152 -78 -225 -33 131 -127 126 -20
7162b0j1l5r1J37j80P0J97k25L03j6qn0l29K89j91M7Q0K3k6k7N4J11k64K27%L1
$$ -20 -31 -66 -157 -20 -200 -130 67 -158 145 129 121 71 -258 31 -160 -113 -33 -10 -36 -63 -9 102 -162 65 65 96
7188I6k26N5J68p2Nk45K92r1K25j63m6K9K61j38j16R0k61J01J26j39M30n50P8
$$ 96 -130 -75 93 21 26 -219 73 -18 207 44 -2 27 288 150 34 124 -137 -36 90 -49 381 -169 -91
7211i1N3J45MN6n5o3J9j47J12o4J9qk06K89n0M0r9Q0m2J43k23M1L8j0ol7p2L06
$$ -91 -38 107 111 167 112 49 68 -79 33 -31 -12 -20 -226 63 13 53 -46 34 -8 135 -88 -47 -9 -19 -25 -62 -134 172
7239A72P3j06N1Rk07P5j58K5j3l26K87L22k25M06l56N1j17q5R5J0L1J04m53K98
$$ 172 245 139 190 199 -8 67 -91 -66 -79 -405 -118 204 -21 385 29 80 -37 -122 -27 -17 14 118 -335 -37
7263c7J13p8L6p8Q3j05J10j13j18K37m4k50o5J56nO2M30l88J25j31k5k41L82k9
$$ -37 76 -2 34 -44 39 -66 44 -69 -187 50 6 -244 -309 -153 -158 -96 334 -54 71 -60 -85 -326 56 27
7287B7m6J2K03j81K50k96l3l9K0K59q3j10n1n2K06J0p7J80n9Mp0P2j37N4J09p1
$$ 27 -19 -7 196 15 265 -31 -64 -103 -83 176 93 -17 -68 -120 86 96 19 199 140 144 74 146 9 63 172 101
7313A01l43M4L36r2j24P5L64n62J78J40k09O5j23M77j81m88M45j13p5K28k11O
$$ 101 -242 -198 138 46 -78 -3 361 -201 -23 117 -92 -27 -150 327 146 -342 103 -10 -85 143 -68 -62
7335f2J31j30L6j9j11QK64k25M1L0j55K25L9r4L12m28M9J6Rj73J92K59Kj5l64
$$ -62 69 -61 -25 -44 -155 -147 117 -108 -67 -37 -192 33 72 -22 290 -138 -89 -73 -64 -237 -45 214 216 201 -163
7360a63k5K71q8J32p7R2q0j67K59j28J60j1k83O0q2K07j66K53q8k38L89l38K5
$$ -163 -188 83 -5 127 50 142 62 -105 154 26 186 175 -108 -48 -130 77 -89 164 76 -162 227 -111 -86
7383h6L7M8m9J23j61J37k07K4L9J8Jk11L00j4K45k27j78K86j52j10nM17m07J27
$$ -86 -49 -1 -50 73 -88 49 -158 -134 -95 -77 -76 -287 13 -1 244 17 -161 125 -27 -137 -142 275 -132 -5
7407eq9J74k3L2k10R5j52L25j37J97p4j28q4J13k70L89n8m87K94L75Q4n22L26
$$ -5 -94 80 57 89 -121 -26 -178 147 10 207 133 5 -79 34 -236 153 95 -392 -98 277 361 -161 165
7430A65j95K53k46j40K80J18l16J92l8j03k9o0K79j76o5J11l6j32j7K2K95m89
$$ 165 -30 223 -23 -163 117 235 -81 111 73 -30 -59 -119 160 -16 -81 30 -6 -138 -155 -133 162 -327
7452c27L66k66J07j36qK72n4k2N6k3n7K41J9j90MJ61j22p8j39M1j4j26K75J63
$$ -327 39 -227 -120 -256 -264 8 -46 -68 -12 -35 -92 149 168 -22 -18 143 21 -57 -196 -155 -169 -295 -20 143
7476A43M8l73M7k3L28p5r3k4J75Rk00L9R9l18n7L38p9j06m9J39N3N5Oqj11J68
$$ 143 191 -182 -135 -158 170 95 2 -22 153 162 -38 1 100 -218 -275 63 -16 -122 -171 -32 21 76 82 74 -37 131
7502A31k7k9j67P6J1Q7K6K25l85QrL54l37k5l76N03j6j61N3K32k50rO1J83l64
$$ 131 104 75 -92 -16 -5 82 108 333 -52 -44 -53 301 -36 -61 -437 66 50 -111 -58 174 -76 -85 -24 159 -205
7527b05o7K42M3N9k3K04l18L60m45J94J8j05N2r8K79k13J80m1l13J58o0m6K61
$$ -205 -272 -30 13 72 49 253 -65 295 -150 44 62 -43 9 -89 190 -23 157 116 -197 -39 -99 -145 116
7550A16n6p8l8N7o8J83l57M10k00J09j37l5J6N4M5l17K70j83J65QK89Q6k34J67
$$ 116 60 -18 -56 1 -67 116 -241 169 -31 78 -59 -94 -78 -24 21 -296 -26 -209 -44 -36 253 339 105 272
7574B72j76j39Q4K2m75N96l8j95J50j26m2m0P1j23K23J91k26J39l4j27K29Q7k73
$$ 272 96 -43 41 63 -412 184 146 -49 101 -25 -67 -107 -36 -159 64 255 29 168 134 7 236 323 50
7597E0J00k36j95J20K22j35J08m04M42R0k30J22M6j83j06J11J42m4K9Q4j08kj11
$$ 50 150 -86 -281 -161 61 -74 34 -370 72 162 -68 54 100 -83 -189 -78 64 20 49 133 25 23 -88
7620h8N1N1M0n7K99l91K51m33M37J32l16P2J95j90JJ64m25M15k02K87j21j64j98
$$ -88 -37 14 54 -3 296 -95 156 -277 160 292 -24 48 243 53 54 218 -207 208 6 293 172 8 -190
7643a90j04M77k28Q6j57O6Q7n2j27J73j81L82j65j43K21j16o1Q8O8k38R9N5N0
$$ -190 -294 183 -45 41 -116 -50 37 -15 -142 31 -150 232 67 -76 145 29 -32 56 124 -114 -15 40 90
7666I0L0j28N9L0K5p0M3p1p9J42J44j05k61L37n0P3k74J65L3k55N2J85M2k75k6
$$ 90 120 -8 51 81 106 36 79 8 -71 71 215 110 -151 186 136 209 -65 100 133 -122 -70 115 157 -118 -144
7691a44K04l5j16K72j87J68J1l50J67N8P2k7j34J0J05j60J62Q6q2k64R4J14j05
$$ -144 60 25 -91 181 -6 162 173 -177 -10 48 120 93 -41 -31 74 -86 76 162 80 -184 -90 24 -81
7714h1j62J42J95J25k8p3j26K9j63K89k51kL92l13r5qJ28k71J87R6j64J24j18
$$ -81 -243 -101 94 219 191 118 -8 21 -142 147 -104 -106 286 -27 -122 -130 -2 -273 -86 10 -154 -30 -148
7737a48K04o1L7P6L4l61J74R4K02m24R1L97j69j43j10R5K9r1L0K58k30K13m39
$$ -148 56 -5 32 108 142 -219 -45 49 251 -173 -82 315 146 3 -107 -12 17 -74 -44 214 -16 197 -242
7760b42J52l4P9L5J43M5j97J82J2m9k38L6O7j24K6Qo3J51Q7m6j44L25Kj06o0j08
$$ -242 -90 -124 -45 -10 133 178 -19 163 175 126 -112 -76 -9 -133 -107 -99 -162 -11 76 30 -114 211 213 107 47 -61
7786f1Q6Nj55J42K3K5l0L2l36O37m02k2r1J56J6MK3o0j65K00J12M9k18J1k45K05
$$ -61 25 30 -125 17 40 65 35 67 -269 368 -34 -56 -147 9 25 29 52 -8 -173 27 139 188 -30 -19 -264 -59
7812e9j89JL03j00J26O4J13l71J82k24L02L1L5m15K13k49J32K32l3Rj33j80P7
$$ -59 -248 -247 56 -44 82 146 259 -112 70 -154 148 179 214 -201 12 -237 -105 127 94 103 -30 -210 -133
7835a33L14n7l77K74KK52k23M6M7l90L83R0k97j7L05k61k6J46j02pK78l21M4Q5
$$ -133 181 124 -253 21 23 275 52 98 145 -245 138 228 -69 -86 219 -42 -68 78 -24 -31 247 -74 -30 55
7859E5k09M13l94J79n0m3K17k01K26n28K35L62k06k04o5R4k6K46j0J2J51n00J24
$$ 55 -154 259 -135 44 -6 -49 168 -33 193 -335 -100 262 56 -148 -213 -119 -145 101 91 103 254 -246 -122
7882a22K7J66j13K50k19j23r3K39J02k2j75O7o5L8r5k25K57J59k7N7l40L34k45
$$ -122 -95 71 -42 208 -11 -134 -227 12 114 92 -83 -16 -81 -43 -138 -363 -106 53 26 83 -257 77 -168
7905a68K26m5j73K09k85J12j37K01K44k09Q6J41k13K4j4K31m28K8K95J20k05l7
$$ -168 58 13 -160 49 -236 -124 -261 -60 184 -25 61 202 -11 13 -1 230 -198 -170 125 245 40 3
7927Cj3j21J86r2J50j65j20J60J61j65q8P7j5j8kJ0J39j52p4M9J45j36O2Q4j70
$$ 3 -10 -131 55 -37 113 -52 -172 -12 149 -16 -104 -27 -42 -60 -62 -52 87 -65 -139 -90 55 -81 -19 65 -105
7952a05J40j97K6K84q0l47K51J67k35r9M45l37J26j13K0p1J76M06o54J26kJ11
$$ -105 35 -162 -136 148 68 -279 -28 139 -96 -195 250 -87 39 -74 -54 -125 51 457 -197 -71 -73 38
7974C8j69r9J89Q9n1P0j38K22j32m2J03L2Q1l81J27L26l44L06j27o3k85J83QK59
$$ 38 -131 -230 -41 48 -3 67 -71 151 19 -23 80 112 193 -188 -61 265 -79 227 100 37 -248 -65 -57 202
7998B02J5j90j0R1j39j28R6K4J04k39J42j46K25l7J50j78K8K17k22J17j61RL06
$$ 202 217 27 17 108 -31 -159 -63 -39 65 -174 -32 -178 47 10 160 -18 10 227 5 122 -39 -30 276
8021B76o7j34j22J36j28j64N81k42k32L0L4k35K01K17L6j78m6p4K37k66K22k50
$$ 276 209 75 -47 89 -39 -203 378 136 -96 -66 -32 -267 -66 151 187 9 -37 -111 126 -140 82 -168
8043a68J07J62k16RJ46k98N82m23j0M4K88k58L6n2j54K08p0R5o0Q6k42J24P7J42
$$ -168 -61 101 -115 -106 40 -258 324 -99 -109 -65 223 -35 1 -51 -205 3 -67 28 -32 54 -188 -64 13 155
8067A55o0Rp7L2L3j3j13J1L17j83j71K43k58R5o7k2J19N8n9J6p6M3q4J12k26k33
$$ 155 95 104 27 59 92 79 -34 -23 294 111 -60 183 -75 20 -47 -69 50 108 49 65 -11 32 -52 60 -166 -399
8093c99K59L95m63J35J65nk10L48r2k93J53J3k25K78Q1l0k63O4K45q3m1j06J29
$$ -399 -140 255 -208 -73 92 87 -123 225 133 -160 -7 6 -219 59 140 110 -153 -89 156 73 32 -74 55
8116E5K5P0j93J4J27k1M7O2k34J59l99N58j24J33k59QJ1l5j56J46L53k61l03L02
$$ 55 80 150 -43 -29 98 77 124 186 -48 111 -288 270 146 279 20 28 39 4 -152 -6 347 86 -217 85
8140H5m3NJ80Ml17m5K00k63K45k21Q3J27R8o0q5l7O3j39J42j80L49j54L63m14
$$ 85 42 47 227 231 -86 -131 69 -194 51 -170 -87 40 138 78 -7 -44 19 -120 22 -158 191 37 400 -14
8164a4Nk78L99k28R4j4J13J22mk53J32k09J36K48l69L33j03nl65J17J84M9J27
$$ -14 -9 -287 112 -116 -22 -36 77 199 195 -58 74 -135 1 249 -120 213 110 105 -260 -143 41 90 217
8187B17j84o5J13r5
$$ 217 33 -32 81 -14
8191a4
$$ Imaginary data points
##PAGE= N=2
##DATA TABLE= (X++(I..I)), XYDATA
0@%%%%%%%%%%%%%%Qj6J6j6J6k4L2l2M0m8N6o5P3q8J04j20J36j52J70j94K20k46
$$ 0 0 0 0 0 0 0 0 0 0 0 0 0 0 0 8 -8 8 -8 8 -16 16 -16 24 -24 32 -33 40 -48 56 -64 72 -80 90 -104 116 -130
36a30K76l10L48l88M31m80N31n87O50p18P93q75R64j061J169j288J420j567J733
$$ -130 146 -164 184 -204 227 -253 278 -309 341 -377 416 -459 505 -556 613 -675 745 -822 911
55I11j919K130k373K655k991L393l886M509n322O435q062J0666j5485K7316j08848
$$ 911 -1008 1122 -1251 1404 -1587 1806 -2080 2429 -2893 3542 -4520 6146 -9339 17977 -90871
70i0871j49281K59681J04205j46532k4326J13956l3473n4587M0873O691n7333
$$ -90871 -240152 19529 123734 -22798 -47124 66832 33359 -21228 19645 26336 -30997
81c0997N6253M0863q6669l2430P6863k53m5308M0383K4095o2486j3861N2382J6509
$$ -30997 25256 66119 -20550 -52980 23883 23630 -21678 18705 42800 -19686 -33547 18835 35344
94C5344k6170p728O059K250m849r645p076P032K3535J3356l1594m2133J4196M9299
$$ 35344 9174 1446 7505 9755 4906 -4739 -11815 -4783 18752 32108 514 -41619 -27423 21876
108B1876J0260k9049q255J9556o588l1600J965L1713L207j6684o918j4362r515
$$ 21876 32136 3087 -5168 14388 7800 -23800 -21835 9878 13085 -3599 -10517 -24879 -34394
121c4394K4069J4458j7434N59J7571r351j1527J9639J8205j2299k2980m247J2274
$$ -34394 -10325 4133 -13301 -12742 4829 -4522 -16049 3590 21795 9496 -13484 -17731 -5457
134e457m56q567J6219K4769r519k2240j460K585r16Q555M875o438K901Q980j3845
$$ -5457 -5913 -14480 1739 26508 16989 -5251 -6711 -4126 -5042 3513 8388 1950 4851 13831 -14
149a4j8811J6591K6987j1220k3033O579O744q283J2841J2285k1866n392K1386
$$ -14 -18825 -2234 24753 13533 -9500 -2921 3823 -4460 8381 20666 -1200 -6592 14794
162A4794j3428k1784L1606K5433l2240k1427J7531J761j2355J2090J3349j0159
$$ 14794 1366 -20418 11188 36621 4381 -17046 485 2246 -10109 1981 15330 5171
174E171q931J22q637j327J8210J794k1152K875K1209r127j9996J1565J9156j391
$$ 5171 -3760 -3638 -12275 -13602 4608 6402 -14750 -11875 9334 207 -19789 -8224 10932 9541
188I541q614p482l545R109N868r739m994N871n59k202J069J896J0171J3624j1595
$$ 9541 927 -6555 -10100 -991 4877 -4862 -9856 -3985 -4544 -6746 -5677 -3781 6390 20014 8419
203H419k2130K671J3794l686m256J2607J819j6695l093J4742L874o174J731j161
$$ 8419 -13711 -11040 2754 -932 -5188 7419 9238 -7457 -10550 4192 8066 1892 3623 2462
217B462m287P022K639j1651N726K1301q812k6818K365J8574k736j0704L778O879
$$ 2462 -1825 5197 7836 -3815 1911 23212 14400 -12418 -10053 8521 5785 -4919 -1141 5738
231E738k199l017p83j941K907Q324k791j3890k63J1568m430p784J2538Q094j8612
$$ 5738 3539 522 -261 -2202 705 9029 6238 -7652 -7915 3653 -777 -8561 3977 12071 -6541
246f541j2867J3913J2249n118j738L009m056m644P31l620j406J3614M983j7162
$$ -6541 -19408 -5495 6754 1636 -102 2907 -1149 -5793 -5062 -8682 -10088 3526 8509 -8653
260h653m625J8645M395j4735N42Q801o743n726N779O81Q73R702j212j3370J260
$$ -8653 -13278 5367 9762 -4973 -4431 4370 -2373 -8099 -2320 -1639 -766 8936 7724 -5646 -4386
275d386J0010l934n696P066N556l768l915k377j855P508P929q942r232P093K837
$$ -4386 5624 1690 -4006 3060 8616 4848 933 -1444 -3299 4209 12138 3196 -6036 1057 3894
290C894r604L414J3662k683j0795J072K413j887L981J405q683k51Q411o271j0094
$$ 3894 -5710 -2296 11366 8683 -2112 -1040 1373 -514 3467 4872 -3811 -4062 4349 -1922 -12016
305a2016J0627J3055r937j2205N693P185l315k40K851l080o77K100n518n519Q716
$$ -12016 -1389 11666 1729 -10476 -4783 2402 -913 -1153 1698 -1382 -2059 41 -5477 -10996 -2280
320b280P441o141k590P116k236r319M258R590k812p409J251K672j038K754L037
$$ -2280 5161 -980 -3570 3546 1310 -8009 -3751 5839 3027 -4382 -3131 -459 -1497 1257 4294
335D294k800j778K739l451n323O431Q993l119o236j20k58J150L426j193m729K889
$$ 4294 1494 -284 2455 -996 -6319 112 9105 5986 -250 -370 -628 522 3948 2755 -1974 915
351I15L605o539m081R320O233p167m459M186K26m087j48K138N01J650j466n548
$$ 915 4520 -2019 -6100 3220 9453 2286 -2173 2013 2239 -1848 -1996 142 643 2293 827 -4721
367d721mP472N39n959J059M785k547o022J710O218J652m073n671j367N640L414
$$ -4721 -4725 2747 3286 -2673 -1614 3171 624 -5398 -3688 2530 4182 109 -5562 -6929 -1289 2125
383B125l321j382N520J039p350l892O561N587k529m931m43K841K098j458k228
$$ 2125 -1196 -2578 2942 3981 -3369 -7261 -700 4887 2358 -2573 -3016 -175 1923 465 -1763
398a763J726L722l174n552J580O214N88l361Q28J351j163j989o85P74L730J387
$$ -1763 -37 3685 511 -5041 -3461 2753 3341 -20 808 2159 996 -993 -1678 -904 2826 4213
414D213m708k700M859J942m016K24M612j551n585o02K659K436K242j159n016j06
$$ 4213 -495 -3195 1664 3606 -410 -186 4426 2875 -2710 -3312 -653 1783 4025 2866 -2150 -2256
430b256M453j427l873M027K947m194l527J945O21Q58K746l278l107L613K411n248
$$ -2256 2197 770 -3103 924 3871 -323 -3850 -1905 -1284 -426 2320 -958 -4065 -452 1959 -3289
446c289N06P791j118q512J600M691k706k041K837l12NK898l955o264P171P972
$$ -3289 -2783 5008 3890 -4622 -3022 1669 -1037 -3078 -241 -553 -548 2350 -1605 -7869 -698 7274
462G274o791p203O796L802n409j87M898j120j699N73l725j255O347L109o223o50
$$ 7274 483 -6720 76 3878 -1531 -1718 3180 2060 361 934 -2791 -4046 2301 5410 -813 -1463
478a463O080k065o072L475O258l595m193J107O55r8J276k6k806J040K742k944
$$ -1463 4617 2552 -3520 -45 6213 2618 -1575 -468 187 89 1365 1339 -1467 -427 2315 -629
494f29l971L570M768j812l795P06J951j097r14J168P40j38l88j657k284K326M039
$$ -629 -4600 -1030 3738 1926 -1869 -1163 788 -309 -1223 -55 685 547 159 -1498 -3782 -1456 2583
511B583k373l639K315J865l151j293L850J886j695j428j017n54L143J806l327
$$ 2583 210 -3429 -1114 751 -2400 -3693 157 2043 348 -1080 -2097 -2651 492 2298 -1029
526a029p99L390p67l885K390M324j633k391N05K9M62J838j618j824M633J476p103
$$ -1029 -1828 1562 795 -3090 -700 3624 1991 -400 105 134 596 2434 816 -1008 3625 5101 -2002
543b002k422O790J428n346L30K767j700q77J706j235N75M201k036o388K846N673
$$ -2002 -4424 2366 3794 -1552 -1222 1545 -155 -1032 674 -561 14 4215 2179 -4209 -1363 4310
559D310l913l273N070J096o153q19M176l66m17J486k526j829L646J311m483L34
$$ 4310 397 -2876 2194 3290 -2863 -3682 494 128 -289 1197 -1329 -3158 488 1799 -2684 -2350
575b350M873j327m230p1K627Q00Jo55j241K60J312o45j056J778K439r84k247q23
$$ -2350 2523 1196 -3034 -3105 -478 322 323 -332 -1573 -1313 -1 -646 -1702 76 2515 1531 -716 -1539
593a539K266J423j715j565J920P48k651j218L029J426j229j235j03k26J486K53
$$ -1539 727 2150 435 -1130 790 1538 -1113 -2331 698 2124 895 -340 -443 -669 817 1070
609A070j727J090L080k044m211J339M069n9k801m33R83M56p85q88Q29J511L36
$$ 1070 -657 433 3513 1469 -2742 -1403 2666 2607 -194 -627 356 812 27 -861 -32 1479 1815
626A815k276j794K240J306o62j726Q43J152j295k218N91L452m27k819N70J670
$$ 1815 -461 -2255 -15 1291 629 -1097 -254 898 -397 -2615 -2024 1428 1001 -1818 -1248 422
642D22j107q44J993J01o38O84j089k409K182L661k943k743K709J288l307l8L151
$$ 422 -685 -1529 464 565 -73 611 -478 -2887 -705 2956 13 -2730 -21 1267 -2040 -2078 1073
659A073l68j204J142j011j414K301K473l193j380L152J04l542J048K806m56j099
$$ 1073 705 -499 643 -368 -1782 519 2992 -201 -1581 1571 1675 -1867 -819 1987 1531 432
675D32P97j451o52J941P86j766N97J664k073k171K176K209j516j547L76M52Q6
$$ 432 1229 -222 -874 1067 1853 87 684 2348 275 -1896 280 2489 973 -574 -198 254 340
692C40j058q19J603J988j421l557Q93K903K53j732n55J091P7o36r52K71J785N39
$$ 340 -718 -1537 66 2054 633 -2924 -2031 872 1125 -607 -1162 -71 6 -630 -1582 -1311 474 1013
710A013k127j174J498J114j261l29J776K51j945l20J275P18j37r6l64m14L44P41
$$ 1013 -1114 -2288 -790 324 -937 -1266 510 761 -1184 -1504 -229 489 352 256 -108 -522 -178 563
728E63j195O1K673ml232l58K763P23j711O03L69j125M7R65j046n72K453j73l489
$$ 563 -632 -571 2102 2098 -1134 -1492 1271 1994 283 886 1255 130 177 1142 96 -476 1977 1804 -1685
747a685N41L258j285k124J881J073j936n96J400o54l39J546p93k245J303J769
$$ -1685 -1144 2114 829 -1295 586 1659 -277 -873 527 -127 -466 1080 287 -1958 -655 1114
763A114k118j147K931O09l210l84J995L54p35R0J4k22O12n88j001J257J932j211
$$ 1114 -1004 -2151 780 1389 -1821 -2205 -210 144 -591 -501 -487 -709 -97 -685 -1686 -429 1503 292
781B92k149M29K086j54r85K69Q08j04j109o65J145J592m08r57l98R58km65L7N06
$$ 292 -1857 -1428 658 504 -481 -212 596 492 -617 -1282 -137 1455 1047 90 -308 650 648 183 220 726
801G26M96n10j357K78J600J97j120o85J218R3j094l28J058K72k9r13p68N48Q42
$$ 726 1222 712 -645 -367 1233 1430 310 -375 843 936 -158 -486 572 844 815 -98 -866 -318 524
820E24j91n72K3Q73n03r77k1J529J6j177m03j27O72r5k20p2O57L57j062j059J029
$$ 524 333 -239 -216 657 154 -823 -844 685 701 -476 -879 -1006 -334 -429 -649 -721 -64 293 -769 -1828 -799
841g99J645o11j250O9J040o0p26j42J014L62l50j460M31J549L52j329n54J426
$$ -799 846 235 -1015 -946 94 34 -692 -834 180 542 192 -1268 -837 712 1064 -265 -819 607
859F07J25j232J33N47Q29l49p31k29O49N02r09j17J213P4j398l56J494L85p09
$$ 607 732 -500 -367 180 1009 660 -71 -300 349 851 -58 -175 1038 1112 -286 -642 852 1237 528
878E28m49m2J52K46l48m91N79J251j121j423N21J455q63k65O5O27q31k9J14n51
$$ 528 79 37 189 435 87 -404 175 1426 305 -1118 -597 858 -5 -270 -205 422 -409 -438 -324 -875
898h75M60O86o30j298Q33J327q21q25R55N67j275k81O66K00rO17q52n81J343K35
$$ -875 -415 271 -359 -1657 -824 503 -318 -1143 -188 379 -896 -1177 -511 -311 -320 297 -555 -1136 207 442
918D42j449M36J621J75k226K75J548j93m52J45K55l50N56n56n42O14J823j501
$$ 442 -1007 -571 1050 1225 -1001 -726 822 629 177 322 577 227 783 227 -315 299 2122 621
936F21j717J230J061q44n76O67J18l08j46m21K12O15N03j269o10J156P3j037J0
$$ 621 -1096 134 1195 351 -225 442 560 252 106 -315 -103 512 1015 -254 -864 292 365 -672 -662
955f62J150j22j029J38M02n8k60K77k99K38L85p24k04M60P99p74o09M40J65J2
$$ -662 488 366 -663 -525 -123 -181 -441 -164 -463 -225 160 -564 -768 -308 491 -283 -892 -452 -287 -275
975b75j04K41J41j43kr2j50R22J30o55l43O19K97n41p2N32M36l20p67J10N29M68
$$ -275 -379 -138 3 -140 -142 -234 -384 538 668 13 -330 289 586 45 -27 505 941 621 -146 -36 493 961
997I61n02m44O2J144q87o05L17J071n09j025K96M63M36m04l65l58Q16Nr09l13
$$ 961 459 15 77 1221 334 -271 46 1117 608 -417 -121 342 778 374 9 -349 467 472 -437 -750
1017g50J037R32j050r60O63N20q17j28J95K84K19m01n36J53J068n49m68K78M52
$$ -750 287 1219 169 -791 -128 392 -425 -553 -358 -74 145 -256 -792 -639 429 -120 -588 -310 142
1036A42n27j53K84J75M88m54m96L3R72k82o78K42O49k19k52N0p8K67K99m05n76
$$ 142 -385 -538 -254 -79 409 -45 -541 -508 464 182 -496 -254 395 176 -76 -26 -104 163 462 57 -519
1057e19M69O16o08l18Q75M19q11l84J42M05J52J64o11n11J207j44p33L77N46N4
$$ -519 -50 566 -42 -360 515 934 123 -261 -119 286 438 602 -9 -520 687 543 -190 187 733 787
1077G87j263K67M37P4k38k10k1J84j6r52J97Q66k9p51J55K05K88k21j62j16L73
$$ 787 -476 -209 228 302 64 -146 -167 17 1 -951 -754 112 83 -668 -513 -308 -20 -241 -403 -519 -146
1098a46L1l85j4M92L41m73j72L8J95q0m74M40O02l98m38P8M80M1j96m4j15K77
$$ -146 -115 -500 -514 -22 319 -154 -326 -288 -93 -173 -647 -207 395 -3 -441 -363 117 158 -38 -82 -197 80
1120H0L22l88k59Q52L40n04p12N95L00m02k5J73J26j9q8n40j19P24K53p91l95
$$ 80 402 14 -245 607 947 443 -269 326 626 224 199 372 498 479 391 -149 -268 456 709 -82 -477
1141d77J116k53o08M03P8o3m09K35m50J97N54k33o35L50O17p16m16O22O11l90
$$ -477 639 386 -222 181 259 196 -213 22 -428 -231 323 90 -545 -195 422 -294 -710 -88 523 133
1161A33q36K99L93k28M0j50k37M51L56p22j14P25R0r47N64L89p7j84j76L18L17
$$ 133 -703 -404 -11 -239 -199 -349 -586 -135 221 -501 -615 110 200 -747 -183 206 129 -55 -231 87 404
1182D04k09q0k86L54K06o2m00K95K60n30j17N74J93l98l29J24J28Q9j37L7J73
$$ 404 195 115 -171 183 389 327 -73 222 482 -48 -165 409 602 204 -125 -1 127 216 79 116 289
1203B89j01Q5l65K30K45j17l74l25N25M27m03j35k93L79J53n48j05K86J67j77
$$ 289 188 273 -92 138 383 266 -108 -433 92 519 116 -19 -312 67 220 -328 -433 -147 20 -157
1223a57j57J23K13L8m73j00M60J22j13n99K23M95O7l76k37O21J93n10r3K84J23
$$ -157 -314 -191 22 60 -413 -513 -53 69 -44 -643 -420 75 142 -234 -471 150 343 -167 -260 24 147
1244A47k83k3j9J28M30k54k68K19N01l99m22J37M46J25k80k7j60K89k62k35K14
$$ 147 -136 -159 -178 -50 380 126 -142 77 578 179 -243 -106 340 465 185 158 -2 287 25 -210 4
1265DM09j56l00p6O7L3R5N7M4J79l56r8Qm3K41j49j64K70j52n7P6J4r7J01J61
$$ 4 413 257 -43 -119 -52 -19 76 133 177 356 0 -98 -90 -133 108 -41 -205 65 -87 -144 -68 -54 -151 -50 111
1290A11m07j6M78l32k51K68J91j16k95M75j10j53k09K50lq0J31j55L25n8J49m13
$$ 111 -296 -312 166 -166 -417 -149 42 -74 -369 106 -4 -157 -366 -116 -119 -199 -68 -223 102 44 193 -220
1312b20OM17P6l83KK77L87m01J75k21L9J62o1l14L84M55l70p01K06N48k22n39
$$ -220 -214 203 279 -104 -102 175 562 161 336 115 154 316 255 -59 325 780 410 -291 -85 463 241 -298
1334b98K02L84j19j93K15l47J51K78j90l06J16M48m51l53L15L37m38n4R2j18k36
$$ -298 -96 288 169 -24 191 -156 -5 273 83 -223 -107 341 -110 -463 -148 189 -249 -303 -211 -329 -565
1355e65M64j83j60O94k22m46M9K69K37k33j78q2K51j39J25N6J19L2nl23L05K25
$$ -565 -101 -284 -444 250 28 -418 -369 -100 137 -96 -274 -356 -105 -244 -119 -63 56 88 83 -240 65 290
1377B90j03j30J17L4j83J0j60L54k2j34k0j49K20J0j54Q7J96k38j11J8L10r0k59
$$ 290 187 57 174 208 25 35 -125 229 207 73 53 -96 124 134 -20 67 263 25 -86 -68 242 152 -107
1400a07K33P3L6l32j7N7M8P5k57q7L50L57o83J18m0L25k95j07N0J97oJ64j70j89
$$ -107 126 199 235 -97 -114 -57 -9 66 -191 -278 72 429 -254 -136 -176 149 -146 -253 -203 -6 -12 152 -18 -207
1424b07J55m71L02k44L25P6m2k77L19%rj44M3L37j73r3K67k25J62J55k13N2J54
$$ -207 -52 -523 -221 -465 -140 -64 -106 -383 -64 -64 -73 -217 -174 163 -10 -103 164 -61 101 256 43 95 249
1447B49J7j93K9n1J74j55j88J10j4rJ93n6j14J39K7l9J7K79k88j54k27L19J06
$$ 249 266 73 102 51 225 70 -118 -8 -22 -31 162 106 -8 131 158 119 136 415 127 -27 -254 65 171
1470A71n2j96R1K3j34Q7j52J05j2j55j87K21N42l78l4N1lq1j01q6J88m0m8O0k95
$$ 171 119 -77 14 37 -97 -10 -162 -57 -69 -224 -411 -190 352 -26 -60 -9 -12 -93 -194 -280 -92 -132 -180 -120 -415
1495d15J23K29m55L89K58k05j64J96J89j96J46l63L10m2k94K11j10K27l3k28J52
$$ -415 -292 -63 -518 -129 129 -76 -240 -44 145 -51 95 -268 42 0 -294 -83 -193 34 1 -227 -75
1516g5K53m7j1j59J35r7O2J03J3k44L80k43j75K15j77L20n24M29J78m46j22J15
$$ -75 178 131 120 -39 96 -1 61 164 177 -67 313 70 -105 110 -67 253 -271 158 336 -110 -232 -117
1538a17P9L22j7j60p2j22J23L5m37J13K05k41J55Q5L93m50Ro5k78N03p6j05q8
$$ -117 -38 284 267 107 35 -87 36 71 -366 -253 -48 -289 -134 -49 344 -106 -97 -162 -440 63 -13 -118 -206
1561b06L18k30k42K86M33j24l53L0R1K31n03K17q4K02K3j99J73L8J70k35k23p3
$$ -206 112 -118 -360 -74 359 235 -118 -88 3 234 -269 -52 -136 66 89 -110 63 101 271 36 -187 -260
1583b60N45J10m69J8Q2J84k90K0J16p8K43l89M08k35K63l41r3P7Q1jj8K16l01
$$ -260 285 395 -74 -56 26 210 -80 -60 56 -22 221 -168 240 5 268 -73 -166 -89 -8 -9 -27 189 -112
1606a12J52o0m7K7l3K6p7L9J01J17m06J05K26l03RK39k25Q3K25k3j99K54q0j71
$$ -112 40 -20 -67 -40 -73 -47 -124 -85 16 133 -273 -168 58 -245 -236 3 -222 -139 86 63 -136 118 38 -133
1630a33P1L03q6m49J95K40j25J11j59l4M0o3J02q3K19J5q9P6j74J71j38l8J80
$$ -133 -62 241 155 -294 -99 141 16 127 -32 -66 -26 -89 13 -70 149 164 75 151 -23 148 10 -28 152
1653A52P2J26j7l10J45K7J41k02j7K21k72j9N6J7J14j37k66K70l54M62j54p4j17
$$ 152 224 350 333 23 168 195 336 134 117 338 66 47 103 120 234 97 -169 101 -253 209 55 -19 -136
1676a36L18j95m14K32J64k0j84J71K38l21L42p6j91l4J72j98O9%n3J94j97L10
$$ -136 182 -13 -427 -195 -31 -51 -235 -64 174 -147 195 119 -72 -106 66 -132 -63 -63 -116 78 -119 191
1698A91l36L2J02j23K49O3l00l84Q13l17l17M47M9j13J27l76L76q7j32N7j65J32
$$ 191 -145 -113 -11 -134 115 178 -122 -506 307 -10 -327 120 169 56 183 -193 183 96 -36 21 -144 -12
1720a2K27k56j56K32J21K0j73J7j99N21m72L11j62L50m00J85j26J58r9m85M03
$$ -12 215 -41 -197 35 156 176 3 20 -179 342 -130 181 19 369 -31 154 28 186 87 -398 5
1741EJ42j48p6j94K86p7R9j21L5J8L7K45j29k68K66k23j6J20j68J79J0j15J23
$$ 5 147 -1 -77 -271 15 -62 37 -84 -49 -31 6 251 122 -146 120 -103 -119 1 -167 12 22 -93 30
1764C0k4j99o4J25K52l07J62k14L20J34m67P0K59J86l87J46J23Q8k13J99r3K6
$$ 30 6 -193 -257 -132 120 -187 -25 -239 81 215 -252 -182 77 263 -124 22 145 233 20 219 126 152
1786A52P5m1J58m01L69j18k27k19N32k14j22J2k6J59k86J9OL42l7q9k24L88k48
$$ 152 227 186 344 -57 312 194 -33 -252 280 66 -56 -44 -70 89 -197 -178 -172 170 133 44 -180 208 -40
1809d0J09j01j05K63lj0K8j86Q6j15n2r7PL72m05L45k5j34n3K2J51lK00l99K79
$$ -40 69 -32 -137 126 123 113 141 -45 41 -74 -126 -223 -216 156 -249 96 71 -63 -116 -94 57 54 254 -145 134
1834A34k43J29j46j74N89k43j34j30L68k07J3j19K13J1j28L33m69L61K49n19k8
$$ 134 -109 20 -126 -300 289 46 -88 -218 150 -57 -44 -163 50 61 -67 266 -203 158 407 -112 -140
1855a40L43p0R3J02m47J14M5J57l72K11J81k38m2j8m4O7J75k20k5L67k81J25m7
$$ -140 203 133 226 328 -119 -5 40 197 -175 36 217 -21 -63 -81 -125 -58 117 -103 -128 239 -42 83 36
1878C6J02j13J70l38K59j18J89m56J57l7j1k9o9L43p7k56q6L80j54J69n5j24K0
$$ 36 138 25 195 -143 116 -2 187 -269 -112 -149 -160 -189 -258 85 8 -248 -334 46 -108 61 6 -118 -98
1901i8J24j77P1j54Q1M37k74M9J15O0Qk70n6L0n9J3J53k60K01J79l17P3M12J6
$$ -98 26 -151 -80 -234 -153 284 10 59 174 234 242 -28 -84 -54 -113 -100 53 -207 -6 173 -144 -71 341 357
1925C57l82K91r3m1j12J61M1k13L3N8j57K70j65o8J15KK0j78K87k92J19j37L6
$$ 357 -25 266 173 132 20 181 222 9 42 100 -57 213 48 -20 95 97 117 -61 226 -66 53 -84 -48
1948d8L8J2j62J72kJ55M7o9p4l4j92L82l46J52j24J8J18k29k15L07m8m0K54j12
$$ -48 -10 2 -160 12 10 165 212 143 69 35 -157 225 -121 31 -93 -75 43 -186 -401 -94 -142 -182 72 -40
1972d0n1K40j49L7rj73O9K58j25p7J30j51K12j23pj10K48k2n7j06J88j00j0m3
$$ -40 -91 149 0 37 28 -145 -76 182 57 -20 110 -41 171 48 41 -69 179 157 100 -6 182 82 72 29
1996B9q6J70J46k11q6K35k34M9k58J03J38r2J63P0q3O0l78K83P6l0mr9K6l81O20
$$ 29 -57 113 259 48 -38 197 -37 12 -246 -143 -5 -97 66 136 53 113 -265 18 94 64 60 -39 -13 -394 226
2021B26j78m08N52r7k6l48L46k42O8J89j36M3N5k84K15P0R0J40j93l7m3NJ9k76
$$ 226 48 -360 192 95 69 -279 67 -175 -107 82 -54 -11 44 -240 -25 45 135 275 82 45 2 7 26 -250
2045b50L75P0j82j19j20K07o7K20r3k46K89k7q4O9J78j87J75j10k10R8N1n7k57
$$ -250 125 195 13 -106 -226 -19 -86 134 41 -205 84 57 -27 42 220 33 208 98 -112 -14 37 -20 -277
2068b77N1L67j49n4m4K59J49n80J95m2K01r3j61O2K5L0n0J29m9L60m44o9jM78
$$ -277 -226 141 -8 -62 -106 153 302 -278 -83 -125 76 -17 -178 -116 -91 -61 -111 18 -31 329 -115 -184 -185 293
2092B93m17k06K05J83N7o9m04L42j19J42k47L56k16J69l81M10J35l83J43J26o8
$$ 293 -124 -330 -125 58 115 46 -358 -16 -135 7 -240 116 -100 69 -312 98 233 -150 -7 119 51
2113E1K24K1l53K19k22j78K45J06m2L1j49J6J14P7j55J5j50N4P0op0l8J2j39J97
$$ 51 275 296 -57 162 -60 -238 7 113 71 102 -47 -31 83 160 5 20 -130 -76 -6 -12 -82 -120 -108 -247 -50
2138e0J66J6j91k0m7Q4p7l5O0O7K10j88M3L7k51J19j6j36K67J49j85j55K5J0j32
$$ -50 116 132 -59 -79 -126 -42 -119 -154 -94 -27 183 -5 38 75 -176 -57 -73 -209 58 207 22 -133 -108 -98 -230
2163b30j52N34r2J48j21k87J79k0J50k76K34j80J13J21o9j77K65M8l30L93j53
$$ -230 -382 152 60 208 87 -200 -21 -41 109 -167 67 -113 0 121 52 -125 140 188 -142 251 98
2184I8j80j0J82q7j27K93O7j01L5MP8m12L06Kj81J6j24L39k49l9K2J95q2j22k60
$$ 98 -82 -92 90 3 -124 169 236 135 170 174 252 -160 146 148 -33 -17 -141 198 -51 -90 -68 127 45 -77 -337
2209c37L81j11L64k90J2k01J87j59J18j58K4J20n9J23k48M81n28L95k65Q5q9L9
$$ -337 44 -67 297 7 19 -182 5 -154 -36 -194 -170 -50 -109 14 -234 247 -281 114 -151 -66 -155 -116
2231a16K17k39K77k97K66O9j79J20j65n0L22o2m24J75J42J39k14KP7J71j46r0
$$ -116 101 -138 139 -158 108 177 -2 118 -47 -97 225 163 -261 -86 56 195 -19 -17 60 231 85 -5
2253eJ64k47J59l4k4K10J0j13n7Q4k54J78j69R4Q1k02j4j8J56K15m01J09Ql6k07
$$ -5 159 -88 71 37 13 223 233 120 63 147 -107 71 -98 -4 77 -125 -139 -157 -1 214 -187 -78 -70 -106 -313
2278c13J27k62K71N2Q7l21K05J24k8o8l90O12M8k03r8k21J49L41k47J16j4J08
$$ -313 -186 -448 -177 -125 -38 -359 -154 -30 -58 -126 -516 96 144 -59 -157 -378 -229 112 -135 -19 -33 75
2300G5J00r7lj3L6j70j00J12J2K39k91M61k09O0p3K74l06M3j81K69P1j22p8n30
$$ 75 175 78 75 62 98 -72 -172 -60 -48 191 -100 361 152 212 139 413 107 150 -31 238 309 187 109 -421
2324d21P40k93K36j89R9L0j50j33j34J93R7k36P9L4m9p6L1j3K45n9k9N0j06n5
$$ -421 319 26 262 73 172 202 52 -81 -215 -22 75 -161 -82 -48 -97 -173 -142 -155 90 31 2 52 -54 -109
2348a09J35o0J48O0j20J43l93J27m4o8L8J02J7J03j22K11J8j17qj67J94M6N5k62
$$ -109 26 -34 114 174 54 197 -196 -69 -113 -181 -143 -41 -24 79 -43 168 186 69 61 -106 88 134 189 -73
2372g3J22K17m06J23N6Lj43J03M8l42M63j37k6r3J10J00l11J76K23l73J60r6R3
$$ -73 49 266 -140 -17 39 42 -101 2 50 -292 171 34 8 -85 25 125 -186 -10 213 -160 0 -96 -3
2395cL62k48k17M5K1L50k11q3j17M0J91q6Q7r1p4k71M60r3L0k31J53j58n8J57
$$ -3 359 111 -106 -61 -40 310 99 16 -101 -61 130 44 131 40 -34 -305 155 62 92 -139 14 -144 -202 -45
2419d5J2QQ2%q8j50j73L78j95L04j47K02j54qq9L7o9R0K67M0k36k54M58n48L28
$$ -45 -33 -25 57 57 -31 -181 -354 24 -171 133 -14 188 34 26 -63 -26 -95 -5 262 302 66 -188 270 -278 50
2444E0j0j30l3J27j48K41K8p2N3jm8j36O8K20j94j10J00j1r1p1n1J85J98j81j45
$$ 50 40 -90 -123 4 -144 97 125 53 106 105 57 -79 -11 209 15 -95 5 -6 -97 -168 -219 -34 164 -17 -162
2469a62K67L5k54RJ53kr7m3P0o2J34r2p4K52l75J93l58L18j60M80j88M3n8j25
$$ -162 105 140 -114 -105 48 46 -51 -94 -24 -86 48 -44 -118 134 -241 -48 -406 -88 -248 232 44 87 29 -96
2493i6K77jl98J7M04k85J24J5o1J10l7k8q9L1l3K1q9L86j72o5p0K11k58K16L3
$$ -96 181 180 -218 -201 203 -82 42 57 -4 106 69 41 -48 -17 -50 -29 -118 268 96 31 -39 172 -86 130 163
2518A63k92J54L02ql28k64K17l0l6J86K2O4l41K68R2k79L01k72n8j10L58k32J51
$$ 163 -129 25 327 319 -9 -273 -56 -86 -122 64 86 150 -191 77 169 -110 191 -81 -139 -249 109 -123 28
2541B8L0j89N3j1J18p5l3n0K3N6J01k78j12L62J06k15Ml4R4k4J58k14qN4pJ22
$$ 28 58 -131 -78 -89 29 -46 -79 -129 -106 -50 51 -227 -339 23 129 -86 -82 -116 -22 -46 112 -102 -110 -56 -63 59
2567E9J02m15L24m0kJ50j68J0j7J87j39Q1j57j30K14n9k58K77L7R4J17o30N45
$$ 59 161 -254 70 30 28 178 10 20 3 190 51 132 -25 -155 59 0 -258 19 56 150 267 -363 182
2590A82l7O1l45l4J23l5L19k55R5J16k01K2r3J34K45n56L89j95o3K3j03K19j99
$$ 182 145 206 -139 -173 -50 -85 234 -21 74 190 -11 11 -82 52 297 -259 130 -65 -128 -105 -208 11 -188
2613a88J96q6k26M42k93j89L10n1PJ76K9j87J14n7r8K5L26j00j46o8J54r7j0j09
$$ -188 8 -78 -304 138 -155 -344 -34 -85 -78 98 127 -60 54 -3 -101 -76 250 150 4 -64 90 -7 -17 -126
2637a26L59K91m30j25J69k00L95k66l03J18R5R9J82P9N7k97J37j11k85K17L44
$$ -126 233 524 94 -31 138 -62 333 67 -236 -118 -23 76 258 337 394 97 234 123 -162 55 399
2658C99n5k66j15M8M7n0k43J95J9jj60J32J24Oj16j12J19n6pq0L16k21K34k52
$$ 399 344 78 -37 11 58 8 -235 -40 -21 -22 -182 -50 74 80 -36 -148 -29 -85 -92 -172 144 -77 157 -95
2682i5L0P0l5j41L17Mqp7Q3K56p82L85J39p9J5l89L22Q4j51O1J82j48j60o8L46
$$ -95 -65 5 -30 -171 146 150 142 65 148 404 -378 7 146 67 82 -307 15 99 -52 9 191 43 -117 -185 161
2707A61k15Q8j36NK36n8p2mj63K32J35l65N1J97k70J18J1J91l70L68k5j25rj93
$$ 161 -54 34 -102 -97 139 81 9 5 -158 74 209 -156 -105 92 -178 -60 -49 142 -228 140 115 -10 -19 -212
2731b12M51m95J72l04K61K4J23j64L2J18m0j56J33RJ06m7j53Q7J47L3m38K46J39
$$ -212 239 -256 -84 -388 -127 -103 20 -144 -112 6 -34 -190 -57 -48 58 11 -142 -55 92 125 -313 -67 72
2754G2N5p4k2O7J22k88L17j53J27k17j40K18L3l73K68M5k30pO7L62j85L3k25Q6
$$ 72 127 53 31 98 220 -68 249 96 223 6 -134 84 117 -256 12 57 -173 -180 -113 249 64 97 -128 -42
2778d2K01O5j21p4K58n94L66J13l21K26lJ1J18j01m8Jj91j99L84J13m4n6j4j09
$$ -42 159 224 103 29 287 -307 59 172 -149 77 74 85 203 102 54 55 -136 -335 49 162 118 62 48 -61
2802f1J15j03q9K67j03j42K48l87K00J35m31L8L36J13qJ30j77lm3j28J63k80Q
$$ -61 54 -49 -138 129 26 -116 132 -255 -55 80 -351 -313 23 136 128 258 81 78 35 -93 70 -210 -202
2825b02J41K40j07RK82k79n1k74K38Q7J78l47L5N2O0j74K31L2o1j52K51j88L68
$$ -202 -61 179 72 81 363 84 33 -241 -3 84 262 -85 -50 2 62 -112 119 151 90 -62 189 1 369
2848C69r0l5l40J26Q8j10k3L33n04Q4j3m8m0K80J39l33M4j52L15k07J20l21J90
$$ 369 279 244 -96 30 118 8 -15 318 -186 -102 -115 -163 -203 77 216 -117 -73 -225 90 -117 3 -318 -128
2871a28L2l2K70l81L16j30Q9J16k18j74J72KR8k06L7K21J12j39L1m3J68l43L99
$$ -128 -96 -128 142 -239 77 -53 36 152 -66 -240 -68 -66 32 -174 -137 84 196 57 88 45 213 -130 269
2894B69j84j61Q9j35K64k74J8K88P5m17K24r7j39Q5K32l61O48m62j0M24l44J40
$$ 269 85 -76 13 -122 142 -132 -114 174 249 -168 56 -41 -180 -95 137 -224 424 -38 -48 376 32 172
2916A72j69J14k3j19k5j9k13L78k62k08J28J60L6K8r8O0j12m1K04k2J07k38J8
$$ 172 3 117 94 -25 -50 -69 -282 96 -166 -374 -246 -86 -50 -22 -120 -60 -172 -213 -9 -31 76 -162 -144
2939a44j11K92j53J67l8n6M7K05m74K82o8J57j45K08k35K34k91R2k4J70k65j78
$$ -144 -255 37 -116 51 13 -43 4 209 -265 17 -51 106 -39 169 -66 168 -123 -31 -55 115 -150 -328
2961c28L29k78L69J2l25K95k79Q7MJ61k50K31K50n27K89N5P4k49J11k37L34j2
$$ -328 1 -277 92 104 -221 74 -205 -118 -114 47 -203 28 278 -249 40 95 169 -80 31 -206 128 116
2983A16j45j93J13j46J16L06k30M1J9J04j65j6J46k39J12k3K26q9K0j96K6N8o3
$$ 116 -29 -222 -109 -255 -139 167 -63 -22 -3 101 -64 -80 66 -173 -61 -84 142 53 73 -123 -97 -39 -102
3006a02K16j96nJ9J26J06k55Q6P5n7J32k72O7J24M1j8J55j02Q3k44Q7k66K28K6
$$ -102 114 -82 -87 -68 58 164 -91 -5 70 13 145 -127 -60 64 105 87 242 140 223 -21 66 -200 28 54
3030E4KJ7K0k6l8J81j98j29J16J0m7M08l96k49K74j87L42nk71Q3O8q3j47K46r9
$$ 54 56 73 93 67 29 210 12 -117 -1 9 -38 370 -26 -275 -1 -188 154 149 -122 -39 29 -54 -201 45 -54
3055e4j14Q3m5J99m21K66K30j91R0j98k8L92k71j69L36j33J9J62m59K89l17M51
$$ -54 -168 -85 -130 69 -352 -86 144 -47 43 -155 -183 209 -62 -231 105 -28 -9 153 -306 -17 -334 117
3077A17k67J07j48O0Kr5M05j79J22j77L49j75q5R3p1M0J55j72j61p2j37N61j84
$$ 117 -150 -43 -191 -131 -129 -224 181 2 124 -53 296 121 36 129 58 98 253 81 -80 -152 -289 272 88
3100H8k93L31j50K83j50n7O1K5L2k32k80O29j51L6m21M0L82m52K49k62K48r1J23
$$ 88 -205 126 -24 259 109 52 113 138 170 -62 -342 287 136 172 -249 -209 173 -279 -30 -292 -44 -135 -12
3123a2j32J6J36k50K49J12k99o6K46J08k74N1l9K94m03J97J36m3M4j60K72m2r7
$$ -12 -144 -128 8 -242 7 119 -180 -246 0 108 -166 -115 -154 140 -263 -66 70 27 71 -89 183 141 44
3146D4o9N7j64J34J00k09L3L69j99J79j63J26n5k08L9k72O48m24J52J3o6j00J2
$$ 44 -25 32 -132 2 102 -107 -74 295 96 275 112 238 183 -25 14 -258 390 -34 118 131 65 -35 -23
3169b3j92J12L0m3K74j38r1K24j67K61k25O3L7k80L14j28j0k6J20n47M79k81K72
$$ -23 -215 -103 -73 -116 158 20 -71 153 -14 247 22 85 122 -158 156 28 18 -8 112 -435 44 -237 35
3192C5l13M36j67l9Q5Oj02N1j13P5j11K70j08p9L15l15j11L99n8j56K7K86l49
$$ 35 -278 158 -9 -48 37 43 -59 -8 -121 -46 -157 113 5 -74 241 -74 -185 214 156 0 27 313 -36
3215c6j28K49o9J2J33o3O0l70L14k01O6K43k1m0k77J77J52j93k08N16m58J60r1
$$ -36 -164 85 16 28 161 98 158 -212 102 -99 -33 210 189 149 -128 49 201 8 -200 316 -142 18 -73
3238g3K01k51J79j9J34r0pl6j6j17J83j08L4J08j77k9L36l35J2L44l50L4K44j32
$$ -73 128 -123 56 37 171 81 74 38 22 -95 88 -20 14 122 -55 -84 252 -83 -71 273 -77 -43 201 69
3262F9J33k50k54M87j82k0J4K1o2K04j50k2M43l28j72M8j80L11J35l80K51j89
$$ 69 202 -48 -302 185 3 -17 -3 18 -44 160 10 -12 431 103 -69 -21 -201 110 245 -135 116 -73
3284g3o9J69Oj2k04M81l39J13L40l60j68M80m07j6J70l00J80q6J18r0L7J84q0
$$ -73 -142 27 33 21 -183 298 -41 72 412 52 -116 364 -43 -59 111 -189 -9 -95 23 -67 -30 154 74
3307G4j56R9o0R4J06k88k3K40o5j80P8p9N47m43J65r2KJ24k40p4J97J04j96K36
$$ 74 -82 17 -43 51 157 -131 -154 86 21 -159 -81 -160 387 -56 109 17 19 143 -97 -171 26 130 -66 170
3331A70q6l59J46l3J47j69o8j92M09L47m77J38K19k60j46L12m1j9j51M50l48j88
$$ 170 84 -275 -129 -162 -15 -184 -252 -444 -35 312 -165 -27 192 -68 -214 98 57 38 -113 337 -11 -199
3353a99R9J09k4j36J83m7K23j80j80J70k10N1Q8L7o0J06J17l63J13K26l18k4K9
$$ -199 -100 9 -15 -151 32 -15 208 28 -152 18 -192 -141 -53 -16 -76 30 147 -216 -103 123 -195 -219 -190
3376a90L89j42r1J45q7L6p7L8Q9l58K62J16J5j36k07K87o0N1kj22P5p2N9J15N5
$$ -190 199 57 -34 111 24 60 -17 21 110 -248 14 130 145 9 -198 89 29 80 78 -44 31 -41 18 133 188
3401A88k78M58k80k14L46k25n6j63M24J00j30mk11K52P6j51k46J47L7k93M27m9
$$ 188 -90 368 88 -126 220 -5 -61 -224 200 300 170 166 -45 207 283 132 -114 33 70 -223 204 155
3423A55o7r4K3J23j23j92K25nl30K71q1j28K59J6k99L35N6j92K9j07L06l29k1
$$ 155 88 -6 17 140 17 -175 50 45 -285 -14 -95 -223 36 52 -247 88 144 -48 -19 -126 180 -149 -170
3446a70K13p8L5j46J60j27J18l15R2L22oj61J10j54K52k40J53l46J12L14k06k10
$$ -170 43 -35 0 -146 14 -113 5 -310 -218 104 98 -63 47 -107 145 -95 58 -288 -176 138 -68 -278
3468b78L67q5K0J32l90L78j49j17K12%jj27J31m2P9k23K34l4Kj54J3k7J6J27J74
$$ -278 89 4 24 156 -234 144 -5 -122 90 90 89 -38 93 51 130 -93 141 107 109 -45 -32 -59 -43 84 258
3493B58j98q3n5J27N6o0k30J36L14k61nJ23j5k16M1K39l21J78J18m16J57K12j49
$$ 258 60 -23 -78 49 105 45 -185 -49 265 4 -1 122 107 -109 -68 171 -150 28 146 -270 -113 99 -50
3516e0r1K23P2n2j05M7k67J68J85j19j86K64L9L3j90J0j20J47J86j04j28J01J46
$$ -50 -141 82 154 102 -3 44 -223 -55 130 11 -175 89 128 161 -29 -19 -139 8 194 90 -38 63 209
3539B09k86J07J29l23N8J79kO1k02K02M7l2O1j15k33k9O8J65Q6l23L1J47l44M51
$$ 209 -77 30 159 -164 -106 73 71 132 -70 132 179 147 208 93 -140 -169 -101 64 150 -173 -142 5 -339 112
3563A12k03j5J11P6m2j52J22K49J4m2l4j39j74K46q2j67k6j72J89R8K16k35K83
$$ 112 -91 -106 5 81 39 -113 9 258 272 230 196 57 -117 129 47 -120 -146 -318 -129 -31 185 -50 233
3586B33l19pL8J07j10j4J89j19Q3k50L82l32Q8J03j1k3j81j45J69M36l75L17n08
$$ 233 -86 -93 -55 52 -58 -72 117 -2 81 -169 213 -119 -31 72 61 38 -143 -288 -119 317 -58 259 -249
3609b49M72j38r6J84k69J96o5J63m64K89o3q7J73j81R8l6Q7j7l51P71l54j23p2
$$ -249 223 85 -11 173 -96 100 35 198 -266 23 -40 -127 46 -135 -37 -73 14 -3 -354 417 63 -60 -132
3632a32L15m18J44N1p9M5o6N1K15l06J62k14L57k01O1L6j07L8J91j40J03k27P5
$$ -132 183 -235 -91 -40 -119 -74 -140 -89 126 -180 -18 -232 125 -76 -15 21 -86 -48 143 3 106 -121 -46
3655d6k09K37J88j29P4j88l7K81j04r7Q7j91O7J40j13K19J36l41L25m40L28p8
$$ -46 -255 -18 170 41 115 -73 -110 171 67 -30 57 -134 -67 73 -40 179 315 -26 299 -141 187 109
3677A09k50K29j76L8K46p7l48QK51J07l20r9j11L15P0k4J18o2r1P6o6J53J8p1
$$ 109 -141 88 -88 -50 196 119 -229 -221 30 137 -183 -282 -393 -78 -8 -32 86 24 -67 9 -57 96 114 43
3701D3j22p7K11Mq8O8op6L2N2j23m7P0J11l7R0q5k17K45J35r7j41O4O4l9k5l32
$$ 43 -79 -156 55 59 -29 39 33 -43 -11 41 -82 -129 -59 52 15 105 20 -197 48 183 86 -55 9 73 34 9 -323
3728c23M93j01J21m5k42K51Q5l31K20k6j88K49l37K3OM07l22l51L84J81k51J38
$$ -323 170 69 190 145 -97 154 239 -92 128 102 -86 163 -174 -151 -145 262 -60 -411 -27 154 -97 41
3750D1q1J60j01R1Nj52l2k17j9J23M20m23L21j76k08K40J66l40k4J26M1j09P9
$$ 41 -40 120 19 110 115 -37 -69 -286 -305 -182 238 -185 136 -40 -248 -8 158 -182 -206 -80 -39 -148 -69
3773f9J47k50K40j40P2J25l11L93j09p4Q5l5j12NM8o7J41J3j98J1k23L47j90j13
$$ -69 78 -172 68 -72 0 125 -186 207 98 24 109 74 -38 -33 15 -52 89 102 -96 -85 -308 39 -151 -264
3797b64K22J78j13k57K98k81J34P4j24J13l76O26k38P3m0j20J37Q1R2l35J30K2
$$ -264 -42 136 23 -234 64 -217 -83 -9 -133 -20 -396 230 -8 65 25 -95 42 123 215 -120 10 32
3819C2K54k87j2q0L6o5P0k65L43Pj2J13J37k73j31J62m12L76j69J89J31R7PO5
$$ 32 286 -1 -13 -93 -57 -122 -52 -317 26 33 21 134 271 -2 -133 29 -383 -7 -176 13 144 241 248 313
3843C13n97L70k18J60j36Ro5K24l4p3L75k24RJ10k34oJ42j16p2M5J65j53P0Pk00
$$ 313 -284 86 -132 28 -108 -99 -164 60 26 -47 328 104 113 223 -11 -17 125 9 -63 -18 147 -6 64 71 -129
3868a29LJ79j16J61r1J23l4p2j5k4Q6j08J21K25l30K6J7k0mj7q5q2K4L03m94J53
$$ -129 -126 53 -63 98 7 130 96 24 9 -15 71 -37 84 309 -21 5 22 2 -2 -19 -104 -186 -162 141 -353 -200
3894b00J36O1P2J18oj22J06Q6m17k7M19j28Jk31J78j31J31k58J73J5L5O3j7j3
$$ -200 -64 -3 69 187 181 59 165 251 -166 -193 226 98 99 -132 46 -85 46 -212 -39 -24 11 74 57 44
3918D4L9q2k53L47j12r9J23J6Oo0j5L3j8m8RR4J01j52L60l55j59J31j91N5K71
$$ 44 83 1 -252 95 -17 -116 7 23 29 -31 -46 -13 -31 -79 -70 24 125 -27 333 -22 -181 -50 -241 -186 85
3943H5L2j60l0K23j71K09J2m31K85j20m4J67q1k47M66m03J49L03k96J10j70K14
$$ 85 117 -43 -73 150 -21 188 200 -231 54 -66 -110 57 -24 -271 195 -208 -59 244 -52 58 -112 102
3965A02j56q0K37l0j34L65j6j99jk37O3M4j05r8m4L97R3p4j44L21j60j51j39K52
$$ 102 -54 -134 103 73 -61 304 288 89 88 -149 -86 -42 -147 -245 -289 108 201 127 -17 304 144 -7 -146 106
3989A06m2j13l43K41j36L0K44K15k27J95q5k74j26M46m1j69J58k42J99l6j6l9
$$ 106 64 -49 -392 -151 -287 -257 -13 202 -25 170 85 -189 -315 131 90 -79 79 -163 36 0 -16 -55
4011e5j28K29J4k16m2Q4J19j59K53k11J46j72K8M7J69p7Jk2j19K44j41O8j81J30
$$ -55 -183 46 60 -156 -198 -114 5 -154 99 -112 34 -138 -110 -63 106 29 30 8 -111 133 -8 60 -121 9
4035IrJ92j52j45L49l55rK01KK5j86K03j61K7k05O7r2N29k47j00K6j38L82j48
$$ 9 0 192 40 -105 244 -111 -120 81 83 108 -78 125 -36 -9 -214 -147 -239 290 43 -57 -31 -169 213 65
4059F5j23j33K81q2j30MJ75p9j31O8J4K36l17O2OK32j83L9J20k89K35l49J72r9
$$ 65 -58 -191 90 8 -122 -118 57 -22 -153 -85 -71 165 -152 -90 -84 148 -35 4 124 -165 70 -279 -107 -206
4083b06R4J96L2j88L3j05o9K79k9o7r6K83k19J37O1r5J46rk05j40J89Q4j06k60
$$ -206 -112 84 116 -72 -39 -144 -213 66 37 -30 -126 157 -62 75 136 41 187 178 -27 -167 22 106 0 -260
4107b60K99J57k82J38n7p8K13k64M24m26J18J13j43l4K52k01j7J42K4k31j70L68
$$ -260 39 196 -86 52 -5 -83 130 -134 290 -136 -18 95 -48 -82 170 -31 -48 94 118 -113 -283 85
4129H5j17l71M17OQ0J51m48K43J21j16jJ78k60j62L22j70P0k34K82j50K6p4L19
$$ 85 -32 -403 14 20 100 251 -197 46 167 51 50 228 -32 -194 128 -42 28 -206 76 -74 -48 -122 197
4152A97l93J56J6k57K59k60P5L11k15K69l4l39J49j00J88j08L7K02k87J15j25
$$ 197 -196 -40 -24 -281 -22 -282 -207 104 -111 158 124 -215 -66 -166 22 -86 -49 153 -134 -19 -144
4173a44R1j40J80K61k40M5k4R7k67M3J01J06m58M92k08l9L34j75r9L48l90k5J34
$$ -144 -53 -193 -13 248 8 53 29 126 -141 -98 3 109 -349 143 -65 -104 230 55 -44 304 -86 -111 23
4196B3l5J91j45l18K46n7j89M4M83j62j02J99l39J46J72m19N4K49Q%j37l1J06
$$ 23 -12 179 34 -284 -38 -95 -284 -240 243 81 -21 178 -161 -15 157 -262 -208 41 49 49 -88 -119 -13
4219a3L2r7K05J48k62J34N6j4o7k4j2lk64K88J54pj29m4j82J70r0j70J47K38j58
$$ -13 19 -78 127 275 13 147 203 189 122 98 86 83 -181 107 261 254 125 81 -101 69 -21 -191 -44 194 36
4244C6R3Q0P1k45K23n16M43j13J8l03J36k2Q0L9j69J22m8K08r6J22q9o1j65J9
$$ 36 129 209 280 35 258 -258 185 72 90 -213 -77 -99 -19 20 -149 -27 -75 133 37 159 70 9 -156 -137
4268a37R4J70j19K5p2P6j8J0j76L01N6k08j83j01J70R7N6j34J55J50k33l6k2K44
$$ -137 -43 127 8 33 -39 37 19 29 -147 154 210 2 -181 -282 -112 -15 41 -93 62 212 -21 -57 -79 165
4292A65q7l30M9m6K53Q9j68K01l10R6j59L67j06J01J51l36K25k83P3n1j27o2J79
$$ 165 78 -252 -203 -249 4 93 -75 126 -184 -88 -247 120 14 115 266 -70 155 -128 -55 -106 -233 -295 -116
4315a16L1J35j34o9J8J14j6j63K69k8j84L47j13k05k47K88P3Q9o8k30K71J8k00
$$ -116 -85 50 -84 -153 -135 -21 -37 -200 69 41 -143 204 91 -114 -361 -73 0 89 21 -209 62 80 -120
4338a20N3K9q1L37l68L2K88j85r8R9j99K9L48j01on0K00j97j16K45k5k25J02r
$$ -120 -67 -38 -119 218 -150 -118 170 -15 -113 -14 -213 -184 164 63 57 7 207 10 -106 139 114 -111 -9 -18
4362a8P8j43J1K73k91k21L11k6kJ64q6l1Ok03K70p8m24O14k76j51K94q0J56j57
$$ -18 60 -83 -72 201 -90 -311 0 -26 -28 136 50 19 25 -178 92 14 -410 204 -72 -223 71 -9 147 -10
4386a0Q9J44l75Q5p1L16j22j5r3K85j61k17K04n3J01l46L59k24J7L23n25L60M6
$$ -10 79 223 -152 -67 -138 178 56 41 -52 233 72 -145 59 6 107 -239 120 -104 -87 236 -289 71 117
4409A17j1Jo6o1j8K5k30J16K45j26L1N9j73L6k9J18K52l63j53J25N3kJ00k10K06
$$ 117 106 107 41 -20 -38 -13 -243 -127 118 -8 23 82 -91 -55 -84 34 286 -77 -230 -105 -52 -54 46 -164 42
4434D2l01R9J79k79J70J70M2K5ql7J12j91j77J24O0K54j69J58m25J56k47J99K82
$$ 42 -259 -160 19 -260 -90 80 122 147 139 102 214 23 -154 -30 30 284 115 273 -152 4 -243 -44 238
4457B38p1j9j52L21l49J92M8p1n0j88K12k06M3k4qJ83j57J9j61J93J17o7J2P3
$$ 238 167 148 -4 317 -32 160 208 137 87 -101 111 -95 -52 -76 -84 99 -58 -39 -200 -7 110 43 55 128
4481A28j41n5J2J86j56p3J59j74K08n02%L55j7J31p8rk23K6K30r0L41k87J33J15
$$ 128 -13 -68 -56 130 -26 -99 60 -114 94 -408 -408 -53 -70 61 -17 -26 -249 -223 7 -83 258 -29 104 219
4505B19j55P9N3J32m83J78Q6%k39J41k2J76J36j83k26L32m75J31J11J55Q3j43
$$ 219 64 143 196 328 -155 23 109 109 -130 11 -11 165 301 118 -108 224 -251 -120 -9 146 229 86
4527H6o0j25L70j99k50O3q8K00l1j3J46j90O1M1j11J15M9k4n8j77JP0j7mo3L10
$$ 86 26 -99 271 72 -178 -115 -203 -3 -34 -47 99 -91 -30 11 -100 15 64 40 -18 -195 -194 -124 -141 -145 -208 102
4553A02j49J46J3k18P9J22k01K13j78J8J99J42j68k57K77J02n2j47M5p5j70K01
$$ 102 -47 99 112 -106 -27 95 -106 107 -71 -53 146 288 120 -137 140 242 190 43 88 13 -157 44
4575D4k34J92j42J9J06J63r3k10N0N5J81k43K77j80J63l79Q8J07q2J46j19K90
$$ 44 -190 2 -140 -121 -15 148 55 -155 -105 -50 131 -112 165 -15 148 -231 -143 -36 -118 28 -91 199
4597A99k35Lj19L70l80J75o3j32L07j07K77l47P1o8LJ6K33l93O14m50J00PN1J07
$$ 199 -36 -33 -152 218 -162 13 -50 -182 125 18 295 -52 19 -49 -46 -30 203 -190 424 -26 74 81 132 239
4621B39m34J44O5J19k8k60l1O2LL93n80j0n4J4L07j0M3J6J34j85J74j03N6j80
$$ 239 -195 -51 14 133 105 -155 -186 -124 -121 272 -308 -318 -372 -358 -51 -61 -18 -2 132 -53 121 18 74 -106
4645a06N3q9R0J44n6j36p6K41J27l48k4P6L48k69m3m6j21L26k32J54R5j92J20
$$ -106 -53 -142 -52 92 36 -100 -176 65 192 -156 -180 -104 244 -25 -68 -114 -235 91 -141 13 108 -84 36
4668C6k43K16p5J15j64k7K49k12J62J40j28J36l62N6l0J63k49J65N5m0j9J2R7
$$ 36 -207 9 -66 49 -115 -142 107 -105 57 197 69 205 -157 -101 -131 32 -217 -52 3 -37 -56 -44 53
4691E3j21J08j24J65j88J93k39K44Q2j3rr3k07J10Q0J2m5j54J46l81M27l65L79
$$ 53 -68 40 -84 81 -107 86 -153 91 173 160 151 58 -149 -39 41 53 8 -146 0 -381 46 -319 60
4714F0Q8l18L66k4k00l6Q0n8K23k0j44j61k2l6J40L70j71j55j5j17K70k89J73
$$ 60 148 -170 196 172 -28 -64 16 -42 181 161 17 -144 -166 -202 -62 308 137 -18 -33 -150 120 -169 4
4737Dr3K06k49L98l15j83J34m7J32l41L57J69m00J37K37j42qJ48mj85J44J51k16
$$ 4 -89 117 -132 266 -49 -232 -98 -145 -13 -354 3 172 -228 -91 146 4 -4 144 140 -45 99 250 34
4760C4P8l6j02r0N6J61l6l4p5L10k92J32j01l0J52j22M9l20J64P2j58j97N50k63
$$ 34 112 76 -26 -116 -60 101 65 31 -44 266 -26 106 5 -25 127 5 54 -266 -102 -30 -188 -385 165 -98
4784i8J78Q5k17P2Q5l4j76J05J22p8K12o6k27Q2oj59K80k38P3J12K14k72K69l86
$$ -98 80 165 -52 20 105 71 -105 0 122 44 256 190 -37 45 39 -120 160 -78 -5 107 321 49 318 -68
4808f8L2K16m5k66J5R5K15j21j83p1J10K79k85k2J66j93K13k48M29k37j2K33l51
$$ -68 -36 180 135 -131 -116 -21 194 73 -110 -181 -71 208 -77 -99 67 -126 87 -161 268 31 19 252 -99
4831i9J35J94j59J51j09k92K34L3R8q2j83N9P9P2l32K97k16L86j74j29J99L2k33
$$ -99 36 230 71 222 113 -179 55 88 186 104 -79 -20 59 131 -201 96 -120 266 92 -37 162 194 -39
4854c9q4o3K45k52L6j97N74k53J54q3J57j41J2k77R2r2M32j60n1J49J23m21L4
$$ -39 -123 -186 59 -193 -157 -354 220 -33 121 38 195 54 66 -211 -119 -211 221 61 10 159 282 -139 -105
4877a05K9O4k60L61K17m21L5p6l1J16J9r4M08n47M28k90J35J7m2k4J34k09M6n0
$$ -105 -76 -12 -272 89 306 -115 -80 -156 -187 -71 -52 -146 262 -285 143 -147 -12 5 -37 -61 73 -136 -90 -140
4901a40J21k90Q2Q7j3pJ57J28l6k7j98J8N0jL26l34l98O69k5j75l3J76pk6j71
$$ -140 -19 -309 -227 -140 -153 -160 -3 125 89 62 -136 -118 -68 -69 257 -77 -475 194 169 -6 -39 137 130 104 -67
4926f7j14J54K4k5J13J70o92N39q8j25Q5l25J69K58r7J39J85k48j1Ll16L07j03
$$ -67 -181 -27 -3 -28 85 255 -437 102 14 -111 -26 -351 -182 76 -21 118 303 55 44 47 -269 38 -65
4949f5L2P7j0k9j94J12J47k64Q3N3l3K1K53k00j38M03k26k2j92J29K81k02N2k
$$ -65 -33 44 34 5 -189 -77 70 -194 -111 -58 -91 -70 183 -17 -155 248 22 0 -192 -63 218 16 68 66
4973F6l2J90k43N2j3M7J93l58j12J88K89Ll27N5L4j18K95j98L23j93l09K25k9
$$ 66 34 224 -19 33 20 67 260 -98 -210 -22 267 270 -57 -2 32 -86 209 11 334 141 -168 57 28
4996B8j04J08p3j35k25O49k34K46k09J85j93p3M01l70J5K4m3K77l31N3K25k61
$$ 28 -76 32 -41 -176 -401 248 14 260 51 236 43 -30 371 1 16 40 -3 274 -57 -4 221 -40
5018d0k01L83P5k80k5J25k04J54m6K63j2oJ45m89L99O5q3r5j88J25J60j72P8k07
$$ -40 -241 142 217 -63 -88 37 -167 -13 -59 204 192 186 331 -158 241 306 223 128 -60 65 225 53 131 -76
5042g6n2jJ43M5J2N2j33J08J21l54L26r9k45J07J89l07J21k3Q2j41L18j03M8k18
$$ -76 -128 -129 14 59 71 123 -10 98 219 -135 191 92 -153 -46 143 -164 -43 -66 16 -125 193 90 138 -80
5066h0K13l81J95m9J79k68K31j35J29l5j96K83j4k7m8j2j96J79L54o0k55J41m78
$$ -80 133 -248 -53 -102 77 -191 40 -95 34 -1 -197 86 72 45 -3 -15 -211 -32 322 262 7 148 -330
5089c30M68j85k2l0%R8p7J34q4M6P2j25j9q5Q5q3K38K25m34J3L03j69k4J0k37
$$ -330 138 -47 -69 -99 -99 -1 -78 56 -28 18 90 -35 -54 -139 -54 -137 101 326 -108 -95 208 39 15 25 -212
5114b12J91J22l8N3l24M71m58L26p1J68j15Km20K30K95j03m1k9R0k49L82m22L11
$$ -212 -21 101 63 116 -208 263 -195 131 60 228 113 115 -305 -75 220 117 76 47 137 -112 270 -152 159
5137A59J0k11j66L97o9j47o3J45q0K27l34J19J70j87M3j04K13k00N55l62m0k2
$$ 159 169 -42 -208 189 120 -27 -90 55 -25 202 -132 -13 157 -30 13 -91 122 -78 477 115 75 53
5159E3k2L6j29m3Q0j0k0M1r6l1K79O2j70j9l2lL2k5q9P0j55K54J49j71j49j64
$$ 53 31 67 -62 -105 -25 -35 -55 -14 -110 -141 138 200 30 11 -21 -24 8 -17 -106 -36 -191 63 212 41 -108 -272
5185b72J83J28j50K91Kj72k38K70k11J63m3m0L39j92n2k12L81j83j06J77J1j16
$$ -272 -89 39 -111 180 182 10 -228 42 -169 -6 -49 -89 250 58 6 -206 175 -8 -114 63 74 -42
5207d2J24k52N3L07k12J30k74K78r3o7K39j64K54k93k49L67j95J5L42k66K2j53
$$ -42 82 -170 -117 190 -22 108 -166 112 19 -48 191 27 281 -12 -261 106 -89 -74 268 2 24 -129
5229a29Q6j35L35k35L19j26l3j38M7J28l46Q1O0R4r4J56l35N57k45J08m11K79
$$ -129 -43 -178 157 -78 241 115 82 -56 -9 119 -227 -146 -86 8 -86 70 -265 292 47 155 -256 23
5251B3M7p2r9J18r6p2J45k07K15J8l27L63J55m36L28J47j99q4J1L8J04j9j30K4
$$ 23 70 -2 -101 17 -79 -151 -6 -213 2 20 -307 56 211 -225 103 250 51 -33 -22 16 120 101 -29 -5
5275eJ03l3k06l4K50j14k33N23k01J3J16p4l82K96l8l0K56l73K72K11j97j34j05
$$ -5 98 65 -141 -175 75 -39 -272 251 50 63 179 105 -277 19 -19 -49 207 -166 106 317 120 -14 -119
5298a19n9J56n0K35l34q6K15K45p7r2m2K24l43K57j44p0K42Qk14j28K57k64J76
$$ -119 -178 -22 -72 163 -171 -257 -42 203 126 34 -8 216 -127 130 -14 -84 158 166 -48 -176 81 -183 -7
5321gJ12j50R6j99L7K51k04nL7j0R1k22J70J45j1k29l7J0R4nK30q6l89K40J84
$$ -7 105 -45 51 -148 -111 140 -64 -69 -32 -42 49 -173 -3 142 131 -98 -135 -125 -31 -36 194 108 -281 -41 143
5346A43N8j99J33J59l59L4N7J61k90K32p9Q7l44J08j1K19o4j38N2N7l5o3k01L17
$$ 143 201 2 135 294 -65 -31 26 187 -103 129 50 137 -207 -99 -110 109 45 -93 -41 16 -19 -82 -283 34
5370C4P5Kj61J33M5j57o8J75j40J23r5O9k44K44o7m19M54r4L88n32L21J1k43J80
$$ 34 109 111 -50 83 128 -29 -97 78 -62 61 -34 35 -209 35 -32 -451 3 -91 297 -235 86 97 -146 34
5394C4p4n1j29N37k20l20l9J61J4J17j74q2J67K74o0j19P5k73K94k89K88l4j80
$$ 34 -40 -91 -220 317 97 -223 -262 -101 -87 30 -144 -226 -59 215 155 36 111 -162 132 -157 131 97 -83
5417h3k45M12J28k58o5J52k15K10jO4m2K57j3l44K5j03K87l11j0LJ24K02j46N7
$$ -83 -328 84 212 -46 -111 41 -174 36 35 99 57 314 301 -43 -18 -121 166 -145 -155 -152 -28 174 28 85
5441H5J50k84L09k93K35j73J8k04Q0J67j98L3j75L52j96P5j51L66l76o1J51K23
$$ 85 235 -49 260 -33 202 29 47 -157 -77 90 -108 -75 -250 102 -94 -19 -170 196 -180 -241 -90 133
5463A33o3r4K65k73q5K21j20j41R2j31J00ML25k93L06k38j11q3K82j59J55j04
$$ 133 70 -24 241 -32 -117 104 -16 -157 -65 -196 -96 -92 233 -60 246 8 -103 -186 96 -63 92 -12
5485a2J14j45j75L70k05O9j83K58k52L35j35n5J32Kk36K81k29P0r2l8J05O9lo6
$$ -12 102 -43 -218 152 -53 16 -167 91 -161 174 39 -16 116 118 -118 163 -66 4 -88 -126 -21 48 45 -21
5509b1l60L93l6mj15L08j13J08k85j5j3M7o7jO9q8J63j30J90j0r8J73j08K10j32
$$ -21 -381 12 -24 -28 -143 165 52 160 -125 -140 -153 -106 -173 -174 -105 -193 -30 -160 30 20 -78 95 -13 197 65
5534F5j33K84J23j90k27J2j08L07k34j1j58J51J09K0k30L17o6l1l6j04P7r8q9
$$ 65 -68 216 339 149 -78 -66 -174 133 -101 -112 -270 -119 -10 10 -220 97 31 0 -36 -140 -63 -161 -250
5557b50K08k07L11J10m8n0nk45K20J90l09N9j07q9M28j0k10lj21J17L51n55K87
$$ -250 -42 -249 62 172 124 74 69 -176 44 234 -75 -16 -123 -212 216 206 -4 -7 -128 -11 340 -215 72
5580G2l5k72L86j69K47k86P7L3n0J78n38K54r2K95k06J90j23J4J09J3P8m06M78
$$ 72 37 -235 151 -18 229 -57 20 53 3 181 -357 -103 -195 100 -106 84 -39 -25 84 97 175 -231 247
5603B47m81K9J15K69q5j20j00J75J57n63J62K19M1j51j02K20j32K16l73N20j38
$$ 247 -234 -205 -90 179 94 -26 -126 49 206 -357 -195 24 65 -86 -188 32 -100 116 -257 263 125
5624A25k71OJ42j32J22k85N56m52K96l3N4r5R3j0n4N2j41J8k69L87j00j22R4P2
$$ 125 -146 -140 2 -130 -8 -293 263 -189 107 74 128 33 126 116 62 114 -27 -9 -278 109 9 -113 -19 53
5648E3l23K62M5k17M4M5oK13j75J6J96m14M78l08j48L34p9rR2Kl30J51Rk35J18
$$ 53 -270 -8 37 -180 -136 -91 -97 116 -59 -43 153 -261 217 -91 -239 95 16 7 99 101 -229 -78 -69 -304 -186
5673a86K28n8P9j0m6j93k0MJ9mJ25J14l18L85J7k31R1K7M1p4K64m12J3J19k07
$$ -186 42 -16 63 53 7 -186 -206 -202 -183 -187 -62 52 -266 119 136 -95 -4 23 64 -10 254 -158 -145 -26 -233
5698b33M17q4n0J27j44j46ON8k04k3K60mJ05r5m9N4r4j3K79l65K27j48Q1J22j95
$$ -233 184 100 50 177 33 -113 -107 -49 -253 -276 -16 -20 85 -10 -59 -5 -99 -112 167 -198 29 -119 -38 84 -111
5723a11N8K06j47L5j95J06k10N69l27r0K70J06l39K6J70N9l36O4oQJ89o9Rj29
$$ -111 -53 153 6 41 -154 -48 -258 311 -16 -106 164 270 -69 -43 127 186 -150 -86 -92 -84 105 36 45 -84
5747h4rM0L64j70j22O9k07K81k63J18J87k68j48L32k03k2Q2o2K28o1M3j18n4J
$$ -84 -93 -53 311 141 19 88 -119 162 -101 17 204 -64 -212 120 -83 -105 -23 -85 143 82 125 7 -47 -46
5771d6p2N0J85l13K96K0j39j5L8j94J06L19p7J9m00K00q6J24j34m3J07j50L11
$$ -46 -118 -68 117 -196 100 120 -19 -34 4 -190 -84 235 158 177 -223 -23 -109 15 -119 -162 -55 -205 106
5794A06p6o7J68K2q0M9j67J96L1j89J78k11J26j99j05O5K98j67J45J02j64j27
$$ 106 30 -37 131 153 73 122 -45 151 182 -7 171 -40 86 -113 -218 -153 145 -22 123 225 61 -66
5816f6J37k20j3J35l9J73k77l8J50QK3o2J88j64J69j70N1J43j10o9K44j66j79
$$ -66 71 -149 -162 -27 -66 107 -170 -208 -58 -50 -27 -89 99 -65 104 -66 -15 128 18 -51 193 27 -152
5839a52K59p2j6q6L08k72K23j87m8J4K9J87l30K03k26Q4l4p4J73p8J38J14j67
$$ -152 107 35 19 -67 241 -31 192 5 -43 -29 0 187 -143 60 -166 -82 -116 -190 -17 -95 43 157 -10
5862a0QJ26k35J18J51j33J16R7j82R4l39R1Q0N1j58J18K64j47j38J57o2r7O8J90
$$ -10 -2 124 -111 7 158 25 141 238 56 150 -189 -98 -18 33 -125 -7 257 110 -28 129 67 -30 38 228
5886B28k72k1K33k71J46K7l6j9J5K6j44Q9N9j73q7K88O6Q8l40q8L32l71n2K15
$$ 228 -44 -65 168 -103 43 70 34 15 30 56 -88 1 60 -113 -200 88 154 242 -98 -186 146 -225 -277 -62
5910f2M5J08KQ4m0j50l9k37L86%p2j68K16J5j29r2L38j9k50k33J69L52k98j0J34
$$ -62 -17 91 93 177 137 -13 -52 -289 97 97 25 -143 73 88 -41 -133 205 186 -64 -297 -128 224 -74 -84 50
5935E0n3j64J08o8j19O9K09p6j80M3o6K66o5K01k56J98LL8p7m5L3LM2k23K13r1
$$ 50 -3 -167 -59 -127 -246 -177 32 -44 -224 -181 -247 19 -46 155 -101 97 100 138 61 16 49 52 94 -129 84 -7
5961gj53J85Q0m7p1r8L84j78k50L79m31M93o9j60j38R0j48K37K66n07L23j96K28
$$ -7 -160 25 105 58 -13 -111 273 95 -155 224 -207 286 217 57 -81 9 -139 98 364 -143 180 -16 212
5984B12l50K31p3k35K50Kj89J47j6j22K11k6j56M6L22j02l3o3j50Q5o5Q6n24N16
$$ 212 -138 93 20 -215 35 37 -152 -5 -21 -143 68 42 -114 -68 254 152 119 56 -94 -9 -74 12 -512 4
6008DJ59j06l11L1J19j12J05L43k65j26O1P2J76k82J4J51j56J40j04j18M63j79
$$ 4 163 57 -254 -223 -104 -216 -111 232 -33 -159 -98 -26 150 -132 -118 33 -123 17 -87 -205 258 79
6030G9l46K41p1J29P8Q6m89K38R7j8J0k01O6k01L85k08J34k87K17j10K39o6j01
$$ 79 -267 -26 -97 32 110 196 -293 -55 42 24 34 -167 -101 -302 83 -125 9 -278 -61 -171 68 2 -99
6053i9J30q4J39K7K63q9l37o3L57k67J37k29R3j50J8K47m4JlJ06l31j26N30J24
$$ -99 31 -53 86 113 376 287 -50 -113 244 -23 114 -115 -22 -172 -154 93 49 50 47 153 -178 -304 226 350
6077C50m81k58N18j92j06O4J14rL4O8k70K94m13L5J69o0K10R3j17l7j78J50K71
$$ 350 -131 -389 129 -63 -169 -105 9 0 34 102 -168 126 -287 -252 -83 -143 67 160 43 6 -172 -22 249
6100B49l15j75K31J85P1k49j66L21l44M6K61k07J51j08j3J22j27m9J20L7M7J8
$$ 249 -66 -241 -10 175 246 -3 -169 152 -192 -146 115 -92 59 -49 -62 60 -67 -116 4 41 88 106
6122A06q7m3j50K57k72K15o2n0J36J3Qk79J11K79k34p8J77l5qj58K13J9j32R2
$$ 106 19 -24 -174 83 -189 26 -36 -86 50 63 71 -208 -97 182 -52 -130 47 12 4 -154 59 78 -54 38
6146C8k80J69p1O0L98p23L60K84l74K16j19J33r7J92l59p0R0J75K58j35O4k97
$$ 38 -242 -73 -144 -84 314 -409 -49 235 -139 77 -42 91 -6 186 -173 -243 -153 22 280 145 209 -88
6168h8J05j92K6J42P5j9O0k56K55m2j55L07n3N7m99L02j58N1K05k68L16j91j27
$$ -88 17 -175 -149 -7 68 49 109 -147 108 66 -89 218 165 222 -277 25 -133 -82 123 -145 171 -20 -147
6191a47J82k65J26R5r2K7J27M3r2j10R5l5K00J5l8N1j03R9r1j09J97j35o3q5r
$$ -147 35 -230 -104 -9 -101 -74 53 96 4 -106 -11 -46 154 169 131 182 79 178 87 -22 175 40 -23 -108 -117
6216a17J90j72n0J24J73j54p4R6k5l4Jk88J58J03M5J83P4M4n94L58l7m8K10k09
$$ -117 73 -99 -149 -25 148 -6 -80 16 -9 -43 -42 -330 -172 -69 -24 159 233 277 -317 41 4 -44 166 -43
$$ [...]
8191E6
##END NTUPLES=NMR FID
##END=
