##TITLE=1H_SL20-Dau-B(500)
 CDCl3, 8 sc, 
 24.12.2020
##JCAMPDX= 6.0         $$ Bruker NMR JCAMP-DX V2.0
##DATA TYPE= NMR FID
##DATA CLASS= NTUPLES
##ORIGIN= UXNMR, Bruker Analytische Messtechnik GmbH
##OWNER= root
$$ XWIN-NMR		Version 3.5
$$ Thu Dec 24 10:37:23 2020 Russian Standard Time (UT+4h)  she@DPX200
##.OBSERVE FREQUENCY= 200.1315066352
##.OBSERVE NUCLEUS= ^1H
##.DELAY= (6, 6)
##.ACQUISITION MODE= SIMULTANEOUS
##.ACQUISITION SCHEME= undefined
##.AVERAGES= 8
##.DIGITISER RES= 18
##SPECTROMETER/DATA SYSTEM= spect
##.PULSE SEQUENCE= zg30
##.SOLVENT NAME= CDCl3
##.SHIFT REFERENCE= (INTERNAL, CDCl3, 0, 15.7039)
##AUDIT TRAIL= $$ (NUMBER, WHEN, WHO, WHERE, WHAT)
$$ ##TITLE= Audit trail, XWIN-NMR		Version 3.5
$$ ##JCAMPDX= 5.01
$$ ##ORIGIN= Bruker BioSpin GmbH
$$ ##OWNER= she
$$ F:/spectra/data/she/nmr/H-F/1/audita.txt
$$ ##AUDIT TRAIL=  $$ (NUMBER, WHEN, WHO, WHERE, WHAT)
(   1,<2020-12-24 10:36:15.57 +0400>,<she>,<DPX200>,
      <created by zg, POWCHK disabled, PULCHK disabled
       configuration hash MD5:
       00 E9 B6 7A A2 85 ED C7 34 08 36 98 17 FE 4E 26
       data hash MD5: 16K
       7E 91 AB A7 0C 01 F4 9C 11 55 54 A5 A2 A8 9E 0B>)
$$ ##END=
$$ 
$$ hash MD5
$$ 53 61 E5 D6 A6 B4 10 0A 4B 0C 7C DC 48 C0 49 6F
##$RELAX= 
##$RELAX= 
##$RELAX= 
##$RELAX= 
##$RELAX= 
##$RELAX= 
$$ Bruker specific parameters
$$ --------------------------
##$DU= <F:/spectra>
##$EXPNO= 1
##$NAME= <H-F>
##$PROCNO= 1
##$TYPE= <nmr>
##$USER= <she>
##$AMP= (0..31)
100 100 100 100 100 100 100 100 100 100 100 100 100 100 100 100 100 100 
100 100 100 100 100 100 100 100 100 100 100 100 100 100 
##$AQSEQ= 0
##$AQ_mod= 1
##$AUNM= <au_zg>
##$AUTOPOS= <>
##$BF1= 200.13
##$BF2= 200.13
##$BF3= 200.13
##$BF4= 200.13
##$BF5= 200.13
##$BF6= 200.13
##$BF7= 200.13
##$BF8= 200.13
##$BYTORDA= 1
##$CFDGTYP= 0
##$CFRGTYP= 5
##$CHEMSTR= <none>
##$CNST= (0..31)
1 1 145 1 1 1 1 1 1 1 1 1 1 1 1 1 1 1 1 1 1 1 1 1 1 1 1 1 1 1 1 1 
##$CPDPRG= <>
##$CPDPRG1= <>
##$CPDPRG2= <>
##$CPDPRG3= <>
##$CPDPRG4= <mlev>
##$CPDPRG5= <mlev>
##$CPDPRG6= <mlev>
##$CPDPRG7= <mlev>
##$CPDPRG8= <mlev>
##$CPDPRGB= <>
##$CPDPRGT= <>
##$D= (0..31)
0 1.2 0 0 0 0 0 0 0 0.06 0 0.03 0 0 0 0 0.0002 0 0 0 0 0 0 0 0 0 0 0 0 
0 0 0 
##$DATE= 1608791775
##$DBL= (0..7)
120 120 120 120 120 120 120 120 
##$DBP= (0..7)
150 150 150 150 150 150 150 150 
##$DBP07= 0
##$DBPNAM0= <>
##$DBPNAM1= <>
##$DBPNAM2= <>
##$DBPNAM3= <>
##$DBPNAM4= <>
##$DBPNAM5= <>
##$DBPNAM6= <>
##$DBPNAM7= <>
##$DBPOAL= (0..7)
0.5 0.5 0.5 0.5 0.5 0.5 0.5 0.5 
##$DBPOFFS= (0..7)
0 0 0 0 0 0 0 0 
##$DE= 6
##$DECBNUC= <off>
##$DECIM= 32
##$DECNUC= <off>
##$DECSTAT= 4
##$DIGMOD= 1
##$DIGTYP= 9
##$DL= (0..7)
0 120 120 120 120 120 120 120 
##$DP= (0..7)
150 150 150 150 150 150 150 150 
##$DP07= 0
##$DPNAME0= <>
##$DPNAME1= <>
##$DPNAME2= <>
##$DPNAME3= <>
##$DPNAME4= <>
##$DPNAME5= <>
##$DPNAME6= <>
##$DPNAME7= <>
##$DPOAL= (0..7)
0.5 0.5 0.5 0.5 0.5 0.5 0.5 0.5 
##$DPOFFS= (0..7)
0 0 0 0 0 0 0 0 
##$DQDMODE= 0
##$DR= 18
##$DS= 0
$$ [...]
##$SUBNAM2= <"">
##$SUBNAM3= <"">
##$SUBNAM4= <"">
##$SUBNAM5= <"">
##$SUBNAM6= <"">
##$SUBNAM7= <"">
##$SUBNAM8= <"">
##$SUBNAM9= <"">
##$SW= 16.9725356469052
##$SWIBOX= (0..15)
0 0 2 0 0 0 0 0 0 0 0 0 0 0 0 0 
##$SW_h= 3396.73913043478
##$TD= 16384
##$TD0= 1
##$TE= 0
##$TE2= 300
##$TE3= 300
##$TEG= 300
##$TL= (0..7)
0 120 120 120 120 120 120 120 
##$TP= (0..7)
150 150 150 150 150 150 150 150 
##$TP07= 0
##$TPNAME0= <>
##$TPNAME1= <>
##$TPNAME2= <>
##$TPNAME3= <>
##$TPNAME4= <>
##$TPNAME5= <>
##$TPNAME6= <>
##$TPNAME7= <>
##$TPOAL= (0..7)
0.5 0.5 0.5 0.5 0.5 0.5 0.5 0.5 
##$TPOFFS= (0..7)
0 0 0 0 0 0 0 0 
##$TUNHIN= 0
##$TUNHOUT= 0
##$TUNXOUT= 0
##$USERA1= <user>
##$USERA2= <user>
##$USERA3= <user>
##$USERA4= <user>
##$USERA5= <user>
##$V9= 5
##$VALIST= <valist>
##$VCLIST= <CCCCCCCCCCCCCCC>
##$VD= 0
##$VDLIST= <DDDDDDDDDDDDDDD>
##$VPLIST= <PPPPPPPPPPPPPPP>
##$VTLIST= <TTTTTTTTTTTTTTT>
##$WBST= 1024
##$WBSW= 4
##$XGAIN= (0..3)
0 0 0 0 
##$XL= 0
##$YL= 0
##$YMAX_a= 93948
##$YMIN_a= -106429
##$ZGOPTNS= <>
##$ZL1= 120
##$ZL2= 120
##$ZL3= 120
##$ZL4= 120
##$ABSF1= 10
##$ABSF2= 0
##$ABSG= 5
##$ABSL= 3
##$ALPHA= 0
##$AQORDER= 0
##$ASSFAC= 0
##$ASSFACI= 0
##$ASSFACX= 0
##$ASSWID= 0
##$AUNMP= <proc_1d>
##$AZFE= 0.1
##$AZFW= 0.1
##$BCFW= 1
##$BC_mod= 2
##$BYTORDP= 1
##$COROFFS= 0
##$CY= 11.3945322036743
##$DATMOD= 1
##$DC= 2
##$DFILT= <>
##$DTYPP= 0
##$F1P= 15.9154993809931
##$F2P= -4.1035820241983
##$FCOR= 0.5
##$FTSIZE= 0
##$FT_mod= 4
##$GAMMA= 1
##$GB= 0.15
##$INTBC= 1
##$INTSCL= 1
##$ISEN= 128
##$LB= 0.24
##$LEV0= 0
##$LPBIN= 0
##$MAXI= 10000
##$MC2= 0
##$MEAN= 0
##$ME_mod= 0
##$MI= 1.114404
##$NCOEF= 0
##$NC_proc= 0
##$NLEV= 6
##$NOISF1= 3.799351
##$NOISF2= 2.8
##$NSP= 1
##$NTH_PI= 0
##$NZP= 0
##$OFFSET= 15.70392
##$PC= 1
##$PHC0= -10766.04
##$PHC1= 16.20095
##$PH_mod= 1
##$PKNL= yes
##$PPARMOD= 0
##$PSCAL= 0
##$PSIGN= 0
##$REVERSE= no
##$SF= 200.130013532006
##$SI= 16384
##$SIGF1= 3
##$SIGF2= 2
##$SINO= 400
##$SIOLD= 16384
##$SREGLST= <1H.CDCl3>
##$SSB= 0
##$STSI= 0
##$STSR= 0
##$SW_p= 3612.71676300578
##$SYMM= 0
##$S_DEV= 0
##$TDeff= 0
##$TDoff= 0
##$TI= <>
##$TILT= no
##$TM1= 0
##$TM2= 0
##$TOPLEV= 0
##$USERP1= <user>
##$USERP2= <user>
##$USERP3= <user>
##$USERP4= <user>
##$USERP5= <user>
##$WDW= 1
##$XDIM= 8192
##$YMAX_p= 0
##$YMIN_p= 0
$$ End of Bruker specific parameters
$$ ---------------------------------
##NTUPLES= NMR FID
##VAR_NAME=  TIME,          FID/REAL,        FID/IMAG
##SYMBOL=    X,             R,               I
##VAR_TYPE=  INDEPENDENT,   DEPENDENT,       DEPENDENT
##VAR_FORM=  AFFN,          ASDF,            ASDF
##VAR_DIM=   8192,          8192,            8192
##UNITS=     SECONDS,       ARBITRARY UNITS, ARBITRARY UNITS
##FACTOR=    0.0002944,     1,               1
##FIRST=     0,             0,               0
##LAST=      2.4114304,     0,               0
##MIN=       0,             -106429,         0
##MAX=       2.4114304,     93948,           0
$$ Real data points
##PAGE= N=1
##DATA TABLE= (X++(R..R)), XYDATA
0@%%%%%%%%%%%%%Qj6J6j6J6k4L2l7M5n3O1p2Q8j01J14j33J52j70J94k21K50k82
35a49L18l58L99m44M96n52O12o80P54q34R18j013J117j229J355j492J645j813
53i50J998k208K445k714L025l385L812m324M947n733O757q146J0140j3253J8779
68A1190l1334J06712P380k00377J65868o2019j9816P9806q6691M1175J8601n8566
80b8071O5911m5850k788M3398n1364K5566J6653l8020L2251j1575j1771K3381
92A7721k4960Q77K8570j6641P393j6788k3270N9886j2224m8683L8525j1440K793
105A759J5695m1162L3359m911k6843N0296m5376l003M6032m7652K8645O477m1357
118b8041L3044j3825J2735J2768m8136M0153L748k7695L1017l4645O904M2244
$$ plain form
0 0 0 0 0 0 0 0 0 0 0 0 0 0 0 8 -8 8 -8 8 -16 16 -21 24 -29 32 -40 48 -53 61 -72 80 -90 104 -117 133 -149
35 -149 169 -189 210 -234 262 -290 322 -358 396 -438 480 -533 584 -645 710 -782 863 -950
53 -950 1048 -1160 1285 -1429 1596 -1789 2023 -2301 2646 -3087 3670 -4476 5664 -7589 11190
68 11190 -20144 86568 93948 -106429 59439 -2580 -22396 57410 -29281 11894 30495 -28071
80 -28071 37840 -8010 -10798 32600 -18764 6802 23455 -14565 17686 6111 -5660 17721
92 17721 -7239 -6362 22208 5567 12960 -3828 -27098 32788 20564 -28119 10406 -1034 1759
105 1759 17454 -23708 9651 4740 -22103 28193 -17183 -20186 25846 -21806 6839 13316 -28041
118 -28041 5003 -8822 3913 16681 -31455 8698 12446 -15249 15768 -18877 -11973 30271
130C0271l9525r64J6975p052O852j6776K159J5660j3393Q101O858j8246L571L091
144b418p065J6428n50j7151P591M249N238p067j8914K6045N986j7935J0682j4738
158i619Q268J9164k6874P602J425l163K3456k9915L449K0976l2835K3448O337
171A1719k7460K4223j2364o357K0486j9283O412K784j0186J9073j7678q371K9067
184A2065j0096j0779M964n443Q233N020p126J564m560J056J2254j1033m092J0438
198B465j0519R141R637k1536P684O895j1135J0108l434k412Q453n753M132p966
212d240o032K2407p244r408J0042n673L768J982n853K956k361O655L408j0817
226d10L748J733m871O282K308p202k339P566J157n573r23j794K744L515j952l311
$$ plain form
130 30271 -9254 -10218 6757 -295 6557 -10219 -8060 7600 -5793 2308 9166 -9080 -5509 -2418
144 -2418 -9483 6945 6395 -10756 -3165 1084 6322 -745 -19659 6386 12372 -5563 5119 -9619
158 -9619 -1351 17813 -9061 -1459 -34 -3197 20259 -9656 -6207 14769 -18066 5382 11719
171 11719 -15741 8482 -3882 -10239 10247 -9036 -2624 160 -10026 9047 -8631 -17002 12065
184 12065 1969 -8810 -3846 -9289 -1056 3964 -3162 -1598 -6158 -5102 7152 -3881 -7973 2465
198 2465 -8054 1087 10724 -10812 -3128 3767 -7368 2740 -694 -3106 5347 -406 3726 -4240
212 -4240 -10272 12135 4891 -4517 5525 -148 3620 5602 -251 2705 344 6999 10407 -410
226 -410 3338 5071 200 6482 8790 1588 -751 6815 7972 2399 1476 -318 2426 5941 3989 678
242F78n021R592K426j6034Q472O744j1678N857O75o047K433L752K853j1062j801
257h161J1062n343K792J845j0859M927L742l082Q14k321J892J89k61L682o852
272e934j671Q289j674m690K605L522j943q51k47l889L893M969j76l783l685N108
288a57N4m56M213q129K974Q800p572q19O89J378L411n821M383o42n551J1484m763
305C476q885Q716n15l71J181k465J40l184O104K306j0279L997L520m758L385J78
321B546n631K762M175l664k447J371R47L018l101j860K259m391N683K074j0235
336f494N730L256l359J660n335L980P77k598P690r629r54J2047r690J213L526
351A820p585Q049Q37l610J722n277M681K916m966M203j473k892N219p87l673J396
$$ plain form
242 678 -4343 5249 7675 -8359 113 6857 -4821 1036 1711 -4336 -1903 1849 4702 -6360 -8161
257 -8161 2901 -2442 350 2195 -8664 -3737 5 -3077 -2263 -4584 -2692 -2503 -2764 918 -5934
272 -5934 -7605 684 -990 -5680 -3075 447 -1496 -2347 -2594 -6483 -2590 2379 2203 -1580 -5265 -157
288 -157 -103 -559 3654 -4475 -1501 7299 -273 -1092 -403 975 4386 -1435 2948 2306 -3245 8239 3476
305 3476 -5409 3307 2792 2421 3602 1137 1277 -1907 4197 6503 -3776 221 3741 -1017 2368 2546
321 2546 -3085 -323 3852 188 -2259 -888 59 3077 -24 -1884 375 -4016 1667 3741 -6494
336 -6494 -764 2492 -867 793 -4542 -562 215 -2383 5307 -4322 -5276 6771 -2919 -1706 1820
351 1820 -5765 2284 3121 -489 1233 -4044 637 3553 -1413 2790 1317 -1575 3644 2857 -816 580
367E80L089j63j804q25O04J963M12j310l810P09O724l659k040K631o062L982L907
384D928m994R06l839M361L347r653O761Q4p411R592m608m126O305k990L695l591
400a233n307Q554l447o55M453q808L703N568o907J392J107k952K743K62J12q43
416b258m821N362L341q508L793K116m425P645m500o617R255k012J317l44p153
431g809J1501l038o588R861p994K313P550j1518P114J049p203Q698m155N80J898
446B259q463J1322m3r587P679m165Q13P523r363J351M588k768L831n484q38Q935
462G590o346k080N787n508L227L403q017N294k80n136O262j333n44j427o507J1542
478E927n17j1679Q366k411j55M888r693M420L116m396M773q718M715Q432j3324
$$ plain form
367 580 3669 3506 1702 877 1481 3444 3856 2546 -1264 -555 6169 2510 470 3101 -2961 1021 4928
384 4928 -66 840 -2999 1362 4709 -4944 1817 1901 -5510 4082 -526 -4652 1653 -1337 2358 -1233
400 -1233 -6540 2014 -1433 -2088 2365 -6443 -2740 2828 -4079 -2687 -1580 -4532 -1789 -1527 -1415 -2258
416 -2258 -7079 -1717 1624 -6884 -3091 -975 -5400 2245 -2255 -8872 383 -1629 -312 -656 -7809
431 -7809 3692 654 -5934 3927 -4067 -1754 5796 -5722 1392 2441 -4762 3936 -219 361 2259
446 2259 -6204 5118 5075 -4512 3167 -998 -185 7338 -2025 -674 3914 1146 4977 -507 -1345 7590
462 7590 1244 -836 4951 -557 2670 6073 -1944 3350 3070 -2066 4196 2863 2319 892 -5615 5927
478 5927 5410 -6269 2097 -314 -469 4419 -5274 -854 2262 -2134 2639 -6079 -1364 7068 -6256
493f256M685L708o547O357m096J440M630r869N872J996l676N975r420Q98J2070
508G767q352k887L395r25O229n654n117R294k042j293J496o329P570J982r722
523d588P107R74m919M700m376L785K911j0666P775J980n357N790r593L672J1576
538A0771j4336J266M339l729Q116r964j964J1099q612K410Q97o744J0539n398
552a310o018R821m565j299J597k474O663n236m348Q961k546j963J368n205N825
567g29N051q544p97L844J749M88o962K975O466o860J160K179k555M959m353j427
583c356O934m544M7R68j09N140p680j034R592m483n77n28k177P948l067l682K155
600A547r91M954l220m505O534j539k085J567j955L081j687k655L940j145r76o08
$$ plain form
493 -6256 -1571 2137 -4410 1947 -2149 -709 3921 -5948 -76 1920 -1756 4219 -5201 -4303 7767
508 7767 -585 -3472 -77 -1002 5227 -427 -5544 3750 1708 415 1911 -4418 3152 5134 -4588
523 -4588 2519 3493 -1426 3274 -1102 2683 5594 -5072 2703 4683 -674 5116 -4477 -805 10771
538 10771 -3565 -2299 2040 -1689 6427 -3537 -5501 5598 -3014 -604 293 -6451 4088 -1310
552 -1310 -7328 2493 -2072 -3371 -1774 -4248 2415 -2821 -7169 1792 -754 -2717 -1349 -6554 -729
567 -729 4322 -4222 -5019 -1175 574 1062 -5900 -2925 3541 -3319 -2159 20 -2535 2424 -1929 -3356
583 -3356 3578 -966 -919 49 -60 5080 -2600 -3634 5958 1475 898 370 -1807 6141 3074 -608 1547
600 1547 556 5510 2290 -2215 4319 2780 695 2262 307 3388 1701 -954 2986 1841 865 257
616B57r73M493q86o658L605L710k519j430j141J125K918k381j681O70M80L395
632B984m548k137O332l379j952L579k456J181j254q55M363l644o61J810k512N182
648B033k181n950O414J000k592n42r46L828r55k029K134k034J663K077l006N01
664e85J559q63r17J806P44k618O3K461m22j159l23Q78O53l33n30j549J820K019
682B704k220j807J061K236q85j633R88p50N38Q22j455K78k21j90N48q0N66k019
700a519j1L303k862q29J965j124J491j063j289R52o34K554j560l174M257n96j963
717b102K632k049P8J241o6L43j954J343J894k592J229Q65k818K129J728j496j249
734h44J478Q05m03p17P38m90l70K527j390j678J414J631j788J020q96j96J333
$$ plain form
616 257 -716 3777 2891 -3767 -162 3548 1029 -401 -1542 -417 2501 120 -1561 -891 -411 2984
632 2984 -1564 -3701 2631 -748 -2700 879 -1577 -396 -1650 -2505 1858 -1786 -2447 -637 -3149 2033
648 2033 -148 -6098 316 1316 -1276 -1818 -2764 1064 109 -1920 214 -1820 -157 1920 -1086 -585
664 -585 974 111 -806 1000 1744 -874 -811 1650 1228 69 -254 624 1277 944 414 -1135 685 2704
682 2704 484 -1323 -262 1974 1089 -544 444 -306 232 1054 -401 -123 -344 -534 14 -66 500 -1519
700 -1519 -1530 1773 -1089 -1918 47 -1077 414 -649 -1938 -986 -1620 934 -626 -3800 457 -139 -2102
717 -2102 530 -1519 -1441 -200 -266 77 -1877 -534 1360 -1232 -3 862 -1956 173 1901 405 -844
734 -844 634 1439 1036 319 1057 567 197 2724 1334 -344 1070 2701 913 1933 1037 841 2174
751B174k48o23j287M57K659q75j681J312j712J180Q33j409N9l43J925j634j319
768e32J929j180k07J463k138Q8P00k23J77j474O58N91r19J407j707r47K282j113
786a145q42N09o3k61O37R29j408l99O77P77j570n36J397K51o59J464j391j022
804b655K106P26j042l57K43N21k58J002o0k230K033J402k439Q29O47p64Q44p4
822D74J86j076N19K521k422q58J989o96k29J191r47j029J466O36j223o05O78M84
840A059l84k99O83j661O96J927k682K34Q11p64J222j205m71Q21j007J594n70k196
858b192K585j067m33K168k606L22J251n28M03j378P43J722k140J435q9k072L079
875A203n66j735J462k5J01M90o19P40j200r0K484j817r12K191j260K03J264k331
$$ plain form
751 2174 1926 1303 16 473 3132 2257 576 1888 176 1356 2189 780 839 496 2421 787 -532
768 -532 1397 217 10 1473 -665 -577 123 -100 77 -1397 -739 -148 -1067 340 -1367 -2314 -32 -1145
786 -1145 -1987 -1478 -1541 -1802 -1165 -236 -1644 -2043 -1366 -589 -2159 -2695 -1298 -1047 -1706 -242 -1633 -2655
804 -2655 -549 177 -865 -1222 -979 -458 -716 286 226 -2004 29 1431 -1008 -179 468 -296 548 474
822 474 660 -416 103 2624 202 -656 1333 637 408 1599 652 -377 1089 1725 502 -103 575 1059
840 1059 675 376 1059 -602 94 2021 -661 -427 384 -380 842 -363 -834 -13 -1020 574 4 -2192
858 -2192 393 -674 -1107 1061 -1545 -1223 28 -500 -97 -1475 -732 990 -1150 285 196 -1876 1203
875 1203 637 -1098 364 339 440 930 311 1051 -149 -239 2245 428 -484 1707 447 650 1914 -417
893d17R59R46p8K42k554J971K235l883J779J152l269L320j145j724K346j851J423
910A452m56j730L270l405n24M511l923l04J945j812K463k281j418K818j486Q88
926Hm91l179M401k22l445K618q30n44J658k221J521N40k318K350j283j03K189
943F49l981K101L340m508M47J398n51K142l451K73L432k689J737j307j683N295
959B644l002k228M096k277Q26J65j500L738k869o65L281l058K553K9m543N553
975B743j64l779J670o29K764n81m856M598O52k919K498l202J004M053m840P60
991b28J943j602J682k745O27M135n862J255L494l562K362j657k010N325k644k036
1007a523J448q88L837l114m096O420k299r37J886l411L448O89m839L967l37j479
$$ plain form
893 -417 542 1488 1410 1652 -902 1069 3304 -579 1200 2352 -917 2403 1258 -466 1880 29 1452
910 1452 996 -734 2536 -869 -1393 3118 -805 -1109 836 -976 1487 -794 -2212 606 -880 8
926 8 -483 -3662 739 517 -2928 -310 -1140 -1684 -26 -2247 -726 -186 -2504 -154 -1437 -1540 649
943 649 -3332 -1231 2109 -2399 -1952 -554 -1105 1037 -2414 -2141 1291 -1398 339 -968 -2651 2644
959 2644 -358 -2586 1510 -767 59 224 -1276 2462 -407 -1072 2209 -849 1704 1733 -2810 2743
975 2743 2579 -1200 470 -159 2605 2024 -2832 1766 2418 -501 1997 -1205 -201 3852 -988 -228
991 -228 1715 113 1795 -950 -323 3812 -2050 -795 2699 -863 1499 -158 -2168 3157 513 -1523
1007 -1523 -75 -963 2874 -240 -4336 2084 -215 -1152 734 -2677 771 1460 -3379 588 251 -1228
1023a228J421k444K913J323n897M527m88n53J750l897K020L577m139J410J47l6
1039D06L045n576J92N385l499J39O04j823L716k375j214K946k387J107K1k673
1055a986N390k604l636M825q83q79K13k688M230m77l368K824k162J942J657o109
1071c711L277K652l831J939j626R10J858m514K623J243l529L041k080k97M412
1086B367m930J96L157k057J324k272n43N304l810p18K212k106K815m94m086M772
1102A131j004j402J961k249K210K54l087L928p82k625L539k572J273K038n006
1117b393K940J669j924J174k451J761K983m639J477J418k524L378k035j377L372
1132B829k240K29L64j518K807k345l98L183l235J67J805k073J787n84k152K548
$$ plain form
1023 -1228 193 -2251 662 1985 -3912 615 127 -426 1324 -2573 -553 3024 -1115 295 442 406
1039 406 3451 -2125 -1933 3452 -47 92 696 -1127 2589 214 -1000 1946 -441 666 687 -1986
1055 -1986 3404 800 -2836 1989 1106 227 440 -2248 1982 1505 -1863 961 -1201 741 2398 -3711
1071 -3711 -434 2218 -1613 326 -1300 -390 1468 -3046 -423 820 -2709 332 -1748 -2045 2367
1086 2367 -2563 -2367 790 -1267 57 -2215 -2758 2546 -1264 -1982 230 -1876 939 445 -3641 1131
1102 1131 127 -1275 686 -1563 647 901 -2186 1742 960 -1665 1874 -698 575 2613 -2393
1117 -2393 547 2216 292 1466 -985 776 3759 -880 597 2015 -509 2869 834 -543 2829
1132 2829 589 818 1182 -336 2471 126 -272 2911 -324 -157 1648 -425 1362 778 -1374 1174
1148A174r28K69l63j940K908K09l376K309k36r80J584j841Q65K60j147J527q32
1165e38r90K320k467O30J966k718P90Q82r24J594k003K95J775j680J148n56j734
1182b210L512j560j257K138j516J092N04j929J633m73j27J549j905N67R03k002
1198a081K055j01j577J465l62L0L41j464R76N04j228J369o71j011K309j685o80
1215h11J570j172N07N7q22Q36j139Q79J076k728J475L92j706J700j99j252J024
1232c13n56N65k93q95J690p76l80J167j163m3J243p26J2j61j5J061q72J7M85p23
1252f76J023qj261Q98M12n81O39k18J61K23k90N10m82m80J273m68q4N28p47K68
1272F40O35p53K30m41L74P12j125P07K18j055J351k66j184J061o24m4K62j84j
$$ plain form
1148 1174 246 515 152 -1788 1120 1329 -2047 262 26 -954 630 -1211 -346 -86 -1233 294 -538
1165 -538 -1528 792 -1675 -1045 921 -1797 -1007 -125 -1049 545 -1458 -1163 612 -1068 80 -476 -2210
1182 -2210 1302 -258 -1515 623 -893 199 703 -1226 407 -66 -193 1356 -549 18 921 -1081
1198 -1081 974 873 -704 761 399 429 770 -694 282 786 -442 927 256 -755 1554 -131 -811
1215 -811 759 -413 94 151 -671 165 -974 -95 981 -1747 -272 120 -1586 114 -85 -1337 -313
1232 -313 -869 -304 -597 -1492 198 -578 -958 209 -954 -997 246 -480 -468 -629 -644 417 -455 -438 47 -676
1252 -676 347 339 -922 -24 388 -193 446 228 389 612 322 832 350 -130 1143 675 591 1119 372 640
1272 640 1275 522 752 311 685 1397 272 979 1197 142 1493 1227 43 1104 480 436 698 514 513
1291E13m01M14L62j522N90R04j142K81M00p69o4N82l33m19k63N86K20j034P55
1310c40j00p71J116k17j267Q95k88K27L1l04O38m90L2P79j417N05P31o77M33l14
1330g98k19P52l34M58K2q67J752n35p45O96l52jQ54j029L91L49j96O98o89Q1N09
1351G97p87O87K38j076Q07J11m80N30q52K91L31k78L05p80rJ491j242l54P46p58
1371b82Q30k49q69Q08p47M88L91j305J217j19j689K005m72j204J214m37K64n9
1389b15j264J648m69m14J098j793R53J364j562J0O76j56N34j302J098O97j446
1406e43Q53N14j593J861q55p17J949j312k1J03j7J485j547o77K208j448L09L47
1424H99j548J835J38j750J088k66L74J05j738J986k3j930K039r48l49J347k488
$$ plain form
1291 513 112 526 888 -634 -44 860 -282 -1 399 -370 -434 148 -185 -604 -867 -281 -61 -1095 -340
1310 -340 -440 -1211 -95 -312 -1579 -684 -972 -745 -714 -1018 -380 -870 -838 -59 -1476 -971 -240 -917 -484 -798
1330 -798 -1017 -265 -599 -141 -119 -986 766 231 -514 182 -170 -171 683 -346 45 394 198 896 207 288 797
1351 797 10 697 935 -141 666 777 297 827 -25 266 597 319 624 -156 -165 1326 84 -270 476 -282
1371 -282 548 299 -570 238 -509 -21 370 -935 282 163 -1526 479 7 -1197 17 -420 -156 -215
1389 -215 -1479 169 -300 -714 384 -1409 -456 908 -654 -644 32 -124 410 -892 206 903 -543
1406 -543 310 824 -769 1092 237 -480 1469 157 136 239 222 1707 160 -517 1691 243 552 899
1424 899 -649 1186 1324 -426 662 396 770 875 -863 1123 1100 -830 1209 261 -88 1259 -1229
1441a229J493R44j982M27j23M16J245k757Q45J629k003J289j033n89K457j999
1457i70p58J463o69Q43q57r66L065k100r75K353j449N02P9j860K680m29j460J136
1475c72q69J737l2k969K366J304k236J137j124P75J778k832J393O35j180J844
1491A355k275P29K562l086L46J834j380J469j901j65K886k135k26Q34q50K363
1507B360j889j871L385j018r59O13j140K181o15k369K178n00l05R11k138K023
1523H47O07l061J956L78r10P34k386J945J270k738J097k01l01K199k996O0L141
1540A641k355M22k35j25K065k474j35K597k025M24L92j629K687q33k047K387o10
1557A47K29n11j403L401q72k397K047o68N30L73k117J615J061j622P90q82O96
$$ plain form
1441 -1229 264 1208 -774 -347 -470 -54 1191 -1566 -721 908 -1095 194 -839 -1428 1029 -970
1457 -970 -1728 -265 -934 -91 -948 -1914 1151 -949 -1924 429 -1020 -518 -439 -2299 381 -48 -1508 -372
1475 -372 -1241 496 464 -2505 -139 1165 -1071 66 -1058 -283 1495 -1337 56 691 -489 1355
1491 1355 -920 -191 2371 -715 -369 1465 85 1554 -347 -512 2374 239 13 847 -3 2360
1507 2360 471 -1400 1985 967 8 621 -519 1662 1047 -1322 856 356 51 962 -1176 847
1523 847 1454 -1607 349 727 -183 551 -1835 110 1380 -1358 -261 -462 -763 1436 -1560 -1500 1641
1540 1641 -714 -292 -527 -652 1413 -1061 -1196 1401 -624 -200 192 -1437 1250 417 -1630 757 147
1557 147 376 -135 -1538 1863 991 -1406 641 -27 503 876 -1241 374 1435 -187 603 -279 417
1574D17J216k802J368J510k188R71l62l16J754k276J84J656j406O98p27q46K970
1591A821j942j105J748j005P87l06j426J705m83p03R64j287J284Q9j857J968j50
1608A02j433J110p87R72J5j379Q51L99o51P31j398J196J253k273N61R68n65J46
1626a82l03N2O07o29M92K61r23J307k88j063J434m18o53Q35q6N01q67j98J151
1645A030n95j97P86j238Q91M08r39N42P8M03m52p11R07l38m14P06q90M12K07q32
1665b36O89n65O70m7o43N64L13j169K26Q29o45o1M3o40L56K87k96j86K40Kj85
1686d54J74q9%l24N84l97k83M87j24n1K78l28j57J72N73m46l90N41K67m97K34
1707b30K39j96N1M38m06j03N50k31j26L73pl50K32K91j33m95K40N96o82J13L26
$$ plain form
1574 417 1633 -1169 199 1709 -479 492 130 -186 1568 -708 -524 1132 -274 424 -303 -1149 1821
1591 1821 -121 -1226 522 -483 304 -2 -1428 277 -206 -909 55 -1232 52 141 -1716 252 102
1608 102 -1331 -221 -1008 -36 -21 -1400 -549 -150 -801 -70 -1468 -272 981 -1292 -731 237 -328 -182
1626 -182 -485 -433 174 -455 37 298 -625 682 394 -669 765 347 -306 529 443 944 77 -121 1030
1645 1030 435 238 1024 -214 677 1085 146 688 766 1169 717 6 913 575 161 867 -23 389 596 -236
1665 -236 453 -112 558 511 -132 432 745 -424 -198 631 -14 -75 -32 -672 -316 -29 -325 -511 -271 -269 -454
1686 -454 -280 -369 -369 -693 -109 -506 -789 -302 -426 -477 -199 -527 -684 -512 61 -385 -775 -234 33 -464 -230
1707 -230 9 -187 -136 302 -104 -207 343 112 -14 359 352 2 234 525 392 -103 137 733 51 164 490
1728D90o13N53n0P1l96j22M13l0m72M82l44k61O67m84l14K38J11P2l03j4L49l84
1750c41L8K57o27N35J48m95R8J67k55L29J46l47N3m12P22j89l93N83k86J15L13
1771A59n79j65K71L52j9k90J59K25l64N31j66l90R53k37n13K80M4k4L00K4l5l00
1793B16J26N54n01R4K81m80K49M6q2q1M9K42k80j95N33j30n43O18m58l11M03J86
1815E36m42j82K78K07o70n3K54l53N6N03k89j63J73J72m95J39k59j50K34L28k44
1836d20l52M64J09l56N1M2L4J35j19j6l8L39l63P9J30j85J72j45K61J23k62J25
1858a92J56k71K99r3k2N00n47j50K99L13L02m52k85Q03p08n5Q49p19L69j4m03
1879b1K73J73r2o5j44Q65n45r51J082p6l72J75n25K04M83q63M36k7K18M59j305
$$ plain form
1728 490 -123 430 380 451 55 -67 346 316 -156 326 -18 -279 388 -96 -410 -172 -61 11 -292 -306 43 -341
1750 -341 -303 -46 -673 -138 10 -485 -387 -220 -475 -146 0 -347 -294 -706 16 -173 -566 17 -269 -154 159
1771 159 -420 -585 -314 38 19 -271 -112 113 -251 280 114 -276 677 440 -73 207 251 227 527 551 516 216
1793 216 342 896 395 489 770 290 539 585 503 422 471 713 433 238 771 641 98 716 258 -53 350 536
1815 536 94 -88 190 397 -273 -326 -72 -425 -369 134 -155 -318 -145 27 -468 -329 -588 -738 -504 -176 -420
1836 -420 -772 -308 -199 -555 -504 -462 -428 -293 -412 -428 -466 -127 -490 -411 -281 -466 -294 -439 -178 -55 -317 -192
1858 -192 -36 -307 -8 -101 -123 377 -170 -320 -21 292 594 142 -143 660 -48 -103 746 27 396 382 -21
1879 -21 252 425 333 268 124 989 444 -507 575 499 127 302 -223 -19 464 -399 37 10 228 687 -618
1900f18N61P92j343L61L36m77M68n57L1R36p86J28R1p10J525j212m04J265l01
1919H6l45N8o39J456m78r67Q23l58N49J61j129J189L88j258J014m45K42L50j483
1938g86J056O73j350Q03n14N32R20j723J63J480j128M73n79J16J259j602o6J102
1956H29p18Q22n13j343J933m98j183J170n71N80n31r86K358j276j021J122p66
1973e92Q65J25j905J332M20j068O19j125R48R87k569J515N35j109J014j052K05
1990h55J555j908L83Q18p79J328j529l4K316k092j13J107r55J335m82j418K161
2007H38o12n62O42j192J673j28k066K205n31o74J053j214J343L96k021J217L25
2024F92o33J174k028J319J225k478Q03O79n84J039j713M54J271j137L66m47k10
$$ plain form
1900 -618 -57 735 -608 -247 89 -388 80 -477 -446 490 -296 -168 -77 -787 738 -474 -878 387 86
1919 86 -259 -201 -840 616 138 -829 -6 -364 185 346 -783 406 794 -464 550 105 347 697 -786
1938 -786 270 943 -407 396 -118 414 1334 -389 -226 1254 126 599 20 136 1395 -207 -273 829
1956 829 111 933 420 -923 1010 512 -671 499 -72 508 -23 -1009 1349 73 -948 174 -592
1973 -592 273 398 -1507 -175 245 -823 -204 -1329 -381 606 -1963 -448 87 -1022 -8 -1060 -855
1990 -855 700 -1208 -825 -7 -786 542 -987 -1021 1295 -797 -910 197 -758 577 95 -1323 838
2007 838 226 -336 306 -886 787 659 -1407 798 267 -407 646 -568 775 1171 -850 367 692
2024 692 59 1233 -795 524 1749 -729 74 753 169 1208 -505 -51 1220 83 449 2 -208
2041b08J718j721p97K228j253l7K19o41J504q45j013J548r18L75Q9j658J957L91
2059I38k167J324j83K21M08j710J440L02j573J261o33K51J096k086O90J243j543
2076g21Q10l60j84J674k262M93J384j430J224m90p99J811j124m43P69l94M07j18
2094B47j028J631m34o74Q90n94jO05j141J034k13q48J096r07R26L09k245J567
2112B20K09M6K46q54M84K68j624N11P53m72O98j346m4J694j520O7J137j363R97
2131A07k84p46P75m76J17N26p90R15l43j039J430j46o33M28m65N18j81j27L23
2150i1J1l15P46q47K06Q41j074N98J81m00N21n79K78P05o69P4L21l23L76k96l04
2171d0R20k53k00J22l21K97j59K2J52l23L35M2n41K68J95o51Q53m74l00L40m8
$$ plain form
2041 -208 1510 -211 -1008 1220 -33 -70 149 -492 1012 167 -846 702 -216 159 248 -1410 547 938
2059 938 -1229 95 -88 133 541 -1169 271 573 -1000 261 -372 -121 975 -1111 -421 822 -721
2076 -721 89 -271 -455 1219 -1043 -550 834 -596 628 138 -661 1150 26 -417 352 -42 365 247
2094 247 -781 850 416 -258 632 38 37 642 -499 535 322 -526 570 -337 589 898 -1347 220
2112 220 429 475 721 -133 351 619 -1005 -494 259 -213 485 -861 -905 789 -731 -664 473 -890 107
2131 107 -177 -923 -148 -624 -507 19 -771 144 -199 -1238 192 46 -587 -159 -624 -106 -287 -414 -91
2150 -91 -80 -395 351 -496 -290 551 -523 75 256 -144 377 -202 76 781 112 186 507 184 560 264 -40
2171 -40 880 627 427 549 228 525 366 388 540 217 552 594 53 321 516 -135 718 244 -56 284 236
2192B36J36r7n08L95M1j36L22m99j02M56j32j3j55l77M46m74M14r1n65N78J9n15
2214f21L36K73m61K88l7o3j32O6J20j76j45P58m95M9M62o91L10L69k51p0j30L36
2236I5J59m19K65K00k11K37j24J8l29P26n01M5j52J34n5J91K29m42j18K77k83
2257e8K43Pk98M69k81k5n4oL8J98n81M70m65P3N05n40O9L11m46M96l67m6M61m92
2281c19J31J48n07L16K89o08L02P8l2J6k8M06k95l14Q85o98L9M44m03j80N62m93
2303b61N17k15K32r7l93M72L13m51K11j46k11M55N5k74K72l43L21j9k30M35l42
2324C01N8N24q10L01k7q4L05k52o4K70n44J22K65o98R98m72k83M53n92J27L89
2345B87o93L31K30n99N88o09J32M39p01K85L31q42P88n78L32L4l56K66J45l58
$$ plain form
2192 236 372 275 -233 162 203 67 389 -110 -212 244 112 99 -56 -433 13 -461 -47 -138 -703 -125 -106 -621
2214 -621 -285 -12 -473 -185 -222 -285 -417 -351 -231 -407 -552 206 -289 -240 222 -469 -159 210 -41 -111 -241 95
2236 95 254 -165 100 300 89 326 202 220 -109 617 116 161 9 143 88 279 508 66 -52 225 -58
2257 -58 185 192 -106 363 82 57 3 -3 35 233 -348 122 -343 -270 235 -305 -236 75 -371 125 -242 -288 173 -319
2281 -319 -188 -40 -547 -231 58 -550 -248 -170 -202 -186 -214 192 -103 -417 468 -230 -191 253 -150 -330 232 -261
2303 -261 256 41 273 176 -217 255 568 117 328 182 -29 426 481 207 479 136 457 438 208 643 301
2324 301 359 883 73 374 347 263 568 316 252 522 -22 100 365 -333 665 193 -90 363 -229 -102 287
2345 287 -406 -75 155 -444 144 -465 -333 106 -595 -310 21 -821 -33 -611 -279 -245 -601 -335 -190 -548
2365e48O17n52n56Q93k90k71O22o2k38k3k38Q81l07m04M27r02J127l30n63P72
2385E5k57m09J232j100Q02m78r59J331j08K98q1q64O29O50q15K46pl81P23p53
2405b46K51R30j233L46L71n92J034p41n05J025k82j09k70o27J490n27j305J761
2423G71q82q6N27j207J242m4j035J029r01N61M35j291J008L37j241O53%j78Q63
2442E61j225K2J304j214P84p22Q0J779j939r1J289r90N93M1p86J597j035l12P03
2461D39m39O89l72j407J968k23j138R60k69L26O3j312J089L20q20R63j303R31
2479D65P53j858L91R00r14O77p32J32J220j827N48Q75q69O87j089j78J617j265
2497d67l08O03k62O41o59p19J799j299K6N94r24R65j17j180J360j90k47K64o58
$$ plain form
2365 -548 69 -483 -1039 -146 -436 -707 -85 -147 -385 -408 -646 235 -72 -476 -49 -951 176 -154 -717 55
2385 55 -202 -611 621 -479 323 -155 -1114 217 109 407 326 -538 91 741 -74 172 165 -216 507 -246
2405 -246 5 935 -298 48 419 -173 861 120 -385 640 358 249 -21 -648 842 315 -990 771
2423 771 -111 -197 330 -877 365 321 -714 315 -586 -25 410 -881 127 464 -777 -124 -124 -302 561
2442 561 -664 -642 662 -552 232 -490 -410 1369 -570 -661 628 -362 231 272 -514 1083 48 -264 439
2461 439 0 689 317 -1090 878 655 -483 477 208 534 597 -715 374 694 -126 837 -466 465
2479 465 1218 -640 -249 651 -263 414 -318 -186 1034 -793 -245 630 -239 448 -641 -819 798 -467
2497 -467 -775 -172 -434 207 -452 -1171 628 -671 -645 -51 -975 -10 -127 -1307 53 -137 -384 -120 -778
2516g78Q60L02j653J210K14o78R20j120L15J315j505N13K89l75O81r07K79Q82
2534G64r70J02N62p96R12o12l40J050n48n5J58m77J289r56m23J097j76l96L57
2553E42r39J041m14k92N30j87K32J05j121R14K89j094P08j23k00L53n80K39K92
2572B95p45O72l74j17O78p03l79J118q22K13k66j00R64q25j83P67n36N49j82p46
2592g22J074l89n26P62m29M38p4n11M76j79p0K02l93M19L12q76O04K58n62L39
2612A53k28L9K51m19K26n4r0O77n96p6Q18o53n6L02q0j9j50p5K79l23M6L70m56
2635a14K51k71J20J19m7k60l0PK17J13m74J79J48l5J44m67P0J08n3Nk06M26j76
2658b26K2m8K94m07R8J74l69J49K75k3k14l8J11J21J13j98J64On6k6K10m8J87
$$ plain form
2516 -778 82 384 -1269 -59 155 -523 397 -723 -408 907 -598 -85 204 -171 510 -397 -118 764
2534 764 -206 -104 458 -338 574 -38 -378 672 124 69 227 -250 1039 83 -340 757 581 185 542
2553 542 -397 644 230 -62 468 281 513 618 -503 411 700 -394 314 191 -9 344 -236 3 295
2572 295 -450 222 -152 -269 409 -294 -673 445 -377 -164 -430 -530 434 -391 -574 193 -343 206 24 -722
2592 -722 352 -37 -563 199 -230 208 134 -377 99 -80 -150 52 -341 78 390 -486 118 376 -186 153
2612 153 -75 -36 215 -204 22 -32 -122 555 -41 -117 701 48 -8 294 214 195 45 -30 249 -74 -28 342 -114
2635 -114 137 -134 -14 105 58 -202 -232 -225 -8 105 -369 -190 -42 -77 67 -400 -330 -222 -275 -270 -476 -50 -226
2658 -226 -204 -252 42 -365 -267 -93 -462 -313 -38 -61 -275 -313 -202 -81 32 -166 -2 4 -52 -78 132 84 271
2681B71l13J93J41j81J98N2j59PO5J3l23K59O7j47j4M34j97J7L5J1l08K70j15
2704B76O2j69ONJ00L9l00j07J54L05m81M68l17Ml3m2M2j24Q7J9k67K02J3K09l67
2729b16J1J46p3j29J96n3k80J44M30l42k01J75l14L87K6j83K54r4p3K93m02J33
2751a65o2M82k01m9j80L37k10kR0j36J52J70k54R4j32J92L2r8K87l10j00M94l00
2774A31k61L0J86q3J19q8j42r0K18k18L49j76J5k11J86M1l38O5K84O2k65J49J33
2797I6j71k59K10N8j90J88m3j64M8Q2j6j72K33J60r1m11M87q6j99O4k3j68M99
2820A32k84k25N55l97M37k36J42J74k64J8J42k3K22k98nM33l45l4J68m1p7L4j86
2843D2N83k78j54N1j89J22K34j87j26K94k40O1k13K90O6m60K15J41m27L41l57
$$ plain form
2681 271 -42 151 292 111 309 361 202 209 274 287 -36 223 290 143 129 563 366 383 418 429 121 391 276
2704 276 338 169 175 180 280 319 19 -88 66 371 -110 358 41 45 12 -30 12 -112 -25 -6 -273 -71 -58 151 -216
2729 -216 -205 -59 -132 -261 -65 -118 -398 -254 176 -166 -367 -192 -506 -119 -93 -276 -22 -116 -189 104 -298 -165
2751 -165 -227 255 54 5 -175 162 -48 -50 40 -96 56 226 -28 66 -66 126 158 60 347 37 -63 431 131
2774 131 -130 -100 86 3 122 34 -108 -198 20 -198 151 -25 -10 -221 -35 6 -332 -267 17 79 -186 -37 96
2797 96 -75 -334 -124 -66 -256 -68 -111 -275 -227 -145 -161 -333 -100 60 -31 -442 45 -41 -240 -176 -199 -367 132
2820 132 -152 -377 178 -219 218 -18 124 298 34 52 194 171 393 95 90 523 178 144 312 271 194 228 42
2843 42 625 347 193 244 55 177 411 224 98 392 152 213 0 290 356 -104 111 252 -175 166 -191
2864a91j42M46O0lj74n40O90m99k3O43n14p4L80j83J43l43j04L76k80J31L14r78
2886h65Q97R9o92J66k1L08l7l34L98J49m78K83k01K5N69m65k14O16l26p6L08k33
2908a24K29l32K2M94j88J8l4l19O81m33n30Q82j66k0J96o94P20L5q41N90q4K02
2930C04J39q84R21pq40M29j74L70J95r41L99M41o30L68m62P0Q13q01j25Q60o45
2951b00J62l02R0J153j184%L84n34N48k86n57J318j13q85J30J87K84m5q02J059
2971D07m70k95L66k56L64L10q47M47M04m87N37o63N06K26p39L33K64k29K59o29
2991a92J51P37o73j08L54l29O60q24%J008n83j69M49m52M32l28o42J052m41j97
3011i5J32m40P13o8p66N99j09j45N4k38L94L06q76L37J4P4M11q73K96N31p63J29
$$ plain form
2864 -191 -333 113 173 170 -4 -544 146 -353 -376 267 -247 -321 59 -124 19 -324 -428 -52 -332 -201 113 -865
2886 -865 32 131 -561 -395 -416 -108 -145 -479 -81 68 -410 -127 -328 -303 266 -199 -413 203 -123 -199 109 -124
2908 -124 105 -227 -205 289 101 119 85 -234 447 14 -516 366 200 180 376 -318 402 437 -404 186 102 304
2930 304 443 -441 480 473 -367 62 -112 258 453 -488 -89 352 -278 90 -372 -302 511 -290 -415 445 -200
2951 -200 -38 -340 -250 903 -281 -281 103 -431 117 -169 -726 592 479 -406 -276 -89 195 150 -652 407
2971 407 -63 -358 8 -248 116 426 -421 26 430 -57 480 -183 323 549 -190 143 407 178 437 -192
2991 -192 -41 696 23 -85 269 -60 600 -224 -224 784 201 32 481 29 461 133 -509 543 102 -95
3011 -95 37 -403 310 242 -524 75 -34 -179 -125 -363 31 337 -539 -202 -188 -114 297 -576 -280 251 -512 -383
3033c83K81l3J20n67MR33p55P2J26l14Q37n60n52P12j55J86l5j87N49m99M3N02
3055C25k18l80L15j73J04M53l09p0L5P6L76r06M50N09o75M56k82M5K62j64l0L10
3077E09l83K81k68j52P34o97J18K49m42L51k09l45N60j26k01K58k24NO0m05L08
3098a9N7m34L02l02L63k12m2J26J86q3k6j47J21Q3l76L18jj97K11J27j11K24l54
3121a86J98j20j30K80K2j38K22k3l40M09p6j31r3L01j97j69K55R7m21L99k01r2
3143a34J79K05L0j90j69K68J8p5l8jj74M07k57k46L01j14N4o8L9M4l5K6r8R2j58
3168i4p4p5J06J25k06J73n8r7p8j33K77J56m88Q8J23J35P0k58l2J95l27M06p8
3191a44K5j4o8N2K26l16J12kq8M80q0k1J14j32k90K64m7J63r8N7K86l63k01L50
$$ plain form
3033 -383 -102 -135 -15 -582 -578 355 -400 -328 -202 -516 321 -239 -791 -79 -234 -48 -83 -270 279 -220 -177 325
3055 325 107 -273 42 -131 -27 426 117 47 82 158 534 -372 78 587 -88 368 86 131 393 229 199 509
3077 509 126 407 139 -13 721 24 142 391 -51 300 91 -254 306 180 -21 237 13 18 78 -327 -19
3098 -19 38 -396 -94 -396 -33 -245 -287 -161 25 -58 -84 -231 -110 -27 -403 -85 -86 -283 -72 55 -56 168 -186
3121 -186 12 -108 -238 42 64 -74 148 125 -215 194 118 -13 -106 195 -2 -171 84 181 -240 159 -42 -134
3143 -134 45 250 280 90 -79 189 207 132 94 93 -81 326 69 -177 124 10 64 -4 35 79 44 70 -28 64 -94
3168 -94 -168 -243 -137 -12 -218 -45 -103 -200 -278 -411 -134 22 -466 -378 -255 -120 -50 -308 -340 -145 -472 -66 -144
3191 -144 -119 -133 -201 -149 77 -239 -127 -129 -217 263 183 162 276 144 -146 118 71 234 136 193 479 116 -85 265
3215B65r3k42L00l0m1m6q4K39j34N3J38l03J79J36j71j06J66k68N3J97J06k83
3237C1J00m1k8k4Q9l23L94j06K3j19j18K67j30r2J94l10j77J9L02LJ20j64p1R3
3261f8k03M5n5K44Q1m31L13j12k35M86n1j61J95k55L59k18o5J52k37L17q9j66
3283a54R2L54j85l66N31k86K24k52Q6n2Q9K14m4l59L12j70l21L73j84J35J45j28
3305E4j60J16r5O06p86q7L65j86J14J59k81L31m85L78J36k82Q7j66k0O64o12k01
3327c51M18lk61K66m69N24l94k10O59m31L78l7p35P64j8m67M11J04j42M28o94
3348b60M90j52j70L44n59K95N84p70j6M20j46J32r5J60J75m74K75M10m97K20m6
3369C20k02L57j54l75L67o6J58j50n60P92l85k57N56n39L51N1r64Q39P1k65K70
$$ plain form
3215 265 172 -70 230 200 159 113 29 268 134 187 325 22 201 337 166 60 226 -42 11 208 314 31
3237 31 131 90 62 38 127 -196 198 92 115 -4 -122 145 15 -77 117 -193 -370 -351 -49 -46 74 -90 -161 -68
3261 -68 -271 -226 -281 -37 44 -387 -74 -186 -421 65 14 -147 48 -207 152 -66 -131 21 -216 101 12 -154
3283 -154 -62 292 107 -259 272 -14 210 -42 44 -8 81 295 251 -108 204 34 -287 86 -98 37 182 54
3305 54 -106 10 -85 521 -265 -352 13 -173 -59 100 -181 150 -335 43 179 -103 -16 -182 -202 462 -150 -351
3327 -351 67 64 -197 69 -400 124 -270 -480 179 -252 126 89 -646 118 100 -367 44 148 6 434 -260
3348 -260 230 78 -92 252 -307 -12 572 -198 -214 206 60 192 97 257 432 -42 233 643 146 366 320
3369 320 118 475 321 -54 313 247 405 255 -305 487 102 -155 401 -138 213 264 -700 139 210 -55 215
3390B15o31M09L72q50L38L92n29M66l86J0L29m89oL38l13O56p32k60Q73l15RK7
3412g7m30O65n11l64R82l90P5J32n02L89J15n02O20l46j22L52m99M66J16n43O32
3433B58k56j81O45p30J70N94o04L27j18R4L21o52M5M25o79N36N6k03O82p38q9
3454i7P96q27K16j9K8K83k39l31M33l90M31j39p22O27K72n53M27m67K40M36q24
3475d19K86J50l73O44n54J34L35o70J60M06j90K37j85QK38m89J77K22k53L96k14
3496D6p6M89m74k12K98l38L78k2m56O23j00j88L87p21O53m6m22M62O5o67M97j24
3518E2L84K88q13K15M7k08M57m67r9O01p10K32J51m45M14m10J32L29j55o8n3j52
3540b78K49p3j89K76J1J02p5l14L36j18m37O97m51J50O5m41L19N9k78L74j24J09
$$ plain form
3390 215 -416 -7 365 -485 -147 245 -284 182 -204 -194 135 -354 -360 -22 -335 321 -411 -671 202 -113 -104 -77
3412 -77 -507 158 -353 -717 265 -125 -50 82 -420 -31 84 -418 202 -144 -266 86 -413 53 169 -374 258
3433 258 2 -179 466 -264 -94 500 -104 223 105 199 520 -132 -87 338 -341 195 251 48 730 -8 -97
3454 -97 699 -128 88 69 97 380 141 -190 243 -147 284 145 -577 50 322 -231 196 -271 -31 405 -419
3475 -419 -133 17 -356 288 -266 -132 203 -467 -307 99 -91 146 -39 -31 207 -282 -105 117 -136 260 46
3496 46 -30 459 -15 -227 71 -267 111 89 -367 256 156 -32 355 -366 287 241 -181 281 346 -321 176 52
3518 52 436 724 -89 126 173 -35 422 -45 -144 457 -253 -21 130 -315 99 -311 -179 150 -5 -73 -126 -278
3540 -278 -29 -102 -291 -15 -4 98 23 -291 45 -73 -510 187 -264 -114 -49 -490 -171 -112 -390 -16 -140 -31
3562c1L43o20J37J67m49N99l23J04L13n34J96K01j61PJ65k88N74m95r8M07k95
3583h1J93Q7l87L96q8j00K07k7L8l9k86L96j14j30K47j44L9j50N4J45j41P4N8
3606B47j56P1K8k52J69L44k65l34J91j3R8l13J50l6k07K55l4J04m05L02r6K13
3628F1p4p7N1j47J47J15m16L93k34K96j71J70j84j4j70L30n9O2n7O6l70L3K91
3651D2m5j31L98l32j6k87J25J20P6j78J00L31k11K26r2nj47m9n3J47O3l03K91
3674G0j05J77p5L1j25j06nR3J00l44M25n01L75M5n68L97K48J9k68l09M52k06k62
3697d42o8N51m14k29q1R86n65Q33l46j70k11j01M08l84N35p44J20k48L45j28J01
3718b52J45K25o27K44N60k5p42O68l61K72j14K48j97K94l77J23J2L4R2m6j03R
$$ plain form
3562 -31 312 -308 -171 -4 -453 146 -177 -73 240 -294 -98 103 -58 -51 114 -174 400 -95 -193 214 -81
3583 -81 112 199 -188 208 120 20 227 200 238 199 -87 309 195 65 312 168 207 57 111 256 115 189 247
3606 247 91 162 190 -62 107 451 186 -148 43 30 128 -185 -35 -71 -278 -23 -57 47 -358 -56 -152 61
3628 61 -13 -90 -39 -186 -39 76 -340 53 -181 115 -56 114 -70 -84 -254 76 17 79 22 88 -282 -249 42
3651 42 -3 -134 264 -68 -84 -371 -246 -126 -50 -228 -128 203 -8 218 126 121 -26 -75 -128 19 82 -221 70
3674 70 -35 142 67 98 -27 -133 -138 -45 55 -289 136 -365 10 55 -513 -116 132 151 -117 -426 26 -180 -442
3697 -442 -510 41 -373 -602 -683 303 -262 571 225 55 -156 -257 151 -233 302 -442 -322 -570 -225 -353 -252
3718 -252 -107 118 -509 -265 295 270 -472 196 -165 107 -7 241 44 338 -39 84 96 130 222 176 73 82
3740H2K3R1m6j99J5K79m6k32K18M9j02Q5oL4k13L0J62N8k80K69j72L04k81O2j80
3765Dj69L31l23L06k76pJ65j21j8pj3j28M4K35J23k81l8K7L3J41j58j65J68j32
3789b59J49m2o8L57l10Q4m3L1j69K03Q2Q9j76N4K72j58k52n2K34K60l48N8P1K1
3813H8J8j53J55Jk23N3k2k67P11k30k45K2m1L8J67k18Q1J2R7J8L7J0j60Qj24N76
3839D09n73J88j34k9K51j66K08O7k98J40J40n13L32q0k10L81k35J88l01K37J93
3860A95j66k02J13j0K34r1j11L51m53o4J24q5M69k2m85L28K20l85L29m88M57k62
3882dl1Q3J90k36K1n5K1K92k90K55M8j53N9k38N2K78m02J96j58j1L66l20j2L82
3906C33l01q0L6J7M3M8m36M86j37j72J08m86R05m55k1R7k47J52Kk78L62K4l37
$$ plain form
3740 82 105 196 150 -49 -34 245 199 -33 185 234 132 217 211 245 32 62 224 282 2 271 99 403 122 184 4
3765 4 -165 166 -157 149 -127 -134 31 -90 -108 -115 -128 -256 -212 23 146 -135 -173 -146 -113 28 -130 -295 -127 -259
3789 -259 -110 -152 -220 137 -173 -89 -132 -101 -270 -67 15 104 -72 -18 254 96 -156 -208 26 286 -62 -4 67 88
3813 88 106 -47 108 109 -114 -61 -83 -350 361 131 -114 -92 -133 -95 72 -146 -65 -53 44 62 99 109 -51 -43 -167 409
3839 409 -164 24 -110 -139 112 -54 154 221 -77 63 203 -310 22 -58 -268 113 -122 66 -235 2 195
3860 195 29 -173 -60 -70 164 73 -38 313 -140 -204 -80 -165 304 282 -203 125 345 -40 289 -199 258 -4
3882 -4 -35 48 238 2 23 -32 -11 281 -9 246 294 141 200 -38 14 292 -110 86 -72 -83 283 -37 -49 333
3906 333 32 -48 -12 5 48 96 -340 146 9 -163 -55 -541 364 -91 -112 -15 -262 -110 -108 -386 -24 0 -337
3929c37K74k3P6J46p30M10L59l46r3j11L93k4j90R7K26o20M47L1k30L77j46l53
3951c67K07m8J56j0k5M43k97k76M13l40K72j13k17K59m29K39L22j32J15O5m85
3972b48J87M33p7R2k85k01P44m18p15Q27j138R98n29J73O10j84m55M57l76j57
3992b62M02m19N01l04rJ85n4j05J7k33L37l0J26k5k86jK90l19R7P4k2k05j50M66
4016G1R5k09k02J77K14L4k41J60J77m20L28p8n4K64l96J11K77n00K69j55Q7K97
4038C06M8l06J22j28R9j63L6K29k16P3J18j67J0j38j58K27L02k66j28Q0n5k20
4060b95L03j59K31M9j83j24K86j73l53M61j75J2j06k0K44K5j09k39L49k66J11
4081a31J88k37K5Mk4K24M8k32m4k3P7J67k13K15j92j05K86j48noL05j97O7n8l7
$$ plain form
3929 -337 -63 -86 -10 136 -594 -184 175 -171 -264 -375 18 -6 -196 -99 127 -493 -46 -15 -245 132 -14 -367
3951 -367 -160 -208 -52 -62 -87 356 59 -217 196 -144 128 15 -202 57 -372 -133 189 57 172 237 -248
3972 -248 -61 372 295 387 102 -99 645 227 -488 339 -799 199 -330 -157 453 269 -186 271 -105 -262
3992 -262 140 -279 222 -82 -91 94 40 -65 -48 -281 56 26 152 127 -159 -160 130 -189 -92 -18 -40 -245 -395 71
4016 71 166 -43 -245 -68 146 180 -61 99 276 -144 184 106 52 316 -80 31 308 -192 77 -78 9 306
4038 306 354 48 170 42 141 -22 14 243 27 100 218 51 61 -77 -235 -8 294 28 -100 -20 -75 -295
4060 -295 8 -151 80 129 -54 -178 108 -65 -418 43 -132 -120 -226 -246 -2 23 -86 -325 24 -242 -131
4081 -131 57 -180 -155 -151 -175 49 97 -135 -179 -202 -125 42 -171 44 -148 -253 33 -115 -120 -126 179 -18 49 -9 -46
4106d6J20p6K09j30j13J89N3j28oJ70J34m62M4R7L2r8J29J05r1k06L71j16j65
4129A6jj43rK11r9K48l68K98p0J6r9J12l05J45Nm6J64J4N3j74j33J10l38L00j43
4154b36J73l0k0kj7j04p8J84N58j35k57J94k3p45O91k70M21l39L20m25O95k98
4176B57O3m20M85l9m90O71n89J05k32K68Q3j94j56L88l03K37j6k53R0J34m2J2
4198E9L0Nj2q6j5l2L12o9JQ4k66OQ8q1q6j26j35L13j60r6L64m09M82o8l79L04
4224B8o2o0K02n6k18Q8k29pK46J61k60L55k29j6k06J41J24J76l62L21j94K19n
4247A57m51M59l26K13M9j88L37j7j51n6J59j53J20j13j38L45m8Lk01n2J73j35
4269a4J47p0q9OL99k05P4q65O92M13Q4k04r01O86K82l06M32m34J74M9n64L94l51
$$ plain form
4106 -46 74 -2 207 77 -36 153 206 78 72 242 376 -86 -42 55 87 -11 118 223 132 -74 297 181 16
4129 16 15 -128 -137 74 -25 223 -145 153 83 99 0 112 -193 -48 -43 -89 75 89 142 -32 -165 -55 -393 -93 -236
4154 -236 -63 -93 -113 -115 -132 -236 -314 -130 428 293 36 230 207 -538 153 -117 304 -35 285 -140 555 257
4176 257 320 -100 385 346 -144 527 -62 43 -189 79 162 -32 -188 200 -103 134 118 -135 -45 89 47 59
4198 59 89 94 82 -4 -19 -51 261 192 193 277 11 17 105 24 -62 -188 -323 -10 -170 -266 98 -311 171 103 -276 28
4224 28 -34 -94 108 52 -166 -78 -307 -314 -68 93 -167 188 -41 -57 -263 -122 2 178 -184 137 -57 162 157
4247 157 -294 165 -161 52 101 -87 250 233 82 26 185 32 152 39 -99 246 198 201 0 -52 121 -14
4269 -14 133 63 -26 -20 379 174 248 -617 75 488 572 368 -533 153 435 129 561 127 301 350 -214 180 -171
4292a71K24l17L73j33j92L32j5l4j5m21M48n07P2J05K1J53k33L60J30n66K91J84
4314H9k72l45K22Q8q3K79J72m02L72l05j18j86R90q77J247n23p2n73j86P69L0
4335C16j002O17K67J7k75M64q45M27K62l92K81j42r6K61Km01N35l16M09m98j86
4356b95O69l87K3L88l26L2j5l10M46l60j1J07j18L22j52m14L29n5P0J90l25J38
4378e4K54o89N40L6j08r2L5l9J45j51j15L60j07J34pl63M12j97o1K05k41L71j95
4401G3o5J59L5O4j51j3M6k97Q3M29k87p0K37k89p8L93j61K47l09J0M8q9K02J60
4425C77o76N26l03K68J00m70K71j03j42K74l55J83J32l08K34M24m03j93J7j46
4445b93L39q9k2R0k41J8L4m00O33j9n03L19j4K87n8n22M51L3l46K21J36N5j72
$$ plain form
4292 -171 53 -264 109 -24 -216 116 101 67 52 -369 79 -428 -356 -251 -230 -77 -310 50 180 -386 -95 89
4314 89 -183 -528 -306 -218 -301 -22 150 -252 120 -185 -303 -489 501 -376 871 348 276 -297 -483 286 316
4335 316 -686 -69 198 215 -60 404 -441 -14 248 -144 137 -5 -101 160 162 -239 296 -20 389 -109 -295
4356 -295 374 -13 10 398 72 104 89 -221 225 -135 -146 -39 -157 165 13 -401 -72 -127 -57 133 -192 -54
4378 -54 200 -489 51 87 -21 -113 -78 -117 28 -123 -238 122 15 149 142 -221 191 -6 -67 138 -103 268 73
4401 73 8 167 202 266 115 102 148 -149 -66 363 76 6 243 -46 -124 269 108 355 46 56 104 15 217 377
4425 377 -299 227 -76 192 292 -178 93 -10 -152 122 -233 -50 82 -226 8 432 29 -164 -147 -293
4445 -293 46 -43 -65 25 -216 -198 -164 -564 69 50 -453 -134 -148 139 81 -441 10 43 -303 -82 54 109 -63
4468f3j56J41K36m93K05J3P9J4k29N7M40l44J69J95m35M50l20q0L73l12R5K46
4490B81m45N02j69j01Q8k25J53K82m39K43k22o7K52j54K73l12j38M68k04k03K89
4511A52l79K32L59p18M48Q7j99L39m76L93l4k95N0J19k24M17k46k28L70k69p6
4532a78J93j55K45o8l79M53k17J41k34J0M26j58k04L08k76Q3L21l14K72l23r0
4553a44L30m2l42O01l73J40Q9k15k84K75j20N8l0K81r2j27p7o6Q60l71j4p47J389
4576I79m43K65q31k30J07J46n40K79N94n0p4o53O43q1m64M30l69j2N18k33l8k07
4598b64j0J60J00J1k30PL61j79P4k51R6K43j87J01p6L8r5P9O0k48J77j21r5K82
4622C3l35J85j39J55m2K95k57J11j93J09J62o4n0J03L3k64M04rNk73J15Oj13J26
$$ plain form
4468 -63 -219 -78 158 -335 -130 -117 -38 -24 -253 -196 244 -100 69 264 -171 279 -41 -121 252 -60 35 281
4490 281 -164 338 169 68 156 -69 84 366 -73 170 -52 -119 133 -21 252 -60 -198 270 66 -137 152
4511 152 -227 5 364 -354 94 181 -18 321 -155 238 204 -91 -41 78 -146 271 25 -203 167 -102 -178
4532 -178 15 -140 105 37 -342 111 -106 35 -199 -189 237 79 -125 183 -93 -10 311 -3 269 -54 -144
4553 -144 186 144 -198 403 30 170 259 44 -240 35 -85 -27 -57 224 132 5 -72 -138 722 351 337 -410 979
4576 979 536 801 -30 -260 -153 -7 -547 -268 326 276 202 -451 192 111 -353 77 -292 -304 214 -19 -57 -264
4598 -264 -274 -114 -14 -3 -233 -226 135 -44 30 -221 -125 118 -69 32 -44 -6 -101 -22 38 -210 -33 -154 -249 33
4622 33 -302 -117 -256 -101 -143 152 -105 6 -187 -78 84 20 -30 73 106 -158 246 237 242 -31 84 90 -23 103
4646A03j64K58L2K3J05m16p1L15j29L0o0%k35M88j27l8P4j89J26k31r2L68j42
4669B8j7J27j70j21J21j03R2m9J88N6m0o6r2j20o2o2L40j28r8J40m9k3q9L18k7
4694I4J10k65j63K03M0m4p1Q6K29P3l32K52j59L27m71K43q0O62j16l57K7k94L47
4717C41k59Q3n06M36j86mP2J20n8j54J31po6N8n9K20k53o0L58l02K41k58r4M7
4741a59l5J85mL1O4l88K17l2j15L81k52q3K96p4J6J47k26j26k2Q5K10k79J19K58
4765B14k16K8J31j52K11j40k68K65k31K36o2nJ90k26j5K60k61Q3n3j6J89M1r1
4788A12O0nj24o8R8J02O1l57L71j90j10J87l16J31M03k82l9J77k33J03J40k79
4810e8J14K7K25l79oL11j90L1J01l13J10L0l10M73k87j16P1J06RK00k79K7J18
$$ plain form
4646 103 -61 197 229 252 357 -59 -130 185 56 86 26 26 -209 279 152 114 188 -1 125 -106 -198 170 28
4669 28 11 138 -32 -153 -32 -135 -43 -92 96 152 112 46 -46 -166 -228 -290 50 -78 -176 -36 -85 -108 -197 121 94
4694 94 204 -61 -224 -21 19 -25 -96 -10 219 292 -40 212 53 380 -91 152 72 734 618 261 288 -6 341
4717 341 82 165 -341 95 -91 -95 -23 97 39 -115 16 9 -57 1 -58 162 -91 -151 207 -95 146 -112 -206 -159
4741 -159 -194 -9 -13 18 82 -306 -89 -121 -236 145 -107 -190 106 32 48 195 -31 -157 -179 -94 116 -163 -44 214
4765 214 -2 26 157 5 216 76 -192 73 -158 78 16 11 201 -25 -40 220 -41 42 -11 -27 162 203 112
4788 112 172 167 43 -25 73 175 236 -121 250 60 -50 137 -179 -48 355 73 34 211 -22 81 221 -58
4810 -58 56 83 308 -71 -77 234 44 75 176 -137 -27 3 -307 166 -121 -237 -166 -60 -51 149 -130 -103 15
4833A5rj31M1l1L96m29L04k64k05K79q5J63j15o3J93n5l8j1p9o6M16m17MK29n9
4858a7q2J26k95M30n9n6q7m6m2j26R9L46j31k25J01J67j04J73k04QL7Lj40N1L
4883g0O4j53J22mJ66l60L75j14K43l92J67j18j72L32j15k12L50k20PJ62k16N77
4905D19n34r4J13K50k98K48j57k43M77k92m8J60k44K08Np6K44k01J97j94M02j56
4927A86l11J24K40j83j02j60J59M28k91r3N6K84l28J07q4M25l20L2K05l94K28
4948B08J83n56L78k48K90k06J39j43J01j91K06j2k54J45R9m9j70j8J61J09j08
4969F4k68k72P33m77k9J58J97k19L1R0j89J33p4R5k0k69J04K51p2K88n02m2K59
4992c0k08K95j97J36J84k96M0K03k77J97n0k3l5RJ0J67P5j49r0L3J66J03l92J93
$$ plain form
4833 15 6 -125 -84 -115 281 -148 156 -108 -313 -34 -119 44 -71 -134 59 4 -34 -45 -124 -190 226 -191 -187 42 -17
4858 -17 -99 27 -268 162 103 47 -40 -86 -128 -254 -155 191 60 -165 -64 103 -1 172 -32 -24 13 16 -124 -73 -70
4883 -70 -6 -159 -37 -41 125 -235 140 26 269 -123 44 -74 -246 86 -29 -241 109 -111 -104 58 -158 419
4905 419 -115 -209 -96 154 -144 104 -53 -296 181 -111 -159 1 -243 -35 -30 -106 138 -63 134 -60 342 186
4927 186 -125 -1 239 56 -46 -206 -47 381 90 -3 53 337 9 116 32 457 137 169 374 -20 208
4948 208 391 -165 213 -35 255 49 188 45 146 -45 161 149 -105 40 139 90 -80 -98 63 172 64
4969 64 -204 -476 257 -220 -249 -91 106 -113 -82 8 -181 -48 -122 -27 -47 -316 -212 39 -33 255 -247 -289 -30
4992 -30 -238 57 -140 -4 180 -116 -76 127 -150 47 -3 -26 -61 -52 -42 125 200 51 -39 -6 160 263 -129 64
5016F4J69mk1j37n9L0J21j65r7K00m3k9P8j92J0oKJ69l6l5k32K89k28K53l34K14
5042a9K7J53N2j50j54j9Q5R0k73Q8k9L9m9K45J78l29J56j77M8J63k78J17L7o8
5066f7L19j81N7k46N6P0j37Q8N2k1Q7j55K11pj6K5k23M0J18j4j66K59l24L35j70
5091a0r1J46J00l9J21m53J50K84j43O1l86qK15j00J62p2p9P8J4Q7J26l86K26k6
5115b3l5J31k26J08K03k53j00L58q4j56M3J60q0k86J99l7r5K39k57k37M78j74
5137a24K62j62J81k34l75M49n3J56n7J54k53L0p5J30r2K52M8l36L71j98Q2k45
5159h9K87p5J81k71j31L01J25j74k21J34J16l13J7L23j17m7o3k4QM24k76j91J91
5182A15j66M1Oj48N3Q0O5k0K7j67j26L26j68o5J8K08j16P1J59j50k11K92k84l42
$$ plain form
5016 64 233 229 208 71 12 42 163 -2 -99 101 58 29 107 -85 -75 -81 -79 90 54 19 -213 76 -152 101 -233 -19
5042 -19 8 161 213 63 -91 -110 -25 65 -208 -120 -149 -110 -159 86 264 -65 91 -86 -38 125 -153 -36 1 -67
5066 -67 252 71 128 -118 -62 8 -129 -41 11 -10 77 -78 133 126 110 135 -88 -48 70 56 -110 149 -175 160 -10
5091 -10 -101 45 145 106 227 -226 -76 208 65 126 -260 -268 -53 -153 9 -63 -142 -64 -50 37 163 -223 3 -23
5115 -23 -58 73 -153 -45 158 -95 -195 163 79 -77 -34 126 46 -240 -41 -78 -173 66 -191 -428 50 -124
5137 -124 138 -24 157 -77 -452 -3 -56 100 43 197 -56 -26 -101 29 -63 189 237 -99 272 74 156 -89
5159 -89 198 123 304 33 -98 203 328 154 -67 67 183 -130 -113 210 93 46 -17 -41 -33 391 115 -76 115
5182 115 -51 -10 -4 -152 -99 -19 46 26 53 -114 -240 86 -82 -147 -129 79 -37 34 193 43 -168 124 -160 -502
5206e02M88Ok03K73k18K17k68o7K22J67oj45p3j95L71j74J25J87J90p13K84M1
5228Gm11N31J20n6j09r1J02l04N08m36N1L0j17j25O29o22K46K41M11l39n78n4
5250c66m6N24o32J06P88p05J022n55N50j347O79P0n42L30K62k57k09K75K16l38
5270a75m8L7l32K76J99J31l07M2Q8Q2Q9l58L54l2j12J66K4k39P8J77QR6k36j67
5294a59Q6K0n6J11l9N62m59j59O0RL70n86M86m41N82l35j98M85n1q4k47K70j57
5317G0J40k07k68M10O9k92L27j63p7L8j17L22j97j25qJJ01l31J32K00R2m71M80
5340A26m5m37M38j51j10L10l51K65M4q1K89m89o1J60J85K6j57k18Q2J13P8r2j93
5363b69N35j01m23L26l8j04j11j6M53m04M9K79j87j8Q0j23J45L31o42K90o7j49
$$ plain form
5206 -502 -14 -8 -211 62 -156 61 -207 -274 -52 115 109 -36 -109 -304 67 -107 18 205 395 -318 -34 7
5228 7 -404 127 247 191 82 -9 93 -211 297 -139 -88 -58 -175 -300 329 -293 -47 194 605 266 -312 -366
5250 -366 -412 112 -520 -414 374 -331 691 136 686 -661 18 88 -454 -124 138 -119 -328 -53 163 -175
5270 -175 -223 -186 -518 -242 -43 88 -219 -177 -89 -7 82 -276 78 46 -66 100 124 -115 -37 140 148 244 8 -159
5294 -159 -73 -53 -109 2 -37 525 66 -93 -33 -24 346 -240 246 -195 387 52 -146 339 288 204 -43 227 70
5317 70 210 3 -265 145 214 -78 249 86 9 47 -70 252 55 -70 -78 -77 24 -307 -175 25 117 -354 126
5340 126 81 -356 82 -69 -179 131 -220 45 89 8 297 -192 -253 -93 92 118 -39 -257 -175 -62 16 -76 -269
5363 -269 266 165 -258 68 30 -74 -185 -201 252 -152 -103 176 -11 -29 51 -72 73 404 -238 52 -15 -164
5385a64P7J20N9k58k60L10J1J61%o3m0R4K23m10Q1Q0J46j34kR0m3P3l29J18L04
5410B44l28j91O4L49k54R4j15K30k65j2L43o4j54Qj56J50N2j74J42J93j51Nj22
5433a12J15M79m27j28n8N1K70l02R8j0J13o4j16J47o3Q7k66L65k87J42J50l48
5455a64J99R5r8r1n7n2L65j80J26J5k07K81j79r7K69m00Q8J23j5n0R0M0M6l71
5479b24q9M23m8r9J3o9j48K38k92J62K76j50j89r6K63K3j82q8J02o0J83O0L68
5502C77J05p51K39n56O58m50K04Q48m81p26N47L06n01N68r17N54P8J33k61j40
5522a66L27k18O18m19L41o79M5q4M3k96J85K76K9k25M09m7l96PL42j06k24J28
5544a10J25l05Q34n70j22J30k76N07j98N6J20k03Q7j1j77J00j57J34K66r5k18
$$ plain form
5385 -164 -87 33 92 -166 -426 -116 -105 56 56 -7 -47 47 270 -140 -59 21 167 33 31 121 78 151 -178 -60 244
5410 244 -84 -275 -211 138 -116 -22 -137 93 -172 -184 159 95 -59 -51 -207 -57 -5 -179 -37 156 5 10 -112
5433 -112 3 482 55 -73 -131 -80 190 -112 -14 -24 89 25 -91 56 -7 80 -186 179 -108 34 184 -164
5455 -164 35 130 32 -59 -116 -168 197 17 143 158 -49 232 53 -44 225 -175 -87 36 21 -29 61 101 147 -224
5479 -224 -313 110 62 -37 -24 -93 -241 -3 -295 -133 143 -7 -196 -292 -29 -6 -188 -276 -174 -234 -51 9 377
5502 377 482 -269 -30 -586 72 -378 -174 674 193 -533 14 320 -181 387 -530 24 102 235 -26 -166
5522 -166 161 -57 561 142 483 -196 -151 -235 -192 -488 -303 -27 2 -223 186 139 -257 -250 92 -14 -238 -110
5544 -110 15 -290 544 -26 -148 -18 -294 213 15 71 191 -12 75 64 -113 -13 -170 -36 230 135 -83
5565h3K89k40M31n74J4K30l59K10J50k04j15p0O7L79J21j36m61M17k30M13k70
5586b1K22q8K27j78j35L20l31j89n5M54q6j9j50L84m98N9K60Q4k26m8J77k50o6
5609a53K75k09M10j7j80j18J51J1j68Q7m0j15L2J45R7l91q5K49k4n3J36k5J3K7
5633E5kp0KJ63n88M74P2k41j70J22J39R5J20j18O9k36l6R9j90k13M81j31J22j97
5657a79M2J47J21k43N1j85L27j69j46J54oL23n8k07J60k52L22j65q2m0K67j59
5679B3k34M16k75O5J07L3P1j78J90J03k14K67k55Q2J54m25k30L81j8j25K26j19
5701D5O3N7j08k27N0m1K78m49P78m06L46m28l0N1j08J10k13J56L75n25N97m94
5723a23j21O5J52M80p89P73r43M97J69m6k5k11j74l11O05j29k25J18L43O2m57
$$ plain form
5565 -83 206 -34 397 -177 -163 67 -292 -82 68 -136 -251 -321 -254 125 246 110 -351 66 -164 249 -21
5586 -21 201 113 340 162 27 347 16 -173 -228 226 140 121 -29 355 -143 -84 176 260 34 -14 163 -87 -153
5609 -153 122 -87 323 306 126 8 159 170 2 89 49 -66 -34 111 208 -183 -268 -19 -43 -96 40 15 28 55
5633 55 53 -17 -15 148 -440 34 106 -135 -305 -183 -44 51 171 53 122 -114 -150 -51 -241 -454 27 -104 18 -179
5657 -179 -137 10 131 -112 -61 -246 81 -88 -234 -80 -86 237 179 -28 132 -120 202 37 -45 -85 182 23
5679 23 -211 205 -70 -5 102 135 206 28 218 321 107 374 119 201 355 -70 -300 81 63 -62 164 45
5701 45 108 165 57 -170 -120 -161 117 -332 446 40 386 -42 -72 -21 -129 -19 -232 -76 299 -226 371 -123
5723 -123 -244 -179 -27 453 -336 437 -506 -9 160 114 89 -122 -296 -607 -2 -131 -356 -238 105 167 -290
5744b90P11m40l31K84k02K67N62p68K52J68qo2K51n43K74q1k7K09k47l7L75l30
5766a3K68j23l46L46j66K34k07k27L63q9l6lo4j04K74k02K39k72R7J98l47J33
5788d7L56k89J77m2j05k22j1K15r3O1m6L8p5J67j20j15K21k68K20K4l51K33K20
5811A48J39j75n7J42l40O6J80k09l1J50J03q7j02j35L09jj53P0m0M78m76J7J55
5834A51k75oK61l5j1J68m23R8L08Lj27j17M2L9k01J5L44j10P4m03K80Q9k93j03
5858b32L08M2q3k79mK62r4K65r8j46L9j69K35J11m6k18r6J70K14Q8n60J90k9J74
5882D4Lp2j51J83j54R6RJ53K4l00j2K77k01j01Q0MR2j02k4J72N2Q1r6j1k2L3L4
5909I1j68J7j03J11j05J98k4k53J89J76k13L2Q9J91j89k79J97R2j15P7j03MJ18
$$ plain form
5744 -290 421 -19 -350 -66 -268 -1 561 -207 45 213 205 143 394 -149 125 44 17 226 -21 -58 317 -13
5766 -13 255 132 -214 132 -34 200 -7 -234 129 40 4 1 -63 -167 107 -95 144 -128 -31 167 -180 -47
5788 -47 309 20 197 155 50 -172 -183 32 -61 0 -46 -8 -83 84 -36 -151 70 -198 22 46 -305 -72 148
5811 148 287 112 55 197 -143 -77 103 -106 -137 13 116 29 -73 -208 101 100 -53 17 -23 455 -21 -4 151
5834 151 -124 -130 131 96 85 253 -170 -72 236 239 112 -5 37 76 -125 -110 234 124 198 -205 75 164 -129 -232
5858 -232 76 118 35 -244 -248 14 -80 185 87 -59 -20 -189 46 157 111 -107 -203 -33 181 269 -291 -101 -130 44
5882 44 47 -25 -176 7 -147 -51 -42 111 135 -165 -177 100 -101 -202 -122 -118 -26 -128 -152 20 72 153 57 46 24 57 91
5909 91 -77 -60 -163 -52 -157 41 17 -236 -47 129 -84 -52 37 228 39 -240 -43 49 -66 11 -92 -88 30
5932C0j44K61j6k06J33j44M4N1l06K65Q5l60M68k74o3j57J1L27m1J78k79j09k76
5955e22P43n46K37K00n37L94O93j083K80N01J8n80N94p61R27p31R5J17j60o6M00
5976B13k25L11j30J8j58k22Q45m26Kn25K1L06q0j64M86m61k07P11q2p59M32k38
5998c32q7k93O78K87m35L29k86P7k06M60Ok76J89J34j60n0J99j72k56j6N1J85
6020B6J31l56K72r7Q1N4j55k49L70j88P0rQ9j11j28K13K41m51J50K64k00j4j19
6043a16O1R7MJ0j96J04l40L38J76l71K94j38K44k4j45o3M3K86l56O7L6O5j61J80
6067I5k95L57l01J47j00K1j3J11j03J9J07L6J32j54q7K05rl5j43o5K5N0N3Rj93
6092a31J53oK10m89L05Q6n6m1j70Q8p7J35o9R5K24k43n6O2k1q2L35j49k88lJ87
$$ plain form
5932 30 -114 147 131 -75 58 -86 -42 9 -297 -32 53 -307 161 -113 -176 -333 -322 5 -36 142 -137 -246 -522
5955 -522 221 -325 -88 112 -425 -31 662 -421 -141 360 378 -202 392 -369 558 -173 -78 39 -121 -187 213
5976 213 -12 299 169 187 29 -193 652 226 228 -297 -276 30 -50 -214 272 -189 -396 315 233 -526 -94 -332
5998 -332 -419 -712 -34 253 -182 147 -139 -62 -268 192 198 -78 111 245 85 35 234 62 -194 -210 -159 26
6020 26 157 -199 73 -24 57 111 -44 -293 77 -111 -41 -50 39 -72 -200 13 254 -197 -47 217 17 3 -116
6043 -116 -55 42 46 56 -140 -36 -376 -38 138 -233 61 -77 167 143 -2 -65 -22 264 -92 -25 11 76 -85 95
6067 95 -200 157 -144 3 -97 -76 -89 22 -81 -62 45 81 213 59 -28 177 168 133 -10 -75 -50 0 53 62 -131
6092 -131 22 16 226 -263 42 128 72 31 -139 -51 -128 7 -62 33 257 14 -42 20 -1 -83 252 103 -185 -188 -1
6117ap8J32k09M6M25q0L9j70Q0k93J4J91j68L19k08o4M0Mk2l2J66j23K3J2Q0m4
6143G9j33K37k40J16k42L23n6j52j12J58K41j89N9J01l26J36k46P6K39k49jK70
6165H9j2n7j05k5K92j88O3k98P4L33l99K13p5j3J48j92J37j35MP7K96n24J09J96
6189HJ26j19J3j32J94l47L60k77J08N4k7rJ09O6K05j61j37j59K9K72k88J76j49
6212h5J67K08m71J27P2M3J7mm5p7J01O1j64pp6P3j2kJ89l43L52P0j85K51l02M4
6238BJ47j75O4KJ03m1Q4l54J19J43Om5j13N8J41j49k02L65j41k4J7k76K84k76
6262b61M62r3L1k09M1p6K84o1k70lJ12R6J8j61K45r6J66k84O6j0J27r6p6L57k00
6287A09O7l79K63lj39q2J99j84J88j2j11M11l68l2o4J03J84k78J51k0J3QJ55k26
$$ plain form
6117 -1 -79 53 -156 -110 315 235 274 104 184 -109 -95 96 -72 247 39 -25 15 19 -3 -35 131 8 31 43 123 79
6143 79 -54 183 -57 59 -183 140 84 -68 -180 -22 219 30 89 190 -136 0 -246 -170 69 -180 -181 89
6165 89 77 20 -85 -110 182 -6 57 -241 -167 166 -233 -20 -95 -108 40 -152 -15 -150 -146 -69 227 -297 -188 8
6189 8 134 15 28 -104 90 -257 103 -174 -66 -12 -39 -48 61 127 332 171 34 -125 -96 176 -112 64 -85
6212 -85 82 290 -181 -54 18 61 78 74 29 -48 53 114 -50 -57 -133 -60 -72 -74 115 -228 124 194 9 260 -42 2
6238 2 149 -26 38 40 143 102 186 -168 -49 94 100 55 -58 0 141 -8 -210 155 14 -10 7 -269 15 -261
6262 -261 201 108 139 -70 -29 -105 179 118 -152 -155 -43 53 71 -90 155 59 225 -59 7 -3 124 28 -48 309 109
6287 109 176 -203 60 57 -82 -164 35 -149 39 27 -84 327 -41 -73 -137 -34 150 -128 23 3 16 24 179 -47
6311d7O8k78K13o9k0J28N4Mrj65o8M4J17O5j17k15K77J4n1j71N13l82k55L75p6
6336e1K13k79K33k92K4K36j29k06J39J76j75m7J03J31p2J8j88L05j00n0K09J6
6358B14j58j15p5m8K93k5Oq7K01j89pk1O0Q7mM7j76n1o4N96m56n6P2j12K01j78
6384d5m1J37n1M9k5j31N40m69k08L60j42L20p1l59J42j36P5L8J2K64j84j1RQ2
6408A55m1l52J37K80J41m98R4O12m48n9m05K71K16l21rk2R6K24m35N55R76j173
6430fm96M41n7J1J87k35L72k52m8R1P1J38l47K07n8k7L0O1j16J57l9j83J07K10
6454B19k18Q8k27o5K41j87o3O7L48j71n4J42j24P5r8R1k44L71l09K30j82r0L40
6477A80j12j28K12M5k63L41r8l39J91j49K45n0j16R9j2K13l11K9L2o0O0O9k75
$$ plain form
6311 -47 21 -257 -44 -113 -133 -5 49 53 44 -121 -189 -145 -28 37 -80 -295 -18 -4 -55 -226 287 -95 -350 25 -51
6336 -51 162 -117 116 -176 -152 84 -45 -251 -112 64 -111 -158 -55 76 4 22 -166 139 39 -11 198 214
6358 214 56 -59 -134 -182 111 86 92 5 206 17 10 -11 49 136 132 179 3 -48 -112 484 28 -28 44 -68 133 -45
6384 -45 -86 51 0 49 24 -107 433 -36 -244 116 -26 294 223 -136 6 -130 -55 -17 -5 259 75 64 73 155
6408 155 114 -238 -101 179 320 -178 -84 528 80 21 -384 -113 103 -218 -227 -249 -153 71 -364 191 1167 -6
6430 -6 -502 -61 -118 -107 80 -155 217 -35 -83 8 79 217 -130 77 19 -8 22 83 -33 124 85 -98 9 219
6454 219 1 89 -138 -203 38 -149 -212 -145 203 32 -22 120 -4 71 -27 64 -180 191 -118 112 -70 -160 180
6477 180 68 -60 152 197 -66 275 177 -162 29 -120 125 75 -41 58 46 259 -52 -23 9 -51 9 78 -197
6500a97R7Q7j24J12J82j29j7q7J65j13L0L4p7n7K06l5J17l6j31o5K64l66J50R7
6524A07q8Q1j76M4K02k79J79j02Q9L9k9j55J82P0l08L17l21J01q1j05R5O0l0J35
6548B7K04Q5k72m53L06N8Ok7j42K93j01J13k10M3j17P2j18j2K07kJ59m19K45N9
6572Dj65J80P3L1L1j29J74j60Qk9k4R6o0j8R0k8r9J42j63J69l00O0J35n0J43K05
6598C16k98J68l99L19j4k90M13l71J59l9n9J97R4k62J74r8n1K9KR0k08K89r5l9
6622B7k62J1K85O8k03N3J08k18J51oN8k30J47J09j15k8K41n5j13p6k5M5j07p9
6646b14M17p4p7pK81l60J05j07m5J98k11R4m4K16k12J42o2j37J96J3j58m7Q6P3
6670F6j8J66o9k89J42l1K26k36o7O1L17r7j08l71L70n4j01N2l1O5m6O7J23j06
$$ plain form
6500 -197 -100 -13 -137 -25 157 28 11 -76 89 -24 6 40 -37 -94 112 77 194 158 27 -38 226 -140 10 107
6524 107 19 100 -76 -32 170 -109 70 -32 57 96 67 -88 94 164 -144 173 -148 -47 -128 -233 -138 -78 -108 27
6548 27 231 316 44 -409 -103 -45 -39 -66 -208 85 -16 97 -113 -70 -187 -115 -233 -245 -38 -40 119 -300 -55 4
6572 4 -161 19 92 123 154 25 199 39 47 18 -6 90 30 12 102 74 -25 117 -46 123 -177 -117 18 -32 111 316
6598 316 18 186 -213 106 92 -198 215 -156 3 -36 -95 102 196 -66 108 10 -41 -12 -10 80 -128 161 66 27
6622 27 -235 -224 61 129 -74 -21 87 -131 20 14 72 -158 -11 98 -17 -45 196 141 28 -48 -73 -28 -135 -214
6646 -214 203 129 52 45 326 -34 71 -36 -81 117 -94 0 -44 172 -40 102 40 -97 99 112 -46 -93 -7 66
6670 66 48 214 145 -144 -2 -33 193 -43 -110 -49 268 171 63 -308 62 8 -93 -41 -72 -7 -53 14 137 31
6694C1k80K16o2j16R6J7p4J05O9nk7n5L6N2o2l5J44N4O1l51N7K46l8j48R7k01
6720a73k7J42K68j80j30J14J3J69q8n7K24k37r0M0k97M93l40J43j41K48k09K22
6742A07k30J42J43k73r0K54j81K49j39NM2N1l28L07K80l24J4j24K04k8J42k42
6764a9k31J72J73lP7j7n6J25k75P5K57n94M04k31R9L10l75K48k70J38j5j64J6
6787a56J24K36l19K09j11j03Pl6J28l9j24K30j9J4j98K47Q5j42J43r6J89j80l1
6810E8j84L43j37qj35K3R0m7O2L7R6k46J21M6k7j48J24k34K42k3Q4l40Q8M13m22
6835a24J03k43J74J21r5j23K10R8j31K08k76J02r4l7J5R7kq2q7r3N02m23J06K81
6859B07m20J18J34r5j2k14L08o0r0J92m6J7r6jj7P5R5J75j96m1O6J5o6l4j14L25
$$ plain form
6694 31 -249 -33 -95 -211 -115 -98 -172 -67 2 -3 -30 -85 -49 3 -59 -94 50 104 165 -186 -129 117 79 -69 28 -173
6720 -173 -200 -58 210 30 -100 14 27 196 108 51 275 38 -52 -12 -309 184 -156 -13 -154 94 -115 107
6742 107 -123 19 162 -111 -201 53 -128 121 -18 -13 29 80 -248 59 339 15 29 -95 109 81 223 -19
6764 -19 -250 -78 95 92 169 152 96 221 -54 21 278 -316 88 -143 -44 266 -109 139 -131 7 -8 -172 -156
6787 -156 -32 204 -115 94 -17 -120 -113 -149 -21 -60 -184 46 27 41 -157 90 175 33 176 80 269 89 58
6810 58 -126 217 80 72 -63 -40 50 3 65 102 198 -48 73 119 92 -56 68 -166 76 53 137 -203 -115 298 -124
6835 -124 -21 -264 -90 31 -64 -187 23 121 -10 198 -78 24 -70 -107 -92 5 3 -79 -166 -259 243 -180 -74 207
6859 207 -213 -95 39 -56 -68 -282 26 -34 -124 68 22 39 -57 -58 -75 0 95 270 74 33 99 114 48 14 -100 225
6885B25j10j33J79j32J66l1q6k4m3R8n0j65j16K94J54j71k02L4J26j16%K06j35
6908c2O8K30m15J68K0k5j04Q4q9j36N78k48o1q0p3J54j68K56k98J27J0qK56l36
6932a22j8L11j75n8Ll7K15j54k36J44J0Q4J82n5o7m8m4L92k02m8m9K5p2o8L4J24
6958G1j90J7N2L18k39Q9K9k29K20j39R3k36l4J94j33J39NN4j01K00k20j15K59
6981A04m11L73j26N8nj07j2K86j02k44K56j48R0m1J79k87J37P4j08l5k8o1k19
7004c77K62J59j23J0L7Q9m8Qj73J39R3Pk17P2L07k59J6j59J17k70N60k01Lo6o9
7029h3P9m3J14J7j60K85k97J40L10l49L7K8k52L17o3j21m2L7K7K31k01M3o5J06
7053I5q2k2N0J48m00K95j1j10J87l06K98J5k95L43k66j73L22j53Q9o2o2m5J08
$$ plain form
6885 225 115 -18 161 29 195 164 78 54 11 109 59 -106 -222 72 226 55 -147 -113 13 -103 -103 103 -32
6908 -32 36 266 -149 19 39 14 -90 -6 -95 -231 347 99 38 -42 -115 39 -129 127 -171 -44 -34 -42 214 -122
6932 -122 -140 171 -4 -62 -59 -96 119 -35 -271 -127 -117 -33 149 94 27 -21 -65 327 125 77 28 53 -19 -87 -53 71
6958 71 -119 -102 -50 268 29 118 147 -82 138 -1 92 -144 -178 16 -117 22 27 81 -20 180 -40 -155 104
6981 104 -307 66 -60 -2 -7 -114 -126 160 58 -186 70 -78 12 -29 150 -137 0 74 -34 -69 -97 -158 -377
7004 -377 -115 44 -79 -69 -32 57 9 17 -156 -17 76 83 -134 -62 245 -14 2 -157 -40 -310 250 49 52 -14 -83
7029 -83 -4 -47 67 84 -76 209 -88 52 362 13 50 78 -174 143 80 -41 -83 -46 -19 212 11 54 -11 95
7053 95 13 -9 41 189 -211 84 73 -37 150 -156 142 157 -138 205 -61 -234 88 -65 24 -38 -100 -145 -37
7076c7j29K25o3J5j24J95M6p7j14J30j30K50m24J81ko7J52j2k35N9J76j15K43
7099A43j32K14k5j39j76J35n0N3j92j6j55K09J87q0j9J80j70j24L22k80M6J40
7121G1k09K75k04K48j34k25L32j02J2P6q8j03R9K9l7r6J43j86L3K15j02j23Q7
7144A1N5N1l5k13J52rP7MO3m14K66M4Lk6j48j69K21J55j02K13k64MJ1K2k0n5R4
7171iK29l07J62j25L4Q8j63P4J36j9q9j7J21j15j17K94k03j13K62Oj47k45L29
7194F6p3L8lm5K48k38k64L51j37K13k45J43l1n0k05J23j2j35K90J3k71J58l1R6
7218aj07J07j03O2J61m14K84j2k19J81k63K61K6m0K9J1k49M36k97L7M4M7J6m09
7242d12K87J43Q4j84Q1k05K33p3K1M0P4j79O6k01rL50j04j58J76J42j27j2j54
$$ plain form
7076 -37 -166 59 -4 11 -113 82 128 51 -63 67 -63 187 -237 -56 -58 -125 27 15 -220 -161 15 -100 143
7099 143 11 225 200 61 -115 20 -30 23 -169 -185 -340 -131 56 -24 -43 137 -33 -157 165 -115 -69 71
7121 71 -138 137 -67 181 47 -178 154 52 64 140 52 -51 48 77 40 -56 87 -99 -66 149 47 -76 11
7144 11 66 117 82 -131 21 12 89 93 156 -258 8 52 55 29 -119 -288 -67 88 -14 199 -65 -61 -50 -28 -48 -103 -9
7171 -9 220 -87 75 -50 -16 72 -91 -17 119 100 11 -6 115 0 -117 177 -26 -139 123 129 -18 -263 66
7194 66 -7 31 28 -17 231 -7 -271 80 -57 156 -89 54 23 -27 -232 -109 -121 -256 34 47 -224 -66 -97 -1
7218 -1 -108 -1 -104 -42 119 -295 -11 -23 -242 -61 -324 -63 -37 -77 -48 -37 -286 150 -147 -110 -66 -19 -3 -412
7242 -412 -125 18 102 -82 -1 -206 27 -46 -25 15 89 -90 -24 -225 -234 116 12 -146 30 172 45 33 -121
7265a21N7J8j46R2O1j4M6J24r8j83K3J44J6k56K91j58m9J29J67r9K8q4J16k83
7289a79K28j37M4k8j4k1J05j19L6K23r4J48k20j60J04M7Q8J89l04j25K34K3K91
7312C59n13K15M6k13N8Q0K9L1k3j86J38nJ60l86P7L06k22J47ro9l5O5r2j13J54
7337ar6O9Op9j30L4K41j13%J1Q7k72L64m17M07r9j0J51o4J3j29QJ56q5J56m05
7363a97Q1k18L92o1n6p6M2P9Q6p3j75P1J44j01L7m14L45K03j88J23m7k23J18J68
7387F0k04k6j6p0L76l69J99K5rj86J78J44r4m2N8K0M7m0K2j00rL4PP8J91k73k49
7414b48J95j40L54j99J9J07qq1J22mj23Q4j53K00q2k75K31j5L5L0m5L8q3q0Q4
7439c7j35R2J42r8k8J26N8j49r1Lm2J40J3p2R9j86qJ96j90J90pJ31k97J64j01
$$ plain form
7265 -121 -64 -46 -192 -100 -39 -53 -7 117 19 -164 -141 3 19 -237 54 -104 -153 -24 143 44 72 -12 104 -179
7289 -179 49 -88 -44 -72 -86 -107 -2 -121 -85 138 44 192 -28 -188 -84 -37 51 240 -64 -189 45 68 359
7312 359 -154 61 107 -106 -48 32 61 92 69 -117 21 16 176 -210 -133 173 -49 98 89 20 -15 50 -42 -155 -1
7337 -1 -97 -28 -22 -101 -231 -197 44 -69 -69 -58 29 -243 121 -296 111 12 2 153 89 102 -27 -19 137 52 208 -197
7363 -197 -116 -334 58 -3 -59 -135 -93 -14 72 -1 -176 -105 39 -62 -25 -439 -94 109 -79 44 -3 -226 -108 60
7387 60 -144 -170 -186 -256 120 -249 -50 -25 -34 -220 -42 102 8 -34 24 44 91 51 73 -27 -36 -2 5 83 274 1 -248
7414 -248 -53 -193 161 -38 -19 88 80 -1 121 117 -6 78 -75 125 43 -232 -1 -16 19 49 4 42 -41 -121 -37
7439 -37 -172 -80 62 -36 -64 62 120 -29 -120 -117 -159 -19 -6 -78 21 -165 -173 23 -167 23 16 147 -150 14 -87
7464h7J60j35l5J89J38j19m0J0m6n9O2j32J97ML2k97J44kJ15O8r1l8Q0k4L4J0
7490A38m5k48J73j86R4P9j27j65J49J16R8J16m10J66R7k6j69k00M51j69O4p0Q1
7513GM1J14j65J19O4j35j28j10L09m03L69l47K77k77R9M7K40k20J13J09j82P3
7535A4k1j65J60O5J1J22k38J63j24J2j58J94O8j99q7K30Q1Kj0nn7j11N0j05J26
7560A8J10J81k07J58j47n1O4j10J34j75L2K16j34j86N3l05O7J96L83j85l68L0
7582b26P9K26Q3K43l55J16l07J41r8J81l9q6J7P3Q6o2K1p9r3J54k27K04J1l00
7606b37L53r4r7P0j50J74J03k25J22r7N7l4R0m5j73k7K24o9J55j27J63j25R6j11
7630dJ20j24M9m2nK62k74O6j55N8J71k1k72J83M7m3R4q3n9K42j12n1l42J13K26
$$ plain form
7464 -87 73 -62 -97 92 230 111 71 81 35 -24 38 -94 103 107 139 -158 -14 -16 99 167 76 38 118 94 128 138
7490 138 93 -155 18 -168 -74 5 -122 -287 -138 -22 76 192 -218 -52 45 19 -150 -350 101 -68 -4 -74 7
7513 7 48 162 -3 116 180 45 -83 -193 116 -287 82 -265 12 -265 -166 -119 121 -99 14 123 -59 14
7535 14 -7 -172 -12 53 64 186 -52 111 -13 -1 -159 35 103 -96 -183 47 128 130 120 115 58 -53 -3 -108 18
7560 18 128 309 102 260 113 62 126 16 150 -25 7 223 89 -97 -44 -349 -282 -86 297 112 -256 -226
7582 -226 -147 79 162 405 50 166 -141 0 -98 83 44 -42 -25 48 134 72 93 14 -79 75 -152 52 63 -237
7606 -237 116 22 -75 -5 -155 19 122 -103 19 -78 -21 -55 35 -10 -183 -210 14 -55 100 -27 136 11 107 -4
7630 -4 116 -8 41 -1 -6 256 -18 48 -107 -49 122 101 -171 12 59 16 110 27 -32 210 98 47 -295 -182 44
7655D4p0j36K42j35k4L7n7J17r0R5o8J09Q9l46J92J39m47K31pk56M38Rk57J19
7679c2J33j25NkN3J62J4l37J98P1r9j39O8J78k20K72k79K2K21l9k02Q2n4j09L2
7704a26J96k53M00j15k05L60k74J20J96j45j67j12J74m0l0J05rk6M9J03j50k6
7726B5L6j89J84j06k1L12m23J23n7j27J52m6J31q9J70r0J02o7O7j24m0k7R6K1
7750A3O7j7j3j02J04L9k17K37l71L87l21L42k4j16jJ42j00k7k4l9R8p0J48k51
7774a16J47p8o5L3k06L86k66L2J17j3K38j89%l0M8r7O4j63L66l14K22O0j01Q5
7798A60l0j60M6J88k40K43l44K54p4l5K02l30K16j29j29J96j82l2K56j68k7R2
7820b7J06j66J90J76k33Q7j06j22J13j01J37j16J26k14J84j11m5JN3K4l0l8L7
$$ plain form
7655 44 -26 -162 80 -55 -79 -42 -99 18 -72 23 -45 64 153 -193 -1 138 -309 -78 -85 -341 97 106 -151 -32
7679 -32 101 -24 -19 -21 32 194 208 -129 69 140 41 -98 -30 148 -72 200 -79 -57 164 125 -77 5 -49 -158 -126
7704 -126 70 -183 217 102 -103 257 -17 103 299 154 -13 -125 49 9 -21 84 75 49 98 201 51 25
7726 25 61 -128 56 -50 -71 241 -182 -59 -116 -243 -91 -137 -6 -95 75 -15 87 20 87 -37 -77 -104 -8 13
7750 13 80 63 50 -52 52 91 -126 111 -260 127 -194 148 124 8 7 149 49 22 -2 -41 57 -13 135 -116
7774 -116 31 -47 -112 -79 -285 101 -165 -133 -16 -29 209 20 20 -10 38 -59 5 -158 208 -106 116 176 75 160
7798 160 130 -30 16 204 -36 207 -137 117 43 8 210 -120 96 -33 -162 34 -148 -180 76 -92 -119 -27
7820 -27 79 -87 103 279 46 133 27 -95 18 -83 54 -62 64 -150 34 -77 -122 -121 -68 -44 -74 -112 -75
7843g5k2m4J09J37k89M80m12RJ21jJ64k36l8O4q0k5O0J05J56j98J51k66J20O7
7867E7J9J50k79J8lL37q7j41k52J42O2J29l07L63k04M25j05n63M47m81R23k19
7889D31o44P36p6Lm94J126n21j074J003J73j02K02q43L52j76o62J18J94L91j15
7909B2n4P3J98j8j57K9Qj74l2n0N5J90j12j03K57j30N7n9K4n2k20K4L79k44j75
7934b64K75R7j46j95L40j05P8l0N9k55J04k5K27l06J4P7K29j99R4r8J02j50R5
7957A8J6K28q0k63j58J87L47m78J33j28j04J89n1L47k82J63k30P3k55L22K36k19
7979A1k2k02K93j23j62K19M58n31j76M24r6JNoJ32n6q02J060j73p55M01k94N56
8002A62l26O00o44l80J253q72N4J34q0m29O96j95n5L10j32o2O9k06k15M31k56
$$ plain form
7843 -75 -97 -141 -32 105 -184 296 -116 -107 14 13 177 -59 -97 -33 -113 -138 -78 27 183 -15 136 -130 -10 57
7867 57 76 226 -53 -35 -38 299 212 71 -181 -39 23 152 -155 208 4 429 324 -239 208 -273 650 431
7889 431 -213 523 447 450 -44 1082 561 -513 490 663 561 763 -80 272 96 -566 -448 -254 137 22
7909 22 -32 41 239 221 64 93 101 -73 -105 -155 -100 90 -22 -125 132 2 59 0 24 -28 -248 -224 155 -89 -264
7934 -264 11 108 -38 -233 107 2 80 50 109 -146 -42 -67 160 -146 -132 -55 174 -25 69 -29 73 -77 18
7957 18 34 262 182 -81 -239 -52 295 -183 -50 -178 -282 -93 -144 203 -79 84 -146 -73 -328 -6 230 11
7979 11 -11 -213 80 -43 -205 14 472 -59 -235 189 93 94 99 93 225 169 -633 427 254 -501 -100 -394 162
8002 162 -164 436 -208 -588 665 -207 -153 -19 -99 -528 168 -27 -82 228 96 34 103 -103 -318 113 -143
8023a43K91j34p99L81L65M89p30j21Q75O02o76q00J28K5J50L10l31k7K89P0l13
8044i9J51n7j44K55k45M50l94J38L0k50L79l79J31j13K10l9J76l18J53p3j05J36
8066gj40L0j66L85j12P4j20J84k13K15N2j86K17j79mM3jl6L65l36j36K7M0p1L24
8091B49j25j9lo0J96l00J71N0m41N60l44J49j56K0JJ4L0j51P0L08l77n4N88m47
8115g1j80L13j91R42q98J13KJ05l4l05J33L9k7j10J03J82Q1l37J21J60j97j61
8137b17K83J88n95J11M30k1j83p5L8J65j69J9K01o7N9k31M5J91N1j24R3l66K13
8160C9j48K12o6j83J72N5R2j43j60J78q8R5n1J38q3J29k45L4K81j76j40J37l33
8183b54K30M7K6P9j98L25l15J63
$$ plain form
8023 -143 148 14 -785 -404 -39 450 -280 -401 474 1076 400 -400 -272 -247 -97 213 -118 -145 144 214 -99
8044 -99 52 -5 -149 106 -139 311 -83 55 85 -165 214 -165 -34 -147 63 24 200 -118 35 -38 -143 -7
8066 -7 -147 -117 -283 102 -10 64 -56 128 -85 130 182 -4 213 34 30 73 72 36 401 65 -71 -44 -4 -75 249
8091 249 124 105 102 42 238 -62 109 159 -282 278 -66 83 -73 -53 -52 -38 -8 -159 -89 219 -158 -212 376 -71
8115 -71 -251 62 -129 813 -85 28 30 135 101 -204 -71 -32 -59 -169 -66 116 197 -140 -19 141 -56 -217
8137 -217 66 254 -341 -230 200 179 -4 -79 -41 124 -45 -26 175 108 167 -64 -19 172 223 99 192 -174 39
8160 39 -109 103 37 -146 26 81 173 30 -130 48 -40 55 4 142 59 188 -57 -23 258 82 -58 79 -254
8183 -254 -24 23 49 128 -70 255 -60 103
8191A03
$$ Imaginary data points
##PAGE= N=2
##DATA TABLE= (X++(I..I)), XYDATA
0@%%%%%%%%%%%%%Qj6J6j6J6k4L2l4M2n4O2p2Q8j04J20j36J54j78K06k36K68l02
35a60L40l82M30m84N42o05O71p44Q27r16J013j120J237j365J504j656J824k009
53a053K214k441K695k982L309l683M115m624N233n975O903q104R728j2068J5776
68I043k2873O2532j43594Q0191R4647j38113J17633n8970k0648O7667o9611L0486
80H390J1844n4456O6442m0779p306M3516m7297J4256J6338l6167L0884j3393j3764
93b1492L6820j7969j1476P918k6375M6030Q677o4632L5039J6398k3491K5264l2298
106b1587J1306K4795m1921L7927j1636l3981N9171l2513p040L3504m7105K3364
118e716J1874j4900K4166m0233J7663L1010m3705K2879n395j5668M8309k9712
$$ plain form
0 0 0 0 0 0 0 0 0 0 0 0 0 0 0 8 -8 8 -8 8 -16 16 -18 24 -30 32 -40 48 -56 64 -72 82 -96 110 -126 142 -160
35 -160 180 -202 228 -256 286 -319 352 -392 435 -481 532 -588 649 -716 788 -868 956 -1053
53 -1053 1161 -1280 1415 -1567 1742 -1941 2174 -2450 2783 -3192 3711 -4393 5335 -6733 9043
68 9043 -13830 48702 -94892 -14701 79946 -58167 59466 496 -20152 47515 -22096 8390
80 8390 20234 -34222 32220 -8559 -15865 27651 -19646 -5390 10948 -25219 5665 -7728 -21492
93 -21492 15328 -2641 -14117 -6199 -32574 13456 22133 -42499 -7460 8938 -14553 10711 -21587
106 -21587 -10281 14514 -27407 10520 -1116 -35097 24074 -8439 -15479 18025 -29080 -5716
118 -5716 6158 -8742 15424 -24809 -7146 23864 -19841 3038 -2357 -18025 30284 572
130E72k0123L2241q145j222n001l784J9457q834l985J0697j5600k518J2621n893
144D83N916M454j9859M181J1504m897k647j3834J5734J6062k7328M823K268o517
158i657K3634k1500o559J9858j2133J6275j3595j6073L3834k3170R43K6544l3922
171a5521J3444Q755k1158K3959j0541q143J6316j4348J1225k511j7807K8152k641
184I181k2219J1006L39K966P761j0060l96J791j697J0868o256r451J3501l910
198C424j203J2872j7944j397J6998j2432L791N102q997Q303m230k875R08p655
212e335J7671p06j8953J1121r2l888N397o847J488J841Q26M220j0415k61O955
227C022n352L142L298o924k511P243K020p717r24J908J398L210l417k794k225
$$ plain form
130 572 -19551 12690 4545 3323 -1678 -5462 13995 5161 1176 11873 -3727 -6245 6376 483
144 483 6399 10853 -9006 -4825 6679 1782 -865 -14699 1035 17097 -10231 -5408 -3140 -9657
158 -9657 13977 -7523 -14082 5776 -6357 9918 -3677 -19750 14084 -9086 -8143 18401 -15521
171 -15521 -2077 6678 -14480 9479 -1062 -9205 7111 -7237 3988 1477 -16330 11822 9181
184 9181 -13038 -2032 -1693 1273 9034 -1026 -1422 369 -1328 9540 3284 -6167 7334 3424
198 3424 2221 15093 -2851 -4248 12750 318 4109 9211 214 8517 4287 1412 2320 -5335
212 -5335 12336 11630 -7323 3798 3706 -182 5215 -1632 -144 1697 2523 6743 -3672 -3933 3022
227 3022 -2330 812 4110 -2814 -5325 1918 3938 -3779 -4703 -2795 -1397 1813 -1604 -4398 -6623
242f623N473N212j4607L037J3271j1948j70O613p328K790L654N61o788l895J3377
257B629k287m406N132q705K399Q469n039jK7O29K309j855K638l220l142Q785j78
274D184o216K081M302j796k817J570j884K671M695k648l804k403M164K961l571
289A489K908l968j616J0200o701n042N084n72L220m629l29M562p176O733J168
304E331j2449Q559L528n495K329k821J90m81K166M133r607N59Q179n756O86K292
320A343n484J626N095l378l620K777J622J163j823l672L488j332J292M689r018
335e232K489P232n955R97j487N75N109n051M549l317n906J3196n442n896Q478
350D339o292L529M559p308J997k279J495N529o164J255J890m471L997M09m328
$$ plain form
242 -6623 -1150 4062 -10545 -7508 5763 -6185 -6355 258 -7070 -4280 -626 -65 -6853 -10748 2629
257 2629 342 -4064 1068 -7637 -5238 3231 -1808 -1809 -1782 -1153 1156 -699 1939 -1281 -4423 4362 4184
274 4184 -2032 49 4351 2555 -262 1308 -576 2095 6790 4142 338 -2065 2099 5060 1489
289 1489 4397 429 -1187 9013 2312 -2730 2354 1782 5002 373 44 4606 -2570 4163 5331
304 5331 -7118 1441 4969 -526 1803 -1018 -828 -1309 857 4990 -4617 -4058 4121 -1635 -949 1343
320 1343 -4141 -2515 2580 -798 -4418 -1641 -19 1144 -679 -4351 -863 -2195 -903 3786 -5232
335 -5232 -2743 4489 -1466 -469 -1956 -1381 3728 -1323 3226 -91 -5997 7199 1757 -4139 4339
350 4339 -1953 1576 6135 -1173 824 -1455 40 5569 -595 660 2550 -1921 2076 2485 -1843
365a843J678K911r72k619J6R97J468m22j838j699O13N184j749n614M038k853K51
382b453O200o463o95N60K90N255q539J248O436r730O450J531q618P309o69j648
398c536J755o739P671J500o045N926m933n75Q933o317k012M891k740J819J751
413A349j647M49k884K859N300p310J80O511n387L579O64q725Q295K310m798K935
429C680n890O596L728j2104Q959o66n669J0907r120k28Q087r659N920J215o046
444b90N433o632N095N480j3241N526K411m896P491o860l717Q389l932J27j122
459g38m025Q774l001o982P529k567j536N789p624J964M985o864M683J734m575
474b454J882m587P107M316j3959O269M401n542O003o895q4Q340p081K670k227
$$ plain form
365 -1843 -165 2746 1774 -845 -829 168 1636 1214 -624 -2323 -1710 3474 1725 -3889 149 -2704 -2453
382 -2453 3747 -2716 -3411 -2851 -2561 2694 -5845 -4597 1839 -7891 -1441 90 -8528 -1219 -1888 -3536
398 -3536 -1781 -8520 -849 651 -5394 532 -4401 -4976 3957 -2360 -4372 519 -2221 -402 1349
413 1349 -298 151 -2733 126 5426 -1884 -1704 4807 -580 2999 3663 -5062 3233 5543 745 3680
429 3680 -2210 4386 8114 -3990 4969 4303 -1366 9541 421 193 8280 -1379 4541 5756 -290
444 -290 5143 -1489 3606 9086 -4155 1371 3782 -1114 6377 -483 -4200 4189 257 384 -738
459 -738 -4763 4011 1010 -5972 1557 -1010 -2546 3243 -4381 -2417 2568 -4296 387 2121 -2454
474 -2454 -572 -5159 1948 6264 -7695 -1426 2975 -2567 3436 -3459 -3543 4797 -2284 386 -1841
489a841j346J0891j0944j753J0225q449L688J284m459O896p151N05P728o515L260
504B019k680l978J2707n697q138P359m17J954k147o906Q727J152o504L403l838
519b984K434N959j0708L207N915p766L093j94j533N812q947K586Q009r102L936
534b83k315k964J3745j1042n411J1733n113L360k702p433J3262m887m621O648
548A977o946N930J381j0401J0309q37n934M939k480L247n65o985Q230J285o227
563c077L436k661K345O545q312k690P413P8n72m306O88P645n720k289N509l559
579D73K595m20m552O954k204l648L972j853K966l674m310J0358k873n458L102
594A428k144M950l78o812L733M42J487l31o184O221Q49n139K518j026R75N17l911
$$ plain form
489 -1841 -3187 7704 -3240 -4993 5232 -3217 471 1755 -2704 4192 -2959 -2454 5274 -1241 2019
504 2019 -661 -4639 8068 2371 -5767 1592 1175 3129 982 -5924 2803 3955 -2549 854 -2984
519 -2984 -550 5409 -5299 -2092 3823 -3943 -850 -1044 -2577 3235 -5712 -3126 4883 -4219 -283
534 -283 -2598 -5562 8183 -2859 -8270 3463 -1650 1710 -992 -8425 4837 -50 -4671 1977
548 1977 -4969 961 2342 -8059 2250 1413 -4521 418 -2062 1185 620 -6365 1865 3150 -3077
563 -3077 359 -2302 43 6588 -1724 -4414 2999 3077 2505 -1801 -1113 6532 812 -1477 4032 473
579 473 3068 2648 -1904 5050 2846 -802 3170 1317 4283 609 -3701 6657 3784 -1674 1428
594 1428 -716 4234 3856 -2956 777 1219 2706 2375 -3809 2412 3261 -1878 640 -386 589 1106 -2805
611b805K963Q55l147J061n56K611J39o610K991N144l801k379N83J450J998j750
627a253k445J746N74J870j856l655O131n07m692M647j037j055J392k031L654j189
643B94l152L913j771J898J096o808N355L356n216K13M24K254N14l939K018J73
659F22p12L107k844j031K385n60q31J011Q02k159o43K747m34j897J95P67Q87q14
677E98n84q73J023K108k665j930J532K121j204j681N63M21QR07j257m89P37l11
695i76O45k30L46j040n79L225k033j720K771m10P1J14j621J449O1Q26K4l621L591
714H93J654l809K481o60j076K090m72M1j129M83K359k079o52J921j998J105J965
731C117k469q60J193J405r59o64L24J39m35J193q02k146J895J571l009L07J094
$$ plain form
611 -2805 158 1013 -2134 -1073 -1629 982 1121 -5489 -2498 2646 -1155 -3534 -2951 -1501 497 -1253
627 -1253 -3698 -1952 -1378 492 -1364 -5019 1112 605 -4087 560 -477 -1532 -140 -2171 1483 294
643 294 -2858 1055 -716 1182 2278 -4530 825 4181 -1035 -822 -398 1856 2370 -1569 449 622
659 622 -90 3017 173 -858 1527 967 136 1147 1949 -210 -853 1894 1460 -437 -242 525 1412 598
677 598 14 -859 164 2272 -393 -2323 -791 1330 126 -1555 -992 -571 -563 344 -913 -1402 -665 -976
695 -976 -331 -561 -215 -1255 -1834 1391 -642 -2362 409 -1 70 184 -1437 12 73 899 923 -2698 893
714 893 2547 -1262 1219 559 -517 1573 1101 1142 13 496 2855 776 124 2045 47 1152 3117
731 3117 648 -212 981 2386 1427 763 1087 1226 791 1984 1182 -964 931 2502 -507 -200 894
748H94j156J325q70r5r03n55K658o17k410R45m03k3P82q49p05L05J068j19k333
767c061J884M4j697K424j069j834K242J25m63l83j72J039j57M88n16j712K429
784c89J127j679k46O76n70R21L96p50n24J047P75p92l32R01j03k70O13m19j578
803a196K707N04j859l39Q93P40k65k47N54j741Q63K530l097L05J385j088N10r
821A150k60n16j27K049j639j810K545n42r58Q91l29j599J510R48j265o33M92P39
839F46n45o68L98m61j3J882j734r61K013r19N13K59j499R44l91O21L39k290J902
858C6Q70k078K084j609m75K297r87j18m54l17K553k212J12J226j984J976R68k854
876i66J207J047o62K32m66M84n0p93K297j142k269K539j55j449J566j542m56J966
$$ plain form
748 894 -262 1063 193 98 -805 -1360 1298 681 -1729 -784 -1187 -1210 -428 -1277 -1982 -1677 -609 -728 -3061
767 -3061 -1177 -1133 -2830 -406 -1475 -3309 -1067 -942 -1405 -1788 -1960 -921 -1078 -590 -1106 -2818 -389
784 -389 738 -941 -1187 -511 -1081 -160 236 -514 -1038 9 784 -8 -340 561 458 188 801 382 -1196
803 -1196 1511 2015 156 -183 710 1450 1185 938 1492 -249 614 3144 47 352 1737 649 1159 1150
821 1150 890 374 247 2296 657 -1153 1392 850 -108 783 454 -1145 365 1313 48 -585 -93 646
839 646 101 -567 -169 -630 -643 1239 -495 -1456 557 -362 151 410 -1089 -145 -536 85 424 -1866 36
858 36 906 -1172 912 -697 -1172 1125 138 20 -434 -751 1802 -410 -298 928 -1056 920 1888 -966
876 -966 241 1288 626 858 392 876 826 33 2330 1188 -1081 1458 1303 -146 1420 -122 -578 1388
894A388q32k01j210M32L123l723n96L147l111J555J001l485K361n59o01J662k472
911b121K178p17k649M941k384k877L884j378L00J05k788K987k16j104J217k678
927c300K561J816m454J989J107j558J757j198j52K143k494J549O43j872K382j711
943g92l11M378l605j187L667j658J369j279j749M226j817q47J411k742M123o28
959B559m890M765n87j773K160k538K362o51k648M232k329o44K603m577L340K447
975C831n912J943J164J37P63m934L058L198m804J761l45j662M392l467j662M108
991A569k487N54k95j659M186l379j855N614l732L01J377l280M759n33m620L482
1007Bn86J398J79n525N813J136n278L703j584j20L461n335K091L051l592K219
$$ plain form
894 1388 556 355 -855 -423 2700 -1023 -1619 1528 -1583 -28 973 -2512 -151 -710 -1311 351 -2121
911 -2121 57 -660 -3309 1632 -752 -3629 255 -1123 -823 -718 -3506 -519 -735 -1839 -622 -3300
927 -3300 -739 1077 -3377 -1388 -281 -1839 -82 -1280 -1432 711 -1783 -234 409 -1463 919 -792
943 -792 -1103 3275 -330 -1517 2150 492 1861 582 -1167 3059 1242 395 1806 -936 3187 2559
959 2559 -2331 2434 1847 74 2234 -304 2058 1407 -1241 2991 662 18 2621 -1956 1384 3831
975 3831 -2081 -138 1026 1163 1926 -3008 50 3248 -1556 205 -140 -1802 2590 -877 -2539 1569
991 1569 -918 -364 -659 -2318 1868 -1511 -3366 2248 -1484 -1183 194 -3086 1673 1140 -3480 2
1007 2 -584 814 993 -4532 1281 2417 -2861 842 -742 -862 2599 -2736 -645 2406 -1186 1033
1023A033j559L47L509n593J631L004l465J568r70l86M828m731o35K883j140J811
1039B135k317k730O601k313l323K593j656K120k16l850M435j125j577K104k750
1054a869K999K13n644N052R37l788J604j538K156J602m947K671L43j014K871m719
1070c071R20M829m714N73J465j326K776l334M43L691m034J489J067k804M205k695
1086e20k194N030j948o56L79j706M769j986l769M497j420J64J683l981L114J487
1102B943m150K704n14m38K073l475K351J332m202L021M8j704L017l929N21L804
1118C402l291L10k06q22L900l947r48L681k958J580M47l222L050p38j579J657
1134C16j703J785l05k314L388j708j981L088j650NJ209k472J829O62j437N63j237
$$ plain form
1023 1033 -526 -179 3330 -2263 -632 2372 -1093 475 -495 -881 3947 -784 -1419 1464 324 2135
1039 2135 -182 -2912 3689 1376 -1947 646 -1010 1110 894 -2956 1479 354 -1223 881 -1869
1054 -1869 1130 1343 -4301 751 1688 -2100 -496 -2034 122 1724 -3223 -552 -209 -1223 1648 -3071
1070 -3071 -2151 2678 -2036 -1463 2 -1324 1452 -1882 -1439 2252 -1782 -293 774 -2030 2175 -520
1086 -520 -2714 2316 368 -288 91 -1615 3154 1168 -2601 1896 476 640 2323 -1658 1456 2943
1102 2943 -1207 1497 983 545 2618 -857 1494 2826 -1376 1645 1693 -11 3006 -923 -402 3402
1118 3402 111 421 215 -607 3293 -654 -1602 2079 -879 701 1148 -2074 976 238 -1341 316
1134 316 -1387 398 93 -2221 1167 -541 -2522 566 -1084 -1079 130 -2342 -513 149 -1288 -725 -1962
1151a962J642J455l883J445J958k216J609n87q08J707j454O53L40j785K303p34
1167c17j075K704k048m65K298j579J211p43q16K456j652j64J226k354K658L12
1183A652l042K445n03q02J491j582P21N96j541K254j619n75J710j612N08Q74j800
1200h25J156M81j148Q12j220N52J282j726O49J41j524K062l92j934J948o11n34
1217h31J068j238Q22k77l03J512j831J35J839j766P70O62j657J019K89k73J95
1234A35j074J092P23j809J511j10q43J474n84n47O38l88Q49n62k39J037p64L21
1252H60P85j383L28Q06o81j25n5j43N91Rl34L02r66Q66N9p99M12m84j56P65n27
1273A30k06J96p6M63p77k26P33j300J076J07j452J034K9p42Q27q16o4L48k89Q08
$$ plain form
1151 -1962 -320 1135 -2748 -1303 655 -1561 48 -539 -1347 360 -1094 -441 -101 -1886 417 -317
1167 -317 -1392 1312 -736 -1201 1097 -482 729 -14 -830 1626 -26 -190 1036 -1318 1340 1652
1183 1652 -1390 1055 552 -250 1241 -341 380 976 -565 1689 70 -505 1205 -407 101 975 -825
1200 -825 331 812 -336 476 -744 -192 1090 -636 13 154 -1370 692 300 -1634 314 -297 -831
1217 -831 237 -1001 -179 -456 -759 753 -1078 -943 896 -870 -100 562 -1095 -76 213 -60 135
1234 135 -939 153 876 -933 578 468 -375 1099 515 -32 606 218 1067 505 266 1303 539 860
1252 860 1645 262 590 1396 715 590 535 392 983 992 658 960 -6 860 919 120 532 48 -108 657 130
1273 130 -76 120 44 507 -270 -496 237 -1063 13 120 -1332 -298 -269 -1011 -184 -1000 -1064 -716 -1005 -197
1293a97j266p0J413o88n22R84q97J44P00m07o2K0N70K04r55M07M58q09P91L67
1313A85j265Q77O18p42L21m36R30l32l02J400j131m70J695j029l07P05p81Q56
1331G92k32r0L54q34O80N78j588P64L38n24N64n76n4O05n96N52m78l56Q58p10
1351D7J97N88j220N90L45n14J36k63l32Q71m85k33n7l38J282o72j011J264m82
1370b87l45P56r23N12K63l04N70q99K75R25j469J227N87j920J412q3l23K56p73
1389e43P83N68j404J308r44o6J649j332o88J431m30L0k01k32J295j564M94J052
1407A206j450N74M92j432J747m36j151P43N4M85o00j536K163k57j150J053j120
1424f15R54N86k178P08P88q69Q03j307Q04Q69k433J302P82j602J648j496j07K137
$$ plain form
1293 -197 -1463 -1533 -120 -808 -1330 -346 -1243 -1099 -399 -806 -868 -848 -278 -74 -1029 -622 -164 -973 -182 185
1313 185 -1080 -203 415 -327 -6 -442 488 156 -146 1254 123 -347 1348 319 12 717 -64 792
1331 792 560 470 824 -10 670 1248 -340 424 762 238 802 226 172 777 181 733 255 -101 757 47
1351 47 244 832 -388 202 547 33 169 -94 -426 445 -40 -273 -330 -668 614 -58 -1069 195 -287
1370 -287 -632 124 -799 -287 -24 -328 242 -657 -382 543 -926 301 888 -1032 380 297 -26 230 -543
1389 -543 240 808 -596 712 -232 -298 1351 19 -669 762 332 362 161 -71 1224 -340 154 1206
1407 1206 -244 330 822 -610 1137 701 -450 293 347 832 232 -1304 859 602 -548 505 -615
1424 -615 339 925 -1253 -545 243 -626 177 -1130 -326 543 -1890 -588 194 -1408 240 -1256 -1363 774
1442G74k155M3R53o10J300j658l54L020k371Q4N99j222K271o35j794K201o68J75
1460d7j20j579K833o42k299K695m24q40J305j790J618R68k524J253L08m6J342
1477B011l222J219K630k841N39K62m82J977k089m37K341j756P92m67j206L189
1493B460k377j120K521q93k72N0j048K639j696j410J948r85J014l00k554K921
1509H98M39k627J252o69R84L94k655J811P65j701J252j182N11J682l058Q99J866
1526H61j563M97j132N78K164k891L2J812j245J613j237j557L574j168j459J320
1542A99r35J779j045j520L159j594p15J629j881J572N40k924K395M21j200N16
1558C96j602K185O63l245J838N12r16J503k398N72K267k077J45J69l50J615k037
$$ plain form
1442 774 -1381 -1338 -385 -995 305 -1353 -1707 1313 -1058 -974 -375 -1597 674 39 -1755 446 -222 -47
1460 -47 -167 -1746 1087 445 -1854 841 417 -423 882 -908 710 1678 -846 407 715 669 2011
1477 2011 -1211 8 2638 -203 336 598 116 2093 4 -433 1908 152 944 477 -729 2460
1493 2460 83 -1037 1484 591 319 369 -679 1960 264 -1146 802 -183 831 531 -2023 898
1509 898 1337 -1290 -38 -707 277 671 -1984 -173 592 -1109 143 -1039 -528 1154 -1904 -1005 861
1526 861 -702 -205 -1337 -759 1405 -1486 -1454 358 -887 726 -511 -2068 1506 338 -1121 199
1542 199 -736 1043 -2 -1522 1637 43 -672 957 -924 648 1188 -1736 659 1080 -120 396
1558 396 -1206 979 1642 -1603 235 747 -169 1334 -1064 -492 1775 -302 -157 12 -338 1277 -760
1575g60k08K495k275k6J150q68J078r96j139K473j173k51J70j083J932k97k322
1592b100K064p1o94R57j619J292O41j636J207m08k34J093j876J366J060k037Q68
1609a27L69m37R76j190L04J192j061K80k95k27J679j384n17J645q24J11j30QP65
1628A137o28j79P96p78N16K65j414J536j21j441J232j75l91o7m32J067j69q09
1646e5P24q77K03J051j183m00J053l68R1o40K16P55j696P79K49j450J065J021
1664E38o08K98r18j87O94k3k49m27R6P03j50n26K32k11L18K12m59K6L21J19j7
1685b18m26K47K95l89K91K45n57N99O7l72K74j55jj2M96j23m39K16M31l91jL37
1707D14m95K53Q0J32n48O56J40o47K91L06k41j69M20k22m05K1N88m98j65L18k82
$$ plain form
1575 -760 -968 1527 -748 -774 376 -492 586 -410 -1549 924 -249 -500 -330 -1413 519 222 -2100
1592 -2100 -36 -107 -801 156 -1463 -171 470 -1166 41 -367 -601 492 -1384 -18 1042 -995 -127
1609 -127 242 -195 781 -409 -105 1087 26 306 11 -216 1463 79 -438 1207 383 494 364 372 1137
1628 1137 509 330 1126 348 864 1129 -285 1251 1130 -311 921 746 355 288 -144 923 754 -55
1646 -55 669 -208 -5 1046 -137 -537 516 148 239 -401 -185 570 -1126 -347 -98 -1548 -483 538
1664 538 -70 228 -690 -877 -183 -206 -455 -882 -786 -83 -233 -759 -527 -738 -420 -208 -667 -641 -320 -201 -218
1685 -218 -644 -397 -102 -491 -200 45 -512 87 154 -218 56 -99 -100 -112 384 261 -178 38 469 78 77 414
1707 414 -81 172 252 384 -164 492 632 -15 276 582 341 172 592 370 -35 -14 574 76 -89 229 -53
1728e3P0N01n74j70o5M09Qp50P86j47n30O60k54n06N19J70j94k41J72L65k86k22
1750c32M01n66K15N83o27n0O47M0p3j45j37p5J22L31p7m27O57k49l2L58j85k70
1772A09L10l5K20j71k55M06j50K68N2n61L48L56o79K2L02n5RL6k24l02R4N52o12
1795D0l21O12k17k93L88l97l37O29J06m24j83L81J7o90J86J65k10L9K18l28k8
1816f47Q4L8l85K17M49k53k34M36k06l47N82q4M5j6p2o7R0L72l10j99L00J59j70
1839b18J6J46O7m5K67j54p3J79J10k10K13j59J03m2K32K2l31O5K66p7J32k59j05
1862A45P25m26m53M70Q3k5k12m12P05l61l16N95l67J75J99o23M07j33m00P8M9
1883i7M40p2j302J067L56q75M38l50O7M46n56J97N6j52P86r41k61J404r26n11
$$ plain form
1728 -53 17 518 -56 -226 -291 118 126 -624 162 15 -515 145 -109 -615 -96 74 -120 -361 -189 176 -110 -332
1750 -332 69 -497 -282 301 -326 -376 271 311 238 93 -44 -119 3 334 257 -170 487 238 206 564 379 109
1772 109 419 384 604 433 178 584 434 702 754 193 541 897 218 240 542 487 496 532 308 6 100 652 40
1795 40 -281 331 114 -179 209 -188 -525 104 210 -214 -397 -16 1 -689 -503 -338 -548 -509 -291 -619 -647
1816 -647 -563 -525 -910 -693 -244 -497 -731 -295 -501 -848 -266 -350 -305 -321 -393 -460 -370 2 -308 -507 -207 -48 -218
1839 -218 -202 -56 11 -34 233 79 6 185 295 85 298 139 242 200 432 454 123 188 454 377 509 250 145
1862 145 870 444 -9 461 544 519 307 -105 600 239 -77 518 151 326 525 -98 309 176 -224 -146 -97
1883 -97 343 271 -1031 36 392 -483 -45 -395 -328 118 -438 -241 -185 -337 449 -492 -753 651 -275 -786
1903g86J160n86K73k42k12R97r48j65N98m74J017l70j301J843m0r64L24l89Q82
1922F17J72j373R50R9o43N97r10P26J093j894O19P33q48N83r45L69J315j652J21
1941b71N62o80J358j254r08K517j690k75O76m47J073r88j036J713p99K02M13j540
1959a374J596O7j785J266J91l79J19j212J735J85k014J253P7l73J124j706O83
1976e47J397j722L32j88N62R53k011L21J968j613L91M72r58J597j053q26J721
1993G96p77N02l12r71K093q26j366J773k62j9K03j470J723J46j644J234o57N87
2011G53N09k319J590Q09j753J202o52J00J216k158Q61J128j417P25r25j21J878
2028A426k248K83J534j372J021p39j047K187q43j063R80q40J281l37k026K509
$$ plain form
1903 -786 374 -212 61 -181 -393 604 -344 -509 89 -385 632 262 -1039 804 764 -200 124 -265 617
1922 617 789 -584 366 465 -178 419 -491 235 1328 -566 53 786 -62 521 -424 -55 1260 -392 -271
1941 -271 291 -389 969 -285 -1193 1324 -366 -641 35 -412 661 -327 -1363 350 -449 -247 166 -1374
1959 -1374 222 289 -1496 -230 -39 -418 -299 -1511 224 409 -1605 -352 -275 -648 476 -1230 -547
1976 -547 850 -872 -540 -728 -166 787 -1224 -903 1065 -548 -157 315 -643 954 -99 -925 796
1993 796 19 521 209 -762 1331 505 -861 912 650 631 834 -636 1087 1233 -411 823 166 753
2011 753 1262 -1057 533 1342 -411 791 139 239 1455 -703 158 1286 -131 594 -331 -452 1426
2028 1426 -822 -539 995 -377 644 -95 -1142 1045 202 -861 119 -721 560 223 -1803 706
2044G06n19j378J192o57P50J2j383J616m11o96R59r31P07R00k018Q26Q87j077
2062e15P47q06L37J317j961N93P24q31J033p43n27J569q75k22N77n37R29p55r23
2081h69J967r93m27Q65j095J378j72j550J324k42k14N84j460J108M82j684J302
2098C04l09k89Q87j488R66M14j130K39M13l2N65j179J24R65n70n0P92k069K116
2117F69j061n68R47l69N39p75r0R29l90o54J577j172N7N09r26R81Q5p05Q10m65
2137g2N57R3j195J282K62j128L82r3L18L71o97Q8N46n20M07l61k06J176q66k47
2157I7P20q22M13J97m44O20o59O4L71o02L70J14o21P71l27n61N98k14J60m0o29
2178d24N23j95k01N09q61L49L19m43m4M77o00L96P1l09J14k09K47j5l39M95l46
$$ plain form
2044 706 187 -1191 1 -656 94 106 -1277 339 -72 -768 191 -740 -33 867 -1151 -325 562 -515
2062 -515 232 -574 -237 1080 -881 -288 436 -395 638 -105 -632 937 62 -160 417 -120 809 54 -869
2081 -869 1098 105 -322 543 -552 826 654 -896 428 186 -28 556 -904 204 686 -998 304
2098 304 -5 -294 593 -895 71 485 -645 -406 7 -25 540 -639 -515 450 -120 -170 622 -1447 669
2117 669 -392 -960 -13 -382 157 -618 -708 221 -169 -823 754 -418 -361 148 -778 203 288 -417 393 -72
2137 -72 485 578 -617 665 927 -201 181 88 406 777 80 168 714 194 601 240 34 1210 344 97
2157 97 817 -5 408 605 161 781 122 186 557 -45 325 439 -182 589 262 -299 299 85 245 205 -424
2178 -424 99 -96 -297 212 -649 -300 19 -424 -468 9 -591 -195 -124 -433 -319 -528 -281 -296 -635 -140 -486
2199d86p5N88p28J55L30k16l9m9l4N75n73N31L22p87K62L85m37N5J87j07L81k37
2221Co9K83k15K96j93k83O17l91n7K55M6p5k61J41L32o06K61K93m57r4O37m44
2243A9m7M76j6j31m30J96R6l37L93o0m09L81m5l11L29l85K03J89m08J16m8j15
2265c44N20n19L17j84m15O62j85k36M37k26R5k2j16K88j36K43j43l3r7M66p13
2286c41L01J95m5K36j59J60k71k79O47j31l54L49l4p5K70n6m47N31k46K5L9P2
2308C87M78m48J2J29o11q0N24l95J30p2R9J48n26M61j16n08N26j06o80P64m03
2329b87K20Q6p87Q49o05j09P60o75L23M12q92K41j09J3M07l94J45K19o46M45k0
2350d04jL34p03K7J225j229L93M49q23R46l05l80P33l22J70K63o19J16L05p55
$$ plain form
2199 -486 -561 27 -701 -546 -216 -432 -471 -520 -554 21 -552 -21 301 -486 -224 161 -276 -221 -34 -141 240 3
2221 3 -66 217 2 298 105 -178 439 48 -9 246 292 217 -44 97 429 -177 84 377 -80 -174 463 19
2243 19 -28 448 432 301 -129 67 163 -174 219 159 -250 131 86 -225 104 -281 -78 111 -297 -181 -229 -344
2265 -344 176 -343 -26 -210 -625 37 -148 -384 53 -173 -78 -100 -216 72 -64 179 36 3 -94 372 -341
2286 -341 -40 155 110 346 187 347 76 -203 444 313 -41 308 274 199 469 413 -34 497 251 276 315 387
2308 387 865 417 429 558 -53 -133 391 -4 126 54 153 301 -225 236 120 -388 138 32 -648 116 -287
2329 -287 -67 19 -768 81 -524 -633 127 -548 -225 187 -705 -464 -573 -560 -153 -547 -402 -183 -829 -384 -404
2350 -404 -405 -71 -774 -747 478 -751 -358 91 -732 214 -91 -471 262 -60 110 373 -246 -130 175 -580
2370e80J322n16m29O59m88K10O51q12O60Jk04N40j659Q55P24q02q0K79J040m56
2390I15j627N50P00j103N76L67r26K157r46j131R90o18m5l7k91J577j341n76J113
2409C04q91R96o3j375J624m95o49O09o20O72M01j539J042J76p28O38q26M99Q18
2428E93j423O75N65p64N05o93L69J284j729N29O94q26J107r56n01J447p13m08
2446b45O91p89J346q47j128J955q19j69M87j050J129q7j111J094j74l93N11j306
2464i05J226N21j727O83P04n27L48p69M53R37j704P81o7o12J373j393j88J734
2482H68j388j28N66p52J332j179k64J350q92L14J3r01J453o59r73J206m45N04
2500B5N9j192J676l99j234J348n64J77R17j723J052L19o51L11j59M5Q19j171K66
$$ plain form
2370 -580 742 226 -203 456 -32 178 829 17 677 678 474 1014 -645 210 934 132 52 331 1371 915
2390 915 -712 -162 538 -565 11 378 -548 1609 663 -468 522 -96 -141 -178 -469 1108 -233 -809 304
2409 304 -587 409 346 -1029 595 100 -549 60 -560 112 513 -1026 16 192 -536 102 -724 -225 593
2428 593 -830 -155 410 -354 151 -542 -173 1111 -618 -89 605 -221 886 -70 -571 876 163 -245
2446 -245 446 -343 1003 156 -972 983 164 -5 482 -568 561 474 -637 457 283 -110 401 -905
2464 -905 321 842 -885 -202 502 -25 323 -446 7 944 -760 21 -46 -658 715 -678 -866 868
2482 868 -520 -648 -82 -834 498 -681 -945 405 -487 -173 -160 -1061 392 -267 -1240 -34 -479 25
2500 25 84 -1108 568 169 -1065 283 -281 -104 813 -910 142 461 -190 121 -38 7 826 -345 -79
2519g9R76j100N62l35j36J085q76l91J320p81M30n45l06J538j004p17J061p35
2537c3N25K67j219J330k95q15N77m31N28j08j093J246mp68P12j014P70K64q91
2556d52N08J69m24L37n53R7J062j607K99P02n32N88n22j47O43p42pO75p20J079
2576D53p93m17J031n49J67O4k75O48j80q84J048k55k22L89m32M18J68q51L15J52
2596ej85N81o19N07K49j128R33m23j29R11p67K30O56q49j72K56J44P8j72l17M51
2617B30m02K44k66k17N11L4m56L32K17n23K78n2K34n18n7O55l34k83M06o71L73
2638b65L81m30K38j05o8L48l88K94q6l1l0K36k05K53j63l87L43j29M01l35K88
2659A60J27l85J10J80k8j05LK05j15J40k99K06J32K17o2k96r8M15%o7J1j28j69
$$ plain form
2519 -79 897 -203 359 24 -112 973 97 -294 1026 245 675 130 -176 1362 358 -359 702 -33
2537 -33 492 759 -460 870 575 -240 337 -94 434 326 -767 479 475 -293 419 -595 175 439 -452
2556 -452 56 225 -199 138 -415 -318 744 -863 -564 138 -394 194 -328 -475 168 -574 -581 94 -626 453
2576 453 -340 -757 274 -275 -108 -44 -319 329 149 -735 313 58 -164 225 -207 211 379 -472 -157 -5
2596 -5 -190 391 -228 279 528 -600 333 -90 -219 692 -75 155 811 -38 -210 46 190 268 96 -221 230
2617 230 -172 72 -194 -411 100 134 -322 10 227 -296 -18 -70 164 -354 -411 244 -90 -373 33 -638 -265
2638 -265 116 -314 -76 -181 -249 99 -289 5 -81 -112 -142 94 -111 142 -21 -408 -65 -194 207 -128 160
2659 160 287 -98 12 192 164 59 62 267 152 292 -7 199 331 548 486 190 92 507 507 440 451 323 154
2682A54P5J81k57K55Pm67J86J36J01j62l0j69J38%o9Q2k1j68k16K45O6k38R8j21
2706a94l9p4M0J42k05j03M60j83l74M67j92k61K35J04k08lQ4J1j97K77Jj68J10
2729b70J55k15K73kJ08l66O4L1K7O8L38l58J59L7M6k80M17j20J93j59m2J37j72
2752F9K65k32o1J83p1p7o2J87m3j6j00J96j06k68L38l47K41K78m08K76l1k35J63
2775A39j61L1K2q0j1Q6q1po6M0L2K23j82m0m9q8K24J25Q1m41K01K11l73j19L20
2800C7j32m0M66m69J45qK16l31J40J22J96l44J11J39m50M04J35k28J10o1j12O1
2822A07J23K33m91M4M23l6m35N14l41J06k7j65J82J41l81n5R0k1P7l30M49pn89
2845c89N96l20p4J08k80O9L51j63k88J99kL50q23L87K29p8j63P1j23K14J18l32
$$ plain form
2682 154 229 410 153 408 415 -52 134 270 371 209 179 10 148 148 79 161 140 -28 -244 1 67 -171 -73 -194
2706 -194 -233 -307 -267 -125 -330 -433 27 -156 -530 -63 -255 -516 -281 -177 -385 -388 -304 -293 -490 -213 -212 -380 -270
2729 -270 -115 -330 -57 -59 49 -317 -253 -222 -195 -127 211 -147 12 49 95 -185 232 112 305 146 104 241 69
2752 69 334 102 41 224 153 76 14 201 158 142 42 238 132 -136 202 -145 96 374 -34 242 211 -24 139
2775 139 -22 9 31 -49 -60 26 -55 -62 -128 -88 -56 167 -15 -55 -104 -192 32 157 238 -203 -2 209 -164 -283 37
2800 37 -95 -135 331 -138 7 -1 215 -116 24 146 342 -2 109 248 -202 202 337 109 219 158 46 107
2822 107 230 463 -28 16 439 403 -32 482 141 247 220 55 237 378 -3 -58 32 11 88 -242 207 200 -389
2845 -389 207 -113 -187 -79 -359 -290 61 -102 -390 -191 -193 157 -666 -279 -50 -128 -291 -220 -343 -129 -11 -343
2867c43K26j17K40j27n93O38r9n11O22k7o8k3l24L79K11n1m2j96J84L97p40L33
2889c1J48j5l2k12J23N18m03r7L61n25N21l36kO03k23n41L46j61K87j67k68L42
2911B36K82o52L99l89L91O8p76R09j77n06M57n28M98R1p13N46j16j8L8l61K90
2932c1M14p76K97L6J11K17p88j49J178r11j6L59k55N59m05n57P58j22j96Q9k6
2953b14N23l05q59R95R3l84N00p29O85L39j192O50k44L80M2q73O58M32j070N97
2973B4J74m19P36p43J98O86q10L10j79k68P92n69j42O05k36o5j44k96Q50n12k49
2994b57L88k78K27j68o88R90Q7r90P21k79K78K71p45J69N06n23J18k40J03N01
3014A91q32K00L74n44L89j86K8Q15p85j79Q08n73M31l79m4Q89p48l98Q79n04L82
$$ plain form
2867 -343 -117 -234 6 -121 -714 -76 -175 -686 -64 -91 -159 -182 -506 -127 84 33 -9 -205 -21 376 -364 -31
2889 -31 117 102 70 -142 -19 499 96 -1 360 -165 356 20 18 621 398 -143 203 42 329 162 -106 236
2911 236 518 -134 265 -124 267 335 -441 468 291 -215 242 -286 212 303 -410 136 20 2 40 -321 -31
2932 -31 383 -393 -96 -60 51 268 -520 -669 509 -402 -418 -59 -314 245 -160 -717 41 -81 -277 -188 -214
2953 -214 309 4 -855 140 233 -151 349 -380 305 644 -548 102 -142 238 280 -593 65 497 -573 24
2973 24 198 -221 515 -228 -30 656 -154 156 -23 -291 501 -68 -210 395 159 94 -50 -346 504 -8 -257
2994 -257 131 -147 80 -88 -776 214 301 -689 32 -247 31 302 -443 -274 232 -291 -173 -413 -310 191
3014 191 -641 -441 -67 -611 -222 -408 -380 435 -350 -529 279 -294 137 -242 -286 603 -145 -543 336 -168 214
3035B14l96n7N82k72j45K69l31L67L75r74O16P9l25P2k8N27j58o55M73R4k53L26
3057D00l75J56O39o57J61K14l94K68n43J47O41p46j29L99j56K0k24J3L22l21K41
3078G6J01m49M33j18n71P51m37j27J03j87M80P7p12M26O8j30lo0L91o8k83L11
3100G2j91OK6P9j33K00j91m7O7j47N87n36j55M72k53J82K07m11M04j5k85K11j48
3123AJ17J12m95M08j01k62J95K17k66R1n1K22k38j58K80j57K22j3l34l0K09R8
3145F7o9k7K0O4K2j72J97j57r6m7Q6J35j8j47M0o9L9o5r6J3K81j34o4q9M1K93
3171D8m55J76K02k59K99j82K45J30k72k1K74k84L39k46J81P1k93j02L25K17k90
3192A03K02J05j34m9P8P9m79K72J28k40L09l35K94n4k6j7j24J2J56l66R4L59j72
$$ plain form
3035 214 -182 -239 343 71 -74 195 -136 231 606 -368 248 327 2 74 46 573 415 -240 233 327 74 400
3057 400 25 181 820 163 324 538 144 412 -131 16 657 -89 -218 181 25 45 -179 -166 156 -165 76
3078 76 177 -272 161 43 -528 223 -214 -341 -238 -425 55 132 -580 -154 -86 -216 -219 -279 112 44 -239 72
3100 72 -119 -113 -87 -8 -141 59 -132 -179 -112 -259 328 -208 -363 109 -144 38 245 -166 238 223 -62 149 1
3123 1 118 230 -265 143 42 -220 -25 192 -74 17 -34 188 -50 -208 72 -85 137 124 -210 -240 -31 67
3145 67 -2 -29 -9 55 77 -95 102 -55 -151 -198 -112 23 5 -142 -102 -171 -132 -197 -293 -280 1 -133 -197 -286 -245 48
3171 48 -407 -231 -29 -288 11 -171 74 204 -68 -89 185 -99 240 -6 175 246 -47 -149 176 393 103
3192 103 305 410 276 227 305 384 -95 177 305 65 374 39 333 279 253 236 112 124 280 -86 8 367 195
3215A95N7j63J05l41K9K22p3j23J56K38m23R0J96k14j27J07k17J33J11j96j9j45
3237d02K03n3j45K74k52J68P5j67J71j66n1K54m6J28j4l12K86Q4r1J38l47j7L77
3260I5l98K59N7J52M9j76J03j3j05jj25K8L47m7k44M02j71J85k03l51N08j76l22
$$ plain form
3215 195 252 89 194 -147 -118 104 31 -92 64 302 -121 -31 165 -49 -176 -69 -286 -153 -42 -238 -257 -402
3237 -402 -199 -252 -397 -123 -375 -207 -132 -299 -128 -294 -345 -91 -137 -9 -23 -335 -49 35 -56 82 -265 -282 95
3260 95 -303 -44 13 165 214 38 141 128 23 22 -103 -75 272 225 -19 383 212 397 194 -157 351 175 -147
$$ [...]
8191e7
##END NTUPLES=NMR FID
##END=
