##TITLE=1H_SL20_Dau-A(500)
 CDCl3, 68 sc, 
 24.12.2020
##JCAMPDX= 6.0         $$ Bruker NMR JCAMP-DX V2.0
##DATA TYPE= NMR FID
##DATA CLASS= NTUPLES
##ORIGIN= UXNMR, Bruker Analytische Messtechnik GmbH
##OWNER= root
$$ XWIN-NMR		Version 3.5
$$ Thu Dec 24 10:16:23 2020 Russian Standard Time (UT+4h)  she@DPX200
##.OBSERVE FREQUENCY= 200.1315066352
##.OBSERVE NUCLEUS= ^1H
##.DELAY= (6, 6)
##.ACQUISITION MODE= SIMULTANEOUS
##.ACQUISITION SCHEME= undefined
##.AVERAGES= 68
##.DIGITISER RES= 18
##SPECTROMETER/DATA SYSTEM= spect
##.PULSE SEQUENCE= zg30
##.SOLVENT NAME= CDCl3
##.SHIFT REFERENCE= (INTERNAL, CDCl3, 0, 15.7039)
##AUDIT TRAIL= $$ (NUMBER, WHEN, WHO, WHERE, WHAT)
$$ ##TITLE= Audit trail, XWIN-NMR		Version 3.5
$$ ##JCAMPDX= 5.01
$$ ##ORIGIN= Bruker BioSpin GmbH
$$ ##OWNER= she
$$ F:/spectra/data/she/nmr/H-F/1/audita.txt
$$ ##AUDIT TRAIL=  $$ (NUMBER, WHEN, WHO, WHERE, WHAT)
(   1,<2020-12-24 10:14:53.23 +0400>,<she>,<DPX200>,
      <continue with go, POWCHK disabled, PULCHK disabled
       configuration hash MD5:
       00 E9 B6 7A A2 85 ED C7 34 08 36 98 17 FE 4E 26
       data hash MD5: 16K
       68 E0 72 4D B0 9E 64 C9 54 54 81 A5 22 F3 2B B8>)
$$ ##END=
$$ 
$$ hash MD5
$$ 2B C3 1B 71 C1 76 79 85 21 6B D7 21 D0 2B 40 FC
##$RELAX= 
##$RELAX= 
##$RELAX= 
##$RELAX= 
##$RELAX= 
##$RELAX= 
$$ Bruker specific parameters
$$ --------------------------
##$DU= <F:/spectra>
##$EXPNO= 1
##$NAME= <H-F>
##$PROCNO= 1
##$TYPE= <nmr>
##$USER= <she>
##$AMP= (0..31)
100 100 100 100 100 100 100 100 100 100 100 100 100 100 100 100 100 100 
100 100 100 100 100 100 100 100 100 100 100 100 100 100 
##$AQSEQ= 0
##$AQ_mod= 1
##$AUNM= <au_zg>
##$AUTOPOS= <>
##$BF1= 200.13
##$BF2= 200.13
##$BF3= 200.13
##$BF4= 200.13
##$BF5= 200.13
##$BF6= 200.13
##$BF7= 200.13
##$BF8= 200.13
##$BYTORDA= 1
##$CFDGTYP= 0
##$CFRGTYP= 5
##$CHEMSTR= <none>
##$CNST= (0..31)
1 1 145 1 1 1 1 1 1 1 1 1 1 1 1 1 1 1 1 1 1 1 1 1 1 1 1 1 1 1 1 1 
##$CPDPRG= <>
##$CPDPRG1= <>
##$CPDPRG2= <>
##$CPDPRG3= <>
##$CPDPRG4= <mlev>
##$CPDPRG5= <mlev>
##$CPDPRG6= <mlev>
##$CPDPRG7= <mlev>
##$CPDPRG8= <mlev>
##$CPDPRGB= <>
##$CPDPRGT= <>
##$D= (0..31)
0 1.2 0 0 0 0 0 0 0 0.06 0 0.03 0 0 0 0 0.0002 0 0 0 0 0 0 0 0 0 0 0 0 
0 0 0 
##$DATE= 1608790232
##$DBL= (0..7)
120 120 120 120 120 120 120 120 
##$DBP= (0..7)
150 150 150 150 150 150 150 150 
##$DBP07= 0
##$DBPNAM0= <>
##$DBPNAM1= <>
##$DBPNAM2= <>
##$DBPNAM3= <>
##$DBPNAM4= <>
##$DBPNAM5= <>
##$DBPNAM6= <>
##$DBPNAM7= <>
##$DBPOAL= (0..7)
0.5 0.5 0.5 0.5 0.5 0.5 0.5 0.5 
##$DBPOFFS= (0..7)
0 0 0 0 0 0 0 0 
##$DE= 6
##$DECBNUC= <off>
##$DECIM= 32
##$DECNUC= <off>
##$DECSTAT= 4
##$DIGMOD= 1
##$DIGTYP= 9
##$DL= (0..7)
0 120 120 120 120 120 120 120 
##$DP= (0..7)
150 150 150 150 150 150 150 150 
##$DP07= 0
##$DPNAME0= <>
##$DPNAME1= <>
##$DPNAME2= <>
##$DPNAME3= <>
##$DPNAME4= <>
##$DPNAME5= <>
##$DPNAME6= <>
##$DPNAME7= <>
##$DPOAL= (0..7)
0.5 0.5 0.5 0.5 0.5 0.5 0.5 0.5 
##$DPOFFS= (0..7)
0 0 0 0 0 0 0 0 
##$DQDMODE= 0
##$DR= 18
##$DS= 0
$$ [...]
##$SUBNAM2= <"">
##$SUBNAM3= <"">
##$SUBNAM4= <"">
##$SUBNAM5= <"">
##$SUBNAM6= <"">
##$SUBNAM7= <"">
##$SUBNAM8= <"">
##$SUBNAM9= <"">
##$SW= 16.9725356469052
##$SWIBOX= (0..15)
0 0 2 0 0 0 0 0 0 0 0 0 0 0 0 0 
##$SW_h= 3396.73913043478
##$TD= 16384
##$TD0= 1
##$TE= 0
##$TE2= 300
##$TE3= 300
##$TEG= 300
##$TL= (0..7)
0 120 120 120 120 120 120 120 
##$TP= (0..7)
150 150 150 150 150 150 150 150 
##$TP07= 0
##$TPNAME0= <>
##$TPNAME1= <>
##$TPNAME2= <>
##$TPNAME3= <>
##$TPNAME4= <>
##$TPNAME5= <>
##$TPNAME6= <>
##$TPNAME7= <>
##$TPOAL= (0..7)
0.5 0.5 0.5 0.5 0.5 0.5 0.5 0.5 
##$TPOFFS= (0..7)
0 0 0 0 0 0 0 0 
##$TUNHIN= 0
##$TUNHOUT= 0
##$TUNXOUT= 0
##$USERA1= <user>
##$USERA2= <user>
##$USERA3= <user>
##$USERA4= <user>
##$USERA5= <user>
##$V9= 5
##$VALIST= <valist>
##$VCLIST= <CCCCCCCCCCCCCCC>
##$VD= 0
##$VDLIST= <DDDDDDDDDDDDDDD>
##$VPLIST= <PPPPPPPPPPPPPPP>
##$VTLIST= <TTTTTTTTTTTTTTT>
##$WBST= 1024
##$WBSW= 4
##$XGAIN= (0..3)
0 0 0 0 
##$XL= 0
##$YL= 0
##$YMAX_a= 565072
##$YMIN_a= -645084
##$ZGOPTNS= <>
##$ZL1= 120
##$ZL2= 120
##$ZL3= 120
##$ZL4= 120
##$ABSF1= 10
##$ABSF2= 0
##$ABSG= 5
##$ABSL= 3
##$ALPHA= 0
##$AQORDER= 0
##$ASSFAC= 0
##$ASSFACI= 0
##$ASSFACX= 0
##$ASSWID= 0
##$AUNMP= <proc_1d>
##$AZFE= 0.1
##$AZFW= 0.1
##$BCFW= 1
##$BC_mod= 2
##$BYTORDP= 1
##$COROFFS= 0
##$CY= 11.3945322036743
##$DATMOD= 1
##$DC= 2
##$DFILT= <>
##$DTYPP= 0
##$F1P= 15.9154993809931
##$F2P= -4.1035820241983
##$FCOR= 0.5
##$FTSIZE= 0
##$FT_mod= 4
##$GAMMA= 1
##$GB= 0.15
##$INTBC= 1
##$INTSCL= 1
##$ISEN= 128
##$LB= 0.24
##$LEV0= 0
##$LPBIN= 0
##$MAXI= 10000
##$MC2= 0
##$MEAN= 0
##$ME_mod= 0
##$MI= 1.114404
##$NCOEF= 0
##$NC_proc= 0
##$NLEV= 6
##$NOISF1= 3.799351
##$NOISF2= 2.8
##$NSP= 1
##$NTH_PI= 0
##$NZP= 0
##$OFFSET= 15.70392
##$PC= 1
##$PHC0= -10767.21
##$PHC1= 21.80095
##$PH_mod= 1
##$PKNL= yes
##$PPARMOD= 0
##$PSCAL= 0
##$PSIGN= 0
##$REVERSE= no
##$SF= 200.130013532006
##$SI= 16384
##$SIGF1= 3
##$SIGF2= 2
##$SINO= 400
##$SIOLD= 16384
##$SREGLST= <1H.CDCl3>
##$SSB= 0
##$STSI= 0
##$STSR= 0
##$SW_p= 3612.71676300578
##$SYMM= 0
##$S_DEV= 0
##$TDeff= 0
##$TDoff= 0
##$TI= <>
##$TILT= no
##$TM1= 0
##$TM2= 0
##$TOPLEV= 0
##$USERP1= <user>
##$USERP2= <user>
##$USERP3= <user>
##$USERP4= <user>
##$USERP5= <user>
##$WDW= 1
##$XDIM= 8192
##$YMAX_p= 0
##$YMIN_p= 0
$$ End of Bruker specific parameters
$$ ---------------------------------
##NTUPLES= NMR FID
##VAR_NAME=  TIME,          FID/REAL,        FID/IMAG
##SYMBOL=    X,             R,               I
##VAR_TYPE=  INDEPENDENT,   DEPENDENT,       DEPENDENT
##VAR_FORM=  AFFN,          ASDF,            ASDF
##VAR_DIM=   8192,          8192,            8192
##UNITS=     SECONDS,       ARBITRARY UNITS, ARBITRARY UNITS
##FACTOR=    0.0002944,     1,               1
##FIRST=     0,             0,               0
##LAST=      2.4114304,     0,               0
##MIN=       0,             -645084,         0
##MAX=       2.4114304,     565072,          0
$$ Real data points
##PAGE= N=1
##DATA TABLE= (X++(R..R)), XYDATA
0@%%%%%%%%%%%%%%o7J35j36J36j36J63k31K72l25L93m25M92o09O83p52Q82j018
31e43J157j312J509j698J904k162K420k694K994l332L707m108M542n020N548o120
47c208O742p431Q185r009R922j0943J2081j3348J4777j6404J8270k0449K3018
60A2203k6100K9886l4639M0826m9227O1294q0149J13649j89769O43709M3389j210156
72f45084J063885m17193k41300O12005m61614R1119J61357k83910L42976k51504
82b9263n6568K57240k26184J00131P2337k12161J65399L289r4784N2447n0629
93a8746J9147Q4923j00452L5009J7575j17849J47402N310j74960J33274n3711
104b3078o496J11012j79477R5385K0225j33424K36854j75077j06720K75137j78622
$$ y = [0, 0, 0, 0, 0, 0, 0, 0, 0, 0, 0, 0, 0, 0, 0, -67, 68, -68, 68, -68, 95, -136, 136, -189, 204, -221, 271, -338, 345, -407, 475, -543, 614, -698, 811, -887, 1017, -1145, 1275, -1419, 1575, -1757, 1950, -2158, 2384, -2636, 2912, -3208, 3534, -3897, 4288, -4721, 5201, -5742, 6339, -7009, 7768, -8636, 9634, -10815, 12203, -13897, 15989, -18650, 22176, -27051, 34243, -45906, 67743, -122026, 521683, 565072, -645084, 418801, 1608, -239692, 372313, -89301, 1818, 163175, -120735, 222241, -29263, -85831, 171409, -54775, 45356, 117693, -94468, 70931, 74220, -20564, 31883, -18746, 401, 85324, -15128, 19881, 37456, -80393, 67009, 72319, -102641, 30633, -23078, -29574, 81438, -98039, -2654, 17571, -115853, 121001, -54076, -160796, 114341, -64281]
115f4281K0174J04549j82984J33484l653p0335J02423j21889P7890O4712j40748
126h0658J14913l7730q3405J39235o3321k5777P3119o0160L2653O15n1441N9468
138A7511l0003j0956P4907o9419j3153O2407n3761K6563K3969o3418N7344R958
150C1949l0032K6761p1587M3659O4277r0565O0546q95q6553J05181k1625m7334
162a6218N3822n8501M5024K0886q4411O7235k4545l1232Q3957p6486l033N0982
174B7480o5110N9301j7953p1961Q8411k7497j6853N1781r3256L9295N6445p5066
186d4983M0245r730l4009O5314m3424p557K7312m2846O4353j3652o6025O7753
198B751k8630j935O5191q4671L992N9832l6589J5467k343k0423L5172j2319J6161
$$ y = [-64281, -44107, 60442, -122542, 10942, 7289, -63046, 39377, -82512, -4622, 60090, -80658, 34255, -3475, -86880, 52355, -10966, -36743, 36376, -23784, 8869, 9484, -41957, 17511, -12492, -23448, 51459, -17960, -31113, 31294, -22467, 4096, 28065, -35353, 21991, 31949, 1917, 28678, -42909, 750, 65027, -25538, 35008, 34113, -52440, 52741, 31116, -16218, 37604, -20897, 24127, 45013, -39398, 27837, 3292, -27940, 56017, -20469, -23502, 27480, -37630, 21671, 3718, -68243, 20168, -7329, -24182, 27599, -65657, -26362, 30083, -44983, -4738, -14468, -48477, 16837, -26587, -34144, -6832, -49678, 14675, 1023, -65002, 2751, -25879, -27814, 37377, -47294, -43302, 16530, -20059, -4592, -6935, -27358, 7814, -4505, 11656]
211A1656m407m7173O3107O768m9567M4014j8536j3021N5103l6832q644K7470k0743
224I195L3535j1746m1137N5504k1237j9187M6324n2233J2615M3727m8683K5661
236C2338j2335l2972N5700k9766p316L2044o2961M3587K7458p4900L5678Q931
248A5486k4590L0382k9090N609J2732l6130L4640j1671l3705M3729k0219n220
260a8047K2626l9319K3364P470l2482L2888k0148j0459L8745m1462J3143L3366
272I685n3622K8899J5686l8801L6356j1747j1980L5312l2823M718J8805k6214
284b5726L8087n909l2720M1875k0244o985L7995l4667M002K0652j7647J9853j1716
297F850m563K3336k7928K2361O035m1892M4594l784l0971L6745k8924n5L2354
$$ y = [11656, 7249, -39924, 23183, 29951, -19616, 24398, 5862, -7159, 47944, 11112, 2468, 29938, 9195, 42730, 30984, -10153, 45351, 24114, 4927, 51251, -982, 11633, 55360, 6677, 32338, 20003, -12969, 42731, 12965, 5649, 37693, -25268, 18319, 45777, -29123, 6555, 15486, -9104, 21278, -7812, -2203, 10529, -25601, 9039, -2632, -36337, 7392, -12827, -18047, 4579, -34740, -11376, -3906, -36388, -3500, -23648, -34107, 4638, -36824, -23681, 9685, -43937, -15038, 648, -38153, -1797, -13544, -25524, 9788, -23035, -18317, 488, -25726, 12361, 6452, -26268, 15607, -4637, -11622, 26373, -8294, -4292, 16360, -1287, 18566, 6850, 2287, 25623, -2305, 20056, 26091, -15801, 28793, 25009, -5962, 30783, 1859, 1804, 34158]
310C4158l5769J8482L501l4894M5464j4935l0869L5036k1154O398J6299m0855
322a9138K2057J0604k3048K1019k1543p352L2549k5101M523N740k7285K7512k580
335b043j8516J7622j8777R496J8523l3397J9424j485j9685M0727k8280j2144L9727
348A1192l4466J3611K3433m5197K6416J1635k1326K5296k3420L740K9680l3932
360a3338J7805O834k6424L7735o034k6767K6151r027M673J0193k1149J4913o676
373H889n302L0920l1162k523L5919l6452O829K1889k9776J5368J444r005J7778
386B4816k9061J4427J9665l9629K4956J788l1628L4075r618j6791J8308k1145
398i837J4600M395k9039K7523j0090j8190K9869k3948o285J9630j6037R469k857
$$ y = [34158, -1611, 16871, 20372, -14522, 30942, 16007, -14862, 20174, -980, 5418, 21717, -19138, 2919, 13523, -9525, 11494, -10049, -17401, 15148, -9953, -5430, 310, -26975, 537, -2043, -20559, -2937, -21714, -12218, 6305, -27092, -7668, -9153, -28838, 11889, -16391, -28535, 11192, -23274, -9663, 13770, -31427, -5011, 6624, -14702, 10594, -12826, -9086, 20594, -13338, 4467, 11301, -15123, 22612, 16578, -10189, 15962, 6935, 11608, 21801, 652, 15565, 8889, 3587, 34507, 3345, 822, 36741, 289, 7118, 29007, -769, 14599, 16043, 7038, 24816, -4245, 10182, 29847, -9782, 15174, 16962, -14666, 19409, 9791, -7000, 11308, -9837, 4763, 9158, -19881, 7642, -2448, -20638, 9231, -14717, -21002, -1372, -17409, -7940, -10797]
411a0797j2797J8450j3301J600J9051l5036J5412J9807l3486K0368Q675k8259
423c0313K5221J138j4285R471r809J7138J538k4343K8524j3192j2389M0351l2065
436a3015n673L3646k5575J2102P255k2770K3579j0688R46K0472l3031J8789J8711
449B4748l0531K0879n428j1468K5856j6749J218P552j8233K4293n284k1411K3791
462A9233j5003j456K4363k5513k19J1441j3187J4457j3646j0684K7606k0730l42
475c680J8544l2513J3995K0254l0309J2046o02j0746J9477j7090K036Q847k2741
488b2482K6047k061k6092K7069j1490m079J8323k3374P900P174j0418J9638j8874
501a2719k027K2650k1137J4392K447k4663K8961L11j9065J8400q987j192J6894
$$ y = [-10797, -23594, -5144, -18445, -16845, 2206, -32830, -17418, 2389, -31097, -10729, -2054, -30313, -5092, -3954, -18239, -8768, -18577, -1439, 99, -24244, 4280, -8912, -21301, 19050, -13015, -18688, 14958, -10617, 1485, 8740, -14030, 9549, -1139, -193, 20279, -12752, 6037, 24748, -5783, 15096, 9668, -1800, 24056, 7307, 8525, 16077, -2156, 22137, 16853, -4558, 19233, 4230, 2774, 27137, 1624, 1405, 12846, -341, 14116, 470, -10214, 17392, -3338, -3680, 14864, -17649, -3654, 16600, -13709, -1663, -2265, -13011, 6466, -10624, -8588, 259, -22482, 3565, 1504, -24588, 2481, -9009, -13088, 5235, -18139, -10239, -3065, -13483, 6155, -12719, -14746, 7904, -13233, 1159, 3606, -21057, 7904, 8215, -10850, 7550, -1437, -2629, 14265]
514A4265j3303L397L968q034J6481o994r820J4848r245m38J7035j7379J207J0638
528A6626q304Q572r783o954J8678j2013M69O007j7890J5832L782j5252P825j0698
542c103N752J0814k2744J4427j499j8253K5653j2293j2555J7879j1582L464L574
555d66j2730J0507q102R82J2686k3543N110J7157j8336P438L161j4279J1925K176
569f314o129L124n650R150L37r828J1500k738o120J4769p935l731J1108n435L532
584c60L725j2936J3540o18o092J5737j4328j273J8988j6604M244Q619j5662J4091
598A1071j212o996J4063j6832P386J1197j9150J1624K456j3511J6685p107o524
611C150Q874q345R629o185r420J7218j1580q18J3902k2540K937J5083j3675k77
$$ y = [14265, 962, 4359, 8327, 293, 16774, 9780, -40, 14808, 5563, 5125, 22160, 4781, 5988, 16626, 8322, 16894, 7111, 157, 18835, 6822, 7291, 13298, -4592, 11240, 15022, -230, 7595, -3103, 2649, 13463, -9281, 5146, 3647, -14606, 11047, -1246, -13801, 4078, -7504, -4040, -466, -13196, -2689, -10791, -9809, 2877, -20666, -15556, 1601, -16735, -9297, -6136, -20415, -8490, -6314, -12443, -9319, -14969, -5819, -5482, -15310, -3810, -6548, -12668, 2101, -5834, -9565, 1543, -3892, -360, 3365, -9571, 3969, 3351, -2741, 12996, -1332, -2605, 16383, -221, 4023, 12642, -3020, 11071, 9859, 2863, 16926, 94, 7480, 18677, -473, 11151, 13607, 96, 16781, 9674, 3150, 12024, 3679, 13308, 7123, -2297, 14921, 3341, 2523, 16425, -6115, -3178, 11905, -1770, -2047]
625b047L926p500M647j582N57K718j2567O918Q904j5913M477O241j4483J3550
639b154mj3516J2155n146J882M873j5001J1320K218r430J4591j3214k41J6287
653D620j5669J0088q41j1261K0352j1088l402J4992j6500J0469O487j5704J3464
666F007n524j995J4191j2291K704M817q832J3289l791j0196J2723m834J58M968
680A1394r329N081M296q771M892k743l036J0332r654j561P773j0778P071J983
694F950j3604J1537l715q448J2894j1832L07P951j1756J1406n899q028J4804j3120
708a0553J862J0190j7742Q968O060j4337J1669k876n997J0995r828L219M726r997
722a3641J1079k010q876J4007o366l237J1336r455K999O694q420P609j54l301
$$ y = [-2047, 1879, -5621, -974, -2556, -1999, 719, -11848, -4930, 3974, -11939, -7462, -1221, -15704, -2154, -2158, -15674, -3519, -8665, -6783, -1910, -16911, -5591, -3373, -12803, 1788, -11426, -11667, 4620, -11049, -961, -1802, -13063, 7289, -3799, -7201, 7791, -8709, 1760, 8247, -7457, 6007, 483, -1512, 12679, 388, 3092, 7909, -923, 12366, 8575, -1621, 11102, 6268, 6426, 11394, 2065, 7146, 11442, 2671, 7563, 4820, 1784, 12116, 2462, 901, 8674, -2104, 4967, 6950, -6654, 4883, 1168, -7280, 5614, -6218, -5911, 2040, -9716, 1690, -4209, -12237, 2567, -10553, -8691, 1499, -16243, -7275, -1215, -15552, -3883, -6759, -12756, -1761, -11589, -8370, -3644, -13641, -2562, -4572, -13448, 559, -5807, -9044, 2292, -7163, -4164, 2530, -5890, 1719, 1565, -1736]
736a736O280p565O049N082j1172J1872j805q405J5562r663l559J3171j0680O764
750A0195J318j2063J3512j486q331R401o561j04P924q893K818m70l114P552o564
765E134l669Q523r987K391P586j1811K844L780o041M028m710j099N712r694P352
780C39k879r396J4374n759p045R350r082L019O021j0992N389l68l918R894q858
795i911P52P461p620L871J58o013R179j941k246M997m523K505L509m262L009j52
811a227k013O549j866k562N025l177L193K723q033N008L284n238O828l793k827
826A874P670o639J533K855n797O211j96o617O809n466J356L641q669O082M79p383
842b257R421n533n137P945n999Q88n83j602M418n419j847Q377j0175K846N873
$$ y = [-1736, 4544, -3021, 3028, 8110, -3062, 8810, 7005, -1400, 14162, 4499, 940, 14111, 3431, 10195, 11513, -550, 12962, 11476, 3145, 12546, 5985, 5881, 13805, 4912, 7730, 7260, 4146, 11698, 5134, 1465, 9988, 1, 2392, 9978, -1833, 1011, 4791, -1250, 2778, -1932, -3031, 2681, -7013, 339, -2540, -11936, 2438, -3321, -10366, -1016, -10098, -7079, -1058, -12050, -6661, -7029, -10947, -1053, -9911, -9159, -1698, -9318, -5447, -5289, -11302, -2123, -4064, -6310, -1313, -5836, -3331, 178, -4084, -1075, -1227, -3240, 3309, 1443, -1119, 3906, 729, 3922, 6645, -1388, 3620, 6904, 1666, 8494, 4701, 1874, 9544, 2905, 4438, 7293, 1496, 7707, 7511, 894, 7703, 2237, 3593, 7234, -1435, 4647, 5126, -2257, 7164, 1631, -3506, 4439, -1560, -672, -1255, -2857, 1561, -3858, -5705, 2672, -7503, -4657, 1216]
857A216r062M629J219o312N052k256j902L195l684K656J199m278O042k281m161
872h728Q864n219j585P052p447L874M386p073M882o66k324Q053n341P09M767n813
888a609N220o93l146N260l163L535K303p321O423J309o073N391j009l983O491
903H935l371L71m39k084O511n450k678P526n613r94O647q364J3O551n735K000
919C826j083l191M009l297N22m7o445P558o16q928O954k078l365M894m703K00
935e790P87j676O475q408k046R374o211q89M579n874M290R43j454K292k821q85
951g314O994p062J608L859m776M460K260n206M669j581J16M089o063M003K989
966C045n179P566j813o404R003k037j675L168l780M489j511k714N297m777K569
$$ y = [1216, -7846, -3217, -1998, -8310, -3258, -5514, -7416, -4221, -7905, -5249, -4050, -8328, -2286, -4567, -8728, 136, -5083, -6668, 384, -7063, -3189, 1197, -5876, -994, -1660, -3984, 4069, -1272, -563, 4204, -1609, 3611, 2918, -228, 5032, 1869, 5404, 7707, 386, 6809, 8118, 2045, 7436, 6427, 2444, 8935, 5564, 5935, 5496, 3412, 9923, 4473, 1795, 9321, 3708, 2714, 9361, 997, 1010, 7561, 1826, 3826, 2743, -448, 3561, 264, 786, 739, -5706, 1852, 1236, -7692, -738, -2816, -6181, -1287, -5990, -5790, -5003, -6679, -204, -8612, -10658, -1284, -7495, -8384, -3805, -9679, -5389, -4446, -5900, -3608, -6429, -7314, -320, -7382, -5774, -1915, -6691, -2231, 29, -5177, -508, -2089, -1973, 2116, -3947, 56, 3045, -2134, 5432, 3619, -2785, 6218, 4181, 2506, 5674, 1894, 6383, 4872, 2158, 7455, 2678, 5247]
981E247K968p861N984J101o271M990j152k440K426k264pO0r79J492l284K0L499
998C529m058r61K231p30k163K692m752J520J368l307K744q17l128L660j031j260
1014d463K323m921L809M14k705L798m516K102L366n330K809J573l881P304l977
1029b295j717M461k806L059n32k259M208q65k59L161m021R26M015j761p1O04j406
1046B442K467Q58j752L57K1J051K101m077J812J462l038K672j123m416O132l016
1062C953o77M075p690J671L183m282K333l375J22L748o568M677j009n996P716
1077A881k749l981K757j779K080j672l447L113j810J031J176l318J758N45k293
1092f708K736j294j104K670k039L83J676j059m12J671k8n70J188k39J263P28p90
$$ y = [5247, 8215, 354, 6338, 7439, 1168, 6158, 5006, 2566, 4992, 2728, 2721, 2781, 1802, 3294, 10, 30, 3529, -529, -1490, 741, 11, -2152, 540, -4212, -2692, -1324, -4631, -1887, -2704, -5832, -2172, -3203, -4463, -2140, -7061, -3252, -2838, -5543, -1745, -6261, -4159, -793, -6123, -3314, -1741, -5622, 1682, -2295, -4012, 449, -2357, 702, 170, -2089, 2119, 1254, 995, 4156, 135, 1061, 5076, 3315, 3244, 3848, 2442, 4909, 5767, 4015, 4372, 4393, 5444, 7545, 3468, 5280, 6742, 3704, 6376, 5253, 837, 6969, 3953, 3276, 7351, -339, 1332, 4515, 233, 2566, -809, -687, 3061, -3507, 1170, 161, -5835, 1881, -868, -4849, -2092, -3871, -1791, -3463, -6910, -3797, -5607, -4576, -3400, -6718, -4960, -4415, -6708, -3972, -5266, -6370, -3700, -5739, -5356, -3680, -4739, -5151, -3480, -3508, -4078, -2890, -3129, -1866, -1138, -1928]
1109a928J155j032K513J147l680M461o94k596M401j532q54L226l141K684P45l360
1125A515M597k439M81K913n112J748K933m077M131k874j654L796k156N15o99j856
1141A762J190Q00j728N12j735j06K920m581O85P01k570L237r70l279J893o64m43
1158b376J154l611J671J691k924K220o61k463K579j39j252N73j836L104O08l105
1174d767J698m2M0J647j606P69P99l37L182l011j154L930j399O01J192j601K310
1191B251j07j076J155k48J036J256j405J141o88n5J938j180j317K345j727L27
1207C646J875k040j051J608r57k58n38o15J134r59Q27j102k576L040j189l305
1223b460L352n68k694K352k050p21J372k207J243n15j531J942j353j352K259j583
$$ y = [-1928, -773, -1805, 708, 1855, -1825, 2636, 1942, -654, 3747, 2215, 1361, 4587, 1446, 4130, 4875, 1515, 6112, 3673, 4154, 7067, 1955, 3703, 6636, 2559, 6690, 3816, 2162, 5958, 3802, 4317, 3618, 1762, 2952, 3752, 2024, 2536, 801, 695, 3615, -966, -281, 420, -2150, 1087, 117, -3162, -1269, -1933, -2376, -1222, -4833, -3162, -1471, -4395, -2175, -2836, -5299, -2720, -2859, -4111, -3538, -5374, -2270, -1662, -4767, -3069, -3111, -3071, -1424, -3030, -2261, -1462, -1799, 1383, -1628, -2782, 1148, -251, 350, 1542, -59, 2251, 2144, 1068, 2223, 1975, 3011, 4267, 2862, 4003, 3315, 3260, 5198, 4018, 2701, 5046, 3319, 3646, 5521, 3481, 2430, 4038, 3081, 2823, 2285, 1670, 2804, 1845, 2672, 1570, -1006, 2034, 845, -2460, 892, 324, -2370, -18, -2068, -2789, -1417, -3624, -2381, -2896, -4427, -2485, -3838, -5190, -2931, -4514]
1239d514o07J562o37Q24j790J42J772k138J011K043k836J359J714j724Q83N09
1255b427L57M90j002K521K19k942M057P18m182M609o8j868K049M97q69P80o14
1272B325J712j335N1K061j377J567O66k801J404R41j532M91l18m27R49p22L77
1289D032q58j408K454k273p44K300j891j181J579k044k13R88j945J754j475j339
1305b264J561j894K02J732l753K064Kj587J589k068N07J752k523J893j58j639
1321d584K341o77j561J593j45P09P77j515K125o08j104L420l003j61L365j981
1337a009O47J573j996K364o67L75O92j530K817o90j591K851p88j526K825j465
1353B882l90J372o35K5N46k205J326k76j387J683j503M01o2j732J626k42k055
$$ y = [-4514, -5121, -3559, -4196, -3372, -5162, -5020, -3248, -5386, -4375, -2332, -5168, -3809, -2095, -3819, -2936, -2427, -2070, -1580, -2582, -61, 158, -2784, 1273, 1991, -2191, 2418, 2350, 482, 2531, 3028, 2159, 2939, 2325, 4037, 2702, 2753, 4814, 3437, 5004, 5670, 2869, 4273, 5214, 3682, 4173, 3855, 3428, 4377, 3655, 4032, 3174, 1766, 4220, 1947, 1203, 3503, 1612, 431, 2010, -34, -247, 741, -1204, 550, -925, -2264, -703, -2597, -2395, -663, -4416, -2352, -2350, -3937, -2348, -4416, -3909, -2157, -4680, -2787, -2945, -4584, -2243, -2920, -4481, -2888, -3033, -2324, -1547, -3062, -937, -1545, -2649, 771, -2232, -2393, 972, -1009, -362, 1211, -785, 1579, 912, 1287, 1979, 449, 3266, 2576, 985, 3836, 3048, 1522, 4347, 2882, 2492, 3864, 3229, 3254, 3800, 1595, 2921, 2645, 1258, 2941, 1438, 1839, 1777, 45, 1671, 1429, -626]
1370f26K976l202p73K469j485P8N06j224J100j409l71P80k080P63M51j525Q29
1387b743K53p80N82n69k05Q35r86j22J405r02P03M3J14L41p90J535O0j208J552
1406h82n33j390K617P05j751Q18J681O23p76J157m40m62K17N29L2N8J086N10j303
1425B496J716j136J35J6n10J115K1l87J63j86j09j42k00J087n28j520M42m21o79
1444A373p0p65J32Q62o50k82K29j823L26r24J42n21L0J23n94j104K932l712J872
1463b424Q99l452P07K324q70R4K32j772O64O66r68O77r6K053o60j500J571J34
1481a721j905K940p01j283L058o61n35O97l33J380p60M84J230j294N95J301j864
1498F28K273m78o10J313j855J365O72j914K393r19j681K176n88n27J88j385K139
$$ y = [-626, 2350, -852, -1625, 844, -641, -563, -57, -1281, -181, -1590, -1961, -1181, -3261, -2498, -2047, -3572, -2743, -2490, -3270, -2688, -3257, -3462, -2627, -3613, -3735, -2330, -3232, -2529, -2486, -2372, -2031, -2821, -1286, -1226, -2434, -882, -1415, -2805, -188, 517, -1234, -416, 1265, 1888, 1112, 2269, 1829, 1367, 1584, 2113, 2145, 2203, 3289, 3799, 2496, 4212, 3076, 3211, 3227, 2717, 3832, 3853, 3466, 3629, 3443, 3334, 3192, 2992, 4079, 3551, 2031, 2473, 2052, 1373, 1303, 538, 670, 1532, 882, 600, 829, -994, -668, -1592, -1450, -1971, -1941, -1818, -2412, -3516, -584, -4296, -2424, -1525, -4977, -4270, -1946, -2816, -2722, -2490, -4262, -3598, -2932, -3900, -3223, -3319, -1266, -1926, -3426, -1855, -1721, -3626, -686, -1387, -2670, 388, -273, -808, -111, -444, 936, 176, 660, 1890, 596, 1191, 2492, 628, 2901, 2423, 1813, 3126, 1271, 2636, 3308, 1394, 3787, 2868, 1187, 3363, 2775, 2248, 2436, 1051, 3190]
1515C190l69j462J52k3k224L473j828n28k69j030N89K40j002P69j34j281J819
1532H2k156p45J631k210K084n82j601K099j165p69J171j813J181N07l95P28n39
1549b492L85N73j486J231J039k118K457J37j102J719j028O5J754o01J099j232
1565D00P93J809j837L91J083m43j57O44j85k13J634P98l008J507J82J63n30K24
1583C255N5n93M94O58k609J693p24m82Q28k129J83L76j147J387r29j670J448p79
1601f85L00K27j827J177j124Q23J05k924K105L09k135J557N6j045J065j205N15
1618b706k148K074o7j266J311N27p50l1J316k94j262K145M67j402R2P88o65J809
1636f2j099R81o28J554K97j389P65J310j324J359k7o07O32k75J562l48j010P75
$$ y = [3190, 2821, 1359, 1511, 1488, -736, 2737, 909, 381, 112, -918, -329, -89, -1091, -322, -456, -1737, 82, -2074, -2819, -1188, -3398, -1314, -1896, -3497, -1398, -2563, -3332, -2161, -3974, -2793, -2286, -2681, -1953, -2492, -2107, -1534, -3020, -1789, -750, -2868, -411, -274, -1376, 343, -685, -620, 1134, 533, 1632, 400, 1193, 3002, 1165, 1556, 2639, 2196, 2039, 2683, 2498, 2285, 3919, 4717, 1709, 3216, 3398, 3561, 3031, 3255, 3310, 2717, 3211, 3869, 1260, 2953, 2229, 1747, 2575, 446, 629, 1005, -142, 1245, 316, -1354, 94, -685, -385, -158, -1985, -808, -1932, -1109, -1004, -3928, -1823, -1514, -3649, -2092, -2036, -3081, -2016, -3221, -2706, -4854, -2780, -2847, -4113, -2802, -2275, -3025, -3056, -1740, -2034, -3296, -1151, -684, -2086, -1994, -1206, -1871, -62, -1161, -180, -808, 746, 1043, -346, 419, 1729, 405, 1764, 1737, 1130, 1762, 1487, 3049, 2701, 1691, 2466]
1654B466O14P7p7j210J177k9o08R5m05K22L94j316K05LQj35J67r01j47j32M06
1675H74q63J14j03o03K27p72M33r93J037K85k136N51P13j314O17l49l50O88l86
1694b330O46k8r59J576j128O30M26j328K353m18j514P56O13M81k07K8N7l34J492
1713H12L58p96N37L97k15P12j16M26M35Q0l47nM89l34p7R93j467Q57p6m57M99
1734B705m77n6j09l21J093k088J100m91o24K52l7k65n89o80Q3M28j63L08j838
1753a769R72M35j478K83n45m14R19j197L67p44l94J356o91o8Q32j650R49P79n90
1772b648k24J31M77K22Jn92M86l48P53J14J88R03p0N52ol5j93O03j06M80R67r12
1794G43P09M49p46J090J96j68L77j73m28K00N29q47K04P44k99m93J00Q9k28j01
$$ y = [2466, 3080, 3157, 3080, 1870, 3047, 3018, 2410, 2505, 2100, 2322, 2716, 1400, 1605, 1608, 1616, 1481, 1648, 747, 600, 468, 874, 11, 125, 22, -581, -354, -1126, -693, -1686, -649, -364, -2500, -1949, -1236, -2550, -1933, -2282, -2632, -1944, -2330, -1684, -1712, -2671, -1095, -2223, -1593, -1167, -2495, -142, -560, -2074, -1318, -705, -224, -431, -403, -346, -680, 812, 1170, 374, 911, 1308, 1093, 1805, 1689, 2115, 2550, 2630, 2283, 2278, 2767, 2433, 2356, 3349, 1882, 2739, 2663, 2206, 2705, 2228, 2172, 2063, 1742, 2835, 747, 1847, 1356, 732, 984, 947, 682, 93, -587, -504, -76, -239, 69, -1769, -797, -362, -1840, -1557, -2102, -2516, -1597, -2794, -2427, -3171, -3565, -2209, -2900, -2968, -2136, -3786, -2837, -2058, -2648, -2872, -2741, -2264, -2042, -2041, -2633, -2147, -2495, -1742, -1628, -1440, -537, -607, -55, -61, -96, -289, 314, 208, 688, 1655, 743, 1452, 1901, 1155, 2245, 2441, 2273, 2650, 2477, 2049, 2249, 2778, 1931, 2135, 2879, 2580, 2087, 2187, 2276, 2048, 1947]
1814A947M20j77j151Q08j94o19Q8N00j254l58N05l07J3l41N31m69kR4r9l79o71
1835a115k96p65Q59N98j463J056kr17L28k60O37m66L93j58j123J326l19K29O14
1854h44p83L81J091j412J106K43p08K77j64J609q25N80R92j239O18K52m42L35
1872A067M91l26J107m32n96R98o54Q38j80j28N58q94m65N01k22n80J089o48n41
1891I83N85q97K17L52j105N44k01j266M89o96J52n84M80Q68j428j117J661n23
1909a486j019l02k55R13l7p88J597n16n1J53j125Q74o12l0N63k41k83J774j223
1928b094M44L24p71J066o89J822r94r0J576l0o41L44N76p11R69M7M31m59j238
1947a18J089K171n03k99J121r67Q70m50j256J275k9l81j01j172K209j200j208
$$ y = [1947, 2367, 2190, 1039, 1847, 1653, 1034, 1122, 1622, 368, 10, 515, 208, 221, -120, 411, -58, -60, 34, -65, -444, -1115, -1411, -2176, -1317, -719, -2182, -1126, -1128, -2045, -1717, -1977, -1340, -1806, -1413, -1571, -2694, -1368, -1687, -1458, -844, -1627, -1246, -155, -1567, -461, -218, -926, -649, -813, 796, -29, 551, 1543, 304, 922, 1174, 732, 1067, 1558, 1232, 2339, 1907, 1311, 2309, 1655, 2493, 2313, 2185, 2743, 1849, 1384, 1885, 1663, 1083, 2172, 1524, 983, 1568, 671, 888, 1240, 135, 679, 478, -788, -299, -995, -843, -1427, -947, -79, -1507, -2624, -963, -1486, -2505, -2807, -3062, -2149, -2186, -2974, -1377, -1893, -1944, -1791, -2916, -2042, -2654, -2684, -2121, -2362, -2645, -871, -2094, -1650, -1326, -2097, -1031, -1720, 102, -892, -982, 594, 564, -77, 267, 843, 132, 1101, 1148, 1579, 1120, -118, 971, 3142, 2639, 2340, 3461, 2494, 3364, 2914, 1658, 2933, 2904, 2523, 2422, 1250, 3459, 2259, 1051]
1964A051R83o40Q38p76j317J072m52n53P46j027O33P73j548j16P71m05m78m71
1982i16j460J789n13p46P18n10J97j556J833m97K8r26L33O55o54O44k07N87O5
2001a136q05p4J095r73J055q99M98O62l45k45M37j0N07j08N1P04j448J898M17
2020A281j156J576j087J21J033q6o04N55N26l08j37j32J76O53j438M84j17m2Q30
2039B128m96m2P3j082M52O86m84j510P92m81Q37o43r77Q93m85j08j215M39j65
2058a388J24j54J066j318O18j229O80O66r78R44k32j024L13M07n2Q7j49P51j084
2077a952R19J46P5j33M84q63R95L91l85k62J286p0M18p70K0L12J12j14P74L09
2097A692n37K55N3M76l18J74P41l31n05J422j999K72O49r64O16k72L74J20k19
$$ y = [1051, 2034, 1394, 2232, 1456, 139, 1211, 759, 206, 952, -75, 558, 1331, -217, -333, 438, 33, -445, -916, -2376, -587, -1100, -1846, -1128, -1638, -1441, -2997, -1164, -1661, -1633, -2559, -2226, -1571, -2225, -1581, -1788, -1201, -1136, -1941, -2015, -920, -1893, -838, -1737, -1239, -577, -922, -1167, -730, -740, -233, -341, -290, 414, -1034, 864, 1281, 125, 1701, 614, 735, 1768, 1682, 1078, 1633, 2159, 1851, 1714, 1582, 1758, 2411, 973, 1457, 1340, 1298, 2128, 1632, 1590, 1663, 581, 1033, 1719, 1235, -275, 517, 36, 873, 230, -747, 146, -339, -447, -1662, -1223, -1388, -1264, -1418, -352, -1670, -1052, -2281, -1601, -935, -1913, -969, -1201, -2225, -1912, -1505, -1557, -1470, -1619, -868, -1952, -1033, -887, -812, -945, -461, -1324, -329, 62, -323, -585, 701, 631, 1049, 279, 299, 611, 723, 609, 1383, 1692, 1155, 1410, 1463, 1939, 1621, 1795, 2536, 2205, 1700, 3122, 1123, 1395, 2044, 1080, 1696, 1424, 1798, 1918, 1699]
2116A699q69j9R07m07j050j80J022j707O61L82m79r65J143q44j30j03l6l29k04
2135a508K0o03J1J05j0m21o8Q92n30P11j69p81Q20j008M41J68k52J129k18p61
2155b032M55J06J60Q64j51n09N06P1P0M0O16l07j29J328k02J32m92K83j99J149
2175A759j55J82m70N2N82l20l35R34r00q4O5L9m60k29N54L5M29q24N2N08j601
2196a87O48L93q21M3m43J56l20N7J05K29j134P95q44O92j9m26J37k78l34J99k23
2217a575N17m73m19Q6Q83k75K67j79j42L17p11J511j326Q41J345j341J65M90k53
2236b72M9P10j259N06J230j497N87J406j233R88l98r3J370j172N93J71n51K85
2254A420N45p85L73n32N86N79k12n29O47r33M86r26Q94o91q6K67P7j345R34k33
$$ y = [1699, 830, 811, 1718, 1311, 261, 81, 1103, -604, 57, 439, -40, -1005, 138, -706, -836, -939, -975, -1304, -1508, -1488, -2091, -2080, -1975, -1985, -2406, -2474, -1582, -2112, -1401, -1570, -2351, -1531, -2539, -2098, -1930, -2182, -1053, -1271, -2032, -1577, -1471, -1311, -447, -598, -1107, -601, -530, -460, -420, 196, -111, -240, 1088, 886, 1018, 526, 809, 610, 1759, 1604, 1786, 1316, 1368, 1950, 1630, 1295, 2229, 1329, 1245, 1310, 1349, 889, 660, 1214, 1249, 1678, 854, 906, 1414, -187, 461, 854, 33, 76, -367, -211, -531, -474, -369, -140, -1274, -479, -1323, -631, -650, -1076, -939, -1217, -1551, -1352, -1575, -1058, -1531, -1950, -1864, -981, -1256, -989, -1168, -1310, -993, -1704, -193, -1519, -678, 667, -674, -509, -19, -272, -223, 487, -772, -266, 964, -533, 54, 1460, 227, 1215, 817, 724, 2094, 922, 1515, 1686, 1135, 1420, 1965, 1180, 1553, 1021, 1607, 2186, 1974, 1445, 2092, 1159, 1645, 719, 1613, 922, 836, 1103, 1180, -165, 769, 536]
2274E36q36R28o27l60p32n4N01n74r25Q57K01L12m99o56J007j612K74J032l29
2293a556l17p6L14k59J278j560k7K13r3R90j105R98L01l44Q0P47j29K99l21J002
2313D35p23N6O99M96o28N86k04j75K87KJ006J86k004N84O36J104p49N22K05r25
2333A396o25P72N73n04Q30j502r70J211J10R49n58j116J36j23K91m24j100J067
2351D13j50q87O06O3L13j024l64P09k86J03j055P57m00p06J172K18j70j55j42
2370i85N26j465R51L60j640Q77Q6P41K50j85q16O40m11M04n23K186j465P1R14
2389E16l12J73q9j87K88L28J84K27J44o84J361q02o9J005k64k65J08K42p86N2
2409A170O92o85O9k77k58j35R22j79o50m47J249p00l40N17q88o8m1k54j9K03m72
$$ y = [536, -300, 628, 1, -359, -1091, -1145, -644, -1218, -2143, -1286, -1085, -773, -1272, -1928, -921, -2533, -2259, -1227, -1556, -1873, -1949, -1635, -1894, -616, -2176, -2203, -1990, -2083, -1093, -2198, -1200, -899, -1243, -1163, -416, -545, -246, -567, 435, -288, -232, 467, 963, 335, 921, 717, 542, 829, 831, 1837, 2023, 19, 603, 1239, 2343, 1594, 2116, 2321, 1396, 771, 1543, 2116, 1612, 2442, 940, -30, 1181, 1291, 2240, 1682, 566, 702, 579, 870, 446, -654, 413, 263, -624, -18, 45, 358, -666, -1030, -321, -607, -504, -1559, -802, -1202, -1908, -736, -518, -688, -843, -985, -459, -1924, -973, -613, -2253, -1376, -1290, -549, -299, -484, -1300, -660, -1071, -667, -1190, 996, -469, -398, 516, 204, 377, 288, 101, 389, 717, 901, 1128, 1272, 588, 1949, 1147, 1078, 2083, 1819, 1554, 1662, 1904, 1118, 1170, 1862, 1177, 1246, 969, 711, 576, 1498, 1319, 669, 222, 1471, 771, 431, 948, 60, -8, -49, -303, -322, -119, -591]
2430e91P5o7P76m06p85J63j93K53J17j166J71M12K56l86L36j347P83m77N6N04
2450a516L6q59J373M37q09R49j198M52M21K69M91m55j36k42J011K73M07p21N78
2469G61k13J42m2K53p77J221j100J029J639k450J220N97r33N08n24M99o65lJ843
2488C005j719LQ34j103K37N41q36m1K97j63r55m86R64P74j874N03L04r44K88q8
2508d59j117J228r3r87J121j064J85J334j762L27o95Q02L4l06m6l45N02L05r5
2527a131M2N86r81M20M49j49J83O74n96O36o71R3N60p52J214p47P68j60Q91j224
2547A05M34l04k45J462o08N20M45l47k96m16J167N5r63M40L49j423P39M14j063
2566D65J022k12p13Q09o33q90M26J80n95P98j699J473j292K85O45j803J547m21
$$ y = [-591, -516, -583, 193, -213, -998, -835, -1028, -775, -658, -1824, -1653, -1241, -985, -1371, -1035, -2382, -1599, -2076, -2020, -1516, -1480, -2339, -966, -529, -1338, -389, -1587, -1135, -714, -445, 46, -409, -545, -787, 224, 497, 904, 183, 761, 548, 690, 648, 901, 124, 1345, 245, 1274, 2913, 463, 1683, 2280, 1347, 1855, 1331, 1830, 1165, 1162, 3005, 1286, 1289, 2123, 1020, 1257, 1798, 962, 921, 1218, 1055, 100, -386, 578, 1352, -522, -19, 285, -659, -371, -459, -1576, -348, -441, -1428, -307, -1371, -1186, 148, -1614, -1287, -1982, -1180, -1146, -1452, -1498, -1843, -1341, -1036, -1131, -1089, -503, -1484, -1064, -615, -764, -581, 93, -503, 133, -538, -445, 115, -637, 577, -170, 598, 438, 1329, 105, 539, 235, -10, 1452, 844, 1364, 1809, 1462, 1166, 750, 1917, 1972, 1009, 1449, 1798, 375, 1114, 1528, 465, 1487, 1275, 562, 1371, 738, -152, 274, 454, -141, 657, -1042, 431, -861, -576, 69, -1734, -187, -608]
2584f08m52j18N74k80O41j429m8O06J76j06o88n5l4Q53P30r09q02M43O50k91P03
2605d44o45L63M93m82L67R10j070O73O85j148M38M22k40P03p54M5M43n1J015m76
2625A247J44R88o74N50k80p72M95l75R3J164j575J611n18j168O54j32n8m24L23
2644A293r4p2o14N57J90q91m91O53o14O09m94j008J041r27J64l70R1J410j216
2663g83m02J04n06j55M12J81L89n55r23J005J56K56K16r52J12J93j19K53J95L6
2683h87L33o98L04K93q97J258J4n67J303J35r64L2R79l49K91k76L45M06q24O45
2703H76L45J9n63k10R07k9n45N84q25J082n41l59J67K27K14n44k59k16oK87m03
2724B08K96o86j17R33j294L48J06n54K7m0J81o92K3L69M3p26J032j5m14O75r98
$$ y = [-608, -1060, -1178, -604, -884, -243, -1672, -1720, -1114, -938, -1044, -1732, -1787, -1821, -968, -238, -1147, -1949, -1506, -856, -1147, -444, -1089, -726, -233, -715, -348, 562, -508, 165, 850, -298, 140, 562, 322, 1025, 271, 316, 759, 708, 1723, 1247, 1391, 2379, 1705, 2255, 1975, 1203, 1698, 1323, 1416, 2580, 1005, 2616, 2098, 930, 1584, 1452, 1394, 970, 1293, 1199, 1127, 513, 1070, 1260, 369, -122, 531, -83, 526, 32, -976, 65, -862, -698, -1068, -977, 433, -783, -1185, -1081, -1587, -1742, -1330, -1149, -760, -1315, -2238, -1233, -1077, -821, -605, -1557, -1445, -1252, -1371, -1118, -923, -887, -554, -1252, -948, -655, -1552, -294, -280, -847, 456, 591, -373, -341, 638, 289, 580, 304, 649, 1055, 231, 876, 1221, 1240, 677, 467, 1374, 1345, 800, 1384, 559, 1641, 1100, 741, 908, 1135, 1349, 805, 546, 330, 324, 611, 208, 504, -182, -299, 634, -660, -312, -206, -760, -733, -773, -592, -1284, -1261, -892, -849, -1575, -543, -558, -972, -297, -1295]
2745a295J43j38k10K10O95o12P44o26J27Q1O33k60K6o94J259n28O09pm62O24l4
2766B85k96P17M16r41J85R87j379J168r9P59j005q82J979L66j600J402k51l31
2784A480k90j06O3j45K73M37j525J248l49l03m4l55m41j84J220r98R58m41K8J34
2804F60p23K93m99j43j54k01k13O5J56r62J322l30j128N22N8n20K05J30q5m4J29
2825a462M99o97Q05L30p77R0N59M1q11N57k23J130m02j83M80m44J226j015k5Q55
2845E33n82J345o22j9j04R2k22N19o74J022J11r66P45m00n02Q10j32m4K24l40
2865G94J002p97L21l93j12K04N75j133O70p44q57R72j066K8P23k89o72J660j198
2884c12j31O95j029J16N1r41P38k55j81Q29j368R61j42n86L39K70m93Q43j154
$$ y = [-1295, -1152, -1290, -1500, -1290, -595, -1207, -463, -1089, -962, -881, -248, -508, -482, -1176, 83, -445, 164, 157, -305, 319, 285, -11, 706, 1122, 181, 366, 1353, -26, 1142, 1043, 1802, 797, -85, 1894, 2260, 660, 2062, 1811, 1480, 1190, 1084, 1147, 1002, 1275, 1712, 187, 1435, 1086, 783, 739, 384, -57, -241, 979, -19, 939, 498, 526, 660, -63, 230, -269, -412, -566, -767, -980, -915, -759, -1721, -399, -729, -1857, -1335, -1277, -1797, -1592, -1462, -1547, -1591, -1462, -963, -1660, -855, -525, -1302, -1212, -653, -612, -1423, -866, -1089, 41, -361, -544, -64, -508, 718, -297, -322, 533, -49, 1296, 674, 655, 551, 643, 421, 940, 266, 1288, 1399, 433, 1178, 778, 276, 1086, 954, 910, 1134, 794, 1796, 999, 1320, 927, 815, 1019, 1594, 461, 1131, 387, -470, 502, -564, -536, 187, -102, -774, 886, -312, -443, 252, -777, -661, -610, -1551, -813, -1068, -1249, -420, -1788, -827, -969, -1555, -1216, -946, -1439, -596, -1750]
2903a750O65J23n96J089P4k10O2%K77N25q45J112k73j154J253L6L85R34j171n1
2923D85M75p85J203L88j057P53p30L68L71r4l45Q6O92k00o23j79P54m34N8o14
2943E72J43J5p0l88Q91n25J54J24j689J236p69l72J65Q16r86J32k86K80N67j394
2963a384Q45m70q08J591j247M05R90j579K8P85l70L40q14J09R44j131L41O66l33
2982a092l96P59q60J362k78p66J281k47M97j59k10l13J355m10k62J7j26O97j01
3001G48N68p71l13J162n55L52M30r32N32j9J26l86Q2J01l3N08j224o9R28O0m11
3022H84m4l25l22L60o9K41m24L40q46J019m35j327P59r56N40K62n11J16m1n87
3042a366R74j054L1Q66J15n99M5J14K53K60n67K70p55p4N74K48O54l28l46O39
$$ y = [-1750, -1085, -962, -1558, -469, -395, -605, -543, -543, -266, 259, -586, 526, 253, -901, 352, 388, 773, 1707, 536, 485, 960, 175, 1378, 1766, 709, 1462, 732, 1100, 1471, 1377, 1032, 1118, 1810, 1610, 987, 808, 1562, 1128, 1186, 572, 715, 730, 660, 272, 1163, 638, 792, 916, -773, 463, -306, -678, -513, 303, -683, -551, -837, -557, 10, -1384, -539, -1009, -1817, -226, -1473, -1068, -78, -1657, -1629, -844, -1214, -874, -1688, -1579, -635, -1766, -1425, -759, -1092, -1488, -729, -1589, -227, -505, -1271, 10, -237, 260, 101, -109, -422, 933, 523, 261, 278, 152, 849, 748, 1316, 545, 232, 1394, 839, 1191, 1621, 689, 1221, 1202, 1328, 942, 1024, 1125, 1092, 1600, 376, 307, 1235, 1295, 884, 840, 515, 193, 553, 484, 725, 301, 641, -205, 814, 379, -948, -189, -1145, -605, -343, -854, -738, -779, -1366, -392, -1446, -1415, -549, -434, -1033, -988, -874, -621, -361, -928, -658, -1413, -1487, -913, -665, -11, -339, -685, -46]
3062d6o81N85M14K14l67P05q16L71P9n83J051l96J6K75k12m38O64p1M65K02k4
3083A407n15l54J93P0K26m23J087m00M95r97R9J36o96K43M6l84O86p58Q37o73
3103C25l17l79k16K79p5l73L4j84p0n43P82m39R9j13p13K95J059m29j52N99p25
3124a256M81j56l5j3L81K49j054m56J674r84J100k9q58J759j141O3J97o82J505
3143G45o80J07Rp7l79R62K93M04J41J98j286Q47L80j398J103p67JJ470q70K54
3163A457j81L10J16o00l40L22L65k73j87Ok50k69K05n54k98j73M79j84K81j093
3183h61N12lq3l62M83j60j41k20O9rq82Q86Q5n54j37Q51n39j53N6j10O03n33j81
3206a383J555j722J318j00j030Q34L39j87m3l00M52L07m34P29l46j38J370j160
$$ y = [-46, -727, -142, 272, 486, 119, 824, 8, 379, 458, -125, 926, 530, 546, 821, 609, 171, 835, 764, 1229, 1431, 1407, 892, 538, 731, 801, 1027, 604, 1691, 1291, 1786, 789, 888, 1024, 328, 571, 617, 233, 919, 161, 998, 325, 8, -371, -587, -308, -383, -756, -722, -906, -976, -1519, -737, -1176, -1077, -1190, -1903, -1608, -549, -978, -1130, -531, -1256, -775, -931, -966, -979, -598, -349, -1403, -1859, -185, -1169, -69, -98, -956, 803, -338, -275, -78, -760, 745, 65, 172, 181, 104, -275, 687, 980, 1384, 1525, 1723, 437, 1284, 1664, 266, 1369, 602, 603, 2073, 1203, 1457, 1276, 1586, 1702, 1102, 762, 1084, 1449, 1176, 989, 995, 745, 476, 681, 127, -171, -344, 135, -49, 232, -861, -349, -352, -435, -797, -314, -474, -615, -835, -766, -775, -1657, -771, -686, -1240, -1377, -526, -1065, -1218, -1162, -1272, -669, -1202, -1383, 172, -1550, -232, -332, -1362, -528, -189, -376, -419, -719, -267, 40, -394, 335, -11, -149, 1221, 61]
3224F1K48J062j076K98j083Q65M75P75r92K60r50O58J379j164L74L30j228Q10
3242A102p64k36M60j48Q3l77R54p1o45k33l38k10m0J68K78O0o55k58J79p36J279
3263a48p99l87L63L04q48J338j310n33J285p58N96m22m92J88O22j18M02L68o63
3282a012J12N67n79o67J884j26m87l9J129q83L41r6r4J24M04M4J52K64l84P36
3302A390k87q1O9l31O79j22j65R81j000M29K3j46j00q72O64k56Q42p73q4m11N41
3323I90k11j026N42M86o65K43j069L67L20j87m9P66j285L00J24n09M22k58K80
3342d19q7q62R32q81K06q63N49q5M13j7K91m63j42Q17P9n15q24O49K91P52l84
3363e63q0P9R36q47M1n85R84N11K00q39M55J025j085O00o69K03k70Q13l23M09
$$ y = [61, 309, 1371, 295, 593, -490, 375, 850, 1625, 633, 893, -57, 601, 1980, 816, 1190, 1520, 292, 1102, 338, 102, 562, 414, 497, 120, 1074, 1003, 358, 125, -213, -423, -463, -295, -17, 43, -612, -870, -691, -1427, -148, -947, -1334, -971, -667, -1515, -177, -1487, -2020, -735, -1493, -897, -1319, -1811, -1623, -1001, -1119, -717, -349, -1012, -900, -333, -912, -1579, 305, 179, -308, -347, 782, -101, 240, 144, 50, 174, 578, 622, 774, 1038, 654, 1390, 1103, 1022, 1091, 760, 1439, 1317, 1152, 2133, 1133, 1562, 1585, 1439, 1339, 467, 1131, 875, 1717, 944, 860, 449, 990, 779, -247, 295, 781, 116, 359, -710, -343, -23, -210, -259, 507, -778, -478, -354, -863, -441, -699, -419, -506, -1368, -436, -1317, -1111, -1974, -1425, -1510, -1097, -1114, -823, -1286, -1428, -611, -532, -1047, -1871, -1222, -931, -179, -563, -643, -564, 372, -475, -434, -1019, -35, 476, 676, -163, 292, 1317, 232, 832, 163, 366, 96, 909, 586, 995]
3383I95K48K34J3m92o2K57m49l18Q51o06M95o57l68m1O78r76R86r73R02j88p20
3404a91J175j371P39J65n51n83K86J46q2K98j77p43L51j035O56L6l63L24k69L40
3424h49l60L66n28K04m6K14J06R87m93L34R52j650R3L42o42Q77O70j314K007j351
3444h1k27P97j646J263Q53k73J0m72O86j55L01L51m14o46K35L56N21j245P77o84
3464C07J134j059R0P89q09J03R1k94m26P87O3k15j003N50p2N94p01K64m38J45
3484a00k60r9l93M41l66O0l91K58p9k88j85O27k24n46R0O9j59O68j61N62O4r12
3506a324O36l87N44n96Q85n74M22k15O30m40k95m4R58M2o08J76J097q35J84j009
3526g53Q21Q76m83k54M74k20J57J88r0O97o20L81q02q5J335k61q30J17k08MJ58
$$ y = [995, 1243, 1477, 1490, 998, 936, 1193, 744, 426, 1277, 671, 1166, 509, 141, 100, 778, -198, 788, -185, 717, 529, -191, 984, -387, 352, 517, -34, -617, -331, -185, -267, 31, -146, -889, -538, -1573, -917, -881, -1244, -920, -1189, -849, -1209, -843, -1371, -1167, -1213, -999, -893, 94, -399, -65, 887, -763, -670, -328, -970, -93, 577, -737, 1270, -81, -308, 489, -1157, 106, 959, 686, 696, 224, 910, 755, 1056, 1407, 993, 347, 582, 938, 1459, 214, 991, 307, 1441, 382, 472, 1261, 452, 555, 646, 352, -74, 713, 776, 561, -442, 108, 36, 630, -71, 193, -245, -100, -360, -459, -852, -411, -777, -717, -1108, -850, -929, -1217, -1402, -775, -999, -1545, -1455, -1386, -1545, -877, -1038, -476, -412, -1324, -688, -1075, -531, -1127, -242, -816, -394, -609, 21, -419, -714, -758, 200, 242, -366, -190, 907, 72, 256, -753, 68, 944, 461, 207, 681, 461, 618, 806, 716, 1413, 793, 1174, 372, 287, 1622, 1361, 531, 648, 440, 444, 602]
3547F02o66Q40O86j256J64k66p7R22j451L60K62K65M1k76m75k61N56j000N94m00
3567h36j75j54N60J61j252M07Q35m37M10n46k04n1R60k65N17p72L7O91m61J62
3587d13L24M5O81l22j477J659M0m77j27P01q1L1m35M50k17R69q23l1N50K79q94
3608D32R9N4L45j03r7m9L58M8K14k53k97N03p01L24n5l04j11J53l78N90m04j245
3630h77N05P2m29j8K59j12j23M5o08J796k013Q71n48j59J030l43p34n50J082M8
3650h06mj124J163j80j16O90M05j515P34q32N74N26k31M90j13L74j51j55R14l51
3670B92m04J10P5K2M18M81o44Q5Q05j771J179O84k80j44m26P79j24j05k20M91
3690A303Q47j390L72M2q55j01M82K56P12k36j096k7n93J99J135n02k71n9N57l45
$$ y = [602, -64, 776, 1462, 206, 370, 104, 27, 949, -502, -142, 120, 385, 426, 150, -325, -586, -30, -1030, -436, -836, -1011, -1165, -605, -444, -1696, -1289, -454, -891, -481, -1027, -1231, -1282, -322, -587, -70, -842, -805, -114, -575, -413, -89, -44, 637, 315, -1162, 497, 537, 60, -67, 634, 553, 584, 149, 599, 382, 1351, 528, 497, 1047, 1326, 432, 531, 585, 930, 827, 730, 681, 1039, 1087, 1301, 1048, 751, 1254, 553, 877, 822, 518, 407, 560, 182, 772, 368, -877, -372, -300, -729, -747, -488, -600, -723, -678, -1286, 510, -1503, -632, -1180, -1339, -309, -652, -1386, -1936, -854, -806, -810, -1934, -771, -951, -1067, -377, 28, -1487, -753, -1585, -1011, -485, -716, -226, -339, 35, -116, -271, 643, 292, -112, -2, 73, 95, 513, 994, 350, 435, 1240, -531, 648, 1332, 1052, 908, 482, 1261, 1137, 1032, 812, 1303, 2150, 760, 1132, 1174, 319, 218, 700, 956, 1668, 1432, 336, 309, -284, -85, 1050, 548, 277, 218, 775, 430]
3710D30q43P39o37M0j64j96k94R81l61q55N59L93q88o6N75j80K36n63O67j02k62
3731g91J25O8o37j86Q13n70r5M77M20N11j69Mp99P13R37o25J82M15m17P13l9j155
3753a05Q46J04k43N79n52Q06q54j4J025q63jk12J41O63m28l0p7j89r07M69L92
3774E50J15n63K29P6j63k05J13m6q4l38n02l1O43j43n10o63R08N8m08K10n54M46
3796h62k%j06N0k18M00m03q0M72K55o00K80J46j39O33k09k19J154m64l57J15n6
3818b10O82r6n24O51k41O5J098o43j54R91j021N04n38L15o22j6K40Q31m79M88
3838A321m81k2O29n59N46m41Q1j57j10m08J08L38q79J072j353O0J173o73j02K09
3858C52o38P09m86k71K07n00JL45j65j68N2m32K03P27k62j380J046Q8j80m38O56
$$ y = [430, -413, 326, -311, -271, -435, -631, -925, 56, -305, -1160, -601, -208, -1096, -1162, -587, -767, -531, -1094, -427, -529, -791, -666, -598, -1235, -1421, -608, -1178, -1273, -796, -376, 135, -34, -30, -829, -116, 821, 196, 378, 793, 376, 1089, 1050, -105, 741, 845, 602, 1181, 629, 1435, 581, 567, 1592, 729, 728, 516, 657, 1320, 892, 862, 785, 596, -311, 158, 550, 665, 102, 331, 407, 244, 39, 152, 106, 22, -316, -818, -849, -206, -349, -859, -1522, -614, -556, -964, -754, -1308, -862, -864, -864, -970, -920, -1138, -738, -1141, -1221, -749, -494, -1094, -814, -668, -807, -174, -383, -602, 552, 88, -269, -154, -210, 472, 376, -148, 503, 262, 327, 1425, 782, 628, 1619, 598, 1102, 564, 879, 257, 241, 481, 1312, 833, 1321, 840, 818, 1447, 888, 1434, 993, 1074, 917, 807, 399, 507, 845, -34, 1038, -315, -255, 918, 245, 143, 352, -286, 423, -63, -334, -127, -627, -626, -281, -446, -614, -562, -994, -791, -64, -326, -1706, -660, -572, -752, -1190, -534]
3879e34p84M18M36r61P91K38J91j09j173N57P89J89k0m29n26P84R3J96o7K7pM63
3901E62J28p96J060J083j460J18K47K09k015Q73K27L88P3K57p75K60K60J27o35
3920A91q98J063k73M29l17P33j289L27j24j16M88J02o31k9O22q06k40L01o2j70
3940f99M97q41K73n10J60O00k91J10P05q57M36q0n06O02j195M20O26j82O60l54
3960d26M23m5o2K51o23N37k16J6O9m61J110L80o83J22n30N46n39N42J85j33N48
3981A011J9M47m71l25j48L94n23J36J087p39p16O83M85r11L08K11r2Ol94K39n89
4002A18L37k08l87L86j97k37M92n75J19j211O09J308j239l43K47L65l67q80Q56
4021h07l02N50P13q73K13j97n22M36K91p23L98J94M35j76o18Q66j147J304k48
$$ y = [-534, -1318, -900, -464, -1425, -634, -396, -205, -314, -1487, -930, -141, 48, 28, -401, -927, -143, -50, 146, 79, 106, 99, 562, 690, -106, 954, 2037, 577, 695, 942, 1151, -864, 9, 236, 624, 697, 954, 179, 439, 699, 826, 191, -707, 356, 83, 512, 195, 928, -361, -34, -158, -274, 214, 316, -315, -344, 278, -528, -768, -467, -529, -699, -202, -1043, -770, -1280, -1120, -520, -811, -701, 4, -853, -417, -497, -1003, -401, -1596, -1176, -550, -732, -72, -426, -3, -48, -110, 141, -482, 55, -161, -145, -76, -537, 573, 953, 270, 392, -138, 408, -131, 411, 596, 463, 1011, 1030, 1477, 1006, 681, 533, 927, 404, 540, 1627, 888, 172, 855, 1340, 429, 737, 948, 856, 862, 468, 707, 118, 455, 247, -140, 246, 49, -188, 304, -271, -152, -1363, -754, 554, -685, -1028, -781, -416, -783, -1663, -807, -1109, -559, 154, -719, -506, -703, -1225, -789, -498, -1221, -823, -629, -194, -370, -988, -122, -1269, 35, -213]
4040b13o02M98n1n53O89j33P57l72l93M82K64m10k8J096r23J21N61m29J035r19
4060D77r67J709m44j67L11k78O3J59j78PK35o39M91j119R20j77K13l72n30M15
4080A29M82j009j08N18k09K76k59J74l76J03M93n30L12q20K2j62k30P23j71L18
4100c24q47R39j01J85k83k1Q59j360j43N37M50j10J28p20J76L87L01M40o21M84
4120C56L97n03p04J102o85P58p82L95J26O00k29N17p02M40m35j245M33R18K21
4139I78m73J343j705L60O4o7K84K73o63M65j003Q1O44J43j109N32q3m78N6L0J83
4160a45k30j7Ml91j67J49O82J50j30p03l09rK35l92J41K01K12p1K35J20m03M09
4182d29l97M13j2K6J35q45R74j120K91Q86k91K19p36N80M50L81k36K35Q4q17Q60
$$ y = [-213, -815, -317, -368, -921, -232, -365, 392, 20, -373, 109, 373, -37, -65, 1031, 108, 229, 790, 361, 1396, 477, -490, 1219, 775, 608, 919, 641, 704, 863, 685, 692, 927, 288, 779, -340, 580, 403, 616, 244, -286, 129, 611, -398, -506, 12, -197, 79, -180, -6, -382, -279, 214, -316, -4, -824, -802, -964, -1194, -471, -642, -324, -1171, -232, -333, -148, -431, -452, 407, -953, -1096, -559, -109, -219, -91, -811, -635, -248, 53, 493, -128, 356, 753, 250, -454, 648, -37, 721, -61, 334, 460, 1060, 831, 1348, 646, 1086, 651, -594, -161, 757, 978, 505, 1848, 143, 503, 567, 500, 784, 1057, 394, 859, -144, -63, 581, 724, -385, 147, 64, -414, -358, -328, -145, -375, -392, -388, -779, -946, -797, -115, 35, -95, -798, -1107, -1116, -881, -1273, -1132, -931, -719, -790, -555, -435, -838, -429, -826, -413, -425, -399, -264, -1109, -135, -1255, -964, -78, -369, -150, -886, -306, 144, 525, 289, 524, 608, -209, 651]
4203F51K49r5j50k70o05Q94n73P42j83L64j86o51K34N55j43o5L61r0J45p78O9
4224D75K08o4J03l53k73J87j55J89j60O38l16k02k93J78k70p40J31M6J323p22
4244g0m28J54Q3j58m61j41P17J16r41K59P08m3k11K66n69N40n08o8L94M85L25
4265D49k75k67p01N97P20m81j5M23l34J33k27J31Q06m74M2J194r63J54j95j87
4285E30Q48o15j99n82J242l73l57j01m09N10P84j236J025k43j56l56L3J88r82
4304d49M78L41l84n45L18K48l73J28q57P86N16m73o87L24M24m76J65k6m58M75
4324e25r54R30n79L05P68j582N30j0J26P95n03o0J9R6L50k28n9M82j63O64k31
4345A71l35N09p26M06J01P0N14k58l41J050p72L96l20M42k49K84L83r18K1O09
$$ y = [651, 900, 805, 655, 385, -220, 674, 101, 843, 660, 1024, 838, 187, 421, 976, 833, 768, 1129, 1039, 1184, 406, 475, 683, 619, 722, 369, 96, 283, 128, 317, 157, 795, 479, 277, -16, 162, -108, -848, -717, -671, 652, -70, -498, -344, -261, -419, -880, -1021, -304, -188, -1129, -870, -162, -205, -416, -150, -719, -179, -687, -755, -361, 124, 449, 174, -93, -794, -197, 523, 42, 27, 450, 116, 249, 22, 153, 959, 485, 527, 1721, 758, 912, 717, 530, 1378, 763, 564, -18, 1224, 851, 494, 393, -16, 494, 1278, 42, 1067, 824, 668, 312, 345, 533, -449, 29, 370, -14, -559, -241, 7, -366, -238, -1095, -309, 207, -266, -953, -629, -205, -681, -516, -542, -1000, -525, -1479, -549, -1128, -823, -55, -1637, -1107, -1117, -991, -196, -699, -759, -740, -644, -294, -522, -581, -99, -262, 402, 171, -164, 345, -381, 25, 126, 196, 710, 452, 111, 1161, 389, 785, 465, 907, 658, 942, 1325, 407, 428, 1037]
4365A037n31m2Q94o64j95j66QL25l49PP78m77m17J15r2j44K01k0j57L35q13j68
4387e35O2L46p07K47N01j81n63O56p47L17n43O75K37r09L8M61j37O39m26m12L23
4408f58K63L49j39l38L00j233Q75M6N79j94J19l04N82p77N28M8N25j23o66Q03
4428E85n70K89o00O49k58M93k61L46N99o04K20k83p54O98L07q97j49R10j39m1
4448E40p99J574j214o8N1J04m05r7M51p9J76M18p08N12l16n36L30p16N95K2m96
4469f61L04N89r94K23J4l46O33q9O9R02o78k45k86L28m46J60Q18J0q01O61o83
4490e18N23j552J123J037o48k03P78N82L37j79m84J27L77q42M44j37q23L86M84
4509H12o33l4J591j420L80J60k13J76r72J786j566M47N16r21P42L4k59q09J106
$$ y = [1037, 506, 464, 1358, 694, 499, 333, 341, 666, 317, 324, 1102, 625, 208, 323, 231, 87, 288, 268, 111, 446, -367, -535, -473, -127, -834, -587, -86, -267, -830, -174, -921, -604, -1147, -472, -235, -1144, -1106, -645, -782, -143, -569, -981, -658, -395, -46, -185, -523, -223, -1456, -581, -535, 44, -150, -31, -335, 247, -530, -2, 46, 571, 448, -218, 585, 15, 304, -296, 353, 95, 588, 327, 673, 1272, 668, 888, 605, -149, 549, 856, -41, -190, 720, 581, 540, -259, 1315, 101, 33, 84, 188, -217, -314, 137, 58, 234, 652, -56, 456, 140, -396, -66, -782, -187, -165, -661, -357, 232, -762, -539, -525, -871, -238, -327, -258, 644, -34, -279, -565, -237, -683, -523, 295, 305, -496, 165, -518, 5, -1547, -424, 613, -35, -238, 540, 1122, 1459, 1280, 796, 923, 1300, 458, 902, 765, -58, 328, 812, 179, 145, 1736, 316, 696, 856, 643, 819, -153, 1633, 67, 514, 1030, 109, 851, 885, 626, -183, 923]
4528I23q02J169p07k42J03R8L52j101L92j401P46p35J261n93J88k40j05O61n93
4547f26O7J58pO37j100M45p61L84L68k39O68k71l25K94Q62k67o58No2K75M70j96
4569A21p67O68k36J162o87R63j092j15N65p09j64J103j15r57J231n71j47M79L
4588G35N34J03j145J1N12m29L34L02o03j8K63j921J663J97P76k019p2Q87m01L37
4608D6l34N71n84O0j118L3J337r15J968k508j45J704l40j95p47J199p46r42J401
4627b55j215R20j00M04K60M56p63q15L49q2K23k6L64q19J297n52O71r18P2Q15
4647B86K6L91L42o64L14j060n8Q94j44k74L52M30n48J292j382M61Q3R5k4l80j74
4668B58L30j43J08k15J59j02R55n06j014P0P76p8j20J10r71K52j287J096L22r44
$$ y = [923, 121, 1290, 583, 341, 444, 542, 894, -207, 185, -1216, -470, -1205, 56, -537, -349, -589, -694, -33, -626, -559, -401, -408, 229, -871, -426, -1187, -803, -435, -674, -6, -277, -602, -308, 554, 287, -371, -366, -428, -153, 317, 121, -646, 22, -214, 948, 261, 1224, 132, 17, 582, -127, -291, 812, 697, -260, 971, 400, 253, 732, 735, 1269, 1372, 227, 238, 750, 321, 655, 957, 354, 336, 599, -1322, 341, 538, 1314, -705, -777, 110, -291, 46, -288, 283, -301, -241, -1359, -1326, 11, -904, 1064, -1444, -1589, 115, -225, -420, -1167, 32, -714, -1656, -255, -1470, -550, -650, -246, 14, 470, -293, -1108, -759, -841, -618, -644, -280, -1099, 198, -354, 317, -601, -529, 286, 312, 703, 1045, 381, 695, -365, -423, 471, 327, 53, 405, 835, 287, 1579, 197, 658, 741, 836, 812, 432, 258, 588, 445, 553, 338, 497, 395, 1350, 844, -170, -100, 676, 598, 478, 588, -383, -131, -1418, -322, 0, -944]
4688i44M79n3j05N26K46m5p39J09L29M56p39k47O09k3o48L44q07J016K47n4j546
4709a589J384p62N37j15J22P40q79J096j834Q70J41n29J040M55o13L50j38j596
4727a320J002O5J217k090J547o8o95R30P0O90m17m78r2Q8j40k52O43O92j282Q45
4747I55M85n27l09m64K98M3M0R2O2q94J18m20Q41m19q24L05Q44j300N69m24J03
4768h26L82l71M80J65k29l45Q08m6p83M60n85R49r11J1J60K78K22l31j9M69n48
4789f10P39l22Q4O17m60l13Q83m92j94N65p95p0J034Q3k05n6J08Ll25L56k4l35
4811B71K51N03P0j345P08O20o45j71Q39o42J24K92r40P8J92J40p96J107m42o48
4831d34K81O1L41M55j346P07n98m52P32l22LK25P87j464P21N81j305Q76o09L07
$$ y = [-944, -465, -518, -623, -97, 149, 104, -635, -526, -197, 259, -480, -727, -118, -141, -789, -445, -1252, -236, 11, -43, -1589, -205, -967, -430, -545, -423, 317, -562, 534, -1300, -430, -289, -818, 222, 677, 64, 414, 276, -1320, -318, -253, 964, -1126, 421, 353, -342, 588, 658, 1348, 931, 453, 361, 449, 309, 57, 700, 1392, 110, 955, 1440, 913, 604, 140, 438, 481, 521, 613, 675, -219, -101, -521, 320, -99, -923, -618, 226, -1074, -505, -929, -826, -444, -815, -335, -170, -399, -744, 64, 18, -765, -305, -890, 59, -852, -841, -681, -403, -181, -512, -531, -62, -610, 129, -193, -109, 508, 48, -265, 618, 126, -68, 497, -298, -368, 666, 749, 544, 488, 596, 599, 274, 630, 606, 271, 522, 1025, 1095, -250, 458, 1078, 433, 262, 1101, 459, 583, 875, -65, 13, 205, 345, -451, 656, 214, -434, -153, -92, 249, 704, -642, 65, -533, -985, -253, -575, -572, -347, 440, -1024, -303, 278, -1027, -151, -760, -453]
4851d53L61q35M08m37j50L09P24q02L87j84l79P54p71K08R21m00j90N8N23O62
4871G14l23o80N29L7j67j45K69O13o84j75m70J209n74P32p88m95R25n1k98L7P94
4892A009m11K70K07l35p06j9M56L44j19l7p97M83J32M19q54L69p26P97k13O4K56
4913E89m94j059J101K28p10P09l07k97j35L3N31m81l11J118q40m78K02j39L14
4932d26K19k23q61R16k4N6R7L99p3J6o76J106o83ON24p70O48l85M98k12j31K5
4954D6O79m46k78K39L48Q2j88J64o70L34l5N75j93j54J054n32r64M5m56J24L51
4975A25N05J4k58K73p86k43M59L41q0n66O50o12m13K41M68n15r2K66j47L00k65
4996c35p60N56K32K70k35O0j72o45J69j11P46p89L08L44l32L53q1O10l71N8k64
$$ y = [-453, -92, -927, -519, -956, -1106, -797, -73, -875, -488, -672, -1051, -297, -1068, -860, 61, -339, -529, -471, 52, 714, 391, -289, 240, 277, 110, -35, 234, 847, 163, -12, -482, 727, 153, 885, 97, -398, 527, 476, 178, 215, 1009, 598, 868, 1075, 740, 34, 15, 471, 815, 696, 659, -138, 345, 477, 896, 42, 411, -315, 482, 269, 333, 589, 95, -964, 137, 365, -345, 364, 57, -240, -375, -342, 189, -292, -603, 515, -325, -803, -601, -740, -426, -207, -430, -1291, -375, -399, -343, -246, 153, 80, 96, -580, 526, -157, -151, 373, -397, 251, -134, 364, 152, 21, 46, 725, 279, 1, 240, 588, 670, 482, 646, -24, 310, 275, 850, 657, 503, 1557, 1025, 61, 106, -350, -226, 125, 630, 644, 386, 659, -127, -370, 89, 430, 350, -216, 434, -178, -591, -350, 118, -397, -489, -223, -370, -70, -335, -1095, -539, -307, -37, -272, -212, -384, -1029, -860, -971, -225, -1014, -706, -362, -694, -341, -422, 188, -183, -125, -389]
5017c89r2r6J89M23j45L79K10l9n20r26J619k92P3l8L52n81M97M92o79K90j25
5038F02K08j1m14M13m5l82K28o39M02n52J074K16m88l47L00j40K11m19K55l18
5058A54j15K63l07O2J36j60M4K62L07j50q91O9L82k45O20q41m85M72K2j14K14
5079c01o76Q73n88R9J069q76m32K68L62m12k24R09q70O68j86R8K96p46R01o76
5099d44j43k28J215j82O5R88j203N73o51q2O67j19K39m85J84N36j371J009q60
5118b92J001K22r26j28K0M67q1M40o60j31M95P2l08kk55q9P05n81j29Q38n77L02
5140D03j067O69o48m9l99N91K1m20O63J6k5m72k14M90L92l49m01M73n57O82l34
5161e35j11N95p46M93o8k62L77K35p56M03N51l01J60P26j241Q16n31K3L69r3j46
$$ y = [-389, -481, -577, -388, 35, -110, 269, 479, 440, -80, -1006, 613, 321, 394, 356, 708, 127, 624, 1116, 437, 727, 602, 810, 799, 385, 798, 753, 371, 599, -40, 362, -190, 884, 1100, 612, 265, 565, 425, 636, 217, 472, 154, 39, 302, -5, 57, 193, 33, 77, 339, 646, 496, -395, -326, 56, -189, 431, -410, -895, -423, -401, -515, -301, -977, -104, -692, -593, 476, -400, -832, -564, -202, -614, -838, 71, -799, -131, -317, -219, 77, -669, 232, -444, -587, -815, 400, 218, 283, 1271, 68, 641, -10, -92, 575, 456, 695, 210, 394, 930, -441, 568, -292, 709, 931, 5, -123, -103, 364, 283, 723, 63, -68, 427, 499, 191, 189, -66, -155, 550, -31, -160, 678, 101, 403, -664, 5, -643, -692, -1091, -500, -479, -899, -236, -220, -245, -717, -931, -441, -49, -398, -799, -326, -883, -201, -535, -646, -51, -797, -304, -372, -634, -257, -22, -778, -375, 176, -125, 35, 761, -480, 336, -195, -172, 197, 104, -42]
5182d2L14n43P76M27p51O0O2K48o4N0M46n61LK26q96M72J81l0N52n77O82j76q07
5205E2P35o74J40m16j78j91J53L77N3O9j0m52J64L22n71M4K43K22o20m05P32j06
5227c17m92O16m07k64n49R12J97m95Q54j90n19j88J248r35k53O49L35p46J96K1
5247c27P38m86On4k73K44J34j42M56n10L53j25q5K66n62R04n72R1P5j84P83J20
5269H50r09L15n13N7J49J1K33k03L12k76L0m79P73N15o02k58nK16p44n89R61L0
5291a26k76N05Q3m71M99r01K45p05M45k13m25J75J70R74R5n93m09O4N22p7J62
5312b57o9K28M54j025L58Q02q60O00o52M15P24n82m38L45O14m65j13K53K4n39
5332a83M15q4N81l74P23o44R3j80n03Q59k17M10N60j592k07J099k93j63P7j31
$$ y = [-42, 272, -271, 505, 932, 181, 241, 303, 551, 487, 537, 983, 422, 425, 651, -245, 227, 408, 378, 930, 353, 1035, 859, 52, 787, 113, 253, -163, -341, -532, -379, -2, 51, 120, 110, -342, -178, 144, -427, -383, -140, 82, -538, -943, -211, -317, -809, -193, -600, -864, -1413, -501, -304, -799, 55, -135, -654, -842, 406, -529, -782, -133, 202, -544, -348, -327, 411, -75, -69, -123, -396, -152, -18, -160, 296, -214, 139, 14, -71, 195, -367, 537, -35, 56, 131, -53, 730, 850, -59, 256, -257, -200, -51, -40, 193, -10, 302, 26, 56, -423, 350, 865, 263, 5, 0, 216, -528, -1117, -156, -126, -402, 103, 186, -285, 214, -687, -442, -1147, -702, -915, -1340, -1165, -995, -21, 74, -519, -928, -864, -342, -419, -257, -326, -98, 356, -669, -311, 491, -369, 231, -421, -6, 718, 136, -302, 43, 657, 192, 79, 332, 356, -183, 232, 148, 729, 355, 1078, 434, 527, 347, -156, 703, 486, 896, 1456, -136, -343, 756, 463, 300, 377, 246]
5352B46j28j23P3n0O29p61n53L04r2P88L0k28J98q69p0O54j01j76K26L71m00j005
5374a037m7O77J97r93J819j689J447q14k89k81M24M9L81j91K95o58l5N11K07l42
5394c69L90l41P60p15k30O66k10J67L18m78l67M91k04J47q2O17n81M90m48J72
5414A93RN97n25O18q86J44L1K78L65q06J072n67m10J38l30L4Q87j19j498J070
5434B95r8J080j011j94l14P15j042P65q70O24JP2M1o47R57j124Q00o27j50M13
5454c14J83L37j063P46m07N3Q04q27j65J006q32O29p48L03L32m73R37k57J37m53
5474g2l65L38K88q63J395j177P13k97N23r8O25o79L45PJ99l6j066P46M01l88M07
5495I46q42L33n28O88J66o85K84J51l96l9MN39m76o92O29q5O51o61m17J50K92
$$ y = [246, 118, -5, 68, 18, 647, -114, -667, -363, -455, 333, 363, 135, 333, -536, -606, 48, -53, -229, -3, 368, -32, -1037, -1084, -407, -210, -1203, 616, -1073, 374, -440, -729, -1010, -586, -537, -156, -347, -52, -710, -745, -234, -27, -369, 21, -320, 440, -275, -505, 161, -49, 118, 436, -42, -409, 82, -122, 25, -57, 560, -21, 469, 21, 193, 202, 799, 274, 892, 6, 150, 181, 459, 824, 18, 1090, 523, 113, 251, -79, -45, 842, 723, -775, 295, 197, 1277, 266, 72, -242, 473, -569, 196, -674, -50, -49, 23, 64, -583, 374, -750, 50, -577, -727, -314, -131, 206, -857, -111, -518, -465, 339, -488, -653, 353, -479, 150, -598, -295, 37, -436, 501, 244, 381, -72, -437, -99, 189, -674, 721, -456, 257, -40, 483, 385, 1010, 331, 676, 683, 882, 846, -220, 526, 927, 539, 946, 104, 437, -91, 597, 763, 78, 362, 513, 117, 78, 82, 621, 145, -547, 82, -3, 648, -13, -430, -280, 12]
5516A2K02p37n2K06p31P36r5J96K21m71K12p5O2n96M52M30p71J373j059J46j57
5537d96J184j145p79J723n05O62m21q82K18M52M19q76O06m07J533j178p1l38M30
5556A29N16J45j192MJ21P79J7P39p43o30J185n65m80L91m10L65l54k74J104m43
5576D04m20J429j016K59m51n9N05l03p48M77p26J086o72m6N88l94n2J57o47M22
5596b07m78K16j7k4M70m1p71n19N21J092j079K81r1L62r44J361J023j018k79m87
5616f29P98l52j11L34l8m78K26m94J497k57j74L49r51M82M9N73j018J11j91J132
5636H58l97N3j91j51PJ47m6J043r67k36r94J706q38J177j256M46j70Q5M09j116
5656d31N55n41J085o36J07o27J015k10l15M9n72N68o00m46P47r39P69K09l59l70
$$ y = [12, 214, -523, -575, -369, -1100, -364, -459, -263, -42, -513, -301, -376, -314, -910, -458, -28, -799, 574, -485, -339, -496, 688, -457, -1236, 487, -18, 644, 223, -659, -441, 11, 430, -446, 160, -247, 1286, 108, 37, -301, 129, 645, 790, -402, -398, -277, 502, 519, 1258, 515, -115, 1070, 505, 25, 416, 6, 371, 17, -257, 847, 404, -16, 1413, 397, 656, 205, 146, 651, 348, -400, 77, -649, 437, -235, -281, 307, -87, -139, 18, -629, -207, -685, -469, -486, -510, -40, -81, -852, -1371, -850, 242, -837, -556, -647, -285, -1229, 132, 1155, 137, -142, -629, 169, -183, -294, 40, 2, -476, -250, -744, 753, 496, 322, 671, -280, 202, 251, 824, -194, -83, -274, 858, 461, 514, 323, 172, 179, 326, 280, 1323, 356, 120, -874, 832, -6, 1171, -85, 361, 191, 276, 685, -431, 124, -417, 668, 32, 139, -488, 527, 317, 2, 51, -521, 47, -553, -999, -252, -1191, -422, -213, -572, -942]
5676i42R26j330N09M42o70L77K4k18N57J24R7J105j112k94j02N77l00K4o34N70
5696b70l91O77J7p00J409q20N38l22K71p98M47n36J679J86j432L93j27j0n37R69
5716F43L94p85j29P35n03O29j073J27J216p73k8J77j81j31j52j64j6Mn98P67j37
5737B2K78o56J78O49j193Q69M57j038M80k95K85l08m51j8L19L69q78O63Q5p5O45
5758C87j358J051n71O95M67j917P42p8P03r26K60JJ341j509O57p6P53m87k90k4
5778a79N87O7L93o56N34r74M92J14O9m34n76N88L89j70o20O71K04k86Q36p00l83
5799c4j05K01N70o32k99N41M93j051J17l02J280k27o37k9L1N7k77L81j19L3N54
5820E46J24j339O20K29p61N71Q61j428j57J082r09R2J02o30N91N24j73l77l41
$$ y = [-942, -16, -1346, -837, -395, -1065, -688, -664, -882, -325, -201, -104, 1001, -111, -405, -507, 70, -230, -206, -840, -270, -661, 16, 33, -667, 742, -78, 460, 138, 409, -389, 58, -478, 1201, 1387, -45, 348, 221, 211, -326, 643, 1037, 252, 123, 858, 355, 984, -89, 38, 1254, 481, 453, 630, 449, 318, 166, 2, -14, -10, -608, 159, 22, 300, -356, -178, 471, -722, 147, 604, -434, 46, -249, 36, -272, -723, -741, -422, -53, -931, -268, -183, -258, 387, -971, 80, -491, 204, 671, -1246, -504, -582, 121, -805, -545, -544, 797, -712, -55, -131, 622, 135, -155, -179, 408, 475, 868, 212, 746, -228, 264, 378, 447, 13, -563, 25, 414, 244, -376, 295, 499, 213, 1049, 349, -34, -139, 62, 632, 0, -299, 242, 735, -316, -199, -501, 779, 552, -85, -114, -83, -26, -303, 78, -41, -8, 546, 670, -669, -49, 180, -581, -10, 851, -577, -734, 348, -561, -469, -367, -997, -406, 118, -55, -432, -773]
5839g73Q36r45R1J736j585M0m33J443J51m28N1o95K46J15O4k58R82%r27L78J096
5860A185q69j40N55N15m41p10J051k17k46l0k64M22j768J201L17j37r26J064q81
5879c19l92J141O29j514l48J070o38Q52m20q44KJ361q30J242k38l04o93Q9m78
5898f32j43k22L91P03l84J012j57j482P18q9q31J291J18n33m47n95M20M97l73
5917g38K30K08o39J005K83l44p78P9P2Q75p93K59P24j24j9o83P27r8K37j224N17
5938b24o25K465j018l2l79o5%M07o75L30Q9L3Q31r72j20Q07j153J22P87n27M50
5959E31k051J696k52j51K64k36j56r13O92O92r29P16j40k25O86j03q48L74J81
5978a72m72l23J176L40j286K74m68R50J2J20q34J20O51L62j077J000q85L45j8
$$ y = [-773, 63, -882, -791, 945, -640, -600, -1033, 410, 561, 133, 184, -511, -265, -150, -86, -344, 638, 638, -289, 89, 1185, 316, 176, 731, 1246, 805, 95, 1146, 929, 683, 653, 389, 811, -957, 244, 561, 424, -502, 562, -319, -711, 430, 1059, -455, -803, 267, -371, 481, 61, -783, -781, 580, -250, 992, 754, 450, -243, -154, -632, -775, -997, -606, 97, -287, 725, 568, -914, -196, -285, -1116, 175, 293, -240, -687, -1282, -862, -365, -738, -508, -300, -939, 66, 349, 5, -773, -694, -622, 253, -540, -281, 443, 319, 300, -383, 344, 246, 483, -741, -224, -849, 1616, 598, 566, 187, 122, 122, 529, -146, 184, 273, 306, 1137, 165, 45, 852, -301, -179, 608, 81, 531, -1520, 176, -76, -227, 37, -199, -355, -1268, -576, 116, -813, -97, -237, -462, 224, 121, -727, -353, -172, -644, -967, 209, 549, -737, -463, -931, 19, 31, 151, -683, -563, 88, 450, -627, 373, -512, -167, -185]
5997a85k41J038l26j5j38L61j118L2P32M30j42M12j049P40n08Q46q20k94Q10j81
6017C84j34l46K22L79N19j343J254n61k21M4k62M20l01P39L94r67j26l99O36J83
6037E14p16J00K62j178L43N30J61m96k88R08M3n87l60J61k99K45Q32j168O27N81
6057B15k410J626l7N33j99j47p50P48l60J027n88P26r04J23k60L42p78J102p20
6076g11J219m05p53K07L69j04j25L77J13J93O67q02L28k19k59O68m40P37l71p93
6096a04P33R8r83J73K06J14M82l97Q00j379K96L05M64j471M85O89p42J082m99
6115C52j98j36l38o1K99n66O23l21q9R79q68l74Q82p95r88J217L79r98k59N34
6135g26J165j91j44r11J64n2R15j498M55N05l19Q0k8o2N70Mn2J86K12m88O53P0
$$ y = [-185, -426, 612, 286, 271, 133, 494, -624, -592, 140, 570, 428, 840, -209, 531, 23, 869, 49, -245, 565, 384, 250, -96, 126, 505, 1024, -319, 935, 374, 153, 197, -65, 355, 54, 793, 1187, 220, 94, -305, 331, 514, -202, -102, 160, -1018, -675, -145, 16, -480, -768, 140, 183, -404, -764, -603, -902, -657, 175, -993, -366, 215, -2195, -569, -606, -73, -272, -419, -1169, -421, -781, 246, -342, 384, -520, -397, -657, -315, -1093, 9, -711, 508, 103, -650, -443, -74, -178, -303, 74, 187, 380, 1047, 245, 573, 354, 95, 763, 323, 1060, 689, -104, 629, 727, -256, -83, 123, 237, 719, 322, 1122, -257, 39, 344, 808, -663, -178, 511, -231, 851, 352, 154, 18, -320, -381, -82, -648, -25, -346, -435, 544, -324, -698, 184, -611, -1599, -382, -3, -1001, -1260, -726, 439, 248, 104, -807, -643, -695, 220, -1278, -823, -318, -637, -557, -585, -647, -77, -73, -125, 61, 273, -215, 438, 508]
6157E08n60N42j93M0j90j54Q18JO40j818O51r4j130J065L35n71K84R36q20q23
6177e33J297n14j33J41O7j181O73j20J508j855N84M21j027R22k38o79Q4N15k0
6196h8k54M1J0l05Q51K69l39p22l93J036q05J3P35o91Q81j539M44M97J79R7o79
6217g62j77J193j450J737m06k54l75O54l18M87o45M69j80j002P43J172j313P27
6235C00p02Q63l03P55k81Q6p82m02J810j296M79n80L86M1l40M82L25j372J393
6254H62j111J329j211M09l79l11K65K49l42k23K72j80R64l29n91K58n68L63k42
6273e16lJ28L89nk63KN68j34q87L54k55m34J118k87j59j14M47J73n75N36n72N4
6295d35L22L38L52n37K2n67J021j008J278j071R93j499Q32J319p22J388j064j329
$$ y = [508, -52, 490, 297, 337, 147, -7, 811, 812, 1452, -366, 285, 191, -939, 126, 461, -110, 174, 1110, 290, -533, 764, 250, 117, 258, 325, -856, -183, -303, 1205, -650, -66, 355, -672, 250, 12, -667, -583, -68, -88, -342, -301, -291, -596, 255, 524, 185, -537, -930, 106, -699, -686, 49, -642, 239, -1300, -856, -359, -180, -83, -762, -939, 254, -1196, 541, 135, -119, -494, 160, -158, 329, -316, 153, -27, -1029, -286, 886, -427, 300, -402, 461, 158, 913, 632, 718, -64, -466, 1344, 48, 527, -53, 333, 374, 34, 516, 841, -531, 862, -249, 1080, -131, 278, -101, -412, -147, 102, -240, -463, -191, -371, 593, 264, -327, -69, -637, -274, -516, -519, -391, -2, -7, -270, -268, 300, 166, -721, -367, -622, -1056, 62, -225, -384, -498, -51, 122, -453, 83, -489, -435, -113, 225, 577, 40, 62, -505, 516, -492, 786, -285, 708, -791, 41, 1360, 638, 2026, 962, -367]
6313c67Q33o04l38M57M2j78L55j97M51m61N49o21P63o48n6N13q45O88r54J387
6333G69j67q79K0L65P3m46k44M50o6m46L24R11o54J30o95Q81j809L17q35K746
6353G45r21j76P5l62M57J447p96j086J008l6j741N79O9K74J90q13J679j553J040
6372G9p64K95L59n49k70O43j15j73P89p35O54N32m88m90J116m61N24j637J179
6391D88P60j502Q61K01K79J43q78J83j79k70j02O20k98q8j54l2n6k53K90L94o14
6412b07L49o00J30J049n95n36K96L72K6l86l1R7J40o01N14j18k12k45l35L99m8
6433e42J19O9L11q86J59O72l06l66M82j24k0Q10q36O80Nq10R13o72K86j34J38
6454e2K33N43o62J8K89p90N43j0K75l90l07R63p6o01K57O32k94J5l97J50M48o55
$$ y = [-367, 466, -138, -476, -19, 23, -155, 200, 3, 454, -7, 542, -79, 684, 36, -20, 493, -352, 336, -618, 769, 602, -277, -257, 108, 181, -265, -509, -59, -125, -571, -247, 664, 10, 140, -555, 326, -1483, -1166, -2001, 745, -176, -352, -277, -639, -182, 1265, 469, -617, 391, 355, -1386, -807, -738, -464, -274, -1087, 592, -961, 79, -685, -390, -31, -580, -850, -207, -322, -495, 294, -441, 213, 745, 257, -233, 883, 422, 946, -691, 488, 1248, -254, 607, 808, 1087, 1230, 352, 535, 356, 86, -16, 604, 306, 218, 64, 32, -24, -277, 13, 407, -207, 142, -458, -328, 721, 126, -410, -114, 258, 284, -102, -133, -36, 104, -497, 17, -101, -313, -558, -893, -494, -542, -423, -354, -43, -929, -770, -98, -404, -770, -288, -412, -432, 378, -458, 222, 227, -583, 330, -342, -56, -190, -52, 181, 724, 62, 80, 369, -421, 122, 112, 387, -3, -310, 653, 577, -24, 233, 865, 571, 586, 189, 339, 787, 132]
6476A32Po56O03o0n04K92R12p64o36J24Jj28J124l96m47P87k26l83l21J175n34
6497A02n35p5k8l68P95q7K28k77l75R3j91qK94J77l88J89L21O5J98q52j98O18
6519c02K06M29o48m21K99L41K25l61k77Q4J269M8n99O6N00n69p18N68Q24r56O15
6540F23q7J63n81K29K27P58r01m80j7L68l35P68m83J82J036j436k95L43L57j43
6560B96N32j916J025p2l35Q38j86M13p94J93O4k46N58p48k04q6P10j42q64P58
6580b06k06K45p92K14N63k48j35K62k47K33k16J2J39K33l68J83K59M4l64R0M72
6601A67k2n94J54j72O62Q9j35P2k86M7N4N72j05k47K8K95n03N02k81Q35m25l09
6623C98j97j79j20N98K15p33M80m00L72K65l47l18k5K22o24N67L68o20j83J02
$$ y = [132, 139, -517, 86, 26, -478, -186, 726, -38, -674, -550, -549, -677, 447, 51, -396, 391, 165, -218, -539, 636, 102, -433, -508, -536, -904, -109, -196, 32, -245, -620, -527, -718, -726, -432, -255, -643, -454, -133, -68, 130, -722, -920, -302, -96, 333, -315, -736, -437, -96, 129, -232, -509, -425, 844, 892, 293, 359, 859, 290, -428, 140, 964, 8, 623, 536, 699, 118, 347, 574, 1332, 431, -49, -66, 302, -33, 735, 252, 434, 1470, 34, -261, 82, 439, 296, 828, -1088, -63, -135, -470, 368, 182, 595, -199, -6, 58, -188, 370, -378, -582, -668, 42, -100, -964, -206, -412, -167, -959, -745, -182, -430, -565, -303, -550, -317, -533, -521, -382, -149, -517, -334, -75, -31, -395, -305, 167, 145, -449, -295, -467, 195, 284, 149, 221, -65, -18, 36, 608, 503, 256, 284, 579, 76, 578, 297, 1132, 707, 398, 201, 22, -98, 500, 715, -18, 462, 62, 434, 699, 352, 34, 9, 231, -393, 174, 542, -78, -261, -159]
6643a59K89l8l97j30J64n62N84N26j08p01k27M10m78K37l15N88K10j51n25N60
6663b23j91l20P46P3j0R0l53R86n48rq55J028l33j8m28M62j28j89J43J6L76r75
6685f60J442q70l17O17J61K66m95J03J312j451J26o9J99k85N81j249n70J519l78
6704a8N93q55n6N6n08J284L83p48J107j508M5J83m08J539j56j646J237o80q42
6723i98K35m57J258M68j303P42K06p42M62k76L68P43j506J297l73m49J13k20J253
6742H21j298l60K51J498j303J99j07N77n79m00J17M14m44M00j0J081k4j369O25
6761H9M35r2L56j320P41K65o5k47O11n65j52K0P64k69o7J32j17k39j82l5l72J29
6783a80m8J78K09K40q6k77M16j26n10N53n75K03o21l21Q55j49Q6l52P2k39K89
$$ y = [-159, 130, 92, -305, -435, -271, -833, -249, 277, 169, -532, -759, -349, -827, -590, -905, -317, -107, -258, -783, -223, -414, -734, 12, 85, 75, 165, -188, 798, 250, 241, -614, 414, 81, 63, -365, 97, -31, -220, -77, -61, 315, -660, 782, -88, -405, 212, 373, 639, 144, 247, 1559, 108, 234, 165, 364, 79, 660, -589, -1159, 360, -18, 575, -280, -336, -280, -788, 496, 879, 131, 1238, -270, -225, -42, -450, 1089, 933, -713, 524, -156, -998, -763, -1220, 38, 506, -797, -55, 151, -591, -129, -405, -37, 706, -800, 497, 124, -325, -212, -432, 821, -477, -837, -586, 912, -391, -192, -299, 278, -301, -701, -584, -170, -614, -214, -224, 857, 833, -536, 89, 524, 432, 788, -532, 209, 474, 409, 162, 773, 208, 56, 76, 840, 571, 504, 636, 519, 280, 98, 63, -309, -180, -228, -50, 159, 399, 313, 36, 452, 326, -184, 369, -206, -3, -624, -945, -90, -239, -153, -505, -433, -672, -383]
6804c83l57O70p38J129p12L93r6J51n37M79J42O21j138j09P89K13o33k70M13m99
6824d72L23q83O34R0J83m06Q72L3k4K74j154K62R54j24q74N62n72K84L89n32N2
6845a29j36R18j472P92N61J28j225j41J123l70R10L6q20n13L83n19K70L66m67
6864c05J74N17m97q57J169j331J321N28j084K33J55n88O71m48j39K83k4p49j3
6883i84J78O3L97L04M00j418R12p77M99J34k24j79N92Q71j177R17o04o3P50m62
6903A29N16j66n13k18O33O60j117O48j03m59K96l00O66n03N39m07K95k44L28l77
6923C03M70n10o80J046o29n04Q76j81k96P86m31L79m19n02k60N37Q9p94l2J379
6943F27j088K49K9j047R57k40M2J93N82L44j154N40j54l75k00Q30k90k76l40j86
$$ y = [-383, -740, -70, -808, 321, -391, 2, -94, 57, -480, -1, 141, 762, -376, -485, 304, 517, -116, -386, 27, -472, -149, -1032, -398, -308, -125, -531, 341, 374, 350, 624, -530, -268, 686, 562, -312, 250, -322, -38, 351, -181, -129, -265, 653, -819, -27, 534, 662, -563, -704, 419, 49, 959, 995, 175, -338, 45, -474, -204, 162, -305, -131, 386, -111, -968, 201, -1130, 191, 719, -365, -132, 23, -565, 106, -342, -481, -198, -222, -971, -984, -806, -743, -346, -42, 358, -1060, -148, -925, -426, -292, -516, -695, -103, 768, -409, 508, -96, -159, 591, 129, 645, 479, -34, -252, 381, 1041, -76, 572, 469, 10, 306, 6, 672, 169, 708, 301, 596, 352, 680, 303, 773, 263, -417, 629, 0, -504, 372, 191, -105, 681, 250, 629, 210, -292, -552, -15, 74, -720, -752, 627, -461, -212, -183, -1230, -273, -513, -471, -278, 304, 648, -506, 34, -120, -495, -695, 135, -155, -431, -771, -957]
6963i57m7L92n28J260l28j84N15K06q04n6R03n68M17n91N89o77O75m52n86Q64
6983D3J499r20j003P39l02j233J573k18J18n26K61M54q89j3N0R54p45L02m2J21
7003B23K42q9m37K39N31p7j212J468n12j610K84j24O50l5J05j66r3J421q07p62
7023g61j72J162p9R29k527J436k7q43J042q04l91P2L77P56K41r83k8J019j044
7042f25n8r92J609J251j332P38o9N14m63r27N30j85n81O52M9Q08k82j918O06l6
7062g11R62J43l95j67M69m16L21R95j243O46N58q26j28k24N04K84q40L66l35O51
7082F14o50j10J163j630k73P38j99O47j05p34Q03j432P26N94p01l82m5Q08j173
7101a341J182Q03j114K18m14k62J427r04J55j182J480l05j150J780j067R95k32
$$ y = [-957, -1004, -612, -1140, 120, -208, -392, 123, 329, -475, -531, 372, -196, 221, -370, 219, -458, 217, -235, -821, 43, 1542, 622, -381, 358, 56, -1177, 396, 178, 296, -230, 31, 485, -404, -417, -367, 587, -158, 144, 102, 223, 465, 376, -61, 178, 709, 632, -580, 888, 376, -1234, -950, -1074, -424, -459, -354, -520, -613, 808, 1, -761, -933, 229, 150, 1079, -1448, -12, -39, -882, 160, -644, -1035, -963, -586, 170, 411, -572, -600, 419, -625, -683, -1675, -66, 1185, -147, 591, 522, 1036, 573, -354, 176, -9, -590, 62, 111, 919, 637, -1281, -675, -711, 251, 394, -1, -168, 301, -115, 206, 1201, -42, 604, 1162, 336, 208, -16, 488, 772, -68, 298, -37, 614, -36, -146, 1017, -613, -886, -148, -347, 300, 195, -539, 264, -1168, -442, 152, -549, -931, -976, -168, -1341, -159, 644, -470, -252, -666, -928, 499, -405, -250, -1432, 48, -257, -1407, 373, -694, 301, 69]
7118F9n27q63J364m79q4O24p87K33m6LM02O3p50J891p41q75N60o17J091m02O05
7139G34p6Q42j220r37K92N04p48J63L06j130J007J15M88k23l20%N1j01k75N86
7159E8k130J887q43J002k41J41Q13j223J259j170N93o23M53o09J232j173kN84
7177HN16j335Ro82J146j489R61M81J59R4o8j28p10M72J070r93M78Q19j289N64
7197H3m69K34M29L20N94j582N11j84K61J76O83r09R22o75J68r73K021j006L41
7216I45l10q62Q29j58k87r2L79j85k69J65N3m17N24M64l47l53j099Q96l42L67
7236i9L16L61N44j803J108l74J46k1J07M5j61K22o76j26K65p80N79l40J25Q42
7256B80r35J47j15l83N75O81j104P19j55R6J65p31J391l89k39M06o22R35l68k86
$$ y = [69, -458, -1321, 43, -436, -520, 104, -683, -450, -496, -493, -91, -28, -778, 1113, 372, -503, 57, -560, 531, 129, 734, 658, 1500, 280, -657, -365, 139, -609, -446, -140, -1270, -263, -148, 340, 117, -203, -203, -152, -253, -528, 58, -2072, -185, -1028, -26, -267, -126, 687, -536, 723, -447, 146, -477, -24, -633, 599, -574, -576, 8, 524, -811, -802, -1484, -338, -1827, -866, -385, -226, -132, -200, -328, -1038, -566, 504, -489, -11, 808, -481, 83, -386, -152, 277, 597, 1191, -391, 120, -64, 197, 373, 1056, 147, 1069, 394, 562, -411, 1610, 604, 945, 635, -227, 602, 444, 157, 65, 444, 259, -10, 155, 208, -209, 315, 779, 432, 79, -1020, -124, -466, -99, 217, 578, 1122, -681, 427, 53, 199, 178, 285, 330, 169, 391, -285, -411, -146, -926, -347, -687, -562, 280, -655, -508, -623, -1006, -431, 250, -854, -135, -290, -194, -29, -760, 631, 242, 3, 409, -213, 722, 354, 68]
7276F8l5j4L46j95m5k61K9O52r6l16n4o47M24J09M2K62j11k85N77j69o9N77j54
7299F35k20l56K98L39o15J09J21N44j14q57K37L84j340P78J17K6O9J16q20M76
7319g3P47n54O71n81j69n6K02k63j56p2l10j35J64L92L28l39J63O8r8l12M27o85
7341f41N29N70p44M72J81n57K78q05O34l15J074j097K94J070k97r58N63m69N12
7360B94j26M68r35P26K22o34M30k3K42o37J117j071L00k47M49M94r5j594R67r9
7380B48K46m66j60L35l19P33q69L92m62n05R39n47l39O53J41L11l8J6n20r2J46
7401a57k87R5M28k1R0q8Q2k003K078l21O1J13p6q25P09m81L96L9l16K94J48J55
7423A13l11j40M23l24n2P22q81M40J06j05M34P7q59K98l12M11n23R11j28M3L69
$$ y = [68, 33, 19, 365, 170, 125, -136, -107, 545, 449, 133, 79, -568, -144, -35, 7, 269, 158, -127, 450, 281, 212, 789, 635, 415, 59, 357, 696, 81, 190, 311, 855, 741, -116, 121, 505, -835, -57, 60, 86, 155, 271, -549, -73, 674, 120, 791, 210, 41, -15, 187, -76, -232, -304, -614, -749, -585, -193, 135, -204, -41, 27, -71, -383, 44, -641, -112, 458, -286, 186, 367, -190, 88, -717, -83, -398, 676, -421, -127, 943, 646, -312, 251, -218, 294, 168, 636, -299, 427, 649, 15, 445, 422, 664, 27, 1144, 73, 373, 126, 575, 1069, 974, -620, 347, 248, 494, 28, -132, 203, -116, 617, -252, 140, -322, -827, 112, -435, -774, -121, 20, 331, 293, 309, -211, -303, -157, -444, -349, 79, 58, 148, 60, 142, -1861, 217, -104, -43, 70, -6, -831, -122, -603, -207, -168, -484, -190, -42, 113, -198, -338, 85, -239, -291, 431, -450, -10, 96, -9, 425, 502, -357, -59, -371, 40, -483, 428, 300, 343, 712]
7444G12m95k75q0O22p36J124o29Q64o34m09K32n78M36J75j99l16M85n83L58K92
7464C66o29Q52j020P26n3j02j32P08o44j058M75K56J8L12P95k93j310L15l52N07
7484b63N16j027k69J686q45n46O74Q25l52j493J647n84o30J323j149j64r6O47
7502a00n00L27N95P31m23n11M28m96N36n55l16l0M21l97N58k78O27k99m01J39
7522E6k29M59o5j30L9l92L80M97j0n35k36J005p35n48P03L3m0k49o72M14J49M88
7544C82o85L38l22M81r09O38l90l16L01j53L08L9lJ01l87j25Q65J6m02l54M2K09
7566c26o17N86J81o51R07j3j94J55l06l42O01l28o34N99O92m04J68m87R05l15
7586A77O3N88n0j118O19P80j081M09m92N53o15M63j57o63P50O33j169N27l7J22
$$ y = [712, 217, -58, -138, 484, -252, 872, 243, 1107, 473, 64, 296, -282, 154, 329, 130, -186, 299, -284, 74, 366, -263, 589, -431, 295, 242, 140, 8, 716, 72, -986, -511, -255, -237, 75, 870, 577, -733, -418, -770, -263, 253, -774, -1043, 643, -202, -748, -74, 751, 399, -1094, 553, -31, -661, 662, -487, -651, -747, -100, -600, -273, 322, 1053, 630, 119, 547, 51, 587, 32, -284, -314, 107, -290, 268, -10, 617, 318, -83, 56, -173, 286, 221, 91, 130, -262, 118, 615, 605, 70, -166, 839, 104, -444, 259, 292, 252, 3, -669, -255, -106, 382, -303, 35, -287, 194, -715, -77, -467, -783, -482, -635, -327, -288, -291, -190, -577, -702, 163, 179, -223, -577, -535, -326, -943, -357, -176, -827, 80, 67, -127, 28, -278, -620, -19, -347, -981, -382, 310, -94, 74, -413, 492, 177, 240, 828, 778, -340, 279, 1059, -22, 387, -105, 448, -167, 296, 139, -524, 226, 859, -310, 217, 180, 302]
7606C02j49n90J183m86l18N01k85j50P01n29j2o70N91q41O86L2p40J289q87o06
7626i78N65l01P67L35l58n64Q30n13O42o61r0q80J158j89n22N14J45l11L5l6N47
7647A35n70P45l54J06N02q0j545O43jqJ152p64M84o41O36j50J02p6l09l16J174
7668H65n07l40P14j052J154j148j3K18q41J019P08l58j445J220J87M7n12p39J388
7687E65q70L80l08L89o19m12J341n21N20P6q95N94j5l48m71M88m32K68R6K3o25
7708g76K64m84M95l23P38J62q3j58m35l89J771r30K50j48m30L12l25n87Q6J647
7728F57q60k77L13J01J0p04N61Q39r24O56r38j29j71P01m80O68M01L65M8mk83
7749E50k56p79R05m08L00Q83j228Q87M88O49j463J37k24j48l96l57O89k02m41
$$ y = [302, 153, -437, 746, 260, -58, 443, 158, 8, 709, 180, 168, -502, 89, -752, -66, -34, -774, 515, -372, -978, -413, -714, 53, 388, 30, -534, 296, -217, 425, -236, -326, -1206, -48, -237, -759, -245, -100, -411, -376, -412, 135, -435, 310, -44, 62, 564, 484, -1061, -418, -419, -427, 725, -39, 445, -196, 440, 290, 392, 316, 7, -309, 865, 358, 18, 732, -320, 834, -314, -327, -109, -950, 69, 777, 419, -1026, 194, 381, 428, -84, -823, 565, -305, 75, -233, 156, -463, -875, 466, -55, 465, 541, -354, 240, 225, -123, -594, -106, -538, -270, -174, -151, -776, -512, -996, -501, -824, -86, 76, -7, -165, -600, -989, 782, -148, 102, -46, -476, -164, -489, -1076, -990, 657, -203, -480, -167, -66, -56, -760, -199, 640, -284, 372, -566, -695, -866, -165, -645, 23, 424, 789, 837, 833, 550, 294, -485, 420, 12, 312, 1195, -33, 854, 1342, 1991, 528, 665, 441, 293, -103, -460, 229, 27, -414]
7768d14J512j062m66P74l51L91l45J19m59j45N02J5p87M46M61p20M54k85L11m82
7788e31l03N08K55K10p96o40P90O15o80J30p9Q51o63O18r60k17P64J188q98K11
7808C73o25M96m56K17k51k0J122n53p01l75R27O01j19j86p5p62J272K8p74l07
7828a68P11j50k91M0l12M99m57K37j161O53J74R03j8K64r72l53o4P17r5j152P98
7849a97n13k44L04m7L0KN22J084p78l23O58p31M3L41j066l34J280k13j095Q86
7869c91l64L76R92j288J385p05j559R66k13O47J435j001j079N11j346J155K40
7886b39K62j57j34K97O70O1k72m79n99Q30k28j64Q56q24P26k40p5n34K46P30r47
7907b14j04j05K48K84J07K05q66N60L96n93L42n46L95kP32r64Ko96J114k64p0
$$ y = [-414, 1098, 36, -430, 344, -7, 384, 39, 158, -301, -446, 56, 71, -716, -270, 191, -529, -75, -360, -49, -531, -834, -326, -71, 139, -657, -1297, -507, 108, -572, -442, -521, 330, -333, 285, -675, -892, -128, 1060, 162, 373, -252, 244, -212, 5, -246, -266, 856, 303, -398, -773, 154, 755, 636, 450, 375, -387, 885, 913, 139, -168, 543, 393, 102, 142, -170, 329, -128, 109, -1052, -399, -225, 678, 660, 924, -48, -401, -465, 252, 157, -995, -197, -710, -954, -650, -697, -667, -665, -143, 941, 163, -160, 498, -233, -190, 151, -915, -1249, 31, -182, -1277, -391, -755, -379, 613, -675, 710, 5, -1554, -588, -801, -154, 1281, 280, -799, -288, -1634, -479, -239, 23, -134, -268, 29, 699, 760, 488, 9, -590, 240, 12, -152, 704, -120, 606, 366, 291, -243, 3, 733, -214, -318, -423, -175, 109, 216, 421, -445, 115, 511, -82, 260, -286, 109, 107, 839, -125, -123, -819, 295, 31, -39]
7928c9o39N03P13q26pL10n61M22k60O50j79J39R2p02N08r31N13j1mQ12j084j21
7950g02J121m3n89k52N71j33n38J317n49K47P0m06rn6k36P60N14j755R51M9J56
7971D88k97l2j90N96j67n92J201J98k24j202N0qN64k13J15o9Q50o06j298R33N0
7992A47j3j67O29j45k92K0Pk87n73Q91O4m63p90M89L14J39K50n58oo7R8m76r9
8015h88R01p91J004p29R8L59r6j41k35N07l22N02l4r9Q3K27j62K39j84K86p07
8036a82n0N50J71m26J48k31M82m63k07K48J42k73J94J61l24L96j34j55O77r73
8056b49P44r04o4J068m96j50K72K01q99m6K44O15o10n7R30r06j57P6k96Q08j344
8077a220J238M09l45m35L21n15qN95j11J04k5L14n33o28N39l69P01j1k84N85p0
$$ y = [-39, -678, -175, 538, -288, -295, 15, -546, -124, -384, 266, 87, 226, 318, -384, 124, -807, -294, -305, -309, 503, -581, -702, 419, 376, -213, -465, 106, -27, -565, 752, 203, 450, 520, 114, 105, 49, -187, 573, 1087, -668, 283, 332, 488, 191, 159, -31, 565, 398, -194, 1007, 1205, 981, -221, -171, -179, 385, 172, 287, 218, 1068, 462, -836, 97, 147, 134, -33, 596, 451, 159, 179, 186, -101, -674, 217, 281, -182, -972, -483, -169, -30, 220, -338, -344, -411, -313, -789, -888, 13, -778, 226, -503, -405, -46, -142, -283, -518, -11, -333, 169, 135, 36, 119, 346, 184, 423, 239, 525, -182, -232, 318, 489, 63, 211, -20, 462, -1, -208, 40, 182, -91, 103, 264, -60, 336, 202, 47, 724, -249, 495, -409, -473, 595, 99, -51, 221, 422, -477, -523, -279, 336, -274, -331, 599, -307, -464, -388, -684, 124, -1220, 18, 427, 82, -353, -32, -547, -555, 40, -71, 33, 8, 322, -211, -839, -300, -669, 32, 21, -263, 322, 252]
8098B52q34J80J437r89K36J96q54J268o66P4m06K08l75j57n48J029Q16r92r6R23
8118G02m65M20o28P4Q3m01O13n2m83J682j706k4L92K29P17p19m84P12p10O89k6
8139F15m02o20J158q84l62R45o11l59j11N80J629q30j428L28m64l00J085j95J41
8158h5J72n9j094L63R8K21P23r96qJ140n69k35l29P82O5K20m39m49K20N40j073
8179g92Q17L14p25K82o4P33o97L26l51M12j45l66
$$ y = [252, -582, -402, 1035, 46, 282, 478, -376, 892, 226, 300, -106, 102, -273, -430, -978, 51, 867, -125, -221, 702, 237, 657, 29, 103, 186, -215, 398, 346, -137, 1545, -161, -185, 207, 436, 1153, 434, -50, 662, -48, 641, 615, 213, -407, 751, -133, -495, 450, -161, -520, -631, -51, 1578, 748, -680, -352, -816, -1116, -31, -226, -85, 87, 28, -1066, -703, -605, -384, 339, -657, -665, 475, -94, -329, -658, 124, 189, 409, -30, -479, -259, 281, -792, 25, 339, -386, -104, -168, 565, -132, 194, -157, 255, 110, -256]
8191b56
$$ Imaginary data points
##PAGE= N=2
##DATA TABLE= (X++(I..I)), XYDATA
0@%%%%%%%%%%%%%%o3J30j35J36j36J72k39K71l38M05m73N41o10P44q75J004j142
31f08J285j436J638j872K106k367K669k989L336l724M145m606N109n664O265o923
47c636P647q433R283j0220J1262j2404J3675j5089J6661j8433K0448k2756K5429
60A3434k8574L2336l6925M2675n0127O0206p4744R7846j42400M06508q83473N06479
72e6759N44619r29483P93550k52749k77852M00928k86234J11087N7503l11421
82b06811L67936j63675p2052J84800k21546P0682J21135j90770Q3723j1921j8892
93e7391R7983r1827k4622Q3633j15473R1674O5401j91319R4217N9538r0486J22113
105D3441j17161o164J29430j53574J33929j3198k10087K72007n0906j42168J79964
$$ y = [0, 0, 0, 0, 0, 0, 0, 0, 0, 0, 0, 0, 0, 0, 0, -63, 67, -68, 68, -68, 104, -135, 136, -202, 203, -270, 271, -339, 405, -470, 534, -608, 677, -759, 879, -993, 1113, -1254, 1415, -1574, 1762, -1962, 2183, -2423, 2686, -2978, 3287, -3636, 4011, -4422, 4861, -5359, 5903, -6501, 7174, -7915, 8746, -9687, 10761, -11995, 13434, -15140, 17196, -19729, 22946, -27181, 33025, -41719, 56127, -86273, 320235, -563238, -56759, 487860, -441623, 351927, 99178, -178674, 222254, -63980, 47107, 104610, -206811, 161125, -2550, -74602, 110198, -111348, -40666, 80469, -110301, -26578, -38499, -57391, 40592, -51235, -75857, 7776, -107697, -16023, 49378, -141941, -47724, 11814, -78672, 43441, -73720, -79884, 49546, -104028, 29901, 16703, -193384, 78623, 27717, -114451, 65513]
116F5513j35373K7201J08599j28372P8536k8100k2190J18656j26614K9291O9461
127E6608j18317J08977J7694r8098Q6527k0143l1546M8184n2595K7956K7537n1613
139A171N7070k3690o7563Q1589k5869l1072N8018o2856J7316M6663o9886K1499
151B390k5280m769R1678q8871j401N6256j00467P3906K8231r1789N8363k2121
163b3874j946N1035q5931L9363K7340o2492P5198l7281m4138P7360m8919J2706
175b1579K7610p9098O9064J7539n8434N3976m9982m420Q8984o8026l354M0348
187A2628m6028M7295l675m2590N1113k2069J8965K6132p5912M8004K6055m6041
199f123O0295m4666l9022Q7799k8717k3908K7913k8695K7454L468k0314J1448
$$ y = [65513, -69860, -42659, 65940, -62432, 16104, -11996, -34186, 84470, -42144, -12853, 56608, -61709, 47268, 64962, -33136, 53391, 33248, 1702, 49886, -2709, 25247, 52784, 1171, 58241, 34551, -33012, 48577, 22708, -8364, 49654, -13202, 4114, 50777, -19109, 2390, -22890, -27659, 64019, -24852, -26253, 30003, -70464, 3442, 31673, -60116, -1753, -23874, -25820, 25215, -60716, -21353, 5987, -56505, 18693, -18588, -62726, 14634, -34285, -21579, 6031, -73067, -4003, 13536, -44898, 9078, -40904, -45324, 43660, -24366, -27720, 12628, -33400, 13895, 10220, -32370, 18743, -3326, 15639, 41771, -34141, 13863, 39918, -6123, 54172, 9506, -29516, 58283, 29566, 5658, 33571, 4876, 32330, 35798, 15484, 26932]
211B6932l7528L2710L9193p1764K6133J7357m2363M8535j8219l6851M2952j8963
223H124N908J0445n4620M6483M986m7709M8057k6958j8483N7734m6587l970J9817
236C227m2478M4676m534l6532M0504l9206P776N0277p0930J0500M3807l7812K0014
249a0711p431j5703K8958k7012J4919J8499m2935L5618O930l0771L0743j9961
261a8857q59L3997l3820J4940J2355l2080M1419j4596k0333N0549l9978m585M7497
274C5649m4909J6942J9737l7057L6003j3315k1894M0077k6883J4395J8365n0066
286a2956L4250N554l1295L9933k2700j8558L5966k1138N628K347j9647K6944j9083
299E245l662K5397m3236K3267K1328m9240K9018k728k5310M1365k7076q397K6087
$$ y = [26932, -10596, 22114, 61307, -10457, 15676, 33033, -9330, 39205, 20986, -15865, 27087, 8124, 14032, 24477, -30143, 16340, 21326, -26383, 21674, -5284, -23767, 33967, -12620, -16590, 3227, -39251, 5425, 891, -35641, 4863, -34343, -26567, 23710, -47220, -36720, 7087, -30725, -10711, -18142, -33845, -4887, -31899, -16980, 1519, -41416, -5798, 1132, -29639, 1104, -18857, -19716, 14281, -19539, -4599, 7756, -24324, 17095, 2499, -17834, 32715, -7263, -11848, 35649, -9260, 7682, 27419, -9638, 26365, 13050, -8844, 31233, 4350, 18745, 37110, -12956, 21294, 26848, -4447, 35486, 12786, -5772, 30194, 9056, 14684, 17031, -2616, 24328, 5245, 1583, 26980, -16256, 7011, 28339, -20901, 8117, 5389, -19921, 21444, -5632, -14029, 12058]
312A2058l7304K5005J1653m5867L1733K35j7664K4683k7699J865L0914k8622Q066
325a0944K833k2254L5144r052j8676K2492j9117J1588J9463l2098J6539K988j0962
338a2056K7345k5708j584K5999k9538K6239L341l6106M3036j2048j7365L9446
350C1001l8471L352L6585l4151J3877Q09j8394L7523k6570p159L0745l2843J9781
363A6085J2828m0243K3218N198j3104J6323j8903L971P526j6987K4581j6331k2291
376a8129L8859k1145j7286L3926k6558j553J7956j9152J1152j1841o980L1429
388A0678l3128l31K6737l5299J9812J3485l4404K0390k371o497K1741k7200J1597
401a4790J4579k9851K5257k828k2831K9098o536p286J3710j7605J4768L843j3963
$$ y = [12058, -25246, -241, 11412, -34455, -2722, -2487, -20151, 4532, -23167, -21302, 9612, -19010, -10944, -8111, -30365, 4779, -4273, -22949, -457, -19574, -7986, 11477, -20621, -4082, -1094, -12056, 15289, -10419, -12003, 13996, -15542, 10697, 14038, -22068, 20968, 8920, -8445, 31001, -7470, -4118, 32467, -1684, 12193, 13002, -5392, 32131, 5561, -1598, 29147, -3696, 16085, 28913, -11330, 11888, 17086, 3982, 20305, 1402, 5373, 12899, -4088, 20493, 4162, -18129, 20730, -415, -17701, 16225, -10333, -11886, 6070, -13082, -1930, -13771, -20751, 10678, -22450, -22781, 3956, -31343, -11531, 1954, -32450, -12060, -14431, -20928, 813, -26387, -14790, -211, -30062, -4805, -7633, -30464, -1366, -7902, -15188, -1478, -19083, -4315, -472, -14435]
414a4435K3663k1522l137L4236k7478L67K8342l1604J4279J8095k4948J2026q8
427G796K961J1067k3865J6066P082k2999L2956j2980k5436L8797j6537r999K1423
440B6332k5393J1515N526j6637K0933k0102j729K8832l1106K691J4433k3211K1161
453A3245m334j7795J7028j5449R706Q837k6456J6030K745j7364K3128j4038j5508
466b0225K3434j1825P21L352j5336K2010n045j8074K3850j9362k322L2438k9598
479a5982j334K0156j8533J6279m800j2602K0891j7595Q789J7769l2862K0817Q804
492I797k1019K3151j4899l735K0979j4006J1275m337j5987K7773j3341m373J6548
505A7826k5724J6844J4429k8464J3938K649j1060J6615q812o597J0828r425P998
$$ y = [-14435, 9228, -12294, -15431, 18805, -8673, -8306, 20036, -11568, 2711, 20806, -4142, 7884, 7796, 10757, 21824, -2041, 14025, 21107, -1892, 31064, 18084, -7352, 31445, 14908, 4909, 26332, 939, 12454, 17980, 1343, 22276, 2174, 445, 29277, -1829, 862, 15295, -7916, 13245, 8911, -8884, 8144, -7305, 2401, 11238, -15218, 812, 3557, -13807, 9321, -4717, -20225, 3209, -8616, -7895, -4543, -19879, 2131, -2914, -20988, 2862, -16500, -18822, 13616, -15982, -17316, 2840, -15693, 586, -4214, -16816, 4075, -13520, -4731, 13038, -19824, 993, 9797, -11222, 11929, -2970, -6705, 14274, 268, 11543, 7206, -8781, 18992, 5651, 1278, 17826, -7898, 8946, 23375, -5089, 8849, 11498, 438, 17053, 8241, 1644, 12472, 3047, 11045]
518A1045J792j8246J2157J188j0225J4772j0409r898J7506r033o95R28j1984J5126
532D024k674j3088J3071j2790L033J4156k0266M213K102n113J6285j9876J481
545a5442J4513k0903J5493O032k5235K0295l72j0382J2850j2325O857M841r594
558a3372J5665j3914m084K7301j6078k991J3260j3940P009Q412r768K903r64M091
572C530O811j2080P887N334r879J1379p19j1791J2346k512k632O465j0690P238
586A0687O048j1696J0199m249j0443J9751j0318r587J6424j3393K142J0431j6594
599e98R273m432q325J8851j7693r28J3669j8891J0922K981j7520J2801n185m06
613e481M281j2899J2376j230j3067J7541j2193q556K2463j0490o800Q709n414
$$ y = [11045, 12837, -5409, 6748, 7936, -2289, 12483, 2074, -7824, 9682, 649, -46, 882, -11102, 4024, 1350, -11738, 1333, -11457, -8424, 5732, -14534, -10321, -8219, -13332, 2953, -16923, -15442, -929, -21832, -6339, -307, -25542, -5247, -5619, -16001, -3151, -15476, -8619, -3778, -13372, 2293, -11621, -15705, 11596, -4482, -7473, 5787, -8153, -1144, 7268, -2500, 403, -561, 3530, 10341, -1739, 6148, 11482, 1603, 12982, 12263, 472, 12818, 10306, 7674, 14139, 3449, 10687, 16735, 5039, 15238, 10989, 546, 20297, 9979, 392, 16816, 3423, 5565, 15996, -598, 8675, 4243, -4082, 14769, -2924, -3852, 9817, -9074, 1848, 4829, -12691, 110, -5075, -5481, -1200, -14099, -1723, -2953, -16020, 1521, -10672, -19228, 3235, -7255, -14055, -5346, -10760]
626a0760L475K036l873L982o133M92J3137j3307j193J3633j1904O520O855j4192
640a1232P662N406n211Q230j1759M996J2528j4870J0393j799r510J9662j0225
653D271k378J0242j5707J4579K44j5348J8109q790k702J3723j6970N309O497j1021
667E8J2844r289n729J2295j0935L892M826j4184R619K241q300O262n034l764Q878
682C680r373M48M508p173N969j478q481R383m634j371R130j5013O752O267j2814
697a4200J1411l026q589J3616p474J671M661j2237J3618k638q900J6721j2279
710g645q0J4368j4348O491N940r185R900m429k260R156p950L598P073j1864R332
725H097K342r840J1722m102n923J2207q028m74P283r088M705q41k697R536j0081
$$ y = [-10760, -7285, -5249, -9122, -5140, -11273, -10781, 2356, -10951, -12144, 1489, -10415, -3895, 2960, -11232, -3570, 1836, -3375, 4855, -6904, -1908, 10620, -4250, 6143, 4344, -5166, 14496, 4271, 1893, 12135, -3572, 11007, 11251, -4097, 14012, 5222, 2520, 16243, -727, 4582, 11079, 58, 12902, 3613, -2116, 10179, -756, 3136, 7962, -6222, 3397, 5638, -2662, 3600, -1434, -5198, 3680, -5693, -5245, -737, -7910, -1941, -3419, -11900, -2517, -7151, -8522, 608, -14405, -7653, -1386, -14200, -2789, -5815, -14404, -788, -8262, -6591, -1930, -14167, -549, -3187, -12087, 4634, -7645, -7725, 6643, -7705, -1214, 4726, -4459, 5441, 1012, -1248, 7908, -42, 3556, 10629, -1235, 8097, 10439, 599, 12321, 8219, 2296, 14503, 6475, 6001, 13284, 4196, 8901, 8060, 5363, 14899, 4818]
740D818J706O662j2883J0327j199j2161J3219n195m735Q347j2695O983M546j3529
754e789P881N9p382Q842o748k985N737o737O146k835p764J0141m343m672J0486
769C7r326l186J0658q187J604Q65k347P099m328l77L757r580J0006K644j2791
784a3452J1240k650l556J0909q744Q53P500o929P098j747n776J1646n699r50M916
799D659o630N484L894o387M614j950j537P331m581j655M124l778M238Q66o125
814B567M819k648j132N441o682M3O686o926J496J547o114O997k957n337O931p760
830c029M002K776r810N596n06m215P314q655R04O699j0058N366K159r701Q390
845b768k421l000L561l393M345k270m410Q667m102l567J0066n333j444O751n585
$$ y = [4818, 6524, 13186, 303, 10630, 9431, -2730, 10489, 5294, 559, 8906, -3789, 3194, 7740, -5789, 2092, 2151, -5231, 3611, -3137, -6122, -385, -7122, -976, -3811, -11575, -1434, -5777, -10449, 37, -9289, -12475, -1817, -10004, -8400, -7535, -9882, -2783, -7111, -7488, -3731, -13311, -3305, -661, -13452, -2212, -4862, -8418, 2491, -6253, -5400, 2100, -4829, 2269, 522, -5254, 6392, 693, -257, 4659, -1971, 3513, 7407, 1020, 5634, 3684, 2147, 9478, 4897, 3242, 7366, 3588, 7826, 8692, 2567, 7386, 4738, 3606, 9047, 2365, 2408, 9094, 2168, 3664, 5211, -903, 6094, 3137, -2200, 4731, -3029, 973, 3749, -6061, -465, -971, -5186, 2128, -6527, -5623, 1076, -8982, -3616, -1457, -11158, -2768, -5189, -8189, -4628, -8021, -3676, -5946, -10356, -1689, -5791, -9358, 708, -4625, -6069, 682, -4903]
860d903J629L404m127L868l63O68L626n157K895K797o760P206J505o652Q676k966
876E346l220P997p103K469L914o046N879j406m729P279n263O46L434p009M403
891F591J007m519N954p936J632N890r158L002J572n798N550j599m107J926k357
906b350K465j552n747O419j279n780P853o278l806R044n020j682L554l934K116
921e977k99j781K432m472M527N386r716K797M789n954N092r48k836M398k740M329
937i73j259o852J1138k250n053R025n601l57P087m030M93J751k920P371l947l248
953C75Q049m628r19N908o030K260J136k584M916m766n17O156o769K229L043q807
969i48O840K292q931M925j474J16K117n987L466k349j690N292o382J936L698p090
$$ y = [-4903, -3274, 130, -3997, -129, -492, 176, 3802, -1355, 1540, 4337, -2423, 4783, 6288, -364, 8312, 5346, 2126, 10123, 3020, 5489, 9403, 3357, 9236, 7830, 3101, 10380, 5117, 5763, 9197, 2188, 6591, 7598, 3079, 9033, 1097, 2729, 8619, -539, 2463, 4035, -1763, 3787, 2188, -1919, 7, -2350, 115, -1437, -7184, -765, -2044, -7824, 29, -6249, -10055, -1011, -6031, -7713, -4159, -8093, -5977, -6276, -8057, -5625, -10097, -5570, -184, -9900, -7103, -2314, -8268, -3176, -4124, -6960, -2562, -5302, -973, -2232, -9084, 2054, -196, -5249, 3776, -1825, -2182, 4905, 875, 1368, 3119, 199, 7570, 3623, 375, 8424, 3796, 2877, 8785, 2755, 5015, 6151, 3567, 8483, 3717, 3200, 9356, 2587, 4816, 7859, -948, 5892, 8184, -747, 4178, 2704, 2820, 4937, -1050, 2416, 67, -1623, 3669, -2713, -777, 2921, -4169]
985d169K619J542m916K702l47j323J642j546N50j481j035L000j324k943L877k7
1001c179k458K359n09j138K663k730J774J649k851K814J044k954M783l673J298
1016a108K732k860K396k10j116O011m648j57M616n907N050L91m892N795j595j039
1032C459K855m329K926J366k352L378l235j148L093j514j609P58n94J85J151k851
1048A539j489K264l23O99k431j286L045l260P66J27n050M173m5m328N355m524
1064d768k397O196n155J038j72j634N193m582j85L785o167N588J109p224M318
1079e057Q54m56J460k366L030L54j329L766l232P72L174l032J693J323k660M454
1095B748n00j510J943R9j340K382O86k419J829O75r7L20m93J884p45q02J904l712
$$ y = [-4169, -1550, -8, -4924, -2222, -2569, -3892, -2250, -3796, -3246, -4727, -5762, -2762, -4086, -7029, -3152, -3179, -5637, -3278, -3787, -4925, -2262, -4992, -3218, -1569, -4420, -1606, -562, -3516, 1267, -2406, -1108, 1624, -1236, 1160, 950, -166, 5845, 1197, 1040, 5656, -251, 4799, 5190, 298, 6093, 4498, 3459, 6314, 1985, 4911, 6277, 3925, 7303, 4068, 2920, 6013, 4499, 2890, 3648, 3054, 3239, 4390, 1539, 50, 2314, 1991, 2690, 259, -1027, 2018, -1242, -476, -349, -5399, -1226, -1271, -5599, -244, -4768, -7165, -969, -6124, -5086, -5258, -6892, -1699, -6281, -6466, -2681, -8848, -3260, -2151, -9375, -5057, -4203, -4659, -3199, -5565, -2535, -2181, -3510, 256, -2976, -2204, 970, -2062, -369, 954, -1706, 2748, 2248, 738, 2681, 2780, 1440, 3822, 4508, 2089, 3918, 4593, 4496, 4816, 4323, 6207, 5462, 4660, 6564, 2852]
1113B852K005K081m845L403J274m831L616k634K86K063m000K779j308k025L383
1128D099l468j972M031m059J575L96l994L174r05k495J943k127J07K886l983Q15
1144c977M4q6K069k622j126K968k199J248O86l023K652J707k161J816j923m97
1160d424L775k056J37K275l147L197R55k521J943q64J450J344j801Q17K154j398
1176A836J449j278j54J113r21J993k28k942L744k55k136J977j536K14K116k506
1192B486j71L79j077J489j117j089J086j469K21m02j222J400j60k248J546j205
1208a553k014K260l22j113J098k165J124l61l26J36k502K831J570m762J859J750
1224b490k634J657J004k761K743j330Q95O88j467K470l11j560K832p08j044K492
$$ y = [2852, 4857, 6938, 2093, 5496, 6770, 1939, 5555, 2921, 3207, 5270, 1270, 4049, 2741, 716, 4099, 631, -1341, 2690, -1369, 206, 602, -3392, -218, -1123, -3618, -1675, -3802, -3695, -809, -4792, -3977, -3933, -4019, -1950, -4572, -5698, -2730, -4929, -3681, -2995, -6018, -3366, -1659, -3820, -2004, -3927, -4424, -649, -2705, -2568, -293, -3440, -243, 712, -1809, 134, -730, 720, 2064, 263, 1080, 3234, 1836, 3285, 2007, 1853, 2966, 2045, 4038, 3810, 868, 4612, 4357, 2221, 4198, 2662, 2876, 4992, 2486, 2315, 2694, 1617, 3106, 1989, 900, 1986, 517, 738, 336, -886, 514, 354, -1894, -348, -1553, -3567, -1307, -1629, -2742, -1644, -3809, -2685, -3046, -3372, -3236, -5738, -2907, -1337, -6099, -4240, -2490, -5124, -3467, -2463, -5224, -2481, -3811, -2916, -2228, -3695, -1225, -1536, -3096, -264, -972, -2016, 476]
1240D76n40m32J237r89K197o21o07L075k531r0L366o81j527J911p24M66n00P8
1258C564K413l137J894K065m900L042J277m590L226N9j785K11l43O38k285q6J951
1275C214j266j026K718m017jK482l191J107o17m91L15j787P17j11j684K530p66
1292a874l212K289O61k879J978r08m31R55m20P99r81N1J135p09o50K196j952R89
1310b963J041j378J430K26q71K657k288J135J386k608K998J25j795K028M17p58
1326G82J361p74J791j39k100L186o82j945L305k747k65K006j730N40K46q22J556
1343C569j280K86P14k085J415P20l873J966k36j243P78p12l84K82p80l44P83j733
1361b157n2L99n92J368k204J94R61k118J699M56k671K428J03j173J114q31K34
$$ y = [476, -64, -496, 741, -248, 1949, 1328, 721, 3796, 1265, 1175, 4541, 3860, 2333, 4244, 3520, 3986, 3486, 3564, 5977, 2840, 4734, 6799, 1899, 4941, 6218, 1628, 4854, 4913, 3128, 3339, 2996, 3634, 1349, 1263, 3214, 1948, 922, 3640, -377, -378, 2104, -1087, 20, -597, -1088, -773, -2560, -1843, -1954, -3638, -1108, -1874, -5086, -2797, -2136, -5015, -3037, -3945, -4376, -3421, -3841, -3042, -4023, -3972, -2837, -3546, -4196, -2000, -3952, -2963, -1922, -3300, -1870, -1644, -2515, 142, -2146, -1011, 375, -2233, 765, 890, -905, 1123, 1540, 782, 2143, 1369, 3160, 3021, 921, 4107, 3425, 1480, 4785, 2038, 1773, 3779, 2049, 2589, 2835, 2013, 3569, 2289, 2575, 3289, 1204, 2619, 3339, -534, 1432, 1196, -47, 731, 19, -365, -83, -863, -1207, -424, -2157, -2209, -1810, -2402, -1034, -3238, -3044, -2083, -4201, -2502, -2046, -4717, -2289, -2186, -3359, -2245, -3076, -2842]
1378b842J129j693K235j131p77J637j282J106K77n64J016O6j04J022L10k3J794
1395B176o79Q05L17j25Q08o53l36Q58j517K006R77k228P75J119j343j51J887q68
1413C828p31K80O99m74o40j32j65n68J503j461k55L80r10p35N22j448k96J278
1431F75j691L11R2j762R89j911O85Q44k301P17N44J27N26j984R50L72j186M72
1449c531m69J96L73J33o97j83P18M34p20l38K374l83j529L067o89k7Q13j68m58
1468a084J157N90k325J841J323O4L31r42P84o18J613P71j870J644M26j813K066
1485C958l25j535P01l47M34p47M15M87n14j93J493k957N36J700k738K047j134
1502A281n57J792k955M2J403j922M22K55q27M07o27l38J770j605j050K189j771
$$ y = [-2842, -1713, -3406, -1171, -2302, -3079, -1442, -2724, -1618, -1341, -1905, -889, -823, -927, 95, 405, 382, 2176, 1497, 2302, 2619, 2494, 3302, 2649, 2313, 3171, 1654, 3660, 4637, 2409, 3184, 4303, 2960, 2809, 4696, 3828, 3097, 3377, 4076, 3602, 2962, 2830, 2665, 2097, 3600, 2139, 1884, 2264, 1354, 619, 1141, -307, -603, 675, -1016, -705, -613, -2375, -1386, -3297, -2612, -1768, -4069, -3352, -2808, -2681, -2155, -4139, -3189, -2817, -4003, -3531, -4000, -3804, -3431, -3298, -3995, -4178, -3460, -3026, -3746, -4084, -1710, -2093, -3622, -555, -1244, -1271, -458, -626, -1084, 73, 663, -1662, 179, 1502, 1566, 1897, 955, 1739, 1121, 2734, 3505, 1635, 3279, 3705, 1892, 3958, 3633, 2098, 2799, 2452, 2886, 2139, 2554, 3041, 2527, 2334, 3827, 870, 1406, 3106, 368, 2415, 1281, 724, 2516, -439, -397, 1006, -916, -494, -239, -1066, -659, -1286, -1624, 146, -1459, -2509, -320, -2091]
1519b091n06J83m93O96j54n12R10q56J45J321k497K404l81j286K075j227N41J477
1537b51k002K190Q69k311J570j62J36J739j955O34J217r90K293j446L94J495k465
1554I55K297N08j973J122m9m25J925j652J43j62l50J742k178n57J817r25j201
1571A037L91O75n94J00l35j726O95l8o13l88N86K90j045o56J624k573J163n8q43
1590b308j45m73P8P71j663J08K129k502R12k68l55m78N14P43k14o21J588j469
1608c653J323J079j296J279n32q59J542J092m64p19j67L213j427m43Q91j7k58
1625E84K060j442l81J596N20j652J481N13r81J676o20n05O11k57J226k022k78
1642B129O17j610J073J100k332J049K55p00J30j746R60J340k768Q79n10j1P00
$$ y = [-2091, -2597, -2414, -2907, -2211, -2365, -2877, -1967, -2823, -2678, -1357, -3854, -1450, -1831, -3117, -1042, -2269, -1728, -251, -2253, -63, 806, -1505, 65, -97, 39, 1778, -177, 457, 1674, 684, 2977, 1531, 1925, 3420, 955, 3252, 3760, 1787, 2909, 2860, 2435, 4360, 2708, 2851, 2689, 2339, 4081, 1903, 1346, 3163, 2238, 1037, 1428, 2103, 1509, 1609, 1274, -452, 243, 205, -408, -796, -210, 80, -965, -1621, 3, -2570, -1407, -1465, -2308, -2453, -2926, -2848, -2077, -3740, -3632, -1503, -4005, -3093, -3361, -3716, -4194, -3680, -2937, -3151, -3772, -2184, -3653, -2330, -1251, -2547, -1268, -1800, -2659, -1117, -25, -489, -1208, -1375, 1838, 411, -32, 859, 842, 584, 2644, 1202, 821, 2417, 2937, 1285, 2766, 3279, 2298, 3974, 3354, 2849, 3460, 3203, 4429, 2407, 2129, 2746, 1136, 2209, 3309, 977, 2026, 2281, 1581, 1711, -35, 925, 2265, -503, 376, -134, -145, 555]
1659E55k31q09p31K39M60r85J0Q0p33k2K27l98J80L7L7k98j56R9m84J052O83m92
1681a680n73L11N43o15K00N12o67J438o15k99P59k56J144K03j179J689j16Q1K39
1700A119l10L99N65j275J311R2Q38j143K90N72N5m89P54k7l49J2k73Pq52R55m26
1721A825p28N95k19Np70j39L69j771R13l68j62J77o23L16j551M25K2K95o59J147
1741i01j313j43N0K27qm17m94J028j097J028K49j639J328o22n4P20k40L46O43
1760a309m92K3L80J200j03l20J029m47LJ192j009o27J397K97l64O48M10K02l69
1779A741j4L27O53L56m59l24k36J094q75l07Q3Q15n81P50l95l67n22N99l57k56
1799A725k94P87j480N29l43mj83j026M15q14k25N41l28k62j75K30o98k98M26K1
$$ y = [555, 324, -485, -1216, -977, -517, -1502, -1492, -1412, -2145, -2167, -1940, -2338, -2158, -2121, -2084, -2382, -2538, -2439, -2923, -1871, -1188, -1680, -2253, -1942, -1399, -2014, -1814, -1302, -1969, -531, -1146, -1445, -686, -942, 202, 405, -774, 915, 799, 880, 1119, 809, 1208, 1773, 498, 1809, 1901, 2739, 1596, 1886, 2458, 2513, 2024, 2778, 2751, 2402, 2414, 2141, 2148, 1296, 2251, 1825, 1097, 1692, 1473, 1478, 708, 569, 938, -833, 80, -288, -450, -273, -896, -580, -2131, -1706, -1684, -1389, -2048, -901, -2214, -2357, -2307, -2080, -2088, -2505, -2999, -1971, -3068, -2040, -1791, -3430, -2102, -2724, -2778, -2058, -2298, -1952, -1309, -1801, -1778, -1398, -198, -301, -621, 408, -39, -36, 1156, 147, -480, 917, 1214, 850, 1498, 1908, 2110, 1741, 1727, 2054, 2707, 3063, 2604, 2280, 2044, 3138, 2263, 1956, 2039, 2854, 2273, 3023, 2628, 2261, 1739, 2338, 1981, 1725, 1431, 2218, 738, 1267, 924, 920, 737, -289, 126, -688, -913, -372, -700, -962, -1137, -907, -1605, -1903, -1477, -1456]
1819a456m15j83n74L7J64M64m57M72K83n62j10L79R69j762N26P45L65J3N9N23
1839e20k76K47O59m38J55K50K42J42K36n13N84L64j219Q98L45j53P77m20L87l34
1859A413k41R59K5J70J071j127j714J234q09M03J55j86J33L1j226J076p90l51
1877B26J90k03J11o86n82J482j695L10L4o63L93mr17N22m26L94N33n96r09J68
1897b318M16l62j22r39J357l42Q18j02j058J324m06N61N27n97l62J790j175R48
1915d2o15m21J314j9l80M27O24m70J740q00J010q85Q75J98n60k8J07L16N85j425
1935A551N44J183r98l44N46m00P76o06j80j23r7Q9j219N66M53J56n88L41m34n17
1955F99p68J252j578K6m27R37m70j519J001m83K12r78L15p56N41m22M08Q24n71
$$ y = [-1456, -1871, -2054, -2628, -2591, -2427, -1963, -2420, -1948, -1665, -2227, -2337, -1958, -989, -2751, -2225, -1480, -1115, -1102, -1043, -520, -796, -549, 110, -328, -173, 77, 319, 461, 697, 184, 768, 1132, -87, 811, 1156, 1003, 1780, 1360, 1747, 1413, 1172, 2131, 2156, 2326, 3397, 2270, 556, 1790, 981, 1384, 1539, 1353, 1486, 1517, 291, 1367, 577, 226, 416, 213, 324, -362, -944, 538, -1157, -847, -813, -1476, -1083, -1087, -2004, -1482, -1908, -1514, -981, -1577, -2486, -2318, -1902, -2264, -2386, -3325, -1968, -2310, -1492, -1594, -2652, -1328, -1734, -1173, -646, -1243, -1605, 185, -990, -42, -657, -1078, 236, 217, -163, 264, 888, 418, 2158, 1358, 2368, 1483, 2358, 2556, 1996, 1968, 2075, 2391, 2976, 1551, 2095, 3278, 2280, 1936, 2482, 2082, 2858, 2252, 2072, 1949, 1852, 1941, 722, 1288, 1741, 1897, 1309, 1650, 1216, 699, -69, 1183, -395, -369, -796, 141, -329, -1848, -847, -1330, -1118, -2096, -1781, -2537, -1996, -2418, -2010, -1186, -1757]
$$ [...]
8191E94
##END NTUPLES=NMR FID
##END=
