##TITLE=1H_SL2-5ID-B(f8)
 CDCl3,8 sc, 
 22.9.2021
##JCAMPDX= 6.0         $$ Bruker NMR JCAMP-DX V2.0
##DATA TYPE= NMR FID
##DATA CLASS= NTUPLES
##ORIGIN= UXNMR, Bruker Analytische Messtechnik GmbH
##OWNER= root
$$ XWIN-NMR		Version 3.5
$$ Wed Sep 22 09:26:07 2021 Russian Standard Time (UT+4h)  she@DPX200
##.OBSERVE FREQUENCY= 200.1314
##.OBSERVE NUCLEUS= ^1H
##.DELAY= (6, 6)
##.ACQUISITION MODE= SIMULTANEOUS
##.ACQUISITION SCHEME= undefined
##.AVERAGES= 8
##.DIGITISER RES= 18
##SPECTROMETER/DATA SYSTEM= spect
##.PULSE SEQUENCE= zg30
##.SOLVENT NAME= CDCl3
##.SHIFT REFERENCE= (INTERNAL, CDCl3, 0, 15.7039)
##AUDIT TRAIL= $$ (NUMBER, WHEN, WHO, WHERE, WHAT)
$$ ##TITLE= Audit trail, XWIN-NMR		Version 3.5
$$ ##JCAMPDX= 5.01
$$ ##ORIGIN= Bruker BioSpin GmbH
$$ ##OWNER= she
$$ F:/spectra/data/she/nmr/H-F/1/audita.txt
$$ ##AUDIT TRAIL=  $$ (NUMBER, WHEN, WHO, WHERE, WHAT)
(   1,<2021-09-22 09:24:51.76 +0400>,<she>,<DPX200>,
      <created by zg, POWCHK disabled, PULCHK disabled
       configuration hash MD5:
       00 E9 B6 7A A2 85 ED C7 34 08 36 98 17 FE 4E 26
       data hash MD5: 16K
       1B 96 74 12 79 DF E6 64 EB C2 40 24 28 92 94 74>)
$$ ##END=
$$ 
$$ hash MD5
$$ 7A 16 20 1C A2 D2 38 CF F0 60 59 A6 2E C9 B6 4B
##$RELAX= 
##$RELAX= 
##$RELAX= 
##$RELAX= 
##$RELAX= 
##$RELAX= 
$$ Bruker specific parameters
$$ --------------------------
##$DU= <F:/spectra>
##$EXPNO= 1
##$NAME= <H-F>
##$PROCNO= 1
##$TYPE= <nmr>
##$USER= <she>
##$AMP= (0..31)
100 100 100 100 100 100 100 100 100 100 100 100 100 100 100 100 100 100 
100 100 100 100 100 100 100 100 100 100 100 100 100 100 
##$AQSEQ= 0
##$AQ_mod= 1
##$AUNM= <au_zg>
##$AUTOPOS= <>
##$BF1= 200.13
##$BF2= 200.13
##$BF3= 200.13
##$BF4= 200.13
##$BF5= 200.13
##$BF6= 200.13
##$BF7= 200.13
##$BF8= 200.13
##$BYTORDA= 1
##$CFDGTYP= 0
##$CFRGTYP= 5
##$CHEMSTR= <none>
##$CNST= (0..31)
1 1 145 1 1 1 1 1 1 1 1 1 1 1 1 1 1 1 1 1 1 1 1 1 1 1 1 1 1 1 1 1 
##$CPDPRG= <>
##$CPDPRG1= <>
##$CPDPRG2= <>
##$CPDPRG3= <>
##$CPDPRG4= <mlev>
##$CPDPRG5= <mlev>
##$CPDPRG6= <mlev>
##$CPDPRG7= <mlev>
##$CPDPRG8= <mlev>
##$CPDPRGB= <>
##$CPDPRGT= <>
##$D= (0..31)
0 1.2 0 0 0 0 0 0 0 0.06 0 0.03 0 0 0 0 0.0002 0 0 0 0 0 0 0 0 0 0 0 0 
0 0 0 
##$DATE= 1632288291
##$DBL= (0..7)
120 120 120 120 120 120 120 120 
##$DBP= (0..7)
150 150 150 150 150 150 150 150 
##$DBP07= 0
##$DBPNAM0= <>
##$DBPNAM1= <>
##$DBPNAM2= <>
##$DBPNAM3= <>
##$DBPNAM4= <>
##$DBPNAM5= <>
##$DBPNAM6= <>
##$DBPNAM7= <>
##$DBPOAL= (0..7)
0.5 0.5 0.5 0.5 0.5 0.5 0.5 0.5 
##$DBPOFFS= (0..7)
0 0 0 0 0 0 0 0 
##$DE= 6
##$DECBNUC= <off>
##$DECIM= 32
##$DECNUC= <off>
##$DECSTAT= 4
##$DIGMOD= 1
##$DIGTYP= 9
##$DL= (0..7)
0 120 120 120 120 120 120 120 
##$DP= (0..7)
150 150 150 150 150 150 150 150 
##$DP07= 0
##$DPNAME0= <>
##$DPNAME1= <>
##$DPNAME2= <>
##$DPNAME3= <>
##$DPNAME4= <>
##$DPNAME5= <>
##$DPNAME6= <>
##$DPNAME7= <>
##$DPOAL= (0..7)
0.5 0.5 0.5 0.5 0.5 0.5 0.5 0.5 
##$DPOFFS= (0..7)
0 0 0 0 0 0 0 0 
##$DQDMODE= 0
##$DR= 18
##$DS= 0
##$DSLIST= <SSSSSSSSSSSSSSS>
$$ [...]
##$SUBNAM2= <"">
##$SUBNAM3= <"">
##$SUBNAM4= <"">
##$SUBNAM5= <"">
##$SUBNAM6= <"">
##$SUBNAM7= <"">
##$SUBNAM8= <"">
##$SUBNAM9= <"">
##$SW= 20.0188988654967
##$SWIBOX= (0..15)
0 0 2 0 0 0 0 0 0 0 0 0 0 0 0 0 
##$SW_h= 4006.41025641026
##$TD= 16384
##$TD0= 1
##$TE= 0
##$TE2= 300
##$TE3= 300
##$TEG= 300
##$TL= (0..7)
0 120 120 120 120 120 120 120 
##$TP= (0..7)
150 150 150 150 150 150 150 150 
##$TP07= 0
##$TPNAME0= <>
##$TPNAME1= <>
##$TPNAME2= <>
##$TPNAME3= <>
##$TPNAME4= <>
##$TPNAME5= <>
##$TPNAME6= <>
##$TPNAME7= <>
##$TPOAL= (0..7)
0.5 0.5 0.5 0.5 0.5 0.5 0.5 0.5 
##$TPOFFS= (0..7)
0 0 0 0 0 0 0 0 
##$TUNHIN= 0
##$TUNHOUT= 0
##$TUNXOUT= 0
##$USERA1= <user>
##$USERA2= <user>
##$USERA3= <user>
##$USERA4= <user>
##$USERA5= <user>
##$V9= 5
##$VALIST= <valist>
##$VCLIST= <CCCCCCCCCCCCCCC>
##$VD= 0
##$VDLIST= <DDDDDDDDDDDDDDD>
##$VPLIST= <PPPPPPPPPPPPPPP>
##$VTLIST= <TTTTTTTTTTTTTTT>
##$WBST= 1024
##$WBSW= 4
##$XGAIN= (0..3)
0 0 0 0 
##$XL= 0
##$YL= 0
##$YMAX_a= 124578
##$YMIN_a= -234367
##$ZGOPTNS= <>
##$ZL1= 120
##$ZL2= 120
##$ZL3= 120
##$ZL4= 120
##$ABSF1= 10
##$ABSF2= 0
##$ABSG= 5
##$ABSL= 3
##$ALPHA= 0
##$AQORDER= 0
##$ASSFAC= 0
##$ASSFACI= 0
##$ASSFACX= 0
##$ASSWID= 0
##$AUNMP= <proc_1d>
##$AZFE= 0.1
##$AZFW= 0.1
##$BCFW= 1
##$BC_mod= 2
##$BYTORDP= 1
##$COROFFS= 0
##$CY= 11.3945322036743
##$DATMOD= 1
##$DC= 2
##$DFILT= <>
##$DTYPP= 0
##$F1P= 2.36226072786647
##$F2P= -0.459571619588291
##$FCOR= 0.5
##$FTSIZE= 0
##$FT_mod= 4
##$GAMMA= 1
##$GB= 0.15
##$INTBC= 1
##$INTSCL= 1
##$ISEN= 128
##$LB= 0.24
##$LEV0= 0
##$LPBIN= 0
##$MAXI= 10000
##$MC2= 0
##$MEAN= 0
##$ME_mod= 0
##$MI= 1.114404
##$NCOEF= 0
##$NC_proc= 0
##$NLEV= 6
##$NOISF1= 3.799351
##$NOISF2= 2.8
##$NSP= 1
##$NTH_PI= 0
##$NZP= 0
##$OFFSET= 15.70392
##$PC= 1
##$PHC0= -14086.38
##$PHC1= 26.60089
##$PH_mod= 1
##$PKNL= yes
##$PPARMOD= 0
##$PSCAL= 0
##$PSIGN= 0
##$REVERSE= no
##$SF= 200.130013532006
##$SI= 16384
##$SIGF1= 3
##$SIGF2= 2
##$SINO= 400
##$SIOLD= 16384
##$SREGLST= <1H.CDCl3>
##$SSB= 0
##$STSI= 0
##$STSR= 0
##$SW_p= 3612.71676300578
##$SYMM= 0
##$S_DEV= 0
##$TDeff= 0
##$TDoff= 0
##$TI= <>
##$TILT= no
##$TM1= 0
##$TM2= 0
##$TOPLEV= 0
##$USERP1= <user>
##$USERP2= <user>
##$USERP3= <user>
##$USERP4= <user>
##$USERP5= <user>
##$WDW= 1
##$XDIM= 8192
##$YMAX_p= 0
##$YMIN_p= 0
$$ End of Bruker specific parameters
$$ ---------------------------------
##NTUPLES= NMR FID
##VAR_NAME=  TIME,          FID/REAL,        FID/IMAG
##SYMBOL=    X,             R,               I
##VAR_TYPE=  INDEPENDENT,   DEPENDENT,       DEPENDENT
##VAR_FORM=  AFFN,          ASDF,            ASDF
##VAR_DIM=   8192,          8192,            8192
##UNITS=     SECONDS,       ARBITRARY UNITS, ARBITRARY UNITS
##FACTOR=    0.0002496,     1,               1
##FIRST=     0,             0,               0
##LAST=      2.0444736,     0,               0
##MIN=       0,             -234367,         0
##MAX=       2.0444736,     124578,          0
$$ Real data points
##PAGE= N=1
##DATA TABLE= (X++(R..R)), XYDATA
$$ [...]
1782b72K93L64l5o62M62K64l91m19J61Q3L4j09J94J94k49p1n8m6K57M8m26m9J73
$$ -272 21 385 350 -312 150 414 23 -396 -235 -152 -118 -227 -33 161 -88 -159 -217 -263 -6 42 -384 -433 -260
1805b60J42m16j28P23p9l77j2J75J47o0J35m61K60M25j35n67K11Q27m32k43K10
$$ -260 -118 -534 -662 61 -18 -395 -407 -232 -85 -145 -10 -471 -211 214 79 -488 -277 550 118 -125 85
1826H5k1K50l56J8n2M66K8n01k34R14j59l43j1R8L29j04m48L51j36M7k30%J07
$$ 85 64 314 -42 -24 -76 390 418 -83 -317 597 438 95 84 182 511 407 -41 310 174 221 -9 -9 98
1849I8j0K56p13L02M35j80l86J68J36J07l51k93O1K57J0k10j9j1M53l46j49M72
$$ 98 88 344 -369 -67 368 188 -198 -30 106 213 -138 -431 -370 -113 -103 -313 -332 -343 110 -236 -385 87
1871H7j53Q4m68L58J5M13o04l9J20K88k70K66o9j79L34k27n9K82J43l24j36J39
$$ 87 -66 18 -450 -92 -77 336 -268 -307 -187 101 -169 97 28 -151 183 -44 -103 179 322 -2 -138 1
1893AK45k48n9K80j51M05l88k18K16j64L92l41K64K34l85J50m00M56K15l21k67
$$ 1 246 -2 -61 219 68 473 85 -133 83 -81 311 -30 234 468 83 233 -167 289 504 183 -84
1914h4J96J83k69j69L6J07J54k47q1l7M95m12k7p3J29n2j76K88j29O8r9j53K35
$$ -84 112 295 26 -143 -107 0 154 -93 -174 -211 284 -128 -155 -228 -99 -151 -327 -39 -168 -100 -199 -352 -117
1937a17j79K02k03lL50L6j72l94N27j96J60j25j24K96Ml08N24j15P9J67p48L87
$$ -117 -296 -94 -297 -300 50 86 -86 -480 47 -149 11 -114 -238 58 62 -246 278 163 242 409 -339 48
1959D8J13M05n17J9K3k04L09J85j92K6J52n64LM84Q9l39J30q9J58Lj45r5K90l66
$$ 48 161 566 49 68 91 -113 196 381 189 215 367 -197 -194 290 379 40 170 81 239 242 97 2 292 -74
1983g4K80r3j36K15N9l37j99L88j92l4k1J29M8j71o6k02L32j55L4j17K37L69m15
$$ -74 206 113 -23 192 251 -86 -285 103 -89 -123 -144 -15 33 -138 -204 -406 -74 -229 -195 -312 -75 294 -121
2006a21l31M71K10l99p8r6N09j05j40j37o2K96m6r0j27M46m6j98j17K80L35m96
$$ -121 -452 19 229 -170 -248 -344 165 60 -80 -217 -279 17 -29 -119 -246 200 154 -44 -161 119 454 -42
2028d2K04K43o2k24J44J29l01M16k87L0k82L78o0k74K73l14J96j06JJ49J26m17
$$ -42 162 405 343 119 263 392 91 507 220 250 -32 346 286 12 285 -29 167 61 62 211 337 -80
2050h0Mr7L73k75j04J08J27M9k58j01K53K08j88m17N8Q8L53n18J49J80j9L9k30
$$ -80 -76 -173 200 -75 -179 -71 56 105 -153 -254 -1 207 19 -398 -340 -252 101 -417 -268 -88 -107 -68 -298
2073b98J26L25o1l27k8L84j2l89R1k6M28q4o8j49K45K23l82M4j7N63k10l98j7
$$ -298 -172 153 92 -235 -263 121 109 -280 -189 -215 213 129 61 -88 157 380 -2 42 25 588 378 -20 -37
2096c7K16L00p29J64J98K10m28K39J8m7j20l2k95M20j31j42J40J29M7j43P4L5
$$ -37 179 479 -250 -86 112 322 -106 133 151 104 -16 -48 -343 77 -54 -196 -56 73 120 -23 51 86
2118H6j35Pj10L4K05j32K13m33O8K95J24m43j58M87k98%R1p9J18qK34l11J04r1
$$ 86 -49 -42 -152 -118 87 -45 168 -265 -197 98 222 -221 -379 108 -190 -190 -99 -178 -60 -68 166 -145 -41 -132
2142a32k21K22j70K20L5k0m5K50l0j80J21n3J94J2m72O1M21k46m2j94L98K15n31
$$ -132 -353 -131 -301 -81 -46 -66 -111 139 109 -71 50 -3 191 203 -269 -208 213 -33 -75 -269 129 344 -187
2165a87J79r2L90j71k5j57P0J77l35M27L5J00j60l12J64L85m43k01J21J84j69
$$ -187 -8 -100 290 119 94 -63 7 184 -151 276 311 411 251 -61 103 488 45 -156 -35 149 -20
2186b0m06J09K83J95j22j63k56L33Ok0l03L14q0pJ38k50N3K93k58o6m3K26lp4
$$ -20 -426 -317 -34 161 39 -124 -380 -47 -41 -61 -364 -50 -130 -137 1 -249 -196 97 -161 -227 -270 -44 -47 -121
2210a21N0L28k56J0j29K70Pk54L65j06j26p3J43j01K0J97o8k34J95J32p2j13N2
$$ -121 -71 257 1 11 -118 152 159 -95 270 164 38 -35 108 7 27 224 156 -78 117 249 177 64 116
2233A16J6J7k54K16J48%L45m63j84j9J03Q8l55O08k20l47k2J39J87l21l7J71l1
$$ 116 132 149 -105 111 259 259 604 141 -43 -62 41 129 -226 382 162 -185 -207 -68 119 -202 -239 -68 -99
2256i9j90K68q2q4J46k36j54M09J21k7l12J88J95n0k92K12J31l2k29J87k34O10
$$ -99 -289 -21 -103 -187 -41 -277 -431 -22 99 72 -240 -52 143 93 -199 13 144 112 -117 70 -164 446
2278D46l89l06J3J65R2J4L52l25l9Q9j72J18m0K32K33n89L44m01L28r1j46M17
$$ 446 57 -249 -236 -71 21 35 387 62 23 112 -60 58 18 250 483 -106 238 -163 165 74 -72 345
2300C45L1j95N6l22J41J8m5j40J43M51m31n2j35L14m35j37L23L71j75k74R7L14
$$ 345 376 181 237 -85 56 74 29 -111 32 483 52 0 -135 179 -256 -393 -70 301 126 -148 -51 263
2322B63m5l9k95J32n6J95l30K17K5j54P2j83R2K55k34L0p6L4j2p1n7R3J36O4m8
$$ 263 218 179 -116 16 -40 155 -175 42 67 -87 -15 -198 -106 149 -85 -55 -131 -97 -109 -180 -237 -144 -8 56 8
2347HN3q7J21j24K72Q6l91r0M5K19k5J74k45J20j28P3m6L3M5j20m8J44j2O0k18
$$ 8 61 -26 95 -29 243 329 -62 -152 -107 112 87 261 16 136 8 81 35 68 113 -7 -55 89 77 137 -81
2372h1M9N4J53J15m34j7l0L89l17j09L77q3j7k05K72j31j62K32j58N1qJ81j57
$$ -81 -32 22 175 290 -144 -161 -191 198 -119 -228 149 66 49 -156 116 -15 -177 55 -103 -52 -60 121 -36
2395c6k07K99n0Ml52L42M2O6l24J31P2k08Q5M1rMM3J3K5M3K19k83J10L7K2j38
$$ -36 -243 56 6 10 -342 0 42 108 -216 -85 -13 -221 -136 -95 -104 -100 -57 -44 -19 24 243 -40 70 107 129 -9
2421il0L95j49n0K3k33J66n1j5P0j78P3L23j37q9P0j96L3J74n02N38k8k01j80
$$ -9 -39 356 207 157 180 -53 113 62 47 117 -61 12 335 198 109 179 -17 16 190 -312 226 198 -3 -183
2445a83k9K74j65j9J33pp2J9K53j57k2r5j03J90Q4j02p8q8L00l1j16k24N14j99
$$ -183 -212 62 -103 -122 11 4 -68 -49 204 47 25 -70 -173 17 101 -1 -79 -167 133 102 -14 -238 276 77
2469G7K7l79L85k83K27k17J48K41l5j74k08L29R6o4M6j43j30L81m70L84J50m22
$$ 77 104 -275 110 -173 54 -163 -15 226 191 17 -191 138 234 170 216 73 -57 324 -146 238 388 -34
2491c4L8q6K34L33l48o6m9K94N4l29Rk23J9Q2M6K9J36j01k83J76l6J58L64l91
$$ -34 4 -82 152 485 137 71 22 316 370 41 50 -173 -154 -72 -26 3 139 38 -245 -69 -105 53 417 26
2515B6k33J37M5j59M7K13N0j00m91N21j6j40n4O9L12m82Q3J66J7q1O2ok71M81
$$ 26 -207 -70 -25 -184 -137 76 126 26 -465 56 40 -100 -154 -85 227 -255 -172 -6 11 -70 -8 -14 -285 196
2539A96k49J00q4n0M90j83k58L10ok39j41L11J5J12m7l93k3M24m67k3L21%j34
$$ 196 -53 47 -37 -87 403 220 -38 272 266 27 -114 197 212 324 277 -116 -139 285 -182 -205 116 116 -18
2562a8J23j9O1k45J37J66k15K15J00l64P0J14J7j70oLJ38k1n6p6l7L8k03J98j72
$$ -18 105 86 147 -98 39 205 -10 205 305 -59 11 125 142 -28 -34 -31 107 86 30 -46 -83 -45 -248 -50 -222
2587b22M58k96R2J48pq8j06J68k00j06J22q9L36l81R2K5J38L3Qk81p4K92j31Q3
$$ -222 236 -60 32 180 173 85 -21 147 -53 -159 -37 -126 210 -171 -79 -54 84 117 125 -156 -230 62 -69 14
2611A4n1J1j27R7J97p2l1R6J5j37R7L70m48j07n7JJ31N1m8l3L08k22l4jK23j72
$$ 14 -37 -26 -153 -56 141 69 38 134 149 12 109 479 31 -76 -133 -132 -1 50 2 -31 277 55 21 20 243 71
2637G1j21J66L7m6M3j85L4L36l67J18j38j4r4L6L19m08K64P2j46M0M6Kj19k16
$$ 71 -50 116 153 107 150 -35 -1 335 -32 86 -52 -66 -160 -124 195 -213 51 123 -23 17 63 65 -54 -270
2661b70L25p9o8m5J72p6j54QK35K27j79k12J74l23K15k00K12Q5J88p6o9m0L3l77
$$ -270 55 -24 -92 -137 35 -41 -195 -187 48 275 96 -116 58 -265 -50 -250 -38 47 235 159 90 50 83 -294
2685b94M71j86j15M53k60R0j97M1J03O5q3j36J82n0O3k51J71r9r8O6J70l22K03
$$ -294 177 -9 -124 329 69 159 -38 3 106 171 88 -48 134 84 147 -104 67 -32 -130 -64 106 -216 -13
2708a3l4N0m4j84J22j7R6J84k00J60j95O6j73R2j7j6J36pO9Pk8m4j14o7J43j29
$$ -13 -47 3 -41 -225 -103 -120 -24 160 -40 120 -75 -9 -182 -90 -107 -123 13 6 75 82 54 10 -104 -171 -28 -157
2734a57K07k77N23l78J62j03r8K02n8k22L04j50J69k13J68L1l52J80J50j04p6
$$ -157 50 -227 296 -82 80 -23 -121 81 23 -199 105 -45 124 -89 79 110 -242 -62 88 -16 -92
2755i2K01k26J50J0k17M39n52K85rj67K31J07j36l71L10j7n1J88l59K95j40J01
$$ -92 109 -117 33 43 -174 265 -287 -2 -11 -178 53 160 24 -347 -37 -54 -105 83 -276 19 -121 -20
2777b0o3rj5K66k41L04j07j99J0Q1j8k02M05l30J85l44M04R8J12n61L14j7J3L0
$$ -20 -83 -92 -107 159 -82 222 115 -84 -74 7 -11 -213 192 -138 47 -297 107 205 317 -244 70 53 66 96
2801I6j65J33p5k21L0K01j2k17L80l24J34Q5l8L8k7L12j91k02J02j19m3K89J7
$$ 96 -69 64 -11 -232 -202 -1 -13 -230 150 -174 -40 45 7 45 18 330 139 -63 39 -80 -123 166 183
2824A83j11j0P2o2l29J14J33j65j15J91r9J31J49o1k49J10J29l4L0k23Q1jk4R0
$$ 183 72 62 134 72 -257 -143 -10 -175 -290 -99 -198 -67 82 21 -228 -118 11 -23 7 -216 -135 -136 -160 -70
2848g0Rk00o2J33L81k98N6J41q6L4q1J12k18r6J91l0K2k36K50J80J52k79O4n9
$$ -70 -61 -261 -323 -190 191 -107 -51 90 4 38 -43 69 -149 -245 -54 -84 -62 -298 -48 132 284 5 69 10
2872A0o3K96o5j91p3O1M14k91k66J34nn3J27J0L74k9k90K04l05K79l62R4K51n22
$$ 10 -53 243 178 -13 -86 -25 389 98 -168 -34 -39 -92 35 45 419 390 100 304 -1 278 -84 10 261 -261
2896b61L69l4q4M0J68l40k4J96j89J87l09M88j22k09J9nJ65r1j56K22J06k63k6
$$ -261 108 74 -10 30 198 -142 -166 30 -159 28 -281 207 85 -124 -105 -110 55 -36 -192 30 136 -127 -153
2919a53m0J30J16M9l8j10n5L62j00m5l42L1J45Lj90L73k54N0p0L03O8J68k62j39
$$ -153 -193 -63 53 102 64 -46 -101 261 161 116 -226 -195 -50 -47 -237 136 -118 -68 -138 165 233 401 139 0
2943@k3J39q7j2l4K03j66J09o6l1m6K4K57l85OR5Q3l4k0j17j9L25k29R3k1r8j73
$$ 0 -23 116 29 17 -17 186 20 129 63 32 -14 10 267 -118 -112 -17 66 32 12 -105 -124 201 -28 65 44 -54 -227
2970b27J97K8l26L39r4K28j89K5j14K89k81L1j95M38m5k71L06o3J42Ql73J0L42
$$ -227 -30 -2 -328 11 -83 145 -44 -19 -133 156 -125 -94 -289 149 104 -167 139 76 218 226 -147 -137 205
2993B05J03l06%m5K57k64j74K78J17o1l05lL52n9M0l58M17k50k8J66k06J62J09
$$ 205 308 2 2 -43 214 -50 -224 54 171 110 -195 -198 154 95 135 -223 194 -56 -84 82 -124 38 147
3016A47j35l3j18J76J35k80J38J27k95J00j16K59K12k06r9j78L04j01k37K54J1
$$ 147 12 -21 -139 37 172 -108 30 157 -138 -38 -154 105 317 111 12 -166 138 37 -200 54 65
3037F5j99L29j74O7q3K58l95J73j91L2L0J75J82k04k82J54Q3O5l3j27K33l21Q2
$$ 65 -134 195 21 88 5 263 -132 41 -150 -118 -88 87 269 65 -217 -63 20 85 52 -75 158 -163 -81
3060h1L70k91k4j85J29J3q0K27l5j64j21M71j05o4l3j86J18j31qK45j27o8J59
$$ -81 289 -2 -26 -211 -82 -69 -149 78 43 -121 -242 229 124 60 27 -159 -41 -172 -180 65 -62 -130 29
3083B9k57J35K46J31n80M82O8k91J71j99n4P0J03j92K2J00q7J66kj04rK65l66
$$ 29 -228 -93 153 284 -296 186 254 -37 134 -65 -119 -49 54 -138 -116 -16 -103 63 61 -43 -52 213 -153
3106a53L4K00l56L45k93K53k79J40K7M3j3J54k89J30K87l30O0pk4n8J33j37J9
$$ -153 -119 81 -275 70 -223 30 -249 -109 -82 -39 -52 102 -187 -57 230 -100 -40 -47 -71 -129 4 -133 -114
3129a14m7L09Mj7%L5o2j6j98O5K26j72J0R7j91j06K65Kj34LK8l73K41K15J86m12
$$ -114 -161 148 152 135 135 170 108 92 -106 -41 185 13 23 120 -71 -177 88 90 -44 -41 -13 -386 -145 70 256 -156
3155a56K26j45nP7Koj71P5j66J71J19J84j74J01k54P6J45j76N1qJ59j58j15J33
$$ -156 70 -75 -80 -3 -1 -7 -178 -103 -269 -98 21 205 31 132 -122 -46 99 -77 -26 -34 125 -33 -148 -15
3179a5M0r2O7L5l0m8O0J03j23K0r7KK34j55j49J72K39l89J54J74k75L77l57Lj28
$$ -15 25 -67 0 35 5 -43 17 120 -3 17 -80 -78 156 1 -148 24 263 -126 28 202 -73 304 -53 -50 -178
3204a78K77K15k41J77j62J25l91L06J47j71L05m18j3K64j04%j23k45J59J26j72
$$ -178 99 314 73 250 88 213 -178 128 275 104 409 -9 -22 242 138 138 15 -230 -71 55 -117
3225a17j00L70r0L9q0J14j21j08J77k25k3K35q9m1R5L0M5Q9m01L6L4L40k93o2
$$ -117 -217 153 63 102 22 136 15 -93 84 -141 -164 71 -18 -59 36 66 111 200 -201 -165 -131 209 -84 -146
3249a46M4K82l13P9J55k36j37J52M49l34J00k35j5K88o6K89m59l9J52K2k65K62
$$ -146 -102 180 -133 -54 101 -135 -272 -120 329 -5 95 -140 -155 133 67 356 -103 -142 10 32 -233 29
3271B9N1j3K52k00r6Q9j69J41j57K2J22K8l30M5O7j3K10j70L46l58o0L80j86K7
$$ 29 80 67 319 119 23 112 -57 84 -73 -51 71 99 -231 -186 -119 -132 78 -92 254 -104 -164 216 30 57
3295E7j70J83j31N7q3M52l31J75m21Q2R7l5O3J04l23J67J13j9k12K05o6K17m08
$$ 57 -113 70 -61 -4 -87 365 34 209 -212 -130 -33 -68 -5 99 -224 -57 56 37 -175 30 -36 181 -227
3318b27L12Pn20N56k38J80n7J30j95P8j77J08j08J07m0J1J54J51m57kJ83L2k67
$$ -227 85 92 -428 128 -110 70 13 143 -52 26 -151 -43 -151 -44 -84 -73 81 232 -225 -227 -44 -12 -279
3341b79J09L71n9l46Q0rK66j79kO7p3R4j60J57j23J86o3o3J52l72J47K47o9qj35
$$ -279 -170 201 142 -204 -124 -133 133 -46 -48 19 -54 40 -120 37 -86 100 37 -26 126 -246 -99 148 79 71 -64
3366f4K63Kl39j19K14P7o7O5j84J63J50r7j90r7K71q1o2K3K03l34J05K0K86l14
$$ -64 199 201 -138 -257 -43 34 -33 32 -152 11 161 64 -126 -223 48 -33 -95 -72 131 -203 -98 -78 208 -106
3390a06n3K6q1J31j59K89P9p7KK20r2l3k22K94m3m0k54N3J17j30j24k3M78k22
$$ -106 -159 -133 -214 -83 -242 47 126 49 51 271 179 146 -76 218 175 135 -119 -66 51 -79 -203 -226 252 30
3414C0qk8j0L70l99L56j31j65O0n09M18N9K91k46j65j12K65j77K38m52K83P9k34
$$ 30 22 -6 -16 354 -45 311 180 15 75 -434 -16 43 334 88 -77 -189 76 -101 137 -315 -32 47 -187
3437a87J34L67l72L3r8J02K77q8j8j67j41O8k5J00J50m92N43j72Oj05l2J17J11
$$ -187 -53 314 -58 -25 -123 -21 256 168 150 -17 -158 -90 -115 -15 135 -357 186 14 20 -85 -117 0 111
3460A11Nj58n6J32r3J07j27J10j33k7J84j69Pk9J78k7J51j71P7O5k01P0k30L63
$$ 111 116 -42 -98 34 -59 48 -79 31 -102 -129 55 -114 -107 -136 42 15 166 -5 72 137 -64 6 -224 139
3484A39O5k25k06L27p3m4L4j33j31L49l46R1L1L01l26K6K52j08J17p3j47J14K96
$$ 139 204 -21 -227 100 27 -17 17 -116 -247 102 -244 -153 -122 179 -147 -121 131 23 140 67 -80 34 330
3507C30k86J1j06j67K47l0J27l0k4o2N2l0p2m3k3M14l97J82l16O8K07o9o9J30
$$ 330 44 55 -51 -218 29 -1 126 96 72 10 62 32 -40 -83 -106 308 -89 93 -223 -155 52 -17 -86 44
3531D4l9P3Pj07j21K75j94K07M4k11Q9K14k30j36J69l62R9j11K45K36k55J30J22
$$ 44 5 78 85 -22 -143 132 -62 145 189 -22 67 281 51 -85 84 -278 -179 -290 -45 191 -64 66 188
3554A88l09K1m5K37l51K84k2JJ3j28K46j93j45N1k0J74m1m5j32K45P0o5j69K22
$$ 188 -121 -100 -145 92 -259 25 3 4 17 -111 135 -58 -203 -152 -172 2 -39 -84 -216 29 99 34 -135 87
3578H7Q3l74m8O4J1j12K72K40k03n9k24L47j41o9K4L5q8M39n94L32J30j90pL29
$$ 87 170 -204 -252 -188 -177 -289 -17 223 20 -39 -263 84 -57 -126 -102 -67 -155 284 -310 22 152 -38 -45 284
3602B84l28j4J56j66J49j36m2L10k86k85M91r1mk1O6M1k65J70N0NJ88l63J30J81
$$ 284 -44 -58 98 -68 81 -55 -97 213 -73 -358 133 42 38 17 83 124 -141 29 79 84 272 -91 39 220
3626B20j98k34J03l4Q9j04J10L06k55m0J41j6l05K86K23p2j81k29L38j52M2n5
$$ 220 22 -212 -109 -143 -54 -158 -48 258 3 -37 104 88 -217 69 292 220 39 -190 148 -4 38 -17
3648a7P5j61K30j05j23K9M8K35k56k58L84P5Q4m1j01j58j4J02j68M07k50j20R7
$$ -17 58 -103 127 22 -101 -72 -24 211 -45 -303 81 156 240 199 98 -60 -74 28 -140 267 17 -103 -6
3671fJ65k52L04o1j08m9P4P4L9k81J27J26k95L44k13k69K59k23J27J81k54P1K40
$$ -6 159 -93 211 150 42 -7 67 141 180 -101 26 152 -143 201 -12 -281 -22 -245 -118 63 -191 -120 120
3694A20k58Q5J61J1j51q4K41j23jr9P0N2J57k87M5n0J05n1K07r7j26L25l24q4
$$ 120 -138 -53 108 119 -32 -116 125 2 1 -98 -28 24 181 -106 -61 -111 -6 -57 150 53 -73 252 -72 -156
3718a56Kj2K87m4k76L20r6j6o0j89L51j28q9n0j22N62k51j43R2r4j8j59L68j67
$$ -156 -154 -166 121 77 -199 121 25 9 -51 -240 111 -17 -106 -156 -278 284 33 -110 -18 -112 -130 -289 79 -88
3742h8O5l0K4J90q7J72j87Q9j82J66m7o0R5j7j58P5J47k30J8K52k49RL56l59n8
$$ -88 -23 -53 -29 161 74 246 59 148 -34 132 85 25 120 103 -55 20 167 -63 -45 207 -42 -33 323 -36 -94
3767i4N6k1n16N98J14k70K92k09J64k28K28l17L57mo9k09j38O8K57j62O6No2L38
$$ -94 -38 -59 -575 23 137 -133 159 -50 114 -114 114 -203 154 150 81 -128 -266 -198 59 -103 -37 -32 -94 244
3791B44k70L27m82L37k4k61L7J49L8J29j88N0j38K05k45J81j23P0k78M75j39R
$$ 244 -26 301 -181 156 132 -129 -92 57 95 224 36 86 -52 153 -92 89 -34 36 -242 233 94 103
3813A03j77r8K68K13n76J29M07l51J18L7j45J60%p7k8Q5K06m34J38rJ38j85L85
$$ 103 -74 -172 96 309 -267 -138 269 -82 36 73 -72 88 88 11 -17 68 274 -160 -22 -31 107 -78 307
3836C07q7j35Nk59K07p6K29M2k48Q7r3j83M8j3R3J9O6j38J91K9j38K67k8k67K05
$$ 307 220 85 90 -169 38 -38 191 233 -15 72 -21 -204 -156 -169 -76 -57 9 -129 62 91 -47 220 192 -75 130
3861A30j74Q4k88L70R4k17k52M53j0j34l21J94k47L94R1j43p8j54K13O2q7Q3K43
$$ 130 -44 40 -248 122 216 -1 -253 200 190 56 -265 -71 -318 76 167 24 -54 -208 5 67 -20 63 306
3884C06l54l82O17J86o06M82k08r5k01L05R3k33P0j0J87l8P5l8n3l79K57J77N4
$$ 306 -48 -430 187 373 -233 249 41 -54 -255 50 143 -90 -20 -30 157 119 194 156 103 -276 -19 158 212
3907B12k7k50K49j95j42K94o9k03L5K57j17P7l98R9k9L63L2n2k55P3K53l02n3
$$ 212 185 -65 184 -11 -153 141 72 -131 -96 161 44 121 -277 -178 -207 156 188 136 -119 -46 207 -95 -148
3930a48J51j29J27P6q3J39l55J16K34n38O00k03j57j96M48n5R3p9j50J37K13n65
$$ -148 3 -126 1 77 -6 133 -222 -106 128 -410 190 -13 -170 -366 82 27 120 41 -109 28 241 -324
3952c24K25L3J9qp7k02K39L36j60M1j79P2lJj70J26q4l1L1K51O5k48J08K6L1k44
$$ -324 -99 -66 -47 -55 -132 -334 -95 241 81 122 -57 15 12 13 -157 -31 -115 -146 -115 136 201 -47 61 87 118 -126
3978a26K11R7j19L7O5n5J95l57J35j2Qk04K29%j13lQ2m5J91k44J34q9k06J77J37
$$ -126 85 182 63 100 165 110 305 -52 83 71 79 -125 104 104 -9 -12 70 25 216 -28 106 17 -189 -12 125
4003A25n1j75l0K13l4l5Oj71J16q8L32r9m1j04Q2N3j04M2j15K1%K5K00j80M2l1
$$ 125 74 -101 -131 82 48 13 19 -152 -36 -124 208 109 68 -36 46 99 -5 37 -78 -57 -57 -32 168 -12 30 -1
4029aQ2k06K41m26K70N9Q5k18J78j77L07j81q6J50k0M8j98l0J98l2j28K6K1l7
$$ -1 81 -125 116 -310 -40 19 104 -114 64 -113 194 13 -73 77 57 105 -93 -123 75 43 -85 -59 -38 -75
4053g5K45k77K11J4l53J01J33OJ90P6l38L40j40k73J86l37K64j33K02j21l8L02
$$ -75 170 -107 104 118 -235 -134 -1 5 195 271 -67 273 133 -140 46 -291 -27 -160 42 -79 -117 185
4075A85j64n5K6j22K51O6k88K23J8j56k55L56M5k19J98k50J81q1J81j60K90k11
$$ 185 21 -34 -8 -130 121 187 -101 122 140 -16 -271 85 130 -89 109 -141 40 -41 140 -20 270 59
4097E9p7k43M79k85K73j90k0L9kK40l13J36k37pl7K90j41k9K9k09j7N62l21M1
$$ 59 -18 -261 218 -67 206 16 -4 35 33 273 -40 96 -141 -148 -185 105 -36 -65 -36 -245 -262 300 -21 20
4121B0r5J41j03L2K1L2q3j3J44o8j21pn8J31j24L72m01k0K49R4m6P3j92j94J03
$$ 20 -75 66 -37 -5 16 48 -35 -48 96 28 -93 -100 -158 -27 -151 221 -180 -200 49 143 97 170 -22 -216 -113
4146a13J70L26o04K96q4j79p6J90J50r0K12j74j94K35J46j5j54p2M0l8q6oP4J94
$$ -113 57 383 -221 75 -9 -188 -264 -74 76 -14 198 24 -170 65 211 196 42 -30 10 -28 -114 -120 -46 148
4170A48j37j42J92l78M01j23J89rR1k36J08j27K63m06J62k70K05j84O6L07J01
$$ 148 11 -131 61 -317 84 -39 150 141 232 -4 104 -23 240 -166 -4 -274 -69 -253 -187 120 221
4191B21K2l03J15o9J06k43M9j5K9R8j6l5K69J23l34j10K68J0k55q4K24j2R0j76
$$ 221 243 -60 55 -14 92 -151 -102 -117 -88 10 -6 -41 228 351 17 -93 175 185 -70 -154 70 58 148 -28
4215b8l6O8J04J29J03m37J48m1K09l2p8R0p7l32K14l02M55P2j54j63J15o9R9j63
$$ -28 -64 4 108 237 340 -97 51 10 219 187 109 199 122 -210 4 -298 157 229 75 -88 27 -42 57 -106
4239a06K07q3l43L70k45J15J41j06P6J86k4j4r3k27J72J4K19j24j0m10N9M0K35
$$ -106 101 18 -325 45 -200 -85 56 -50 26 212 188 174 81 -146 26 40 259 135 125 -285 -226 -186 49
4262D9M6m11K95n0lL4r1K81N0j31j07n4p6N37l36q8K35j20j16j05J7J18j80J12
$$ 49 95 -316 -21 -71 -74 -40 -131 150 200 69 -38 -92 -168 369 33 -55 180 60 -56 -161 -144 -26 -206 -94
4286i4J9J05R3p5J42Q5m06L06l73K00O1K8k75j51L19J82m5P7r6j92k1j24L29j99
$$ -94 -75 30 123 48 190 275 -131 175 -198 2 63 91 -184 -335 -16 166 121 198 102 -90 -111 -235 94 -105
4310a05j19K44o4J64j56J84k19j03K21l14K15r8JK13N7j5J8j5J18k46L7j60K05
$$ -105 -224 20 -44 120 -36 148 -71 -174 47 -267 -52 -150 -149 64 121 106 124 109 227 -19 18 -142 63
4333F3j19J56J4m7j79P5P7k6m9K4N9r8J04N6k09K27q6p9K25j91L2J31pj81J44
$$ 63 -56 100 114 67 -112 -37 40 14 -35 -11 48 -50 54 110 -99 128 42 -37 188 -3 29 160 153 -28 116
4358A16j70K78j39k57M49k71Rp5J05Nl69L11j14M39k96J11k52J09o4K18J3j35
$$ 116 -54 224 85 -172 277 6 15 -60 45 50 -319 -8 -122 317 21 132 -120 -11 -75 143 156 21
4380B1j19L82k80M4k80J16L83l07n1j11J29L6j14j69K77L06l27K46j90Q7j07K58
$$ 21 -98 284 4 48 -232 -116 267 -40 -91 -202 -73 -37 -151 -320 -43 263 -64 182 -8 79 -28 230
4402B30l50k9K84j75n0L21j23l82M46j69k29M12j54J24j97n1K92r9K5k14k8qM98
$$ 230 -120 -149 135 -40 -90 231 108 -274 172 3 -226 186 32 156 -41 -92 200 101 126 -88 -116 -124 374
4425C74m31q4J97j79j57K11j48L10j90KPJ33j83J66o3Kj93K16K38k16l3M7m2q3
$$ 374 -57 -141 56 -123 -280 -69 -217 93 -97 -95 -88 45 -138 28 -35 -33 -226 -10 228 12 -21 26 -16 -99
4449i9J31J32n66K34K40K2m4j45k11K63K44k12po2k05L30l6J36m93L56j56J42
$$ -99 32 164 -402 -168 72 94 50 -95 -306 -43 201 -11 -18 -80 -285 45 9 145 -348 8 -148 -6
4471fP0r7j18R3Q9K11l27Q3o7q0K38M8R6l38J54Kj76M4M45k59q0j63M73k98l11
$$ -6 64 -33 -151 -58 31 242 -85 -2 -69 -149 89 137 233 -105 49 51 -125 -81 364 105 25 -138 335 37 -274
4496b74L20j60L46j81k29M3K06k61K53J8j27M2j1J81J1n8K6l01J91K65k57j55
$$ -274 46 -114 232 51 -178 -135 71 -190 63 81 -46 -4 -15 166 177 119 145 -156 35 300 43 -112
4518a12N52n64j2M38l79k64J44K78k79J37k1J93oJ09k16r6m6J95j84J41Oq3Kj33
$$ -112 440 -124 -136 302 -77 -341 -197 81 -198 -61 -82 111 105 214 -2 -98 -144 51 -133 8 14 -69 -67 -200
4542b00k25J43J47j48K67O5k3n0O2j81L01j74J6n4l1r6J49R4K0j14R6P4o3q8L6
$$ -200 -425 -282 -135 -283 -16 49 26 -24 38 -143 158 -16 0 -54 -85 -181 -32 62 82 -32 64 138 75 -13 23
4567B3L6m3j74J20mn0L48k05k85L13L0n2J12j66k87J81K18j00M8k20L31k14Q1
$$ 23 59 16 -158 -38 -42 -92 256 51 -234 79 109 57 169 3 -284 -103 115 15 63 -157 174 -40 41
4590D1J78k62J93m30K29J04k80J83J10r0j01L70o8j53n5K83l21Rm1J97r6k07K48
$$ 41 219 -43 150 -280 -51 53 -227 -44 66 -24 -125 245 177 24 -31 252 -69 -60 -101 96 0 -207 41
4613D1n8N2j36K73J7k85k16M64J29J40l99LN8J28j7j79p7j48n0J57m0L59n45L34
$$ 41 -17 35 -101 172 189 -96 -312 152 281 421 22 25 83 211 194 15 -62 -210 -260 -103 -143 216 -329 5
4637EO6q4J24l47J97J18l04K30k9Q2K2K79l09J3j57J58O2k64K02j26J84m00L84
$$ 5 71 -13 111 -236 -39 79 -225 5 -24 58 80 359 50 63 -94 64 126 -138 64 -62 122 -278 106
4660A06j40J22J74l83K4lQ9j29J66j32PL2J74j47J71l89N57j87k49K03N9k04K07
$$ 106 -34 88 262 -121 -97 -100 -11 -140 26 -106 -99 -67 107 -40 131 -258 299 112 -137 66 125 -79 128
4683A28j69r5K79l32K91M6k76p0L99j03j71K26o6j15k2N6J76m3r4l8P7j51N9L17
$$ 128 -41 -136 143 -189 102 148 -128 -198 201 98 -73 153 87 -28 -50 6 182 139 45 7 84 -67 -8 309
4707C09l33Q2qj74m2J24J8J15n7K74l49j28K29j1k00J17J03K6l2l27J45%p7j6
$$ 309 -24 58 50 -124 -166 -42 -24 91 34 308 -41 -169 60 49 -151 -34 69 95 63 -264 -119 -119 -196 -212
4731b12J27L00j36J02j09j53J13j68J68o1j3J23o1M4j67L58j85M2j32L8K69k91
$$ -212 -85 215 79 181 72 -81 32 -136 32 -29 -42 81 20 64 -103 255 70 112 -20 18 287 -4
4753dJ10Q8k69K13o4k40o4L80j38m2j13Q2J6k2J24j00k5J02K2k30R8n2k36N05
$$ -4 106 194 -75 138 74 -166 -230 150 12 -30 -143 -61 -45 -67 57 -43 -68 34 56 -174 -76 -128 -364 141
4777A41n0j28J50k55J24K86m76K2J62N9k24mn0J77n8m3J92N9k3j53K41k57J72
$$ 141 91 -37 113 -142 -18 268 -208 -186 -24 35 -189 -193 -243 -66 -124 -167 25 84 61 -92 149 -108 64
4800F4j11J49j86J28m4j36K16m3r2J17j39K06j3j73P4j15j88J12M53r7j11m95
$$ 64 -47 102 -84 44 0 -136 80 37 -55 62 -77 129 116 -57 17 -98 -286 -174 279 182 71 -424
4822d24M59L5j32j79L13r4j39K15l23M05j29J77k67J99k8k72r8J12N38l45Q8p6
$$ -424 35 70 -62 -241 72 -22 -161 54 -269 136 7 184 -83 116 88 -184 -282 -170 368 23 111 35
4844C5j02J87o8K12j18k34J65j11P6p3O3J44j56j35J47k13J13OK90j02k76J53
$$ 35 -67 120 52 264 146 -88 77 -34 42 -31 32 176 20 -115 32 -181 -68 -62 228 126 -150 3
4866Cj68K30K8O6k03m5K62o7o1Q0j7n4J14j66j92R4O1j95J94j60L08k26J38k45
$$ 3 -165 65 93 159 -44 -89 173 106 45 125 108 54 168 2 -190 -96 -35 -230 -36 -196 112 -114 24 -221
4890b21K70N7J9n5j19J56j06m9L01n67N6M18l33J69J17j30j36j32J65L0M1o2J29
$$ -221 49 106 125 70 -49 107 1 -48 253 -314 -258 160 -173 -4 113 -17 -153 -285 -120 -90 -49 -111 18
4913A8p9J81j77j3J76l89M03j39l5j87J51O3j75NK06j49L01j43p3K37J66l59J70
$$ 18 -61 120 -57 -70 106 -283 120 -19 -54 -241 -90 -27 -202 -197 9 -140 161 18 -55 182 348 -11 159
4936A59j55l2J53k8j51l6J6r6J68l8J36k31J4j35L03PL58o24q0K09l02L14J12
$$ 159 4 -28 125 97 -54 -90 -74 -170 -2 -40 96 -135 -121 -256 47 54 412 -212 -292 -83 -385 -71 41
4959D1k23j53M63O6l40P6K85l02K62j72M9rn9m6j52J4J57L2J82p3P9j57J9P0m07
$$ 41 -182 -335 128 194 -146 -70 215 -87 175 3 52 43 -16 -62 -214 -200 -43 -11 171 98 177 20 39 109 -298
4984b98M02j80Q5J2k38N09k66l02J34J69p6R2k28n6K44J18l4P9l10J87J45m07
$$ -298 104 -76 9 21 -217 292 26 -276 -142 27 -49 43 -185 -241 3 121 87 166 -144 43 188 -219
5006b19L27Q7l63p8R1J49q7J13k78N15m54oK11K6k7j46R9m7J78j75l5J69p8k8
$$ -219 108 195 -168 -246 -155 -6 -93 20 -258 257 -197 -203 8 34 7 -139 -40 -87 91 -84 -119 50 -28 -56
5030e6l6R7r8J26k15K8J58p8J65R0j31Q4k62J30p5j54L13k10j01K00L68l12k76
$$ -56 -92 5 -93 33 -182 -154 4 -74 91 181 50 134 -128 2 -73 -227 86 -124 -225 -25 343 31 -245
5053b45L8K17J02k61L4N1J54j07l12M22p4j10K58J83j18l27K83j90M0Q1k25L97
$$ -245 -207 10 112 -149 -115 -64 90 -17 -329 93 19 -91 167 350 232 -95 188 -2 38 119 -106 291
5075B91k91j24J64J83k99J06j08J60l9K21j59K2k4l03r3K94j29rJ20j04J89k01
$$ 291 0 -124 40 223 -76 30 -78 82 43 264 105 127 103 -200 -293 1 -128 -137 -17 -121 68 -133
5097a33J19J78j67k83N2J06K21n30L74o6J54p3l10L50L7lQ3m33L82J84m11L9J7
$$ -133 -14 164 -3 -286 -234 -128 93 -437 -63 -129 25 -48 -358 -8 29 26 109 -324 58 242 -169 -130 -113
5120a13K29L9k17L22j86k3j55J87k8R5o6m0K9J0j4J62o0l12J33J34ml2o6q1M0
$$ -113 116 155 -62 260 74 51 -104 83 55 150 84 44 73 83 69 231 171 -141 -8 126 122 90 24 -57 -17
5145a7k8k02K35J76m4k15K45j71p1k8R5J01k65K80j70J89k23o9L4k2J36K85l51
$$ -17 -45 -247 -12 164 120 -95 150 -21 -92 -120 -25 76 -189 91 -79 110 -113 -182 -148 -170 -34 251 -100
5168a00L10j67k9N2P%J06l60l4J68LK36K0l88P0Q1j14J64k67Q2M51l70j59K37
$$ -100 210 43 14 66 73 73 179 -181 -215 -47 -44 192 212 -176 -106 -25 -139 25 -242 -160 291 -79 -238 -1
5192aL36l27P6j9J19K8k64O3RJK87l85N2k02N9L31k13k2N6j59M23j40l6l7j19
$$ -1 335 8 84 65 184 212 -52 11 20 21 308 -77 -25 -227 -168 163 -50 -72 -16 -175 248 108 72 35 -84
5217h4NJJ27J54j58L8Qj40J79o2j38lJ77l0R6m67K29Mj37L75j85l6J02J11k29
$$ -84 -79 -78 49 203 45 83 91 -49 130 68 -70 -73 104 74 170 -297 -68 -64 -201 174 -11 -47 55 166 -63
5242f3O0J19j55l3Kj6K53K6l70L16k63K19j52J18J21j61R9j25q5K50n4N3J26l51
$$ -63 -3 116 -39 -72 -70 -86 167 193 -177 139 -124 95 -57 61 182 21 120 -5 -90 160 106 159 285 -66
5266f6OO5l5K11k54j78K73n9J45k17j7K00L0j1o2j5j49L67n1m17l0L3M26k23L08
$$ -66 -60 5 -30 181 -73 -251 22 -37 108 -109 -126 74 104 93 31 16 -133 234 183 -234 -264 -231 195 -28 280
5291B80o2k32O6j09oK18k21K36j53K96k65j08o2j10K62kJ07j78pJ36k08L64n41
$$ 280 218 -14 52 -57 -63 155 -66 170 17 313 48 -60 -122 -232 30 28 135 -43 -50 86 -122 242 -299
5314b99K55o6qJ32Q1j20J44k09K75o3j5rK08j66k23r7K77j22K04j00JPK0k8J59
$$ -299 -44 -110 -118 14 95 -25 119 -90 185 122 107 98 306 140 -83 -180 97 -25 179 79 80 87 107 79 238
5339B38j36j65j5J11o2j20L22k13JM8LK60R5k46m1R6l15J48O0j31J23Pl85K82
$$ 238 102 -63 -78 33 -29 -149 173 -40 -39 9 12 272 367 121 80 176 -139 9 69 -62 61 68 -317 -35
5363c5J78j15j67K94j11l10L59J38j30l58L9K21j70L3K91k1m08L66j63J23K64
$$ -35 143 28 -139 155 44 -266 93 231 101 -257 -218 3 -167 -134 157 136 -272 94 -69 54 318
5384C18k48k75K66j25L3j4K03k38J33K1N2o3j80j0J23J00K9J18q8j06mn2k42J86
$$ 318 70 -205 61 -64 -31 -45 158 -80 53 74 126 63 -117 -127 -4 96 125 243 155 49 45 -7 -249 -63
5408f3J35l0k09K04k61J79j14K90j03j6k11M55Q8m05M26l98K05r2J04m9m51M62
$$ -63 72 42 -167 37 -224 -45 -159 131 28 12 -199 256 344 -61 365 -33 172 80 184 135 -316 146
5430A46k57k6K05m4kK5m7jn3l5K6j55K93k59R3L22m17N8R2q7J92j71K17k25p1
$$ 146 -111 -137 68 24 22 47 0 -1 -54 -89 -63 -218 75 -184 -91 231 -186 -128 -36 -123 69 -102 115 -110 -181
5455a81J09j75PK11K94j53k67J98PJ53l21M4N7J26k9j31Q9Q6o8R1j92l5L8L1l5
$$ -181 -72 -247 -240 -29 265 112 -155 43 50 203 -118 -74 -17 109 80 -51 38 124 56 147 -45 -80 -42 -11 -46
5480d6l40M25l5l1J89k68K00J53l78J29k5Q9K1p9j62J92l16L48j26J2j2K0L53
$$ -46 -386 39 4 -27 162 -106 94 247 -131 -2 -27 62 83 4 -158 34 -282 66 -60 -48 -60 -40 313
5503C13l48k6J04P1N5k09P2l8o3m0J99Qj47J30l43L84k13P7k7J93j70K81k60k3
$$ 313 -35 -61 43 114 169 -40 32 -6 -69 -109 90 98 -49 81 -262 122 -91 -14 -41 152 -18 263 3 -20
5527b0j64K04o8N1M1r4J40m7r2P6or4J60k7J13K8p1j56L0r5L35k3j68j65J23L6
$$ -20 -184 20 -48 3 44 -50 90 43 -49 27 21 -73 87 60 173 201 130 -26 4 -91 244 221 53 -112 11 47
5553D7k27K43n9Q6m46M17K28m26J69j33R5P8j90J20q7k55M61j54P7k60K16K97
$$ 47 -180 63 4 90 -356 61 289 -137 32 -101 -6 72 -118 2 -85 -340 121 -33 44 -216 0 297
5575B97k21rJ69n4K8j02j35n9N2K95j25k76K07k25K00j44J64m3Q9l1j92J85pk44
$$ 297 76 67 236 182 210 108 -27 -86 -34 261 136 -140 67 -158 42 -102 62 19 108 77 -115 70 63 -181
5599a81J69P5P5j44j2k9O7K45m24J70K00k96J88k6j89j5K04k10Q6q1N6m7J83j02
$$ -181 -12 63 138 -6 -18 -47 20 265 -159 11 211 -85 103 77 -112 -127 77 -133 -47 -128 -72 -119 64 -38
5623c8j03J87o0o1J15Q4k09J4n4k6K58n3O9n5j1j02L31l79M6J0j13J41k92M56
$$ -38 -141 46 -14 -75 40 124 -85 -71 -125 -151 107 54 123 68 57 -45 286 -93 -47 -37 -150 -9 -301 155
5647A55q7j84K70J37J3m15K99k55J4J92m16L22k42J62K8l81M86j00J27mk17NQ7
$$ 155 68 -116 154 291 304 -111 188 -67 -53 139 -277 45 -197 -35 -7 -388 98 -2 125 121 -96 -91 -4
5670dM0J11m05L60k7n6n21N00K4q7J27P9k31ok0q5q6K72n5JJ27J03L0q1j4k53
$$ -4 36 147 -258 102 75 19 -502 -2 22 -65 62 141 -90 -96 -116 -201 -287 -15 -70 -69 58 161 191 110 96 -157
5696a57J86J82j76J43j09j01J14m8J4K7j51K60k69J42J30l08N52k86k04j78J13
$$ -157 29 211 35 178 69 -32 82 34 48 75 -76 184 -85 57 187 -121 431 145 -59 -237 -124
5717a24L08k06j55L19k01Q4k32K7K10K0L1mn5o9r7Q5k2Q8J7J92k16r2K0j3J46
$$ -124 184 -22 -177 142 -59 25 -207 -180 30 50 81 77 22 -47 -144 -59 -81 7 24 216 0 -92 -72 -85 61
5742F1J25N3l92Q4R1l5j93J84j95K94l29L63l79K57j88nL07k28l7J14J5PJ39j9
$$ 61 186 239 -153 -69 22 -13 -206 -22 -217 77 -252 111 -268 -11 -199 -204 103 -125 -162 -48 -33 -26 113 94
5766I4J11l20J90j89K39k52q7K89N7k76K66K1n9j82L0O6k4k20J77O1L81n86J44
$$ 94 205 -115 75 -114 125 -127 -214 75 132 -144 122 143 84 -98 -68 -2 -26 -246 -69 -8 373 -213 -69
5789f9L91l38m1Rk2Q9j16J26R8K3L2j70J52j23N8rj32n7J07j5j59J13J69j55J35
$$ -69 322 -16 -57 -48 -70 19 -97 29 127 150 182 12 164 41 99 90 -42 -99 8 -7 -166 -53 116 -39 96
5814I6j45J28J22m54K11K9j17J87j63P4J59k70N4K69j24R9k58o8K13j68J96N2
$$ 96 -49 79 201 -253 -42 -13 -130 57 -106 -32 127 -143 -89 180 56 155 -103 -171 42 -126 70 122
5836A22R5j25k46J23qk99L02K11m43L87l91K54p1j10K31p1j2Q8K3J99q6l28K57
$$ 122 217 92 -154 -31 -39 -338 -36 175 -268 119 -272 -18 -89 -199 32 -39 -51 37 60 259 173 -155 102
5859A02k16K08J85m23R0K06k81L51K0j04k37Q3j60K41l0r2Q0j35K22K16l94J28
$$ 102 -114 94 279 -144 -54 152 -129 222 242 138 -99 -16 -176 65 35 -57 23 -112 110 326 -68 60
5881F0m8n8J47j69j34J22J56p4R0O0n87O99j76L8k29J18j67J45M9r8NK62Pk54
$$ 60 12 -46 101 -68 -202 -80 76 2 92 152 -435 264 88 126 -103 15 -152 -7 42 -56 -51 211 218 -36
5905c6K25k14J9L1q5P2K61pj92l20J27K14m5J02j95Q4L8J9n8m4J29k9p0j86J43
$$ -36 189 -25 -6 25 -60 12 273 266 74 -246 -119 95 50 152 -43 41 79 98 40 -4 125 96 26 -160 -17
5930a7N4j40J4M6L27l78l8J53O1K5k20J10Q8l6p3J46j97K94j40j97J77k24Q7J90
$$ -17 37 -103 -89 -43 284 -94 -132 21 82 107 -113 -3 85 49 -24 122 -75 219 79 -118 59 -165 -78 112
5954A12O3j45q7J12k59J18K03j32K39j82J47j9n4j72rJ88j48j09J14m9N6r0K21
$$ 112 175 30 -57 55 -204 -86 117 -15 224 42 189 170 116 -56 -65 123 -25 -134 -20 -69 -13 -103 118
5977A18N9l15J30K6l6R8o3K8j23L8O6j34J34Q9q0k30q9K15m6M6K99l62J93r7j05
$$ 118 177 -138 -8 18 -18 80 17 45 -78 -40 26 -108 26 115 35 -195 -284 -69 -115 -69 230 -132 61 -36 -141
6002a41M9k12M30J25m15K2jJ69J02k29R3p6J87k09p6J14J04K55R7m20j68L37j68
$$ -141 -92 -304 126 251 -164 -142 -143 26 128 -101 -8 -84 103 -106 -182 -68 36 291 388 -32 -200 137 -31
6025c1q0M40l04pk42M64k13j23J42L6j62L03p6k41r5K64L0Or6J67j68p9J48q7
$$ -31 -111 329 25 18 -224 240 27 -96 46 82 -80 223 147 -94 -189 75 105 111 15 182 14 -65 83 -4
6049dJ46l24L42M4k17N7K57n00n6K80nR6k18pq3K43q2k0K22m16M33j85Q9K66k87
$$ -4 142 -182 160 204 -13 44 301 -199 -255 25 20 116 -102 -109 -192 51 -31 -51 171 -245 188 3 92 358 71
6074G1J18k15P8j7k03L09o3j54J55P6k85K86j11j54K4p2L31r9m2J66j80r5J70
$$ 71 189 -26 52 35 -168 141 78 -76 79 155 -130 156 45 -109 -85 -157 174 75 33 199 19 -76 94
6097I4j97O8J75j53k15L57j14r7K20O9o5k31J42L3l23J7O9O7m8N1j9Pj37J80M2
$$ 94 -103 -35 140 -13 -228 129 15 -82 138 207 142 -89 53 86 -237 -220 -151 -84 -132 -81 -100 -93 -230 -50 -8
6122hk44N22o19M49j85L86l81j25K13j76L89N0n4m03K45k24K38Q7j19n0O2m05
$$ -8 -252 270 -349 100 -85 301 -80 -205 8 -168 221 271 217 -186 59 -165 73 160 41 -9 53 -352
6144c52L82j57jj2K17o3q3j59J85J02N4k17J52J02k27J09l8J38j26r4J48k87J44
$$ -352 30 -127 -128 -140 77 14 -69 -228 -43 59 113 -104 48 150 -77 32 -6 132 6 -88 60 -227 -83
6167h3J95k17J49O9l74M60l9%r6k84K18j74K08L19k25J24J7q9m15J81P2j91L79
$$ -83 112 -105 44 113 -261 199 160 160 64 -220 -2 -176 32 351 126 250 267 178 -237 -56 16 -175 204
6190B04m91M15k84J27J75q6q1j39N9n3P2J02O0j32m0J28K67l77M6k9O3l2j08k8
$$ 204 -287 128 -156 -29 146 60 -21 -160 -101 -154 -82 20 80 -52 -92 36 303 -74 -28 -57 6 -26 -134 -162
6214a62K10k78K13J12n6k34L91k21jj15l7L2K19l10K40nJ30m42K64J36o6N7K0
$$ -162 48 -230 -17 95 39 -195 196 -25 -26 -141 -178 -146 73 -237 3 -2 128 -314 -50 86 20 77 97
6237I7%r6L0l1J64j05r4q8K40j79O9l4K71k35j77J51r4K50j97p8J57O7J47j2j68
$$ 97 97 1 31 0 164 59 -35 -123 117 -62 7 -27 244 9 -168 -17 -111 139 -58 -136 21 88 235 223 55
6262E5J63k88j9J27j49L28l69P8M3k1r7K09PJ92p2m80L51K17m57K83K9j96J58
$$ 55 218 -70 -89 38 -111 217 -152 -74 -31 -52 -149 60 67 259 187 -293 58 275 -182 101 130 -66 92
6285I2l02O3L17o15L56L09k73K05j65j58M53r1l6q6j90K99L6j38j13P9k06L11
$$ 92 -210 -147 170 -445 -89 220 -53 152 -13 -171 282 191 155 69 -121 178 214 76 -37 42 -164 147
6307A47n5j98K4m7K12m3j52K3O8L11k55L8J1J59l31K07k14j34M54k14o9j9K70
$$ 147 92 -106 -82 -129 83 40 -112 -89 -21 290 35 73 84 243 -88 119 -95 -229 225 11 -58 -77 193
6330A93q6m7j6j08K59j11j62J50j51J9Q1m2J04j08J48q7k43K78K5m2p7j0O8k6
$$ 193 107 60 44 -64 195 84 -78 72 -79 -60 21 -21 83 -25 123 36 -207 71 96 54 -23 -33 35 9
6354IJ41j41K80m18K93p9J57k13k23K68N1n8Q4j87K55k39L2J33k1k58q8L50M2
$$ 9 150 9 289 -129 164 85 242 29 -194 74 125 67 151 -36 219 -20 12 145 124 -134 -222 128 170
6377A70j01m2k5K49m0q3n32N55j29l9J61k99j3J89J8N5%k2Qq5R2m13L65n0n9J3
$$ 170 69 27 2 251 211 128 -404 151 22 -17 144 -155 -168 21 39 94 94 72 80 -5 87 -326 39 -11 -70 -57
6403e7k58L92J2l41O8K75o5P2k3R8k71N8j28j78M83n4k11K04N3k23J31J13l4j69
$$ -57 -315 77 89 -252 -184 91 26 98 75 173 -98 -40 -168 -346 137 83 -128 76 129 -94 37 150 116 -53
6427e3K4r0J92J25k37j9j94M55l11j81K15l6lJ0J89K5j14P7J52j49k9Q7k54n5
$$ -53 -29 -119 73 198 -39 -58 -252 203 -108 -289 -74 -110 -113 -103 86 111 -3 74 226 77 48 135 -119 -174
6451a74J03J14J49j59J33k23o7K89k42r7L59j73K10k09Q7p7J17k52J97k95M58
$$ -174 -71 43 192 33 166 -57 -124 165 -77 -174 185 12 222 13 100 23 140 -112 85 -210 248
6472B48j24j87K14j97p1QJ87l8K6lo4q2k4J75k5j64r3O4l3K81J47m39m8J60%O
$$ 248 124 -63 151 -46 -117 -109 78 40 66 63 -1 -83 -107 68 43 -121 -214 -150 -183 98 245 -194 -242 -82 -82 -76
6498g6K47m0k55J75O8j72J14p6J91k43K53l17K80j25L2j83j16L13R5l20J89n2
$$ -76 171 131 -124 51 119 -53 61 -15 176 -67 186 -131 149 24 56 -127 -243 70 165 -155 34 -18
6520a8Q7J17k15j04J25N4K3J63j82p9j93J73R2l37L20p4N9j45J73J45l60K57l6
$$ -18 69 186 -29 -133 -8 46 69 232 50 -29 -222 -49 43 -294 26 -48 11 -134 39 184 -176 81 45
6543D5l46J64M6M33m52J12mJ10m3r6Q7R9l0r3o6J23j38J36j27j18L18j31J34p
$$ 45 -301 -137 -91 342 -110 2 -2 108 65 -31 56 155 125 32 -34 89 -49 87 -40 -158 160 29 163 156
6567A56j72pJ80o1Mj59J27MQ9j65o4O6N1j02M9k2j18K43l54J74Q0P3J60P2l80
$$ 156 -16 -23 157 96 100 -59 68 72 161 -4 -68 -2 49 -53 -4 -26 -144 99 -255 -81 -1 72 232 304 -76
6592g6o4K19k37J00p0J36j71j12O1K67l04J63J17j54R3J59k99J56J52k30J59j3
$$ -76 -140 79 -158 -58 -128 8 -163 -275 -214 53 -251 -88 29 -125 -32 127 -172 -16 136 -94 65 52
6614E2r5K78n2j13KL4j00M6p0J02k94J35l6M02k4k65L00m01L17m8J05l50J82k81
$$ 52 -43 235 183 70 72 106 6 52 -18 84 -210 -75 -111 291 267 2 302 -99 218 170 275 -75 107 -174
6638a74M18k96K01Q0j58m32M82J38k05j54N8j9p7K42k15K02M5j30j54K3Q8o9J60
$$ -174 244 -52 149 229 71 -361 121 259 54 -100 -42 -61 -138 104 -111 91 136 6 -148 -125 -37 -106 54
6661E4L49m71J56k85L12n10L05J38J36k1l07K18j66J77k38n1j16K15K34j05j55
$$ 54 403 -68 88 -197 115 -395 -90 48 184 163 -144 74 -92 85 -153 -204 -320 -105 129 24 -131
6682a31J21O5j22J44J27k73Nk11L03J07m9k06J34L1J26r5l8q4j29O1M3J15L6k31
$$ -131 -10 55 -67 77 204 -69 -64 -275 28 135 86 -120 14 45 171 76 38 -46 -175 -114 -71 44 80 -151
6706a51K15j61O9r8N3K05l5j55J55m07K81J89k51P6N6J44J35l46J31J2l15J35
$$ -151 64 -97 -28 -126 -73 132 97 -58 97 -310 -29 160 -91 -15 41 185 320 -26 105 117 -198 -63
6728f3Q1K49k94J57q6J00j86J67o1j29p1j37K31q3O6J56J50j99k15K19k2j6Lo6
$$ -63 18 267 -27 130 44 144 -42 125 64 -65 -136 -273 -42 -125 -59 97 247 48 -167 52 30 14 17 -49
6752d9K50r1l89L51J37l53M89n00K57K7k19J21k4J32m39K58K19l7l30K80J12j06
$$ -49 201 110 -279 72 209 -144 345 -155 102 129 -90 31 7 139 -300 -42 177 140 -190 90 202 96
6774I6j26L54k96l40K63J42m91M14j61J10l06L41J55m01J67J3L4P0J44p1j14p6
$$ 96 -30 324 28 -312 -49 93 -398 16 -145 -35 -341 0 155 -246 -79 -66 -32 38 182 111 -3 -79
6796g9J59j50O8k9j11J46R6p1J5j19L9J37j2N7l08R1n1K53n4j18J18L0r6m7K41
$$ -79 80 -70 -2 -31 -142 4 100 29 44 -75 -36 101 89 146 -162 -71 -122 131 77 -41 77 107 11 -36 205
6821B05k45R3J08j29J17k62J17k52J68J64J26k09J43m07L13Kp8P2K40l02J81l94
$$ 205 -40 53 161 32 149 -113 4 -248 -80 84 210 1 144 -263 50 52 -26 46 286 -16 165 -229
6843b29L72k44J42n6L16j47k47j26J46K11Q9m68N3L13p9Kj74n2R2j3J99K31o65
$$ -229 143 -101 41 -15 301 154 -93 -219 -73 138 227 -241 -188 125 46 48 -126 -178 -86 -99 100 331 -334
6866c34L62K2l8P8l29K54j23rm2L03k20oL07p0j23j10j53M2P7J52r6JR4J50j95
$$ -334 28 50 12 90 -239 15 -108 -117 -159 144 -76 -82 225 155 32 -78 -231 -189 -112 40 -56 -55 39 189 -6
6891fJ89j41j93O2k57M38j76J88KK4q3k87J54K76k13j36J93j41Mp1L19k60J35
$$ -6 183 42 -151 -89 -346 92 -84 104 106 130 47 -240 -86 190 -23 -159 34 -107 -103 -174 145 -115 20
6914B0j04K05l71K22N3q7J28q7o0K86l40j2J41L7k89K56n9q3l8O7j61M39j45%
$$ 20 -84 121 -250 -28 25 -62 66 -21 -81 205 -135 -147 -6 31 -258 -2 -61 -144 -182 -115 -276 163 18 18
6938A8j70Q2J75j72l06K99J10J6p5N7m4J27j9J37n18J19O5j69P4M00j7n0l95N1
$$ 18 -152 -70 105 -67 -373 -74 36 52 -23 34 -10 117 98 235 -283 -164 -99 -268 -194 206 189 139 -256 -205
6962b05J80O1k45K19k6q3J48J29q1J50m98K25k45Q6J43L3j24Q3j35L7jK44o6r8
$$ -205 -25 36 -209 10 -16 -99 49 178 97 247 -251 -26 -271 -185 -42 -9 -133 -50 -185 -148 -149 95 29 -69
6986f9rj10r3K49K00J4l17L8l1K62Jk57J71j18k20N02J01n48K36j03J65k55M0
$$ -69 -78 -188 -281 -32 168 182 -135 -97 -128 134 135 -122 49 -69 -289 213 314 -234 2 -101 64 -191 -151
7009a51K83J32n54L79QJ41m07J84J31J8k9j81mL06l75Q9q7Q0L08j47j59R2j09
$$ -151 132 264 -290 89 97 238 -169 15 146 164 135 -46 -50 256 -119 -30 -117 -37 271 124 -35 57 -52
7032e2j62K61J25Jj35j17J64j51m3M87l53P2j49O9n5J00K1k33K47j89l7K32m0
$$ -52 -214 47 172 173 38 -79 85 -66 -109 378 25 97 -52 17 -38 62 83 -150 97 -92 -129 103 63
7055F3jl0J79l93N75p20J90J13j20K9L88m52M51m31K10K12m83J67jN2K06l27M
$$ 63 62 32 211 -182 393 -327 -137 -24 -144 -115 273 -179 272 -159 51 263 -220 -53 -54 -2 204 -123 -119
7078a19nL49j25j89J75J17M8k66k0M5J30k75K10N3l8l10J47K22k54r1K37J03m8
$$ -119 -124 225 100 -89 86 203 251 -15 -35 10 140 -135 75 128 90 -220 -73 149 -105 -196 41 144 96
7101I6p7PK9o0r1J03j10j05K01q3J95K67k70J8l11K76j29pk0K32j67k80L53p0
$$ 96 19 26 55 -5 -96 7 -103 -208 -7 -90 105 372 102 120 -191 85 -44 -51 -71 161 -6 -286 67 -3
7125cJ77K0k86K45k89j63M2L08l23K21J11l62J13k5K37J09l47J91q5L55k83m7
$$ -3 174 194 -92 153 -136 -299 -257 51 -272 -51 60 -302 -189 -214 23 132 -215 -24 -109 246 -37 -84
7147h4r5J57j06J86j07N7K50j97M3j2j29Q3N4k09J84J1k44N6K27ll44K81J3j00
$$ -84 -179 -22 -128 58 -49 8 258 61 104 92 -37 46 100 -109 75 86 -158 -102 125 122 -222 59 72 -28
7171b8k07L81o9k7K86n48K52O7r8l2J36j12r2K46K40n84K31J94j80N6Q3m52L25
$$ -28 -235 146 77 50 336 -212 40 107 9 -23 113 1 -91 155 395 -189 42 236 56 112 195 -257 68
7194F8j16L21k54o3k9k4J24j9J14p0J0N7Q1j87k88L59j18J13J7M9j68Q6m4J32
$$ 68 -48 273 19 -44 -73 -97 27 8 122 52 62 119 200 13 -275 84 -34 79 96 145 -23 63 19 151
7218A51k58N3L19j96j9j49J91J30j4l13P4J7L9K50k40K20j86M9q0J43j77m4R4
$$ 151 -107 -54 265 69 50 -99 92 222 208 -105 -31 -14 25 275 35 255 69 118 38 181 4 -40 54
7241E4l7Q7m1Pj14QO5Qj81j14J11K9K36J10k10r9l9L1O4%Pkj06K60j05J1K1J16
$$ 54 17 104 63 70 -44 -36 29 37 -144 -258 -147 -118 118 228 18 -81 -120 -89 -25 -25 -18 -20 -126 134 29 40 61 177
7269A77k11k49L32J69p6j69L8J18j08j00m7J64j34n6L22Ll21k11L91K03j53k33
$$ 177 -34 -283 49 218 142 -27 11 129 21 -79 -126 38 -96 -152 170 173 -148 -359 32 235 82 -151
7291a51J88P4k29oJ26J67l6j65r3K01j07K13j09Nq5klk61K88J9j58Q8P2j28R1
$$ -151 37 111 -118 -124 2 169 133 -32 -125 76 -31 182 73 78 -7 -9 -12 -273 15 34 -124 -36 36 -92 -1
7316aQ0J42j87j68k13K44O3j64J08R7J97l20o0L8j1J80r8K24k80J52K4k36K67
$$ -1 79 221 34 -134 -347 -103 -40 -204 -96 1 198 -122 -182 -144 -155 25 -73 151 -129 23 47 -189 78
7339G8r6l3K7j43L42q8j88k00N24m33L54k58L39j30j19k22L98j90m8j26J76k6
$$ 78 -18 -51 -24 -167 175 87 -101 -301 223 -210 144 -114 225 95 -24 -246 152 -38 -86 -212 -36 -62
7361f2J64j04k6j41J79k6j00J07j10P7j97K41k4K80l27J35k48K93j07K49m18J99
$$ -62 102 -2 -28 -169 10 -16 -116 -9 -119 -42 -239 2 -22 258 -69 66 -182 111 4 253 -165 34
7383C4j69p4K14q3M6K1n2N9j7p0J42l4L71m00J35K5M3k48j74L10j14L4j77K93
$$ 34 -135 -209 5 -78 -32 -11 -63 -4 -21 -91 51 17 388 -12 123 148 191 -57 -231 79 -35 -1 -178 115
7407A15O1k07J5J32j29R5J7O1J05l54J97o0m3J53j17R9j67J52j78J16K7J05O5
$$ 115 176 -31 -16 116 -13 82 99 160 265 -89 108 48 5 158 41 140 -27 125 -53 63 90 195 260
7430B60j72k4P2O9l10K28R1J10n13M39k21k03K56J95j00m9k17J6J93j7J96n1P2
$$ 260 88 64 136 205 -105 123 214 324 -189 250 29 -174 82 277 177 128 -89 -73 120 103 299 248 320
7453C20k85q3K12l68J93J08O8j21j0o4J11J4k23KJ76j8O0o1p2J68k01r5R5K15
$$ 320 35 -48 164 -204 -11 97 165 44 34 -30 81 95 -128 -126 50 32 92 31 -41 127 -74 -169 -74 141
7477A41j55J35k95J91L6J80j32k36J04J60k67J43qm3j07J99j37K94J09m05K69
$$ 141 -14 121 -174 17 53 233 101 -135 -31 129 -138 5 -3 -46 -153 46 -91 203 312 -93 176
7498A76j54j99J00J6J66l5k68K62j96L10k55K29k46J37j14J13j30J28k29J26J83
$$ 176 22 -177 -77 -61 105 70 -198 64 -132 178 -77 152 -94 43 -71 42 -88 40 -189 -63 120
7519A20J3k19O6q1j33L76j35J25l56J41K85l30K92k09K23l2l31R3J3K61q0j82
$$ 120 133 -86 -20 -101 -234 142 7 132 -224 -83 202 -128 164 -45 178 146 -185 -92 -79 182 102 -80
7541h0J67k8o6J2j37K16R0m10L74J6j24J09K19j58j14k14R7J9K58k79J17k66M4
$$ -80 87 59 -7 5 -132 84 174 -236 138 154 30 139 358 200 86 -128 -31 -12 246 -33 84 -182 -138
7564a38J00K76o1k68k99L93p4m3L8oj9K09n8k96J80OJ10J39j55j34K23m35K14
$$ -138 -38 238 177 -91 -390 3 -71 -114 -76 -82 -101 108 50 -246 -66 -60 50 189 34 -100 123 -312 -98
7587i8J13j48j39K67J19k52K48j03K32j57L85m95M4j77L26j37j74N8j30K69n0
$$ -98 15 -133 -272 -5 114 -138 110 7 239 82 467 -28 16 -161 165 28 -146 -88 -218 51 1
7608AN8J43l40J98O6j82J24l15J83M8Rn9J07J11l55J1K36M7j11p3L9j01N3L41
$$ 1 59 202 -138 60 126 -56 68 -247 -64 -16 -7 -66 41 152 -203 -192 44 91 -20 -93 -54 -155 -102 239
7632B39q3j31o1p0M50m75j7K46o3k19K32K6j8J1r2J90k52J21k03K76k50K38M8
$$ 239 156 25 -36 -106 344 -131 -148 98 35 -184 48 74 56 67 -25 165 -87 34 -169 107 -143 95 143
7655A43J09j4j54j33M8o5j65L0J73q1JO0J59p6L05m17L39l14J98J4l26J17k8J97
$$ 143 252 238 84 -49 -1 -66 -231 -201 -28 -109 -108 -48 111 35 340 -77 262 -52 146 160 -166 -49 -77 120
7679A20q4Q8j54J60l8o9n0J90l35L12k72J04O3j7RJ80j38o5L57n20K9q8K11r0
$$ 120 36 124 -30 130 92 23 -27 163 -172 140 -132 -28 35 18 27 207 69 4 361 -159 -130 -218 -7 -97
7703i7J75p6l5j77L16m4L5j65J18j92J69J00k03L2J15j93K29q0k59L93p4l31L83
$$ -97 78 2 -33 -210 106 62 97 -68 50 -142 27 127 -76 -44 71 -122 107 27 -232 161 87 -244 139
7726A39k95J54J84m10K80J52L4k4k87L21k79J43m8K03l56O5O9k03K6K37p6P0r4
$$ 139 -156 -2 182 -228 52 204 238 214 -73 248 -31 112 64 267 -89 -24 45 -158 -132 105 29 99 5
7749EJ11K12l55J3l3q7K30p9P2o1k69K13nj61m2J83o0K72j54p5J84j82lL68n17
$$ 5 116 328 -27 -14 -47 -134 96 17 89 28 -241 -28 -33 -194 -236 -53 -113 159 5 -70 114 -68 -71 297 -220
7774b20M36m22J40J61n1l6j06q2J42J79k07p7J47J05J86l29N2Kk02J60J85k72
$$ -220 216 -206 -66 95 44 8 -98 -180 -38 141 -66 -143 4 109 295 -34 18 20 -182 -22 163 -109
7796a09P7j96L82k34K16k72J77M2N1k11j50K24R9j60Q7Q2J35k62p6J9J60m4N1
$$ -109 -32 -228 154 -80 136 -136 41 83 134 -77 -227 -3 96 -64 23 105 240 -22 -98 -79 81 37 88
7819H8k5J15L9p7k50N9K78l21K97k84J23J4o5j99J23OL68k66J9j57K67j49K1k39
$$ 88 63 178 217 140 -110 -51 227 -94 203 -81 42 56 -9 -208 -85 -79 289 23 42 -115 152 3 24 -215
7843b15J68J18j39J1J27j45P7J27j53p6l7O9o6J70N5k04J89l9J54l96K27m7J17
$$ -215 -47 71 -68 -57 70 -75 2 129 -24 -100 -137 -68 -134 36 91 -113 76 37 191 -205 22 -25 92
7866I2r7J9J56j64o1J42P6j54K36k03K0n2K51k07r7M5n2K82l90K47p9J66m4o7
$$ 92 -5 14 170 6 -55 87 163 9 245 42 62 10 261 54 -43 2 -50 232 -158 89 10 176 132 65
7890F5j52k7J47O2Q6m29K26l9L03j67j61J31j35r5N96l22rk2j80L08k20j67K70
$$ 65 -87 -114 33 95 181 -248 -22 -61 242 75 -86 45 -90 -185 411 89 80 58 -122 186 -34 -201 69
7913F9n5j1P3n5k50K71k41L58k50K92j49mJ18J64k57k0l10L18l2n1J33K4m4pK42
$$ 69 14 3 76 21 -229 42 -199 159 -91 201 52 48 166 330 73 53 -257 61 29 -22 111 135 91 84 326
7938C26k14k72J15J43k71J48K27kl13J27Q1k18J91j88K02r0m7K29R1k08Kj42Q8
$$ 326 112 -160 -45 98 -173 -25 202 200 -113 14 95 -123 68 -120 82 -8 -55 174 265 57 59 -83 5
7961Eo3P3M1L4J31l29J60j47J06o9O0N6j65K77L2l62K17k29J07J14K26k28O2n1
$$ 5 -58 15 56 90 221 -108 52 -95 11 -58 2 58 -107 170 202 -160 57 -172 -65 49 275 47 109 58
7985E8L9k98J12K41J09m12Q7K67k63O7m6p6J34K54n37M04J06k37j39j7L88j51
$$ 58 97 -201 -89 152 261 -151 -64 203 -60 7 -39 -115 19 273 -264 140 246 9 -130 -147 241 90
8007I0K7k66K22j23R4J09j08K35l0j67o7P0p9J62k91J26J21m7q8j3J84K5k07o0
$$ 90 117 -149 73 -50 44 153 45 280 250 83 16 86 7 169 -122 4 125 78 -10 -23 161 186 -21 -81
8031h1J74j77J58K29l25pm9J89p1L7J65l78J01j34K64k08K07n4r7J75k51J2M8
$$ -81 93 -84 74 303 -22 -29 -78 111 40 77 242 -136 -35 -169 95 -113 94 40 -57 118 -133 -121 -73
8054g3K73p0J41j47j36J5p9J52j3J72M2r2n7On6j8O3k2l86PM16j51M24m69P9J02
$$ -73 200 130 271 124 -12 3 -76 76 63 235 277 185 128 134 78 60 123 101 -285 -278 138 -13 411 -58 21 123
8080A23K5k1j77j97K36m6P9J75m75N12J7l69l1J63k85J56L61k63J09j38J0K11
$$ 123 148 127 -50 -247 -11 -57 22 197 -278 234 251 -118 -149 14 -271 -115 246 -17 92 -46 -36 175
8102A75l6j83Q1M1P8j05j19K22k43N9J27J81l07j72K02M7j56Q8J4J84k05J69j76
$$ 175 139 -44 37 78 156 51 -68 154 -89 -30 97 278 -29 -201 1 48 -108 -20 -6 178 -27 142 -34
8125c4j01jJ32K60m30J21L47l36j62K00J25K3j10p8J83J32n79P9J03K5kQ7j12
$$ -34 -135 -136 -4 256 -174 -53 294 -42 -204 -4 121 144 34 -44 139 271 -308 -229 -126 -101 -103 -16 -128
8148a28K3J10J28j77N8p3P1j19K15k55K36J40j85Mj92J80j71L4l4r1N1K22J88
$$ -128 -105 5 133 -44 14 -59 12 -107 108 -147 89 229 44 48 -144 36 -135 -101 -135 -226 -175 47 235
8171B35j14j17J04kk7po2N0o7K20k62O2k4J25j21P6j11K33k05P8
$$ 235 121 4 108 106 79 72 10 60 -7 213 -49 13 -11 114 -7 69 -42 191 -14 64
8191F4
$$ Imaginary data points
##PAGE= N=2
##DATA TABLE= (X++(I..I)), XYDATA
0@%%%%%%%%%%%%%%Qj6J6j6J6k1K9l2L7m5N1n9P2q3R2j05J21j39J59j81K04k30
$$ 0 0 0 0 0 0 0 0 0 0 0 0 0 0 0 8 -8 8 -8 8 -13 16 -16 21 -24 27 -32 40 -43 49 -56 65 -74 85 -96 108 -122
36a22K58k89L24l61M00m44M93n46O04o67P37q12Q94r86J086j198J321j457J609
$$ -122 136 -153 171 -190 210 -234 259 -287 317 -350 387 -425 469 -517 569 -629 692 -765 844
55H44j781J979k205K467k778L151l610M193m954N999p527R975j4529K5747j01596
$$ 844 -937 1042 -1163 1304 -1474 1677 -1933 2260 -2694 3305 -4222 5753 -8776 16971 -84625
70h4625j49742K53679J05266j47258k6589J12914l0523n3626M1097O630n7423
$$ -84625 -234367 19312 124578 -22680 -49269 63645 33122 -20504 20593 27223 -30200
81c0200N5274M0845q7166l2571P7616R14m5454M0030K3502o2573j4375N1972J7219
$$ -30200 25074 65919 -21247 -53818 23798 24712 -20742 19288 42790 -19783 -34158 17814 35033
94C5033k5006q082N859J848m962r589p203O771K4582J3398l1881m2558J3801N0073
$$ 35033 10027 1945 7804 9652 4690 -4899 -12102 -5331 19251 32649 768 -41790 -27989 22084
108B2084J0263k9571p850J9891o707l2447K262L2333K966j7245o782j4323r630
$$ 22084 32347 2776 -5074 14817 8110 -24337 -22075 10258 13224 -4021 -10803 -25126 -34756
121c4756K4826J4104j8125J199J8208j0278j1684K0841J8191j3220k3692l911
$$ -34756 -9930 4174 -13951 -12752 5456 -4822 -16506 4335 22526 9306 -14386 -18297
133a8297J2241r7r105J7459K5130j0212k2582j718K681r13R448M793p114L532
$$ -18297 -6056 -6153 -15258 2201 27331 17119 -5463 -7181 -4500 -5413 4035 8828 1714 5246
147E246Q962j4156j9699J7367K7694j1617k3704P158O275q090J3880J2158k3042
$$ 5246 14208 52 -19647 -2280 25414 13797 -9907 -2749 3526 -4564 9316 21474 -1568
160a568n152K2250j4609k2390L3364K6139l3692k1633J8070J456j2718J3022J3697
$$ -1568 -6720 15530 921 -21469 11895 38034 4342 -17291 779 2235 -10483 2539 16236
173A6236j1102q696m08r413o10J9297J231k2214L891K1807j0082k0570J2136J9987
$$ 16236 5134 -3562 -3970 -13383 -13993 5304 6535 -15679 -11788 10019 -63 -20633 -8497 11490
187A1490j941q749p688m205J0599N643j0916m725O609p88k920J332J846J1439
$$ 11490 9549 800 -6888 -11093 -494 5149 -5767 -10492 -3883 -4671 -7591 -6259 -4413 7026
201G026J4088j2438k3936M015J4455m637l825J3348J482j8015k874J5702M128
$$ 7026 21114 8676 -15260 -11245 3210 -1427 -5252 8096 9578 -8437 -11311 4391 8519
214H519o262J330j185l999P721K541j2852O515K2914j0066k9166L208K0361l413
$$ 8519 2257 3587 2402 -1597 6124 8665 -4187 2328 25242 15176 -13990 -10782 9579 6166
228F166j1659M884P140k638l680j83k277L109R012k937j5243j9J2364m638q807
$$ 6166 -5493 -609 6531 3893 213 30 -2247 862 9874 6937 -8306 -8325 4039 -599 -9406
243i406J3982Q713k0644j3935J5799J2782n103k116L353m798m962O51m328r16
$$ -9406 4576 13289 -7355 -21290 -5491 7291 2188 72 3425 -1373 -6335 -5684 -10012 -10928
257a0928J4982N341j9436n219K1939L966j6610Q66J0038p776o217O312P19J049
$$ -10928 4054 9395 -10041 -15260 6679 10645 -5965 -5099 4939 -2837 -9054 -2742 -2023 -974
271i74J1155j881j4908J990J1122m424o474Q363O388m787m168l239j728Q810Q214
$$ -974 10181 8300 -6608 -4618 6504 2080 -4394 3969 10357 5570 1402 -1837 -3565 5245 13459
286A3459r925j0210Q099K787j0819M158J5447l415j1847J705K212k277N250R16
$$ 13459 3534 -6676 1423 4210 -6609 -2451 12996 9581 -2266 -561 1651 -626 4624 5540
300E540j0033K49R252p502j1432J2674J4494j1370j3795O832P688l510k27L031
$$ 5540 -4493 -4244 5008 -2494 -13926 -1252 13242 1872 -11923 -5091 2597 -913 -1140 1891
314A891l265j272K600o726o069J0635Q248p304k729Q033l104j0407N075J1350
$$ 1891 -1374 -2646 -46 -6772 -12841 -2206 6042 -1262 -3991 4042 938 -9469 -4394 6956
328F956l853q720K065K730p81L174L451l466j607K727m363o014P824J0192l162
$$ 6956 3103 -5617 -3552 -822 -1603 1571 5022 1556 -51 2676 -1687 -7701 123 10315 7153
343G153p710k79K91J292M275j744n606L601M051p910m513J1530O754q967m894
$$ 7153 -557 -836 -545 747 5022 3278 -2328 1273 5324 -2586 -7099 4431 11185 2218 -2676
358b676N229N35n224j81K604Q73J723j981p037Q19R100L11p339J734N845l906
$$ -2676 2553 3088 -2136 -2317 287 1160 2883 902 -6135 -5316 3784 4095 -3244 -1510 4335 429
374D29p181K452P612J743n048o746j455O755L930m200j234O736P22r380m028Q063
$$ 429 -6752 -4300 3312 5055 7 -6739 -8194 -1439 2491 -1709 -2943 3793 4515 -4865 -8893 -830
390h30O886l136o306o79L440L237k183k872K630M637m325p271K944P888k10l741
$$ -830 6056 2920 -3386 -4065 -625 2612 429 -2443 187 4824 499 -6772 -3828 4060 3850 109
406A09N57K037j692k153j043P83N045J716o353k744O041K495n388O42O102k569
$$ 109 666 2703 1011 -1142 -2185 -1402 3643 5359 -994 -3738 2303 4798 -590 52 6154 3585
422C585o895p76L627K756L445k351o619O08N697k278m262N080L663o178l378K361
$$ 3585 -3310 -4086 -459 2297 5742 3391 -3228 -2620 3077 799 -3463 1617 5280 -898 -4276 -1915
438a915M49J106L080l761n019O040K682p272J193J0632l167j0221K459N904l638
$$ -1915 -1466 -360 2720 -1041 -6060 -20 2662 -4610 -3417 7215 4048 -6173 -3714 2190 -1448
453a448k364L413m57K32L679n714p594R430J0474r804q583R358M314p544M50O642
$$ -1448 -3812 -399 -856 -624 3055 -2659 -10253 -823 9651 -153 -8736 622 4936 -2608 -2158 4484
469D484j461k451M18m825j712R369K738q141M89P719l460q005N396P584m505n632
$$ 4484 3023 572 990 -3835 -5547 3822 6560 -1581 -1092 6627 3167 -4838 558 8142 3637 -1995
485a995J550P89m6K009o76l390J773L172m256m846N013O350k960n029J185K713
$$ -1995 -445 344 298 2307 1631 -1759 14 3186 -1070 -5916 -903 5447 2487 -2542 -1357 1356
501A356j604j278J393J359j11n94k422l293L733N038l429n111L197K696m583j111
$$ 1356 -248 -1526 -133 1226 1115 521 -1901 -5194 -1461 3577 148 -4963 -1766 930 -3653 -4764
517d764N166K464k618j740j766k85M105K137m429o51M570k009m555L675N468k719
$$ -4764 402 2866 248 -1492 -3258 -3543 562 2699 -1730 -2381 2189 180 -4375 -700 4768 2049
533B049k484P18l34P78K860k742j907O503J240j0280k218R620O16p046J391L671
$$ 2049 -435 283 -51 727 3587 845 -1062 5441 6681 -3599 -5817 3803 4419 -2627 -1236 2435
549B435k921n40K411k271J234N836l790q779M919P630n632m605P582Q80q752j89
$$ 2435 -486 -1026 1385 -886 348 6184 2394 -6385 -1466 6164 532 -4073 3509 4389 -4363 -4552
565d552N353m99l46J625l268k296N326J057o411J223O527j903o948K62M402J203
$$ -4552 801 302 -44 1581 -1687 -3983 1343 2400 -4011 -2788 3739 1836 -5112 -4850 -448 755
581G55p09o65j707N77K044j149j530K838L143j257l888r07L479J979k607j960
$$ 755 46 -619 -2326 -1749 295 -854 -2384 454 3597 2340 -1548 -2455 1024 3003 396 -1564
597a564L022Q88m548j243M586K047k099j762l67k07K861J5k725J913M313l228
$$ -1564 1458 2346 -2202 -3445 1141 3188 1089 -673 -1040 -1247 1614 1629 -1096 817 5130 1902
613A902n753K188N882m88m114m87J701K18j067j042J352K375k20l575j246K296
$$ 1902 -3851 -1663 4219 3731 -383 -870 831 1049 -18 -1060 292 2667 2447 -1128 -2374 -78
629g8K367j619j908J123J065j664l319J515M844j101m345R81K528j964o78L118
$$ -78 2289 670 -1238 -115 950 -714 -4033 -2518 2326 1225 -3120 -2139 389 -1575 -2253 865
645H65j4j347J391j685l675L953N098m961l996M819J078n007K96M709r05j673
$$ 865 851 -496 895 -790 -4465 -512 4586 -375 -4371 448 1526 -3481 -3185 1524 619 -1054
661a054K029j497k443M304L085n279j441N344r13n040K131M144j772r30J055k173
$$ -1054 975 -522 -2965 1339 4424 -855 -2296 3048 2135 -2905 -774 3370 1598 668 1723 -450
677d50o88L173L50k591J625K231l680k557L736K406k451j748L71Q97j56j114j394
$$ -450 -1138 2035 2385 -206 1419 3650 -30 -2587 1149 3555 1104 -644 -273 624 468 -646 -2040
694b040K037L502k685n189J340N489n70l065l56J439M36j425j852Q13K919N89
$$ -2040 -3 3499 814 -4375 -3035 2454 1884 -1181 -1537 -98 338 -1087 -2939 -2126 793 1382
710A382l725j555L074J252k366J14K879j65l253l02K577P51m22j14k32o85R71
$$ 1382 -2343 -3898 -824 428 -1938 -1824 1055 890 -2363 -2665 -88 663 241 127 -105 -790 181
727A81M98k339Q77L810R9n295j12M585L27k342R16J086k289M29J143j593J27L999
$$ 181 679 -1660 -783 3027 3126 -2169 -2281 2304 2631 289 1205 2291 2 431 1574 -19 108 4107
745D107j706n725K151M733k090l399L307J635l749p33K200n85l96K327j969l239
$$ 4107 2401 -3324 -1173 3560 1470 -1929 1378 3013 -736 -1469 731 146 -250 2077 108 -3131
761c131K721K668m170j047M739J30n136l3L366J65j403N34l62j19Q24r34j501
$$ -3131 -410 2258 -1912 -2959 1780 1910 -3226 -3259 107 272 -1131 -597 -959 -1078 -254 -1188 -2689
778b689K458K576k318l302J365K801m07j592L55J873p4k171p27K063K191j192
$$ -2689 -231 2345 27 -3275 -1910 891 484 -1108 -753 1120 1046 -1125 -1852 211 2402 1210
794A210j717k0J204Q4o98l2J169R27j160k119L77L118j8k532j36K414o71j891
$$ 1210 -507 -527 677 761 63 31 1200 2127 967 -1152 -775 2343 2325 -207 -343 2071 1400 -491
812d91M09J039J087p82j719q05P88J733m48j565P64J477j082k333J226J926k02
$$ -491 -82 957 2044 1262 -457 -1262 -474 1259 811 -754 10 1487 405 -1928 -702 1224 1022
829A022j710o14J04P14M79q15j05P03P11k198j169K183K316j610k180J112J319
$$ 1022 -688 -1302 -1198 -484 -5 -820 -925 -222 489 -1709 -2878 -695 1621 11 -2169 -1057 262
846B62n92j291K08J415J020j359j961N36L081K09k861K34K288n40j889L55J721
$$ 262 -330 -1621 -1413 2 1022 -337 -2298 -1762 1319 1528 -1333 -1099 1189 649 -1240 -885 836
863H36O98m24j351m52J623N67j482R6K142k45k579j12K290M99j570l58K02K6O56
$$ 836 1534 1110 -241 -693 930 1497 15 111 2253 2008 -571 -683 1607 2106 536 178 380 406 1062
882A062r52m92J562J347k037k450J390K186r95j350O69O78j197m17N05m79N25
$$ 1062 110 -382 1180 2527 490 -1960 -570 1616 621 -729 -60 618 -579 -996 -491 -970 -445
899d45J244j753j895K376J498k345q04K184N67k539j5R08K25N73O17j622q42K377
$$ -445 799 -954 -2849 -473 1025 -1320 -2124 60 627 -1912 -1927 -1019 -794 -221 396 -1226 -2068 309
917C09L56k894Q40L565r35l680J435K412n97j122J277k99o2O94j183j158K675
$$ 309 665 -2229 -1389 2176 1241 -2439 -1004 1408 811 -311 966 667 605 1299 116 -1042 1633
934A633K293l503k194K863J668k379j073K017L48j533K45l15R0J815r7k708k66
$$ 1633 3926 423 -1771 1092 2760 381 -692 1325 1673 140 385 70 160 1975 1878 -830 -1096
951a096K279m18k249R01J966j050j737R09O40m86M28m17q65Q45O02j524n31J437
$$ -1096 1183 765 -1484 -583 1383 333 -1404 -495 145 -341 87 -330 -1195 -350 252 -1272 -1803 -366
969c66J150j697r57P69O38l30k10K80J68L8Mm54j69J779L55j660j59J176L51j113
$$ -366 784 -913 -1870 -1101 -463 -793 -1003 -723 -555 -517 -513 -967 -1136 643 998 -662 -821 355 706 -407
989d07L09J089M87j262n55L52Q73Q66q05j092N07J630j498j521J431J958j554
$$ -407 -98 991 1478 216 -339 13 886 1752 947 -145 362 1992 494 -1027 404 2362 808
1006H08j514M90J173J91o47k57LR86m29j734o3K714K8k411m04J382K33j139m67
$$ 808 -706 -216 957 1148 501 244 247 1233 804 -930 -993 1721 1749 -662 -1066 316 549 -590 -1057
1025a057N07J076m95j180j000J520J348j427r17R30O89p31n45O00P68L3o31j164
$$ -1057 -550 526 31 -1149 -2149 -629 719 -708 -1625 -695 -6 -737 -1282 -682 86 119 -512 -1676
1043a676O67J687p35j056O47Q70k56o26J86L49P36j7j113n84J419P58j452l37
$$ -1676 -1009 678 -57 -1113 -466 404 148 -478 -292 57 793 776 -337 -921 498 1256 -196 -533
1061e33J805mj672j04R70n7L17L31q21J05J090o01j103J031J285j226j377P39
$$ -533 1272 1268 -404 -508 462 405 722 1053 232 337 1427 826 -277 754 2039 813 -564 175
1079A75N32j49l71m02L44J28m48p05L96J311l41j694M02J025K16j447R8Q39K25
$$ 175 707 558 187 -215 129 257 -191 -896 -500 811 470 -1224 -822 203 419 -1028 -930 -91 134
1098A34p76p29L98J222Mj330j64R06L29r67k26J193N04o76r17r7J573l26o64j19
$$ 134 -642 -1371 -973 249 253 -1077 -1241 -335 -6 -973 -1199 -6 498 -178 -1095 -1192 381 55 -609 -728
1118g28M56P49k99j234N03J633M15j861l85J708M61j225L35O07p1k85Q1j087M1
$$ -728 -272 477 178 -1056 -553 1080 1495 -366 -751 957 1418 193 528 1135 1064 779 860 -227 -186
1137a86K320o18k373N90J921r72j466J018R17p93l16L73p79K28J146q84j773J561
$$ -186 2134 1516 -857 -267 1654 682 -784 234 1151 358 42 415 -364 -136 1010 126 -1647 -86
1155h6J069k063r11K057O31j454p03R57R7L7M2o24Q1J239q01j229P66J644n88
$$ -86 983 -1080 -1991 66 697 -757 -1460 -503 -406 -369 -327 -951 -870 369 -432 -1661 -895 749 161
1174A61j541K99J360m05o31L77O77L92p33j80Q4N54l2l52KL34K98q89n3O64Q75
$$ 161 -1380 -1081 279 -126 -757 -380 297 689 -44 -224 -140 414 382 30 32 366 664 -225 -278 386 1261
1195A261q36o17M40O16j17n15J3N69r8j24p07J51R30j40r75n60J098K28n29q68
$$ 1261 425 -192 248 864 747 232 245 814 716 592 -115 36 966 826 -149 -709 389 617 88 -780
1215g80O27P70O2j278m67R13N70n92q67P24O42p37n10K06L36N59m28j201P01J009
$$ -780 -153 617 679 -599 -1066 -153 417 -175 -1042 -318 324 -413 -923 -717 -381 178 -250 -1451 -750 259
1235B59l56q16L13J254p08j085K49R10N86l24r72L64N90K76q78n18J418O64j315
$$ 259 -97 -913 -600 654 -54 -1139 -890 20 606 282 -690 -326 264 540 -338 -856 562 1226 -89
1254h9q58J329N14m56l16K1K48K04m73m31M77R06p70m37L01K51O8m00J91M25K9
$$ -89 -947 382 896 440 124 145 393 597 124 -307 170 1076 306 -131 170 421 489 89 280 705 734
1275G34o70o43M86R44n45p02J63N49l55l28O35j53lO1l49p14N46O52p96k34N62
$$ 734 64 -579 -93 851 306 -396 -233 316 -39 -367 268 115 112 173 -176 -890 -344 308 -488 -722 -160
1296a60M05r95k47J094J14r37K02J06K23j0N8m05j0R94n09j323R43J232j52j203
$$ -160 245 -750 -997 97 211 -726 -524 -418 -195 -205 -147 -552 -562 432 -77 -1400 -457 775 623 -580
1316e80J70R22q7n38kJ64Q04l5r24o99J340J082j240j152R70J210j180q09R23
$$ -580 -410 512 425 -113 -115 49 853 818 -106 -805 535 1617 377 -775 195 1405 225 -584 339
1335C39O62m63m12J43LL97K42j139k30J115K81j484k13J158K18j163j66L78K01
$$ 339 1001 538 126 269 272 669 911 -228 -458 657 938 -546 -759 399 617 -546 -712 -334 -133
1354a33M0J59o58L9R78l28j408N50Q68j52q91N12N45m34o9r1K14N78l26l11l76
$$ -133 -93 66 -592 -553 425 97 -1311 -761 107 -45 -936 -424 121 -313 -382 -473 -259 319 -7 -318 -694
1375f94O24K40m29j24M64K94p09L82r8O07k56M0m62L00N15l17m65L16Q85p06q16
$$ -694 -70 170 -259 -383 81 375 -334 48 -50 557 301 341 -121 179 694 377 -88 228 1113 407 -409
1396d09M17J058m34p62M48J09j77n7l27k9Q96j89j065K11J088j99q58j9M31J1
$$ -409 8 1066 632 -130 318 427 250 193 -134 -163 733 544 -521 -310 778 579 -279 -298 133 144
1416A44n14k02N10J67j55k76p09O07O14n02m67O23N96n53r71N16Q60l79m41j57
$$ 144 -370 -572 -62 105 -50 -326 -1035 -428 186 -316 -783 -160 436 -117 -1088 -572 288 -91 -532 -689
1436f89M17L99J36q68L80N28K64p63l52N42P86l28p18J90N90j17m33Q0J48N34
$$ -689 -272 127 263 -605 -225 303 567 -196 -548 -6 780 452 -266 -76 514 397 -36 44 192 726
1456G26j27n60l73O93N51q16l12Q49o7m84n06K44P46m5n24j75L47J45l82m28N29
$$ 726 599 39 -334 359 910 94 -218 631 564 80 -426 -182 564 519 -5 -180 167 312 -70 -498 31
1477C1L42k35n62J29N19K11j011K34N07j3m58j95L71M23n22l02K3O05n34lk5K50
$$ 31 373 138 -424 -295 224 435 -576 -342 165 152 -306 -501 -130 293 -229 -531 -508 97 -437 -440 -465 -215
1499b15L92o48l31K94Q77m53l72J83M72q3n31K24K77O1J86p35J12O06K62n10m09
$$ -215 177 -471 -802 -508 369 -84 -456 -273 199 116 -415 -191 86 147 333 -402 -290 316 578 68 -341
1520c41P19M35q51l38N72N52m51J53p52N74O59k76p74J94J023p33m48p1Q73l17
$$ -341 378 813 -38 -376 196 748 297 450 -302 272 931 655 -119 75 1098 365 -83 -154 719 402
1540D02n30j24Q7L44L52j028JO45O07j369j09P09L77n49l13rK63K40l47l58L74
$$ 402 -128 -252 -165 179 531 -497 -496 149 756 -613 -722 -13 364 -185 -498 -507 -244 -4 -351 -709 -335
1561c35M01k38n43MJ150n35l85m3L53K69m99J23R8L61j12k42j7L12K39k10l58
$$ -335 66 -172 -715 -711 439 -96 -481 -524 -171 98 -401 -278 -180 181 69 -173 -190 122 361 151 -207
1582b07K84O27m43l16K19N10k38l73L29j29J56j50j29k3N22j78m76m9M58N8n40
$$ -207 77 704 261 -55 164 674 436 63 392 263 419 269 140 117 639 461 -15 -64 394 452 -88
1603h8K71K29l41r9J20l5j54R9L8n01L90M24o28l35N27L01o95j94L09K16j4j65
$$ -88 183 412 71 -28 92 57 -97 2 40 -461 -71 353 -275 -610 -83 218 -477 -671 -362 -146 -160 -325
1625c25q7q4N69K1o71L61M28N2q42o1P16N1n40Q6J15K61P9l30J39J71O95o69m43
$$ -325 -412 -496 73 94 -577 -216 212 264 -578 -639 77 128 -412 -326 -211 50 129 -201 -62 109 804 135 -308
1648c08L64N54q6o70L56L13K53o73l93R64j5n46k89J96K84M09o53j6K09j14j88
$$ -308 56 610 524 -146 210 523 776 103 -290 674 659 113 -176 20 304 713 60 44 253 139 -49
1669d9l01L83M21k67k88j06M17j99k13O7j40K35R3l95rK57J08k17k08M69j43k14
$$ -49 -350 33 454 187 -101 -207 210 11 -202 -135 -275 -40 53 -342 -351 -94 14 -203 -411 58 -85 -299
1691b99k50K28P1L87m21J45l89O28l08p0R8K78n1j81j76N76R7n59K81J24J35m99
$$ -299 -549 -321 -250 137 -284 -139 -528 100 -208 -278 -180 98 47 -134 -310 266 363 -196 85 209 344 -155
1713a55M6M02Q2K64m10l78O53K67m57o12P23K99n64k21K98N34m97j54K1J01J61
$$ -155 -109 293 375 639 229 -149 504 771 314 -298 425 724 160 -61 237 771 274 120 141 242 403
1734D03n5k28k55M97l21l92J06M20J86p00P3J69L6l2%l78K77J66k79n69O95M31
$$ 403 348 120 -135 362 41 -351 -245 175 361 -339 -266 -97 -61 -93 -93 -471 -194 -28 -307 -876 -181 250
1756B50l09j43k19K67O5j75j29K97j02J90n10k8O49J81m87j82M70M0k89m6K39
$$ 250 -59 -202 -421 -154 -89 -264 -393 -96 -198 -8 -518 -546 103 284 -203 -385 85 125 -164 -210 29
1777B9J82r8J2k75J08L27%m58M26R6Q2l37N0L46l41KJ55J10j06ol82J38L47l5
$$ 29 211 113 125 -150 -42 285 285 -173 253 349 431 94 144 490 149 151 306 416 310 304 -78 60 407 372
1801C72l28N3n6K70n48K4L58j49r6J39o6M0l77K25p0o2J3J31k88M8N42l50n21
$$ 372 44 97 41 311 -237 -213 145 -4 -100 39 -27 13 -364 -139 -209 -271 -258 -127 -415 -367 175 -175 -696
1824f96M78K02l42r7K65J53l36J61j17m9M02M04p06l0M04J63l41j98K68K75J59
$$ -696 -218 -16 -358 -455 -190 -37 -373 -212 -329 -378 24 428 -278 -308 96 259 -82 -280 -12 263 422
1845D22k58j71L06J99j78k22O4K19j56l76j42O46K33o14J25j76L08o4j48j48M49
$$ 422 164 -7 299 498 320 98 162 381 225 -151 -293 353 586 -28 97 -79 229 165 17 -131 318
1866C18k9j84m49M87K73l15m24P2M96l04k50j32P05l03r2m09L11L47l21k72J23
$$ 318 289 105 -344 143 416 101 -323 -251 245 -59 -309 -441 264 -39 -131 -540 -229 118 -203 -475 -352
1887c52J46M14l40r7QK35j43Jj9J81j77P4j64K94k64L23k16r2K14P4ok37J16Q9
$$ -352 -206 208 -132 -229 -221 14 -129 -128 -147 34 -143 -69 -233 61 -203 120 -96 -188 26 100 94 -143 -27 62
1911F2j26j11L96o7K8k60J34j21N68m13O4p5K83J5m58K06N0O7l27O7P7J94r4l68
$$ 62 -64 -175 221 154 182 -78 56 -65 503 90 154 79 362 377 -81 125 175 242 -85 -18 59 253 159 -209
1935b09K85j39J68o44K88K39Q9j01m51K80K91j93j75J35J57l23l7k2M46J32k27
$$ -209 76 -63 105 -539 -251 -12 77 -24 -475 -195 96 -97 -272 -137 20 -303 -340 -362 84 216 -11
1956a1m61J21K64n7l70K52L49Q1m00k0L09o0J68j08j66n1L45k80O8J27M89k94
$$ -11 -472 -351 -87 -144 -514 -262 87 168 -232 -252 57 -3 165 57 -109 -160 185 -95 -27 100 589 295
1978B95l57N5M19J6k64o5P8M6L21m20r5L61M2m24p0J16K17j72M8k58L07l9J02
$$ 295 -62 -7 412 428 164 99 177 223 544 124 29 390 432 8 -62 54 271 99 147 -111 196 157 259
2001B59n8j34K22j69n18M7N75o07j62M16K67j68n25K09J69j10O2j82J30J96M7
$$ 259 201 67 289 120 -398 -351 224 -383 -545 -129 138 -30 -555 -346 -177 -287 -225 -407 -277 -81 -34
2022c4l08K54M23l98k36nL69o4J62l01j4J11R7j48J68k67N32j86j57J45J19r3
$$ -34 -342 -88 335 -63 -299 -304 65 1 163 -138 -152 -41 56 -92 76 -191 341 155 -2 143 262 169
2044A69j9j58K79J21k52j51M2M13q0j88J01n7K15l55k95L58K1j80o8J41P7Jl47
$$ 169 150 -8 271 392 140 -11 31 444 364 176 277 220 435 80 -215 143 164 -16 -84 57 134 135 -212
2067b12J06K77q0n1k10R4P4Q6l93J52M1Ro3j83Q4L96k57p3J13%O0j43oK14K30
$$ -212 -106 171 91 40 -170 -76 -2 84 -309 -157 -116 -107 -170 -353 -269 127 -130 -203 -90 -90 -30 -173 -179 35 265
2092B65n28q4j6O09Ok21k19J65J28j50K25k10J57P1k69p8J97J63j83j12R0M71
$$ 265 -263 -347 -363 246 252 31 -188 -23 105 -45 180 -30 127 198 -71 -149 48 211 28 -84 6 477
2114D77m32l22K78J79M6k05j6N8K43l22k73J98N63m87K30k53J62p3j38K49l65
$$ 477 45 -277 1 180 226 21 5 63 306 -16 -289 -91 472 -15 215 -38 124 51 -87 162 -203
2135b03M12k80oK4J47j05o7k28K64R4k50l34N12L41m82j06J09J33O6j53j20K52
$$ -203 209 -71 -77 -53 94 -11 -78 -306 -42 52 -198 -532 -20 321 -161 -267 -158 -25 41 -112 -232 20
2157B0JK10p67l6P10j28o8j06J91P9j74j11P5J42J59l01j60M90O7q7k22l8L96
$$ 20 21 231 -536 -572 138 10 -58 -164 27 106 -68 -179 -104 38 197 -104 -264 226 293 206 -16 -54 342
2180C42K98p03K99K03l13j39k13L71K19L5l15j10K46l6J9l42K7O09m26j64L07
$$ 342 640 -63 236 439 126 -13 -226 145 364 399 84 -26 220 184 203 -139 -112 497 71 -93 214
2201B14j51j27L02k02k27K21j01j23j53J72M02n16O2K98p6j7j19o6J6J13j77P3
$$ 214 63 -64 238 36 -191 30 -71 -194 -347 -175 227 -289 -227 71 -5 -22 -141 -207 -191 -78 -255 -182
2223a82J42j8O7l06J71M04l16j89L03l4J81n06J81K04J88m83J69K89j64o7Q2N2
$$ -182 -40 -58 9 -297 -126 278 -38 -227 76 42 223 -283 -102 102 290 -193 -24 265 101 34 116 168
2245A68J67j85k65K48oJ63j49J05j67J14m01M23p3k2K22k49k62O0M45m10lK62
$$ 168 335 150 -115 133 127 290 141 246 79 193 -208 215 142 120 342 93 -169 -109 336 -74 -77 185
2267A85k9k25N5Q7K5k12j14k24L42K4K33l49K42j93J90j74n3n4M63k87k50K07
$$ 185 156 -69 -14 73 98 -114 -228 -452 -110 -86 147 -202 40 -153 37 -137 -190 -244 219 -68 -318 -111
2289a11J27r7L43l62L4J27K8n6r0J79m7K85l89K21k4J93m87K09L7J46k36j42L99
$$ -111 16 -81 262 -100 -66 61 89 33 -57 122 75 360 -29 192 168 361 -126 83 120 266 30 -112 287
2312B87r3k62j8J32L48l66j94L37k65J85l24K06q0K07j12k86J92j02K20n2j44
$$ 287 194 -68 -86 46 394 28 -166 171 -94 91 -233 -27 -107 100 -12 -298 -106 -208 12 -40 -184
2333a84R8j58K67k03k29L11J1N9l25M54K1m57L64Qj6J11k25n9J57j50j1O5q6K84
$$ -184 -86 -244 23 -180 -409 -98 -87 -28 -353 101 122 -335 29 37 21 132 -93 -152 5 -145 -156 -91 -177 107
2357A07j76K50k68L56m75M44q3k2P5k02q4M4K87j59j60K61p9J34k83J09q8K22
$$ 107 -69 181 -87 269 -206 238 155 133 208 6 -78 -34 253 94 -66 195 116 250 -33 76 -12 210
2379B10q0M6j82K90o4k83J85K27j81l9k33j28L49J58k34l31K17L30l83L87j80
$$ 210 130 176 -6 284 220 -63 122 349 168 129 -104 -232 117 275 41 -290 -73 257 -126 261 81
2400H1k79Q5j69K06J67l0j50n0J22K45k52M3n7j57R7P0k61J94J3k53K71K2J25
$$ 81 -198 -113 -282 -76 91 61 -89 -139 -17 228 -24 19 -38 -195 -98 -28 -289 -95 -82 -335 -64 -42 83
2423H3j18m8k08k16K78j18J97J89P5mk22L12l6R1j41P6l15K29J54m31R5L75K51
$$ 83 -35 -83 -291 -507 -229 -347 -150 39 114 110 -112 200 164 255 114 190 -125 104 258 -173 -78 297 548
2446E48l30l6l7R2k47j74k1J03K50j63J23J84j65k52J77L2l16k7M21l97J88Q4
$$ 548 218 182 145 237 -10 -184 -205 -102 148 -15 108 292 127 -125 52 84 -232 -259 162 -235 -47 37
2468C7l30M42k42K99l56P3jJ01l7j47J42n8O6k1k31J08L50l55j08J17K64p7r4
$$ 37 -293 149 -93 206 -150 -77 -78 23 -14 -161 -19 -77 -11 -32 -263 -155 195 -160 -268 -151 113 36 -58
2491e8K59k41K47k03j5P0l1NO4j13L90k07k20J5J93J55m67K54j04K39j12Q9j69
$$ -58 201 -40 207 4 -11 59 28 33 97 -16 374 167 -53 -38 155 310 -157 97 -7 232 120 209 40
2514D0J60j75k47L11L3n6O8n46M40j20J65j71j18L48j75k63K07J66j02o3L01m56
$$ 40 200 25 -222 89 122 66 134 -412 28 -92 73 -98 -216 132 -43 -306 -99 67 -35 -98 203 -253
2536b53L43r7k21J09m1k79L88K30j12j10l32J81r7K47p9J60m9k20K36j05j14J09
$$ -253 90 -7 -228 -119 -160 -439 -51 179 67 -43 -375 -194 -291 -44 -123 37 -12 -232 4 -101 -215 -106
2558a06J82k19l3J81mm6L67m45N2j24L35j24J00j04K66l06lJ58O6j80M1j04J97
$$ -106 76 -143 -176 5 1 -45 322 -123 -71 -195 140 16 116 12 278 -28 -31 127 193 13 54 -50 147
2581A47j76J14j56L83j19n6j68KK17M2j36k67K15j32j21M28j96m2J17j55J37j91
$$ 147 -29 85 -71 312 193 137 -31 -29 188 230 94 -173 42 -90 -211 217 21 -21 96 -59 78 -113
2603a13J17M9R7j24o0Q6l30L67k35J07r4L6n8q2L91l48J8J99M9L9k66q7M81k97
$$ -113 4 53 150 26 -34 52 -278 89 -146 -39 -133 -97 -155 -237 154 -194 -176 23 72 111 -155 -242 239 -58
2627e8o6L0J2J34k79J15K24r3K43l65J22L59k31m8J30j1n1K9k87q9J90k02L87
$$ -58 -124 -94 -82 52 -227 -112 112 19 262 -103 19 378 147 99 229 218 167 196 -91 -180 10 -192 195
2650A95j64o1K95Q8l25j04K06j83j52L37j98J06q0O0j83J48j22Q3qr7N4o7K36
$$ 195 31 -30 265 353 28 -76 130 -53 -205 132 -66 40 -40 20 -163 -15 -137 -54 -62 -159 -105 -172 64
2673F4k45R5j1j27N0J24M9k12O8M9j39L78r0j17M2j33L0M3J42P2j91J7L00o3j48
$$ 64 -181 -86 -97 -224 -174 -50 -1 -213 -145 -96 -235 143 53 -64 -22 -155 -125 -82 60 132 -59 -42 258 195 47
2698D7k63L07Q2j44K55k36l6L54m24K12l08l2J74M1k82K55m0K97k48j53M18l37
$$ 47 -216 91 173 29 284 48 12 366 -58 154 -154 -186 -12 29 -253 2 -38 259 11 -142 276 -61
2720f1j05N7J95k68N1j0K42j10J28j58M1L0l0j72J07j5j41J12K05J79l18K5L1
$$ -61 -166 -109 86 -182 -131 -141 101 -9 119 -39 2 32 2 -170 -63 -78 -219 -107 98 277 -41 -16 15
2743A5kj22Qr5L0j09K75Q1l66J84K20Pj44K28J2j68kJ69k15J59q0qj11J40k83
$$ 15 13 -109 -101 -196 -166 -275 0 81 -285 -101 119 126 -18 210 222 54 52 221 6 165 85 77 -34 106 -177
2768a77L38J68k79LJ05m20J65J96ql4P9m4Q6k31L45k23K45q7j48j30J36j01o7
$$ -177 161 329 50 53 158 -262 -97 99 91 57 136 92 178 -53 292 69 314 227 79 -51 85 -16 -83
2791h3l1l3K46j99n4j04J79l3Q6rO6j05j09J75k8r4K17k42J49j04j03J4M16m9
$$ -83 -114 -147 99 -100 -154 -258 -79 -112 -26 -35 31 -74 -183 -8 -36 -130 87 -155 -6 -110 -213 -199 217 168
2815A68Q5m34J81j30L91m06J10J08j78o4M65m05J25K51n6k37j10qK35J80k15k79
$$ 168 253 -181 0 -130 261 -145 -35 73 -105 -169 296 -109 16 267 211 -26 -136 -144 91 271 56 -223
2837b23J59L42m74OK34oNJ34K23l28q5J31nr9q7l4O7K36K1n3k02L8n7k92J08K69
$$ -223 -64 278 -196 -190 44 38 43 177 400 72 -13 118 113 14 -73 -107 -40 196 217 164 -38 0 -57 -349 -241 28
2863B8o5K36m84K19Om3K90k82j13L6K05j51J08k3J44q7j0j03M20l68J36l01K23
$$ 28 -37 199 -285 -66 -60 -103 187 -95 -208 -172 33 -118 -10 -33 111 24 14 -89 331 -37 99 -202 21
2886B1n2j45L62k13l3L19o2k49L97m09j6M81k75o0j6k58J86K69j50l9j57L59j82
$$ 21 -31 -176 186 -27 -60 259 197 -52 345 -64 -80 401 126 66 50 -208 -22 247 97 58 -99 260 78
2909G8R0j68L5K84l27n2J98l04K84R4jj87n8P5l70K88j22P3L46p5l46J44j02Q8
$$ 78 168 0 35 319 -8 -60 138 -166 118 212 211 24 -34 41 -329 -41 -163 -90 256 181 -165 -21 -123 -35
2933c5q9p8M52l57K1N3p3M03k00l65J20K87j66j33J63k2j63M7J62K4R4k21n8q7
$$ -35 -124 -202 250 -107 -86 -33 -106 297 97 -268 -148 139 -27 -160 3 -19 -182 -135 27 51 145 -76 -134 -221
2957b21N89m22J11k64K70k14K08L52k52j97L39n18L09Q1j62j8J60j96j29J2K41
$$ -221 368 -54 57 -207 63 -151 57 409 157 -40 299 -219 90 171 9 -9 151 -45 -174 -162 79
2978G9j73j6J97J58k53L08k38k00L38k42L5K76pj88J03n6j70l6L12l29M8J59k95
$$ 79 -94 -110 87 245 -8 300 62 -138 200 -42 -7 269 262 74 177 121 -49 -85 227 -102 -54 105 -190
3001a90l6r0K86j66Q2K17j23J2L5L31n23l9L46j72K36k95m3L36p8j34j9J02j0
$$ -190 -226 -316 -30 -196 -114 103 -20 -8 27 358 -165 -204 142 -30 206 -89 -132 204 126 -8 -27 75 65
3024F5n7k80M58K5l37J66q6Q9K41j08m53M06o0j3j29J5J30m9l3L16l94RR8j62
$$ 65 8 -272 186 211 -126 40 -46 43 284 176 -277 129 69 56 -73 -58 72 23 -10 306 -88 -79 19 -143
3048a43P1N4R7J28j21j54Q1j48L28n8k46Q8q1P5J7J82l55M57k32J67j71j2J8j47
$$ -143 -72 -18 79 207 86 -68 13 -135 193 135 -111 -23 -104 -29 -12 170 -185 272 40 207 36 24 42 -105
3072a05M6j97J47N0l3O4J1QRm2l2j91K20J9J78j47Qk02J3L33p5Q9LK2j24j46J31
$$ -105 -59 -256 -109 -59 -92 -28 -17 -9 0 -42 -74 -265 -45 -26 152 5 13 -189 -176 157 82 171 174 196 72 -74 57
3099E7J58l1j41k4K25l08j55K53o5J08o9p9q5M36l03j13L33j49j16p2M57m00J22
$$ 57 215 184 43 19 244 -64 -219 34 -31 77 8 -71 -156 280 -23 -136 197 48 -68 -140 317 -83 39
3122C9j99J45O3j89O3K31l11L06j69j40J21n4J6Q8J22l48K89k41M0N6L41k68o8
$$ 39 -160 -15 48 -141 -78 153 -158 148 -21 -161 -40 -94 -78 10 132 -216 73 -168 -128 -72 269 1 -67
3145f7R0K78l11K69k67Nj5j33Q5J4J21o8%no5K8%r9K82p9l97M29k8m4Qj93k1L34
$$ -67 23 301 -10 259 -8 -3 -18 -151 -66 -52 69 1 1 -4 -69 -41 -41 -140 142 63 -334 95 67 23 31 -162 -183 151
3173A51R8J8l24lnJ28j15P1qk1k3J16k90M5q6L24J47Q6m02j34O4K2M53m33J69
$$ 151 249 267 -57 -60 -65 63 -52 19 11 -10 -33 83 -207 -162 -248 76 223 309 -93 -227 -163 -141 312 -121 48
3198D8j12j14nJ93L5J22o29P85n44L11K7k48L25k50J79p0K7k0k8J11l59L43M2
$$ 48 -64 -178 -183 10 45 167 -462 323 -221 90 117 -131 194 -56 123 53 80 60 32 143 -216 127 169
3221A69k65K45r5km2k7J08j10j93L01J13r9j10J48j59m2j50L10M5N2k41J2N2j33
$$ 169 -96 149 54 52 10 -17 91 -19 -212 89 202 103 -7 141 -18 -60 -210 100 145 197 -44 -32 20 -113
3245a13N2Q8j94J04L07r5Jk91K48J86k10M9m9J44j95j53O1m1j87J97l8N0M2j25
$$ -113 -61 27 -167 -63 244 149 150 -141 107 293 83 132 83 227 32 -121 -60 -101 -288 -91 -129 -79 -37 -162
3269a62J23K7J15J75q0k53J90L6l3k42J37K01l46K37j30k93K99r8j3n0L25lj42
$$ -162 -39 -12 103 278 198 -55 135 171 138 -104 33 234 -112 125 -5 -298 1 -97 -110 -160 165 162 20
3292B0l8O3k33J31j70L43r8N5J5O1J6j67n4R2q5J77J9l69L9j15K85m29L18J60
$$ 20 -18 45 -188 -57 -227 116 18 73 88 149 165 -2 -56 36 -49 128 147 -222 -183 -298 -13 -442 -124 36
3316C6j28J09o1R5L4m73K67P5j65M16l11P7R2j88J59k18J07ML3K33j81J0j26J06
$$ 36 -92 17 -44 51 85 -388 -121 -46 -211 205 -106 -29 63 -125 34 -184 -77 -73 -40 193 12 22 -104 2
3340BJ5Mq3M9JM8Lp7j52L21J2k5j55J5o3L9k65M15Mm9j57k5J50K95m83K16J22
$$ 2 17 21 -62 -13 -12 36 39 -38 -190 131 143 118 -37 -22 -85 -46 -311 104 108 59 -98 -123 27 322 -161 55 177
3367A77j99j2K02J65j38j97K45k37k10L02N8k95K10k46L72m30K40R9r3P4l57J16
$$ 177 -22 -34 168 333 195 -2 243 6 -204 98 156 -139 71 -175 197 -233 7 106 13 87 -270 -154
3389a54K10L2k33L28k99O2K52m97M25k18K03o8Km56L20L37k68K58m46K60l74L54
$$ -154 56 88 -145 183 -116 -54 198 -299 126 -92 111 43 45 -411 -91 246 -22 236 -210 50 -324 30
3411C0N2Qk59O4J2p4K78l01L4L18j16J1N2j35l7K05l15L64k46j8J08j96L08k10
$$ 30 82 90 -169 -105 -93 -167 111 -190 -156 162 46 57 109 -26 -63 142 -173 191 -55 -73 35 -161 147 -63
3435f3l4R2M8k23K04n8o8N2L9j41K33q1Jk4j30J08l02K18K35J17j63k56K84K3
$$ -63 -97 -5 43 -180 24 -34 -102 -50 -11 -152 81 0 1 -23 -153 -45 -347 -129 106 223 60 -196 88 111
3459A11pj4k6j7j66j93L6J87m1J27n1K96m59L22n5j25j41J69r2J99j12L91j88
$$ 111 104 90 64 47 -119 -312 -276 -89 -130 -3 -54 242 -217 105 50 -75 -216 -47 -139 60 -52 339 151
3482A51j22m0j5L1j33J59j37K68j61r8K55j26j08k4J70K79k70m27L06Q3k90J60
$$ 151 29 -11 -26 5 -128 31 -106 162 1 -97 158 32 -76 -100 70 349 79 -348 -42 41 -249 -89
3504h9R9J35K9N6j19P8q1%l22N13k74J40m08L39k77K52O1J13l69K32j04j92K72
$$ -89 10 145 174 230 111 189 108 108 -214 299 25 165 -243 96 -181 71 132 245 -124 108 4 -188 84
3527H4l06K87k81K16j7j1j33K05J5P7q7Jj83J37J0O1L6mj46J35j52K9K84k51j71
$$ 84 -222 65 -216 0 -17 -28 -161 44 59 136 49 50 -133 4 14 75 111 107 -39 96 -56 -27 257 6 -165
3552a65M20l10o9J89j71j3k1l4J24k1k3M2J7J48l0M4k55O2J67j95J86K30n14L81
$$ -165 255 -55 -124 65 -106 -119 -140 -174 -50 -71 -94 -52 -35 113 83 127 -128 -66 101 -94 92 322 -192 189
3576A89m18M7J55j39J03J17m8k31Q7m2J58J33m13K12Q9Q1m7m7pL0J05j63J86j98
$$ 189 -229 -182 -27 -166 -63 54 6 -225 -138 -180 -22 111 -302 -90 -1 80 33 -14 -21 9 114 -49 137 -61
3600f1M3K03j34j24P4K64m11K36M7j26l26L65k61J84j03J37J0lO7j9n9J4rJ46
$$ -61 -18 185 51 -73 1 265 -146 90 137 11 -315 50 -211 -27 -130 7 17 14 81 62 3 17 8 154
3624A54j56K04q0j1K0n2r7oN1n4K3O7R0l34J12k12L39J60j46L51j81k29p7Q1k45
$$ 154 -2 202 122 111 131 79 -18 -24 27 -27 -4 63 153 -181 -69 -281 58 218 72 423 242 13 -64 17 -228
3649b28J09L51m20J38J18k39jM20j56QQ6k86k73M90j45j45K97n97M22k17K91p6
$$ -228 -119 232 -188 -50 68 -171 -172 248 92 100 186 -100 -373 117 -28 -173 124 -473 -51 -268 23 -53
3671e3j13M57k69l4J17j08j56L33l37K86r3j0J3J1l0p3K98j39P6r8k22J87j04
$$ -53 -166 291 22 -12 105 -3 -159 174 -163 123 30 20 33 44 14 -59 239 100 176 78 -144 43 -61
3694f1k7J34j2j92J33K10j84Q5k05R2j1P7k18P0O5j86L44k99J23J9L5K05j05k24
$$ -61 -88 46 34 -158 -25 185 1 86 -119 -27 -38 39 -179 -109 -44 -230 114 -185 -62 -43 -8 197 92 -132
3718a32K4L53r4j18R8O6m3p5p1K1K8J07l70O3J34j8R9P2k56L34l18Q2j60J9j15
$$ -132 -108 245 151 33 131 197 154 79 8 29 57 164 -206 -143 -9 -27 72 144 -112 222 -96 -14 -174 -155 -270
3743b70L89k55K13J48k28j24O6K31LM8j55q2j2K38k87o1O6J71k06J86k5j35m2
$$ -270 119 -136 77 225 -3 -127 -61 170 173 221 66 -16 -28 210 -77 -138 -72 99 -107 79 54 -81 -123
3766a23K03J06k38k14L66P2l85K08l5M00n18L97j98k97J06J24K09j05k1l81L56
$$ -123 80 186 -52 -266 100 172 -213 -5 -40 360 -158 239 41 -256 -150 -26 183 78 57 -324 32
3787C2J79j90r8KJ06j6L9m1K07n1k58J4J2j40j63L36j7q9K03m1q6n2K35J5k54
$$ 32 211 21 -77 -75 31 15 54 13 220 169 -89 -75 -63 -203 -366 -30 -47 -136 67 26 -60 -112 123 138 -116
3812a16K03k58L11j2J17j16q5j01J38J0k86J52K05j89J46k01p5K7%K70j08J4j30
$$ -116 87 -171 140 128 245 129 44 -57 81 91 -195 -43 162 -27 119 -82 -157 -130 -130 140 32 46 -84
3835h4J13j87J83J33j8k06J86k22J44k31L7J48M5K1L17m27J7o7K98K04l88K2j04
$$ -84 29 -158 25 158 140 -66 120 -102 42 -189 -152 -4 41 62 379 -48 -31 -98 200 404 16 38 -66
3858f6q0J91j20p1J23J85k13k4k32K42J24j63J92m6K6j41k6J07R1J8k7q6N8m2
$$ -66 -146 45 -75 -146 -23 162 -51 -75 -307 -65 59 -104 88 42 68 -73 -99 8 99 117 90 4 62 20
3882B0l02L42q1j5NR3L0N5k91o7M64K4j61j13R9J32j76L2k63N0P6N0k6R8m57N84
$$ 20 -282 60 -21 -36 -31 62 92 147 -144 -211 253 277 116 3 102 234 58 90 -173 -123 -47 3 -23 75 -382 202
3908B02j44j20M7j8l1j86J72J4J7N9k18L85r3k37L30k15P9N3j46J09k83L12o8
$$ 202 58 -62 -15 -33 -64 -250 -78 -64 -47 12 -206 179 86 -151 179 -36 43 96 -50 59 -224 88 20
3931B0O8j37J14q9J15k83J23J56k13kK6L7j65L78p9k45J88j97m4K54j46J02r0
$$ 20 88 -49 65 -24 91 -192 -69 87 -126 -128 -102 -65 -230 148 69 -176 12 -185 -229 25 -121 -19 -109
3954a09L58l98J22L72j83j21O6k3m5K61j11j48Pk05Oq3J90j67QJ92k0Q0r5K05
$$ -109 249 -149 -27 345 162 41 107 84 39 300 189 41 48 -157 -151 -234 -44 -211 -203 -11 -31 49 -46 159
3978A59k85L13M7l33J66m8m9l1N7o6J31k04L31l8o3q4K28k35J75q3Jj24n9K36
$$ 159 -126 187 234 -99 67 19 -30 -61 -4 -70 61 -143 188 150 87 3 231 -4 171 88 89 -35 -94 142
4002A42P5l27J50J55l25L22l95K47O7k04N9P8K02k4k36P4n0n8jj89K74J9KL32
$$ 142 217 -110 40 195 -130 192 -203 44 111 -93 -34 44 246 222 -14 60 10 -48 -49 -238 36 55 57 389
4026C89o23L32J70m52K72J56q0m31M26j81m0K4P6k50L30l9o5k2K17m2l20P6R6
$$ 389 -234 98 268 -184 88 244 164 -267 159 -22 -62 -38 38 -212 118 79 14 -8 209 167 -153 -77 19
4049A9J76l23L15j77l5j2J27l5J6k71K19L3q6J16l1k5J32R8k20J33k90J30j05
$$ 19 195 -128 187 10 -25 -37 90 55 71 -200 19 52 -34 82 51 26 158 256 36 169 -121 9 -96
4072i6J83k29J94M9L5j89n4P9J60j79N0O5J44k24J62l02O4q2J60j22J53j78M2
$$ -96 87 -142 52 101 136 -53 -107 -28 132 -47 3 68 212 -12 150 -152 -88 -170 -10 -132 21 -157 -115
4095a15m4K58n5P7j64q1m5J93o7m5K01j6R5j99R6p4q2k6J97j6j19J22K72k87J
$$ -115 -159 99 44 121 -43 -124 -169 24 -43 -88 113 97 192 -7 89 15 -67 -93 104 88 -31 91 363 76 77
4120G7j6r5J53Q6k75J74n5N8L9k41j62L35k39K74k57JM02j71K67m03j1q7K01l02
$$ 77 61 -34 119 205 -70 104 49 107 146 -95 -257 78 -161 113 -144 -143 259 88 355 -48 -59 -146 55 -247
4144b47P2K69O3j70j09O0J55J26Q6m39k4K86J36k25K4o4M3j20J72k0j42O2m3K69
$$ -247 -175 94 157 -13 -122 -62 93 219 305 -134 -158 128 264 39 63 -1 42 -78 94 74 -68 -6 -49 220
4168B20j03p2O9k74L54k58J35k49J57j13L94l20rJ61p8J25qk9J86m65J92j95K69
$$ 220 117 45 114 -160 194 -64 71 -178 -21 -134 260 -60 -69 92 14 139 131 102 288 -177 15 -180 89
4191H9J72k04j10K75j08o2J34q2O0j7k65K91j19N1r4j1k2k3J97m28L68j17KJ34
$$ 89 261 57 -53 222 114 52 186 104 164 147 -118 173 54 105 11 0 -22 -45 152 -276 92 -25 -23 111
4215A11J08m93K00J87rj72Q0j83L46k98o2L02m9j91J17K3OO7r8rP8m4K62r8l15
$$ 111 219 -274 -74 113 104 -68 12 -171 175 -123 -185 117 68 -123 -6 17 23 90 -8 -17 61 17 279 181 -134
4240a34J95k66K34l9j62L2J31Q2m3L61m67K99k18k04J68R7o9P4K3j08k5Q5j5k52
$$ -134 61 -205 29 -10 -172 -140 -9 73 30 391 -76 223 5 -199 -31 66 -3 71 94 -14 -39 46 31 -221
4264b21J49K04MP4k75P4N6l14J29o4L6R5M64l87j40J29K15n8N5j24l30L79j20
$$ -221 -72 132 136 210 -65 9 65 -249 -120 -184 -148 -53 411 24 -116 13 228 170 225 101 -229 150 30
4287C0m4P3J64k11q7L3Q9o0j06L3j0J07k50N08j59n9j30j24K72J54l2k81Qk79
$$ 30 -14 59 223 12 -75 -42 47 -13 -119 -86 -96 11 -239 269 110 51 -79 -203 69 223 191 -90 -82 -361
4311c61L81j7J94j32j38K6j40K08j20L02p1p8j75L72k90%K30k07j03L00l32J79
$$ -361 20 3 197 65 -73 -47 -187 21 -99 203 132 54 -121 251 -39 -39 191 -16 -119 181 -151 28
4333B8m4K42j41j34J05j98M39l20k8P9j18p1O8J97J45m33J88j0M05l97k58J37
$$ 28 -16 226 85 -49 56 -142 297 -23 -51 28 -90 -161 -93 104 249 -184 4 -6 399 2 -256 -119
4355a19K31ml29J72L9O1K25l23K54j55K17k91j3J90j29R5m55K44j8L70q3k37L17
$$ -119 112 108 -221 -49 -10 51 276 -47 207 52 269 -22 -35 155 26 121 -334 -90 -108 262 179 -58 259
4378B59l47K14k78Q3lN4J52M8m6j20N0J4j0K3k05m8L45k39pj07L29m9j88J0K44
$$ 259 -88 126 -152 -69 -72 -18 134 182 136 16 66 80 70 93 -112 -160 185 -54 -61 -168 161 112 -76 -66 178
4403A78o6q4J26l67K41o7L70l04j10J77k47L21p7k60J30l3J45K29k61R2k30M8
$$ 178 112 28 154 -213 28 -39 331 27 -83 94 -153 168 91 -169 -39 -72 73 302 41 133 -97 -49
4425d9n5K8K11q8k08k3J3J38o8J62q2k09j16L63P2j53l7n3M29l77R2P7j60J76
$$ -49 -104 -76 135 47 -161 -184 -171 -33 -101 61 -21 -230 -346 17 89 -64 -101 -154 275 -102 -10 67 -93 83
4449H3O8j1l26J79N6j06P2K46q6k41L17k2l6j92J05Q4K9k24M3r9j3K29j13J96
$$ 83 151 140 -186 -7 49 -57 15 261 175 -66 251 229 193 1 106 190 219 -5 38 -61 -74 155 42 238
4473B38l90J28nN6q5j14NL92l23m6l0K15l0OK68l70L43R4l29P0J52j60k8j52j19
$$ 238 -152 -24 -29 27 -58 -172 -167 225 -98 -144 -174 41 11 17 285 -85 258 352 23 93 245 85 57 -95 -214
4498b14J91n1N9J51J10l74K27L8k05K62k52M0J10m2j76j4N01m19k36K44J12n8
$$ -214 -23 -74 -15 136 246 -128 99 137 -68 194 -58 -18 92 50 -126 -140 361 -58 -294 -50 62 4
4520DL5j82K5nRJ14K37l50l3K44k56K28L71m36j21K59k72P6Q0j64J38P0K3q9k29
$$ 4 39 -143 -118 -123 -114 0 237 -113 -146 98 -158 70 441 5 -116 143 -129 -53 27 -137 1 71 94 5 -224
4545b24M65l18J09j08Q5Jo5J87j95J27l85L05K46l17j46L11p2j70K80j09M20k55
$$ -224 241 -77 32 -76 9 10 -55 132 -63 64 -321 -16 230 -87 -233 78 6 -164 116 7 427 172
4567A72l00J55r7M4O0k39o7L14k4J82q7p0p3J19k69J19K6Q1J50j71j06n2J06r
$$ 172 -128 27 -70 -26 34 -205 -272 42 18 200 113 43 -30 89 -180 -61 -35 46 196 25 -81 -133 -27 -36
4591c6J58k5j9l60J34K48k99j42L56l12J76J8J78M5j31M9j26L32k71j84O5M6K9
$$ -36 122 97 78 -282 -148 100 -199 -341 15 -297 -121 -103 75 120 -11 38 -88 244 -27 -211 -146 -100 -71
4614g1J02K73n50J78K79O1m9k14K30k16J3J65r9k37j70L37k63L31m6m64L62P3
$$ -71 31 304 -246 -68 211 272 223 9 239 23 36 201 102 -135 -305 32 -231 100 54 -410 -48 25
4636B5j45L00k43j24R7l6K33k58K25L05k10j84n8J52J88l30J42k68J22Q5J28j80
$$ 25 -120 180 -63 -187 -90 -126 107 -151 74 379 169 -15 -73 79 267 -63 79 -189 -67 18 146 -34
4658c4Q5j99M2j32L4M57k42J56o9j42m3M4K84l04j53J99j63N4J93j09l0J42K57
$$ -34 51 -148 -106 -238 -204 253 11 167 98 -44 -87 -43 241 -63 -216 -17 -180 -126 67 -42 -72 70 327
4681C27l90K04j77J5k7J1k9j8l0J45k50J33L06j71o3m3K0J05R5l15J49k15L20
$$ 327 -63 141 -36 -21 -48 -37 -66 -84 -114 31 -219 -86 220 49 -14 -57 -37 68 163 -152 -3 -218 102
4704A02J2P5m9l78L24k05pK69J2l44K51r4M3j87L07k75K59j66m3J7J48l05K11
$$ 102 114 189 140 -238 86 -119 -126 143 155 -189 62 -32 11 -176 131 -144 115 -51 -94 -77 71 -234 -23
4727b3N9m16N85l99L6j2K48J03j3j54O6J19J1m88L51k54M61l30N4L9j62K28j45
$$ -23 36 -380 205 -194 -158 -170 78 181 168 14 80 199 210 -278 73 -181 280 -50 4 43 -119 109 -36
4750c6K38j75j96K23P9k24P1p3R6j45K11q9j32L96k3r8j49J32J74k20J59j76j33
$$ -36 202 27 -169 54 133 -91 -20 -93 3 -142 69 -20 -152 244 221 123 -26 106 280 60 219 43 -90
4773i0K83M9m03L38j95N1J83k34p1l1J14j15o8J17o2K4j25J58j11J68J15J33j50
$$ -90 193 242 -161 177 -18 33 216 -18 -89 -120 -6 -121 -189 -72 -134 -110 -235 -77 -188 -20 95 228 78
4796G8k29J35j13K01j03j18j52L03k0Q1k90J29J53J43r2L3j23k48K91jj24lJ02
$$ 78 -151 -16 -129 72 -31 -149 -301 2 -18 63 -227 -98 55 198 106 139 16 -232 59 58 -66 -69 33
4819C3j33K54k17j2n1K79%j73q8k8K24j58K77o43O04l1q5J96l26R2L08m31J8J20
$$ 33 -100 154 -63 -75 -126 153 153 -20 -108 -136 88 -70 207 -436 168 137 52 248 -78 14 322 -109 -91 29
4843B9j5Ok32L86j06o3O6K3j60m1J77k79M12k71j00n5K90l8N7QJ04j88J38j17
$$ 29 14 20 -212 174 68 5 71 94 -66 -107 70 -209 203 -68 -168 -223 67 29 86 94 198 10 148 31
4867C1j82K83j72M1J42km9k88K09o2q5K70j25j45M0p8LM9q2L98l46NL7J86J05
$$ 31 -151 132 -40 1 143 141 92 -196 13 -49 -134 136 11 -134 -94 -172 -169 -120 -202 196 -150 -145 -108 78 183
4892A83j44J5j15K73m51L62j26J70j1J15j63l2j75L05l23L88j74k06j6L3j28J14
$$ 183 39 54 -61 212 -239 123 -3 167 156 271 108 76 -99 206 -117 271 97 -109 -125 -92 -220 -106
4914a06j00L98m9q0k57J69N6j47p0J20J99L9j7j80L8P9Q6k87J45o1j34L32j14
$$ -106 -206 192 143 63 -194 -25 31 -116 -186 -66 133 172 155 -25 13 92 178 -109 36 -25 -159 173 59
4937E9j33j6oL50k53P1L4l19M2J12K51n2k21J1r0Q3o0J73o2j80K00L0J62r3R5
$$ 59 -74 -90 -96 254 1 72 106 -213 -171 -59 192 140 -81 -70 -160 -77 -137 36 -26 -206 -6 24 186 93 188
4962A88k24k05M31k03K29k53L42j18k45k67N08j36M9K6j47J46l05Q6J71J9k23
$$ 188 -36 -241 190 -13 216 -37 305 187 -58 -325 183 47 96 122 -25 121 -184 -98 73 92 -131
4983a31K2p9L75l83L08q9J4j9j35j7J14R5J02r2Q8k19K07J32k52k00Q7J7M2R7
$$ -131 -109 -188 187 -196 112 23 37 18 -117 -134 -20 75 177 85 173 -46 161 293 41 -159 -72 -55 -13 84
5007H4k23K5J52J04k71M2j27RJ51j11R0K42l23K03K39l00J12r4j38l0L41q7J72
$$ 84 -139 -114 38 142 -129 -87 -214 -205 -54 -165 -75 167 -156 47 286 -14 98 4 -134 -164 177 90 262
5030B62l97J20j72K36J44j07l2J43j49k22L88k62q9J96o1j6k0Q1k00J33n9k53
$$ 262 -135 -15 -187 49 193 86 54 197 48 -174 214 -48 -137 59 -2 -18 -38 43 -157 -24 -83 -336
5052c36K05r4K56l73N38j43J0k6k0J42j36O9j84P1j15K55k64K20P1n0Qj86J78
$$ -336 -131 -225 31 -342 196 53 63 37 17 159 23 92 -92 -21 -136 119 -145 75 146 96 104 -82 96
5075I6k85n0L29L8M1j20j96R4M1J05j67M2J48M7l3p6l51N89r4j40l9J03j49Q2
$$ 96 -189 -239 90 128 169 49 -147 -53 -12 93 -74 -32 116 163 130 54 -297 292 198 58 19 122 -27 55
5099E5l01M07k18Q7J0k32K89n1l25L71r7L84k27k47K3r4n4L67j77L38k24o3K7
$$ 55 -246 161 -57 30 40 -192 97 46 -279 92 -5 379 152 -95 -72 -166 -220 147 -30 308 84 21 48
5122D8r4J11R4k33o6J43K37j27k19P4J67l04J12l7L21j34k79M01m19J29L58k88
$$ 48 -46 65 159 -74 -140 3 240 113 -106 -32 135 -169 -57 -94 227 93 -186 215 -204 -75 283 -5
5144eJ17j15lnJ06j53K8K05l95k2K02M3j70K10j29K38O8l55K4j53K86o6n1K40
$$ -5 112 -3 -6 -11 95 -58 -30 175 -220 -242 -40 3 -167 43 -86 152 220 -135 -111 -264 22 -44 -95 145
5168A45j34j37K65n8j03J33j70j6j59J42J49j59K71j47J00j71J1K90k35j9q1l6
$$ 145 11 -126 139 81 -22 111 -59 -75 -234 -92 57 -102 169 22 122 -49 -38 252 17 -2 -83 -119
5190a19J70k9K21m44K61J9J68j84p6KJ8q0K49j12L42n77J88l0j88L26k04K16L4
$$ -119 51 22 243 -201 60 79 247 63 -13 -11 7 -73 176 64 406 -171 17 -13 -201 125 -79 137 171
5213A71n7M3j57j74J1J31j84j13M38J40k63k2J53n20N01k9l04J92j12M89m74K08
$$ 171 114 157 0 -174 -163 -32 -216 -329 109 249 -14 -36 117 -403 98 69 -235 -43 -155 334 -140 68
5235F8J04l62L57j91j8N2J6J57j99j06R0J45j50r6K89k67N1L44m69o7L74j99O7
$$ 68 172 -190 167 -24 -42 10 26 183 -16 -122 -32 113 -37 -133 156 -111 -60 284 -185 -252 122 -77 -10
5258a0P3m0k5j79O63k79m24N27j07k09l84M33j27K08L0q6k61J56r5L33j41pl06
$$ -10 63 23 -2 -181 482 203 -221 306 199 -10 -394 39 -88 120 150 64 -197 -41 -136 197 56 49 -257
5281b57Q8M35m25J76p4J75k07LJ87r9j11k9K1MLn8nL15j71K1M4r1j67J28J1o5
$$ -257 -169 266 -159 17 -57 118 -89 -86 101 2 -109 -138 -117 -113 -110 -168 -173 142 -29 -8 36 -55 -222 -94 -83 -148
5307a48K95p3j76p6K55n9K7j79j45M49j49o1J10k18j01L33j23k2Q7q5K29j08p
$$ -148 147 74 -102 -178 77 18 45 -134 -279 170 21 -40 70 -148 -249 84 -39 -61 26 -59 170 62 55
5330E5o8P7p8l4M7r8J88j26M6P8l42O1K98l75J49L56J5k18J32j97l0L7l5K11o0
$$ 55 -13 64 -14 -48 -1 -99 89 -37 9 87 -255 -194 104 -271 -122 234 249 31 163 -34 -64 -27 -62 149 89
5355H9k95L32p5Lk38R2L17k66K80l45K31k34lJ00nM2nj44m1K43j62k2J03K41l30
$$ 89 -206 126 51 54 -184 -92 225 -41 239 -106 125 -109 -112 -12 -17 25 20 -124 -165 78 -84 -106 -3 238 -92
5380i2J68r8n2N4Q4j34K98k35j41J51m1O8N7r7J54Rn5j1M7k82K72k0k92M36k78
$$ -92 76 -22 -74 -20 64 -70 228 -7 -148 3 -38 30 87 -10 144 153 98 87 134 -148 124 104 -188 248 -30
5405c0k32L80r6j74j7K44jj70j8J42o0N1J53k75l5J75j79J68l3k29J75r7L82j38
$$ -30 -262 118 22 -152 -169 75 74 -96 -114 28 -32 19 172 -103 -138 37 -142 26 -7 -236 -61 -158 224 86
5429H6j5k08K74n8k79L99l76n9K91J39j21J89l41J33pq6m9L62k1k36J08k53J08
$$ 86 71 -137 137 79 -200 199 -177 -236 55 194 73 262 -79 54 47 -39 -88 274 253 17 125 -128 -20
5452b0o4M4K46k6n35K35K96n82L91J65j31j32JM65n13K20l7j72K38Omj52j47K28
$$ -20 -84 -40 206 180 -355 -120 176 -406 -15 150 19 -113 -112 353 -160 60 23 -149 89 95 91 -61 -208 20
5476B0N7J15j28K16l08ml5J76j19j43M06m70J21J66k71L51J15j45K59m33J08R7
$$ 20 77 192 64 280 -28 -32 -67 109 -10 -153 253 -217 -96 70 -201 150 265 120 379 -54 54 151
5498A51j96j04K38l00K25J29k15o4J9n8k16M62j82J97r5Q6o1K5k68M08k65Q6M
$$ 151 -45 -149 89 -211 14 143 -72 -136 -117 -175 -391 71 -111 86 -9 77 16 41 -227 181 -84 2 6
5521FJ1K3j44K22r2n5J76j83j72J57k7K02n58N17r8O5j51k05K69K12j94j18J50
$$ 6 17 40 -104 118 26 -29 147 -36 -208 -51 -78 124 -434 83 -15 50 -101 -306 -37 175 -19 -137 13
5544A3J78j46Q8Rj80J92k89J2M96j60k83J19j71J23J10R0j58pl8J42k27J05m0
$$ 13 191 45 133 142 -38 154 -135 -123 373 213 -70 49 -122 1 111 201 43 36 -2 140 -87 18 -22
5567b2J32n2M4k2n5MJ59k65O8J9j14K61q1j2J4j11J41k29J78o7K08j13j50PjJ01
$$ -22 110 58 102 80 25 29 188 -77 -9 10 -104 157 76 64 78 -33 108 -121 57 -10 198 85 -65 -58 -59 42
5593D2P3k13K10j79K48l21L3K62n02L0P44l86r7O2K32l58K41o5k20L68l04K90
$$ 42 115 -98 112 -67 181 -140 -107 155 -347 -317 427 41 -56 6 238 -120 121 56 -164 204 -100 190
5615A90l6l02K73J31m26Q1R0m0k81J85J05J18J03k04j66J14m8O68k71l65J68j
$$ 190 154 -148 125 256 -170 -89 1 -39 -320 -135 -30 88 191 -13 -179 -65 -113 555 284 -81 87 86
5637H6q2J42n9p8q1L49l20k01M06j81J63R4l01J33j33Jl9J98k82K53O1r6j52R8
$$ 86 4 146 87 9 -72 277 -43 -244 162 -19 144 238 -63 70 -63 -62 -101 97 -185 68 129 33 -119 -21
5661b1J1o7J05J28j09MJ46n0l47L00k35NN2J4J14n3N2M6J23k68r3J21L6l5J55
$$ -21 -10 -77 28 156 47 51 197 147 -200 100 -135 -130 -78 -64 50 -3 49 95 218 -50 -143 -22 14 -21 134
5686A34L1k33j0J26J2k21K81k14k56M15J0j44K34q9J9J4k77O9J9oJ17k50K35q1
$$ 134 165 -68 -78 48 60 -161 120 -94 -350 65 75 -69 165 76 95 109 -168 -99 -80 -86 31 -219 16 -65
5710f5jN8j24O8J35pk57N0q0L23k78r3M18j74J26r6l4q6Q0N8P6j06L5j47p1K99
$$ -65 -66 -8 -132 -64 71 64 -193 -143 -223 100 -178 -271 147 -27 99 3 -31 -117 -37 21 97 -9 26 -121 -192 107
5736A07k31M1K69j16m1J96j73L03m10P1J50k24j20J85k43K69K47m66M55j00l84
$$ 107 -124 -83 186 70 29 225 52 355 -55 16 166 -58 -178 7 -236 33 280 -186 269 169 -215
5757b15P2K83j19j53p0J04J46n3j14K17k97M9J46P4J00j79o4J02k23K01M2n8J49
$$ -215 -143 140 21 -132 -202 -98 48 -5 -119 98 -199 -150 -4 70 170 -9 -73 29 -194 7 49 -9 140
5780A40n2j10R9pp0J11j65K43r1l99K98O8l4QM4k81j4J88K43k68J4k7Q4O0J0k38
$$ 140 88 -22 77 70 0 111 -54 189 98 -301 -3 65 31 39 83 -198 -212 -24 219 -49 -35 -62 22 82 92 -146
5806a46J94j7R3J06k22k1Q9J07j49m7l1%O6kk4o4K78j30k04J55m8j21k4R3L16
$$ -146 48 31 124 230 8 -13 76 183 34 -13 -44 -44 22 20 -4 -68 210 80 -124 31 -17 -138 -162 -69 247
5831B47p0n45M08p2P2j65L07L9l30P1J0N0J17l13K88j19J56L7Lk17J38K0j1mM6
$$ 247 177 -368 40 -32 40 -125 182 221 -109 -38 -28 22 139 -174 114 -5 151 188 191 -26 112 132 121 117 163
5856A63l55K75k45M91l04j81L90k71k0j52K8K61o4K66k44J03j35K23m64L33j2
$$ 163 -192 83 -162 329 25 -156 234 -37 -57 -209 -181 80 16 282 38 141 6 229 -235 98 86
5877H6j94j86L04j2Jj78J26K43l14PO3J66m29K76M8k45L35k21J66N2l1j53J61
$$ 86 -108 -294 10 -2 -1 -179 -53 190 -124 -117 -54 112 -317 -41 7 -238 97 -124 42 94 63 -90 71
5900G1l0k82J61K44j88Lj34R5J59j15L3r0l69M74j66J15J84j81J74j35j07R1K8
$$ 71 41 -241 -80 164 -24 -21 -155 -60 99 -16 17 -73 -442 32 -134 -19 165 -16 158 23 -84 7 35
5923C5j3J71k68N9J04j81l9K20n3j6K65j84k57Q6q0K39j07l1K68k33j98Q3J26
$$ 35 22 193 -75 -16 88 -93 -132 88 35 19 284 100 -157 -71 -151 88 -19 -50 218 -15 -213 -130 -4
5946dM2J52k14P2j77J13K13l45J1R2L0j72M43k83n2q5j4L67l25J17l8j33J46K63
$$ -4 38 190 -24 48 -129 -16 197 -148 -137 -45 -15 -187 256 -27 -79 -164 -178 189 -136 -19 -57 -190 -44 219
5970B19k95o6J68q8J72j15M8l8j22J35O4k51J10k5qO53n35J15j06J11j70K7K13
$$ 219 -76 -142 26 -62 110 -5 43 5 -117 18 82 -169 -59 -84 -92 561 26 141 35 146 -24 3 216
5993B16l12J75o8K8K47r0j43Jj41J45l30L70r7k55K97J66l60J73J99l95N8N7J07
$$ 216 -96 79 11 39 286 196 53 54 -87 58 -272 98 1 -254 43 209 -151 22 221 -174 -116 -59 48
6016D8J79k4k41J06j14P6Q9q0k54O5K94k70L67j21p0J98l46J57K7K0P4o1k17Q6
$$ 48 227 203 -38 68 -46 30 119 39 -215 -150 144 -126 241 120 50 248 -98 59 86 106 180 119 -98 -12
6040a2N5k68J21K19k68O9K03pk20q9J33J97O2j97L27m30j76K60k70K16K62k12
$$ -12 43 -225 -104 115 -153 -84 119 112 -108 -197 -64 133 195 -2 325 -105 -281 -21 -291 -75 187 -25
6062b5k55L14j36J29m1j1o2k2L7m3J18j88K59o5J54m8l1j9l43J59j5J51pj67L1
$$ -25 -280 34 -102 27 -14 -25 -87 -109 -72 -115 3 -185 74 9 163 115 84 65 -278 -119 -134 17 10 -157 -126
$$ [...]
8191A37
##END NTUPLES=NMR FID
##END=
