##TITLE=1H_SL2-5ID-B(f3)
 CDCl3,8 sc, 
 22.9.2021
##JCAMPDX= 6.0         $$ Bruker NMR JCAMP-DX V2.0
##DATA TYPE= NMR FID
##DATA CLASS= NTUPLES
##ORIGIN= UXNMR, Bruker Analytische Messtechnik GmbH
##OWNER= root
$$ XWIN-NMR		Version 3.5
$$ Wed Sep 22 09:31:25 2021 Russian Standard Time (UT+4h)  she@DPX200
##.OBSERVE FREQUENCY= 200.1314
##.OBSERVE NUCLEUS= ^1H
##.DELAY= (6, 6)
##.ACQUISITION MODE= SIMULTANEOUS
##.ACQUISITION SCHEME= undefined
##.AVERAGES= 8
##.DIGITISER RES= 18
##SPECTROMETER/DATA SYSTEM= spect
##.PULSE SEQUENCE= zg30
##.SOLVENT NAME= CDCl3
##.SHIFT REFERENCE= (INTERNAL, CDCl3, 0, 15.7039)
##AUDIT TRAIL= $$ (NUMBER, WHEN, WHO, WHERE, WHAT)
$$ ##TITLE= Audit trail, XWIN-NMR		Version 3.5
$$ ##JCAMPDX= 5.01
$$ ##ORIGIN= Bruker BioSpin GmbH
$$ ##OWNER= she
$$ F:/spectra/data/she/nmr/H-F/1/audita.txt
$$ ##AUDIT TRAIL=  $$ (NUMBER, WHEN, WHO, WHERE, WHAT)
(   1,<2021-09-22 09:30:14.04 +0400>,<she>,<DPX200>,
      <created by zg, POWCHK disabled, PULCHK disabled
       configuration hash MD5:
       00 E9 B6 7A A2 85 ED C7 34 08 36 98 17 FE 4E 26
       data hash MD5: 16K
       87 9B E3 B4 F2 FD 02 87 A8 BB 52 B6 03 0B 34 EE>)
$$ ##END=
$$ 
$$ hash MD5
$$ 87 20 4D 9D EE ED 25 76 6C 53 A0 C4 92 51 20 25
##$RELAX= 
##$RELAX= 
##$RELAX= 
##$RELAX= 
##$RELAX= 
##$RELAX= 
$$ Bruker specific parameters
$$ --------------------------
##$DU= <F:/spectra>
##$EXPNO= 1
##$NAME= <H-F>
##$PROCNO= 1
##$TYPE= <nmr>
##$USER= <she>
##$AMP= (0..31)
100 100 100 100 100 100 100 100 100 100 100 100 100 100 100 100 100 100 
100 100 100 100 100 100 100 100 100 100 100 100 100 100 
##$AQSEQ= 0
##$AQ_mod= 1
##$AUNM= <au_zg>
##$AUTOPOS= <>
##$BF1= 200.13
##$BF2= 200.13
##$BF3= 200.13
##$BF4= 200.13
##$BF5= 200.13
##$BF6= 200.13
##$BF7= 200.13
##$BF8= 200.13
##$BYTORDA= 1
##$CFDGTYP= 0
##$CFRGTYP= 5
##$CHEMSTR= <none>
##$CNST= (0..31)
1 1 145 1 1 1 1 1 1 1 1 1 1 1 1 1 1 1 1 1 1 1 1 1 1 1 1 1 1 1 1 1 
##$CPDPRG= <>
##$CPDPRG1= <>
##$CPDPRG2= <>
##$CPDPRG3= <>
##$CPDPRG4= <mlev>
##$CPDPRG5= <mlev>
##$CPDPRG6= <mlev>
##$CPDPRG7= <mlev>
##$CPDPRG8= <mlev>
##$CPDPRGB= <>
##$CPDPRGT= <>
##$D= (0..31)
0 1.2 0 0 0 0 0 0 0 0.06 0 0.03 0 0 0 0 0.0002 0 0 0 0 0 0 0 0 0 0 0 0 
0 0 0 
##$DATE= 1632288613
##$DBL= (0..7)
120 120 120 120 120 120 120 120 
##$DBP= (0..7)
150 150 150 150 150 150 150 150 
##$DBP07= 0
##$DBPNAM0= <>
##$DBPNAM1= <>
##$DBPNAM2= <>
##$DBPNAM3= <>
##$DBPNAM4= <>
##$DBPNAM5= <>
##$DBPNAM6= <>
##$DBPNAM7= <>
##$DBPOAL= (0..7)
0.5 0.5 0.5 0.5 0.5 0.5 0.5 0.5 
##$DBPOFFS= (0..7)
0 0 0 0 0 0 0 0 
##$DE= 6
##$DECBNUC= <off>
##$DECIM= 32
##$DECNUC= <off>
##$DECSTAT= 4
##$DIGMOD= 1
##$DIGTYP= 9
##$DL= (0..7)
0 120 120 120 120 120 120 120 
##$DP= (0..7)
150 150 150 150 150 150 150 150 
##$DP07= 0
##$DPNAME0= <>
##$DPNAME1= <>
##$DPNAME2= <>
##$DPNAME3= <>
##$DPNAME4= <>
##$DPNAME5= <>
##$DPNAME6= <>
##$DPNAME7= <>
##$DPOAL= (0..7)
0.5 0.5 0.5 0.5 0.5 0.5 0.5 0.5 
##$DPOFFS= (0..7)
0 0 0 0 0 0 0 0 
##$DQDMODE= 0
##$DR= 18
##$DS= 0
##$DSLIST= <SSSSSSSSSSSSSSS>
$$ [...]
##$SUBNAM2= <"">
##$SUBNAM3= <"">
##$SUBNAM4= <"">
##$SUBNAM5= <"">
##$SUBNAM6= <"">
##$SUBNAM7= <"">
##$SUBNAM8= <"">
##$SUBNAM9= <"">
##$SW= 20.0188988654967
##$SWIBOX= (0..15)
0 0 2 0 0 0 0 0 0 0 0 0 0 0 0 0 
##$SW_h= 4006.41025641026
##$TD= 16384
##$TD0= 1
##$TE= 0
##$TE2= 300
##$TE3= 300
##$TEG= 300
##$TL= (0..7)
0 120 120 120 120 120 120 120 
##$TP= (0..7)
150 150 150 150 150 150 150 150 
##$TP07= 0
##$TPNAME0= <>
##$TPNAME1= <>
##$TPNAME2= <>
##$TPNAME3= <>
##$TPNAME4= <>
##$TPNAME5= <>
##$TPNAME6= <>
##$TPNAME7= <>
##$TPOAL= (0..7)
0.5 0.5 0.5 0.5 0.5 0.5 0.5 0.5 
##$TPOFFS= (0..7)
0 0 0 0 0 0 0 0 
##$TUNHIN= 0
##$TUNHOUT= 0
##$TUNXOUT= 0
##$USERA1= <user>
##$USERA2= <user>
##$USERA3= <user>
##$USERA4= <user>
##$USERA5= <user>
##$V9= 5
##$VALIST= <valist>
##$VCLIST= <CCCCCCCCCCCCCCC>
##$VD= 0
##$VDLIST= <DDDDDDDDDDDDDDD>
##$VPLIST= <PPPPPPPPPPPPPPP>
##$VTLIST= <TTTTTTTTTTTTTTT>
##$WBST= 1024
##$WBSW= 4
##$XGAIN= (0..3)
0 0 0 0 
##$XL= 0
##$YL= 0
##$YMAX_a= 89894
##$YMIN_a= -168046
##$ZGOPTNS= <>
##$ZL1= 120
##$ZL2= 120
##$ZL3= 120
##$ZL4= 120
##$ABSF1= 10
##$ABSF2= 0
##$ABSG= 5
##$ABSL= 3
##$ALPHA= 0
##$AQORDER= 0
##$ASSFAC= 0
##$ASSFACI= 0
##$ASSFACX= 0
##$ASSWID= 0
##$AUNMP= <proc_1d>
##$AZFE= 0.1
##$AZFW= 0.1
##$BCFW= 1
##$BC_mod= 2
##$BYTORDP= 1
##$COROFFS= 0
##$CY= 11.3945322036743
##$DATMOD= 1
##$DC= 2
##$DFILT= <>
##$DTYPP= 0
##$F1P= 2.36226072786647
##$F2P= -0.459571619588291
##$FCOR= 0.5
##$FTSIZE= 0
##$FT_mod= 4
##$GAMMA= 1
##$GB= 0.15
##$INTBC= 1
##$INTSCL= 1
##$ISEN= 128
##$LB= 0.24
##$LEV0= 0
##$LPBIN= 0
##$MAXI= 10000
##$MC2= 0
##$MEAN= 0
##$ME_mod= 0
##$MI= 1.114404
##$NCOEF= 0
##$NC_proc= 0
##$NLEV= 6
##$NOISF1= 3.799351
##$NOISF2= 2.8
##$NSP= 1
##$NTH_PI= 0
##$NZP= 0
##$OFFSET= 15.70392
##$PC= 1
##$PHC0= -14087.06
##$PHC1= 25.20089
##$PH_mod= 1
##$PKNL= yes
##$PPARMOD= 0
##$PSCAL= 0
##$PSIGN= 0
##$REVERSE= no
##$SF= 200.130013532006
##$SI= 16384
##$SIGF1= 3
##$SIGF2= 2
##$SINO= 400
##$SIOLD= 16384
##$SREGLST= <1H.CDCl3>
##$SSB= 0
##$STSI= 0
##$STSR= 0
##$SW_p= 3612.71676300578
##$SYMM= 0
##$S_DEV= 0
##$TDeff= 0
##$TDoff= 0
##$TI= <>
##$TILT= no
##$TM1= 0
##$TM2= 0
##$TOPLEV= 0
##$USERP1= <user>
##$USERP2= <user>
##$USERP3= <user>
##$USERP4= <user>
##$USERP5= <user>
##$WDW= 1
##$XDIM= 8192
##$YMAX_p= 0
##$YMIN_p= 0
$$ End of Bruker specific parameters
$$ ---------------------------------
##NTUPLES= NMR FID
##VAR_NAME=  TIME,          FID/REAL,        FID/IMAG
##SYMBOL=    X,             R,               I
##VAR_TYPE=  INDEPENDENT,   DEPENDENT,       DEPENDENT
##VAR_FORM=  AFFN,          ASDF,            ASDF
##VAR_DIM=   8192,          8192,            8192
##UNITS=     SECONDS,       ARBITRARY UNITS, ARBITRARY UNITS
##FACTOR=    0.0002496,     1,               1
##FIRST=     0,             0,               0
##LAST=      2.0444736,     0,               0
##MIN=       0,             -168046,         0
##MAX=       2.0444736,     89894,           0
$$ Real data points
##PAGE= N=1
##DATA TABLE= (X++(R..R)), XYDATA
$$ [...]
$$ plain form
1878 -828 4 616 -829 -153 -106 31 -197 110 -72 -515 77 953 -82 -424 174 729 -234 57 681 462
1898 462 -202 102 621 381 230 378 -127 -79 832 520 -404 90 585 277 -149 476 314 -467 -193 340
1918 340 142 -195 138 -160 -401 -123 333 -36 -708 -372 30 -303 80 -28 -790 -771 19 -64 -493 -284 -95
1939 -95 -473 -282 -7 -43 -451 -518 -195 -203 2 -158 -337 -116 376 332 -307 -130 534 420 -161 498 391 167
1961 167 -83 397 543 255 179 89 255 662 492 167 77 586 324 -40 -69 433 423 -10 2 198 116 -192
1983 -192 -66 -102 153 -252 -80 -437 -479 -242 -481 -448 -182 -13 -253 -576 -231 -339 -246 -494 -570 -439 -293 -163
2005 -163 -36 -227 -142 -175 134 -57 52 100 303 -278 149 378 314 201 67 238 211 0 22 -126 187 350
2027 350 378 105 315 493 238 7 192 590 427 8 229 315 182 237 69 39 373 125 -221 55 184
$$ packed form
1878h28Q32O12j445O76M7J37k28L07j82m43N92Q76j035l42N98N55r63K91O24k19
1898D62o64L04N19k40j51J48n05M8R11l12r24M94M95l08m26O25j62p81K74N33
1918C40j98l37L33k98k41K78M56l69o72L36M02l33L83j08p62J9P90q3m29K09J89
1939i5l78J91K75l6m08o7L23qK05j60j79K21M92m4o39J77O64j14n81O59j07k24
1961A67k50M80J46k88p6r0J66M07j70l25r0N09k62l64k9N02j0m33J2J96q2l08
1983a92J26l6K55m05J72l57m2K37k39L3K66J69k40l23L45j08R3k48p6J31J46J30
2005a63J27j91Q5l3L09j91J09M8K03n81M27K29o4j13j34J71k7k11K2j48L13J63
2027C50K8k73K10J78k55k31J85L98j63m19K21Q6j33N5j68l0L34k48l46K76J29
$$ plain form
2048 184 322 -378 -278 222 114 -322 -262 94 51 -64 -336 -265 -177 79 -200 -300 -110 -99 -366 -481 26 42
2070 42 -209 -302 139 86 -105 -37 -322 246 163 -135 -67 63 311 28 -208 -178 -336 379 248 227 -100 275 76
2093 76 86 129 139 398 269 188 37 481 589 447 -3 48 311 -2 -48 204 276 218 316 -200 -164 386 377 -96
2117 -96 -48 248 -192 -245 -259 94 154 -345 -447 -177 -21 -332 -99 -133 -74 -60 -486 -602 82 167 -108 -265 19
2140 19 -129 -403 -153 321 324 -80 -189 -137 207 38 280 54 42 424 24 -73 211 654 348 8 443 220
2162 220 -56 398 379 76 -84 573 343 -250 274 375 304 36 47 109 -40 129 108 -60 63 347 -34 -484
2184 -484 -100 326 -219 -392 -87 -122 -586 -135 65 -154 -533 -244 -368 -456 -44 32 -250 -219 119 -6 -647
2205 -647 -238 138 209 -314 34 -86 -491 -100 300 -129 166 565 -29 -353 554 967 53 -157 312 275 -100
$$ packed form
2048A84J38p00J00N00j08m36O0L56m3j15k72P1Q8K56k79j00J90J1k67j15N07J6
2070D2k51r3M41n3j91O8k85N68q3k98O8J30K48k83k36L0j58P15j31k1l27L75j99
2093G6J0M3J0K59j29q1j51M44J08j42m50N1K63l13m6K52P2n8R8n16L6N50rm73
2117i6M8K96m40n3j4L53O0m99j02K70J56l11K33l4N9J4m26j16O84Q5k75j57K84
2140A9j48k74K50M74Lm04j09N2L44j69K42k26j2L82m00r7K84M43l06l40M35k23
2162B20k76M54j9l03j60O57k30n93N24J01p1k68J1O2j49J69k1j68J23K84l81m50
2184d84L84M26n45j73L05l5m64M51K00k19l79K89j24q8M12P6k82L1L38j25o41
2205f47M09L76P1n23L48j20m05L91M00m29K95L99n94l24R07M13r14k10M69l7l75
$$ plain form
2226 -100 88 410 69 -118 166 545 70 138 -183 -160 311 642 -61 -410 167 348 -363 -4 578 -205 -757
2247 -757 161 500 -150 -153 62 -168 -624 179 501 -439 -362 89 -137 -198 280 -19 -609 -492 240 -345 -539
2268 -539 324 272 -580 -226 748 171 -697 -101 141 144 129 148 36 -289 655 363 -653 11 671 -68 -304
2289 -304 796 854 -365 273 428 115 -89 448 130 -168 414 778 -411 -71 231 232 -320 104 580 -420
2309 -420 -416 181 299 -290 128 94 -671 -449 451 301 -377 -411 -13 -357 -339 481 169 -825 -224 190 -197 -239
2331 -239 24 -576 -675 286 160 -229 -687 -162 -9 -220 260 231 -397 -187 310 290 -155 432 136 -641 289
2352 289 1252 560 -403 138 802 -31 306 630 -136 -170 394 425 -156 467 508 -173 156 674 824 -269 -498
2373 -498 321 101 -83 286 -240 -407 -63 270 -135 -133 -127 -487 -726 137 468 -334 -612 4 -80 -315 -20 93
$$ packed form
2226a00J88L22l41j87K84L79m75O8l21K3M71L31p03l49N77J81p11L59N82p83n52
2247g57R18L39o50lK15k30m56Q03L22r40P7M51k26o1M78k99n90J17P32n85j94
2268e39Q63n2q52L54R74n77q68N96K42Lj5J9j12l25R44k92j016O64O60p39k36
2289c04J100N8j219O38J55l13k04N37l18k98N82L64j189L40L02Jn52M24M76j000
2309d20MN97J18n89M18l4p65K22R00j50o78l4L98l44J8Q20l12r94O01M14l87m2
2331b39K63o00r9R61j26l89m58N25J53k11M80k9o28K10M97k0m45N87k96p77R30
2352B89R63o92r63N41O64q33L37L24p66l4N64L1n81O23M1o81L29N18J50j093k29
2373d98Q19k20j84L69n26j67L44L33m05KOl60k39Q63L31q02k78O16q4k35K95J13
$$ plain form
2395 93 -388 -682 327 -23 -258 -321 -142 -451 -323 597 1 -386 -18 285 182 502 414 101 -438 92 561
2416 561 69 -293 587 194 -72 568 513 19 -173 417 168 120 647 91 -370 -69 652 250 -227 123 40
2437 40 -92 -104 245 114 -286 -91 -52 -109 197 -19 -541 -245 210 246 -757 -309 -57 -310 -193 -13 135
2458 135 -236 -400 -94 -251 -248 -43 -384 -373 274 293 -186 -162 83 137 -203 114 266 -257 -87 126 352 83
2480 83 72 144 -235 40 401 183 -205 -27 -9 240 188 552 42 -236 140 -6 246 45 164 165 -249 -25
2502 -25 232 19 -55 66 -9 -65 331 113 -141 70 361 -198 -129 -123 56 -464 -187 65 109 -209 -203 -18 -80 -84
2526 -84 -59 -84 -167 -29 43 -338 -81 115 -368 -167 222 49 40 -182 255 151 89 -21 -44 190 71 47 -76
2549 -76 59 246 287 140 361 285 156 -243 176 438 145 57 363 120 25 13 125 5 128 269 -276 337
$$ packed form
2395I3m81k94J009l50k35o3J79l09J28R20n96l87L68L03j03L20q8l13n39N30M69
2416E61m92l62Q80l93k66O40n5m94j92N90k49m8N27n56m61L01P21m02m77L50q3
2437D0j32j2L49j31m00J95L9n7L06k16n22K96M55L6j003M48K52k53J17J80J48
2458A35l71j64L06j57LK05l41J1O47J9m79K4K45N4l40L17J52n23J70K13K26k69
2480H3j1P2l79K75L61k18l88J78J8K49n2L64n10k78L76j46K52k01J19Jm14K24
2502b5K57k13p4J21p5n6L96k18k54K11K91n59O9OJ79n20K77K52M4l18OJ85o2m
2526h4K5k5q3J38P2l81K57J96m83K01L89j73rk22M37j04o2j10k3K34j19k4j23
2549g6J35J87M1j47K21p6j29l99M19K62k93q8L06k43r5j2J12j20J23J41n45O13
$$ plain form
2571 337 -27 25 -50 -21 132 -275 -187 61 20 -428 -390 -191 -354 -407 -69 -242 -182 69 -172 -301 -57 83 -291
2594 -291 -225 1 -231 -147 -89 247 78 -300 -86 117 3 -49 86 172 -99 40 92 89 276 235 140 -275 249
2617 249 246 512 -166 337 229 234 118 259 40 195 94 -103 93 162 138 -272 134 -15 96 -123 -11 -109
2639 -109 -197 -461 53 -8 -173 -177 158 -282 -366 -59 -25 -184 -99 -49 12 -124 -120 -215 69 105 -335 -282 5 178 245
2664 245 -152 142 -95 30 -144 -62 114 99 272 -46 103 88 169 98 13 166 -27 15 208 465 300 58
2686 58 -15 44 156 -182 41 57 143 448 -15 -285 351 73 -357 -123 228 20 -167 -44 212 -88 -40 205
2708 205 -50 71 -72 -347 -281 -27 -124 -64 -230 -139 107 -159 -220 -41 -32 24 -56 -20 -129 -244 -56 11 -7 9
2732 9 -169 -16 163 45 275 -124 146 14 -311 128 160 41 -214 353 204 23 156 312 326 -13 173
$$ packed form
2571C37l64N2p5K9J53m07Q8K48m1m48L8J99j63n3L38j73O0K51k41j29K44J40l74
2594b91O6K26k32Q4N8L36j69l78K14K03j14n2J35Q6k71J39N2lJ87m1r5m15N24
2617B49lK66o78N03j08Nj16J41k19J55j01j97J96O9k4m10M06j49J11k19J12r8
2639a09q8k64N14o1j65mL35m40q4L07L4j59Q5N0O1j36Mr5K84L6m40N3K87J73O7
2664B45l97K94k37J25j74Q2J76j5J73l18J49j5Q1p1q5J53j93M2J93K57j65k42
2686E8p3N9J12l38K23J6Q6L05m63k70O36k78m30K34L51k08j87J23K56l00M8K45
2708B05k55J21j43k75O6K54r7O0j66R1K46k66o1J79RN6q0L6j09j15J88O7j8J6
2732Ij78J53J79j18K30l99K70j32l25M39L2j19k55N67j49j81J33J56J4l39J86
$$ plain form
2753 173 -119 -73 197 176 62 170 363 -107 60 88 342 112 -47 10 246 -251 -292 213 -112 -13 -192 -70
2775 -70 -127 129 14 -648 -153 239 147 -338 -475 30 -577 -288 156 197 -260 -406 -164 -18 40 -5 -17 26 154
2798 154 253 61 22 186 150 69 256 393 -144 -66 454 223 98 321 558 29 -128 581 23 202 428 92
2820 92 -73 250 451 -107 -67 354 111 -301 -7 288 10 -318 243 87 -273 -176 -63 89 -192 346 -311
2841 -311 -406 14 251 -89 -375 308 -329 -522 -242 253 132 -245 -67 -80 -49 -69 -16 -63 -166 286 78 -73
2863 -73 81 183 -228 16 682 359 -487 -96 -27 40 433 380 -49 -330 153 419 120 151 191 -110 26 311
2885 311 305 -87 -255 406 173 -92 137 39 -88 -234 133 460 -224 -207 144 -425 -160 126 -344 -559 -144
2906 -144 110 -140 -127 219 -305 -555 -21 296 -235 15 26 -242 -87 243 185 -220 -297 115 -187 228 250 18
$$ packed form
2753A73k92M6K70k1j14J08J93m70J67K8K54k30j59N7K36m97m1N05l25R9j79J22
2775g0n7K56j15o62M95L92r2m85j37N05o07K89M44M1m57j46K42J46N8m5j2M3J28
2798A54R9j92l9J64l6q1J87J37n37P8N20k31j25K23K37n29j57P09n58J79K26l36
2820I2j65L23K01n58M0M21k43m12K94K95k78l28N61j56l60R7J13J52k81N38o57
2841c11r5M20K37l40k86O83o37j93K80M95j21l77J78j3L1k0N3m7j03M52k08j51
2863g3J54J02m11K44O66l23q46L91O9O7L93n3m29k81M83K66k99L1M0l01J36K85
2885C11ol92j68O61k33k65K29r8j27j46L67L27o84J7L51n69K65K86m70k15M15
2906a44K54k50J3L46n24k50N34L17n31K50J1k68J55L30n8m05p7M12l02M15K2k32
$$ plain form
2928 18 -364 50 621 -55 -273 -176 -159 -281 374 250 117 105 268 24 132 284 316 -565 -411 308 236 -321
2950 -321 -116 199 21 84 469 58 -245 40 36 -11 -65 74 -426 -432 373 127 -180 -258 16 -247 -87 440 -6
2973 -6 -355 -610 59 -78 -223 -406 -151 -384 -283 359 151 167 36 -12 -321 -170 242 -305 -240 207 267 -357
2995 -357 -91 399 -115 -35 45 384 -246 82 224 184 286 308 124 -396 -4 525 362 -218 297 -21 -263
3016 -263 -2 244 -128 -331 71 -134 -105 134 77 -353 -243 313 0 -458 -174 199 -223 -353 79 -175 -574
3037 -574 -319 111 -90 -418 -66 -251 -189 -45 117 -297 -192 -165 -490 -359 347 260 -251 -172 37 -131 -205 256
3059 256 -6 -60 -184 169 44 71 152 -111 -165 -98 411 -160 77 345 109 -32 -82 595 -258 -248 352 28
3081 28 220 -17 -269 97 -122 203 38 -211 -107 5 -46 -146 107 -109 -89 -55 289 -19 -230 -50 110
$$ packed form
2928A8l82M14N71o76k18R7J7j22O55j24j33j2J63k44J08J52L2q81J54P19p2n57
2950c21K05L15j78O3L85m11l03K85mm7n4J39n00oQ05k46l07p8K74k63J60N27m46
2973fl49k55O69j37j45j83K55k33J01O42k08J6j31m8l09J51M12n47O5M47O0o24
2995c57K66M90n14Q0Q0L39o30L28J42m0J02K2j84n20L92N29j63n80N15l18k42
3016b63K61K46l72k03M02k05K9K39n7m30J10N56l13m58K84L73m22j30M32k54l99
3037e74K55M30k01l28L52j85O2J44J62m14J05K7l25J31P06q7n11P9K09j68p4M61
3059B56k62n4j24L53j25K7Q1k63n4O7N09n71K37K68k36j41n0O77q53J0O00l24
3081B8J92k37k52L66k19L25j65k49J04J12n1j00K53k16K0L4L44l08k11J80J60
$$ plain form
3102 110 -128 -139 -38 49 -143 -26 -162 -125 64 -19 30 217 652 -142 -221 -118 86 -74 -131 298 170 -138
3124 -138 -250 85 223 -310 116 -17 -231 25 -192 -124 -32 269 130 -105 -67 307 -90 105 91 520 60
3145 60 82 33 28 -43 173 -59 -137 334 -134 388 90 -160 50 -285 69 198 -93 -260 -122 -75 -207 -203 -239 -145
3169 -145 -248 -222 -209 -209 -5 -57 -162 -232 167 -76 -381 8 95 -166 -129 16 46 -74 59 -168 -2 3 38 68
3193 68 -175 -74 -127 232 230 -35 -120 15 -12 -59 157 206 -144 -58 21 100 82 107 390 -125 -55 73 238 -57 31
3218 31 -73 187 118 -24 -71 16 -254 -63 208 -16 -61 -307 -53 -99 -270 -121 -373 12 -37 -333 -301 -41 4
3241 4 -53 -170 -126 -130 -173 -283 -162 73 7 -66 87 320 77 55 70 150 201 -37 187 85 1 193 114 375 146
3266 146 -143 -17 293 113 135 -162 103 423 244 84 96 -104 -102 114 -104 115 112 -76 -12 152 120 -102 -233
$$ packed form
3102A10k38j1J01Q7j92J17j36L7J89q3M9J87M35p94p9J03K04j60n7M29j28l08
3124a38j12L35J38n33M26j33k14K56k17O8R2L01j39k35L8L74l97J95j4M29m60
3145F0K2m9np1K16k32p8M71m68N22k98k50K10l35L54J29k91j67J38M7j32Ml6R4
3169a45j03K6J3%K04n2j05p0L99k43l05L89Q7k61L7J45L0j20J33k27J66NL5L0
3193F8k43J01n3L59kk65q5J35k7m7K16M9l50Q6P9P9j8K5K83n15P0J28J65k95Q8
3218C1j04K60o9j42m7Q7k70J91K71k24m5k46K54m6j71J49k52L85m9k96L2K60M5
3241Dn7j17M4mm3j10J21K35o6p3J53K33k43k2J5Q0N1k38K24j02q4J92p9K61k29
3266A46k89J26L10j80K2k97K65L20j79j60J2k00KK16k18K19lj88O4J64l2k22j31
$$ plain form
3289 -233 -108 17 71 -154 -263 -130 41 -64 -23 10 -46 -20 -192 163 131 -287 -119 -53 -6 -92 -162 -73 151 -231
3313 -231 -230 -80 34 171 -101 -106 325 22 -339 49 67 -90 109 -28 -23 185 -50 306 65 -144 167 51
3335 51 -26 218 179 -137 -270 251 118 -256 14 83 163 -32 120 44 -93 25 4 135 -385 38 136 -215 112
3358 112 71 -35 -117 122 -121 -360 -109 233 8 -28 -77 99 170 35 121 -66 30 55 34 -148 47 -51 -202
3381 -202 -127 133 227 -53 -5 192 56 -73 248 140 -146 97 163 -74 -307 83 133 42 199 477 -129 -262
3403 -262 146 54 1 190 201 -182 -209 407 259 -102 119 406 -417 114 -103 -22 -59 -46 8 -352 -165 21 -120
3426 -120 -296 -2 -29 -269 -166 199 108 -260 -272 -66 -201 -217 52 -240 -51 292 62 -468 -57 89 -158
3447 -158 -162 15 -20 -59 157 159 -78 -264 264 484 137 -199 219 -30 4 310 386 -147 -132 453 75 -194 230
$$ packed form
3289b33J25J25N4k25j09J33J71j05M1L3n6K6j72L55l2m18J68O6M7q6p0Q9K24l82
3313b31JJ50J14J37k72nM31l03l61L88J8j57J99j37NK08k35L56k41k09L11j16
3335E1p7K44l9l16j33N21j33l74K70O9Q0j95J52p6j37J18k1J31n20M23R8l51L27
3358A12m1j06q2K39k43k39K51L42k25l6m9J76P1j35Q6j87R6K5k1j82J95r8j51
3381b02P5K60R4k80M8J97j36j29L21j08k86K43O6k37k33L90N0r1J57K78o06j33
3403b62M08r2n3J89J1l83k7O16j48l61K21K87q23N31k17Q1l7J3N4l60J87J86j41
3426a20j76K94k7k40J03L65r1l68j2K06j35j6K69k92J89L43k30n30M11J46k47
3447a58mJ77l5l9K16Kk37j86N28K20l47l36M18k49L4L06P6n33J5N85l78k69M24
$$ plain form
3470 230 259 -335 -44 281 96 14 62 -14 -148 145 56 -244 -187 5 -239 -219 16 118 -364 -441 202 128 -331
3493 -331 -48 -181 -174 66 24 -91 -251 -159 36 -217 -238 55 -150 -85 299 441 37 -245 92 -53 -290 398
3515 398 127 155 98 97 232 79 54 120 -282 -143 418 205 -110 197 149 -305 87 464 274 -261 -35 122
3537 122 117 26 93 -373 -128 279 5 -214 119 461 -292 -406 357 -68 -217 -220 168 -231 -212 -115 -5 -378 -152
3560 -152 153 -58 93 24 -117 16 18 127 -249 -353 -38 306 -22 -73 241 -79 -328 66 337 51 -66
3581 -66 -25 27 -175 39 216 -136 -40 399 -97 109 263 361 -293 169 250 -31 -13 170 116 35 41 140 60 -47
3605 -47 -28 131 69 72 -6 53 -19 306 234 -175 -46 131 64 11 -226 83 -171 26 22 197 -212 39 -189 -49
3629 -49 162 132 -155 -205 -208 -85 -82 -62 -59 40 -233 165 44 -224 -188 -240 209 -16 -27 303 -77 124 380 -131 31
$$ packed form
3470B30K9n94K91L25j85q2M8p6j34K93q9l00N7J92k44K0K35J02m82p7O43p4m59
3493c31K83j33PK40m2j15j60R2J95k53k1K93k05O5L84J42m04k82L37j45k37O88
3515C98k71K8n7jJ35j53k5O6m02J39N61k13l15L07m8m54L92L77j90n35K26J57
3537A22nr1O7m66K45M07k74k19L33L42p53j14P63m25j49lL88l99J9R7J10l73K26
3560a52L05k11J51o9j41J33KJ09l76j04L15L44l28n1L14l20k49L94K71k86j17
3581f6M1N2k02K14J77l52R6M39m96K06J54R8o54M62Q1k81J8J83n4q1OR9q0j07
3605d7J9J59o2Lp8N9p2L25p2m09J29J77o7n3k37L09k54J97mJ75m09K51k28J40
3629d9K11l0k87n0lJ23LK0LR9k73L98j21k68L6n2M49k25j1L30l80K01K56n11J62
$$ plain form
3654 31 75 118 -29 -44 127 231 340 231 9 -173 -38 109 215 3 -18 -121 -198 253 118 -99 11 164
3676 164 -194 -61 -21 -88 134 -111 -202 -85 68 7 -248 96 -63 -274 -135 19 94 -49 -236 -96 57 -59
3698 -59 -208 -208 -54 -89 -47 -38 85 -190 -68 -233 -24 -115 204 -175 94 283 -34 136 60 8 -215 163 277
3721 277 52 -74 -118 -28 -3 -52 12 290 180 -28 185 -67 -135 -208 107 53 -9 -20 -49 -319 -50 -162 187 -14
3745 -14 1 32 -23 336 -196 20 -37 -80 -140 -246 -30 189 154 115 -196 1 -112 -109 17 -82 -253 -176 116 65 41
3770 41 -259 112 0 159 111 375 -102 -321 242 50 24 -144 -173 131 -40 -174 -219 405 214 -94 83 32
3792 32 277 186 201 372 25 30 147 23 220 -90 -33 -117 -241 310 -72 59 152 -29 109 13 81 227 28
3815 28 96 100 29 -95 168 -26 -331 139 -183 -134 51 -45 87 -200 130 84 -29 -114 -245 -8 -14 -85 -23 189
$$ packed form
3654C1M4M3j47j5J71J04J09j09k22j82J35J47J06k12k1j03p7M51j35k17J10J53
3676A64l58J33M0o7K22k45r1J17J53o1k55L44j59k11J39J54P5j43j87J40J53j16
3698e9j49%J54l5M2RJ23k75J22j65K09r1L19l79K69J89l17J70p6n2k23L78J14
3721B77k25j26m4R0K5m9O4K78j10k08K13k52o8p3L15n4o2j1k9k70K69j12L49k01
3745a4J5L1n5L59n32K16n7m3o0j06K16K19l5l9l11J97j13LJ26r9j71P7K92n1k4
3770D1l00L71j12J59m8K64m77k19N63j92k6j68k9L04j71j34m5O24j91l08J77n1
3792C2K45r1J5J71l47NJ17j24J97l10N7q4j24N51l82J31R3j81J38r6O8J46j99
3815B8O8Mp1j24K63j94l05M70l22M9J85r6J32k87L30m6j13q5j31K37op1O2K12
$$ plain form
3839 189 -105 -197 316 92 147 -76 -62 317 -12 216 -40 168 41 115 -46 50 285 124 -100 257 91 93
3861 93 252 -5 68 293 -268 91 -17 -81 293 -54 -81 130 202 139 -277 -59 113 -460 -51 142 -123 -227
3883 -227 -207 68 -159 -200 219 -29 -45 -185 53 -207 9 -6 -94 158 68 28 -216 99 131 192 -168 -125 188
3906 188 -230 321 177 64 50 -24 231 82 406 51 59 -113 17 144 128 251 299 -13 191 20 226 -383
3928 -383 -63 166 -226 -85 256 205 -383 81 183 58 51 103 -138 -461 362 73 -471 -408 -63 -88 -269 -6
3950 -6 69 -171 -253 -88 -149 -116 -206 -119 -234 43 85 85 -390 125 343 -57 -210 258 75 37 187 192 288 152 435
3975 435 -162 -202 255 238 -227 -224 125 233 -111 -51 132 -39 -101 398 -100 -22 80 206 -196 18 360 206
3997 206 -120 75 -159 17 -23 149 -268 -11 190 -17 -131 17 83 -105 -58 -188 -52 -35 -295 -150 -161 -18
$$ packed form
3839A89k94r2N13k24N5k23J4L79l29K28k56K08j27P4j61R6K35j61k24L57j66K
3861I3J59k57P3K25n61L59j08o4L74l47k7K11P2o3m16K18J72n73M09J93k65j04
3883b27K0K75k27m1M19k48j6j40K38k60K16j5q8K52r0m0k44L15L2O1l60M3L13
3906A88m18N51j44j13j4p4K55j49L24l55Qj72J30J27j6J23M8l12K04j71K06o09
3928c83L20K29l92J41L41n1n88M64J02j25pN2k41l23Q23k89n44O3L45k5j81K63
3950fP5k40q2J65o1L3r0Q7j15K77M2%m75N15K18m00j53M68j83l8J50NR6j36K83
3975D35n97m0M57j7m65LL49J08l44O0J83j71o2M99m98P8J02J26m02K14L42j54
3997B06l26J95k34J76m0J72m17K57K01k07j14J48O6j88M7j30J36J7k60J45j1J43
$$ plain form
4019 -18 84 -13 -467 -94 -4 -40 11 -20 -87 -66 -134 159 -173 -225 137 -110 100 172 -147 -262 -28 12 246 -60
4043 -60 47 -21 -42 17 127 127 -339 -187 134 64 169 207 192 -141 84 318 20 -34 -112 -28 158 100 95 -199 -85
4068 -85 243 58 -57 -94 219 -122 -400 245 -204 -192 -219 -144 -83 -120 -23 -16 -259 113 226 -39 161 126 -477 -206
4092 -206 202 79 -302 -107 -72 126 -6 -164 215 137 67 127 -173 -137 -55 -220 -253 -50 307 242 15 219 220
4115 220 0 327 328 86 -172 354 138 -36 -145 220 257 170 143 -98 -20 -56 94 -31 -115 61 15 -257 -204
4138 -204 252 -32 -10 14 156 1 85 171 29 -128 -39 -25 -327 -37 379 -413 104 -45 23 -91 273 86
4160 86 -105 -33 5 90 -13 -30 -186 -51 24 9 -22 12 96 -204 -95 -74 41 294 29 -46 239 112 193 18
4184 18 60 134 288 -75 -9 60 3 -74 57 -227 44 -12 31 -7 -279 -104 157 42 -89 67 110 -101 -224 -13
$$ packed form
4019a8J02r7m54L73R0l6N1l1o7K1o8K93l32n2L62k47K10P2l19j15K34M0K34l06
4043f0J07o8k1N9J10%m66J52L21p0J05L8j5l33K25K34k98n4p8Q4J86n8nk94J14
4068h5L28j85j15l7L13l41k78O45m49J2k7P5O1l7R7Pk43L72J13k65K00l5o03K71
4092b06M08j23l81J95L5J98j32j58L79p8p0O0l00L6Q2j65l3K03L57o5k27K04J
4115B20k20L27Jk42k58N26k16j74j09L65L7q7k7k41P8l6J50j25q4J76m6k72N3
4138b04M56k84K2K4J42j55Q4Q6j42j57Q9J4l02K90M16p92N17j49O8j14L64j87
4160H6j91P2L8Q5j03j7j56J35P5j5l1L4Q4l00J09K1J15K53k65p5K85j27Q1j75
4184A8M2P4J54l63O6O9n7p7J31k84K71n6M3l8k72J75K61j15j31J56M3k11j23K11
$$ plain form
4208 -13 50 -8 -199 -6 52 -187 194 101 -106 -160 -11 -212 -228 193 -270 18 -150 73 109 124 190 225 246 66
4232 66 -26 51 -99 249 93 -29 92 267 -106 124 -154 29 331 -41 -105 156 287 76 -332 130 -58
4253 -58 228 45 53 134 -58 -55 -72 159 115 -24 71 10 7 -190 -13 36 -175 158 79 4 -156 10 -427 -244 -137
4278 -137 337 156 -353 -147 -77 -322 120 -366 58 4 124 -243 -212 196 -114 127 -150 22 -188 178 3
4299 3 -19 -100 356 -9 -15 167 56 316 60 226 3 -9 125 211 121 129 43 279 -36 78 -1 20 28 121 -91 -29
4325 -29 177 113 -21 -130 -278 -85 -129 -99 155 36 -185 5 -215 -107 138 -12 -277 -277 -73 -93 21 -345
4347 -345 -221 54 168 -247 -197 110 151 228 56 -71 87 135 -230 -178 46 -14 -233 -24 -215 100 -49 -113
4369 -113 433 90 -20 -42 51 -51 -18 144 158 -52 -155 174 250 293 16 32 -11 -115 69 -131 -90 59 -41
$$ packed form
4208a3O3n8j91J93N8k39L81r3k07n4J49k01j6M21m63K88j68K23L6J5O6L5K1j80
4232F6r2P7j50L48j56j22J21J75l73K30k78J83L02l72o4K61J31k11m08M62j88
4253e8K86j83QQ1j92Lj7K31m4j39R5o1lj97J77M9k11L33p9p5j60J66m37J83J07
4278a37M74j81n09K06P0k45M42m86M24n4J20l67L1M08l10K41k77J72k10L66j75
4299Ck2q1M56l65oJ82j11K60k56J66k23j2J34Q6r0Qq6K36l15J14p9K1QR3k12O2
4325b9K06o4j34j09j48J93m4L0K54j19k21J90k20J08K45j50k65%K04k0J14l66
4347c45J24K75J14m15N0L07M1P7j72j27J58M8l65N2K24o0k19K09j91L15j49o4
4369a13N46l43j10k2R3j02L3J62J4k10j03L29P6M3k77J6m3j04J84k00M1J49j00
$$ plain form
4392 -41 -272 -65 43 247 -61 77 141 74 -131 36 36 66 -238 -313 -97 52 79 -394 -207 -7 -31 -48 19 -168
4416 -168 86 -178 -181 29 -142 -17 52 248 -126 -105 22 -172 -13 141 47 -32 -90 -1 53 -236 -57 371 204
4439 204 -80 77 33 -116 -51 100 265 61 115 165 196 -104 -42 -192 83 102 251 119 175 93 -40 283 349
4462 349 52 -99 -62 -153 -49 -258 38 -42 12 -10 -69 -27 -336 -70 -119 -217 -73 -64 -166 -60 188 60 -157 -62
4486 -62 28 171 144 41 -74 -57 7 117 30 -254 255 195 -125 35 78 176 -139 231 285 147 -54 40 112 104 461
4511 461 -96 86 160 223 -50 4 195 70 -358 41 283 -198 -94 129 -144 209 -133 222 -154 -276 -150
4532 -150 -115 -239 -166 250 -34 -37 -4 -473 -139 79 99 -295 82 -137 199 -251 78 267 3 43 227 -146
4554 -146 117 -28 66 41 53 -3 16 -231 250 357 -259 127 88 -47 20 30 208 -100 -137 392 149 -75 -75 53
$$ packed form
4392d1k31K07J08K04l08J38O4o7k05J67%L0l04p5K16J49K7m73J87K00k4j7O7j87
4416a68K54k64lK10j71J25O9J96l74K1J27j94J59J54r4p9n8Q9N4k89J79M28j67
4439B04k84J57m4j49O5J51J65k04N4N0L1l00O2j50K75J9J49j32N6q2j33L23O6
4462C49k97j51L7r1J04k09K96q0N4k2n9M2l09K66m9r8J44Rj02J06K48j28k17R5
4486f2R0J43k7j03j15J7O4J10q7k84N09o0l20J60M3R8l15L70N4j38k01R4P2qL57
4511D61n57J82P4O3k73N4J91j25m28L99K42m81J04K23k73L53l42L55l76j22J26
4532a50L5j24P3M16k84lL3m69L34K18K0l94L77k19L36m50L29J89k64M0J84l73
4554a46K63j45R4k5J2n6J9k47M81J07o16L86l9j35O7J0J78l08l7N29k43k24%J28
$$ plain form
4578 53 4 -150 117 -89 -2 121 31 -14 -32 -19 33 135 123 144 -136 -155 190 -127 149 -74 -235 -155 130 57
4602 57 -186 63 95 -212 -185 143 -47 -90 -214 -148 125 103 0 -212 -285 194 -18 -77 -330 75 -30 -23 46 225
4626 225 -78 -23 266 102 -126 42 -87 -233 18 165 188 128 189 71 -154 118 222 -1 -227 -128 -7 40
4648 40 -13 241 -75 -82 120 94 40 -47 -118 -298 58 159 -59 66 -251 62 23 6 -101 -61 -494 -56 45 -258
4672 -258 -200 -64 -50 187 -56 91 -148 -500 9 -21 211 69 213 11 23 -49 255 -55 -29 121 149 79 254
4695 254 350 119 -106 372 272 49 148 273 -335 117 114 27 -399 14 194 -166 69 305 -56 -93 -187 144
4717 144 -143 -92 174 282 212 -17 -154 246 -32 139 -83 -142 3 14 -188 -96 -4 34 -27 280 54 -190 -110
4740 -110 -9 6 18 -54 -43 -99 169 60 -263 57 90 -50 -335 -105 79 368 284 162 154 49 48 -27 20 104 112
$$ packed form
4578E3m9j54K67k06Q7J23r0m5j8J3N2J02j2K1k80j9L45l17K76k23j61Q0K85p3
4602E7k43K49L2l07K7L28j90m3j24O6K73k2j03k12p3M79k12n9k53M05j05PO9J79
4626B25l03N5K89j64k28J68j29j46K51J47K3o0O1j18k25K72J04k23k26R9J21M7
4648D0n3K54l16pK02k6n4q7p1j80L56J01k18J25l17L13l9j7j07M0m33M38J01l03
4672b58N8J36J4K37k43J47k39l52N09l0K32j42J44k02J2p2L04l10K6J50K8p0J75
4695B54R6k31k25M78j00k23R9J25o08M52lq7m26M13J80l60K35K36l61l7r4L31
4717A44k87N1K66J08p0k29j37M00k78J71k22n9J45J1k02R2R2L8o1L07k26k44Q0
4740a10J01J5J2p2J1n6K68j09l23L20L3j40k85K30J84K89q4j22qj05jp5M7Q4Q
$$ plain form
4765 112 -88 -22 71 251 126 -84 232 109 48 149 32 -12 16 48 159 -65 296 88 1 30 163 214 75
4788 75 64 -52 -290 120 -41 57 -141 0 122 14 106 228 145 -102 -117 -251 -25 98 -224 103 -81 98
4810 98 29 -47 199 -2 -125 29 51 131 -313 -32 -240 164 -201 46 278 -30 68 185 35 -17 113 42 227
4833 227 -22 196 -17 -22 72 160 -41 -98 -46 -147 32 63 -145 28 -68 -31 -52 -228 131 -86 -123 -22 102 -106
4857 -106 -177 -81 181 -178 -271 -53 -243 204 -29 26 -321 -94 85 -311 -123 -138 -151 -107 157 254 83 -65 163
4880 163 -148 -194 -432 -36 -151 -317 -216 224 -61 -64 42 169 63 206 139 55 41 87 -150 -84 226 283 141
4903 141 71 344 -154 222 -80 -213 -134 -48 -134 39 15 -22 34 126 113 103 -97 -191 -33 -152 -25 -140 76 -140
4927 -140 -11 -301 120 -111 -130 -206 -184 -35 -70 -167 -9 121 65 -28 -30 165 8 135 38 -147 -6 225 273 195
$$ packed form
4765A12k00O6R3J80j25k10L16j23o1J01j17m4K8L2J11k24L61k08q7K9J33N1j39
4788G5j1j16k38M10j61R8j98J41J22j08R2J22q3k47j5j34K26J23l22L27j84J79
4810I8o9p6K46k01j23J54K2Q0m44K81k08M04l65K47K32l08R8J17j50n2J30p1J85
4833B27k49K18k13nR4Q8k01n7N2j01J79L1k08J73r6L7k1j76L59k17l7J01J24k08
4857a06p1R6K62l59r3K18j90M47k33N5l47K27J79l96J88j5j3M4K64R7j71j48K28
4880A63l11m6k38L96j15j66J01M40k85lJ06J27j06J43o7q4j4M6k37O6L10N7j42
4903A41p0K73m98L76l02j33P9Q6q6J73k4l7N6R2j3j0k00r4J58j19J27j15K16k16
4927a40J29k90M21k31j9p6K2J49l5r7J58J30n6r3kJ95j57J27r7j85J41K31M8p8
$$ plain form
4951 195 90 -109 -51 428 105 59 39 -19 56 -154 137 121 25 73 -206 -148 77 11 -48 182 60 -85 27 -70
4975 -70 116 18 276 -28 129 13 27 -99 -86 -34 -325 35 -173 -182 -216 -53 106 -190 -12 -150 -166 -6 186
4998 186 66 -116 1 -227 5 -204 -88 226 282 68 62 11 -314 73 -28 83 -26 220 77 -145 388
5019 388 -307 -25 272 11 -24 243 308 -44 227 -216 141 26 60 -39 -106 -7 72 -64 -70 -117 14 27 -163 209
5043 209 21 240 151 80 45 -79 -197 51 -146 -166 -29 -208 84 28 -112 16 101 119 19 -244 -160 180 -399
5066 -399 -58 -249 -328 -231 152 290 121 -53 14 -248 71 80 25 -102 133 -81 43 3 176 139 30 -13 41
5089 41 122 -13 225 297 -108 178 327 -287 -185 280 109 -335 -52 284 -81 96 -94 32 -189 -27 123
5110 123 -222 36 200 45 54 71 69 24 -421 39 -4 -261 222 -23 -213 -59 112 -253 -82 57 29 -423 -119
$$ packed form
4951A95j05j99N8M79l23m6k0n8P5k10K91j6r6M8k79N8K25o6n9K30j22j45J12r7
4975g0J86r8K58l04J57j16J4j26J3N2k91L60k08rl4J63J59k96J78j38j6J60J92
4998A86j20j82J17k28K32k09J16L14N6k14on1l25L87j01J11j09K46j43k22N33
5019C88o95K82K97k61l5K67O5l52K71m43L57j15L4r9o7R9P9j36om7J31J3j90L72
5043B09j88K19q9p1l5j24j18K48j97k0J37j79K92n6j40J28Q5J8j00k63Q4L40n79
5066c99L41j91p9R7L83J38j69j74O7k62L19Rn5j27K35k14J24m0J73l7j09m3N4
5089D1Q1j35K38P2m05K86J49o14J02M65j71m44K83L36l65J77j90J26k21J62J50
5110A23l45K58J64j55RJ7km5m45M60m3k57M83k45j90J54J71l65J71J39k8m52L04
$$ plain form
5133 -119 31 109 -129 -204 -79 -12 49 174 162 197 203 86 -85 159 103 114 91 90 65 -68 -207 -2 -70 -11 389
5158 389 -11 -137 -71 258 -70 -233 149 189 23 -46 326 -11 -202 92 -132 -23 -136 -56 -196 -152 230 -248
5180 -248 130 -54 -62 254 -133 185 153 3 -215 -67 -205 -98 -29 72 -149 -258 133 -9 -213 128 -118
5201 -118 28 16 -67 -121 -149 180 82 -315 47 355 -56 -188 -76 51 196 -67 262 -260 -48 409 -46 -187
5223 -187 342 4 -62 136 277 -81 -117 -29 270 16 -161 -111 -231 16 400 94 1 -114 57 -116 -141 93
5245 93 171 20 -13 65 97 4 -26 -219 -152 59 288 -157 -504 -8 -40 30 -101 -51 -321 25 289 -126 -455 29
5269 29 22 77 73 83 293 80 -275 89 119 123 -199 70 -127 87 133 -167 81 73 168 -146 -151 183 32 -108 157
5294 157 44 12 -109 48 -71 -91 160 34 -135 -256 74 -101 -139 16 -2 -262 -193 40 -198 -185 -85 59
$$ packed form
5133a19J50P8k38p5J25O7O1J25j2L5Oj17j71K44n6J1k3jk5j33j39K05o8N9M00
5158C89m00j26O6L29l28j63L82M0j66o9L72l37j91K94k24J09j13Q0j40M4L82m78
5180b48L78j84qL16l87L18l2j50k18J48j38J07O9J01k21j09L91j42k04L41k46
5201a18J46j2q3n4k8L29r8l97L62L08m11j32J12J27J45k63L29n22K12M57m55j41
5223a87N29l38o6J98J41l58l6Q8K99k54j77N0j20K47L84l06r3j15J71j73k5K34
5245I3P8j51l3P8L2r3l0j93O7K11K29m45l47M96l2P0j31N0k70L46K64m15l29M84
5269B9pN5mJ0K10k13l55L64L0Ml22K69j97K14M6l00K48qR5l14nL34j51j40K65
5294A57j13l2j21J57j19k0K51j26j69j21L30j75l8J55j8k60O9K33k38J3J00J44
$$ plain form
5316 59 -51 97 129 -66 -106 95 -125 -148 -175 -22 -162 -62 152 -23 2 -29 364 -94 -185 -124 58 -10 -268
5339 -268 86 109 107 -94 -106 51 127 -239 6 129 -55 38 -23 94 -67 -146 171 107 71 224 11 -30 45 28
5363 28 -104 210 -39 243 -1 124 17 -61 -286 -113 -70 66 -22 -36 -118 192 -109 -76 -167 107 -58 9 -158
5386 -158 22 37 2 144 20 34 -263 -54 -50 -92 -102 303 125 -160 -104 202 68 -118 -43 -114 179 -46 245
5409 245 -60 -5 -16 -185 -167 126 -45 -4 -87 -15 165 -86 275 38 -21 22 -90 131 152 -92 -111 71 -21 -108
5433 -108 52 12 186 54 62 -323 159 -42 78 -5 227 -141 38 -185 -92 -148 -37 -125 173 -19 -85 -90 -40 -182
5457 -182 -53 206 -182 -77 -297 -149 19 -168 200 -149 -13 -223 23 102 46 -80 93 337 1 38 132
5478 132 156 30 233 40 80 295 110 2 21 -93 165 -96 406 -25 -129 -19 135 -210 86 247 97
$$ packed form
5316E9j10J48L2j95m0K01k20k3k7J53j40J00K14j75K5l1L93m58r1O1J82o8k58
5339b68L54K3kk01j2J57P6l66K45J23j84R3o1J17j61p9L17o4l6J53k13m1P5j7
5363B8j32L14k49K82k44J25j07p8k25J73M3J36q8j4q2L10l01L3r1K74j65O7j67
5386a58J80J5l5J42j24J4k97K09Mm2j0M05j78k85N6L06j34j86P5p1K93k25K91
5409B45l05N5j1j69J8K93j71M1q3P2J80k51L61k37n9M3j12K21K1k44j9J82r2q7
5433a08J60m0J74j32Ql85M82k01J20q3K32l68J79k23R3n6J11q8K98j92o6nN0j42
5457a82J29K59l88J05k20J48J68j87L68l49J36k10K46P9n6j26J73K44l36L7R4
5478A32K4j26K03j93M0K15j85j08J9j14K58k61N02m31j04J10J54l45K96J61j50
$$ plain form
5499 97 30 -25 -14 258 121 -18 -70 6 223 75 1 -10 -60 -136 -125 -212 -16 -68 -162 -12 -13 -173 9 -134 -116 68
5525 68 -102 -45 -32 -209 -114 178 -133 33 -53 -311 -176 29 20 -4 -4 -25 -34 62 -23 285 27 296 250 -64 168
5550 168 -42 66 -1 118 62 -123 70 159 323 -100 243 -197 -41 -115 78 119 -268 61 149 21 -95 63
5572 63 -137 100 51 -164 130 154 70 -114 35 -77 -95 295 205 -91 -128 52 -124 -73 113 124 -151 -161 27
5595 27 68 -52 52 28 -113 152 -16 -24 31 56 65 327 273 -133 -76 -222 -230 218 240 -96 237 -13 126 121 241
5620 241 -131 241 -177 122 405 240 110 119 -30 -141 -10 61 27 -8 314 -16 -159 24 62 -22 -98 -70 -120
5643 -120 -76 108 8 -101 -103 226 -96 58 -223 146 38 88 23 120 70 -83 100 71 -32 -58 -84 170 -8
5666 -8 278 63 -47 344 57 17 -202 69 66 131 -34 70 -171 27 94 151 -165 138 -84 20 213 -23 -25
$$ packed form
5499I7o7n5J1K72j37j39n2P6K17j48p4j1n0p6J1q7J96n2r4J50jj60J82j43J8J84
5525F8j70N7J3j77R5K92l11J66q6k58J35K05rk4%k1rR6q5L08k58K69m6l14K32
5550A68k10J08o7J19n6j85J93Q9J64m23L43m40J56p4J93M1l87L29Q8j28j16J58
5572F3k00K37m9k15K94K4q4j84J49j12j8L90r0k96l7J80j76N1J86J1k75j0J88
5595B7M1j20J04k4j41K65j68qN5K5RK62n4m06N7j46qM48K2l36L33k50J39nJ20
5620B41l72L72m18K99K83j65j30Rj49j11J31P1l4l5L22l30j43J83L8q4p6K8n0
5643a20M4J84j00j09kL29l22J54k81L69j08N0o5R7n0j53J83k9j03k6k6K54j78
5666hK86k15j10L91k87m0k19K71lO5j65J04k41J98O7N7l16L03k22J04J93k36k
$$ plain form
5689 -25 -269 -57 -20 -44 -250 32 265 -43 -186 -234 196 124 -151 -133 -280 50 -161 -158 116 13 -11 -1 64 -222
5713 -222 -255 11 123 91 -162 143 -5 -7 36 -128 183 190 -91 -132 94 261 39 -7 -151 -227 157 -149 18
5736 18 97 -104 -26 -86 -363 -39 544 19 -172 -94 226 55 -88 234 -48 -92 160 43 161 -151 32 44
5758 44 -100 56 -271 -79 -69 50 72 -306 -163 -49 172 -183 -5 58 -188 -313 143 10 -39 -237 35 -125
5780 -125 -236 109 -9 -34 -308 -320 -119 10 -20 106 -322 112 117 -116 295 -100 262 -144 244 -110 -124 -153
5802 -153 71 208 223 178 -51 99 116 85 0 138 122 67 -163 95 72 37 154 -3 79 52 11 1 -150 9
5826 9 106 -28 106 -46 -53 -266 -126 53 -118 49 -93 -67 24 -215 -26 -115 182 31 -198 76 12 57 -104
5849 -104 -18 203 191 -173 155 -91 -108 41 120 -194 -100 85 -296 -259 -19 27 -146 -137 -3 114 -304 25 169
$$ packed form
5689b5k44K12L7k4k06K82K33l08j43m8M30p2k75J8j47L30k11LK74j03k4J0O5k86
5713b22l3K66J12l2k53L05j48kM3j64L11Pk81m1K26J67k22m6j44p6L84l06J67
5736A8P9k01P8o0k77L24N83n25j91P8L20j71j43L22k82m4K52j17J18l12J83J2
5758D4j44J56l27J92J0J19K2l78J43J14K21l55J78O3k46j25M56j33m9j98K72j60
5780a25j11L45j18k5k74j2K01J29l0J26m28M34Nk33M11l95L62m06L88l54j4k9
5802a53K24J37J5m5k29J50J7l1q5J38j6n5k30K58k3l5J17j57Q2k7m1j0j51J59
5826IR7j34J34j52pk13J40J79j71J67j42K6R1k39J89q9K97j51k29K74o4M5j61
5849a04Q6K21j2l64L28k46j7J49P9l14R4J85l81L7K40M6j73RJ34J17m18L29J44
$$ plain form
5872 169 -17 107 -216 211 132 65 121 -120 174 76 93 198 110 -22 138 -229 -75 97 83 -31 74 -173
5894 -173 -160 192 61 -97 -229 -198 -4 -177 110 -16 -304 117 25 -107 30 88 164 34 -241 21 -60 -179
5916 -179 -211 -43 187 -266 129 95 -349 -286 -302 242 81 38 132 48 7 163 -12 85 47 134 -140 26 306 -30
5940 -30 -1 118 -42 52 61 -147 -124 129 205 -118 266 258 35 -35 -25 2 219 -125 -59 -9 -43 209 -57 -106 59
5965 59 62 -27 -128 -2 324 -214 97 -84 -100 -240 64 36 -50 -189 27 -161 84 124 104 -139 -110 206 -126
5988 -126 -343 37 193 -41 171 -110 -17 -2 402 16 -112 102 4 -13 133 141 128 326 85 70 -26 146 -45
6011 -45 -63 -159 -101 178 49 -37 -27 76 80 20 304 91 -51 -67 178 52 -148 67 -129 111 10 -66 -90 108
6035 108 -313 -143 -97 -143 -18 42 49 -135 -177 -124 -309 -46 -167 -193 21 76 66 -159 -196 -35 256 215 76 5
$$ packed form
5872A69j86J24l23M27p9o7N6k41K94r8J7J05q8j32J60l67J54J72j4j14J05k47
5894a73J3L52j31j58j32L1J94j73K87j26k88M21r2j32J37N8P6j30k75K62q1j19
5916a79l2J68K30m53L95l4m44O3j6N44j61m3R4q4m1J56j75R7l8Q7k74J66K80l36
5940c0K9J19j60R4Rk08K3K53P6l23L84qk23p0J0K7K17l44O6N0l4K52k66m9J65
5965E9Lq9j01J26L26n38L11j81j6j40L04k8q6j39K16j88K45M0k0k43K9L16l32
5988a26k17L80J56k34K12k81R3J5M04l86j28K14r8j7J46Qj3J98k41j5r6J72j91
6011d5j8r6N8K79j29q6J0J03Mo0K84k13j42j6K45j26k00K15j96K40j01p6k4J98
6035A08m21J70M6m6J25O0Pj84m2N3j85K63j21k6K14N5j0k25l7J61K91m1j39p1
$$ plain form
6059 5 22 -10 15 148 -159 40 137 83 7 -20 250 -79 209 190 55 184 41 199 -71 227 20 142 -97
6082 -97 45 12 -24 -85 267 250 -75 41 -88 -142 228 71 -96 20 -95 138 -200 35 -9 -122 17 252
6104 252 -169 -94 144 95 -41 -77 -33 -68 -156 -288 86 -124 -181 -153 -2 -60 -169 307 -222 -210 36 -72 93
6127 93 140 32 219 -104 221 12 14 -88 76 -1 37 202 -23 -19 107 9 31 -21 -177 158 -38 -146 -216 31
6151 31 99 -59 -56 193 -265 245 4 -169 166 -19 121 -29 -44 -237 -145 -116 50 82 102 -58 -85 -76 -161 -105 85
6176 85 337 38 -186 -110 -179 -179 -110 -179 181 205 131 211 -503 -185 -9 126 -108 339 -14 46 -73 -90 161 -221
6200 -221 78 -95 274 121 181 15 208 12 -129 12 198 128 273 213 70 -74 133 -116 -50 -123 -58 175
6222 175 -102 -27 -3 -135 -68 84 -46 -9 -123 119 11 101 152 -297 131 -17 94 212 -140 -286 -15 240
$$ packed form
6059EJ7l2K5J33l07J99R7n4p6k7K70l29K88j9j35J29j43J58k70K98k07J22k39
6082i7J42l3l6o1L52j7l25J16j29n4L70j57j67J16j15K33l38K35m4j13J39K35
6104B52m21P5K38m9j36l6M4l5q8j32L74k10n7K8J51n8j09M76n29J2K46j08J65
6127I3M7j08J87l23L25k09Kj02J64p7L8J65k25MJ26r8K2n2j56L35j96j08p0K47
6151C1O8j58LK49m58N10k41j73L35j85J40j50j5j93R2K9J66L2K0j60k7Rq5N6J90
6176H5K52k99k24P6o9%O9o9L60K4p4Q0p14L18J76J35k34M47l53O0j19j7K51l82
6200b21K99j73L69j53O0j66J93j96j41J41J86p0J45o0j43j44K07k49O6p3O5K33
6222A75k77P5K4j32O7J52j30L7j14K42j08R0N1m49M28j48J11J18l52j46K71K55
$$ plain form
6244 240 -4 52 75 -60 -122 -169 -129 -112 58 -133 -158 -4 32 123 -24 -33 102 -50 158 -226 408 63 100 -119
6268 -119 -11 -60 -49 83 -37 -183 76 128 183 143 116 133 -174 -91 -163 -20 99 -54 -6 -170 299 285 -79 -97
6292 -97 46 -293 42 121 -142 289 89 197 -65 43 170 91 -105 -121 18 -157 -139 70 130 67 -52 -75 237
6315 237 -173 -9 -34 -153 105 22 -233 -127 127 15 78 43 -128 145 20 82 -32 243 -67 119 178 -110
6337 -110 63 157 51 -79 -217 -165 -102 112 95 238 9 -55 237 109 89 87 -160 215 -17 -54 -42 -8 -71 -17
6361 -17 -22 -213 -220 -101 48 -308 -358 -38 -155 -94 -49 -40 -79 3 -13 -160 44 -104 94 -70 -18 86 121 14 17 -111
6387 -111 116 137 -34 -61 -161 21 307 11 145 177 139 -126 107 9 92 -68 -114 319 8 23 240 302 -134
6410 -134 191 98 -49 -31 -24 -48 11 92 -133 24 41 -203 -105 167 -165 204 -341 -30 -21 45 -85 61 -75 -17
$$ packed form
6244B40k44N6K3j35o2m7M0J7J70j91k5J54L6R1j47rJ35j52K08l84O34l45L7k19
6268a19J08m9J1J32j20j46K59N2N5m0k7J7l07Q3p2J43J19j53M8j64M69j4l64j8
6292i7J43l39L35P9k63M31k00J08k62J08J27p9j96j6J39j75J8K09O0o3j19k3L12
6315B37m10J64k5j19K58q3k55J06K54j12O3l5j71K73j25O2j14K75l10J86N9k88
6337a10J73R4j06j30j38N2O3K14j7J43k29o4K92j28k0kk47L75k32l7J2L4o3N4
6361a7nj91pJ19J49l56n0L20j17O1M5Rl9Q2j6j47K04j48J98j64N2J04L5j07Lj28
6387a11K27K1j71k7j00J82K86k96J34L2l8k65K33r8Q3j60m6M33l11J5K17O2m36
6410a34L25r3j47J8Pk4N9Q1k25J57J7k44R8K72l32L69n45L11RO6j30J46j36N8
$$ plain form
6434 -17 140 -174 70 -465 -81 -48 76 -107 71 -28 -254 -83 96 -102 369 -126 24 136 -182 -40 209
6455 209 168 170 -153 -151 185 -152 17 188 59 14 72 93 -95 -3 105 221 -121 106 62 138 118 -88 -93 -138 69
6480 69 7 -27 -270 6 -315 227 135 -209 22 -152 -74 92 -32 -125 102 67 -352 36 -132 -102 124 -139 207
6503 207 151 71 75 -63 -2 -191 0 126 -147 -34 -434 13 -13 -5 -79 -181 -80 -6 94 -154 196 90 -122
6526 -122 25 91 18 9 71 163 247 -52 -29 81 23 242 64 22 109 11 59 336 -136 -12 0 45 -112 -239 -96
6551 -96 -297 -203 201 -104 17 -154 -102 -120 26 24 -25 -209 21 142 -214 55 -22 121 30 -171 -209 -153 -16 -79
6575 -79 -196 -24 308 -12 -97 -144 390 114 -186 16 184 -46 -30 212 97 -55 -17 -147 3 220 92 -78
6597 -78 85 103 483 176 39 138 -71 -250 -86 88 -48 6 -12 37 -201 292 -320 242 52 158 -55 -105
$$ packed form
6434a7J57l14K44n35L84L3J24j83J78r9k26J71J79j98M71m95J50J12l18J42K49
6455B09m1Kl23KL36l37J69J71j29m5N8K1j88R2J08J16l42K27m4P6k0k06nm5K07
6480F9o2l4k43K76l21N42r2l44K31j74P8J66j24r3K27l5m19L88j68L0K26k63L46
6503B07n6q0Mj38O1j89J91J26k73J13m00M47k6Qp4j02J01P4J00k48L50j06k12
6526a22J47O6p3rO2R2Q4k99K3J10n8K19j78m2Q7r8M8K77m72J24J2M5j57j27J43
6551i6k01R4M04l05J21j71N2j8J46km9j84K30J21l56K69p7J43r1k01l8N6J37o3
6575g9j17J72L32l20q5m7N34k76l00K02J68k30J6K42j15j52L8j30J50K17j28j70
6597g8J63J8L80l07j37R9k09j79J64J74j36N4j8M9k38M93o12N62j90J06k13n0
$$ plain form
6619 -105 337 -112 -121 84 -132 52 -44 -200 -201 261 110 108 -101 -252 92 -178 126 33 -147 227 88 -59 272
6642 272 102 107 -166 175 66 -15 -88 104 -23 294 99 -56 -44 250 4 55 -52 9 303 -19 108 -157
6664 -157 -27 49 130 1 5 -192 98 -72 -130 72 23 -335 -207 22 -162 75 -43 -174 47 250 114 8
6686 8 53 273 141 96 102 -214 104 74 32 26 -15 107 82 183 -41 -5 215 -84 73 -223 313 77 -90 -99 37
6711 37 -187 -53 -80 -47 24 337 -118 106 -22 183 -196 187 241 -44 35 23 129 -102 -81 177 -194 -264 -35
6734 -35 117 -55 171 -78 220 20 -68 146 -161 -26 121 -101 -64 -28 155 109 86 207 -314 65 -18 -48 13
6757 13 125 133 324 263 -126 -219 186 -58 -146 -83 -147 36 205 -190 1 -88 -242 18 189 63 24 -206 -143 149
6781 149 -71 -227 169 10 100 292 116 -316 103 -52 -189 53 -35 49 -67 191 54 -67 -53 59 71 -3
$$ packed form
6619a05M42m49rK05k16J84r6j56jM62j51kk09j51L44k70L04r3j80L74j39j47L31
6642B72j70Nk73L41j09q1p3J92j27L17j95j55J2K94k46N1j07O1K94l22J27k65
6664a57J30P6Q1j29Mj97K90j70n8K02m9l58J28K29j84K37j18j31K21K03j36j06
6686HM5K20j32m5Ol16L18l0m2om1J22k5J01k24L6K20k99J57k96N36k36j67rJ36
6711C7k24J34k7L3P1L13m55K24j28K05l79L83N4k85P9j2J06k31K1K58l71p0K29
6734c5J52j72K26k49K98k00q8K14l07J35J47k22L7L6J83m6k3J21n21L79q3l0O1
6757A3J12QJ91o1l89r3M05k44q8O3o4J83J69l95J91q9j54K60J71j26l9k30O3K92
6781A49k20j56L96j59R0J92j76m32M19j55j37K42q8Q4j16K58j37j21J4J12J2p4
$$ plain form
6803 -3 -71 -14 43 -4 191 110 195 72 -155 -181 141 -273 -139 173 60 -98 -92 -199 129 55 -166 33 201 38
6827 38 -225 150 -162 -17 40 -49 -135 -189 266 -22 -40 -114 74 165 -71 -110 -63 140 97 52 288 9 280 92
6851 92 -118 189 3 -122 -183 168 78 131 -10 -89 144 14 -37 105 123 324 -32 -144 293 -274 -45 -164
6873 -164 -213 136 10 -25 393 53 -4 -65 107 -10 -279 140 152 -94 -154 -196 -244 -69 -45 67 -83 30 -228
6896 -228 -94 -100 -126 244 -62 153 -55 -69 -40 -187 27 -30 92 36 -139 139 -136 84 11 132 172 -14 -42
6919 -42 33 -196 2 -36 74 50 281 -129 -102 -22 -64 97 143 2 -32 -158 144 155 -86 196 48 -6 -24 18
6943 18 109 -117 147 -45 82 36 -249 163 -265 -145 -23 -208 -253 -38 99 -17 -211 -196 68 214 6 -109
6965 -109 14 -299 21 -14 -115 324 131 21 -65 -41 144 29 188 -91 -86 -91 -41 66 140 68 -24 -15 -26 323 208
$$ packed form
6803co8N7N7m7J95q1Q5j23k27k6L22m14J34L12j13j58Oj07L28p4k21J99J68j63
6827C8k63L75l12J45N7q9q6n4M55k88j8p4J88R1k36l9M7K03m3m5K36k79K71j88
6851I2k10L07j86j25o1L51r0N3j41p9K33j30n1J42J8K01l56j12M37n67K29j19
6873a64m9L49j26l5M18l40n7o1J72j17k69M19J2k46o0m2m8J75K4J12j50J13k58
6896b28J34ok6L70l06K15k08j4K9j47K14n7J22n6j75K78k75K20p3J21M0j86k8
6919d2P5k29J98l8J10k4K31m10K7Q0m2J61M6j41l4j26L02J1k41K82j48n4j8M2
6943A8R1k26K64j92J27m6k85M12m28J20J22j85m5K15J37j16j94J5K64J46k08j15
6965a09J23l13L20l5j01M39j93j10q6K4J85j15J59k79NnN0J07P4p2r2Rj1L49j15
$$ plain form
6990 208 -167 -96 -67 -26 116 169 58 -42 58 151 -54 -17 -84 0 48 9 -349 -123 -1 -135 -99 82 175 223
7014 223 74 96 -37 -139 121 101 -128 -43 189 103 133 -180 -37 49 -3 -213 104 -207 199 36 -83 -63 -148
7037 -148 278 167 -114 -19 -69 3 187 -148 -117 274 129 -121 -17 -13 -7 72 285 -38 162 -146 172 228 -100
7060 -100 -221 -160 114 -113 -34 -35 0 -31 218 -75 -3 21 195 -28 -3 19 -88 -147 -278 -16 -133 -19 -27 -193
7084 -193 -11 -130 -122 131 -299 80 -62 -202 -48 46 122 -172 209 202 145 -208 -112 41 10 46 -68 60 217
7107 217 104 21 236 -272 -227 39 -21 194 -223 36 114 -8 -90 246 30 -31 94 107 -7 -212 18 91 3
7130 3 323 -24 56 52 241 84 -48 5 -142 294 95 61 257 -44 -187 -45 -71 149 -92 -160 3 -65 204
7153 204 30 22 -9 1 30 -80 -44 -157 -28 -364 -12 48 -23 -27 181 -249 -125 29 83 58 -60 104 70 -132
$$ packed form
6990B08l75P1K9M1J42N3j11j00J00R3k05L7o7Q4M8l9l58K26J22j34L6J81R3M8
7014B23j49K2j33j02K60k0k29Q5K32q6L0l13J43Q6n2k10L17l11M06j63j19K0q5
7037a48M26j11k81R5n0P2J84l35L1L91j45k50J04MOP9K13l23K00l08L18N6l28
7060a00j21O1K74k27P9jL5l1K49k93P2K4J74k23K5K2j07n9j31K62j17J14qj66
7084a93J82j19QK53m30L79j42j40J54R4P6k94L81pn7l53R6J53l1L6j14J28J57
7107B17j13q3K15n08M5K66o0K15m17K59P8j22q2L36k16o1J25J3j14k05K30P3q8
7130CL20l47Q0mJ89j57j32N3j47M36j99l4J96l01j43J42k6K20k41o8J63o8K69
7153B04j74ql1J0K9j10L6j13J29l36L52O0p1mK08m30J24J54N4k5j18J64l4k02
$$ plain form
7177 -132 292 50 277 46 149 -49 -13 -38 64 -47 214 -182 344 223 72 168 107 -66 42 -87 -51 -183
7199 -183 -54 60 33 -23 -23 -100 32 -104 -216 189 61 -164 -231 81 16 -171 -195 150 -39 -1 -134 -125 83 6
7223 6 -325 45 209 107 -93 -78 46 50 -16 -66 -13 154 -376 -175 -261 84 -90 103 125 -78 115 -181 -139 142
7247 142 13 171 -98 -117 156 -178 -80 -18 -60 -31 40 -5 -136 75 -23 7 211 -162 62 109 52 128 -136 85
7271 85 -102 52 223 -251 -46 -112 -197 -31 68 -178 28 -12 -109 -193 31 -154 25 42 -141 -31 -230 183 -211
7294 -211 -10 30 -142 308 15 97 16 45 -20 -103 -283 -148 304 185 27 -102 278 31 33 -54 7 78 -242 220
7318 220 375 243 51 -368 152 -83 -123 0 66 3 256 -109 44 -87 -109 31 230 48 105 211 -43 88
7340 88 -222 -247 -251 -89 59 50 -20 -34 177 -39 -115 -134 43 -137 -125 15 2 97 203 -71 -254 113 -85 65
$$ packed form
7177a32M24k42K27k31J03j98L6k5J02j11K61l96N26j21j51R6o1j73J08j29L6j32
7199a83J29J14k7n6%p7J32j36j12M05j28k25o7L12o5j87k4L45j89L8j33RK08p7
7223Fl31L70J64j02k00J5J24Mo6n0N3J67n30K01q6L45j74J93K2k03J93k96M2K81
7247A42j29J58k69j9K73l34R8O2m2K9P1m5j31K11r8L0K04l73K24M7n7P6k64K21
7271H5j87J54J71m74K05o6q5J66R9k46K06m0r7q4K24j85J79J7j83J10j99M13l94
7294b11K01M0j72M50k93Q2q1K9o5q3j80J35M52j19j58j29L80k47Kq7O1P1l20M62
7318B20J55j32j92m19N20k35m0J23O6o3K53l65J53j31k2J40J99j82N7J06k54J31
7340H8l10k5mJ62J48rp0j4K11k16p6j9J77j80J2J40j3R5J06k74j83L67j98J50
$$ plain form
7364 65 -22 52 -51 130 15 197 226 38 95 -132 -86 80 46 230 74 -81 84 -108 -185 90 -116 -89 -44
7387 -44 -93 53 125 -67 -44 7 70 118 319 39 125 44 16 -19 -117 -109 40 -17 32 104 -124 -68 121 418 90 36
7413 36 16 131 -167 -19 -67 -20 108 13 181 -4 62 -3 41 -86 83 110 -17 -34 9 119 -206 221 169 -17
7437 -17 -46 18 -150 -170 91 97 198 26 -33 171 -208 20 219 220 -259 134 -110 299 241 -112 19 97 49 227
7461 227 186 230 -181 48 20 -230 3 -250 -41 117 -219 107 -44 -82 216 70 -231 -165 139 -40 -89 -27
7483 -27 -86 74 234 96 0 21 28 -107 152 -257 305 -2 -19 215 297 78 -99 88 -20 55 75 135 -220 77
7507 77 38 -278 68 -125 -57 -74 76 -281 11 -55 10 5 153 -251 -19 44 -99 134 13 -1 -145 61 66 2
7531 2 -62 27 -79 40 -97 0 8 -20 45 -123 198 39 -116 -94 -28 20 -136 -40 170 164 -54 109 68 -42 165
$$ packed form
7364F5q7P4j03J81j15J82K9j88N7k27M6J66l4J84j56j55J65j92p7K75k06K7M5
7387d4m9J46P2j92K3N1O3M8K01k80Q6q1k8l5r8QJ49n7M9P2k28N6J89K97l28n4
7413C6k0J15k98J48m8M7J28r5J68j85O6o5M4j27J69K7j27j7M3J10l25M27n2j86
7437a7k9O4j68k0K61OJ01j72n9K04l79K28J99Jm79L93k44M09n8l53J31P8m8J78
7461B27m1M4m11K29k8k50K33k53K09J58l36L26j51l8K98j46l01O6L04j79m9O2
7483b7n9J60J60j38r6K1Pj35K59m09N62l07j7K34Q2k19j77J87j08P5K0O0l55K97
7507G7l9l16L46j93O8j7J50l57K92o6O5nJ48m04K32O3j43K33j21j4j44K06No4
7531Bo4Q9j06J19j37R7Qk8O5j68L21j59j55K2O6M8j56R6K10ok18J63m1j10K07
$$ plain form
7556 165 -156 -55 70 61 -52 201 93 -133 27 -72 135 254 -79 -203 203 -152 9 164 -22 -86 61
7577 61 96 27 77 21 107 83 -101 -122 263 291 -84 -151 -251 148 -46 -124 120 95 -215 -222 -64 -3 149 215 -53
7602 -53 -152 107 149 -38 -251 83 -2 -115 -35 204 219 25 38 -5 170 -14 61 83 121 9 -49 -30 -376 -96
7626 -96 -31 59 133 -46 200 -52 9 -158 -52 -21 -79 139 19 27 189 29 -115 27 -47 -28 -47 -131 -212 91 50
7651 50 -101 -86 -2 -145 -231 15 -46 59 -259 -90 335 97 -3 -57 43 -3 -113 -227 -204 -138 -184 5 -114
7674 -114 84 -15 56 -34 -65 184 -168 -3 -57 13 -110 113 -129 46 231 30 -97 -42 72 66 -66 -127 -56 -69
7698 -69 -87 -238 43 -7 73 91 -1 -73 -218 213 -188 259 -37 146 -139 51 -126 33 118 208 127 32 404 -126
7722 -126 -44 106 152 319 503 160 -102 -11 -202 -179 60 -21 -36 51 24 40 56 84 -37 9 187 -30 97 -76
$$ packed form
7556A65l21J01J25rj13K53j08k26J60r9K07J19l33j24M06l55J61J55j86o4J47
7577F1L5o9N0n6Q6k4j84k1L85K8l75o7j00L99j94p8K44k5l10pJ58O1J52O6k68
7602e3r9K59M2j87k13L34q5j13Q0K39J5j94J3m3J75j84P5K2L8j12n8J9l46K80
7626i6O5R0P4j79K46k52O1j67J06L1n8K18j20QJ62j60j44J42p4J9j9q4q1L03m1
7651E0j51J5Q4j43q6K46o1J05l18J69M25k38j00n4J00m6j10j14K3O6m6J89j19
7674a14J98r9P1r0l1K49l52J65n4P0j23K23k42J75J85k01j27N5J14oj32o1P1j3
7698f9j8j51K81n0Q0J8r2p2j45M31m01M47k96J83k85J90j77J59Q5R0q1r5L72n30
7722a26Q2J50M6J67J84l43k62R1j91K3K39q1j5Q7k7J6J6K8j21M6J78k17J27j73
$$ plain form
7746 -76 -187 -100 114 106 85 54 30 214 12 -149 -15 -98 -68 -94 -18 106 209 296 148 -165 -10 114 85 -134
7770 -134 17 -171 27 -29 91 21 -162 -76 205 261 48 12 -116 -82 -173 -53 125 74 171 159 -252 -264 172 207
7794 207 63 183 -221 -124 -20 235 -280 -91 -341 -44 18 -13 48 -76 -83 -72 -89 152 -90 -99 89 116 134 -126
7818 -126 -13 152 -83 182 -102 -156 139 182 -121 -33 364 40 82 74 22 18 -114 -8 -219 -30 -120 39 113 -103
7842 -103 43 -36 49 321 -137 71 96 232 193 58 36 -23 45 -137 76 -98 12 156 229 -42 23 -244 31
7865 31 -43 -71 142 145 -84 -10 -172 -16 -215 -107 71 -132 86 -90 -63 -55 -15 88 -142 83 -156 82 63 54
7889 54 -73 49 -24 -204 3 121 195 227 -235 -72 59 -106 -186 -147 4 3 57 104 -9 -78 168 -69 191 27
7913 27 73 166 -49 -124 32 81 274 -44 292 101 61 243 -46 101 -137 81 114 121 -138 67 279 -139 -37
$$ packed form
7746g6j11Q7K14qk1l1k4J84k02j61J34q3L0k6P6J24J03Q7j48l13J55J24k9k19
7770a34J51j88J98n6J20p0j83Q6K81N6k13l6j28L4r1J20J78n1R7j2m11j2M36L5
7794B07j44J20m04R7J04K55n15J89k50K97O2l1O1j24pJ1j7K41k42rJ88K7J8k60
7818a26J13J65k35K65k84n4K95M3l03Q8L97l24M2qn2mj32J06k11J89r0J59P4k16
7842a03J46p9Q5K72m58K08K5J36l9j35k2n9O8j82K13j74J10J44P3k71O5k67K75
7865C1p4k8K13Lk29P4j62J56j99J08J78k03K18j76K7QM0J03k30K25k39K38j9r
7889E4j27J22p3j80K07J18P4L2m62J63J31j65q0L9J51jN4M7j13o9K46k37K60j64
7913B7M6R3k15p5J56M9J93l18L36j91m0J82k89J47k38K18L3Pk59K05K12m18J02
$$ plain form
7936 -37 -94 -113 132 60 -223 -44 89 -96 -127 -105 349 124 -257 -252 54 3 -16 -226 -29 -97 251 -136 99 -11
7960 -11 53 -57 -62 212 55 80 46 85 174 -126 42 274 164 19 114 93 23 61 84 6 -27 -177 -20 -33 30 -6
7986 -6 -121 273 52 -51 144 165 65 -15 40 144 212 -151 -11 -15 -196 -315 28 162 -213 -107 -103 -79 -95 34
8010 34 147 -108 -75 -27 189 -96 89 -108 209 0 8 278 -53 105 100 160 -212 63 -216 -81 -87 -3 -187 -80
8034 -80 103 -216 3 316 -134 47 9 88 98 -164 1 -166 -251 -244 -27 -148 -71 -30 -155 -116 45 131 -46 90
8058 90 85 -45 -104 143 289 97 -280 -167 281 -38 204 125 56 -27 62 -57 274 -78 166 4 23 -78 50
8081 50 -95 175 -47 -230 103 -118 17 63 92 364 224 35 210 136 300 -226 99 135 -42 42 75 18 66
8104 66 -168 -162 86 88 69 143 -61 27 -138 -52 176 9 -111 70 151 21 -100 144 119 -191 -23 -25 215 284 -79
$$ packed form
7936c7n7j9K45p2k83J79J33j85l1K2M54k25l81NL06n1j9k10J97o8L48l87K35j10
7960a1O4j10nK74j57K5l4L9Q9l00J68K32j10j45R5k1p0L8K3p8l3j50J57j3O3l6
7986fj15L94k21j03J95K1j00q0N5J04O8l63J40mj81j19L43J34l75J06MK4j6J29
8010C4J13k55L3M8K16k85J85j97L17k09QK70l31J58nO0l72K75k79J35oQ4j84J07
8034h0J83l19K19L13m50J81l8P9J0k62J65j67q5PK17j21P7M1j25L9J61Q6j77J36
8058I0nj30n9K47J46j92l77J13M48l19K42p9o9q3Q9j19L31l52K44j62J9j01J28
8081E0j45K70k22j83L33k21J35M6K9K72j40j89J75p4J64n26L25L6j77Q4L3n7M8
8104F6k34OK48Kj9P4k04Q8j65Q6K28j67j20J81Q1j30j21K44k5l10J68kK40O9l63
$$ plain form
8129 -79 -186 -32 101 -183 -26 -17 -12 -190 -41 -137 -63 205 273 -338 -59 389 -168 125 11 106 93 325 -39
8152 -39 23 -56 -102 128 4 -249 -37 11 -92 -283 7 17 -178 320 30 64 -11 63 -84 160 -95 91 -31
8175 -31 30 -25 -97 -35 150 42 3 -138 -107 -113 -1 21 48 -34 -55 -69
$$ packed form
8129g9j07J54J33k84J57RNj78J49r6P4K68O8o11K79M48n57K93j14R5j3K32l64
8152c9O2p9m6K30j24k53K12M8j03j91K90J0j95M98k90L4p5P4j47K44k55J86j22
8175c1O1n5p2O2J85j08l9j41L1oJ12K2K7q2k1j4
8191f9
$$ Imaginary data points
##PAGE= N=2
##DATA TABLE= (X++(I..I)), XYDATA
$$ plain form
0 0 0 0 0 0 0 0 0 0 0 0 0 0 0 0 0 -6 8 -8 8 -8 8 -15 16 -16 22 -24 27 -32 38 -41 48 -54 62 -70 79 -89 100
37 100 -111 125 -137 154 -171 189 -209 231 -255 283 -310 344 -378 416 -459 506 -557 618 -684 761
57 761 -850 954 -1079 1228 -1416 1654 -1974 2421 -3094 4218 -6434 12435 -61945 -168046
71 -168046 21688 89894 -25945 -35750 57584 18660 -34724 18080 40989 -16798 5333 34006
83 34006 -17501 -26498 30527 15274 -30249 11169 44495 -7122 -25762 20103 22273 -12942 7550
96 7550 27830 -1074 -14424 3703 -2606 -6555 23999 25165 -17922 -28783 2229 10944 1671
109 1671 8789 1330 -15778 -4890 7165 -13027 -16416 8628 4818 -21281 -18988 2513 -643
122 -643 -13165 -3644 4149 -3024 -3902 -4556 -13514 1933 24627 3740 -21717 -5912 7778 -6861
$$ packed form
0@%%%%%%%%%%%%%%%oJ4j6J6j6J6k3L1l2L8m6N1n9P0p9Q9j02J16j32J49j68J89
37A00k11K36k62K91l25L60l98M40m86N38n93O54p22P94q75R65j063J175j302J445
57G61j611J804k033K307k644L070l628M395n515P312j0652J8869p4380j06101
71a68046J89734O8206j15839r805R3334l8924n3384N2804K2909n7787K2131K8673
83C4006n1507q997N7025j5253m5523M1418L3326n1617j8640M5865K170l5215K0492
96G550K0280k8904j3350J8127o309l949L0554J166m3087j0861L1012Q715r273
109A671P118p459j7108J0888J2055k0192l389K5044l810k6099K293K1501l156
122f43j2522R521P793p173q78o54q958J5447K2694k0887k5457J5805J3690j4639
$$ plain form
136 -6861 -5072 18019 14767 -11794 -13566 7040 9526 1044 802 -1223 -3578 6068 8502 -5189
150 -5189 -4215 13796 15146 -3343 -7103 3972 4981 25 4100 8951 4696 338 -3743 -4584 5932
165 5932 14491 1952 -13574 -6609 5446 -665 -3041 9506 5764 -10612 -5372 6094 -135 -2701
179 -2701 2883 -4716 -10551 3405 6922 -12602 -14407 7911 8615 -9786 -6230 4953 -4916 -5928
193 -5928 8127 1813 -11865 -2367 2868 -10074 -6519 11996 5629 -12938 -6397 5875 -133 -2322
207 -2322 5525 370 -5430 3721 5665 -4594 -134 10148 1367 -6627 6225 11915 -2562 -5679
221 -5679 7610 8848 -686 -1295 1687 2188 4902 4362 -434 1668 6857 1832 -5177 852 7979 597
237 597 -7950 -3351 2586 835 -2093 -4087 -1157 4438 1465 -6947 -4670 3007 -97 -7057 -4285
$$ packed form
136f861J789K3091l252k6561j772K0606K486q482k42k025k355R646K434j3691
150e189R74J8011J350j8489l760J1075J009m956M075M851m255m358m081q41J0516
165E932Q559j2539j5526O965J2055o111k376J2547l742j6376N240J1466o229k566
179b701N584p599n835J3956L517j9524j805K2318P04j8401L556J1183r869j012
193e928J4055o314j3678R498N235j2942L555J8515o367j8567O541J2272o008k189
207b322P847n155n800R151J944j0259M460J0282q781p994J2852N690j4477l117
221e679J3289J238r534o09K982N01K714n40m796K102N189n025p009O029P127p382
237E97q547M599N937j751k928j994K930N595k973q412K277P677l104o960K772
$$ plain form
252 -4285 1689 -720 -5332 -4189 -2861 -3135 -1590 -2743 -4979 -1282 2394 -1555 -3455 624 1035 -2324
268 -2324 -1517 569 -1117 -205 2474 1095 -73 4273 3910 -2557 -1619 5842 5628 927 117 1552 1906
285 1906 2688 3232 651 2001 6179 2396 -3441 1187 7679 1763 -3243 2322 4041 -1574 -3668 607
301 607 2132 1623 332 -2592 -3100 1740 2252 -4973 -5319 2322 707 -7944 -5956 2651 2123 -2856 -2738
318 -2738 -1401 -3340 -4318 -3020 -2810 100 2072 -2472 -5945 -295 4716 -417 -3711 183 1591 -2537
334 -2537 -3131 876 3221 2573 1420 -966 -1473 2896 3200 -375 1584 5019 1605 -2674 901 4456
350 4456 3608 2285 2753 655 -607 3103 2623 -825 2164 5784 532 -4954 -932 3080 1117 402
366 402 1437 -1434 -2597 713 341 -3004 780 4638 -3155 -8253 -981 3838 -1453 -3727 190 -85
$$ packed form
252d285N974k409m612J143J328k74J545j153k236L697L676l949j900M079M11l359
268b324Q07K086j686R12K679j379j168M346l63o467R38P461k14m701q10J435L54
285A906P82N44k581J350M178l783n837M628O492n916n006N565J719n615k094M275
301F07J525n09j291k924n08M840N12p225l46P641j615q651J988Q607n28m979J18
318b738J337j939r78J298K10K910J972m544l473N650N011n133l294L894J408m128
334b537n94M007K345o48j153k386n07M369L04l575J959L435l414m279L575L555
350D456q48j323M68k098j262L710m80l448K989L620n252n486M022M012j963p15
366D02J035k871j163L310l72l345L784L858p793n098P272M819n291k274L917k75
$$ plain form
382 -85 -4617 -4289 -1585 -294 1244 514 -4112 -4235 1698 616 -4675 -2080 3568 -955 -6315 -2058
398 -2058 3704 1579 -867 1528 1668 -911 -1183 -499 252 3570 3689 -1496 -2905 2555 4451 794
414 794 624 4248 2766 -2397 -1363 2364 3066 3169 2584 -5 -1118 1116 2556 1196 1352 3011 407
431 407 -2577 37 2161 212 -12 976 -1358 -3320 -507 297 -2687 -1745 2620 -157 -6095 -3879
447 -3879 958 -700 -2350 -461 -1138 -3479 -2231 -1602 -2726 -24 2939 -3313 -7475 -1180 3669 -1158
463 -1158 -3397 1571 1605 -3149 -1600 2265 1552 1536 1970 -199 -342 3186 2284 -2338 665 6942 2613
480 2613 -3848 372 5439 2366 524 4282 3374 -651 323 2708 1513 2657 3700 -841 -3410 1435
496 1435 3692 -1530 -2190 2038 303 -3657 -1092 1383 -1932 -2929 197 -216 -3615 -2921 -1345 -3264
$$ packed form
382h5m532L28K704J291J538p30m626j23N933j082n291K595N648m523n360M257
398b058N762k125k446K395J40k579k72O84P51L318J19n185j409N460J896l657
414G94j70L624j482n163J034L727P02J03n85k589j113K234J440j360J56J659k604
431D07k984K614K124j949k24R88k334j962K813Q04k984R42M365k777n938K216
447c879M837j658j650J889o77k341J248O29j124K702K963o252m162O295M849m827
463a158k239M968L4m754J549L865p13j6M34k169j43L528r02m622L003O277m329
480B613o461M220N067l073j842L758r08m025R74K385j195J144J043m541k569M845
496A435K257n222o60M228j735l960K565K475l315r97L126m13l399O94J576j919
$$ plain form
512 -3264 -2463 1305 -881 -5514 -3499 -6 -512 -836 413 -1818 -3764 -97 2564 -422 -1796 969
528 969 84 -3136 -480 3581 956 -2799 -273 3288 2138 587 876 511 1764 4421 2833 -506
544 -506 1571 3364 394 -80 5048 4081 -3166 -3126 3032 4315 1096 -499 -1968 -2246 1551 2812 -1937
561 -1937 -2154 1305 -424 -3388 1214 3428 -3027 -4775 923 1950 -1549 -1027 -934 -3830 -1641 2814
577 2814 6 -4244 -1105 -182 -3682 -480 3895 -2058 -6827 -167 3532 -977 -996 1426 -2965 -3602
593 -3602 3654 4001 -3369 -2548 2578 279 -679 3883 2359 -4033 -583 4668 914 -1326 2828 942
609 942 -4451 894 6376 53 -4521 1180 3372 -35 1837 3862 -1141 -2696 3763 3721 -346 809
625 809 1650 -3690 -1816 6119 3340 -5978 -4009 2703 801 -1184 929 -795 -3964 -686 2197 -699
$$ packed form
512c264Q01L768k186m633K015L493n06l24J249k231j946L667K661k986j374K765
528I69q85l220K656M061k625l755K526L561j150j551K89l65J253K657j588l339
544e06K077J793k970m74N128r67p247M0O158J283l219j595j469k78L797J261m749
561a937k17L459j729k964M602K214o455j748N698J027l499N22R3k896K189M455
577B814k808m250L139R23l500L202M375n953m769O660L699m509j9K422m391o37
593c602P256L47p370Q21N126k299r58M562j524o392L450N251l754k240M154j886
609I42n393N345N482o323m574N701K192l407J872K025n003j555O459m2m067J155
625H09Q41n340J874P935k779r318J969O712j902j985K113j724l169L278K883k896
$$ plain form
641 -699 -1886 404 -1955 -3863 1227 3045 -3489 -6194 354 2139 -1329 -1102 -474 -2893 -2505 1882
657 1882 1707 -1407 -1424 -1020 -1989 655 4122 684 -3563 -1547 2040 1476 1078 2067 -143 -1585 1970
674 1970 4149 1338 -258 1392 1793 1370 2421 1855 -585 -599 1878 1908 1318 1373 -519 -2644 775 4149
692 4149 1564 -2193 -1245 -301 -948 658 2175 -751 -3454 -1628 -288 -242 101 -1196 -4005 -2386 2009
709 2009 -352 -4463 -1850 1322 -1256 -2370 482 -260 -3346 -1649 1340 789 -125 -163 -2361 -2459 2435
726 2435 3377 -1546 -1974 1426 360 -1109 2262 3872 -484 -1447 2004 1912 529 2074 1737 -766 556
743 556 3383 661 -1614 1056 2246 277 876 2275 -899 -2481 1394 2942 190 -953 48 -1118
759 -1118 -1536 1185 1665 -1158 -1972 -850 -957 -586 897 -403 -2337 -1073 370 -1234 -2229 -74 377
$$ packed form
641f99j187K290k359j908N090J818o534k705O548J785l468K27O28k419L88M387
657A882j75l114j7M04r69K644L467l438m247K016L587n64l98R89k210j442L555
674A970K179k811j596J650M01m23J051n66k440j4K477L0n90N5j892k125L419L374
692D149k585l757R48R44o47J606J517k926k703J826J340M6L43j297k809J619M395
709B009k361m111K613L172k578j114K852p42l086J697K989n51r14l8k198r8M894
726B435R42m923m28L400j066j469L371J610m356r63L451r2j383J545l37k503J322
743E56K827k722k275K670J190j969N99J399l174j582L875J548k752j143J001j166
759a118m18K721M80k823q14J122j07L71J483j300j934J264J443j604r95K155M51
$$ plain form
776 377 -1836 -1468 357 -927 -2029 -1052 220 421 -128 -1155 -1989 -172 1339 331 -256 495 139
793 139 -1147 -332 2132 1827 -144 -476 298 828 1015 668 177 1224 1699 236 -270 1230 1993 500
811 500 179 1649 1190 -628 -161 700 1249 543 352 -405 -551 615 655 -280 86 684 -1200 -1739 242
830 242 895 -336 -839 -362 -697 -2029 -681 337 -1018 -1359 -118 -761 -1778 -896 -129 -634 -415 -86
848 -86 -1374 -1423 203 154 -1178 -551 1049 -28 -1890 -407 1375 475 -595 381 643 103 698 456
866 456 598 1291 1132 221 126 1414 1561 465 577 1550 775 -134 626 1650 864 2 558 1005 744 253
886 253 -116 358 667 12 -1171 -563 723 617 -1058 -1186 -156 -295 -1089 -742 -416 -605 -1145 -1219 -1056
905 -1056 -1075 -922 -785 -949 -1171 -639 -1333 -1067 -411 -253 -980 -464 54 -375 -961 -9 609 -45 -434 454
$$ packed form
776C77k213L68J825j284j102R77J272K01n49j027q34J817J511j008n87P51l56
793A39j286Q15K464l05j971l32P74N30J87l47m91J047M75j463n06J500P63j493
811E00l21J470m59j818M67Q61N49p06j91p57j46J166M0r35L66N98j884n39J981
830B42O53j231n03M77l35j332J348J018j355l41J241o43j017Q82P67n05K19L29
848h6j288m9J626m9j332O27J600j077j862J483J782r00j070R76K62n40N95k42
866D56J42O93j59r11r5J288J47j096J12R73p75r09P60J024p86q62N56M47k61m91
886B53l69M74L09o55j183O08J286j06j675j28J030j39p94L47L26j89n40p4J63
905a056j9J53J37j64k22N32o94K66O56J58p27N16N18m29n86R52O18o54l89Q88
$$ plain form
925 454 406 161 295 584 1082 896 724 699 972 1676 1086 348 1097 1701 734 125 1057 1634 648 -184 687
946 687 1080 832 78 -82 397 436 -42 -492 -115 630 47 -1167 -555 448 -671 -1434 -542 116 -925
965 -925 -1412 -615 -522 -738 -860 -634 -1126 -801 -642 -1210 -912 108 -35 -1172 -737 365 -192 -519 110 467
985 467 -410 -340 301 584 277 398 505 282 418 783 159 167 1062 689 -90 559 993 347 -33 1346 875
1006 875 114 63 932 628 515 1059 833 -128 166 360 339 830 904 -813 -1216 253 674 -954 -1207 245
1026 245 413 -1047 -908 -12 -405 -480 -154 -201 -690 -296 -345 -1383 -339 861 -446 -1674 -667 161 -697
1045 -697 -758 416 -22 -1329 -728 296 96 220 -56 -325 -421 397 419 -161 260 1226 288 -212 1143 1278
1065 1278 -132 193 1926 1134 -172 390 891 382 826 1520 422 -851 365 392 475 1109 1424 -758
$$ packed form
925D54m8k45J34K89M98j86j72k5K73P04n90p38P49O04r67o09R32N77r86q32Q71
946F87L93k48p54j60M79L9m78m50L77P45n83j214O12J003j119p63Q92O58j041
965i25m87P97R3k16j22K26m92L25J59n68K98J020j43j137M35J102n57l27O29L57
985D67q77P0O41K83l07J21J07k23J36L65o24QQ95l73p79O49M34o46l80J379m71
1006H75p61n1Q69l04j13N44k26r61K94J94k1M91P4j717m03J469M21j628k53J452
1026B45J68j460J39Q96l93p5L26m7m89L94m9j038J044J200j307j228J007Q28q58
1045f97o1J174m38j307O01J024k00J24k76k69r6Q18K2n80M21R66r38n00J355J35
1065A278j410L25J733p92j306N62N01n09M44O94j098j273J216K7Q3O34L15k182
$$ plain form
1083 -758 -1193 799 992 -236 -218 679 -479 -1027 513 332 -1328 -838 76 -768 -887 -107 -1144 -1976
1101 -1976 -507 663 -1215 -1491 -466 -1104 -1605 451 1055 -1151 -1914 -658 -73 -93 548 86 -1495
1118 -1495 -474 1446 349 -659 1043 625 -476 312 2056 711 -871 701 1299 687 828 1330
1134 1330 -448 -384 2025 2137 -136 301 784 -611 110 2674 1321 -1405 -804 1077 37 -46 1133
1151 1133 -79 -2139 -303 1143 -310 -1106 -252 -1094 -1208 396 914 -2218 -1868 884 90 -1137 -142
1168 -142 35 -2062 -1380 1808 272 -1837 -1076 -304 -859 171 1752 -342 -2127 -216 739 -16 542
1185 542 1035 -727 -1685 1288 2358 -63 -768 715 925 194 1289 1002 -767 -245 1921 1124 142
1202 142 929 288 -1322 532 2855 611 -1751 -186 818 -225 577 1568 -875 -1857 433 1264 -410
$$ packed form
1083g58m35J992J93j228J8Q97j158n48J540j81j660M90R14q44j19P80j037q32
1101a976J469J170j878k76J025o38n01K056O04k206p63J256N85k0O41m62j581
1118a495J021J920j097j008J702m18j101P88J744j345j582J572N98o12J41N02
1134A330j778O4K409J12k273M37M83j395P21K564j353k726O01J881j040q3J179
1151A133j212k060J836J446j453p96Q54q42j14J604N18l132L50K752p94j227R95
1168a42J77k097O82L188j536k109P61P72n55J030J581k094j785J911R55p55N58
1185E42M93j762r58K973J070k421p05J483K10p31J095k87j769N22K166p97r82
1202A42P87o41j610J854K323k244k362J565J004j043Q02R91k443r82K290Q31j674
$$ plain form
1219 -410 -88 243 -1126 -892 1516 514 -1945 -895 364 -722 -924 1318 -449 -2644 -886 1493
1235 1493 -201 -1051 -331 -842 -1288 669 1101 -1292 -1509 155 -143 -900 1153 1140 -1961 -1343 1537 1424
1253 1424 -803 406 415 -743 323 2014 605 -830 699 1307 133 1010 2151 -355 -1571 1364
1269 1364 2252 -81 -568 934 310 -554 1446 1701 -1034 -855 930 378 -178 1267 201 -1978 -635
1286 -635 1708 116 -1789 173 -39 -1678 -307 1049 -688 -2125 -224 470 -997 -699 420 -1392
1302 -1392 -1640 606 354 -1316 -771 209 -799 -590 1114 651 -1805 -524 1225 182 -591 616 447
1319 447 -894 294 1452 642 -297 788 521 -103 1250 1560 -434 -651 1424 1226 -360 347 1249
1336 1249 74 -402 1155 816 -644 141 558 -100 302 700 126 -1215 8 976 -379 -367 279 -277
$$ packed form
1219d10L22L31j369K34K408j002k459J050J259j086k02K242j767k195J758K379
1235A493j694q50P20n11m46J957M32k393k17J664k98p57K053j3l101O18K880j13
1253A424k227J209Rj158J066J691j409j435J529O08j174Q77J141k506j216K935
1269A364Q88k333m87J502o24q64K000K55k735J79J785n52n56J445j066k179J343
1286f35K343j592j905J962k12j639J371J356j737j437J901O94j467K98J119j812
1302a392k48K246k52j670N45R80j008K09J704m63k456J281J749j043p73J207j69
1319D47j341J188J158q10r39J085k67o24J353L10j994k17K075j98j586P07R02
1336A249j175m76J557l39j460P85M17o58M02L98n74j341J223R68j355J2O46n56
$$ plain form
1354 -277 -1311 -97 496 -842 -1310 -215 -364 -866 -275 -135 -1166 -880 263 -286 -982 17 -50 -897
1372 -897 -112 830 -269 -1030 -302 396 -486 -178 360 206 -563 313 874 371 392 809 387 -151 858 918
1392 918 -167 421 1162 343 -354 903 1104 -136 28 1061 446 -284 174 495 37 -109 419 -394 -498
1411 -498 531 299 -455 -245 672 -722 -1260 -244 444 -753 -724 -2 -202 -654 -460 -483 -444 -438 47 -846
1431 -846 -653 171 71 -663 -499 308 -64 -796 194 649 -415 -120 522 -65 -265 346 341 208 -274 358
1451 358 51 -265 380 576 53 168 756 64 -161 868 865 218 140 757 489 -153 67 479 361 351 474
1472 474 228 -52 84 314 -29 -63 149 -206 -532 262 382 -51 -348 337 -93 -607 -494 -360 -258 -290 -564
1493 -564 -580 -465 -282 -479 -571 -224 -52 -604 -1235 -154 208 -378 -508 -168 -3 -345 -246 123 -16 58 222
$$ packed form
1354b77j034J214N93j338m68J095j49n02N91J40j031K86J143n49o96R99o7q47
1372h97P85R42j099p61P28O98q82L08N38j54p69Q76N61n03K1M17m22n38J009O0
1392I18j085N88P41q19o97J257K01j240J64J033o15p30M58L21m58j46N28q13j04
1411d98J029k32p54K10R17j394n38J016O88j197K9P22k00m52J94k3L9OM85q93
1431h46J93Q24j00p34J64Q07l72p32R90M55j064K95O42n87k00O11nj33m82O32
1451C58l07l16O45J96n23J15N88o92k25J029lo47p8O17k68o42K20M12j18j0J23
1472D74k46k80J36K30l43l4K12l55l26P94J20m33k97O85m30n14J13J34J02l2k74
1493e64j6J15J83j97r2L47J72n52o31J081L62n86j30L40J65l42R9L69j39P4J64
$$ plain form
1514 222 -186 -323 332 351 15 395 545 202 113 630 715 96 242 603 408 298 477 805 325 173 428
1535 428 234 33 382 48 145 229 220 -195 -164 293 -22 -330 -142 -173 -408 -475 -416 -245 -398 -687 -620 -535 -315
1558 -315 -391 -585 -508 136 -258 -1112 -596 -82 -255 -729 -472 -179 -233 -225 -49 158 137 64 -436 109 503 518 42
1581 42 245 477 504 62 384 517 293 513 404 442 262 467 447 287 510 411 -243 -40 658 519 -254 47
1603 47 284 -290 66 587 -69 -271 161 211 -375 -307 -88 -174 -597 -228 -170 -695 -65 -132 -806 -675 108 99 -1031
1626 -1031 -855 -26 -311 -104 -106 -20 -579 -234 353 -454 -154 62 -239 -795 275 625 -435 -911 371 433
1646 433 91 349 472 -107 -37 362 770 -189 326 570 10 241 925 312 -591 389 1144 224 -204 949
1666 949 411 -659 427 968 -23 -290 119 -423 -280 405 319 -906 -680 386 388 -470 90 302 -1007
$$ packed form
1514B22m08j37O55J9l36L80J50l43q9N17Q5o19J46L61j95j10J79L28m80j52K55
1535D28j94k01L49l34R7Q4rm15L1M57l15l08J88l1k35o7N9J71j53k89O7Q5K20
1558c15p6j94P7O44l94q54N16N14j73m74K57K93n4QJ76K07k1p3n00N45L94J5m76
1581D2K03K32K7m42L22J33k24K20j09L8j80K05k0j60K23r9o54K03O98j39p73L01
1603D7K37n74L56N21o56k02M32N0n86O8K19q6m23L69N8n25O30o7o74J31P83rj130
1626a031J76Q29k85K07kQ6n59L45N87q07L00K16l01n56J070L50j060m76J282O2
1646D33l42K58J23n79P0L99M08r59N15K44n60K31O84o13r03R80P55r20m28J153
1666I49n38j070J086N41r91k67M09n42J43O85q6j225K26J066Kq58N60K12j309
$$ plain form
1685 -1007 -757 395 -35 -1067 -430 -297 -731 -140 561 -492 -1203 -224 136 -206 -480 206 -958 -1253
1703 -1253 790 610 -746 -655 423 -188 -546 1031 973 -839 -370 986 599 -124 424 441 -546 777
1721 777 1713 121 -780 767 1058 -143 405 1708 221 -1000 637 1380 160 -25 347 -470 -459 1295
1739 1295 740 -1207 -403 730 -429 -700 547 -157 -1847 -513 743 -432 -1206 27 -668 -1270 92
1756 92 728 -1053 -1296 116 82 -769 363 420 -1426 -1087 926 672 -858 -277 566 -793 -200 1125
1774 1125 231 -1078 -140 907 90 103 832 303 -777 629 1593 -173 -141 1159 24 -601 1069 690
1792 690 -379 -589 797 860 60 315 128 -993 -318 1086 157 -553 -44 61 -1037 -290 1130 -280
1810 -280 -1706 -20 609 -457 -658 358 -378 -739 655 458 -1169 -611 170 -339 -545 709 230 -1574
$$ packed form
1685a007K50J152m30j032O37J33m34N91P01j053p11R79L60l42k74O86j164k95
1703a253K043j80j356R1J078o11l58J577n8j812M69J356l87p23N48J7r87J323
1721G77R36j592r01J547K91j201N48J303j487j221J637P43j220j85L72q17J1J754
1739A295n55j947Q04J133j159k71J247p04j690J334J256j175p74J233o95o02J362
1756I2O36j781k43J412l4q51J132N7j846L39K013k54j530N81Q43j359N93J325
1774A125q94j309R38J047q17J3P29n29j080J406R64j766L2J300j135o25J670l79
1792F90j069k10J386O3q00K55j87j121O75J404r29p10N09J05j098P47J420j410
1810b80j426J686O29j066k01J016p36l61J394j97j627N58P81n09k06J254m79j804
$$ plain form
1828 -1574 -679 849 135 -603 28 113 -586 135 1092 222 -1146 79 381 -204 436 847 -352 -712 950
1847 950 892 -17 196 496 -359 -316 900 792 -764 -183 888 179 53 754 467 -500 155 883 278 -19
1867 -19 242 -2 -859 483 1070 -768 -1041 375 529 -517 -256 243 -542 -873 14 116 -137 -404 -121
1886 -121 -707 -68 530 -439 -1037 -178 374 -138 -603 26 -91 -997 -84 624 -220 109 65 -158 -131 504 479
1907 479 -334 -218 722 441 -135 389 294 125 -58 662 55 -49 495 676 -21 333 519 335 -161 281
1927 281 377 56 195 197 -77 -229 298 260 -154 -446 283 75 -462 108 20 -489 -325 -241 -68 -272 -200 -22
1949 -22 -252 2 -45 -246 -691 287 -71 -434 -120 43 -140 -555 -296 431 -70 -264 -412 -94 134 80 66
1970 66 76 200 91 110 68 758 501 52 55 424 398 296 203 242 377 337 -128 47 255 287 229 203 138 267 137
$$ packed form
1828a574Q95J528p14p38O31Q5o99P21R57q70j368J225L02n85O40M11j199l60J662
1847I50n8r09K13L00q55M3J216j08j556N81J071p09j26P01k87r67O55P28o05k97
1867a9K61k44q57J342N87j838k73J416J54j046K61M99p85l31Q87J02k53k67K83
1886a21n86O39N98r69n98Q59N52n12m65O29j17r06R13P08q44L29m4k23K7O35k5
1907D79q13J16R40k81n76N24r5j69j83P20o07j04N44J81o97L54J86j84m96M42
1927B81R6l21J39Kk74j52N27l8m14k92P29k08n37N70q8n09J64Q4J73k04P2J78
1949b2k30K54m7k01m45R78l58l63L14J63j83m15K59P27n01j94j48L18K28n4j4
1970F6J0J24j09J9m2O90k57m49LL69k6j02r3L9J35m0m65J75K08L2n8k6o5J29j30
$$ plain form
1995 137 235 -38 77 -59 59 -177 -68 -44 -82 -94 -258 -226 -165 140 -204 -259 24 -285 -235 -522 -249 -102 -433
2018 -433 -282 83 -33 -52 -216 73 -305 -41 21 -98 -267 239 231 -116 -130 209 258 -91 87 171 398 -168
2040 -168 20 231 412 260 -5 -33 526 507 218 -7 285 356 -110 106 427 261 -50 -157 327 180 -127
2061 -127 -142 -98 109 353 -85 -228 108 56 -117 -243 42 -154 -188 -264 -229 -157 -58 -185 -31 -268 -356 -180 -449
2084 -449 -324 -64 -255 -414 -71 -217 -241 -122 -466 -187 -68 151 -28 -168 -93 58 313 212 -127 51 75
2105 75 102 -119 386 213 352 256 -11 144 527 460 32 -89 256 -85 -44 67 596 486 -179 122 355 181
2127 181 -70 -290 168 239 127 -226 -326 150 151 -130 -511 -141 192 -477 -524 -178 -151 -393 -499 -348 -419 -296
2149 -296 -63 -285 -176 -177 -187 -402 -57 413 -185 -206 -61 149 -232 41 173 27 16 403 320 -13 103 255
$$ packed form
1995A37R8k73J15j36J18k36J09K4l8j2j64L2O1L05l44n5K83l09N0k87K73J47l31
2018d33J51L65j16j9j64K89l78K64O2j19j69N06ql47j4L39M9l49J78Q4K27n66
2040a68J88K11J81j52k65k8N59j9k89k25K92P1m66K16L21j66l11j07M84j47l07
2061a27j5M4K07K44m38j43L36n2j73j26K85j96l4p6L5P2R9j27J54k37q8J76k69
2084d49J25K60j91j59L43j46k4J19l44K79J19K19j79j40P5J51K55j01l39J78K4
2105G5K7k21N05j73J39r6k67J55L83o7m28j21L45l41M1J11N29j10o65L01K33j74
2127A81k51k20M58P1j12l53j00M76Jk81l81L70L33o69m7L46K7k42j06J51p1J23
2149b96K33k22J09jj0k15L45M70n98k1J45K10l81K73J32j46j1L87q3l33J16J52
$$ plain form
2171 255 261 182 216 305 91 199 385 392 244 434 122 36 274 355 291 -337 458 265 -190 98 428 187 -226
2194 -226 204 56 -249 18 -64 -257 -349 166 -16 -951 -212 160 -9 -482 -113 -72 -437 -125 -99 6 -427
2215 -427 -68 -385 -600 206 547 -322 -632 212 119 -194 0 308 -457 -208 438 160 -80 -31 379 37 132
2236 132 664 324 -246 324 694 146 -78 461 -79 -430 463 808 135 -384 141 17 -60 363 539 -174
2256 -174 -462 373 235 37 97 261 -747 -284 375 -244 -771 78 128 -622 -18 513 -198 -722 -312 53
2276 53 182 -347 252 -533 -325 532 263 -502 -436 558 -70 -580 421 286 -351 -331 613 325 -164 -91 -84 -395
2298 -395 314 501 -146 -152 343 80 -286 713 910 -208 -394 385 278 152 213 94 -239 151 590 623 -470
2319 -470 -172 318 -61 -36 541 -214 -506 -205 370 -496 -313 329 -408 -725 210 715 -281 -835 -1 43 -451
$$ packed form
2171B55Op9L4Q9k14J08J86Pj48J90l12q6K38Q1o4o28P95j93m55K88L30k41m13
2194b26M30j48l05K67q2j93r2N15j82r35P39L72j69m73L69M1l65L12K6J05m33
2215d27L59l17k15Q06L41q69l10Q44r3l13J94L08p65K49O46k78k40M9M10l42R5
2236A32N32l40n70N70L70n48k24N39n40l51Q93L45o73n19N25j24p7M23J76p13
2256a74k88Q35j38j98O0J64j008M63O59o19n27Q49N0p50O04N31p11n24M10L65
2276E3J29n29N99p85K08Q57k69p65O6R94o28n10J001j35o37K0R44k88m89P3Pl11
2298c95P09J87o47oM95k63l66R99J97j118j86P79j07j26O1j19l33L90M39L3j093
2319d70K98M90l79K5N77p55k92L01N75q66J83O42p37l17R35N05r96n54Q34M4m94
$$ plain form
2340 -451 -59 -315 -590 -599 -121 -146 -271 -14 8 -696 -222 490 -168 -912 -319 340 82 -73 -35 -149 -381 158
2362 158 283 -159 72 621 237 -184 738 791 -316 -368 417 495 148 273 152 -338 398 620 165 164 245 -33
2384 -33 -218 246 603 16 -566 114 394 -147 245 268 -601 -748 231 473 -315 -381 -221 -324 -411 214 -273
2405 -273 -944 -575 -19 -36 -422 -21 -221 -580 119 398 -354 -506 -281 -71 -252 214 310 -199 -344 178 412
2426 412 -39 423 17 -121 240 642 415 -161 117 574 -310 254 162 146 51 192 219 34 297 153 -39
2447 -39 18 535 262 -273 -339 295 279 -627 -104 4 -453 -145 -24 42 -198 139 -140 -467 -23 211 -430 -211
2469 -211 477 -168 -545 -140 -82 -170 -230 62 8 -129 -95 -85 -282 105 464 30 -184 -76 -31 -168 119 334
2491 334 3 -109 297 392 -163 -41 251 277 152 439 499 -30 -19 86 16 128 138 92 38 250 123 39 -269
$$ packed form
2340d51L92k56k75rM78k5j25K57K2p04M74P12o58p44N93O59k58j55L8j14k32N39
2362A58J25m42K31N49l84m21R22N3j107n2P85P8l47J25j21m90P36K22m55jQ1k78
2384c3j85M64L57n87n82O80K80n41L92K3q69j47R79K42p88o6J60j03q7O25m87
2405b73o71L69N56j7l86M01k00l59O99K79p52j52K25K10j81M66R6n09j45N22K34
2426D12m51M62m06j38L61M02k27n76K78M57q84N64r2j6r5J41K7j85K63j44j92
2447c9N7N17k73n35o6O34j6r06N23J08m57L08J21O6k40L37k79l27M44K34o41K19
2469b11O88o45l77M05N8q8o0K92n4j37L4J0j97L87L59m34k14J08M5j37K87K15
2491C34l31j12M06R5n55J22K92K6j25K87O0n29J1J05p0J12J0m6n4K12j27q4l08
$$ plain form
2514 -269 200 199 -74 73 386 -29 -157 -161 33 -33 -104 -17 64 147 190 -194 -110 18 162 -443 -504 -15 -72 -143 -424
2539 -424 -157 -67 -209 -113 -472 -50 -90 -111 -162 -338 107 -98 -15 -8 -64 -26 -234 197 51 242 90 273 126
2562 126 -82 173 418 -30 481 420 77 136 185 254 52 299 170 -23 269 207 -1 -111 39 93 122 -134
2584 -134 -84 -77 61 42 -186 -38 47 -212 -187 -211 -94 -101 -428 -370 298 -141 -540 -103 57 -374 -313 -304 -98 -53 66
2609 66 72 -408 -201 176 -174 -272 341 335 -364 -251 410 -26 230 73 84 67 34 102 390 62 517 199 -8
2632 -8 220 374 -61 68 43 317 239 116 389 149 -36 141 247 -368 -371 27 92 -266 -27 189 -113 -91 -159
2655 -159 -106 -93 179 61 -158 -246 37 67 -346 -119 -351 -189 -131 42 -62 -200 -188 -155 -113 -39 14 159 -167
2678 -167 152 162 -453 134 219 -21 -288 119 443 -81 42 51 39 444 171 146 -151 197 41 416 104 10
$$ packed form
2514b69M69jk73J47L13m15j28mJ94o6p1Q7Q1Q3M3l84Q4J28J44o05o1M89n7p1k81
2539d24K67R0j42R6l59M22m0k1n1j76M45k05Q3Pn6L8k08M31j46J91j52J83j47
2562A26k08K55K45m48N11o1l43N9M9O9k02K47j29j93K92o2k08j10J50N4K9k56
2584a34N0PJ38j9k28J48Q5k59K5k4J17pl27N8O68m39l99M37J60m31O1RK06M5J19
2609F6Om80K07L77l50r8O13oo99J13O61m36K56j57J1j7l3O8K88l28M55l18k07
2632hK28J54m35J29k5K74p8j23K73k40j85J77J06o15lL98O5l58K39K16l02K2o8
2655a59N3J3K72j18k19q8K83L0m13K27k32J62N8J73j04j38J2L3M2P4N3J45l26
2678a67L19J0o15N87Q5k40k67M07L24n24J23Rj2M05k73k5k97L48j56L75l12r4
$$ plain form
2700 10 166 -247 337 237 265 -1 211 199 150 1 144 125 -95 116 22 0 -31 -169 -148 -53 -136 -248 -210 -49
2724 -49 -226 -48 -286 -115 -42 -126 -344 -47 -287 -62 -111 -99 -209 -48 -27 -205 -51 -91 -178 -122 164 -21 -117
2747 -117 -107 25 16 -240 252 51 -206 -201 178 -120 -53 205 52 48 -22 350 234 207 70 341 -118 163 367
2770 367 425 -160 72 10 43 35 36 -204 -407 208 51 -200 -44 569 -211 263 33 2 -369 -282 349 124 -152
2793 -152 -160 -168 -468 -15 -144 -542 -365 -135 -70 -337 106 86 -527 -132 122 36 -179 111 -29 -215 -149 298 -22
2816 -22 -137 313 136 117 -180 189 35 -208 493 295 68 -229 55 80 -198 223 394 -119 -71 -41 -26 205
2838 205 310 73 -244 -107 511 -71 84 367 5 -197 -45 231 14 -209 -195 79 -234 -124 -121 -539 -165
2859 -165 -7 -359 -525 13 26 -218 -121 323 -120 -727 -327 278 -225 -321 237 -315 -250 241 639 -123 -145 39
$$ packed form
2700A0J56m13N84j00K8k66K12j2m9j49J43j9k20K11r4k2l1j38K1R5q3j12L8J61
2724d9j77J78k38J71P3q4k18K97k40K25m9J2j10J61K1j78J54m0q7N6K86j85r6
2747a17J0J32rk56M92k01k57NL79k98O7K58j53mp0L72j16k7j37K71m59K81K04
2770C67N8n85K32o2L3qJk40k03O15j57k51J56O13p80M74k30l1l71Q7O31k25k76
2793a52qql00M53j29l98J77K30O5k67M43k0o13L95K54q6k15K90j40j86O6M47l20
2816b2j15M50j77j9k97L69j54k43P01j98k27k97K84K5k78M21J71n13M8L0J5K31
2838B05J05k37l17J37O18n82J55K83l62k02J52K76k17k23J4K74l13J10Lm18L74
2859a65J58l52j66N38J3k44R7M44m43o07M00O05n03r6N58n52O5M91L98p62k2J84
$$ plain form
2881 39 110 -53 434 398 -74 -202 434 314 133 -8 14 98 -31 327 265 -115 40 256 231 103 508 195
2903 195 -206 153 216 175 -108 98 37 -601 145 536 -5 -208 64 45 -145 -28 -34 -381 -378 83 -88 -171 168
2926 168 -5 -411 -56 68 12 -328 -113 68 -247 -171 -63 -136 -203 224 229 -134 -162 94 -292 -101 565 329
2948 329 -338 65 358 19 54 -55 -159 -277 250 590 404 100 417 169 -43 332 350 33 -568 305 221
2969 221 -142 200 92 -410 -495 408 274 -85 70 181 -326 79 345 171 -284 -110 223 -175 -156 -34 -263
2990 -263 -517 202 301 -320 -290 -30 -156 -416 186 158 -544 -540 34 -213 213 36 -255 -478 -32 480 3 -108
3012 -108 -138 410 24 122 334 128 -36 142 268 30 267 245 -52 117 402 235 -70 29 272 -70 -88 77
3034 77 -85 -50 -105 59 -171 -63 91 -76 -130 49 70 -148 -323 44 -39 -164 -1 140 -252 -209 -2 -187
$$ packed form
2881C9P1j63M87l6m72j28O36j20j81j41K2Q4j29L58o2l80J55K16k5j28M05l13
2903A95m01L59O3m1k83K06o1o38P46L91n41k03K72j9j90J17ol47LM61j71q3L39
2926A68j73m06L55J24n6l40K15J81l15P6J08p3o7M27Nl63k8K56l86J91O66k36
2948C29o67M03K93l39L5j09j04j18N27L40j86l04L17k48k12L75J8l17o01Q73q4
2969B21l63L42j08n02q5R03j34l59J55J11n07M05K66j74m55J74L33l98J9J22k29
2990b63k54P19R9o21L0K60j26k60O02k8p02MN74k47M26j77k91k23M46N12m77j11
3012a08l0N48l86R8K12k06j64J78J26k38K37k2k97J69K85j67l05R9K43l42j8J65
3034G7j62L5n5J64k30J08J54j67n4J79K1k18j75L67q3j25J63J41l92M3K07j85
$$ plain form
3056 -187 -271 -297 -365 -14 -92 118 340 -338 -19 -126 -52 63 124 -49 -263 -103 155 -80 7 52 153 32 -28
3079 -28 182 -83 -41 123 241 212 18 48 244 398 225 261 40 -15 435 24 90 89 142 78 108 89 99 -146 80
3104 80 -105 -33 131 22 -145 -214 159 -23 -160 -64 -34 -101 -157 52 -157 -280 -84 -147 -216 192 -21 -186 -64
3127 -64 74 73 -67 9 -16 -223 -414 -166 244 -305 -78 -51 -99 -66 105 198 -130 -81 94 103 118 247 17 32 98
3152 98 28 -4 -33 255 75 161 -7 247 115 -152 238 307 -14 -68 84 51 144 -70 -91 62 344 -85 -161 266
3176 266 84 -233 -46 148 132 38 -243 -344 26 -172 -344 -124 -136 -239 15 236 -91 223 -228 -221 -269 -160
3198 -160 76 -96 -89 129 -45 -7 30 -33 253 -273 -81 -264 59 -51 329 141 75 62 227 -1 230 225 146
3221 146 -21 66 194 86 49 275 -26 219 32 -121 38 -292 220 131 294 -13 104 235 204 -172 39
$$ packed form
3056a87q4k6o8L51p8K10K22o78L19j07P4J15O1j73k14J60K58k35Q7M5J01j21o0
3079b8K10k65M2J64J18k9j94L0J96J54j73L6k21n5M50m11O6jN3o4L0j9J0k45K26
3104H0j85P2J64j09j67o9L73j82j37R6L0o7n6K09k09j23J96o3o9M08k13j65J22
3127f4J38jj40P6k5k07j91K48M10n49K27K7m8L3J71R3l28M9J75RJ5J29k30J5O6
3152I8p0l2k9K88j80Q6j68K54j32k67L90O9l21n4J52l3R3k14k1J53K82m29p6M27
3176B66j82l17J87J94j6r4k81j01L70j98j72K20j2j03K54K21l27L14m51Pm8J09
3198a60K36j72PK18j74L8L7o3K86n26J92j83L23j10L80j88o6j3J65k28K31np9
3221A46j67Q7J28j08l7K26l01K45j87j53J59l30N12q9J63l07J17J31l1l76K11
$$ plain form
3242 39 -119 -121 -39 -247 -226 -114 36 -235 -277 -69 110 -156 -189 -230 -249 -25 -209 -141 -25 228 -238 234 -72
3265 -72 -249 -113 253 -76 -97 -72 -73 155 -194 261 170 220 322 52 4 -243 134 162 35 259 68 79 192
3288 192 236 148 -15 -281 -155 -28 372 -100 -170 -113 221 -336 33 354 141 -97 -209 -74 92 -4 64 -76
3310 -76 -291 -175 -235 15 -115 -27 -72 9 -138 -94 -228 -233 17 -141 -304 -53 123 -122 -37 72 13 -143 273
3333 273 63 -263 -48 385 97 -360 64 223 -141 -104 229 82 -125 114 251 -224 -165 282 -161 -59 376
3354 376 -32 -273 -22 266 84 12 329 294 -136 35 27 133 -172 -155 259 62 -192 96 -522 -193 85 26
3376 26 47 -259 -87 -90 -146 327 -67 -293 -348 274 -155 -165 -18 -44 -164 -97 -135 154 89 -252 -5 -123 155 80
3400 80 95 -270 93 274 2 51 358 -31 -106 88 221 -264 68 380 54 106 115 -64 47 259 167 -101 22
$$ packed form
3242C9j58kQ2k08K1J12J50k71m2K08J79k66l3m1j9K24j84O8J16K53m66M72l06
3265g2j77J36L66l29k1K5jK28l49M55r1N0J02k70m8k47L77K8j27K24j91J1J13
3288A92M4q8j63k66J26J27M00m72p0N7L34n57L69L21k13k38j12J35J66r6O8j40
3310g6k15J16o0K50j30Q8m5Q1j47M4j34nK50j58j63K51J76k45Q5J09n9j56M16
3333B73k10l26K15M33k88m57M24J59l64L7L33j47k07K39J37m75N9M47m43J02M35
3354C76m08k41K51K88j82p2L17l5m30J71qJ06l05J7M14j97k54K88o18L29K78n9
3376B6K1l06J72ln6M73l94k26n5O22m29j0J47k6j20O7l8K89o5l41K47j18K78p5
3400H0J5l65L63J81k72M9L07l89p5J94J33m85L32L12l26N2Rj79J11K12r2k68J23
$$ plain form
3423 22 243 133 -257 129 466 -83 -579 8 -50 -163 -16 190 -117 -160 74 -232 -104 -8 31 -504 -75 184
3445 184 23 -532 -8 -176 -318 22 46 43 -175 112 148 -47 -52 -235 -194 -241 65 301 -204 -152 215 224 -27 -16
3469 -16 127 -2 140 368 79 -263 186 215 -312 77 187 -117 0 271 206 15 205 208 -261 -420 127 95
3491 95 -173 -9 206 -37 -146 142 -306 -90 -211 242 -81 -164 232 -59 -173 -358 163 55 -446 45 -126
3512 -126 32 202 152 63 -109 143 124 3 -86 347 -313 -120 339 252 -336 52 -6 46 204 546 -102 -447
3534 -447 -80 158 217 63 121 73 -248 -30 445 73 256 269 72 70 -184 296 1 -170 281 211 -141 158
3556 158 319 43 243 211 -35 301 74 175 -100 14 374 31 -542 113 126 -183 -164 232 157 -153 154
3577 154 160 -585 45 -38 -269 -39 237 -21 -305 -78 151 80 -343 32 -7 -308 25 201 22 -152 114 -166
$$ packed form
3423B2K21j10l90L86L37n49m96N87n8j13J47K06l07m3K34l06J28R6L9n35M29K59
3445A84j61n55N24j68j42L40K4lk18K87L6j95nj83M1m7L06K36n05N2L67Rk51J1
3469a6J43j29J42K28k89l42M49K9n27L89J10l04J17K71o5j91J90Lm69j59N47l2
3491I5k68J64K15k43j09K88m48K16j21M53l23q3L96k91j14j85N21j08n01M91j71
3512a26J58J70n0q9j72K52j9j21q9M33o60J93M59q7n88L88n8N2J58L42o48l45
3534d47L67K38N9j54N8m8l21K18M75l72J83J3j97kk54M80k95j71M51p0l52K99
3556A58J61k76K00l2k46L36k27J01k75J14L60l43n73O55J3l09J9L96p5l10L07
3577A54Op45O30q3k31K30K76k58k84K27K29p1m23L75l9l01L33J76j79j74K66k80
$$ plain form
3599 -166 53 97 179 150 -165 67 46 -254 189 152 164 42 533 5 -206 120 23 109 -61 -131 380 131 65
3622 65 120 -22 -72 -9 -77 -181 373 37 -158 -176 25 -193 -125 -123 -97 -291 -135 89 -234 -309 -3 159 -74 -326
3646 -326 -198 -102 -278 232 -131 -130 -142 -8 83 -155 -124 -189 -28 -82 -29 81 -211 238 461 23 -37 45 421 -16
3670 -16 165 -4 113 139 23 252 -53 154 75 -159 -49 21 96 -73 108 18 -218 95 4 -72 -133 94 17
3693 17 -113 50 128 26 -46 -44 -145 -400 -348 -155 -213 -391 -290 78 2 13 -243 221 -116 249 -180 -224 -77
3716 -77 -10 -55 -182 -165 135 77 -88 -146 45 15 131 135 -66 37 -18 36 161 -16 84 -172 -27 -205 95 -46
3740 -46 215 90 -4 168 64 225 -99 -41 35 -127 178 -78 -5 -36 170 -85 -96 28 136 117 -140 68 127
3763 127 76 -3 -61 -58 -10 -195 -43 58 125 -226 87 28 -87 -246 25 68 -88 4 107 -43 42 10 116 -130
$$ packed form
3599a66K19M4Q2k9l15K32k1l00M43l7J2j22M91n28k11L26r7Q6j70p0N11k49o6
3622F5N5j42n0O3o8j04N54l36j95j8K01k18O8KK6j94J56K24l23p5L06J62k33k52
3646c26J28R6j76N10l63Jj2J34R1k38L1o5J61n4N3J10k92M49K23m38o0Q2L76m37
3670a6J81j69J17K6j16K29l05K07p9k34J10P0P5j69J81r0k36L13r1p6o1K27p7
3693A7j30J63P8j02p2Kj01k55N2J93n8j78J01L68p6J1k56M64l37L65m29m4J47
3716g7O7m5j27J7L00n8j65n8J91l0J16Mk01J03n5N4J25j77J00k56J45j78L00j41
3740d6K61j25r4J72j04J61l24N8P6j62L05k56P3l1K06k55j1J24J08j9k57K08N9
3763A27n1p9n8LM8j85J52J01O7l51L13n9j15j59K71M3j56R2J03j50Q5l2J06k46
$$ plain form
3787 -130 367 136 -217 110 30 -109 -164 221 38 190 -35 71 289 -131 57 60 -21 -66 37 -56 46 153
3809 153 24 -36 340 81 79 -51 -15 139 -190 173 151 131 -22 44 110 6 -43 239 -179 -115 37 39 -129 -244
3833 -244 21 -327 -26 -8 191 -285 -115 -177 -112 -54 -17 -107 -248 -120 -205 -56 68 -102 76 -286 -28 142
3855 142 107 -76 -94 138 -124 63 385 353 150 -103 303 104 280 219 119 -65 106 -84 -56 -145 266 169
3877 169 178 -130 51 -58 -285 -24 -74 -32 100 262 -238 -37 -493 -36 -50 57 -46 -198 -130 -58 -110 19 -390
3900 -390 -47 3 -357 153 123 -81 160 71 -319 -93 -422 221 -135 -60 193 -225 -316 -244 108 -66 64 197
3922 197 35 99 165 44 -90 -260 182 195 39 12 -33 -97 -42 359 159 -133 116 -74 23 102 225 -2 232
3945 232 111 248 -181 26 26 -132 -173 166 -135 60 158 -137 -60 -26 224 -162 -184 -20 82 -152 -371 -67
$$ packed form
3787a30M97k31l53L27q0j39n5L85j83J52k25J06K18m20J88Lq1m5J03r3J02J07
3809A53j29o0L76k59kj30L6J54l29L63k2k0j53O6O6j04m9K82m18O4J52Kj68j15
3833b44K65l48L01J8J99m76J70o2O5N8L7r0j41J28q5J49J24j70J78l62K58J70
3855A42l5j83j8K32k62J87L22l2k03k53M06j99J76o1j00j84J71j90K8q9M11r7
3877A69Rl08J81j09k27K61n0M2J32J62n00K01m56M57j4J07j03j52O8P2n2J29m09
3900c90L43N0l60N10l0k04K41q9l90K26l29O43l56P5K53m18r1P2L52j74J30J33
3922A97j62O4O6j21j34j70M42J3j56k7m5o4N5M01k00k92K49j90R7P9J23k27K34
3945B32j21J37m29K07%j58m1L39l01J95R8k95P7L4K50l86k2J64J02k34k19L04
$$ plain form
3967 -67 18 -330 -251 -172 109 -26 -20 -1 -390 134 78 -334 -169 -68 116 152 78 106 -189 -147 51 78 -225 -194 396
3992 396 -87 -103 347 -75 2 89 106 108 -54 290 90 -208 359 236 -200 -185 145 52 -198 -59 58 -266 -324
4015 -324 -54 23 37 -40 -102 -216 -178 245 -222 -225 158 189 -148 7 167 -107 -430 -62 183 -249 3 35 -412
4038 -412 -49 -81 201 -374 -77 24 -203 -136 86 -85 -377 -201 129 -142 60 54 179 -133 33 301 151
4059 151 -57 -118 -87 2 360 350 60 -140 333 380 121 74 225 -156 -11 288 -53 115 62 135 -168 211 128
4082 128 79 -38 58 237 -176 -61 89 -115 -47 402 80 -112 -237 -57 128 -60 151 -150 -236 -116 112
4103 112 -252 -156 -85 -170 -194 58 171 -98 -198 84 342 -49 196 66 86 111 -78 17 21 61 -20 -66 77 465
4127 465 156 14 -37 161 279 28 -2 155 -158 213 347 113 55 180 82 184 -16 -121 -48 -223 51 -27
$$ packed form
3967f7Q5l48P9P9K81j35OJ9l89N24n6m12J65J01J84L6p4K8k95M2J98K7l03L1N90
3992C96m83j6M50m22P7Q7J7Kj62L44k00k98N67j23m36J5L30r3k50J39J17l24n8
4015c24K70P7J4p7o2j14L8M23m67lL83L1l37J55J60k74l23L68K45m32K52L2m47
4038d12L63l2K82n75K97J01k27O7K22j71k92J76L30k71K02oJ25l12J66K68j50
4059A51k08o1L1Q9L58j0k90k00M73M7k59m7J51l81J45K99l41J68n3P3l03L79q3
4082A28m9j17R6J79m13J15J50k04O8M49l22j92j25J80J85j88K11l01q6J20K28
4103A12l64R6P1q5k4K52J13k69j00K82K58l91K45j30K0K5j89R5MM0q1m6J43L88
4127D65l09j42n1J98J18k51l0J57l13L71J34k34n8J25r8J02k00j05P3j75K74p8
$$ plain form
4149 -27 -202 -116 -45 -102 108 -28 -65 -116 -68 187 0 -74 -15 44 -114 -89 119 -48 -90 -151 -163 -226 -113 -28 -121 86
4175 86 225 -247 -235 -106 131 -242 73 266 -82 -97 215 -336 -73 114 179 -75 -54 88 157 140 -78 160
4197 160 350 68 128 204 108 -290 44 4 257 150 126 -142 -343 167 222 -48 -1 -201 -179 -60 -88 28 -201
4220 -201 -253 -148 -111 215 -71 -3 -90 -191 -308 19 -106 -106 -223 -244 -173 -177 68 -173 183 -335 -203 17 46 -80
4244 -80 97 34 114 -151 91 68 46 -255 127 -52 -152 99 92 113 -86 -22 196 46 22 303 205 -126 -49 260
4268 260 173 -93 73 9 -54 366 -28 -268 16 144 220 89 -353 -88 -104 63 73 19 -32 212 14 -273 26
4291 26 -243 -422 -197 105 -205 -90 -79 -261 -147 -33 -194 329 31 -46 96 33 21 291 -403 121 70 -141
4313 -141 -47 -159 -111 -14 265 100 -215 -354 29 283 -182 234 -123 61 -102 -22 359 -110 108 38 33 67 244
$$ packed form
4149b7j75Q6P1n7K10j36l7n1M8K55j87p4N9N9j58K5K08j67m2o1j2o3J13Q5r3K07
4175H6J39m72J2J29K37l73L15J93l48j5L12n51K63J87O5k54K1J42O9j7k18K38
4197A60J90k82O0P6r6l98L34m0K53j07k4k68k01N10N5k70M7k00K2J19k8J16k29
4220b01n2J05L7L26k86O8q7j01j17L27j25%j17k1P1mK45k41L56n18J32K20K9j26
4244h0J77o3Q0k65K42k3k2l01L82j79j00K51pK1j99O4K18j50k4K81r8l31P7L09
4268B60q7k66J66o4o3M20l94k40K84J28P6j31m42K65j6J67J0n4n1K44j98k87K99
4291B6k69j79K25L02l10J15J1j82J14J14j61N23k98p7J42o3j2K70o94N24n1k11
4313a41R4j12M8R7K79j65l15j39L83K54m65M16l57J84j63Q0L81m69K18p0nL4J77
$$ plain form
4336 244 25 20 24 21 165 -130 -20 -201 49 -207 -36 -32 260 -288 -243 -114 13 -63 -318 12 -106 133 115 -78
4360 -78 -52 4 69 -42 98 121 170 50 74 -89 28 -101 290 4 70 -62 47 70 -184 -36 -34 -228 107 -73
4384 -73 90 -20 -78 -98 108 29 193 408 295 111 88 12 -198 -137 41 157 252 133 -92 -157 -54 39 -23 77
4408 77 121 52 -148 -174 110 -317 -164 -163 -149 -153 32 34 32 -97 -255 -34 -271 -173 -61 233 -91 12 -175 -100 189
4433 189 -128 -231 -88 -69 69 -202 162 98 -17 -416 -177 8 111 -69 103 19 282 0 -234 59 192
4454 192 264 53 34 158 117 152 78 -283 169 -127 -26 104 -71 317 -63 75 -49 106 45 -72 -25 38 -41
4477 -41 -192 106 -46 -298 -12 -94 -185 -127 373 -70 -59 54 -58 16 -109 -99 -8 197 18 -17 -117 -124 21 -200
4501 -200 80 94 372 97 -337 109 65 -29 295 113 -20 -8 27 45 24 142 -4 170 61 356 -236 -143 -75
$$ packed form
4336B44k19nMlJ44k95J10j81K50k56J71MK92n48M5J29J27p6k55L30j18K39j8j93
4360g8K6N6O5j11J40K3M9j20K4j63J17j29L91k86O6j32J09K3k54J48Kj94L35j80
4384g3J63j10n8k0K06p9J64K15j13j84k3p6k10O1J78J16R5j19k25o5J03R3o2J00
4408G7M4o9k00k6K84m27J53JJ4mJ85Kkj29j58K21k37R8J12K94l24J03j87P5K89
4433A89l17j03J43J9J38k71L64o4j15l99K39J85J03j80J72q4K63k82k34K93J33
4454A92P2k11j9J24m1L5p4l61M52k96J01J30j75L88l80J38j24J55o1j17M7O3p9
4477d1j51K98j52k52K86q2r1N8N00m43J1J13j12P4j25J0R1K05j79l5j00pJ45k21
4501b00K80J4K78k75m34M46m4r4L24j82j33J2L5J8k1J18j46J74j09K95n92R3O8
$$ plain form
4524 -75 136 53 104 118 -246 -112 -15 5 89 266 -168 66 -113 63 -49 -4 91 138 14 -98 188 -40 -130 -83
4548 -83 270 12 -12 99 -69 -208 -180 201 -245 104 -70 -156 13 -106 48 -328 -48 61 -185 54 -39 -1
4570 -1 158 -1 332 37 -354 183 -34 37 -4 -110 41 -254 186 58 -367 -1 330 -208 38 266 34
4591 34 -224 -12 324 64 -5 195 -189 -144 63 213 213 -34 212 170 44 82 -5 57 -226 -207 54 140 -193 94
4615 94 -237 -335 169 60 -243 -143 110 -262 -3 -4 -133 -268 -109 -54 -113 -228 141 51 -369 53 7 -52 -213
4638 -213 77 -41 -97 -20 95 81 146 182 238 -9 44 194 211 33 582 251 -270 -28 82 -20 107 280 59
4661 59 -23 259 83 -70 100 -201 -263 -303 215 198 -115 -181 -11 241 48 193 -63 -13 -7 185 -268 -229 89
4684 89 -216 -12 -122 -240 -170 -305 102 80 -79 146 22 45 -14 44 136 -129 72 62 -293 -197 193 -61 -33
$$ packed form
4524g5K11q3N1J4l64J34R7K0Q4J77m34K34j79J76j12M5R5M7j24j12K86k28r0M7
4548h3L53k58k4J11j68j39K8L81m46L49j74q6J69j19J54l76K80J09k46K39r3L8
4570aJ59j59L33k95l91N37k17P1m1j06J51k95M40j28m25L66L31n38K46K28k32
4591C4k58K12L36k60o9K00l84M5K07J50%k47K46m2j26L8q7O2k83J9K61Q6l33K87
4615I4l31r8N04j09l03J00K53l72K59jj29j35J59N5n9j15L69r0m20M22m6n9j61
4638b13K90j18n6P7J15j4O5L6N6k47N3J50J7j78N49l31n21K42J10j02J27J73k21
4661E9q2K82j76j53J70l01o2m0N18j7l13o6J70K52j93J45k56N0OJ92m53L9L18
4684H9l05K04j10j18P0j35M07k2j59K25j24K3n9N8R2k65K01j0l55R6L90k54K8
$$ plain form
4707 -33 35 -178 -72 -103 237 79 -295 234 181 96 -151 171 4 188 193 -99 30 68 -84 -82 102 241 7
4730 7 -276 -83 11 66 56 22 1 -30 -63 17 -235 -196 -134 89 -64 -25 82 -204 -246 -39 38 -125 -176 224 48
4755 48 -246 60 124 -2 -192 -240 101 -228 24 -340 -146 -19 -36 72 59 62 -373 29 -253 -81 94 -209
4777 -209 183 49 -51 61 149 228 115 12 163 -104 1 -255 234 207 -128 -101 197 -153 60 -268 -10
4798 -10 82 41 31 -59 97 -161 8 28 -104 -183 101 -287 -7 23 -21 -213 65 -238 123 -71 -78 127 126 4
4822 4 -199 171 44 -21 -39 -54 133 -7 111 -32 24 5 -385 -91 87 -85 -102 123 56 105 187 27 47 30
4846 30 -28 96 -26 100 258 66 216 34 153 -31 -133 14 290 -83 136 27 -11 -116 -23 -75 13 -29
4868 -29 -35 2 19 73 -245 -77 40 75 -133 -171 -8 159 -179 -81 57 -372 -140 -102 -136 -164 44 18 16 12 -71 -199
$$ packed form
4707c3O8k13J06l1L40j58l74N29n3q5k47L22j67J84Nk92J29L8j52KJ84J39k34
4730Gk83J93R4N5j0l4k1l1l3Q0k52L9O2K23j53L9J07k86m2K07P7j63n1M00j76
4755D8k94L06O4j26j90m8L41l29K52l64J94J27j7J08j3Lm35M02k82J72J75l03
4777b09L92j34j00J12Q8P9j13j03J51k67J05k56M89k7l35K7K98l50K13l28K58
4798a0R2m1j0r0J56k58J69K0j32p9K84l88K80L0m4j92K78l03L61j94pK05jj22
4822Dk03L70j27o5j8j5J87j40J18j43N6j9l90K94J78j72j7K25o7M9Q2j60K0j7
4846C0n8J24j22J26J58j92J50j82J19j84j02J47K76l73K19j09l8j05R3n2Q8m2
4868b9oL7J7N4l18J68J17L5k08l8J63J67l38R8J38m29K32L8l4k8K08k6kmq3j28
$$ plain form
4894 -199 -214 117 18 -53 48 -168 -80 140 -40 265 106 -26 13 216 35 232 121 -174 175 -140 222 -144
4916 -144 292 -89 -171 9 262 165 -130 -164 201 230 -50 -238 -31 116 -36 -46 4 176 16 110 -40 -57 -162
4939 -162 5 -30 26 -91 -422 -273 20 -117 -133 -53 -155 -397 -91 -342 44 133 -75 89 24 -213 127 -278
4961 -278 76 -129 -15 15 88 22 19 -88 35 400 -260 166 -75 20 91 161 -163 421 84 -93 247 227 78
4984 78 12 101 129 -15 146 69 -95 -81 220 111 4 -57 134 75 -180 228 3 -5 74 210 -1 63 70 15 -107
5009 -107 73 -116 -27 29 6 -171 -34 88 -89 -52 -217 -279 187 28 92 -222 -155 18 -77 121 103 41 152
5032 152 143 57 189 54 -41 359 108 71 -31 124 -169 -38 -59 104 67 -204 -154 -14 -72 -30 -99 22 -114 204
5056 204 282 46 -106 250 108 -104 45 -64 301 15 25 -213 -278 -60 7 250 75 109 -56 23 94 -12
$$ packed form
4894a99j5L31r9p1J01k16Q8K20j80L05j59j32L9K03j81J97j11k95L49l15L62l66
4916a44M36l81q2J80K53r7k95l4L65K9k80j88K07J47j52j0N0J72j60R4j50j7j05
4939a62J67l5N6j17l31J49K93j37j6Q0j02k42L06k51L86Q9k08J64o5k37L40m05
4961b78L54k05J14L0P3o6lj07J23L65o60M26k41R5P1P0l24N84l37j77L40k0j49
4984G8o6Q9K8j44J61p7j64J4L01j09j07o1J91n9k55M08k25qP9J36k11O4Pn5j22
5009a07J80j89Q9N6k3j77J37J22j77L7j65o2M66j59O4l14O7J73r5J98j8o2J11
5032A52rq6J32j35r5M00k51l7j02J55k93J31k1J63l7k71N0J40n8M2o9J21j36L18
5056B04P8k36j52L56j42k12J49j09L65k86J0k38o5K18O7K43j75L4j65P9P1j06
$$ plain form
5078 -12 -136 63 258 38 -155 -36 -118 -266 -28 283 201 126 28 -76 47 134 -315 -119 -13 -205 -15 110
5100 110 -23 170 297 -35 319 -67 -152 -78 270 349 -256 -113 233 85 231 263 -278 -22 161 -157 50
5121 50 33 277 -368 41 79 -87 -164 -98 107 -123 63 -22 -231 -112 -386 -203 10 -66 338 -203 -287 -58 -4
5144 -4 -87 -55 -68 10 -229 165 106 221 -255 22 -103 -100 127 126 -200 67 291 303 44 129 -84 -89 107 189 160 -397
5170 -397 -113 -38 -48 100 63 388 201 374 171 -66 247 98 -191 -195 60 -224 58 -21 253 189 169 -49 -146
5193 -146 119 -66 162 130 -425 -189 81 -86 -39 253 74 -218 206 175 -248 -286 -179 4 -221 117 5
5214 5 -245 -14 -195 -191 90 107 -26 -277 214 135 -167 -8 331 309 -274 298 124 62 -28 215 94 -3 -133
5237 -133 201 -203 122 284 28 11 155 245 -215 -31 47 122 123 47 43 -21 295 -200 -93 -189 -245 29 34 -340 -58
$$ packed form
5078a2j24J99J95k20j93J19q2j48K38L11q2p5r8j04J23Q7m49J96J06j92J90J25
5100A10j33J93J27l32L54l86q5P4L48P9o05J43L46j48J46L2n41K56J83l18K07
5121E0j7K44o45M09L8j66p7O6K05k30J86q5k09J19k74J83K13p6M04n41q4K29N4
5144dq3L2j3P8k39L94n9J15m76K77j25LK27jl26K67K24J2k59Q5k13nJ96Q2k9n57
5170c97K84P5j0J48l7L25j87J73k03k37L13j49k89mK55k84K82p9K74o4k0k18r7
5193a46K65j85K28l2n55K36K70j67M7K92j79k92M24l1m23l8J07J83k25L38j12
5214Ek50K31j81MK81J7j33k51M91p9l02J59L39k2n83N72j74o2r0K43j21r7j30
5237a33L34m04L25J62k56j7J44R0m60J84P8P5Jp6mo4L16m95J07r6n6K74Nl74K82
$$ plain form
5262 -58 -63 -19 -180 -16 -130 119 -117 -145 -283 102 162 -148 -53 81 -160 -157 -150 -65 -21 249 -54 -17 47 169 44
5287 44 60 120 -40 -151 -155 136 188 -253 -184 53 69 -78 -114 -60 -334 83 -75 -64 205 249 -288 229 56 -8
5311 -8 -169 13 123 -35 -273 364 101 -163 109 -79 -150 -376 31 -135 17 131 -282 -303 -108 112 -4
5332 -4 -345 238 -199 -27 14 -95 -49 -26 -12 -3 -69 -205 -145 -164 -179 164 21 227 169 43 -24 -123 63 290 286 144
5358 144 -23 273 -46 -219 125 -38 377 77 -125 124 170 357 268 -118 230 53 -203 58 -129 -42 -44 -59
5380 -59 222 -105 -272 125 -26 -90 208 -84 -229 9 211 231 80 -50 -268 -56 20 76 235 -95 149 347
5402 347 258 216 -137 -115 93 282 191 -279 -67 -164 86 136 104 -303 -343 -34 19 -65 -89 -159 -196 87 8 -42 116
5427 116 258 26 -8 -164 46 -95 162 6 253 188 -5 57 73 -65 -328 99 59 113 281 -39 -167 109
$$ packed form
5262e8nM4j61J64j14K49k36k8j38L85O0l10R5J34k41LPQ5M4K70l03L7O4J22j25
5287D4J6O0j60j11mK91N2m41O9K37J6j47l6N4k74M17j58J1K69M4n37N17j73o4
5311hj61J82J10j58k38O37k63k64K72j88p1k26M07j66J52J14m13k1J95K20j16
5332dl41N83m37J72M1j09M6K3J4Ro6j36O0j9j5L43j43K06n8j26o7r9J86K27mj42
5358A44j67K96l19j73L44j63M15l00k02K49M6J87q9l86L48j77k56K61j87Q7kj5
5380e9K81l27j67L97j51o4K98k92j45K38K02K0j51j30k18K12P6N6J59l30K44J98
5402C47q9m2l53K2K08J89r1m70K12r7K50N0l2m07m0L09N3q4k4p0l7K83p9n0J58
5427A16J42k32l4j56K10j41K57j56K47o5j93O2J6j38k63M27m0N4J68l20j28K76
$$ plain form
5449 109 -50 41 142 164 142 103 -4 -243 -17 -121 106 -53 -189 -199 -127 -68 -233 -125 287 -264 -106 30
5471 30 -139 19 46 -37 71 33 162 -38 14 69 -137 -128 -161 253 -249 9 -38 203 293 134 -79 -23 112 96
5495 96 62 254 79 98 -141 -117 -34 58 145 93 242 12 168 -22 15 -55 5 -56 69 -62 266 -59 274 217
5519 217 -101 -47 -90 -159 -62 123 282 128 106 -318 -236 13 -20 -23 184 -229 -86 -47 -67 -322 85 330 -108 -51
5543 -51 -82 2 61 -147 -18 48 28 141 -121 9 -101 191 46 21 -29 36 215 -52 51 43 72 161 101 -153 -133
5568 -133 160 143 -6 289 182 21 -44 -31 58 98 255 -300 106 147 7 -54 1 154 0 -5 84 78 -300 86
5592 86 -226 294 -50 112 -159 -218 11 59 45 -285 -64 85 -87 35 31 -106 -99 -317 -105 -1 -184 -78 -138
5615 -138 28 199 -141 -78 58 -18 -8 -26 154 283 -89 -240 131 21 203 105 -81 4 170 -52 -14 -20 -210
$$ packed form
5449A09j59R1J01K2k2l9j07k39K26j04K27j59j36j0P2N9j65J08M12n51J58J36
5471C0j69J58K7q3J08l8J29k00N2N5k06Rl3M14n02K58m7K41R0j59k13N6J35j6
5495I6l4J92j75J9k39K4Q3R2Q7n2J49k30J56j90L7p0O0o1J25j31L28l25L33n7
5519B17l18N4m3o9R7J85J59j54k2m24Q2K49l3lK07m13J43L9k0k55M07K45m38N7
5543e1l1Q4N9k08J29O6k0J13k62J30j10K92j45k5n0O5J79k67J03qK9Q9o0k54K0
5568a33K93j7j49K95j07j61o5J3Q9M0J57n55M06M1j40o1N5J53j54nQ9ol78L86
5592H6l12N20l44J62k71n9K29M8j4l30K21J49j72J22mj37Pk18K12J04j83J06o0
5615a38J66J71l40O3J36p6J0j8J80J29l72j51L71j10J82r8j86Q5J66k22L8oj90
$$ plain form
5638 -210 -231 53 -120 182 -318 168 -118 -135 190 -36 -150 -103 -102 -172 146 135 88 -369 -22 51 -171 57 32
5661 32 -128 -136 -139 -161 284 -225 -248 -248 18 24 44 -81 51 -68 -249 -68 -27 66 53 -15 172 130 37 -141 -164 15
5687 15 -346 -16 29 103 109 -144 254 -103 -90 175 199 104 65 179 -145 2 32 144 19 209 86 -45 -241
5710 -241 -259 112 -200 -104 169 -4 -44 -73 -16 -112 -18 25 93 22 -31 22 -90 -245 85 -31 -138 -398 -310 -265 84
5735 84 7 110 -37 84 146 24 -70 -43 31 433 125 -41 -274 32 68 -226 28 -256 -135 45 255 303 -54
5758 -54 40 303 -179 286 232 -93 40 -103 120 -103 -125 -83 114 -313 220 0 -10 100 134 -44 -168 20
5780 20 174 -339 237 -152 76 -212 76 -174 -299 200 -7 -73 -266 -302 1 278 -52 225 -158 -75 -254
5801 -254 -203 -65 47 -56 -311 110 56 -33 -200 -105 146 219 21 -10 113 -36 -147 402 118 -238 -48 -95
$$ packed form
5638b10k1K84j73L02n00M86k86j7L25k26j14M7Jp0L18j1m7m57L47P3k22K28k5
5661C2j60qlk2M45n09k3%K66OK0j25J32j19j81J81M1R3j3o8J87m2r3j78k3J79
5687A5l61L30M5P4Ok53L98l57J3K65K4r5l9J14l24J47L0J12j25J90j23j31j96
5710b41j8L71l12R6K73j73m0k9N7r6R4M3O8p1n3N3j12j55L30j16j07k60Q8M5L49
5735H4p7J03j47J21O2j22r4K7P4M02l08j66k33L06L6k94K54k84J21J80K10M8l57
5758e4R4K63m82M65n4l25J33j43K23k23k2M2J97m27N33k20j0J10L4j78j24J88
5780B0J54n13N76l89K28k88K88k50j25M99k07o6j93l6L03K77l30K77l83Q3j79
5801b54N1J38J12j03k55M21n4q9j67R5K51P3j98l1J23j49j11N49k84l56J90m7
$$ plain form
5823 -95 -77 188 412 204 139 -142 63 -76 220 207 -2 -71 199 181 110 -68 -47 -113 307 -221 -155 36 28 0
5847 0 -221 135 13 -137 -74 10 258 -189 -176 23 212 -184 43 -81 -214 -67 -217 31 95 84 -308 275
5869 275 -171 60 -321 -145 33 -186 -71 103 213 180 94 -63 51 -82 40 -50 -89 17 290 -194 -88
5890 -88 0 -15 188 -108 213 180 33 10 11 -77 0 -25 -109 -281 98 141 -117 145 -24 -16 -133 6 -122 -3 -170
5915 -170 87 -84 156 -248 211 -10 -59 -65 -22 54 -41 -38 -54 -18 45 68 -53 112 94 59 -105 -199 -135 71 -183
5940 -183 129 -177 137 156 -134 270 17 -16 187 -3 296 -133 176 -28 -151 105 121 -62 142 -88 -26
$$ packed form
5823i5J8K65K24k08o5k81K05j39K96j3k09o9K70j8p1j78K1o6M20n28O6J91qk8
5847@k21L56j22j50O3Q4K48m47J3J99J89l96K27j24j33J47j50K48O4j1l92N83
5869B75m46K31l81J76J78k19J15J74J10l3q6j57J14j33J22r0l9J06K73m84J06
5890h8Q8j5K03k96L21l3j47k3Jq8P7k5q4j72L79M3k58K62j69Qj17J39j28J19j67
5915a70K57j71K40m04M59k21m9oM3P6r5Lj6L6O3K3j21J65j8l5j64r4O4K06k54
5940a83L12l06L14J9k90M04k53l3K03j90K99m29L09k04j23K56J6j83K04k30O2
$$ [...]
8191F7
##END NTUPLES=NMR FID
##END=
