##TITLE=1H_SL2-5ID-A
 CDCl3,8 sc, 
 27.9.2021
##JCAMPDX= 6.0         $$ Bruker NMR JCAMP-DX V2.0
##DATA TYPE= NMR FID
##DATA CLASS= NTUPLES
##ORIGIN= UXNMR, Bruker Analytische Messtechnik GmbH
##OWNER= root
$$ XWIN-NMR		Version 3.5
$$ Mon Sep 27 13:40:36 2021 Russian Standard Time (UT+4h)  she@DPX200
##.OBSERVE FREQUENCY= 200.1314
##.OBSERVE NUCLEUS= ^1H
##.DELAY= (6, 6)
##.ACQUISITION MODE= SIMULTANEOUS
##.ACQUISITION SCHEME= undefined
##.AVERAGES= 8
##.DIGITISER RES= 18
##SPECTROMETER/DATA SYSTEM= spect
##.PULSE SEQUENCE= zg30
##.SOLVENT NAME= CDCl3
##.SHIFT REFERENCE= (INTERNAL, CDCl3, 0, 15.7039)
##AUDIT TRAIL= $$ (NUMBER, WHEN, WHO, WHERE, WHAT)
$$ ##TITLE= Audit trail, XWIN-NMR		Version 3.5
$$ ##JCAMPDX= 5.01
$$ ##ORIGIN= Bruker BioSpin GmbH
$$ ##OWNER= she
$$ F:/spectra/data/she/nmr/H-F/1/audita.txt
$$ ##AUDIT TRAIL=  $$ (NUMBER, WHEN, WHO, WHERE, WHAT)
(   1,<2021-09-27 13:39:35.06 +0400>,<she>,<DPX200>,
      <created by zg, POWCHK disabled, PULCHK disabled
       configuration hash MD5:
       00 E9 B6 7A A2 85 ED C7 34 08 36 98 17 FE 4E 26
       data hash MD5: 16K
       DD 60 47 13 1B 49 8E 98 52 E5 39 D1 06 87 59 7E>)
$$ ##END=
$$ 
$$ hash MD5
$$ F8 1C EC 4A 11 B0 1B 19 63 CC 2A 4E 5E A2 90 BB
##$RELAX= 
##$RELAX= 
##$RELAX= 
##$RELAX= 
##$RELAX= 
##$RELAX= 
$$ Bruker specific parameters
$$ --------------------------
##$DU= <F:/spectra>
##$EXPNO= 1
##$NAME= <H-F>
##$PROCNO= 1
##$TYPE= <nmr>
##$USER= <she>
##$AMP= (0..31)
100 100 100 100 100 100 100 100 100 100 100 100 100 100 100 100 100 100 
100 100 100 100 100 100 100 100 100 100 100 100 100 100 
##$AQSEQ= 0
##$AQ_mod= 1
##$AUNM= <au_zg>
##$AUTOPOS= <>
##$BF1= 200.13
##$BF2= 200.13
##$BF3= 200.13
##$BF4= 200.13
##$BF5= 200.13
##$BF6= 200.13
##$BF7= 200.13
##$BF8= 200.13
##$BYTORDA= 1
##$CFDGTYP= 0
##$CFRGTYP= 5
##$CHEMSTR= <none>
##$CNST= (0..31)
1 1 145 1 1 1 1 1 1 1 1 1 1 1 1 1 1 1 1 1 1 1 1 1 1 1 1 1 1 1 1 1 
##$CPDPRG= <>
##$CPDPRG1= <>
##$CPDPRG2= <>
##$CPDPRG3= <>
##$CPDPRG4= <mlev>
##$CPDPRG5= <mlev>
##$CPDPRG6= <mlev>
##$CPDPRG7= <mlev>
##$CPDPRG8= <mlev>
##$CPDPRGB= <>
##$CPDPRGT= <>
##$D= (0..31)
0 1.2 0 0 0 0 0 0 0 0.06 0 0.03 0 0 0 0 0.0002 0 0 0 0 0 0 0 0 0 0 0 0 
0 0 0 
##$DATE= 1632735574
##$DBL= (0..7)
120 120 120 120 120 120 120 120 
##$DBP= (0..7)
150 150 150 150 150 150 150 150 
##$DBP07= 0
##$DBPNAM0= <>
##$DBPNAM1= <>
##$DBPNAM2= <>
##$DBPNAM3= <>
##$DBPNAM4= <>
##$DBPNAM5= <>
##$DBPNAM6= <>
##$DBPNAM7= <>
##$DBPOAL= (0..7)
0.5 0.5 0.5 0.5 0.5 0.5 0.5 0.5 
##$DBPOFFS= (0..7)
0 0 0 0 0 0 0 0 
##$DE= 6
##$DECBNUC= <off>
##$DECIM= 32
##$DECNUC= <off>
##$DECSTAT= 4
##$DIGMOD= 1
##$DIGTYP= 9
##$DL= (0..7)
0 120 120 120 120 120 120 120 
##$DP= (0..7)
150 150 150 150 150 150 150 150 
##$DP07= 0
##$DPNAME0= <>
##$DPNAME1= <>
##$DPNAME2= <>
##$DPNAME3= <>
##$DPNAME4= <>
##$DPNAME5= <>
##$DPNAME6= <>
##$DPNAME7= <>
##$DPOAL= (0..7)
0.5 0.5 0.5 0.5 0.5 0.5 0.5 0.5 
##$DPOFFS= (0..7)
0 0 0 0 0 0 0 0 
##$DQDMODE= 0
##$DR= 18
##$DS= 0
##$DSLIST= <SSSSSSSSSSSSSSS>
$$ [...]
##$SUBNAM2= <"">
##$SUBNAM3= <"">
##$SUBNAM4= <"">
##$SUBNAM5= <"">
##$SUBNAM6= <"">
##$SUBNAM7= <"">
##$SUBNAM8= <"">
##$SUBNAM9= <"">
##$SW= 20.0188988654967
##$SWIBOX= (0..15)
0 0 2 0 0 0 0 0 0 0 0 0 0 0 0 0 
##$SW_h= 4006.41025641026
##$TD= 16384
##$TD0= 1
##$TE= 0
##$TE2= 300
##$TE3= 300
##$TEG= 300
##$TL= (0..7)
0 120 120 120 120 120 120 120 
##$TP= (0..7)
150 150 150 150 150 150 150 150 
##$TP07= 0
##$TPNAME0= <>
##$TPNAME1= <>
##$TPNAME2= <>
##$TPNAME3= <>
##$TPNAME4= <>
##$TPNAME5= <>
##$TPNAME6= <>
##$TPNAME7= <>
##$TPOAL= (0..7)
0.5 0.5 0.5 0.5 0.5 0.5 0.5 0.5 
##$TPOFFS= (0..7)
0 0 0 0 0 0 0 0 
##$TUNHIN= 0
##$TUNHOUT= 0
##$TUNXOUT= 0
##$USERA1= <user>
##$USERA2= <user>
##$USERA3= <user>
##$USERA4= <user>
##$USERA5= <user>
##$V9= 5
##$VALIST= <valist>
##$VCLIST= <CCCCCCCCCCCCCCC>
##$VD= 0
##$VDLIST= <DDDDDDDDDDDDDDD>
##$VPLIST= <PPPPPPPPPPPPPPP>
##$VTLIST= <TTTTTTTTTTTTTTT>
##$WBST= 1024
##$WBSW= 4
##$XGAIN= (0..3)
0 0 0 0 
##$XL= 0
##$YL= 0
##$YMAX_a= 69250
##$YMIN_a= -130275
##$ZGOPTNS= <>
##$ZL1= 120
##$ZL2= 120
##$ZL3= 120
##$ZL4= 120
##$ABSF1= 10
##$ABSF2= 0
##$ABSG= 5
##$ABSL= 3
##$ALPHA= 0
##$AQORDER= 0
##$ASSFAC= 0
##$ASSFACI= 0
##$ASSFACX= 0
##$ASSWID= 0
##$AUNMP= <proc_1d>
##$AZFE= 0.1
##$AZFW= 0.1
##$BCFW= 1
##$BC_mod= 2
##$BYTORDP= 1
##$COROFFS= 0
##$CY= 11.3945322036743
##$DATMOD= 1
##$DC= 2
##$DFILT= <>
##$DTYPP= 0
##$F1P= 2.36226072786647
##$F2P= -0.459571619588291
##$FCOR= 0.5
##$FTSIZE= 0
##$FT_mod= 4
##$GAMMA= 1
##$GB= 0.15
##$INTBC= 1
##$INTSCL= 1
##$ISEN= 128
##$LB= 0.24
##$LEV0= 0
##$LPBIN= 0
##$MAXI= 10000
##$MC2= 0
##$MEAN= 0
##$ME_mod= 0
##$MI= 1.114404
##$NCOEF= 0
##$NC_proc= 0
##$NLEV= 6
##$NOISF1= 3.799351
##$NOISF2= 2.8
##$NSP= 1
##$NTH_PI= 0
##$NZP= 0
##$OFFSET= 15.70392
##$PC= 1
##$PHC0= -14081.24
##$PHC1= 16.00089
##$PH_mod= 1
##$PKNL= yes
##$PPARMOD= 0
##$PSCAL= 0
##$PSIGN= 0
##$REVERSE= no
##$SF= 200.130013532006
##$SI= 16384
##$SIGF1= 3
##$SIGF2= 2
##$SINO= 400
##$SIOLD= 16384
##$SREGLST= <1H.CDCl3>
##$SSB= 0
##$STSI= 0
##$STSR= 0
##$SW_p= 3612.71676300578
##$SYMM= 0
##$S_DEV= 0
##$TDeff= 0
##$TDoff= 0
##$TI= <>
##$TILT= no
##$TM1= 0
##$TM2= 0
##$TOPLEV= 0
##$USERP1= <user>
##$USERP2= <user>
##$USERP3= <user>
##$USERP4= <user>
##$USERP5= <user>
##$WDW= 1
##$XDIM= 8192
##$YMAX_p= 0
##$YMIN_p= 0
$$ End of Bruker specific parameters
$$ ---------------------------------
##NTUPLES= NMR FID
##VAR_NAME=  TIME,          FID/REAL,        FID/IMAG
##SYMBOL=    X,             R,               I
##VAR_TYPE=  INDEPENDENT,   DEPENDENT,       DEPENDENT
##VAR_FORM=  AFFN,          ASDF,            ASDF
##VAR_DIM=   8192,          8192,            8192
##UNITS=     SECONDS,       ARBITRARY UNITS, ARBITRARY UNITS
##FACTOR=    0.0002496,     1,               1
##FIRST=     0,             0,               0
##LAST=      2.0444736,     0,               0
##MIN=       0,             -130275,         0
##MAX=       2.0444736,     69250,           0
$$ Real data points
##PAGE= N=1
##DATA TABLE= (X++(R..R)), XYDATA
0@%%%%%%%%%%%%%Lj1J6j6J6k0K8l2M0m8N6o4P2q8J04j20J36j54J76k00K27k58
35a37K91l26L65m09M57n11N67o28O98p73Q55r45J040j145J264j393J533j690J865
54I78k058K275k523K805l128L506l956M501n175O037p183Q790j1225J5400k4506
69a5462Q3525o7899r8132J37092Q828p4641O737O4026m1426j3358L1828q229l4418
82b1529K7072K3103l0236j9999K2275K359n158J5133P060l2372p849J6214J609
95b318m424J1718p17o486P941o406k3449M738K6947J1937j4915k3321m818K2149
109a424O802j8488n18J7811n527j9923K443J8603Q089j719j294p280j0155R323
123c257J3905r018n415J6453k200k2279P416K4476m222j6785M447Q788j2084j5706
$$ plain form
0 0 0 0 0 0 0 0 0 0 0 0 0 0 0 3 -8 8 -8 8 -12 16 -16 24 -24 32 -32 40 -48 56 -64 72 -82 94 -106 121 -137
35 -137 154 -172 193 -216 241 -270 297 -331 367 -406 449 -496 544 -601 663 -730 803 -887 978
54 978 -1080 1195 -1328 1477 -1651 1855 -2101 2400 -2775 3262 -3921 4869 -6356 9044 -15462
69 -15462 68063 164 -97968 39124 47952 -26689 -19952 44074 2648 -10710 21118 12889 -21529
82 -21529 5543 28646 -1590 -21589 686 3045 -2113 13020 20080 -12292 -20141 -3927 -2318
95 -2318 -6742 4976 4259 -2227 5714 -692 -24141 -19403 7544 19481 4566 -18755 -23573 -1424
109 -1424 5378 -13110 -13628 4183 -1344 -21267 -18824 -221 7868 6149 4855 -2425 -12580 -3257
123 -3257 10648 1630 -3785 12668 10468 -11811 -4395 20081 15859 -926 3521 12309 225 -15481
137a5481Q909K2114L8j5045Q70O584n114k535L759m62K169L439j1578j2752R406
152e679J6937j080r417J18q66p338M270J0951p317p090J1655n976k2136J1312
166a1656K4798j3819j7088J4289N371j6624L980J7511k970p384M242k706q845
179a0901R466Q900j3014k057K0163m010k4977K905J8802j080k638N966p141m498
193d114J3004J298j3891M548J0928j1817j4180Q356J2264O23k01J38m490j542
207I24M721p11k248M918r86j1971L01R190k126n075M701J699l773n78l221l760
223g995Q397Q594o983p619L805J346o525m69P502J442m944k083P73J025M653J858
239B777o472j115N607l722o441R657J0949p001j2260J01N220N4k3L437L322N49
$$ plain form
137 -15481 -6572 15542 15580 535 1405 7989 2875 340 4099 3637 5806 9245 -2333 -15085 -5679
152 -5679 11258 10178 761 879 13 -7325 -3055 7896 579 -6511 5144 -832 -22968 -11656
166 -11656 13142 -677 -17765 -3476 1895 -14729 -10749 6762 3792 -3592 650 -2056 -10901
179 -10901 -1435 7465 -5549 -7606 12557 8547 -16430 -13525 5277 4197 1559 7525 384 -4114
193 -4114 8890 10188 -3703 845 11773 -44 -14224 -5868 6396 7019 6818 6956 2466 924
207 924 5645 4934 2686 7604 6618 -5353 -5052 4138 2012 -3063 1638 3337 -436 -1014 -4235 -7995
223 -7995 402 8996 2013 -5606 -1801 -455 -6980 -7449 53 1495 -3449 -5532 -4759 -3734 919 2777
239 2777 -3695 -4810 797 -2925 -9366 291 11240 4239 -8021 -7920 -2700 -2646 -2669 768 4090 4639
255D639N1l443n066L722P658m879r220N854Q566n877o264Q670O798n920o135l67
271a213J507J854K414k000k752L170K17p936j45J2021K099r722l471L139o82q5
287a585L065l09p97J369m937o269N535R722l494q491K014M923j249k340j085N59
303c369L947K248p129n359Q495N550o438k216N570k468o195L959O561M78n79J11
319C166m334k766L349J485k269K423L949n062n329N863P134j744l030n07k084
334B44o24K744k08j777L127J741n803k157N372J147m117J364M101l783m889K107
350a411K936l98J747j64o620j759O097k25m796M253N667n356p254J936M092P93
366d62J419j549m457J771M070l821k333P335K095r814k363P636K684k920J442
$$ plain form
255 4639 4690 1247 -3819 -97 7561 2682 -6538 -684 7882 2005 -4259 4411 11209 5289 -846 -1213
271 -1213 294 2148 4562 2562 -190 2980 3197 -4739 -4884 7137 9236 -486 -3957 -818 -1500 -1585
287 -1585 1480 1171 374 1743 -3194 -9463 -3928 5794 2300 -6191 -4177 746 -503 -2843 -3928 -3369
303 -3369 578 2826 -4303 -9662 -1167 4383 -2055 -4271 1299 -1169 -7364 -3405 3156 3634 3055 3166
319 3166 -1168 -3934 -585 900 -1369 1054 5003 -59 -5388 475 7609 5865 2835 2328 244
334 244 -380 2364 2156 379 3506 5247 -556 -2713 2659 3806 -311 1053 5154 1371 -3518 -1411
350 -1411 1525 1127 2874 2710 -3910 -5669 428 203 -4593 -340 5327 -29 -7283 -5347 -1255 -462
366 -462 957 -592 -5049 -3278 792 -3029 -5362 1973 4068 -5746 -8109 -473 2211 -709 733
381G33J488l437J3M76m062K415Q636j604q816K473P253k689l927L548J883k249
397B134p73k347l321O637P608n623p193M582L652n990j149O932P68n339j560M2
413i40q00K955K488m703k825M033K20m243J851N906j192n535j180K418J75q72
429b244j2R49R76l23l280j827L670L692k317k816J950J654k013j826L667K849
445B749j860l858j494Q90L195L037j318o11R47L40k334J031M521m94m487n9J875
462B070n83q81R47O73J367K33n146k346O041M876n551l773M131J708l517j704
478a455J281O65K472L15p123k060P776J890o091R94M210m325m186M175J816k008
494a654J336K44n963R63N911k906m712O333L998q090k741P289K616k989N29l74
$$ plain form
381 733 2221 -1216 -1203 -727 -4789 -2374 6262 4658 -4158 -1685 5568 2879 -1048 2500 4383 2134
397 2134 1361 -986 -4307 2330 9938 4315 -2878 1704 5356 -634 -1783 5149 5917 578 -982 -940
413 -940 -1740 1215 3703 -1000 -3825 208 428 -3815 -1964 3942 2750 -2785 -3965 -1547 -1372 -2244
429 -2244 -2256 -1307 -331 -654 -3934 -5761 -2091 1601 -716 -3532 -1582 72 -1941 -3767 -100 2749
445 2749 889 -2969 -4463 -3573 -378 2659 1341 730 1677 2017 -317 714 5235 4741 254 195 2070
462 2070 1487 606 1553 2226 3593 3826 -1320 -3666 2375 7251 1700 -2073 2058 3766 249 -1455
478 -1455 -174 491 2963 3278 -3845 -5905 1871 3761 -2330 -1336 2874 -1451 -5637 -1462 354 -1654
494 -1654 -318 -74 -6037 -5074 837 -2069 -6781 -448 3550 -4540 -7281 8 2624 -365 164 -210
510b10l214K664L781m291j552P324R96p606j289N262N09k180J199Q06j164J08
526A143M77j618K079L264k352m063R36K107q00M78J097j54j644j154n45K001K347
543C599j543k522N59L94j278j116J258J172o52k176k376J066L131J56j997r8K437
560A4n76k887j04K760J546r25k134m26J275L91l71P41J654j295k313J0K328K774
578B462J68l197p37L003l75m405Q57N925O09m547j371K589J221J035L60k932J65
595H30M389j753o455K935O621k914n883K027J439k532J483K432l231K0L303l784
611a073m219O050M298o368k896N385m29n393J920M248j662j022J060l396j026
626d523N713R25n221N79M298k656l644K928K300p43o67n42k010J655K468r96n81
$$ plain form
510 -210 -3424 -760 3021 -1270 -2822 4502 5498 -2108 -3397 1865 2374 194 1393 2199 1035 1143
526 1143 1620 2 2081 5345 2993 -1070 -134 1973 1173 1651 2748 2594 950 -204 -749 1252 3599
543 3599 2056 -466 93 487 -791 -1907 -649 523 -129 -2305 -4681 -3615 -484 -328 -2325 -2423 14
560 14 -562 -3449 -3553 -793 753 -172 -2306 -2732 -1457 -1066 -1437 -696 958 -337 -2650 -2640 -312 2462
578 2462 2630 -567 -1304 1699 1324 -3081 -2224 3701 4310 -237 -1608 981 2202 3237 3597 665 830
595 830 5219 3466 -2989 -54 6567 3653 -2230 -203 1236 -1296 187 2619 -612 -592 2711 -1073
611 -1073 -5292 758 5056 -1312 -4208 1177 748 -4645 -2725 1523 -139 -1161 -101 -3497 -4523
626 -4523 1190 2115 -3106 -2527 1771 -885 -4529 -1601 699 -44 -711 -1253 -3263 -1608 860 -136 -717
643g17K364k38k980N35K763L98o62l2n53j23Q78j626n35L487J101m103j437K947
661A467M77r14P72P04j795o31M52r55P28K782j453l526M16K651q55j652J305J679
679A652j469j810o45J362J399l5j401j057Q01P9j272o28J658K914j843l943R05
696c333M313k24k795J179K154j681j007K06K87R77K737k157m242K473M347j943
712A291l276K967K145k892j598K198M47k4J350j181k309J559J592k340l21L496
728C104J75m027m31K804K58j130M7m05k72O87r70j524J429J987r55k553L84R82
746d10K64k41k98O8M82r30j387R83K071j067j405J134L26j768K12J785K23n98
764e56R6r98p68K048J543k251n89K773J95l451L22K900k8j529O66l37q6J238L39
$$ plain form
643 -717 1647 1409 -1571 -1036 1727 2125 1463 1431 878 755 1633 7 -528 2959 4060 -43 -1480 1467
661 1467 1944 1030 1802 2506 711 80 532 -423 305 3087 1634 -1892 -1476 1175 320 -1332 -27 1652
679 1652 183 -1627 -2272 -910 489 454 -947 -2004 -1203 -1124 -2396 -3024 -1366 1548 -295 -4238 -3333
696 -3333 980 756 -2039 -860 1294 -387 -1394 -1188 -901 76 2813 656 -3586 -1113 3234 1291
712 1291 -1985 982 3127 235 -1363 835 1282 1258 2608 1427 -882 677 2269 -71 -392 3104
728 3104 3279 -748 -1179 1625 1883 753 800 395 123 810 -160 -1684 -255 1732 777 -1776 -1392 -410
746 -410 -146 -387 -685 -617 -135 -1065 -2452 -1469 602 -465 -1870 -736 -410 -2178 -1966 -181 42 -556
764 -556 -460 -1458 -2226 -178 1365 -886 -1475 1298 1493 -1958 -1636 1264 1236 -293 373 36 -50 1188 1527
783A527j769J143K360j749l499J861L625j138k713J059R48r73o87M14L67P94J01
800A671j726j554K127J595k069j419J712J373j890j906R65J966j94j340q80m4
816a613J350j34j367L73J671M5k354j072K426J535j404j357O10Q32M6j100k76
833a789J816J191j206k020P53J797K53r66P3J002M76j413n76Q67J913j77j821
850A73p86J743K48p22K74R72p82o25K40k97J93J018J8j540M32O08j282n70J688
869A003O18j936p79J498j48j029M53M54j54J9n76j590M27K763Q7l315l28K468
887f5r7j906M60J309N6o27j75n42P21J758m49j757O33J628j680j485K210K095
905B087j596j506P97P98r8J84j44l38J498K53k139r26L030J315k668j291J612
$$ plain form
783 1527 -242 901 3261 1512 -1987 -126 3499 2361 -352 707 1655 682 -5 409 776 1570 1671
800 1671 -55 -1609 518 2113 44 -1375 337 1710 -180 -2086 -1121 845 651 -689 -1569 -1613
816 -1613 -263 -397 -1764 -1391 280 325 -2029 -3101 -675 860 -544 -1901 -1291 -459 -413 -1513 -1789
833 -1789 27 1218 12 -2008 -1255 542 795 -171 -98 904 1380 -33 -609 258 2171 1994 173
850 173 -613 1130 1378 656 930 1902 1120 495 735 438 631 1649 1667 127 559 1167 -115 -685 1003
869 1003 1621 -315 -1094 404 256 -773 -320 134 -20 -1 -577 -2167 -1740 1023 1110 -2205 -2533 -65
887 -65 -162 -2068 -1608 -299 -243 -870 -1045 -1587 -866 892 443 -1314 -681 947 -733 -2218 -8 2087
905 2087 491 -1015 -218 580 482 666 522 184 1682 1935 -204 -1130 1900 3215 547 -744 868
922H68P11j026qL97L0R59p11k418N93K555n33k368M63J340r19r78M97N61L01j38
942A76j119j593K125J328j825n91J719J44k102m65J877N5p15L7l26j90J012M62
960Ij319M44J698q26k044R96J786m80l03L16m00k09J99P3K21J190M2j109k64J174
980A194L60j223J97J135j40j435j99J001N56j08j011k21K19N35p81p22J132J375
998A864q12k053k20K227j57j183m89O24J61n76o10L52J130N75j478j495J368R17
1016A45r29p74J033O76j148l51j58M23J150l28j093m00K204J45j800M77K245l78
1034A139j674p3P70L91O37j5j442R9K037j133j775J626J794j358j520J039N93
1051A135m65L09L69j171L93L23r75m01J660J61j687J26Q01n65j40N05r3k56L2
$$ plain form
922 868 1579 553 545 942 972 1931 1220 -1198 -605 1950 1417 -951 -488 852 -67 -1045 -548 13 314 176
942 176 -943 -2536 -411 917 -908 -1499 220 364 -1738 -2203 -326 -271 -986 -949 -1275 -1465 -453 9
960 9 -1310 -866 832 6 -2038 -1042 744 264 -39 277 -123 -332 -133 -60 161 1351 1393 284 20 1194
980 1194 1554 331 528 1663 1523 88 -111 890 1446 1338 327 106 325 860 79 -643 489 1864
998 1864 1052 -1001 -1221 1006 849 -334 -823 -199 -38 -614 -1224 -872 258 833 -645 -2140 -772 145
1016 145 -784 -1558 -525 151 -997 -1348 -1506 -1083 67 -261 -1354 -1754 450 595 -1205 -728 1517 1139
1034 1139 -535 -608 162 553 1190 1175 -267 -168 1869 736 -1039 587 2381 1023 -497 542 1135
1051 1135 670 979 1348 177 570 893 -82 -483 1177 1338 -349 -223 578 13 -127 378 285 29 61
1070F1m89r21Q80P83j025p23Q68J20r85L47N83J06J09l9r92q6J363l65p43P82
1090c66Q67j220n33Q50Q36l86k42r9p5N81O1q66P12J480q77j437K97J503K75j080
1110B81m37N54P90l08j030J09J566L58j192j059N64R00k29n98k15R71k17j275
1128d67n86J269N92p07m51k39L82L35m15p71O24J138r62j670L22K327m39j341
1146a059n5P26K8m75l34N07O07M39j244q75J598P83j393k63Q76M87r39o0N50N84
1166D88L11k11p94K01P69l45l66M19Q74m75o54L67K76j62K47m03l94M75K12r06
1186g1M29R20l70j109J32N66k83j08J87k78P3K88r03o97J533P36j858p62J641
1205F6K48j266KP40K68o01l90j42j04J333k10j415N05J772r88j388O09J695l89
$$ plain form
1070 61 -428 -1349 -469 314 -711 -1434 -566 -446 -1431 -1084 -501 -395 -286 -325 -1317 -1403 -40 -405 -1148 -366
1090 -366 501 -719 -1252 -402 434 48 -194 -293 -368 213 274 -592 120 1600 723 -714 -417 1086 1361 281
1110 281 -156 398 1188 880 -150 -41 1525 1883 691 -368 196 1096 867 269 54 1025 808 -467
1128 -467 -1053 216 808 101 -350 -589 -207 128 -287 -1058 -434 704 -258 -1928 -1606 721 282 -1059
1146 -1059 -1114 -388 -360 -835 -1169 -662 -55 384 -860 -1735 -137 646 -747 -1010 -134 353 -586 -646 -96 488
1166 488 799 588 -206 -5 764 419 53 472 1346 871 217 584 860 698 945 542 148 623 835 -71
1186 -71 358 1278 908 -201 -69 497 214 106 293 15 88 376 -527 -1224 309 1045 -813 -1575 66
1205 66 314 -952 -950 -210 58 -543 -933 -1075 -1179 154 -56 -1471 -966 806 -182 -1570 -961 734 345
1224C45j072L52K14R9L84k77n84Q25N93j000q97J188J090l67r44P0P99Q4q99L
1244FQ05P87r87o56j79R78P00p76p92M37R37r17j184Q83J391r00r07R6R3L84k47
1265d8m25J29K91K82r35j80R46k28k73m10Q2J25L06j42m56N93O1m80o65R65M15
1286d7n91K85K07k72k5L44k16K09N60l07j088Q38J106p20r25J269N07j045KM85
1306E76L48o30N07j43r37R32M21j176O6J524r7j847j03J446j20r18L21n5J42L92
1326F49o20o19J40J239k53j977N97J173p9j318J77R95n79k02l90M01N09K51p65
1345f71o28Q64P19r93r68J393O68n74p53L45Q01j63j01o10M02P17M8r76L72Q08
1365G00jo77n45P56L30J45m87L16J01N06q28l90O46Q39o17p00K65K21k37j18M63
$$ plain form
1224 345 -727 -375 -161 -62 322 45 -539 286 879 -121 -1018 170 1260 893 -51 19 818 902 3 6
1244 6 811 1598 611 -45 -224 754 1454 678 -114 323 1260 343 -841 42 1433 533 -374 -278 -185 199 -48
1265 -48 -473 -344 -53 229 -706 -886 60 -168 -441 -851 -769 -644 -338 -480 -936 -343 -282 -762 -1427 -462 -47
1286 -47 -638 -353 -146 -418 -443 -99 -315 -106 454 147 -941 -103 1003 283 -642 627 1134 89 91 576
1306 576 924 294 801 658 -279 653 1074 -102 -36 1488 1391 -456 -559 887 767 -151 170 115 257 649
1326 649 29 -590 -450 789 536 -1441 -844 329 250 -1068 -891 104 -475 -677 -1067 -666 -157 94 -671
1345 -671 -1299 -435 284 -709 -1677 -284 384 -190 -943 -598 203 40 -61 -671 -269 448 496 -480 -108 700
1365 700 699 22 -523 233 563 708 221 537 638 1144 316 -74 572 1411 794 94 359 580 343 225 688
1386F88k59M4m22k01J69N16j20q25K31P11m16j122N17P43l66n59L3J27pR0J65
1407b63l69K60K99r83j87R82N25o75o81J045J25m81p2N15j20NJ99o12n2J159k46
1428C73p57k5J438o3j580J86J246K32n86m56R1L41P03m05j018Q01P59o71j045
1447d36P46J137p52o99L5O93k83m21k24o9R50r4r43n67O44Q09r32l36K88K28m80
1468g06k40M76K02M06n61p74K79J092l12o60K15O28l18k99j42L73K11K43l95k7
1488c09L08K41m37k40R71K9o51k18N26J50j35K24L7o0K23j32l13N19J79k42p82
1509a12O59M20n98o95Q22K99m19k71k88L79R5j09k75k21O52nq68p4Q05j7k88n18
1531f27N15J03k02p53N82P3K50o98k50M33P25j26j130n6R98K44p23k45Q10J96
$$ plain form
1386 688 429 473 51 -150 19 535 415 -410 -179 532 116 -1006 -489 254 -112 -671 -638 -511 -518 -428 -263
1407 -263 -632 -372 -73 -1056 -1243 -261 264 -411 -1092 -47 78 -403 -475 40 -80 -75 124 -488 -540 619 373
1428 373 -384 -409 1029 966 -614 -428 818 1050 464 8 99 440 1143 738 -280 521 1280 609 -436
1447 -436 310 1447 695 -4 31 724 441 20 -204 -273 677 583 -360 -927 -283 526 -406 -742 -454 -226 -706
1468 -706 -946 -470 -268 138 -423 -1197 -918 174 -138 -798 -583 45 -273 -572 -714 -341 -130 113 -282 -309
1488 -309 -1 240 -197 -437 534 563 -88 -306 220 370 235 459 496 436 659 527 214 733 912 670 -112
1509 -112 547 967 369 -326 496 795 376 105 -183 196 291 182 -93 -314 338 333 -535 -609 196 179 -109 -627
1531 -627 -112 -9 -211 -964 -382 -309 -59 -757 -1007 -574 151 25 -1105 -1161 -163 81 -642 -887 -77 119
1551A19q9r44Q54L13M27l93r43Q71L22m17o19O55P00l23o62J36L53M27K2p15N1
1572A45M58K02r15M7N03K57o33k9R7J11J73j0k91n1O42q92n49O08Q25o20o95L61
1594b56K73l49l6J01j40J79K16q33J54L61K64o15K59N06m46n14L07M00o6k4n5
1615c14K05J41r1k71J55N55k61m00j75P34J25k30j39K15J03K62n23p4O29J01m03
1636C44p09L69Q75k49n91n8N47K62n21m74J34R62l02o05m55O50K99m77l69O14
1656B46L2l62p73J78Q21J02p97k22L94N44k73n39K1L82M87n66n29K35O88n24j
1677d56K2O25k59K5m31J07P47j4p95J40P73j42m30L24J7K25l82O9o8K79M01o79
1699I8p5O34J0n34j40L76K39l01k27L63o8j00Q8k26L07k22k04q0M43M5o55j30
$$ plain form
1551 119 30 -914 -60 253 680 287 -656 215 537 120 -499 156 856 533 -129 7 360 787 809 94 145
1572 145 603 805 -110 -63 440 697 64 35 132 243 416 406 115 64 706 -186 -735 -127 698 78 -617 -256
1594 -256 17 -332 -368 -267 -407 -228 -12 -845 -691 -330 -66 -681 -422 84 -362 -876 -569 -169 -235 -259 -314
1615 -314 -109 32 -59 -330 -175 380 119 -281 -456 278 403 173 34 249 352 614 91 17 646 747 344
1636 344 -365 4 879 630 39 -19 528 790 269 -205 -71 891 589 -16 -471 179 478 1 -368 246
1656 246 278 -84 -857 -679 142 244 -553 -775 -381 163 -110 -649 -628 -246 241 -325 -854 -619 69 -455 -456
1677 -456 -434 191 -68 -43 -474 -367 380 366 -429 -289 484 342 -88 236 253 478 96 165 97 376 777 98
1699 98 23 657 667 133 -7 369 608 307 80 443 375 275 363 137 444 222 18 -62 381 426 -229 -359
1721c59Q8O3K82m25m2K59j14r8j20J01L21j75n96L64J82j37k86M2M36K68k88l92
1743f26j70O21K29l55j33N38M44j078J26O25K26l42m21R8P04J76J15r24L76N06
1763G35l93k99j07N13J92n17L7J58M24m08k36mK87M41n20o13Q9N82q7m80M6K66
1785A06J57m52o7K59J56k91n08O4K85K30l48j04o3P23k76n80M12L3J02j01j52
1806d15J99j60K0O0J31R3q2j43M0J89L16l49lL33Ll01L33j56R2L35o45J66L14
1829C70J61o79M45J73J44m25k90M01J02J62k20m56K79K96l69k97K74M58m53n46
1849d70K63K84J12m01k42K57J87N0o71J6R28Lp18k91N68N1m93j56M31L07l08K6
1871b67k96J88O50m20n62R3Q39q6o07J41M39N82r04j47M17J26K24j85l8j78N82
$$ plain form
1721 -359 -271 -208 74 -351 -393 -134 -248 -346 -466 -365 -44 -219 -815 -451 -269 -406 -692 -650 -214 54 -234 -626
1743 -626 -796 -175 54 -301 -434 104 548 -530 -404 221 447 105 -316 -218 486 662 777 -147 229 735
1763 735 342 43 -64 449 641 124 161 319 743 335 99 95 382 823 303 -310 -221 361 274 -206 -160 106
1785 106 263 -189 -256 3 159 -132 -640 -576 -291 -61 -409 -513 -576 147 -129 -709 -297 -264 -162 -263 -415
1806 -415 -216 -376 -356 -296 -165 -72 -154 -297 -257 -68 248 -101 -104 229 232 -69 264 108 200 535 -110 56 370
1829 370 531 -148 297 470 614 189 -101 300 402 564 344 -112 167 463 94 -203 71 529 76 -470
1849 -470 -207 77 189 -212 -454 -197 -10 40 -631 -615 313 316 -402 -693 -125 -74 -567 -723 -292 15 -293 -267
1871 -267 -563 -375 275 -145 -707 -614 225 139 -468 -327 112 694 -210 -357 60 186 410 225 187 9 591
1892E91m36n88O83M96j88m82n0L93j33J43q0k23J63K15o43N08P1R6o14O7K2rj00
1915i8k10K24N6k82J25o0j15J24l6l0J0J24j58k99K19L36j23l21j36O05l09Mo9
1938d19L65J24l05p6m3M75l23Q7L7K77J99l74k48J01N70k35k64Q8K18L09m15j96
1960d8K24N02k13o27L43M77j89k84j38j57N28l6l57k68N68Q1l91k70O20Q2p19
1981b72k68M23J52O1m47j38p7O68j24o94K37M35N4m01j28K45R5k79j16L21K55
2002BM7m24K97P6P2Ln20N22K21k71o0Q8M6M7k23N82k49O4p1k70J53M21n23K10
2026B40J27O2J10k93j53J32P5j52k1L43o3k89Q5k16L28k12m6k59j61O22l08j36
2048a85rK20k89q2K08o9K01k55m60L60M02L1p85J85N69q7j84k80M30k7k9l67J42
$$ plain form
1892 591 155 -433 250 746 558 76 26 419 286 429 349 126 289 504 -139 369 440 536 -78 -11 11 2 -98
1915 -98 -308 -84 -28 -310 -185 -245 -360 -236 -272 -302 -292 -168 -326 -625 -406 -70 -193 -514 -650 -45 -354 -350 -419
1938 -419 -54 70 -235 -311 -354 121 -202 -115 -78 199 398 24 -224 -123 447 212 -52 36 254 563 148 -48
1960 -48 176 678 465 -162 181 658 469 185 47 -110 418 382 25 -243 325 406 15 -255 365 447 -272
1981 -272 -540 -117 35 96 -351 -489 -566 102 -22 -716 -479 -44 10 -391 -519 -274 -179 -458 -574 -253 2
2002 2 49 -375 -78 -2 70 73 -447 75 296 25 -35 53 99 146 -77 505 256 320 249 -21 132 553 30 240
2026 240 367 429 539 246 93 225 300 148 127 470 407 118 203 -13 315 103 57 -202 -363 259 -49 -185
2048 -185 -194 26 -263 -345 -137 -206 -5 -260 -720 -360 42 73 -712 -527 42 -45 -229 -509 -79 -106 -135 -502 -360
2071c60K12K60k61j30J05O36j47m94K15K07J64l07l12K82M04L04p43p3M16R4j84
2092B88n97M17M96p7m56j03O31k50L6p3l61L12K52n42l26P47q1k58j80J61j54
2113a18K65k98r5L02j65j28n5J82Q6j61k55L41k33N2M2m4K21O9m27J38K47j57
2135a91k64K34J42m8J21l54L25R4K47k26J53k17N01l55q0L20m4R6m65K83L1J59
2157D62n22l8K80K03j72k43K26L66k99m20P0K63J48l05m62M56K04J19m18m69N54
2178CK43l71l16L62j38K0J25j69N9K57k89k93P8K55N2j65j26M34j13q4l72M85
2200f3P6k03n3o3K88M12l23k13nM65nl17j14M75L0j76r1J66kj04j57M18j21J98
2224E18l80jJ04K02k53l67L24P1m5k98J97R0j36l64M18k1m30L35n1K32p9q9l78
$$ plain form
2071 -360 -148 112 -149 -279 -174 462 315 -179 36 243 407 100 -212 70 474 778 35 -38 378 472 288
2092 288 -309 108 604 527 71 -32 599 349 385 312 -49 263 515 -27 -353 394 313 55 -125 36 -118
2113 -118 147 -151 -246 56 -109 -237 -292 -110 -24 -185 -440 -99 -332 -280 -238 -282 -61 8 -419 -281 -34 -191
2135 -191 -455 -221 -79 -127 -6 -360 -35 59 306 80 233 16 517 162 82 402 358 454 -11 272 303 462
2157 462 -60 -98 182 385 213 -30 196 562 263 -157 -87 176 324 19 -443 13 217 336 -82 -551 3
2178 3 246 -125 -441 -79 -217 -197 -72 -241 -182 75 -214 -507 -429 -174 -122 -287 -413 21 -92 -176 -548 -63
2200 -63 13 -190 -243 -306 -18 394 71 -142 -147 318 313 -4 -118 357 387 211 120 286 284 180 23 441 320 518
2224 518 138 137 241 443 190 -177 147 218 173 -125 72 162 26 -338 80 59 -371 -36 -87 145 66 -23 -401
2247d01N13j22j86q4l39L29K75J9j87k44K19J85l39j0rL89k34j56K97K40j31j14
2269i0j08L11K12l53j46k0N79l67l49N78J73N2l20J38j16K84j43m90J42L79%m75
2291a29K18L65p5j53l05L03J58j69k51J49k3M8j35k57K74K64k27r4m74L60k35
2312c88M20k13l39M95O5l76k52M99j9j78J04k98L58K45k59l04O64j97%J56j74
2333IL4L6j85L44l11J89n8P1N6j88n6K1Q6J90J36l03K91q5j59j28J17M00r0l38
2357G9J92n3l4j99J35R5j57L18l09k17J32P4k0p8j47J28ok22j62N33P2m55K1j56
2381d36N63q8n09j61L04M00k47k19M4L08K8k79R7K80J35l16M6r1J79j25o8K7J62
2404C4L98o76l4J71K82m21J38L08K60r0q7j95J33J76k44j8J1J49O6n22j18P86
$$ plain form
2247 -401 112 -10 -196 -280 -619 -290 -15 4 -183 -427 -208 -23 -362 -372 -381 8 -226 -382 -85 155 24 -90
2269 -90 -198 113 325 -28 -174 -194 385 18 -331 247 420 472 152 290 174 458 315 -175 -33 346 346 -129
2291 -129 89 454 379 226 -79 224 382 213 -38 111 88 136 1 -256 18 282 55 -39 -513 -153 -388
2312 -388 32 -181 -520 -25 40 -336 -588 -89 -108 -286 -182 -480 -122 123 -136 -440 224 27 27 183 9
2333 9 43 79 -106 238 -73 116 58 129 185 -3 -59 -38 48 238 374 71 362 277 118 -10 107 507 417 79
2357 79 271 218 184 -15 120 215 58 376 67 -150 -18 56 36 -42 -189 -61 -67 -289 -451 82 154 -301 -280 -436
2381 -436 127 39 -470 -631 -327 73 -174 -393 -349 -41 -13 -292 -195 85 220 -96 -50 -141 38 -87 -155 -128 34
2404 34 432 -244 -278 -107 175 -246 -108 200 460 370 283 88 221 397 153 135 146 295 361 -161 -279 507
2426E07m74J40j21p7J31R4l30o1J06K49K7j51l09J62K96l05l28O16m94j44P1K98
2448i7k28K26l1j96L41k91N1j74M22j62O1k28J99J61j82j31J94L59l54k66M89
2469A63m5J55j99mK13O2k90n1P4J9K70k09l14M45R8J95n72M32j88lj85K30J59
2492D55l09j62j02j98O01j1m43lK68j96K15n49L43L5K97k97k76K68L4j32l21M22
2514f1J68k22k16l6o4O52n21J74j88M0L50l63K54p3k5j72J47K44n0J83m10J43
2536d6K25j52j89j4L87M4j23k78L00lJ91j65J26p2l47L24j01N7RP8l0m71K71P8
2560I9n6J23j97K20k98K94J05k7l07O0j6O8p5k7k62J07R5J2k60J34L53l03q2J7
2584b23M9j3k56N15j54r9O0j27K83N2L3k89j23M04j6j81oM4L02j72j13k40L54
$$ plain form
2426 507 33 173 52 -25 106 200 -130 -191 -85 164 191 40 -269 -107 189 -116 -444 172 -322 -466 -395 -97
2448 -97 -325 -99 -130 -326 15 -276 -225 -399 23 -139 -78 -306 -107 54 -128 -259 -65 294 -60 -326 163
2469 163 118 273 74 70 283 345 55 4 78 97 367 158 -156 289 387 582 10 442 254 251 66 296 455
2492 455 146 -16 -118 -316 285 274 -169 -172 96 -100 115 -434 -91 -56 241 -56 -332 -64 -30 -162 -483 -61
2514 -61 107 -115 -331 -367 -431 221 -300 -126 -314 -274 76 -287 -33 -106 -131 -303 -156 88 38 221 -189 -46
2536 -46 179 27 -162 -176 211 255 132 -146 154 151 342 177 303 231 -116 208 107 164 173 251 221 -250 21 99
2560 99 43 166 -31 189 -109 185 290 263 -44 16 0 68 -7 -34 -296 -189 -94 -82 -342 -208 145 -158 -240 -223
2584 -223 -174 -187 -443 72 -82 -181 -121 -248 35 87 120 -169 -292 112 96 -85 -91 -47 255 83 -30 -270 84
2607H4M33m83j19Q0M19j50l71L82k0j00j43j47O8J35m0j03l0L74k01j20j63Q9
2629a26K83j17j86j19L74Rj95M5K34j56k70j28j54O54j40l57K69N1p2J27l29O5
2651b38l3M31k45l0j33L21l11Q6j78N36j75k83K39K01J2k59R7m5L05l96K49K01
2673C52j27p2j30p3O45m64j89N9M64l59j22Q3l0j00j1O7q1K49p2k83N7K1M30j95
2697A19j1k52J31J4k42r7k65O34J56m86j48L28J73j76l69L12J34LN1j58J9L16
2719A86j26k41K66R1m33K14M3O1J40k18l2J89p6k1J35l10M90j3l93K63j75K98
2741C38k31J44OJ72l50q9P0K18k09K36o0l69PJ78q0p7K15M7M0k94q8q2J91j95
2765b62O2P4J13O6k90J69j76L61k07l0J07P2k11j50J24oJ1jj01J33k48J43Q9L09
$$ plain form
2607 84 517 34 -85 -5 414 264 -107 275 255 155 12 -135 -67 68 28 -75 -105 269 68 -52 -215 -126
2629 -126 157 40 -146 -265 109 118 -77 -32 202 46 -224 -352 -506 148 8 -349 -80 -29 -101 26 -303 -238
2651 -238 -271 160 -85 -115 -248 73 -238 -152 -330 206 31 -252 -13 188 200 -59 38 -7 298 -98 151 352
2673 352 225 153 23 -50 595 131 -58 1 465 106 -16 67 37 -63 -74 -7 -88 161 89 -194 -137 -116 314 119
2697 119 108 -144 -13 1 -241 -338 -603 31 187 -299 -447 -119 54 -122 -491 -179 -45 -42 9 -149 -130 186
2719 186 60 -181 85 176 -257 -43 0 61 201 -17 -49 140 64 43 178 -132 358 345 -48 215 40 338
2741 338 107 251 257 429 79 -10 60 278 69 305 245 -124 -117 61 -19 -96 119 166 206 -88 -176 -258 -67 -262
2765 -262 -200 -126 -13 53 -237 -68 -244 117 -90 -120 -13 59 -152 -302 -178 -184 -173 -174 -275 -142 -390 -247 -158 151
2789A51j48J7k58L61R5k49J92m7j79K8L31o7j21K53l88p2L54n8o9l45M95J36l04
2812A08j04l3K16k0M2n12O2L25J41l64P7RJ72k97K64k88K02L6k43K1j3N6N2m1
2836a32Q1M25m54l2R5M9J21m4l24L8L90n06J96j75K12m6j18L5J36J31qk69J06
2859i3R2j89L82k43L53n66M91j55L9J56k5k14J44J67k01J40j04n7l9J09k94K67
2881A60o9M2P7k99L46j47k54M6Q8J63o8j44R6p0L1l38K72J4j49J33j89Q6n6R6
2905a33J04j82k17N45k96o3P8J02O8k98K27J21K80n63K74M6L44n13q0K90J59k50
2927D3l0k7r1M08j07j96J31l1L99m56k08M15O4J26m51J59M0J57l44j85K65Krk49
2951a75K19j30r3K09J91j69q6p5m53L59J1N1j09lK65q4l20L02k9J71k23J54k40
$$ plain form
2789 151 3 20 -238 123 218 -31 161 114 -65 -37 294 227 106 359 -29 -101 253 195 126 -219 276 412 108
2812 108 4 -29 187 167 209 -303 -241 84 225 -139 -62 -53 119 -178 86 -202 0 36 -207 -186 -199 -143 -91 -132
2836 -132 -51 374 -80 -112 -17 32 153 109 -215 -177 213 -293 -97 -272 -60 -106 -224 -189 -53 78 70 -199 -93
2859 -93 -1 -190 192 -51 302 -264 227 72 111 267 242 28 172 339 138 278 174 117 78 187 -107 160
2881 160 91 133 210 -89 257 110 -144 -98 -10 153 85 -59 37 -33 -2 -340 -68 -54 -203 -70 -259 -173 -229 -133
2905 -133 -29 -211 -428 117 -179 -242 -164 -62 6 -292 -65 56 336 -227 47 93 437 -76 -156 134 293 43
2927 43 13 -14 -105 303 196 0 131 100 499 43 -165 250 314 440 -11 148 188 345 1 -184 81 83 74 -175
2951 -175 44 -86 -179 30 221 52 -34 -109 -562 -203 -192 -141 -250 -253 12 -72 -392 -90 -119 52 -171 -17 -257
2974b57M43l81r3J5K05O5Nq6Q5J33j28j05JK23k0ql8K76l5j07k07J51q9J23LJ00
3000B74p2L5j90n9J11q0K32O8q0ql20J59o0N0L99n36j98M14k08j17K23l27N24
3023B34j9j28l97J77K2Kj64K29NK49l62j8J09O8N2m56R7K29J35j21J5J56m0n2
3047B2j59o7O73p43K68k24J32J44K46n73J72L50k30k4J86N9r9j95J97l2j6Qo7
3070B8O5O8K24l55J10q8J38j13k55L71J84m19qJ9J61j92L7j06p5L51l56L53j08
3093C4m03L27j38K30r6j03j06J99J84o6k12N7j33R1J77m02L57j36J00r1J53j02
3115g9K76j38j47J41L9M8l8J77k42L12K06m64j44N94n31M1J78J1k68K20q8J48
3137B52l9j28J43k86N1L97m65L55k03k13K59m35K29J3J96j89l12J93K01j3k12
$$ plain form
2974 -257 186 -195 -288 -273 -68 -3 2 -84 1 134 6 -99 -98 125 105 97 59 335 300 193 -14 137 48 171 174 274
3000 274 202 237 47 -12 99 19 251 319 239 231 -89 70 10 60 459 -77 -275 139 -69 -186 37 -290 234
3023 234 215 87 -310 -133 -111 -109 -273 -44 -39 210 -152 -170 -61 7 59 -397 -300 -71 64 -57 -42 114 74 22
3047 22 -137 -204 469 -274 -6 -230 -98 46 292 -281 -109 241 11 -13 173 232 133 -62 135 103 87 95 28
3070 28 93 161 385 30 140 52 190 77 -178 193 377 -42 -50 -31 130 -62 -25 -131 -206 145 -211 142 34
3093 34 -369 -42 -180 50 -46 -149 -255 -56 128 62 -150 -93 -226 -135 42 -360 -3 -139 -39 -130 23 -79
3115 -79 197 59 -88 53 92 140 102 279 37 349 555 91 -53 541 10 51 229 240 -28 192 104 252
3137 252 213 85 228 -58 -7 390 -75 280 77 -136 123 -312 -83 -70 126 -63 -375 -182 19 6 -206
3158b06N5P3J26j21J2M8oK02n13J06K52K9N5k13k2JK4J13k28L16k45K49l13M96
3182B90k6m1p3l33J87J75j45J56j54nj30J77L80m08j10O27j74m01o2K27k04J14
3204F7j20J38p4j20J04J58l62L59k24J12Rk67L68k82L67k76k40J14K70j23m29
3225d51L82J68n23R4Q2J48j61qM06Mk27o6l61N20Q8l02K4J39n4J62K87n02J69
3248A8o9Q8j70k29K33M84l34K3k09Q29m45j64R4R8j87j47N6j28K35JJ20k86L04
3271B15o2n4J39l92J62q4J01n5N3J61m8k66k32L40K07l61r6J57J55r3L2RK8k01
3295a85J46MP5l27R1K92J6n6l16l3L45P3l69K27K68k51j32pm3K49J65k95L68j71
3319A34k17K82j82p9M02k78q7J08K19k66k2P8o3O6O5n4k83L95o6l03J39O1J56
$$ plain form
3158 -206 -151 -78 48 -73 -61 -13 -19 183 -330 -224 28 57 112 -101 -123 -122 -98 15 -213 103 -142 107 -206 290
3182 290 264 223 150 -183 4 179 34 190 36 31 -99 78 458 50 -60 567 393 -8 -70 157 -47 67
3204 67 -53 85 11 -109 -5 153 -209 150 -74 38 47 -220 148 -134 233 -43 -283 -169 101 -22 -451
3225 -451 -69 99 -424 -330 -248 -100 -261 -269 137 141 -86 -152 -513 7 95 -207 -183 -44 -98 64 351 -151 18
3248 18 -51 37 -133 -362 -129 355 21 44 -165 664 219 55 149 247 60 -87 -31 -159 76 77 197 -89 215
3271 215 153 99 238 -154 8 -76 25 -30 23 184 136 -130 -362 -22 185 -176 -272 -115 40 -53 -21 -12 16 -185
3295 -185 -39 -35 40 -287 -196 96 112 56 -260 -293 52 125 -244 -17 251 0 -132 -139 -182 67 232 -63 305 134
3319 134 -83 199 17 -62 340 62 -25 83 302 36 14 92 29 95 160 106 -177 218 152 -151 -12 49 205
3342B05k99o3M87j68j08M0m06K74l9P2P5q7K58j73j62l54K75J20K2o2L9l8J25
3365C3k72J46pP5L3l33K05K34o7k9j10J93J1M9j17R2J85l89Q7k10J43J40J35k47
3389b0J82L2j6ML2j03J22k48nJ92l54K84j65J94j54N6L75l15k63K62k84J88PK68
3413B71l05p9N7Q8k6j13Q0L72m12k13p5J39J37j36k40K62J12L5L1q4K86m4j32
3436A1Q1j08J26M8l33M22J6k76r0mM71l34L9K08n22M53k05J49j61R0M9l8k96K26
3460B2L97k79j56M05l43L27l67Mk53L33N6m31M44j26J3n2j7m43O31r8j88j59L63
3483H3Lr0k40J83L3l21K05o5J59K57m57K05O7k7l7J71n9k02m6L31j12k15J53J87
3507A66j75N4Lk06K04J24Q6j80j84J70R5J7r0k97K82j63K0O3N2k8P5k19J68J72
$$ plain form
3342 205 -94 -157 330 162 54 94 -312 -38 -77 -5 70 -17 241 68 -94 -448 -173 -53 -31 -93 -54 -92 33
3365 33 -239 -93 -100 -25 8 -325 -120 114 47 18 -92 101 112 161 44 136 321 -68 19 -191 -48 92 227 -20
3389 -20 162 194 178 182 214 111 233 -15 -20 172 -182 102 -63 131 -23 33 408 93 -170 92 -192 -4 3 271
3413 271 -34 -113 -56 32 6 -107 -27 345 -67 -280 -355 -216 -79 -215 -455 -193 -81 -46 -15 -99 187 143 11
3436 11 92 -16 110 158 -175 247 263 -13 -103 -107 364 30 69 277 -245 208 3 152 -9 81 130 92 -204 22
3460 22 419 140 -16 389 46 373 6 10 -243 90 146 -285 159 33 46 -6 -23 -466 165 67 -121 -280 83
3483 83 86 -4 -244 -61 -28 -349 -144 -209 -50 207 -250 -45 22 -5 -42 129 70 -132 -178 153 41 -174 -21 166
3507 166 -9 45 48 -158 46 170 256 76 -108 62 157 174 84 -213 69 -94 -74 -11 41 13 88 -131 37 209
3531B09m5k5r6n7L98m82K23L2p7j50j06O9J86j65L10p4j39O8N7j65kN8Q6j57k25
3556b69J69k92M61r7N3j13M44k54M6j38j22K67m38K54k3J07r1q4Q3K70j22Q3j71
3579B3j5J91o6J28l17J79J41l06l8K65J07j73q3j14K34j21N2J18j41k22J08j46
3601a96J02O8l8j18k01J28L57l4r6r2J62j55j5nM2k9j6J07m8K42l92L63m72J84
3625a52p4J63J54N6l97L44k45J82l00K75j39m6J67J28rl8PN2j63J93j63L22l35
3648a8J25O5r8L27n09L2L4J86l31L46j52K69Kk81q0O9J90l33L38q0J07j78l1j08
3672a09K13Q9l90L9K61j93K84k07j39K01O5k70j41k2L04Q5k61K00o7j73K40j8
3694ij22J60m6k29J2Q6J56O8J0J89k32L5P9j00N1j36O6P6J7Lm2o0l6j17J14j16
$$ plain form
3531 209 164 139 43 -14 384 -98 125 157 80 -70 -176 -107 79 -86 224 150 11 79 136 -29 -31 27 113 -44 -269
3556 -269 -100 -392 69 -28 25 -88 356 102 148 10 -112 155 -283 -29 -52 55 -36 -120 -37 233 111 194 23
3579 23 8 199 133 261 -56 123 264 -42 -80 185 292 119 36 -78 156 35 87 205 64 -158 -50 -196
3601 -196 -94 -26 -64 -182 -383 -255 102 68 -28 -120 42 -113 -128 -133 -91 -120 -136 -29 -77 165 -227 136 -336 -152
3625 -152 -226 -63 91 147 -250 94 -151 31 -269 6 -133 -179 -12 116 107 69 76 128 -35 158 -5 317 -18
3648 -18 107 172 74 401 -108 -76 -42 144 -187 159 7 276 278 -3 -83 -14 176 -157 181 101 208 30 -1 -109
3672 -109 104 193 -197 -158 103 -90 194 -13 -152 49 114 -156 -297 -319 -15 70 -191 9 -58 -231 9 -9
3694 -9 -131 29 -17 -246 -234 -148 8 76 86 275 43 78 157 57 108 -28 38 114 131 134 92 32 -4 -121 -7 -123
3720a23M33n7r0m03L18j98L34k34O3j02K00j76j01J50Q6n13K36K88l61N11m24
3741a63L23k39o9M9R3K0j67K32q3l03J70l9J31j32K97k2Km55n1K76J97j73K65
3764A59j35o4K17m56K40J44K81k68P6k96K05J49m32jL03R6l16J14K93k47j6O1
3786A07J28k6mL5l79J02K64j11j01K06l74Q7nj60P3K8J37m7j24R5N8l46J97n6
3810b16K71k86M3j1q6K11k51L1J74K8j38J96j11J45j42J29j71K21q6j56J16l9
3832a28K65k42J36Q5j21O9K2j78J78J20j57P0J41oq8j95Pj8L5P2j20J55K7j54
3856b5RQ6n2O9K4l23J47L7J46j64%l8J05k08K43qn5J08l41K55o9K61j69j16L79
3881C01m44q2K25l7q6L33m73L10m5o6q4j14m9L34j52M9P7J55j96k98L93Nk34L28
$$ plain form
3720 -123 310 253 163 -240 78 -120 214 -20 43 -59 141 -35 -136 14 100 -413 -177 111 -250 261 -163
3741 -163 160 -79 -148 -99 -6 14 -153 79 -4 -307 -137 -176 -45 -177 120 98 100 -355 -406 -130 67 -106 159
3764 159 24 -40 177 -279 -39 105 386 118 194 -102 103 252 -180 -181 122 218 -98 16 309 62 46 107
3786 107 235 209 205 240 -139 -37 227 116 15 221 -153 -66 -71 -231 -158 -130 7 -40 -164 -69 -11 -357 -160 -216
3810 -216 55 -231 -188 -199 -285 -74 -325 -294 -120 -92 -230 -34 -145 0 -142 -13 -184 37 -49 -205 -89 -128
3832 -128 137 -105 31 116 -5 64 86 -92 86 206 49 119 260 254 166 -29 -22 -40 -5 67 -53 102 129 -25
3856 -25 -16 70 18 87 111 -212 -65 -28 118 -46 -46 -84 21 -187 56 48 -7 101 -240 15 -54 207 38 -78 301
3881 301 -143 -225 0 -37 -123 210 -263 47 2 -64 -148 -262 -311 23 -129 -80 -3 152 -44 -342 51 56 -178 150
3905A50p5J44J48l56J55l5n0K12k2l84L5J86K59l58j30K07j78J34r7nJ17p0o7
3928h0p0J9J73j29j6J27m4q3j08J38R0j46J26k42ML94k41j57K72J66m47Q7O2m4
3952a49K66j18O6l6P0j95J35j54J37j45K85k24M34m10J56j98R6K42j00k92J88
3973E4K59l5n52K54K06k64L29l82J49L64j33o42L92l3K55l47K03j12N8J60k15
3994c2J71k3p7k79L45j97L7J70l98J86o9j15J99j32K3J78L27m11k25M04J79k62
4016aj35K03m0JJ12k84M3J10j1O2j66Q2J66kj77J78Q8k50J26L2j42J95j0K9j67
4041D2J14K9j20J62j09Q7m58Q8J67q0K40j05O7p3N3k71L18l67K44K00l80j99M93
4064A42m7l5k95Q5k20N8L37N6j03k07K56L6n3j59kO0J58Rl57J29K29l18J48J73
$$ plain form
3905 150 75 219 367 11 166 131 81 293 271 -113 -78 108 367 9 -121 86 -92 42 -55 -60 57 -13 -80
3928 -80 -150 -131 42 -87 -103 24 -20 -103 -211 -73 17 -129 -3 -245 -241 153 -88 -245 27 193 -254 -167 -105 -149
3952 -149 117 -1 65 29 99 -96 39 -115 22 -123 162 -62 372 -38 118 -80 16 258 158 -134 54
3973 54 313 278 -274 -20 186 -78 251 -131 18 382 249 -393 -1 -34 221 -126 77 -35 23 183 -32
3994 -32 139 116 39 -240 105 -92 -55 115 -283 -97 -166 -281 -82 -214 -191 -13 314 -97 -322 82 261 -1
4016 -1 -136 67 27 28 140 -144 -101 9 -2 60 -106 -24 142 140 -37 141 229 -21 105 137 -5 190 180 209 42
4041 42 156 185 65 227 118 205 -253 -165 2 -78 162 57 124 51 104 -167 151 -216 28 228 -152 -351 142
4064 142 95 60 -235 -150 -370 -312 25 81 -22 -229 27 63 10 -149 -151 -91 67 76 -281 -152 77 -241 -93 80
4088H0K02j15l83P8J68N9L2l3k5n3J56j1p1L61Nk55Q4j70k01M4r7L50q6PJ56n30
4114b48K56L9j40Q7jr9l36O74m21L65j66K9k02k8J59k85Q20o68L9J48Q3r8m5j89
4138b27K68j87J66j78K64k49K63p7k38J43j44M37l07k26m4J29J62l4J03J26k84
4159a34Q0J81j18n3R5J9J26l02K56j28j49M13r0J19k08j37J0M02n05K81j62k2
4181b6J21r4l52K86j25K23J04k04P5j17k7K99j11k40J58Q6l66J54M04m47o2P0
4203a91P4k30K84n1Q9J1J24k30j1J87j37K5Q6n5K2K61n20K32N5J50k14K40l06
4226a05K15n5J4Qj3j78J26K14k48J29q2P7J30j5j72O8Q2q7J04K4j70P6l57J10
4250a05J88l42K42R6q7M1P4k70K1J13J58k25k74O6L9J42j11L29np4k77O22k35
$$ plain form
4088 80 282 167 -216 -138 30 89 121 88 63 10 166 155 84 445 450 195 279 109 -92 -48 -145 205 119 126 282 -248
4114 -248 8 47 -93 -6 -7 -106 -442 232 -189 176 10 39 -163 -191 -32 -317 503 -165 -126 22 105 7 -38 -227
4138 -227 41 -146 20 -158 106 -143 120 43 -195 -52 -196 241 -66 -292 -336 -207 -45 -79 24 150 -134
4159 -134 -54 127 9 -44 51 70 196 -106 150 22 -127 286 196 315 107 -30 -20 382 -123 158 -4 -26
4181 -26 95 1 -351 -65 -190 33 137 -67 8 -109 -136 163 52 -188 -30 56 -310 -156 248 -199 -261 -191
4203 -191 -117 -347 -63 -114 -25 -14 110 -120 -131 56 -81 -56 30 -25 -3 258 -262 -30 25 175 -39 201 -105
4226 -105 110 55 69 77 64 -114 12 226 -22 107 25 102 232 217 45 113 195 108 212 236 66 142 -215 -105
4250 -105 83 -259 -17 79 -8 33 107 -163 -142 -29 129 -96 -370 -304 -265 -123 -234 95 90 16 -261 361 126
4273A26k34o9R7j38K00k27N28m37J78K21k59O5n1j05p6K74L8j66r7N15l43kk30
4296a92K61j42k45M34j2N1oj00P8R5j25k00K79k33mL19m58P2L24l43J62j71J85
4319B9j81N3L3J12j60j41K42J23r8K52K7m72r0p4K58R4J44k38L5J55n20M37k00
4342a80L11l57n1L86j53m8J25N7l33J20J59j62K93n6j37j10M44l83L29j79o8j07
4364a00K56k99L44k6p9l10L75J14k78J3J13k04k7MJ97n2p4j59J15N1pJ10j59%
4388h2k8j65J89J79k61j34K99O6j19MQ7J01L3l88L23P5k99k07L12R4j42j44L17
4411A10k55n5L8q8K28J9J8J86k56O5o6K3k73K71K06m55M04J23j35J30k28m3Q4
4434E1j24K01qj00J25J28m66L30l72K92k05k0K75q9k6Q7j06p0l5K72j75P2p7J19
$$ plain form
4273 126 -108 -177 -80 -218 -18 -245 283 -154 24 245 -14 51 0 -105 -181 93 131 -35 -132 383 40 38 -192
4296 -192 69 -73 -318 116 104 155 149 49 127 222 97 -103 176 -57 -61 258 -200 -128 196 -147 15 -156 29
4319 29 -152 -99 -66 46 -114 -255 -13 110 12 264 291 -181 -271 -345 -87 7 151 -87 -52 103 -417 20 -180
4342 -180 131 -226 -277 109 -44 -92 33 90 -243 -123 36 -126 167 111 -26 -136 308 -75 254 75 7 -100
4364 -100 156 -143 201 175 96 -214 161 275 -3 10 123 -81 -108 -104 93 41 -33 -192 -77 -26 -33 77 -82 -82
4388 -82 -110 -275 -86 93 -168 -302 -3 63 -56 -52 35 136 169 -219 104 179 -120 -327 -15 79 -63 -207 110
4411 110 -145 -200 -162 -250 -22 -3 15 201 -55 10 -56 -33 -306 -35 171 -284 120 243 108 238 10 -33 51
4434 51 -73 128 120 20 145 273 -193 137 -235 57 -148 -168 107 18 -8 79 -27 -97 -132 140 -35 37 -40 79
4458G9j71o7N5m9J68j20nj37M09l63k6o2K45Mk7j36Q2O4K56j10n8p7K45k90m5
4483a36j43K09n3N7L1r8M9J91M1m43K51K75k94l9J74J02l26K15o5J0M68k83j83
4506A0m3j82L16m0k16K04m8K46k52j18R1J36j46j30KR3J7j14l9m8K02n6qk00K
4531c21K63m0R3r1L47m86N5L06k05K50l43q4P8K15j15J03p1M5j9J13n0l8K17j77
4555D5oJ42l59K5M52k20l2J64R6j86R8k45k77L68K89l15L31n86L30q3M8k68N3
4578a36K76m5j49J74k16k12J89K92j15j13J28j55l45K09j30K07K86k68K61l45
4598b07L54j64m3J86j36lJ04k28O1k3O5L13j86j02j26J77j36K1J84k66M44P5k53
4621A11p8K29j21l2m9j6P8l03L26P7j10p8L36k38j87M25O3m03J7k16KJ97j06J18
$$ plain form
4458 79 -92 -159 -104 -153 15 -105 -110 -247 162 -201 -227 -289 -44 -40 -67 -203 -121 -57 199 89 31 -46 199 -91 -136
4483 -136 -279 -70 -123 -66 -35 -133 -84 107 148 -295 -44 231 -63 -102 72 174 -152 63 -2 8 476 193 10
4506 10 -33 -215 101 61 -155 49 1 247 -5 -123 -32 104 -42 -172 -170 -77 -60 -174 -213 -261 -59 -115 -123 -323 -321
4531 -321 -58 -98 -5 -96 251 -235 -180 126 -79 171 -172 -256 -178 37 -78 25 -46 -1 -20 93 43 5 222 45
4555 45 39 181 -178 -153 299 79 47 211 307 121 219 -26 -303 65 354 39 370 -216 114 31 79 -189 -136
4578 -136 140 95 -54 120 -96 -308 -119 173 58 -55 73 -82 -427 -218 -348 -141 145 -123 138 -207
4598 -207 147 -17 -60 126 -10 -13 91 -137 -76 -99 -34 279 93 -9 -135 42 -94 -73 111 -155 289 364 111
4621 111 33 262 141 109 60 44 122 -181 145 222 112 34 370 132 -55 370 433 30 47 -169 -167 30 -76 42
4645D2l12L91j0j58J38K44l44rl2L8n8j20O1j0L3q7N3r0K13j56M7j87M63k01K0
4670c1K2J32m1j77J78j34Q2J60m06m2L63k94M34j98K32k28R8j5r6M13k06j84R9
4693A61r6j33k59L36o9k35M64l66J57K35j04J3j54k0LJ80j04l41N20n7j08j45
4715a22J21k36p4J16Mj12L90m05J57K37m6l26M09k94J28J40k28o4J86K79m55R6
4737i9J8k58M56j68J18JJ22j5l71K64L12l33M15n49N6K1j33K68j96K7Q3r8q4L50
4761B07k99K57q2K3J19k17K10j65%m68M33j3R1K29k97l6n6Q4N3j8j4K5j74J06
4785bn8l6n7J68P1m8pj61m8J03J89R8j55j44P8j22J76q7J50Q0l13j57M13k30M06
4810C07k34Q5l23J40j49J25J57QJ09j30K33l59J69q2J59l46M0J97k3J44l90L23
$$ plain form
4645 42 -270 121 111 -47 91 335 -9 -18 -50 -12 -70 -190 -129 -139 -106 -193 -140 -230 -17 -173 -126 -313 150 -51 -31
4670 -31 -9 123 82 -95 83 -51 31 191 -215 -257 106 -188 246 48 280 52 150 135 39 452 246 62 161
4693 161 65 -68 -327 9 -60 -295 169 -197 -40 195 91 104 -50 -70 -67 113 9 -332 188 131 23 -122
4715 -122 -1 -237 -311 -195 -191 -303 87 -318 -161 76 30 -296 113 -181 -53 87 -141 -205 -19 260 -195 -99
4737 -99 -81 -339 117 -51 67 68 190 175 -196 68 380 47 462 -87 -31 -10 -143 125 -71 -44 39 -59 -143 207
4761 207 -92 165 83 106 225 8 218 53 53 -415 18 5 96 325 28 -8 -64 20 73 55 41 66 -108 -2
4785 -2 -60 -96 -153 15 86 38 31 -130 -178 -75 114 212 57 -87 -9 -131 45 -42 108 188 -125 -282 131 -99 307
4810 307 73 158 -165 -25 -174 -49 108 116 225 95 328 -31 138 56 215 -131 -91 106 83 227 -163 160
4832A60j93k29K22j02K34j5k48K43m59M75N7k70J92j14K71o5m76L14Oj21l5o1
4854b14N5L72m00O0J1K7j56L12r7n4K22n97L99K77r8l11qo7M17J61j83J1j05J84
4878B18j11k6K47r2Kk20J59k40j0J39L6K14k86J16q0ok09L4L12k26q2m6N4J85
4902H2J46J25m61L3O5N9k6J0J05l02%L1J01L8J1M2k41K48k09l87P71j63J36l28
4926a14J27j54r1L30m42L18N0J32l23M04k75l8L58l52R5K62j78R5l88L12j12L7
4948E3j70J26J04k9n1l4j60O4K79j83K82l2j90j05K05M5k82K3J43k80L14J27o3
4971A86l95M15k58J5j24Q7r9j36L15k7j59J62J54k44j36L11k72o7J91K10k81K21
4993F9l34J94R3J05l09Q2o1L20P1m6J25m07J34q0K22J24m33P19m89l02L58j9k68
$$ plain form
4832 160 -33 -262 -40 -142 92 77 -171 72 -387 88 145 -125 67 -47 224 159 -317 -3 3 -118 -153 -214
4854 -214 -159 213 -187 -127 -116 -89 -245 67 -30 -84 138 -459 -60 217 119 -192 -200 -267 150 311 128 139 34 218
4878 218 107 81 328 236 238 18 177 -63 -73 66 102 316 30 146 66 60 -149 -115 197 -29 -111 -157 -103 82
4902 82 228 353 -108 -75 -10 49 23 33 138 -164 -164 -133 -32 6 17 59 -182 66 -143 -530 241 78 214 -114
4926 -114 13 -141 -232 98 -344 -26 24 156 -167 237 -38 -76 282 -70 25 287 109 204 -184 128 16 53
4948 53 -117 9 113 84 33 -1 -161 -97 182 -1 281 249 59 -46 159 204 -78 -55 88 -192 122 249 186
4971 186 -209 206 -52 -37 -161 -74 -173 -309 6 -21 -180 -18 136 -108 -244 67 -205 -272 -81 129 -152 69
4993 69 -265 -71 22 127 -182 -100 -161 159 230 184 309 -98 36 -44 178 302 -131 588 99 -203 155 136 -132
5016a32J96n0K39l68J68l31L85j91pr1L06J51j08l16KM21k87n2J72k76k8K17j70
5039a50J52n3j38j14J93K29j38k41k00L79Q2j08M3j77J64K1J00o6r9K14l04J08
5061a03J12j41J2J3P1J90j28m02L22K08j33j57n4L24j09K34m24K52J8j87L95m79
5083a66R3K59J02l26J52J28j94j9L34n02L87m21O8M62m47K4J08p9k13L15J0k61
5105a86P2k38L33oj20k1J48j43N7Q4l3p0j15K38j68L2J44J50j51J44k71N1J12
5128D3J49l88J55J57K28m52j45M77O7k04o5M3Q2Mj77J71j97K16R2l04j73K61j26
5151h6K83k57j75K96J52l72n3K66l1J42l2l35L17j28o1j14Q6J59j85K0r0K91n7
5174C6j69rj37P9K24Q9k95m4K77J5m2J76n66K65J73k86K47j04m1L96o3P2k66k28
$$ plain form
5016 -132 64 14 253 -115 53 -278 107 -84 -91 -182 124 275 167 -149 -147 274 -13 -65 107 -169 -197 20 -150
5039 -150 2 -51 -189 -303 -110 119 -19 -260 -460 -81 1 -107 -64 -241 -77 -56 44 -22 -121 93 -211 -103
5061 -103 9 -132 -120 -107 -36 154 26 -376 -54 154 21 -136 -190 134 25 259 -165 87 105 -82 313 -166
5083 -166 -73 186 288 -38 114 242 48 29 363 -139 248 -173 -105 357 -90 -66 42 -37 -250 65 75 -186
5105 -186 -114 -352 -19 -25 -145 -166 -18 -161 -104 -20 -53 -123 -238 0 -168 -136 8 158 7 151 -120 -69 43
5128 43 192 -196 -41 116 344 -108 -253 224 291 87 22 65 147 151 -26 145 -52 164 256 -48 -221 40 -86
5151 -86 197 -60 -235 61 213 -159 -212 54 23 165 133 -202 115 -13 -74 -188 -102 57 -128 -108 -198 93 36
5174 36 -133 -142 -279 -200 24 113 -182 -226 51 66 24 200 -366 -101 72 -214 33 -71 -112 284 221 293 27 -201
5198b01L61k76O2L6j35L16k0k0Q3r4P9o4k0k18Q0J35Q9j08j23q0J83L5l27J66
5222f1j01o1J97J68l15O1K24j17k61J75p4P7L2K4p5O7j27L4J07j59K04m4k04J68
5246f1o9m5j4n5K26l9o3J26J58k36q3%J34J73k30r9L19j93J09p2l65M00l7L2K02
5271B18l78J89L93l62L6q6Q5j67k10L53k00M11n11l3K89K5N3q2J21k10KQ2r9O7
5295a4K09l58L24l79K18m8p5L9KJ32r9J1r6J36M5J23n2m13L23j89L54j42Jl5M6
5320F3j7Nj18j68L67J46m52J71MJ8R8J90k65j58L02j56J55k87L50k20K7mJ74m34
5344b09J17J23k21J00P8K10k25P5N0m07M20j26J47q5j96J08j01P6m9L68k79o6
5366i2J05j88J37l9K7N2k3pj81K70j02j08j63L59l8k11K47r1L4j89K02p7j21K28
$$ plain form
5198 -201 160 -116 -54 -18 -153 163 143 123 206 112 191 127 107 -111 -31 104 193 85 -38 -118 65 100 -227 -61
5222 -61 -162 -223 -26 142 -173 -112 112 -5 -266 -91 -165 -88 -56 -32 -107 -40 -167 -133 -26 -185 19 -25 -229 -61
5246 -61 -130 -175 -189 -244 -18 -57 -120 6 164 -72 -155 -155 -21 152 -78 -177 142 -51 58 -14 -379 21 -16 16 218
5271 218 -160 29 422 60 96 10 95 -72 -282 71 -129 282 -229 -262 27 52 105 23 144 -66 -64 18 -81 -14
5295 -14 195 -163 161 -218 0 -48 -123 -84 -82 50 -49 -38 -134 2 47 170 118 -295 28 -161 193 51 52 17 63
5320 63 46 51 -67 -235 132 278 -174 -3 1 19 117 307 42 -116 186 30 185 -102 248 28 55 51 225 -209
5344 -209 -92 31 -190 -90 -12 198 -27 48 98 -309 111 -15 132 47 -149 -41 -142 -66 -115 253 -26 -92
5366 -92 13 -175 -38 -77 -50 2 -21 -28 -209 61 -41 -149 -312 47 9 -202 45 -46 -12 -201 1 -76 -197 31
5390C1m6q9l3J22k82K68j7N3K4K9K08k78R5K5J39m16K99P0o6k90K08J7M9n6n1
5415A3K76k30q4K7J46k20K25k62L49k24p5n3J15J17j16j5m11N93m48J36J49k27
5437b19K35J86p4j93M3P2j38J53N7l25K67k17K06l3J28p7o3k16J28J24N0k84J94
5460DM5k5p9PL72l28O9l3J9O2opl5j05j21J3J03m1K26N4K9j87R9l14L21j03J41
5487A80j22P0q0k2J1P6j59N9p5L0j94J15K10qj27k6p6J85J37j2j78J02k25J60
5511C1k43J15K08r6K60l01p4l1M45j62l3l44J96j96L42l04N3O3J51K53k37m18
5533c22M51j03K42j9k97J4j09K88N5m38L09J38j13l06Q2L25j86n4P1j01j38J82
5555b9j52K85j55J0j06K18k61J05j5J53R9j57k77K22L0K24k28j44K6J41P5K4q3
$$ plain form
5390 31 -15 -104 -137 -15 -297 -29 -46 7 31 60 268 -10 85 110 249 -167 132 202 136 -154 54 71 120 64 13
5415 13 289 59 -25 2 148 -72 153 -109 240 16 -59 -112 3 120 4 -11 -422 171 -277 -141 8 -219
5437 -219 16 202 128 -65 -22 50 -88 65 122 -203 64 -153 53 20 148 71 8 -208 -80 44 94 -190 4
5460 4 49 24 -55 -48 324 -4 65 32 51 113 107 100 65 -40 -161 -148 -45 -86 140 194 223 36 135 -179 142 39 180
5487 180 58 128 48 26 37 113 -46 13 -62 -32 -226 -111 99 91 -36 -62 -138 47 184 172 -6 96 -129 31
5511 31 -212 -97 111 15 275 -26 -100 -131 314 152 119 -225 -29 -225 117 -187 -134 -71 80 333 96 -322
5533 -322 129 26 268 249 -48 -34 -143 145 200 -238 71 209 96 -210 -128 197 11 -43 28 -73 -211 -29
5555 -29 -181 104 -51 -41 -147 71 -190 -85 -100 53 152 -5 -282 -60 -30 194 -34 -178 -152 -11 64 88 5
5578EJ25o7M4m1q7m4J68l9J46k69J93r6L8J48j41l04J68P3j18J60K6j24L3K5R8
5603A20pk18J00P4j90J25k18J54K35q9j4r0K18m48J54j10M8k6K91j59K34j91J70
5626A63j71K78n56L24j32o8J00r6K77k61J18K48k84p9J42N9k54K47K47l98J00
5647DO2k50Q9K3R6Q8j38k46L36J75j60J8J49l86K94O1l23K57k25L06o3j3k18k5
5671h9K2N6Ok62L20j17K58j44K9O2j29r6j22K01JP0j57J68k00J29k05K40R3k17
5695h3J98J46k46k09Q5m9NN8p5J9k01L44lm52M75o2J13k84L23J40l66K16J5j94
5719h7K18mj28j35J55j16J23J25j06n4l4J66J46l75J02n5J94M7p0k03J26J21o6
5742I0J75m56L13j08k15J12K94k88K40o4j25r6L9J59j46k8J89k35J17q5p0K50
$$ plain form
5578 5 130 63 107 66 -21 -65 103 64 210 -59 134 38 76 224 83 -221 -53 20 -98 62 88 -36 -3 22 120
5603 120 113 -105 -5 69 -121 4 -214 -60 175 86 72 -18 200 -248 -94 -204 -156 -182 109 -50 184 -7 163
5626 163 -8 270 -286 38 -94 -162 -62 -158 119 -142 -24 224 -60 -139 3 62 -192 55 302 -96 4
5647 4 66 -184 -95 -72 24 112 -26 -272 64 239 79 97 246 -140 154 215 -108 149 -76 230 167 154 -64 -89
5671 -89 -67 -11 -5 -267 53 -64 194 50 79 141 12 -84 -206 -5 -4 66 -91 77 -123 6 -199 41 134 -83
5695 -83 115 261 15 -194 -109 -158 -153 -95 -170 -151 -352 -8 -11 -463 12 -50 63 -221 102 242 -124 92 107 -87
5719 -87 131 127 -1 -136 19 -97 26 151 45 -9 -43 123 269 -106 -4 -59 135 182 112 -91 35 156 90
5742 90 265 -191 122 14 -201 -89 205 -83 157 93 -32 -128 -89 70 -76 -104 85 -150 -33 -118 -188 62
5764F2j31J02q8j21jJ08kJ14L8q5j52K26k45K99k22J17k04K25J33k88L75j48l2
5787H0j56j06L90k24R1lK7q6k22J34K6J25j00l4J38L1k68L32j95QJ79j98K00J03
5811B72k22j08J40j3j07o1J35J9j8k96N70m05P2j15k3J00K42k84p4K37M3m05O40
5834C39k51K2K8k65J4J42j5K97l49P6J79j70K13k83Q2K83o54K74p5L36m71L19
5856G1lO4q8j03K37k19m8j33N75l24q0J86l04J80J5m6J54j67j55K71k26K68K04
5879C29l97J64m16L57J36k36j24K1j9L99l78K55j27JpJ14j89J12L85l76J2J52
5901A68l00L58k98Q1oK1Q2q3r7L75n32N33o0k23J57q2m1o8j2j73L62j99j02J29
5925a0J28j4o3J09j25j7R1j15O9j40K85l20J21J25k74J46K14j16k04K72j7o7j42
$$ plain form
5764 62 -69 33 -55 -176 -177 -69 -71 43 81 -4 -156 70 -175 124 -98 19 -185 40 173 -115 260 112 80
5787 80 -76 -182 208 -16 75 72 99 13 -209 -75 -49 76 -24 -58 80 111 -157 175 -20 -12 167 -31 169 272
5811 272 50 -58 82 69 -38 -99 36 55 37 -259 311 -94 -22 -137 -160 -60 182 -102 -176 61 104 -301 339
5834 339 88 110 138 -127 -113 29 14 311 -38 38 217 47 260 -23 59 342 -312 -38 -113 223 -248 71
5856 71 68 132 44 -59 178 -41 -89 -222 353 29 -51 135 -169 11 26 -20 134 -33 -188 83 -143 125 329
5879 329 -68 96 -320 37 173 -63 -187 -166 -185 214 -164 91 -36 -35 -42 72 -117 -5 380 4 16 168
5901 168 -132 226 -72 9 3 24 106 23 -74 301 -231 302 242 19 176 94 53 -15 -27 -200 162 -37 -139 -10
5925 -10 118 104 41 150 25 8 99 -16 53 -87 198 -122 -1 124 -150 -4 210 94 -110 162 145 78 -64
5948f4n9J75k29k40N40l1j04p6M72n60o4M41n11K02j27J70L1q2K5rq9J74o6q6
5972a67J77J55k36j5o4Q3L4K8k0j03O1q5J37O0P1O3m94M79k22l9J05k72J13K10
5996E9r3J53n5l7k1N4p3J42P9k19K09k49K34l99q4K16n5L19j12j19M47o48P03
6019D51l61p7j56J41L40n58J37J3J22j59K06j84K27j14k36K51l09K85J1J06j54
6040a8J5m3%k9J02n7J6J08OM3n3j85j8J16J11m44K35Q5L8L7o0J06m1J88m98L44
6066A04j87J6J34k23L9K65k3j37o9J28k5j10K45j10L7m4k58J34J66J36k88o2L09
6089A77k36K32l72J82q6K13j64r8J71R1k27%ML4J99j75Q7rk32K8L47j73N5l63
6113c15K75o1J98r7J70N2j19j86J68l3N7j04K41l25J24Q2m48L11J0P4n0k86J38
$$ plain form
5948 -64 -123 52 -177 -417 123 92 -12 -88 384 -176 -240 201 -310 -108 -235 -65 -34 -116 -91 -100 -189 -15 -81 -167
5972 -167 10 165 -71 -86 -150 -67 -33 -5 -25 -128 -67 -152 -15 45 116 179 -315 164 -58 -97 8 -264 -151 59
5996 59 -34 119 64 27 6 60 -13 129 208 -11 198 -51 183 -216 -300 -84 -139 180 68 -51 396 -252 451
6019 451 90 13 -143 -2 338 -220 -83 -70 52 -107 99 -85 142 28 -208 43 -266 19 30 136 -18
6040 -18 -3 -46 -46 -75 27 -30 -14 94 100 143 90 -95 -113 3 114 -330 -95 -10 28 65 5 111 70 258 -240 104
6066 104 -83 -67 67 -156 -117 148 125 -12 -81 47 22 -88 157 47 84 40 -218 -84 82 218 -70 -132 177
6089 177 -59 173 -199 -17 -103 110 -54 -152 19 110 -117 -117 -113 -79 120 -55 32 23 -209 -181 166 -7 48 -315
6113 -315 -40 -101 97 0 170 222 103 -83 85 52 109 5 246 -79 45 127 -321 -10 0 74 24 -262 -124
6136a24L05R9j71l1j19Q7P8n71M44J25k01K56j04j52L07n4k55K75j18J29l85k2
6158b02jM25j30J4k16K37k6J31l80j36L08l27N80k11j96J53Q6Q4lj64OJ29j68
6181gP9k15l3J97r4K72j39k8k40L50o7p0r7M7L6K7K04k45M6j67j04L82j12j82
6205a60K26L2Q5k32j51M34l36o7K54O7k27L4K61k82k07l7K41J01J34k18J18k5
6227D5J81k58j73L44J63m39L03k74j82J00P1J82l12K70L22m95N5L39k43K0k9Q
6249bq0K56l3J59k74J38l16J75j29K54J43k03j41L49M1l01l9O2k18j4J43K36k18
6272a2R1p0J48j71J10J09j59k4j10J0lJ65j74K30r3J05j12k1N6p9L10m08k23K67
6296e8j79J62Q8k0K92n7l96O1J75m7Q5l5O7l10J6L72k86K78k01l4n0n4M5N5k04
$$ plain form
6136 -124 181 280 109 78 -41 46 124 -447 -3 122 -79 177 73 -79 228 174 -81 194 76 205 -180 -202
6158 -202 -203 222 92 106 -110 127 101 232 -148 -284 24 -303 277 66 -130 23 109 193 190 26 32 161 -7
6181 -7 72 -143 -176 21 -73 199 60 32 -208 142 75 5 -92 -45 -9 18 222 -23 23 -144 -248 134 22 -160
6205 -160 66 98 183 -49 -200 234 -102 -169 85 152 -75 -41 220 -62 -269 -306 -65 36 170 -48 70 45
6227 45 226 -32 -205 139 302 -137 166 -108 -290 -190 -119 63 -249 21 343 -152 -97 242 -1 19 -10 -2
6249 -2 -82 174 141 300 26 164 -152 23 -106 148 291 88 -53 296 337 36 -3 59 -159 -173 -30 206 -12
6272 -12 79 9 157 -14 96 205 46 22 -88 -78 -81 84 -90 140 47 152 40 19 75 -4 306 -102 -325 -58
6296 -58 -237 -75 13 -7 285 228 -168 -107 68 21 106 71 138 -172 -156 216 -70 208 7 -27 -77 -131 -86 -31 -235
6321b35J04K34J8Lk32NL26k45J13r8j50J56j31K47j02j72q0K78j98K77j38K32
6343B12j70J2j02j61Q4J66k23J6L9o8K05J01k38M54k69J15j18p2J90j23k49K14
6365A5J25k04r7N8L90m48K98M5k96rK14j0q3rq8l39N54j51m8L10j11o1L1j44j00
6390a58K16j2K82o08J75J20Qr2L61l21j46J88l55n2K57J93j72k06K76p7K77j60
6412fQ7m0lj6k44K77q1J83Jn56M49J76k76j04L14k14J9j1R2N1K30n89K77j42K84
6437A58Q2k42K32m0k94Q0R1k73N56l58p9K52j03j04J61M9k56K89K0j65R8k01K28
6460A81PM7m7j95R9j20J36l8J6j71J01J4p9q0J58J12j33R1k14o7J30l5j1J92n8
6485C6l74J32L01L5k54k9LM20l85P0p8NP6l19M15j12J26k8o1k40K11P5J19K37
$$ plain form
6321 -235 -131 103 121 124 -108 -103 223 -22 91 -7 -157 -1 -132 115 13 -159 -239 39 -159 118 -20 212
6343 212 42 54 -48 -209 -125 41 -182 -166 -127 -195 10 111 -127 327 58 173 55 -17 173 50 -199 15
6365 15 140 -64 -161 -103 287 -161 137 182 -114 -123 91 81 -2 -11 -99 -438 116 -35 -83 227 116 55 86 -58 -158
6390 -158 58 46 328 -280 -105 15 23 -69 292 -29 -175 13 -342 -394 -137 56 -116 -322 -46 -123 154 -6
6412 -6 81 41 38 22 -222 55 -26 157 158 -398 51 227 -49 -153 161 -53 -34 -45 47 98 328 -261 16 -126 158
6437 158 240 -2 230 190 -104 -24 67 -206 350 -8 -87 165 62 -42 119 168 -88 201 221 56 154 -47 181
6460 181 188 235 188 -7 92 -28 108 70 86 -85 16 30 -49 -129 29 141 8 99 -115 -182 -52 -87 -98 94 36
6485 36 -338 -206 95 130 -124 -153 -150 270 -115 -45 -123 -118 -42 -361 54 -58 68 40 -21 -261 -50 25 144 381
6509C81k79l75M91j04o4K6Jj18m0M1M5r2K17p2M8j34J2J38k44J83p6J42M2K4l06
6534a13O8J34k22K98k07J93j93m6K37k21l3j2K20M1l06J1L49j08j36J41j21n6
6556h2K12k68K01k55Q6L7k74L00K09l9j60J55j02J84k0r7r2J2J34j04p0j33K22
6579E6K20k88j81L0J94j8J41p4Q7j10m4k7o8j74K75Qj82m0L62m19M93k13n5O1
6603C4j57J40Q1j76k0K90j67k58J08j3J36j7J07n3k15L03j73j45J52J59k96J05
6625g5J17j64J08j77K25k13J31K55j89P1J50l26OK31k10K47r7R7k36K11j19J56
6647A99k82M0J42Q0m14K45J14K85k24j42L7qr2Q9K04r4j0m64J23J15K92l89J45
6670iL1m7k02J87k32L28J67m88J40p2jn2M27l75J58R0J38k75j25K72L8j71J42
$$ plain form
6509 381 102 -273 218 114 50 76 77 -41 -81 -40 5 -87 130 58 106 -28 -16 122 -122 61 -15 127 169 193 -113
6534 -113 -45 89 -133 165 -42 151 -42 -88 149 -72 -105 -117 103 144 -162 -151 198 90 -46 95 -26 -82
6556 -82 130 -138 63 -192 -106 -69 -343 -43 166 127 -33 122 20 204 184 87 -5 7 141 37 -33 -166 56
6579 56 276 -12 -193 -163 31 13 154 80 167 57 13 -14 -82 -256 19 27 -155 -195 167 -252 241 28 -27 34
6603 34 -123 17 98 -78 -98 192 25 -233 -125 -138 -2 -19 88 35 -180 123 -50 -195 -43 116 -180 -75
6625 -75 42 -122 -14 -191 34 -179 -48 207 18 89 239 -87 -81 150 -60 187 90 187 -49 162 43 199
6647 199 -83 -43 99 179 -235 10 124 409 185 43 80 72 -20 69 273 179 169 -295 -172 -57 235 -154 -9
6670 -9 22 -25 -227 -40 -272 56 223 -265 -125 -197 -198 -250 177 -198 -40 50 188 -87 -212 60 98 -73 69
6693F9K51k87j17J68k69O0K04j04qj7J95j14k81L21J46k91K07j83n1J81m78O92
6715B94J2l88M3j37J20k33L34R8k34o5K32l40L99k2k37K03l47K25k30J86K64m11
6737b34M0K11M1j24p3L10l40K28k68q1K08K9p6J33j61M59m17q5L3M2K76l49L20
6760A22p7k28J98L3N2j37J00k46K12L2J78l44J39J73l22K68M9l6k88L7L77j19
6782A73j96K44k90K3n5J01K94j1k64l9J28k28J76K25j42k54L09k0j11L8q9J14
6804A26n9J4n2r6pon8M9K86k85K1N9J72j08q5J17j65K44j27j27j4M8J53P0l6j21
6830A3j26j24L05k04K03MJ37K3n57M66r6k64J05K21M1p4K54j72k08K9L6o4j22
6853a74K86j52q5M3l6P9K01l94L14p0k55K26J56j03J15j46L1l15j29K39P0J89
$$ plain form
6693 69 320 33 -84 84 -185 -125 79 -25 -33 -50 145 31 -250 71 217 -74 133 -50 -101 80 -398 294
6715 294 306 -82 -39 -176 -56 -289 45 143 -91 -156 76 -264 135 113 -124 79 -268 -43 -273 -87 177 -234
6737 -234 -194 17 58 -66 -139 171 -169 59 -209 -290 -82 -53 -129 4 -157 302 -115 -200 -167 -125 151 -198 122
6760 122 45 -183 15 48 100 -37 63 -183 29 61 239 -105 34 207 -115 153 202 166 -122 -85 292 173
6782 173 -23 221 -69 -46 -101 0 294 283 19 -20 108 -120 56 281 139 -115 194 174 63 101 12 126
6804 126 67 81 29 -67 -74 -80 -138 -89 197 -88 -67 -8 164 56 -29 88 -77 167 40 -87 -101 -53 100 170 134 13
6830 13 -113 -237 68 -136 67 71 208 231 -326 140 44 -220 -115 106 147 73 327 155 -53 -24 12 -52 -174
6853 -174 112 -40 -125 -82 -118 -39 162 -232 82 12 -243 -17 139 36 151 5 36 -279 -408 -169 -99 90
6875I0J60j66k15K66j1j98O1MJ02l9P0j97L00n82J77K97j61J01J70j61K2p9k3
6898a2pjK88J75k31o2r0j73L22k61K52N8k36j46K27rJ14N1j60o7J7k33K39m18
6922c63N20J7j23j50L00k38J5j08L75m52J55J27O7l14o4L78j12o5K35j76N7R4
6944A75rj86j79J26J74l7k47Q4l9N0J28K27l32o7J93j37K86j85P4j40j04L18j81
6967hK83l18j9K67l81K99j50j84K58n4j2K28l69L7J15Q1k05L05k66J06j86O5j00
6990b08J11J98k03K16o3j14j81P4J58o6o1j18K1J42J69m5k36L30j01l27J58K72
7012A26m52J12J59l3q1J75o7L2j91O1p3L77J98l73k28L1L93k32LL9j13J95K27
7035B85j23j13k13P8K25r3j27K38j70P5j39j85J57L14j48l48K60J14k48R8q8J92
$$ plain form
6875 90 250 84 -131 135 124 -74 -13 -9 93 54 124 -73 227 -355 -178 119 -42 59 229 68 90 11 -12
6898 -12 -19 -20 268 443 212 150 60 -113 209 -52 200 258 22 -124 103 94 208 259 99 32 49 -184 55 -363
6922 -363 157 174 51 -99 201 -37 -22 -130 245 -207 -52 75 142 -172 -236 142 30 -35 200 24 81 175
6944 175 166 -20 -199 -73 101 64 -183 -99 -138 -88 40 267 -65 -132 61 -76 210 25 99 -41 -145 173 -8
6967 -8 275 -43 -62 205 -176 123 -27 -211 47 -7 -19 209 -160 -123 -8 73 -132 173 -93 13 -173 -108 -208
6990 -208 -97 101 -102 114 51 -63 -244 -170 -12 -78 -139 -257 -236 -94 75 30 -206 124 23 -304 -146 126
7012 126 -326 -214 -55 -88 -169 6 -61 -29 -220 -159 -232 145 343 -30 -258 -227 166 -66 -63 -24 -137 58 285
7035 285 162 49 -164 -86 139 46 -81 157 -13 62 -77 -262 -105 209 61 -287 -27 87 -161 -63 -151 41
7057D1qrl9j07m8K33K2l91L53l06M32j02j49L59j58j36PJ68j40L4K06l90J93m4
7081B1k37Q1K10Lj92L3j4R3L3K12m55J70n0j01J32o6M30k83k32K13lo6L22m89
7105b35L74j82N8n4M8j19J7J13k99L91l0p6j0j42J93jJ16k71M4K07j52%j24J02
7129c2J01j20J71J4q5n0j07o0K75l38J96j24N3K92J20m99M08m8j86R1l1P1k89
7152a77J36O2J62m09K21J42K9M3l05J49j9O4j88J03J9J70l14J34m5j4J03j55J33
7175D4j91MP7J01MO6J49n5j76k25K23k09N8n3J81J41q3p1k7M3j85N5J08m0Q8j4
7201A3j9jn5N00m15k58J03j74N50j53j17q6L17k66m7O0ON1j6k16L60k15N1R2j38
7226g3O6O3J70k99j5q0L13l49m0L09j96K42n5NJ83k12K0j12O6l2L10m32K47j85
$$ plain form
7057 41 33 24 -15 -122 -170 63 85 -306 47 -259 173 71 -78 281 123 -13 -6 162 22 56 262 -128 65 21
7081 21 -216 -135 75 78 -114 -81 -95 -2 31 243 -212 -42 -92 -193 -61 -127 303 20 -212 1 -2 -68 254 -235
7105 -235 139 -43 15 -39 9 -110 -93 20 -279 112 82 6 -4 -146 47 46 162 -109 -65 142 -10 -10 -134 -32
7129 -32 69 -51 120 134 49 -1 -108 -168 107 -231 -35 -159 -106 186 306 -193 215 167 -19 72 41 112 -177
7152 -177 -41 21 183 -226 -5 137 166 209 -96 53 34 98 -90 13 32 202 -112 22 -23 -37 66 -89 44
7175 44 -147 -143 -66 35 39 105 254 199 23 -202 21 -188 -130 -183 -2 139 56 -15 -42 1 -184 -129 -21 -61 27 13
7201 13 -6 -7 -62 438 23 -235 -132 -306 244 91 -26 -112 205 -61 -108 -48 -42 9 -7 -223 137 -78 -27 65 -73
7226 -73 -7 56 226 -73 -88 -168 145 -204 -244 65 -131 111 56 61 244 32 52 -60 6 -26 284 -148 99 -86
7250h6J25J4P2q9J9j3K00k75J44P2Qk58j99M76m1o7k30O0K59k75k08K51Q1j00
7274f0p3K24l95J41J35m8L33k25K30m50l0L58k00J04j5J10k48J55L2J6r8L2k3
7297EJ67q7j62L48j27p5j39J96k65J31k94N34j09r0r7lO9o6J37j01q6J19J79o2
7321A22m67J69L83p9j62o4J16mjJ09P2k93M39l62Q1j09ll9n8K37m47L48m6K76
7345B18j13K83l17K44l00j60L76l46J61Mkj12M5Q9j21j15L64j77J84j40N8l19
7367a96L72k70N2j25P3J79o5jk05K51o6l38L19j1kj52K39Q6m9r5rQ1j48M12m02
7392g0k7J05l80K52O2pJ94Pj63L1k84L22J71j40j84J81j08P0j88K84k55q2K90
7415H1Jj60M3Q2j67J57J3j88M1o0K13k69L92j49j50J12M0l1j56J77J4j88J5L75
$$ plain form
7250 -86 39 53 125 36 55 42 242 -33 111 183 191 -67 -266 210 169 102 -128 -68 191 -84 -292 -41 40 -60
7274 -60 -133 91 -304 -163 -28 -76 257 32 262 -188 -218 140 -60 44 29 139 -109 46 78 94 -4 28 5
7297 5 172 85 -77 271 144 69 -70 126 -139 -8 -302 232 123 33 -64 -67 2 -64 73 -28 -114 5 184 122
7321 122 -345 -176 207 128 -34 -98 18 14 13 122 194 -99 340 -22 59 -50 -53 -92 -150 87 -360 -12 -58 218
7345 218 105 388 71 315 15 -145 231 -115 46 50 48 -64 -19 70 -51 -166 198 21 205 65 123 -196
7367 -196 176 -94 -42 -167 -94 85 20 19 -186 65 -1 -339 -20 -31 -33 -185 54 140 91 -4 -13 68 -80 332 -70
7392 -70 -97 8 -372 -120 -58 -65 129 136 -27 4 -280 42 213 73 -111 70 -38 32 -156 128 -127 -209 81
7415 81 82 -78 -35 47 -120 37 50 -138 -97 -157 56 -213 179 30 -120 -8 32 1 -155 22 36 -152 -137 238
7439B38k62l6M46m38J46j39m5O3J46k20m4L80k51lj26J17j3j04J54J17Pn0j48
7462f5n5QJ1P6j6K20k22J52j64K91j56k21p1L67j37j44n7oL41j89j72L13o5J32
7486A71M7j69K4j05o4K68M2K3j82q5Mj36J25j63K50K37n18K28J5ko2K59l7j01
7510F9n8k2nJ54p6k01OJ12j63L9J78jj16J68k34KL74j39j63K01l99J81k0j26M13
7535A74j26J01k18M7J21o5j08J70j03J34j05L03k64l49K64k48J45N9J76j72K72
7556B08n9k66K59j32kJ48J2q7j02j5k48K70M8P5l9K01m44K50l5j15L54k11j53
7579h3J10Pj97R1q4J67j0l0l3K5ojj10K15L3P5j27j65R0K2J44k85O4k54L59K39
7605B56k21j58Q6j37M5J79n8R8Q0k31O2R7j48o5K51k07K99k52k13J60j06J08J26
$$ plain form
7439 238 -24 -60 386 -52 94 -45 -90 -27 119 -101 -145 235 -16 -19 -145 -28 -41 -145 9 126 133 83 -65
7462 -65 -120 -112 -101 -25 -41 179 -43 109 -55 236 80 -141 -212 155 18 -126 -183 -189 152 -37 -209 104 39 171
7486 171 218 49 73 -32 -96 172 214 237 55 -30 -26 -162 -37 -200 50 287 -231 -3 12 10 -52 207 170 69
7510 69 11 -11 -16 138 62 -139 -133 -21 -184 -145 33 32 -84 84 -150 -148 226 87 -76 125 -274 -93 -113 -239 174
7535 174 48 149 -69 -22 99 34 -74 96 -7 127 22 325 61 -288 -24 -272 -127 -68 108 -64 208
7556 208 149 -117 142 10 8 156 168 81 -21 -36 -284 -14 34 109 70 271 -173 77 42 -73 281 70 -83
7579 -83 27 34 -163 -72 -156 11 1 -29 -62 -37 -43 -44 -154 61 94 169 42 -123 -33 -11 133 -152 -88 -342 17 256
7605 256 35 -123 -37 -174 -129 50 -8 90 170 -61 1 98 -50 -115 136 -71 228 -24 -237 -77 -183 -75 51
7628E1N1j5j19J22nP6j91Q8k09L04k99J03K02k42J49j43l8K50j15k9O0rl8J07
7652A11k28k85L58P1j31K1L2K45k1j63r0p4L34k00J2j6k15K73L1n4J2K42k70m1
7676d6o8J85o7N3K1J38k60P6N5M3oj48K28k66k15M28q2qO5o9l62K94L03m23J93
7701F2j32Q3Kr6j03K90o3J76J99o20K58O2j52P3P7k8j67Q6K51m6l69J78L94n33
7725a18rJ43l5N0j11kM7K34j59M7j35j44L47j13N4K17m46m9Q6j03J6L38j33j44
7749a22J83m6k5j33L8O1j47J92J76k49p6K17N8k55n7M23j85J08k1J20l07n1O5
7772c3J5M6Q4j06j36M85m83K14oj90J3M29m08k40K33J9K46l3j78k88K87K40j40
7795G0K8m6n1J02j63K62J7k52K07k33J11O4m0j66K03r5J8k0q5q7L18j63L6J09
$$ plain form
7628 51 102 87 -32 90 85 161 -30 58 -151 153 -146 -43 159 -83 66 -77 -115 135 20 -9 51 42 4 111
7652 111 -117 -402 -44 27 -104 -83 -51 194 173 10 -80 -154 180 -20 -8 -24 -239 34 65 11 23 265 -5 -46
7676 -46 -114 71 4 57 78 216 -44 32 87 130 124 -24 204 -62 -277 151 69 61 126 57 -305 -11 292 -131 62
7701 62 -70 13 15 -81 -184 106 43 219 418 -202 56 118 -34 39 116 88 -79 7 258 212 -157 21 415 -118
7725 -118 -127 16 -19 31 -80 -82 -35 199 40 87 -48 -192 155 42 96 313 -133 -182 -96 -199 -183 155 22 -122
7749 -122 61 15 -10 -143 -105 -44 -191 1 177 -72 -148 69 127 -128 -185 238 53 161 140 260 -47 -98 -33
7772 -33 -18 28 112 6 -130 355 -128 86 80 -110 -97 332 -76 -316 -83 -64 182 149 -29 -317 -30 210 70
7795 70 98 52 1 103 -60 202 219 -33 174 -59 52 116 76 -90 113 18 36 16 -69 -156 162 -1 35 144
7819A44j0r0P2m07J24J07L39k44J84k92J18j16M3q4L36l67J89k21m1K14k15L77
7841A60j24j83J26K5J67k8l20K34j09j23J98j18K97o7q0j05RL0L9j71J91L8k18
7864a32N7O6J04j05mj13J17L2q7J94l15J38J4j38L76l57J8l5J39o9J80p3p3OP1
7889A1j16K77K85l03ok78J11l1L45m14j07R4K27J62j58j28M0K17l02J52k92J64
7911e0n7j66J05J14qP5N5N2p6m08L52mr4N1K22j07J03q9p4K7J46j91p5M4L6J69
7937A52k77O3k8J34n0R6K32k66Oq9L8k42J37L26m11Q4J34l8j23K7rK08n7Mj31
7962h0l5J55O9QR1j8k12o0k48L68p4j36O9r3L88m19J75J86q8O5J84j98j54J90
7986A33K8l0k46M2J19M4J4k11L00m05J75j94K88j92K73j26r4J91j11R4k2k27J37
$$ plain form
7819 144 134 44 116 -291 -167 -60 279 35 219 -73 45 -71 -28 -112 224 -143 46 -175 -216 -2 -217 160
7841 160 36 -147 -21 4 171 143 -177 57 -52 -175 23 -95 202 135 55 -50 -41 -11 28 -143 48 86 -132
7864 -132 -75 -9 95 -10 -14 -127 -10 22 -65 129 -186 -48 -34 -172 204 -153 -135 -170 -31 -100 80 7 -66 -60 11
7889 11 -105 172 457 154 148 -130 -19 -50 295 -119 -226 -132 95 257 99 -29 11 228 -74 78 -214 -50
7911 -50 -107 -273 -168 -54 -62 13 68 120 44 -364 -12 -16 -110 -59 163 56 159 70 -4 23 169 -22 -97 -53 -17 152
7937 152 -125 -62 -90 44 -6 90 322 56 62 -27 11 -231 -94 232 -179 -95 39 1 -122 -95 -104 104 47 51 -80
7962 -80 -115 40 109 117 208 190 -22 -82 -330 38 -36 -172 -103 -196 192 -227 -52 134 46 111 295 97 -57 133
7986 133 161 131 -115 -73 46 90 104 -107 193 -212 -37 -231 57 -135 138 12 -82 109 -2 92 70 -157 -20
8009b0K23k28J89j98n8J07Q4L1n6j16J01pML6J4Q7m96K13J04P7k58K67j6n3K9
8034F0k67J25R5J4j39r8J19J27n5J71j21Q1k47J59j16P8j85J42j3Q5m2P0o4k44
8058b65K06J93j24P7J08k32J6j27m2J82J65J14j14k17%M3k25L19r7j33L68m64
8080b49K52J27j79Q3J95r6M2K20l65j40n2L7R5j25j8N3J71K4J54j57Np1P4J18
8104A98l48M45l43K55l24q1L94k53rp2P0J00L11l30J8K31j51l69L01N0lj13j07
8127a30M78m12J97M3m68K46K2Q3K0J21n0p5j51OJ58m2P0j20j6q9j2M28l36P5m04
8152c58M40k11J48l0K56l39J29k37J85J42j70M7j04J04j14j01K71j67M0L17j74
8173G4J73m96M31k04J6j56J4j35L20j57O2J13j58K15n05J71P3M99
$$ plain form
8009 -20 203 -25 164 -34 -92 15 99 130 74 -42 59 52 56 92 106 193 -303 -90 14 91 -167 100 84 31 60
8034 60 -207 -82 13 27 -112 -210 -91 36 -19 152 31 112 -135 24 -92 -14 -199 -57 -70 15 -27 43 -21 -265
8058 -265 -59 134 10 87 195 -37 -21 -148 -190 -8 157 271 157 -60 -60 -17 -242 77 -20 -153 215 -249
8080 -249 3 130 -49 34 229 133 175 395 30 -110 -162 -125 -30 -155 -173 -120 51 75 229 72 77 6 80 198
8104 198 -150 295 -48 207 -117 -198 196 -57 -66 -138 -68 32 343 13 31 262 111 -258 43 93 90 -23 -130
8127 -130 348 -64 133 176 -292 -46 -24 59 79 200 150 75 -76 -70 88 46 116 -4 -20 -109 -121 307 -29 46 -358
8152 -358 82 -129 19 -11 245 -94 35 -202 -17 125 -45 2 -102 2 -112 -213 58 -109 -69 248 74
8173 74 247 -249 182 -22 -6 -162 -148 -283 37 -120 -58 55 -103 112 -393 -222 -149 350
8191C50
$$ Imaginary data points
##PAGE= N=2
##DATA TABLE= (X++(I..I)), XYDATA
0@%%%%%%%%%%%%%%%%Oj4J6j6J6j6K2l0L2l7M5m8N6o7P5q7J00j12J26j42J59j77
38i3J98k22K47k74L03l35L70m09M54n01N51o08O70p36Q11q94R86j093J215j353
58g13J513j703J931k210K563l025L655m575O046q763J5407o0240q0161J47395
72A7120N2130q9512p999P2330k4538l9954L1646J5724m2945K1093L1341l7392
84i56k7004L2054Q302j3855J6876L199k7086n53J9543K807o799K741l276l777
98B216J127l100r408L237K2435O848k5215k1377J1482K4763N532j4322r217J0801
112E802j795k3655L24K5137K645j4330j531o641r877J3269J3117j0523k803J4622
126C761Q07j3965M472J9486m224k3906j030J5623o913j2834J7671K1238p946j6717
$$ plain form
0 0 0 0 0 0 0 0 0 0 0 0 0 0 0 0 0 0 6 -8 8 -8 8 -8 14 -16 16 -21 24 -24 32 -35 40 -47 53 -59 67 -75 84 -93
38 -93 105 -117 130 -144 159 -176 194 -215 239 -262 289 -319 351 -385 426 -468 518 -575 640 -713
58 -713 800 -903 1028 -1182 1381 -1644 2011 -2564 3482 -5281 10126 -50114 -130275 17120
72 17120 69250 -20262 -28261 44069 19531 -20423 11223 26947 -15998 5095 36436 -956
84 -956 -27960 4094 12396 -1459 15417 18616 -8470 -9023 10520 13327 6528 9269 5993 2216
98 2216 3343 243 -9165 -5928 16507 23355 -1860 -23237 -11755 13008 18540 4218 -4999 5802
112 5802 4007 -19648 -19324 5813 8458 -5872 -7403 -14044 -23921 -10652 2465 -8058 -10861 3761
126 3761 4568 -9397 -4925 14561 10337 -13569 -14599 1024 -5889 -18723 -1052 20186 12240 -4477
140d477q81O932J484k555L315M736j314l728o555q494P555J9759k933j5680L209
155C73N819o363M902J0302r345p471J0470j849j5276R774J9626j3456k2956Q785
169f665J2671j3622j805K0589k040j6996L822K895j0184P966J1679j2849m725
182i264J7209m747k3611M318K0788m08q051K645r14l381Q271K927j2741k003J2275
197C313o680j3330J2699J6777n533p033J23n202j056P625L00k104N645o74q828
212c958K064R831j026n238K157K979l518k606l40k67M467N537o755r589N145O389
228E272n667j131Q146p06p756j028K302J053L074n42o890j513M731j560m045O675
244D15Q202p402j2872K062J0471m5k798K979Q41k653j349k694l949M627O530n006
$$ plain form
140 -4477 -5358 1574 3058 503 3818 8554 7240 3512 -3043 -11537 -3982 15777 12844 -2836 373
155 373 6192 -171 4731 15033 5688 -1783 8687 6838 -8438 1336 20962 7506 -15450 -6665
169 -6665 6006 -7616 -9421 11168 9128 -7868 -4046 -1151 -11335 -3369 8310 -4539 -9264
182 -9264 7945 3198 -20413 -16095 4693 4285 -3766 -1121 -2035 -5416 2855 5782 -6959 -8962 3313
197 3313 -3367 -16697 -3998 12779 7246 213 336 -4866 -5922 1703 2003 -101 5544 4870 -3958
212 -3958 -1894 7937 6911 1673 3830 6809 3291 685 345 78 4545 10082 3327 -6262 -1117 5272
228 5272 -395 -1526 6620 5914 -1842 -2870 -568 485 3559 3017 -3873 -5386 -655 -2215 -6260 415
244 415 8617 1215 -11657 -9595 876 831 -1967 1012 1853 -800 -2149 -4843 -8792 -4165 2365 -2641
260b641o890O161R517m251o710O945P175q416q460L554M135J086K086j275l645
275a629K982J597n841J483J0622N84j0417l566N792K249j363J659m69k604k32
290H47j907l079N842Q584n008r912K707O221j997l526M94P06K329O68p263l636
306g930Q407M955p155l969N327k91n401L279P157j702m611m18k580k110M430L199
322E87k921N53L295m046m126O135O694l763n037m01mL50L043J196j586J580J913
339C462m440k155O146K157m595j4L954k888m528L664M182j572n77q3m712l40O714
356D375J095m979J663N145n673p432L658N962n23j690j697l592J691M566k902
371c33l365N759J642q990k163R323K509n837q71J686l288j048J971j627J534O776
$$ plain form
260 -2641 -9531 -3370 6147 1896 -4814 2131 9306 890 -7570 -4016 119 1205 3291 2016 -1629
275 -1629 1353 2950 -2891 -1408 9214 9798 -619 -4185 1607 3856 2493 4152 3683 1079 847
290 847 -1060 -4139 1703 10287 5279 -4633 -1926 4295 2298 -1228 -734 -28 2301 2969 -4294 -7930
306 -7930 477 5432 -1723 -5692 -365 -656 -6057 -2778 4379 2677 -1934 -2352 -4932 -7042 -2612 587
322 587 -2334 -1781 1514 -2532 -6658 -523 6171 2408 -2629 -3030 -3034 -2684 359 1555 -31 1549 3462
339 3462 -978 -3133 3013 5170 575 561 4515 1627 -2901 763 4945 3373 2796 2713 -1999 -2339 4375
356 4375 5470 491 2154 7299 1626 -5806 -2148 3814 3291 1601 -96 -3688 -1997 2569 -333
371 -333 -3698 2061 3703 -5287 -7450 1873 4382 -1455 -2326 -640 -3928 -4976 -3005 -4632 -3098 3678
387C678k000q671K573Q163k873n260K826K769l086j276l1m95M899O086n857q177
403f732N450N894m788j727P199P18o520j259K756N62J949J991m613k923M220J508
419C685m037J130N670j936o838K59M318N20j448m2L76j50r50k763j053M114K652
436C507l241l509J395K631k171j433K945J795l403l916l44K804L047O81j840k393
452c445P08P77k053J123L869m41m408M95L684P10j087Q63J008m37o55l040j024
469c353N805M088n651m824N264K970l994j153K823J492Q98o21n312j147P796K005
485G086p066j296N064k513m135M285L452l053n08N46m147L61N965k038o041M503
501D65L714q499l542Q093K894n626q30P83j695J896M078l230k580O097J047q090
$$ plain form
387 3678 1678 -6993 -4420 3743 870 -4390 -1564 1205 -1881 -3157 -3188 -3683 1216 7302 1445 -6732
403 -6732 -1282 4612 -176 -1903 5296 6014 -506 -1765 991 1553 3502 5493 880 -2043 2177 3685
419 3685 -352 778 6448 4512 -2326 -2067 2251 2771 1323 1281 1657 1507 557 -2206 -3259 855 3507
436 3507 266 -3243 -1848 783 -1388 -2821 124 1919 -1484 -5400 -5744 -2940 107 788 -1052 -3445
452 -3445 -2737 -1960 -4013 -2890 979 538 -3870 -3375 309 1019 -68 795 1803 1366 711 -2329 -3353
469 -3353 2452 6540 889 -3935 1329 4299 305 -848 1975 3467 4365 3744 -1568 -2715 5081 7086
485 7086 20 -1276 3788 1275 -2860 1425 4877 1824 1316 1862 -2285 -1924 4041 2003 -4038 465
501 465 4179 -4320 -7862 231 3125 -2501 -3331 -2548 -4243 -2347 1731 -1499 -4079 2018 3065 -5025
517e025j314O904N73l475N58J461j570lJ288j23J148K455k171m028J895L179q
534A744p40O73l09k043o23J521K224J220j065j820N94J828n56q89J477J087j817
551B506k376r29J319K299k69l315m71K195o86k500L83K965J339k103k437l08J517
568h71M62o12L15O07j535j984M44K742J707j159l028n09L010J97l151L45N352
585B332m74n795r62M028J023j37k51j759K4M127j048m444L093O847k992o105K145
602c48L748k348K02K403k425j181K384j306l831N009M656o311m190O001J297n425
618a665J690M378k283k929Q09j514q72M982Q51n466m09M529j825l712K762L224
634B550k199k054M1q24L79K426j259k146J338N73k855Q89L368L20j656M8k84n1
$$ plain form
517 -5025 -6339 565 1138 -2337 -1779 -318 -1888 -1891 -603 -726 422 2877 706 -3322 -1427 1752 1744
534 1744 1004 1677 1368 -675 -1298 223 2447 3667 2602 782 1376 3204 2648 1759 3236 4323 2506
551 2506 130 -799 520 2819 2550 -765 -1236 959 273 -2227 -1844 1121 2460 357 -2080 -2388 -871
568 -871 -409 -1021 -706 -99 -1634 -3618 -3174 -432 1275 116 -2912 -3421 -411 -214 -3365 -3020 2332
585 2332 1858 -3937 -4899 -871 152 15 -236 -1995 -1971 2156 1108 -3336 -243 6604 3612 -2493 -348
602 -348 3400 1052 1254 3657 1232 51 2435 1129 -2702 2307 6963 652 -3538 2463 3760 -1665
618 -1665 25 4403 2120 -809 0 -1514 -2386 2596 3447 -2019 -2428 2101 276 -3436 -674 2550
634 2550 351 -1703 -1662 -2486 -2107 319 -940 -3086 -1748 -1175 -4030 -3141 227 547 -1109 -1061 -1345 -1396
652a396J035l07j29K466M4l279j587L332J906j827L24P51j189n88J271J62M96
669A485J970j325l764Q37L473q56j849R59J496j344j929P87J645J269r02j359
685E93p14N48N54r51n03J324J500k653l351J292L955n01l343O14K223j079j819
702b311R39Q65J71Q80j783l279K189M797k266m001K631K803l128j620K529J606
718A022j362O21j31k035J176K085j791q99L481O6m270q3L852M61j400l62O18l55
736F94P92j30j268J037K388j848k278M26J844J05q76k78Q9K75p02r65J113J327
754A745p28k245J009O78j349n26K056n3j679n4l66j43J412J133k160p65K088J65
772B18k827N08K795k57k278K65N95k39O09M62j160O29J793j336k697K015L357
$$ plain form
652 -1396 -361 -668 -797 1669 1713 -1566 -3153 179 2085 258 582 1333 144 -444 827 989 1485
669 1485 3455 2130 -1634 -797 2676 1820 -29 930 2426 1082 -847 -60 1585 2854 1952 593
685 593 -121 427 981 30 -473 851 2351 -302 -3653 -2361 1594 1093 -2250 -1636 587 -492 -2311
702 -2311 -1372 -507 -336 544 -1239 -4518 -2329 2468 202 -3799 -1168 1635 -1493 -3113 -584 1022
718 1022 -340 281 150 -1885 -709 1376 -415 -1314 2167 2233 -2037 -2120 1732 2193 793 431 1049 694
736 694 1486 1356 88 1125 3513 1665 -613 -187 1657 1762 886 608 697 972 270 -695 418 1745
754 1745 1017 -1228 -219 459 -890 -1416 640 587 -1092 -1146 -1512 -1655 -243 890 -1270 -2035 53 218
772 218 -2609 -2101 694 437 -1841 -1576 -981 -1220 -611 -149 -1309 -680 1113 -223 -2920 -905 2452
789B452j321k864J440J264p43l80M49J028N2l32j262o96K150J706j936j521J583
806A069J627k086j267J550J539p52j285q62Q73J232n51r36K3J259j13k476l38
823a494K116J023j384j782P25R22m70q70J57Q92Q80j785j948J162K007j00j589
840a538j11J129k0j013j09Q73J597n27k063J23J761M77j188K90Q94n29p84R23
858A85q3J60J001q7r46N6Q80k95q63J368J231k490o53J684N75j044K83N87n77
877I72l05o0r94M26K529n39k932p60L098l23k376M62J664m76j570J92J23L14J117
896E62o04j791N68J328j126j489J819K044k028j926Q43J493l18j66R1m05R63M21
914B79j808m39K945Q88k507j486K210J003o45m76M31L22K27j06j795P89K629k46
$$ plain form
789 2452 1131 -1733 -293 971 228 -152 297 1325 1377 1045 -217 -913 1237 2943 1007 -514 1069
806 1069 2696 610 -657 893 2432 1680 395 -467 406 1638 1087 151 174 1433 1320 -1156 -1494
823 -1494 622 1645 261 -1521 -796 126 -344 -1214 -1057 -165 715 -1070 -3018 -1856 151 51 -1538
840 -1538 -1649 -520 -540 -1553 -1662 -789 808 281 -1782 -1659 102 579 -609 -319 575 46 -738 185
858 185 102 262 1263 1176 230 286 1166 871 8 1376 2607 117 -536 1148 1723 679 962 1549 972
877 972 667 607 -387 39 2568 2029 -903 -1663 1435 1112 -1264 -802 862 386 -1184 -992 -869 -555 562
896 562 -42 -1833 -1265 63 -1063 -2552 -733 1311 -717 -2643 -1800 -307 -625 -791 -700 -1105 -142 279
914 279 -1529 -1968 977 1865 -642 -2128 82 1085 440 -36 395 717 944 838 -957 -168 2461 2215
932B215k591N02J929q17j181O70J218n04m70j166n78J623J625j943j049J419M35
949A337j956j84K140l87j421K14l02l64R97R6j110oJ380j065j653J118J554k36
967A52j204K55k05m34L55K38p1N36J34r55k68J134O69j007r6J044J06j288L27
986e78J438M33n37p37j93Q16L23m07o44J002J325j286j505L05J945M6j249k94
1004B03O88M45o83p39M93Q25O3j369j267J704J321j345j021J275N34j468p53O59
1022d35M04L89m88j623j68J866J41j532l51K370o98k219M63J637O6K16m83j097
1040a542N86J423n43j645J110K022j566j667J572J027q42L12J99m13K63L34p27
1057i7k28J725L31j763k46J495l15m94M59L14l30k15L42p39R34Q63j323j211J068
$$ plain form
932 2215 -376 126 2055 1238 57 727 1945 1441 971 -195 -773 850 2475 532 -517 902 1337
949 1337 -619 -803 1337 950 -471 -257 -559 -923 74 170 -940 -946 434 -631 -2284 -1166 388 152
967 152 -1052 -797 -1002 -1436 -1081 -843 -914 -378 -244 -1199 -1467 -333 336 -671 -767 277 383 -905 -578
986 -578 860 1293 756 19 -174 642 965 558 -86 916 2241 955 -550 -245 1700 1746 497 203
1004 203 891 1336 653 -86 407 1232 1295 -74 -1341 363 1684 339 -682 593 1127 -341 -1094 -435
1022 -435 -31 358 -130 -1753 -1921 -55 86 -1446 -1797 573 -125 -2344 -1881 -244 -178 38 -445 -1542
1040 -1542 -956 467 -76 -1721 -611 1411 -155 -1822 -250 777 -65 247 446 33 296 630 -97
1057 -97 -325 1400 1731 -32 -278 1217 902 408 867 1181 851 636 978 239 1173 2036 713 -498 570
1076E70J49o57j88M15Mk29k78p10K21Q07j63j017N18Q23j095o18J096N35o66k70
1096g53k41J9M93j38o13L57J576r19j619N48J572L47j648m1Q14L76k72n21J88
1115d75R24P26j597n02J059J208l30p51j30J104k11r56m83J500P34r88r28L50
1133B54N22J12k60l80j88J319p47j424O00J614l58j686J70J071k36q34j93M02
1151b42O24J14j122r97J677P40j286j288J278L52j021J1P27J59l13l29j47J38
1169i25Q02k95l17K89J056q86n41L18Q09k76j90L96n63K03P03o99N5J285n66r21
1189b63M74O90j12k40J34r0j24L72m66l92P32P47j341o91J640K24j680L11Q08
1208G33K14p38m89j94K96Q46p3j540J72J583p00j780N63J761q06j363N51N20J33
$$ plain form
1076 570 719 62 -126 289 293 64 -214 -924 -703 104 -59 -1076 -558 265 -830 -1448 -352 183 -483 -753
1096 -753 -994 -975 -482 -620 -1233 -876 700 -219 -1838 -1290 282 629 -1019 -1060 -246 130 -142 -663 -475
1115 -475 449 1175 -422 -924 135 1343 1013 262 132 1236 1025 69 -414 1086 1820 832 -96 254
1133 254 776 888 628 248 60 1379 632 -792 -192 1422 1064 -622 -452 619 383 -451 -644 -242
1151 -242 382 496 -626 -1623 54 794 -492 -1780 -502 -150 -1171 -1160 -433 -274 -587 -916 -1063 -925
1169 -925 -123 -418 -735 -446 610 -276 -817 -499 310 34 -156 240 -323 -120 583 -116 -61 1224 658 -263
1189 -263 211 901 789 549 683 593 469 841 375 -17 715 1462 121 -570 1070 1294 -386 -75 733
1208 733 947 209 -280 -474 -178 668 595 -945 -773 810 110 -1670 -1107 654 -152 -1515 -964 -444 -311
1227c11O7k71n51M15N99o05j020J253J077p58r23K82Q15J10q29J42P89L82o13
1246E0q37L40J052N98j415k99P04J137j202m76Q34Q68m12j027K28L62L84K76q07
1265C58j72Q58k61p57j03J061k8j087m9M57QN0l20k1J51K71j036l12R43J35q28
1286f82J18O05n31m90L85M80n00J83k62o71P11Q04l86q84P12M46j003l12J138
1305a39K26l68J45K85o17M48O44q48m95J627J70j837J04K130l14j137P9O54r5
1324F62l2J29o79M23R80m46j817P01J705m63j517K32J044k38j115K58L20L42K88
1343G77q69r97R30P97r66o92R88O63j120q45P94O14n25j57l50L01N73k34p08K35
1363g91J109R4j537J36O81M69m07k06p3M59J09l40l47N66J009p36j004P85M88
$$ plain form
1227 -311 -244 -515 -1066 -651 -52 -657 -1677 -424 653 -105 -1028 -746 69 179 -650 -508 281 663 50
1246 50 -787 -447 605 1203 -212 -511 193 1330 128 -348 486 1354 942 -85 143 505 889 1165 358
1265 358 186 1044 783 26 -77 984 956 -131 -180 277 285 335 15 -6 145 416 -620 -932 11 146 -682
1286 -682 -564 41 -490 -980 -595 -115 -615 -432 -694 -1365 -654 150 -236 -1120 -408 38 -965 -1277 -139
1305 -139 87 -281 -136 149 -468 -20 624 -224 -719 908 1078 -759 -655 1475 1161 24 103 757 662
1324 662 630 759 80 503 1483 1037 -780 -79 1626 1163 -354 -122 922 684 -431 -173 147 489 777
1343 777 -92 -1089 -159 638 -328 -1020 -32 631 -489 -1334 -540 74 -451 -608 -958 -657 -84 -318 -1026 -791
1363 -791 318 412 -1125 -989 -308 161 -246 -452 -525 -66 43 -297 -644 -78 931 195 -809 -24 464
1382D64j22k51N37l18J8J27l11L12N62n10m00J35P96m07o93K56J031p58m44P2
1402I6L65l13K81Pm77J07O60j013o91J104N15r37k54N38L95j094k7K89M40o73
1422f82J07K6L2M31j3p24k44J341l37j082L43J088q7j006k13N76K53N63n93l12
1442e33L54J090o28j086P60J410o84q84K45L71R6Q8l20L1P27j35r00j79R63M81
1462A267p22n49P62j58o15J3L96p1N5k64o57K48Q80l65q63J65J059m96q91L6P60
1483a0q4j28m16L6L9M05m24l01N32L14p65k36P46K56k15k38M95k92j47N05k85
1504b13K30M23m09o61Q15P00o11l94N74K06m13k58J19L27L85k79o05J70O22j20
1524F08l83j15P82K4j170M2N25N78m54o20J32M25J72n24k37K44O05r83m88N06
$$ plain form
1382 464 342 91 628 310 328 455 144 456 1018 508 108 243 1039 632 -61 195 1226 468 24 96
1402 96 461 148 429 436 -41 66 726 -287 -978 126 641 -296 -550 -12 383 -711 -738 -449 -9 -682
1422 -682 -575 -549 -517 -86 -99 -823 -1067 274 -63 -1145 -802 286 199 -807 -1020 -444 -191 372 -221 -533
1442 -533 -179 911 283 -803 -43 1367 683 -201 44 415 511 599 279 310 1037 902 2 -177 786 1267
1462 1267 545 -4 758 600 -15 -2 394 323 378 114 -543 -295 585 220 -643 -478 581 85 -806 -770 -10
1483 -10 -94 -222 -638 -602 -563 -158 -582 -883 -351 -37 -802 -1038 -292 -36 -251 -489 6 -286 -433 72 -213
1504 -213 17 440 31 -630 185 885 274 -120 454 660 247 -11 108 435 820 541 -64 106 728 608
1524 608 225 110 892 916 -254 -212 313 891 437 -183 -51 374 546 22 -215 29 634 -349 -837 -331
1544c31N62j20p87R8M49K5q02K29K07L61L14p63o76M19R84m88o65P43O90n83o77
1565h11J25O16L3K06l81r8N90J39o95K38O60Jn74j01K72M09m48J82l05Q10m21
1586D47j4o67P57P82o56q01P11M3j24j2l04L42q1P7m05j61N75r3o17k82O17n5
1608G9l72j33L03j4j21m08L81l22L92l53J45L83r7p03j23O24K58l33k53J74M71
1629b2J87p35m2O11L51p03l16M77N94j39m21l0N78P6n22j36O82M23K8r05o8N57
1651E25J50l52l27N47L10l46p48J17J122m69l60l88M65N5j04j61j04K60L00r96
1671e04l2N75M57m38r22M56K26j28l64K66K79J44l43m58J77M42j27m20K08M48
1691e8j80j51k0K45M75l38m52j50P12L35o94K06L97J18l66j26J86M06Ok00qN8
$$ plain form
1544 -331 231 111 -676 -578 -129 -104 -906 -677 -470 -109 205 -558 -1234 -815 169 -319 -984 -241 449 -134 -811
1565 -811 -686 -70 -37 169 -212 -310 280 419 -276 -38 622 623 49 -52 220 629 181 363 58 868 447
1586 447 433 -234 523 1305 649 -152 559 602 478 466 162 504 423 500 95 -66 509 416 -201 -483 134 79
1608 79 -293 -426 -123 -137 -258 -666 -285 -607 -215 -568 -423 -40 -137 -840 -963 -339 -81 -414 -667 -493 -22
1629 -22 165 -570 -612 -1 350 -353 -669 -192 402 263 -158 -188 390 466 -56 -192 490 913 941 36 -32 525
1651 525 675 323 -4 543 853 507 -241 -124 998 529 169 -219 246 301 197 36 -68 192 492 -504
1671 -504 -536 39 496 58 -864 -408 -182 -310 -674 -408 -129 15 -328 -786 -609 -167 -294 -714 -506 -58
1691 -58 -238 -389 -409 -164 311 -27 -479 -629 83 418 -276 -70 327 445 79 -47 139 545 551 351 343 401
1713D01L6j83J05J52M33l19n28N5M44l85j69J92K01j60J5l70L39kL18j033M75
1734A7M68m12l88JN76k81l06l25J06M24l9k22m48M87M16p18l84Q61K17n93j86
1755g29L0N28L49j34q93L97N55k7o41L26L90J76m28J87j25M70n6l68J45L34L35
1776H21q12m1N00J66N6q33K60R5N01j83o23M53L82l71m52K39L64m27L15m97L49
1797B62K96m43n97K15M46K1m18j15K07k13P5n8M7J49j59k13o9L57J89k85k54L78
1819a82j55k41N59o6J42j90M1j5O6k04j41M42J10lK1n30L77L43k25l01O6K59M22
1842E95l00k44L10M40o42l82N27J97j73k11n8K55J20km72O8O36J81j079m5O82
1863D03j1n62j93O00K07l08n76j66L77K66j36o11K9O17M6n59k8P04r5o23p9L53
$$ plain form
1713 401 437 254 359 511 944 625 97 152 596 211 42 234 435 275 290 -80 259 257 575 -458 17
1734 17 485 73 -315 -314 262 -19 -325 -650 -544 -120 -159 -381 -829 -342 74 -644 -1028 -167 50 -543 -729
1755 -729 -699 -171 178 44 -849 -452 103 76 -565 -239 151 327 -101 86 -39 431 375 7 152 486 821
1776 821 9 -32 468 634 690 -143 117 212 713 530 -93 360 742 371 -81 158 522 95 410 -87 262
1797 262 558 115 -482 -267 179 200 -218 -333 -126 -339 -264 -322 -275 -126 -285 -498 -567 -210 -21 -306 -560 -182
1819 -182 -337 -578 -19 -85 57 -133 -92 -107 -41 -245 -386 56 166 163 184 -346 31 374 149 -152 -86 173 595
1842 595 295 51 361 801 159 -223 304 501 328 117 59 314 434 432 -40 28 664 845 -234 -279 403
1863 403 392 -170 -363 237 444 136 -440 -606 -229 37 -99 -710 -681 -64 -18 -577 -605 99 4 -619 -698 -345
1885c45L97j94k30r3K53L99k08k63O4L50J37o82K71N48m13O2R7j03O7no3R6K09
1908C51n7k12k9M68j7n67L55l4K19J88m27j7K15j55q6k37J88J21m9l82K60Q4m70
1931b90J48K52j19k48OJ85Q7j05j58l83K56K87p3m76J96O3K62k95k74M01P3l09
1953e14l54O65o5K66k57j32L71K23l72l09O38J49m5n57N2N03J72r0l93J52L96
1974D99N4n22N0L77M04n36m72M81R2O2n97K48O7N0P4l49L2L23R7p11l00Q25q0
1997A68m85j01M25o4K25m20j62O9M81Np84O12K0n18K98k05J53l1J54l73M0M70
2019b3o4l12K69K51q7k27q4R1M06pl76K32PJ21k57M69j2k05k5k2O8Q3K9L9j93
2044A71K83j63J01k99L64Kl97O8Q1l5p8l04J91K38Qm18j8K83K76m84l19M25O2
$$ plain form
1885 -345 52 -142 -372 -465 -212 187 -21 -284 -220 130 267 -415 -144 404 -9 53 150 47 114 109 46 142 351
1908 351 294 82 53 521 504 -63 292 258 477 665 238 221 436 281 195 -42 146 267 218 -164 96 180 -290
1931 -290 -142 110 -9 -257 -251 -66 21 -84 -242 -625 -369 -82 -155 -631 -435 -372 -110 -405 -679 -278 -205 -514
1953 -514 -868 -203 -268 -2 -259 -391 -20 203 -169 -478 160 309 264 -293 -241 262 434 344 -49 103 499
1974 499 553 31 81 458 862 326 -146 335 427 489 -108 140 207 257 331 -18 14 337 434 -277 -577 248 168
1997 168 -317 -418 7 -57 168 -252 -414 -345 136 141 -643 -31 -11 -529 -231 -436 -283 -314 -160 -533 -493 -23
2019 -23 -87 -399 -130 121 34 -193 -277 -186 220 213 -163 69 76 197 -60 409 397 192 167 145 213 296 325 364 171
2044 171 454 291 392 93 457 459 62 130 211 176 98 -206 -15 223 231 -187 -205 78 354 -130 -449 -24 38
2067C8k22j87J91j22L45l66o4L52M0l14j49J45M46j62k63l97M58N78m62m29J78
2088c66L80j33J9j51K58K83l33k75K24O95j28m64J62n1O1J86m72J13M75J03o16
2109c0qN50j31j98k28J33N6j12Q4l26M06K26o06Q7J24J1K59m86K39K75m62k30
2131c67K20J93m24J43o4J41J93m08pJ03L05k59j88K45K52k87j39j11K32L36k06
2152i7j59J20M09P1l37j52K49Q1k53j06J19K88o4l89K49L24J08l23J19J38j40
2173B55M28n57q5M18J6k91m12K89N8j08J04m05L81M29n38k7L2M28l31k77Q1K51
2195A39L9m39j64K20K01k18l17J22K65M02l64m32M23L40m00l57J46K65J19k69
2215b79r5K66k5M14k97M4K04j14N4k22J62L46k62k73L75%k50n3K56j7L5k09K35
$$ plain form
2067 38 -184 -371 -180 -302 43 -323 -387 -35 5 -309 -458 -313 133 -29 -292 -689 -231 347 -115 -544 -366
2088 -366 14 -119 -100 -251 7 290 -43 -318 -94 601 473 9 171 120 181 367 -105 8 483 586 -30
2109 -30 -38 512 381 183 -45 88 144 32 116 -210 196 422 -184 -97 27 38 297 -189 50 325 -137 -367
2131 -367 -147 46 -378 -235 -299 -158 35 -373 -380 -277 28 -231 -419 -174 78 -209 -348 -459 -227 109 -97
2152 -97 -256 -136 273 344 7 -145 104 185 -68 -174 -55 233 169 -220 29 353 461 138 257 395 255
2173 255 683 126 41 459 475 184 -228 61 119 11 115 -290 91 520 -18 -45 -13 415 84 -193 -112 139
2195 139 178 -261 -425 -205 -4 -222 -539 -417 -152 250 -114 -546 -123 217 -183 -540 -394 -129 -10 -279
2215 -279 -374 -108 -133 281 -16 28 232 118 172 -50 112 458 196 -77 298 298 48 -5 251 234 269 60 295
2238B95p5K6J3J0p4J19k40j94K93J59Q2l02j96J90K4j17J03l98L38J6j47k60L73
2261C8R8m94P3O1K19j35j89P1L59j19n2o73M67L55m43L1O4L50O2j35l20L20J55
2284A63k40j58J52R7N76p06j64N07P5k21j92K12L72l55M8j31L33j74j01m4N6N21
2306F26j34m37j41K33L73n26K9J65J64j07k85M4J87l8k33j88J80Q4%K9l51K39
2328h7L67o33K9K67l2j67j27J07Q8KN6P5l54M29q7l51K09L09n5j84K9N4M4j39
2352a51M6J68K79j66j81K04J56l56J33J45O1j59L8r1J32o0p6m7K38J17l88O1l9
2375F4J64j88l00J19M37k51J05l25R1R0J4l61O7J95K69l49k78L79j10J35n6k75
2397c64L49j31j9j49j65M70m0k26p7O0N68p4m81J75K83j28N8k72J69N0o3J06P7
$$ plain form
2238 295 220 246 259 269 195 314 74 -120 173 332 414 112 -84 106 130 13 116 -282 56 72 -75 -335 38
2261 38 136 -358 -285 -224 -5 -140 -329 -258 101 -18 -70 -743 -276 79 -364 -333 -269 81 143 8 -312 8 163
2284 163 -77 -235 -83 14 590 -116 -280 227 302 81 -111 101 473 118 166 35 368 194 93 49 105 626
2306 626 492 55 -86 147 520 -6 23 188 352 245 -40 4 191 153 -80 -268 -88 -4 -4 25 -326 -87
2328 -87 280 -353 -324 -57 -89 -256 -383 -276 -188 -186 -130 -55 -409 20 -67 -418 -209 100 45 -139 -110 -56 -12 -151
2352 -151 -105 63 342 176 -5 199 355 -1 132 277 338 179 217 126 258 198 122 75 313 430 42 103 64
2375 64 228 40 -260 -141 296 45 150 -175 -84 6 20 -341 -274 -79 190 -159 -437 -58 -168 -33 -89 -364
2397 -364 -15 -146 -165 -314 -479 -9 -49 -275 -352 -292 276 202 -279 -104 179 51 109 -163 6 56 -7 99 176
2420A76N5pk63L2J44J71m9k35J56O5m3j59K52j52p0n1P3J40J67j58L5N5k13l8
2444H3r9Q3K89j89o1k6m7K9j6j00r1M7n7Q5p4K79j9k94J07l14N14l44J71q2J80
2469E4k15N9j67j98M10L0l17NL84k1k31R1J87K41l88J22jL7k9l0L6L06j47j92
2493B6j73L10K3k0j36n0J85M05k70l63K00Q2k30J69l93K53Q3P3l65K98R2n1k15
2516f7O8m1K49l42j16N7l9j41k58M29Q0N4j54R4k2J44q4k04P2J87l82J31K80k29
2540b34L27o4p1R1j4j27n8J33K08j40k59L13M6j0k30R5J25J95j77n3jK38l19o8
2564e4K49J70k16N1q5J80o2J04l26J26j83K80j41L3j41K97l51R9j42K91J2o89
2586d98K7M38l8O5n2Nj8J09l26N8K08o2ok53J09R9J59j51PO0j54P5j30L70K97
$$ plain form
2420 176 231 224 -39 -7 137 308 259 24 180 245 202 43 295 143 73 22 95 235 402 244 279 334 121 83
2444 83 -16 67 356 167 106 80 33 62 46 -54 -145 -98 -155 -70 -144 135 116 -178 -71 -385 129 -215 -44 -126 54
2469 54 -161 -102 -269 -467 -57 -27 -344 -339 45 24 -207 -116 71 312 -76 46 45 82 53 23 59 365 218 26
2493 26 -147 163 186 166 30 -20 165 570 300 -63 137 219 -11 158 -235 18 101 174 -191 107 199 148 -67
2516 -67 1 -40 209 -133 -249 -192 -231 -372 -630 -201 -121 -67 -221 -127 -149 -5 -89 -293 -221 -34 -416 -285 -5 -234
2540 -234 93 29 -42 49 35 -92 -150 -17 191 51 -208 105 151 141 -89 6 131 326 149 96 95 333 14 -54
2564 -54 195 365 149 200 115 295 233 337 11 137 -46 234 93 126 -15 282 -69 30 -112 179 191 -498
2586 -498 -471 -33 -71 -6 -58 -53 -71 38 -288 -230 -22 -84 -90 -343 -234 -135 24 -127 -120 -60 -214 -139 -269 101 398
2611C98l04l61P6J62R0l6k79K54L42r1l81R1J47J30j29j68J99K48k22l10K80j58
2633b2j6K89j17j92M92P9m13p9P7Q5l58J13K36m5q9k52j66J77j31R0m4K6J55m0
2657a45l2M26r3l20O4l56J31J07P0O0J62k66L66j6l12K56o9k61J41M18k64r3O
2680b0L16r7n8L0l64M47j86j61Q3L67j46m2j5RJ82m82Q9K05K60l16rK21n2Q7k47
2705A01n62M10NJ12j43j45K21k49L96n70L1J17J97j79j31L64k2j30r4K02l7j49
2727b55R6n35L67J86k63K90k7J98q1j30n9R9J0j4N5P5j50J64m1k72N51j54j46
2750c6J09r7L36m5K2j63r6J27L7l59L14Q3J8j96j10K89j45k97L06K77j70j06J42
2773B40k64K0k71R3J12M03m87P5Pln4j77M03k54L02l55o4m9L65r6o1N2J6j95K69
$$ plain form
2611 398 94 -267 -191 -29 61 25 -254 0 342 251 -130 -39 108 238 109 -59 140 388 166 -144 136 -22
2633 -22 -38 251 134 -58 434 513 100 21 98 183 -175 -62 174 129 40 -212 -378 -201 -332 -242 -286 -260 -105 -145
2657 -145 -177 249 156 -164 -100 -456 -325 -218 -148 -88 74 -192 174 158 -154 102 33 -228 -87 331 67 -26 -20
2680 -20 296 199 141 171 -193 254 68 -93 -10 357 211 169 154 163 345 -137 -48 157 417 101 92 313 261 348 101
2705 101 -461 -51 -46 66 -77 -222 -1 -250 146 -424 -393 -276 -79 -258 -389 -25 -47 -177 -271 -69 -106 -255
2727 -255 -159 -694 -327 -141 -404 -114 -141 57 -24 -154 -213 -114 -104 -118 -63 12 -138 26 -15 -287 264 110 -36
2750 -36 73 -24 312 267 289 126 30 157 194 -165 149 232 250 54 -56 233 88 -209 97 374 204 98 240
2773 240 -24 -4 -275 -182 -70 333 -154 -79 -72 -75 -129 -306 97 -157 145 -210 -274 -323 42 -54 -115 -63 -47 -242 27
2798B7k99K39K21l23J78l00M18q2J17l91L13Qj32J05q7K19q9j08J14j0k4J58j66
2821A06k3K42q8k39P8K05J06k12k29n3K41j6o2l22M37K43k07k75j16J87R6Pk68
2844a62M2N8q4n1r5M46l68J59k52N8K18l0m68M95m4j30o6M06l60L43j63JJ48j27
2868b6L2k61N5P4K95j20j67L84l42QJ14M6k15M82K4l87J34M3M05p73M56k77J78
2891A62m70N86n8j22p9m8J21O4j0J09k96j34P2J37j11J99J3m92J68p3J86j36j45
2914c57J68K8n8Q4RP9J50j20m32K57J2J48r1l82M50K0J86l84J05K20K08l98j36
2937b34L61j58j79k82O09O5j21k64J51K08J20R5Nj71o7k9n0k34L62K01n78M8K70
2960A28J07j48l38L89j50K49l5k88P3K06l46R2Q8k6m4k00J37J37J0n63O9L0L79
$$ plain form
2798 27 -272 -33 188 -135 43 -257 161 79 196 -195 118 126 -6 99 12 231 142 34 148 138 114 272 106
2821 106 83 325 237 -2 76 281 387 175 -54 -107 134 118 56 -266 171 414 207 -68 -184 3 99 106 -162
2844 -162 -120 -62 -146 -197 -292 154 -214 -55 -307 -249 -31 -61 -529 -34 -78 -208 -274 132 -228 115 -48 -47 101 -26
2868 -26 6 -255 -200 -126 169 49 -118 266 -76 -68 46 92 -123 359 383 -4 130 173 578 -195 261 -16 162
2891 162 -308 278 220 98 19 -29 92 156 146 255 -41 -175 -103 34 -77 122 135 -357 -189 -262 -76 -212 -357
2914 -357 -189 -161 -219 -135 -126 -47 103 -17 -449 -192 -180 -32 -123 -505 -55 -35 151 -233 -128 92 300 -98 -234
2937 -234 127 -31 -210 -492 117 182 61 -203 -52 156 276 371 376 205 138 109 59 -175 187 388 -190 -142 128
2960 128 235 87 -251 138 -12 237 202 -86 -13 193 -153 -61 27 1 -43 -243 -106 31 41 -522 -453 -423 -44
2983d4k68R3N2j05K10l81K74J09l6l8j58N39j77m22L61J37j11j70K59J28r3L5
3005A94q9k16j59L10j73J55J79O6j89r6p9J77j04K80k92J48j17O5p3q2L74O4k89
3028E4n6r8L93l2l25l7K12K4k47M4K48j93J63Pk20j15j00K79k78L99j96N7m8l1
3052i6J17mRk16J96J49m53P5n5n6P26n18Mr2M50p8k71L3j49L17j19O3r2J80j20
3077@k2L3K34k98K66n7rk8k9j97L92l38J58n9M9ok28L4N8L7L08k22o9m5K11j97
3103b4l61J75J05Q0Q3k02l3N1O2Qm9K25k25r7n0L44k32J02j02n8L50p1l32l9L29
3128C9J35m84J72L1M04l28pj78M37l03J87r8N2M26l24k47m6M11r7K8n2o4N7O4
3152B15j29j11K77j84J23m3j07J94q9k20j91L51O2k05j49M38l57L88l54j42L12
$$ plain form
2983 -44 -312 -219 -167 -272 -62 -443 -169 -60 -96 -134 -292 247 70 -352 9 146 35 -135 124 252 159 194
3005 194 105 -111 -270 40 -133 22 201 267 78 -18 -97 80 -24 256 -36 112 -5 60 -13 -95 279 343 54
3028 54 -2 -100 293 261 -64 -101 111 135 -112 -68 180 -13 150 157 -63 -178 -278 1 -277 122 -74 -17 -65 -96
3052 -96 21 17 26 -190 6 155 -298 -223 -278 -334 392 -126 -122 -214 236 158 -113 -80 -229 88 -31 32 -60 120 0
3077 0 -22 11 245 -53 213 156 147 119 90 -107 285 -53 105 46 95 89 -139 -105 -47 -10 298 76 7 -38 173 -24
3103 -24 -385 -210 -105 -25 58 -144 -177 -126 -64 -56 -105 120 -105 -202 -252 92 -140 -38 -140 -198 152 81 -251 -290 39
3128 39 174 -310 -138 -107 297 -31 -38 -216 221 -82 105 7 59 485 161 -86 -132 279 182 210 158 94 151 215
3152 215 86 -25 252 68 191 148 41 235 146 -74 -265 86 148 -57 -206 232 -125 263 -91 -233 79
3173G9Rm61L19J1K24l99L65k15J69l44n9J13q7K04r3Q0l9l0L05k36pJ36j01l9
3197i6J92k07NQLJ29KJ26J41N8m22M61p80K23K75P0l81K10j83M42j99j46K50r9
3221H2K80n17J20m3K16m78K56Q6r2N4O8j72M37k00n5l10J87Q6j28k58K98j32N29
3244C14n36J55l07K30n1k7P0R2p9qNQ6K25p0j26O9k70K39L16k94NO2J68l56RJ95
3270A16J72k57OK51K71n29Q6j59J88O5q6L1K4j02j09O7M4K82Q3l24L6j77J18K7
3294A24k09J73k41J60k09K4M6o9J73k08K43K43k61J07k0Nj25oJ76m26j24R9J21
3317b04Q6Pr7J5K79O2j53M9j60J92K1J72k84j0M8J40j87j93M94J06m27k4J39L88
3341D59n27N2P2K7m8p9K68l5M0j92J06O7j25K31l87r0O6K38j34n5j5L8L0j62O1
$$ plain form
3173 79 88 -373 -54 -43 181 -218 147 -68 101 -243 -302 -189 -276 -72 -165 -85 -124 -154 151 -85 -92 44 -57 -96
3197 -96 96 -111 -106 -98 -95 34 36 162 303 361 -61 400 -380 -157 118 188 -193 17 -166 276 77 -69 181 82
3221 82 362 -155 -35 -78 138 -340 -84 2 -90 -36 32 -140 297 97 42 -268 -81 5 -123 -381 -83 -215 314
3244 314 -222 -67 -374 -144 -195 -222 -152 -60 -139 -147 -142 -56 169 99 -27 42 -228 11 327 33 38 100 268 -88 -79 116
3270 116 288 31 37 288 559 30 116 -43 145 210 124 155 179 77 -32 35 79 361 444 120 156 -21 97 124
3294 124 -85 88 -153 7 -202 -178 -132 -201 -28 -236 7 250 -11 96 76 81 -44 -50 126 -300 -424 -325 -204
3317 -204 -118 -111 -208 -193 86 148 -5 44 -116 76 97 269 -15 -25 23 163 -24 -217 277 383 -44 -68 71 459
3341 459 -68 -16 56 83 35 -44 224 189 229 37 143 210 85 316 -71 -161 -95 143 9 -46 -61 -23 7 -155 -94
3366i4K29p3k05J24j84J37L0j46qJ76M3p9r7L4M7N3j19J63o5J4o9J21k32M21m64
3391b43J67j64L01j00L0K62l97K82k07NJ01Q8r3lK13J06k37j71K48k45J14J14
3413A71J7n0p9K37j39N1J75l28k82L91k23J3nl38qM51n2k49J99k26K96J88l52
3436a42qJ83k95J06k17L70kk17J07J83j77J01J07m0q0J05k33O6L34k94L29l38
3458e2Q6J30j53K47q7l11L72j75oK9m32M35k04M33l93L75k35j19p5J52k05J94
3480FR4o9K51k21o6oJ55k86J78j78J50k62K48m26K25J96R5r7j79q7M50k51k42
3503c22J16k6J96q3q1K20j63j26J57J6J36k08o9J9J90j68L94j88q7K52k10O9M4
3526G8P4q1J9J02m26L40k58L25P1q2j37j09J77j18k7Q1j09K11J7l55K28j05M03
$$ plain form
3366 -94 135 62 -143 -19 -203 -66 -36 -182 -190 -14 29 -50 -147 -113 -66 -13 -132 31 -34 -20 -89 32 -200 221 -243
3391 -243 -76 -240 61 -39 -9 253 -144 138 -69 -64 37 125 32 29 242 348 111 -60 188 -57 57 171
3413 171 188 138 59 296 157 208 383 55 -227 164 -59 -46 -51 -389 -397 54 2 -247 -48 -274 22 210 -142
3436 -142 -150 33 -262 -156 -373 -3 -5 -222 -115 68 -109 -8 99 59 -21 84 -149 -83 251 -43 286 -52
3458 -52 34 164 11 258 171 -140 232 57 51 80 -352 83 -121 312 -81 294 59 -60 -135 17 -188 6
3480 6 100 31 282 61 -5 -11 144 -142 36 -142 8 -254 -6 -432 -207 -11 84 -13 -192 -279 171 -80 -322
3503 -322 -206 -232 -36 -119 -200 20 -143 -269 -112 -96 40 -168 -237 -218 -28 -196 198 10 -77 175 -35 34 78
3526 78 152 71 90 192 -234 106 -152 173 244 162 25 -84 93 -25 -52 29 -80 131 148 -207 21 -84 319
3549C19j79l30M14l48P0M45m69m8K83k5l29R7L5J90k68O2r4J61j71J89l6m2k6
3572a00j05J26K40N3j98k36j2M74j44l31J3M26l0k65J96r1mJ37k67K06o7j3r4
3595h6n9J34J39k81M07k59j22N02m21NK04O4k59J96l55K01J59l08j50N08Qj29
3617I8K0j51L5p2k7J66k28k7J23J18k38J68n6K6J28l63K63j6J33O2k75J00r5J86
3641G8k00L5K36k49Q5k63J89r9K21q6J02j76k27M64j28j33J01K52j11J98j90j40
3663d1R2J52k90QK72J52j40j90r1N1R0o9j12L09M2k88k8J77k9O9n8j66J7L66n78
3688b83M10j42Q4k80o6J64K43k38j14M01l50L51k28k23K19q8kJ53k24J27R2o3
3710e7j28K26j17N0o7p4L37k6q6p6J90j00q0K38k97K43k52K43Q6p5k10N8K50o8
$$ plain form
3549 319 140 -190 224 -124 -54 391 -78 -126 157 132 -197 -100 -65 125 -143 -81 -175 -14 -185 4 -32 -74 -100
3572 -100 -205 -79 161 214 16 -220 -232 242 98 -233 -220 206 176 -89 107 16 12 149 -118 88 21 8 -86
3595 -86 -145 -11 128 -153 254 -5 -127 375 -46 -41 163 227 -32 164 -191 10 169 -139 -289 219 227 98
3617 98 118 -33 2 -70 -97 69 -159 -186 -63 55 -183 -15 -71 -45 83 -280 -17 -33 100 162 -113 -13 -108 78
3641 78 -122 -87 149 -100 -15 -278 -89 -188 33 -53 49 -127 -354 110 -18 -151 -50 202 91 289 99 -41
3663 -41 51 203 -87 -79 193 345 205 15 -76 -25 65 -4 -116 193 235 -53 -81 96 67 136 78 -88 -71 295 -283
3688 -283 127 -15 69 -211 -277 -113 130 -108 -222 179 -171 180 -48 -271 -52 -140 -142 11 -213 -86 6 -57
3710 -57 -185 41 -76 -26 -93 -167 170 144 58 -18 172 72 -8 230 -67 176 -76 167 253 178 -32 26 276 208
3734B08j17o8m9K59j66k7%Lq8j8j47N9K14k76M55j75J4J46l96J71l81N16r9m2
$$ plain form
3734 208 91 23 -26 233 67 40 40 43 -45 -63 -210 -151 63 -213 242 67 81 227 -169 2 -379 137 38 -4
$$ [...]
8191i3
##END NTUPLES=NMR FID
##END=
