##TITLE=1H_SL19a-Dau
 CDCl3, 8 sc, 
 30.08.2021
##JCAMPDX= 6.0         $$ Bruker NMR JCAMP-DX V2.0
##DATA TYPE= NMR FID
##DATA CLASS= NTUPLES
##ORIGIN= UXNMR, Bruker Analytische Messtechnik GmbH
##OWNER= root
$$ XWIN-NMR		Version 3.5
$$ Mon Aug 30 08:45:33 2021 Russian Standard Time (UT+4h)  she@DPX200
##.OBSERVE FREQUENCY= 200.131506
##.OBSERVE NUCLEUS= ^1H
##.DELAY= (6, 6)
##.ACQUISITION MODE= SIMULTANEOUS
##.ACQUISITION SCHEME= undefined
##.AVERAGES= 8
##.DIGITISER RES= 18
##SPECTROMETER/DATA SYSTEM= spect
##.PULSE SEQUENCE= zg30
##.SOLVENT NAME= CDCl3
##.SHIFT REFERENCE= (INTERNAL, CDCl3, 0, 15.7039)
##AUDIT TRAIL= $$ (NUMBER, WHEN, WHO, WHERE, WHAT)
$$ ##TITLE= Audit trail, XWIN-NMR		Version 3.5
$$ ##JCAMPDX= 5.01
$$ ##ORIGIN= Bruker BioSpin GmbH
$$ ##OWNER= she
$$ F:/spectra/data/she/nmr/H-F/1/audita.txt
$$ ##AUDIT TRAIL=  $$ (NUMBER, WHEN, WHO, WHERE, WHAT)
(   1,<2021-08-30 08:44:22.89 +0400>,<she>,<DPX200>,
      <created by zg, POWCHK disabled, PULCHK disabled
       configuration hash MD5:
       00 E9 B6 7A A2 85 ED C7 34 08 36 98 17 FE 4E 26
       data hash MD5: 16K
       01 35 F7 12 D4 0E 6C C0 C8 C8 FF 6B 0B 0A 13 69>)
$$ ##END=
$$ 
$$ hash MD5
$$ B4 1A 36 A8 C1 03 39 8D 9F 3D A5 AF 77 AC 31 C1
##$RELAX= 
##$RELAX= 
##$RELAX= 
##$RELAX= 
##$RELAX= 
##$RELAX= 
$$ Bruker specific parameters
$$ --------------------------
##$DU= <F:/spectra>
##$EXPNO= 1
##$NAME= <H-F>
##$PROCNO= 1
##$TYPE= <nmr>
##$USER= <she>
##$AMP= (0..31)
100 100 100 100 100 100 100 100 100 100 100 100 100 100 100 100 100 100 
100 100 100 100 100 100 100 100 100 100 100 100 100 100 
##$AQSEQ= 0
##$AQ_mod= 1
##$AUNM= <au_zg>
##$AUTOPOS= <>
##$BF1= 200.13
##$BF2= 200.13
##$BF3= 200.13
##$BF4= 200.13
##$BF5= 200.13
##$BF6= 200.13
##$BF7= 200.13
##$BF8= 200.13
##$BYTORDA= 1
##$CFDGTYP= 0
##$CFRGTYP= 5
##$CHEMSTR= <none>
##$CNST= (0..31)
1 1 145 1 1 1 1 1 1 1 1 1 1 1 1 1 1 1 1 1 1 1 1 1 1 1 1 1 1 1 1 1 
##$CPDPRG= <>
##$CPDPRG1= <>
##$CPDPRG2= <>
##$CPDPRG3= <>
##$CPDPRG4= <mlev>
##$CPDPRG5= <mlev>
##$CPDPRG6= <mlev>
##$CPDPRG7= <mlev>
##$CPDPRG8= <mlev>
##$CPDPRGB= <>
##$CPDPRGT= <>
##$D= (0..31)
0 1.2 0 0 0 0 0 0 0 0.06 0 0.03 0 0 0 0 0.0002 0 0 0 0 0 0 0 0 0 0 0 0 
0 0 0 
##$DATE= 1630298662
##$DBL= (0..7)
120 120 120 120 120 120 120 120 
##$DBP= (0..7)
150 150 150 150 150 150 150 150 
##$DBP07= 0
##$DBPNAM0= <>
##$DBPNAM1= <>
##$DBPNAM2= <>
##$DBPNAM3= <>
##$DBPNAM4= <>
##$DBPNAM5= <>
##$DBPNAM6= <>
##$DBPNAM7= <>
##$DBPOAL= (0..7)
0.5 0.5 0.5 0.5 0.5 0.5 0.5 0.5 
##$DBPOFFS= (0..7)
0 0 0 0 0 0 0 0 
##$DE= 6
##$DECBNUC= <off>
##$DECIM= 32
##$DECNUC= <off>
##$DECSTAT= 4
##$DIGMOD= 1
##$DIGTYP= 9
##$DL= (0..7)
0 120 120 120 120 120 120 120 
##$DP= (0..7)
150 150 150 150 150 150 150 150 
##$DP07= 0
##$DPNAME0= <>
##$DPNAME1= <>
##$DPNAME2= <>
##$DPNAME3= <>
##$DPNAME4= <>
##$DPNAME5= <>
##$DPNAME6= <>
##$DPNAME7= <>
##$DPOAL= (0..7)
0.5 0.5 0.5 0.5 0.5 0.5 0.5 0.5 
##$DPOFFS= (0..7)
0 0 0 0 0 0 0 0 
##$DQDMODE= 0
##$DR= 18
##$DS= 0
##$DSLIST= <SSSSSSSSSSSSSSS>
$$ [...]
##$SUBNAM2= <"">
##$SUBNAM3= <"">
##$SUBNAM4= <"">
##$SUBNAM5= <"">
##$SUBNAM6= <"">
##$SUBNAM7= <"">
##$SUBNAM8= <"">
##$SUBNAM9= <"">
##$SW= 20.0188882624521
##$SWIBOX= (0..15)
0 0 2 0 0 0 0 0 0 0 0 0 0 0 0 0 
##$SW_h= 4006.41025641026
##$TD= 16384
##$TD0= 1
##$TE= 0
##$TE2= 300
##$TE3= 300
##$TEG= 300
##$TL= (0..7)
0 120 120 120 120 120 120 120 
##$TP= (0..7)
150 150 150 150 150 150 150 150 
##$TP07= 0
##$TPNAME0= <>
##$TPNAME1= <>
##$TPNAME2= <>
##$TPNAME3= <>
##$TPNAME4= <>
##$TPNAME5= <>
##$TPNAME6= <>
##$TPNAME7= <>
##$TPOAL= (0..7)
0.5 0.5 0.5 0.5 0.5 0.5 0.5 0.5 
##$TPOFFS= (0..7)
0 0 0 0 0 0 0 0 
##$TUNHIN= 0
##$TUNHOUT= 0
##$TUNXOUT= 0
##$USERA1= <user>
##$USERA2= <user>
##$USERA3= <user>
##$USERA4= <user>
##$USERA5= <user>
##$V9= 5
##$VALIST= <valist>
##$VCLIST= <CCCCCCCCCCCCCCC>
##$VD= 0
##$VDLIST= <DDDDDDDDDDDDDDD>
##$VPLIST= <PPPPPPPPPPPPPPP>
##$VTLIST= <TTTTTTTTTTTTTTT>
##$WBST= 1024
##$WBSW= 4
##$XGAIN= (0..3)
0 0 0 0 
##$XL= 0
##$YL= 0
##$YMAX_a= 127099
##$YMIN_a= -270366
##$ZGOPTNS= <>
##$ZL1= 120
##$ZL2= 120
##$ZL3= 120
##$ZL4= 120
##$ABSF1= 10
##$ABSF2= 0
##$ABSG= 5
##$ABSL= 3
##$ALPHA= 0
##$AQORDER= 0
##$ASSFAC= 0
##$ASSFACI= 0
##$ASSFACX= 0
##$ASSWID= 0
##$AUNMP= <proc_1d>
##$AZFE= 0.1
##$AZFW= 0.1
##$BCFW= 1
##$BC_mod= 2
##$BYTORDP= 1
##$COROFFS= 0
##$CY= 11.3945322036743
##$DATMOD= 1
##$DC= 2
##$DFILT= <>
##$DTYPP= 0
##$F1P= 2.36226072786647
##$F2P= -0.459571619588291
##$FCOR= 0.5
##$FTSIZE= 0
##$FT_mod= 4
##$GAMMA= 1
##$GB= 0.15
##$INTBC= 1
##$INTSCL= 1
##$ISEN= 128
##$LB= 0.24
##$LEV0= 0
##$LPBIN= 0
##$MAXI= 10000
##$MC2= 0
##$MEAN= 0
##$ME_mod= 0
##$MI= 1.114404
##$NCOEF= 0
##$NC_proc= 0
##$NLEV= 6
##$NOISF1= 3.799351
##$NOISF2= 2.8
##$NSP= 1
##$NTH_PI= 0
##$NZP= 0
##$OFFSET= 15.70392
##$PC= 1
##$PHC0= -13358.49
##$PHC1= 13.20099
##$PH_mod= 1
##$PKNL= yes
##$PPARMOD= 0
##$PSCAL= 0
##$PSIGN= 0
##$REVERSE= no
##$SF= 200.130013532006
##$SI= 16384
##$SIGF1= 3
##$SIGF2= 2
##$SINO= 400
##$SIOLD= 16384
##$SREGLST= <1H.CDCl3>
##$SSB= 0
##$STSI= 0
##$STSR= 0
##$SW_p= 3612.71676300578
##$SYMM= 0
##$S_DEV= 0
##$TDeff= 0
##$TDoff= 0
##$TI= <>
##$TILT= no
##$TM1= 0
##$TM2= 0
##$TOPLEV= 0
##$USERP1= <user>
##$USERP2= <user>
##$USERP3= <user>
##$USERP4= <user>
##$USERP5= <user>
##$WDW= 1
##$XDIM= 8192
##$YMAX_p= 0
##$YMIN_p= 0
$$ End of Bruker specific parameters
$$ ---------------------------------
##NTUPLES= NMR FID
##VAR_NAME=  TIME,          FID/REAL,        FID/IMAG
##SYMBOL=    X,             R,               I
##VAR_TYPE=  INDEPENDENT,   DEPENDENT,       DEPENDENT
##VAR_FORM=  AFFN,          ASDF,            ASDF
##VAR_DIM=   8192,          8192,            8192
##UNITS=     SECONDS,       ARBITRARY UNITS, ARBITRARY UNITS
##FACTOR=    0.0002496,     1,               1
##FIRST=     0,             0,               0
##LAST=      2.0444736,     0,               0
##MIN=       0,             -270366,         0
##MAX=       2.0444736,     127099,          0
$$ Real data points
##PAGE= N=1
##DATA TABLE= (X++(R..R)), XYDATA
0 0 0 0 0 0 0 0 0 0 0 0 0 8 -8 8 -8 16 -16 20 -24 32 -34 40 -49 60 -72 81 -96 112 -128 146 -169 192 -217
33 -217 247 -279 313 -353 395 -442 492 -548 609 -677 750 -829 915 -1011 1114 -1227 1352
50 1352 -1487 1641 -1808 1993 -2204 2440 -2706 3012 -3366 3784 -4282 4893 -5657 6647 -7983
65 -7983 9902 -12903 18276 -30889 126495 -33322 -197872 127099 66854 -65828 43595
76 43595 106461 -11669 8198 37564 17645 12616 13848 -17496 3077 17491 15102 16442 16518
89 16518 -14615 -17474 7693 7746 -31494 -17827 15714 -8053 -16197 25729 -2084 -44441 -21442
102 -21442 -17964 -14036 40249 11469 -60338 -30272 8053 -7576 2957 -2944 -29223 -10062 -12352
115 -12352 -29904 13734 14696 -51754 -40948 17061 12147 -23500 -33787 -14207 -5390 -32182 -14869
128 -14869 29737 -20555 -67950 -4925 21553 -17920 -4142 470 -39707 -30613 4479 6669 4118
141 4118 -6599 -13756 2284 -392 -12597 -4798 -6620 -3912 13966 2660 -2612 18576 -1663
154 -1663 -29643 -2624 16093 -455 -8516 -4798 4594 6523 -1771 11339 2261 -51671 -35649
167 -35649 33677 23448 -6321 10786 -11304 -40156 -5225 14000 -2379 -593 -6526 -11511 12285
180 12285 12169 -12633 -8781 3161 -760 -206 6902 6943 -1900 -2858 10762 7691 -3401 8238 4383
195 4383 -13488 9198 23019 -2376 3873 11233 -18611 -3397 35898 11137 -14258 -643 116
208 116 2474 13235 8789 13054 8891 -19422 -2317 35715 8676 -20707 6678 21618 6381
221 6381 7275 16211 6366 -10253 -37 26884 19631 -5470 2455 11072 823 11820 20356 4436
235 4436 -535 91 -3998 12051 17064 -1654 299 8704 -159 2480 5040 -6241 -1976 3129 -4444
250 -4444 6775 13981 -7666 -13428 3628 6587 -5721 -10007 1044 5928 -12543 -7326 23224
263 23224 8613 -29048 -19036 4162 3069 3894 1727 -8547 -9680 -11411 -4303 9698 -5603
276 -5603 -22050 -2032 3355 -14765 -7791 3404 -9190 -15286 -5778 501 -3337 -16637 -17954 -2648
290 -2648 1560 -4348 -6713 -10687 -7675 -3184 -12366 -7779 7501 -6825 -20325 -1382 7926 -1216
304 -1216 -4199 -7662 -9322 -5483 -3911 7115 13574 -8050 -15625 6703 7237 -6887 -1826 3516
318 3516 -414 992 5712 9876 1342 -13445 -707 17272 5310 -1117 7965 -512 -5937 7436
332 7436 10472 7811 6526 -3918 -1423 12965 8985 -603 2306 5449 7279 7029 2717 8065 8683
347 8683 -4349 -1335 12951 9221 1326 4810 6860 5965 3231 4455 10008 -1143 -11061 11154
361 11154 23577 1777 -5441 4240 454 -962 6843 9482 6314 -5802 -9468 9296 12816 -4446
375 -4446 -1894 4028 -6111 -979 7695 -1943 -4359 2099 -230 1346 2917 -4452 -5911 -3989 -2254
390 -2254 5737 3319 -4370 1143 -2336 -10620 3378 9357 -9151 -11320 3739 4941 -923 -1380 1155
405 1155 -1428 -13958 -9506 12257 7890 -11166 -5658 2779 -4759 -5468 -800 -1624 -5341 -7602 1271
420 1271 9109 -7106 -16382 -2556 -276 -4497 4432 1170 -10969 -6854 -3346 -3086 3570 -1139 -9020
435 -9020 -2197 261 -1510 1141 -5565 -8332 -33 -3050 -4767 7087 408 -13912 -4676 3317 -3551
450 -3551 -6796 -4942 -777 -1763 -9196 -1336 7658 -11846 -21490 1226 7155 -6973 -4442 452 -8412
465 -8412 -10339 -320 7224 -1290 -14120 -5374 6588 -489 -3309 3508 -277 -2621 305 -532 4060
480 4060 6347 -4408 -1923 10624 7144 2867 2329 -4281 2040 11882 2976 3419 11106 -581 -3052
495 -3052 13158 9844 -2085 3439 5908 3169 6618 9747 10213 4639 -4150 2976 14811 8207 1098
510 1098 8232 10380 3496 1889 10276 13710 -151 -3372 14677 15938 789 3862 6330 -3059
524 -3059 5431 14543 4288 1193 2326 -3867 2968 10420 -78 -4259 528 -563 3120 3327 -5444
539 -5444 -2029 954 -8221 -3267 8049 -1971 -9361 -950 629 -5442 -4024 2098 903 -10828
553 -10828 -8386 9273 6595 -11959 -8613 2133 -1778 -2621 1682 -867 -6833 -8399 -839 7029
567 7029 -2440 -11122 -2962 -1482 -7351 -874 1163 -6109 -5798 -3650 -3226 -626 -4866 -8258 -2891 -4423
583 -4423 -4074 4531 -2168 -10840 -1989 -2443 -7263 5412 4657 -13132 -7379 7390 1931 -4857 -2268
598 -2268 -2299 -3483 -2128 1557 4387 -2341 -9258 -2173 3886 -2439 -5270 1222 2168 -7544 -7704 6299
614 6299 4080 -11365 -5394 5144 -2801 -2221 5213 -4823 -8739 1659 1324 1780 6659 -5180 -9139
629 -9139 5923 6346 -1526 2026 105 -2309 6139 4895 -920 4508 2869 -4598 3675 9908 144
644 144 -1550 5888 3617 -3751 1674 10507 3572 -6656 245 8020 2874 136 2097 -147 -520
659 -520 1705 6213 8053 -2284 -9492 4878 12578 208 -1023 5874 202 -99 6213 3043 1428
674 1428 4706 1346 1291 6347 4502 1517 979 -313 3183 6280 2640 3448 2051 -4378 642 8743
690 8743 2025 -3950 625 1935 373 2004 3344 702 -5291 -5241 6060 7995 -4358 -6694 2509
705 2509 2612 -3916 -2162 3989 1856 -6584 -3076 5046 -279 -4831 335 -1662 -5107 1754 2581 -4123
721 -4123 -4025 -4812 -4797 2816 1597 -7337 -5460 -2430 -4133 -192 -688 -7899 -6149 -1927 -4244 -1761 -746
738 -746 -7481 -7810 3 -965 -6735 -2939 1666 -4725 -9734 -451 4302 -4224 -7197 -836 -559 -2255
754 -2255 -131 -572 -2050 -3215 -3781 3135 6372 -4544 -7206 2798 1263 -2585 4052 2592 -3936
769 -3936 -578 2135 735 1557 480 -1620 1214 3726 2143 1395 629 858 1219 1490 4107 5537 387
786 387 -1485 2910 5175 3316 1955 1407 2785 1986 2339 7356 4979 -4425 -518 8789 4254 -491
802 -491 4074 3992 -403 -108 3701 6065 1595 -2578 2514 5446 773 504 2718 435 -250 2254 2541
819 2541 3035 289 -3315 315 3892 1117 551 662 -1876 279 2291 148 1227 526 -4356 -636
835 -636 5374 464 -4063 -256 1693 -1312 -1837 2352 2319 -4163 -4642 3022 3030 -3156 -2013 297 -1350
852 -1350 -1333 -104 750 -495 -4536 -3570 3794 1600 -4275 -1095 -253 -4242 -757 2143 -1636 -2102 -1417
869 -1417 -3009 -262 1293 -2151 -3422 -2047 -451 -148 -1427 -1470 -1066 -4061 -3469 2786 1086 -5778
885 -5778 -3426 391 -728 -2929 -2393 444 -1426 -6661 -2119 5019 -2094 -7861 -1278 900 -3755
900 -3755 -1996 650 -2125 -4724 -3732 703 919 -3504 -4234 -102 -1534 -2943 348 -789 -3670 -1878
916 -1878 -497 -84 1360 -904 -2834 -816 420 1086 1208 -1035 419 1365 -1201 1498 5149 -536
932 -536 -3393 2932 4992 721 45 2377 2562 287 310 5661 5373 -2091 -840 6146 3819 -279 3013
949 3013 3714 1111 1298 3777 5673 2126 -1375 3010 5663 1881 2401 5250 1823 -125 3486 4349
965 4349 3263 2844 1203 1716 4173 3643 1738 1126 1505 2719 2025 918 3222 2618 -2060 -344 4481
982 4481 1757 -1159 66 1271 -131 -946 1281 2876 -1545 -4646 2269 3845 -2799 -2267 1770 -1135
998 -1135 -2839 835 1995 -777 -3664 -2692 1614 414 -3462 -966 -4 -2957 -2286 705 -1029 -2856
1014 -2856 -2568 -2724 -1197 -44 -2082 -3899 -3583 -2026 -1385 -2458 -2727 -1809 -3859 -4947 -561 244 -4618
1031 -4618 -4614 -1181 -1329 -2737 -2650 -5 -1234 -6223 -2933 3780 -487 -5535 -712 1023 -2982 -1592
1047 -1592 1783 -570 -3035 -1900 944 2500 -1857 -3273 590 571 -2350 1141 2241 -2126 -2215 1192
1063 1192 653 -551 169 -135 -846 178 1456 843 -105 839 -22 -1674 1657 4164 60 -2576 1084
1080 1084 2780 1912 696 417 1517 598 -1259 3163 4568 -2154 -2661 4467 2440 -2299 1413 2832
1096 2832 -1261 -1046 1997 2616 694 -1508 15 1837 -23 -254 2759 1339 -1868 7 2986 2458
1112 2458 413 -780 215 1985 3166 2070 159 605 2135 1833 1348 2994 2111 -274 1119 3381
1128 3381 2244 881 1078 2046 1947 193 1172 4923 1412 -3293 1318 4489 -528 315 3342 -752
1144 -752 -2533 2187 3071 142 -1861 -1553 1817 3041 -901 -1787 1069 -433 -1943 969 1098 -1997
1160 -1997 -1538 -77 -918 -1285 154 -1616 -2817 -772 -892 -3062 -396 788 -4303 -5044 58 -183
1176 -183 -3152 -2937 -3134 -2698 -1100 -2148 -2320 -1508 -5065 -4729 1976 -280 -6827 -2946 1438 -3583 -3903
1193 -3903 960 -1070 -4084 -1735 -293 -745 -1082 -1369 -778 -581 -1961 -1196 1329 735 -2493 -1922 1511
1210 1511 1296 -404 -258 -569 -1262 1960 1976 -907 31 1040 -1386 927 3725 -530 -2110 2040 2927
1227 2927 385 593 1692 1736 989 -165 2377 4537 960 -878 3072 2390 -207 2906 4448 668
1243 668 -998 2050 4087 2618 -307 -4 2549 2576 1213 2156 1569 -296 247 2686 2340 133 316
1260 316 986 1282 1226 1470 286 288 1702 -244 -870 2754 2127 -1958 -240 1823 21 342 1310 -654
1278 -654 -519 -36 113 2631 707 -4056 -738 3637 -901 -2584 1823 299 -2849 359 2119 -675
1294 -675 -1898 -895 190 222 -341 -876 -231 -244 -1655 -1573 918 640 -2191 -1588 173 -269 -35 57 -1919
1313 -1919 -1755 638 -714 -1214 1388 -1421 -3610 823 1823 -2268 -1928 274 -1051 -1322 -542 -97
1329 -97 -958 -1860 -2134 437 230 -2871 -1393 743 -1867 -3342 34 871 -2270 -3706 -609 779 -1503
1346 -1503 -1887 -1031 -1718 -2307 -368 -483 -1173 -1585 -1511 -674 251 -744 -1900 -1175 -856 -258 -125 -1123 -112
1365 -112 143 -1931 -1232 1450 90 -1693 -32 725 -479 -118 1246 785 -859 -1628 1590 3467 -520
1382 -520 -1321 2273 1604 -604 1321 2492 81 -690 1793 2800 1793 283 1081 1885 1328 1293 2076
1399 2076 1834 1328 1183 1675 2617 2258 1000 1341 1377 1855 2402 1613 1057 2148 1775 489 2458 3598
1417 3598 -6 41 3115 2081 -11 1720 2204 599 -59 1262 2350 1018 -1280 247 2388 101
1433 101 -738 1453 981 -1247 -482 1673 946 -1734 -1347 811 -100 -1185 169 192 -2068 -1487 -324
1450 -324 -631 -779 -974 -2085 -1449 -129 -953 -1447 -1807 -1956 -1465 -1524 -1298 -634 -1608 -3371 -1249 207 -1751
1469 -1751 -3064 -913 -941 -2374 -2072 90 -495 -3216 -2375 692 -452 -2586 -836 -39 -1541 -1867 107
1486 107 222 -1259 -2094 -416 568 -734 -938 520 -467 -1565 -261 697 -461 -705 -392 -300 559 723
1504 723 -224 -577 -215 394 355 -155 489 350 -1018 -680 1850 874 -1570 -285 1353 -47 -724 691
1522 691 1477 -663 -1780 843 2349 -459 -1445 1295 1076 -584 319 1765 67 -1310 -21 1580
1538 1580 993 -530 416 998 -64 224 1658 569 -489 -47 679 919 970 237 240 719 832 1319 1278
1557 1278 540 799 621 185 1682 2367 23 -569 2026 2359 282 510 1885 860 -103 1112 3066
1574 3066 1338 -548 820 2571 622 -314 1426 1668 -87 -206 1893 1951 -179 -455 921 462 -535
1591 -535 590 1154 -590 -742 187 598 342 -444 -921 -467 140 -322 -145 -705 -1008 -622 -410 -886 110
1610 110 -148 -2278 -1213 792 -1111 -2254 -246 -372 -1905 -2114 -105 -344 -2618 -2284 -518 -674 -2001
1627 -2001 -1728 -259 -1587 -2858 -1353 288 -1683 -3193 -1153 137 -1582 -1653 -343 -1227 -2165 -856
1643 -856 -280 -1075 -590 -1029 -956 6 -411 -1181 -516 -575 -558 -198 97 -334 164 -584 -1287 793 1209 -741
1663 -741 -686 930 398 -760 1164 1795 -575 -1421 1045 1823 266 -272 758 1321 543 291 1688 1824
1681 1824 -424 410 2257 1725 -319 1066 2215 263 246 2103 1471 868 1319 243 929 2379 1058
1698 1058 478 1026 665 785 1773 1115 -35 558 890 805 1651 601 -1178 957 2262 -88 -418 1533
1716 1533 586 -1069 403 1500 -30 -468 662 361 81 35 255 1029 -54 -1522 157 1708 59
1733 59 -1521 501 221 -1141 696 1318 -1437 -969 764 -107 74 102 -1360 -642 1228 -214 -1046 -159
1751 -159 138 -714 -389 -507 138 531 -462 -1236 314 -10 -1229 11 390 -1476 -1667 1439 1066 -2075
1769 -2075 -1348 265 -229 -735 -293 -614 -971 -437 -155 -15 -337 -1893 -728 888 -1008 -1936 -220 -240
1787 -240 -1788 -877 -447 -1131 -208 -393 -1884 -821 92 -723 -845 -417 -1601 -1194 12 39 -818 -1196 -1295
1806 -1295 -122 519 -909 -1597 303 283 -1196 -314 776 -474 -1357 546 593 -770 -444 860 255
1823 255 -667 71 406 1137 -83 -899 679 1402 31 271 1349 -576 -205 1932 1124 -176 420 904
1841 904 851 1455 1463 -152 950 1699 469 751 1682 1242 643 944 1048 1163 1304 717 1059 1903 619 182
1861 182 2237 2067 -416 147 2673 1165 -340 1051 1259 273 721 1292 572 197 130 730 1428 552
1879 552 -722 328 1099 -491 -120 920 129 -639 353 -28 -404 81 -370 -921 -642 -225 -779 -813 -305
1898 -305 -961 -1469 -551 220 -512 -1507 -1165 66 -490 -1253 -937 -416 -1282 -1960 -119 266 -1747 -1676 -183
1917 -183 -216 -1749 -949 -26 -1133 -1414 -366 -307 -320 -1294 -851 -55 -896 -1334 -45 -193 -1460 -733 129
1936 129 -509 -572 -602 -676 -466 408 -161 -678 -50 36 -256 27 583 147 -682 -639 50 607 -528 -399 413
1957 413 399 -498 -258 1276 113 -1033 305 1169 -282 -607 916 515 -648 -151 887 649 -580
1974 -580 -588 535 950 155 -63 606 193 -190 505 754 243 32 270 273 763 487 437 183 486 619 374
1995 374 460 846 607 37 933 1090 522 -302 771 647 45 341 1116 946 -14 324 1707 1347 -47
2014 -47 184 1385 314 -121 1237 1526 26 -439 883 1191 254 200 716 476 -118 536 910 574 -67
2033 -67 576 248 334 471 -18 176 263 449 435 90 40 253 -234 -443 498 418 -697 -645 256 -211 -972 -225
2055 -225 264 -771 -1213 -89 295 -891 -1451 -414 19 -952 -637 89 -608 -1264 -843 50 -621 -1650
2073 -1650 -1034 -244 -887 -1388 -773 -426 -1153 -1161 -499 -572 -831 -714 -870 -1006 -760 -557 -1079 -972 -647 -829 -784
2094 -784 -519 -135 -801 -1194 -370 -157 -587 -934 -270 74 -924 -511 362 65 -1000 -443 729 -321 -621
2113 -621 153 722 -151 -418 950 827 -17 -274 702 1310 247 334 973 400 367 940 1287 541 654 427
2133 427 838 1265 528 714 282 647 694 473 612 1378 789 -3 590 1295 807 502 543 841 346 666 820
2154 820 1324 -12 -342 1116 1465 67 177 1079 293 -430 564 852 279 -378 286 728 29 -200 19
2173 19 622 168 -330 183 284 -498 -415 48 176 -278 27 -122 -349 -53 8 -216 -95 -103 -427 -218 283 234
2195 234 -802 -144 218 -110 -296 -136 -94 37 -689 -317 509 -309 -1148 -48 243 -1071 -715 454 -231
2214 -231 -923 -398 163 -95 -553 -602 -612 -330 -597 -258 31 -473 -953 -49 250 -474 -731 -525 -589 -423 -344
2235 -344 -703 -624 -370 -239 -880 -419 243 -1030 -671 -95 -363 -951 -68 -110 -361 -917 -430 99 -36 -998
2255 -998 -1071 109 -143 -983 -51 60 -1150 -409 704 -79 -644 -416 -73 322 -143 -262 -207 221 21 -207
2275 -207 436 325 19 -33 500 -321 93 925 224 58 519 154 437 1202 945 -120 521 1585 671 169
2295 169 898 657 601 1206 905 641 607 637 788 1461 178 -4 1306 1282 -38 670 1763 663 208 499
2315 499 512 260 871 1228 22 168 410 533 967 631 -252 374 991 194 167 127 -335 137 448 -329 -227
2336 -227 196 -152 -447 461 -50 -1014 86 491 -863 -977 81 -165 -397 -988 -973 -248 57 -544 -685
2355 -685 -254 -671 -921 56 -476 -1517 -662 250 -570 -913 -371 -688 -629 -263 -493 -920 -308 -749 -967 -468
2375 -468 -279 -779 -261 -181 -565 -517 -253 -434 -182 -197 -876 -500 603 -45 -1167 -98 298 -482 -149 272
2395 272 -315 -910 33 272 162 -271 -375 662 383 -686 -127 855 9 -426 357 534 -633 -24 535
2414 535 120 -463 443 347 -20 124 -202 148 877 231 -131 250 611 178 478 408 -14 234 396 54 251
2435 251 460 -162 109 1344 277 -284 593 1087 33 -263 272 688 198 211 -84 485 283 289 476 586
2455 586 -301 111 1316 262 -528 386 813 242 130 603 244 247 388 374 532 361 384 474 492 179 -57
2476 -57 153 123 173 464 482 382 708 381 -387 508 1053 -26 -501 666 60 -218 191 530 -61 -608 68
2497 68 431 -40 -456 -28 96 -180 -697 247 190 -536 -809 263 -419 -693 -191 -260 -230 -478 -278 -214 -754
2518 -754 -699 -1077 -505 -460 -552 -643 -747 -902 -324 -484 -1126 -795 -342 -768 -616 -62 -578 -1021 -357 -95 -648
2539 -648 -724 -68 -159 -743 -838 -40 -258 -800 -553 -228 -47 -560 -8 -223 -270 -641 -150 275 -156 -516 32
2560 32 288 -70 488 783 314 -271 201 567 443 394 350 403 268 497 308 476 297 270 167 753 786 725
2582 725 35 174 682 524 336 331 694 386 174 798 1151 187 -74 550 1022 170 227 787 423 58 451
2603 451 1066 462 2 330 619 146 -7 153 420 272 207 375 476 266 -41 371 182 215 285 44 -23
2624 -23 3 -212 33 146 -75 138 -159 98 208 -41 -317 259 216 -344 129 529 -134 -722 -182 455 -214
2645 -214 -400 18 91 -253 -198 215 203 -636 -407 146 32 -269 -365 14 -241 -702 -79 -48 -119 -590 -386 -23
2667 -23 24 -201 -341 -541 -398 -21 -325 -153 -293 -448 -496 -306 -194 -134 -625 -449 267 -290 -567 43 51 -532
2689 -532 -343 124 105 -659 -502 -181 -442 -502 -431 105 -373 -570 -251 -62 -555 -158 -166 -168 -277 -565 -131 27
2711 27 -508 -217 -209 -12 -52 -176 -382 70 -3 123 196 -36 -249 35 173 116 442 28 55 351 437 0 377
2734 377 764 232 -30 461 549 116 65 363 405 373 91 629 348 236 235 529 717 145 201 816 734 335 476
2757 476 579 134 401 391 569 453 593 284 335 820 396 474 454 394 162 -41 494 185 -43 -304 164 568
2779 568 256 -171 111 369 -219 -297 425 65 -593 -505 186 -195 -585 -150 249 -290 -444 -465 33 -220 -580
2800 -580 -44 -4 -568 -735 -179 -263 -1027 -184 154 -358 -433 -248 -500 -563 -110 -765 -627 -318 -380 -533 -349 -734
2822 -734 -225 -289 -281 -190 -557 -323 -521 -68 -240 -815 -233 -104 -783 -643 189 -222 -437 -97 161 -178 -328
2843 -328 77 129 64 -91 -302 558 156 -478 -346 249 -69 -123 208 105 26 243 68 -13 220 52 9 45
2865 45 349 -90 -45 477 393 -385 121 573 139 422 -384 221 440 -21 241 475 14 -94 442 1107 300
2886 300 -360 334 582 108 250 299 -12 -66 404 159 416 229 -21 392 328 -120 314 887 123 -116 419
2907 419 459 145 383 230 -37 327 595 111 284 283 109 -64 765 250 15 44 447 349 291 -6 24 624
2929 624 393 -349 213 496 -189 34 576 210 -313 779 478 -167 -436 274 306 181 -323 -385 24 -6 -264
2950 -264 -125 -60 -566 -258 374 -230 -459 -110 -135 -259 -264 -400 -684 -160 -132 -711 -397 26 27 -686 -342 -482
2972 -482 -574 -345 -357 -456 -227 -614 -521 96 -413 -972 -187 215 -637 -520 -186 -552 -653 -316 0 -443 -718
2993 -718 -64 -2 -250 -697 -450 -95 -127 -504 146 -204 -179 -388 4 -326 -124 450 -215 -123 106 70 257 325
3015 325 329 26 20 432 407 131 -115 329 356 119 -138 446 481 25 24 493 465 181 419 752 175 -45 670
3038 670 627 18 438 313 281 166 492 100 632 323 354 964 293 90 399 252 289 32 340 379 254 387
3060 387 207 113 333 322 135 174 241 343 -78 81 -46 55 -242 150 396 66 -208 72 287 -325 -368 377
3082 377 354 -402 164 86 -238 -4 239 158 -397 -182 62 -97 -189 -331 -111 294 -187 -110 217 -73 -104 -193
3104 -193 140 -591 -209 -208 -113 -184 -190 -210 -268 221 -104 -475 -150 145 -357 -381 -241 23 -341 -67 -286 -448 -334
3127 -334 -540 18 305 -438 -400 53 19 -243 -400 122 10 -637 -87 -250 -233 -280 -220 -140 -310 -60 -239 -270
3149 -270 -492 -207 -374 -89 -159 90 -375 -209 -322 -218 -25 -482 -123 -77 -129 -69 149 131 -197 -48 -41 -263
3171 -263 -95 444 22 167 -2 128 138 -122 189 173 144 -80 31 232 -26 -24 410 601 -55 82 553 321
3193 321 80 240 475 432 425 289 577 442 156 315 398 733 245 159 206 383 -76 373 595 594 715 33 265
3216 265 301 242 96 182 141 5 26 350 358 -2 -70 403 298 89 -46 228 -40 -330 67 203 16 -229 106
3239 106 18 65 -149 46 87 -247 -300 -14 -143 -308 -280 -127 -207 -127 -72 -315 -323 -441 -627 -232 -232 -197 -521 -518 -185
3264 -185 -395 -591 -368 -171 -105 -510 -486 -234 -295 -557 -299 -140 -457 -714 186 -273 -299 -347 -50 -6 -413 -436
3286 -436 90 -139 -345 -21 -256 -280 -59 -235 -278 67 -306 -189 -205 -54 -3 -150 24 -135 -54 44 -139 164
3308 164 -38 -21 181 -112 134 -233 7 144 -107 -62 223 228 180 19 264 437 94 282 158 111 -144 300
3330 300 317 76 -1 307 62 48 192 -30 -174 42 107 221 2 276 81 248 168 184 143 207 494 334 260
3353 260 152 374 176 -21 98 463 368 9 386 500 274 71 412 301 -38 19 281 413 269 -69 129
3374 129 526 -170 116 165 131 -70 356 373 -91 28 291 205 49 48 176 36 -67 -260 -290 -46 20 155 -153
3397 -153 37 -192 -89 140 -63 -95 -5 -290 52 5 -422 -798 22 43 -244 -396 36 -208 -213 -96 -234 -147
3419 -147 -265 -239 -153 -541 -629 -261 -294 -501 -766 -300 -275 -508 -363 -476 -844 -583 183 -443 -488 -455 -60 -263
3441 -263 -150 -450 -418 -50 -43 -380 -279 17 -74 -205 -246 -59 -249 10 -184 -259 178 -10 -307 29 67 -203
3463 -203 -66 574 284 -126 -3 -117 203 262 16 112 166 194 207 478 -70 30 492 423 197 243 316 417 -24
3486 -24 295 234 332 302 522 346 605 365 269 341 272 -56 78 875 304 371 231 120 584 485 -119 -129 444
3509 444 371 51 605 399 290 -278 200 160 56 -43 62 293 -83 -398 159 335 58 -260 7 212 -14
3530 -14 113 255 -284 -29 194 130 -248 -142 -93 37 171 -263 -310 70 247 -157 241 -302 -203 64 -255 -17
3552 -17 -301 118 -198 -35 71 -339 -478 227 -125 -612 109 205 -97 -603 -91 -286 0 -173 -98 -89 138 -310
3574 -310 -82 -47 -190 -101 67 235 -102 -29 -144 -309 -351 -168 -404 -332 -104 -239 -126 -169 -491 -532 -32 -222
3596 -222 -461 34 -296 -69 -223 -403 -67 -112 -191 -453 73 -158 -255 -47 108 -164 -393 -405 -165 -128 59 -83
3618 -83 50 -168 46 101 158 10 -201 266 430 -87 -181 184 -29 -88 39 122 404 -88 79 -239 277 410
3640 410 136 -23 152 238 107 270 -45 192 231 151 19 157 199 348 400 488 173 434 293 259 114 436
3662 436 347 98 240 265 296 47 308 309 109 56 38 293 353 -14 -88 -75 155 175 84 131 -19 65 74 -48 -91 134
3688 134 -160 121 -56 -70 -49 -174 -124 -223 -136 -537 -54 -184 -240 -100 -203 -180 -403 26 -55 -487 -469 -186 -402
3711 -402 -445 -155 -265 -211 -223 -375 -192 -229 -260 -112 -238 -404 -276 -242 -223 -52 -221 -112 -183 -185 -158 -250 -120 -334
3735 -334 34 -74 -94 -300 -172 -94 -38 -11 -87 78 49 83 -210 -64 207 65 -238 -124 46 -129 -205 57 113
3758 113 -107 -23 640 203 80 375 130 27 -44 184 298 149 -38 -289 116 142 146 100 242 -40 178 -38
3780 -38 115 231 15 -6 203 58 264 -26 166 155 165 103 170 278 9 40 282 211 239 164 89 186 79 -114
3804 -114 132 -41 158 291 296 89 262 145 320 -28 242 488 32 243 199 139 52 122 269 154 101 -100
3826 -100 272 155 175 70 101 -26 44 8 -77 51 24 21 10 217 68 44 34 -253 52 -234 -181 -248 -310 -250 -223
3851 -223 -51 -305 -222 -163 433 -324 -122 -450 138 -355 -238 -76 -88 -195 -431 -271 -26 -151 -297 -70 -205
3872 -205 -307 -524 -317 -101 -377 -147 -218 -263 -222 -207 -400 -157 -194 -296 -331 -268 -207 -422 -340 -173 44 -216 -251
3895 -251 -10 -91 -97 -106 26 -283 -434 38 80 -268 -127 -295 -98 -10 15 127 167 -207 16 67 49 202 144 276
3919 276 76 76 302 137 102 31 283 256 77 16 231 142 177 182 101 237 468 187 246 205 50 359 160 -15
3943 -15 162 243 16 151 269 210 -13 230 382 206 95 452 158 37 107 146 -127 116 487 116 51 251
3965 251 132 176 18 103 197 -106 161 152 87 -88 10 75 113 -25 -107 -10 -93 39 17 -49 -192 449 -51 -75 -29
3990 -29 65 198 -40 102 2 -296 -168 12 -197 -233 -346 239 131 -407 26 59 -65 -202 227 -20 -85 -160
4012 -160 -81 292 -34 -63 -163 -63 -41 -378 219 -11 -379 -525 20 -159 -421 -22 -184 -327 -92 -21 -69 -331
4034 -331 -90 -127 -260 -314 -219 -210 286 -72 -406 -55 -236 -171 -135 -293 -181 -198 -175 63 -93 -153 -415 -274 197
4057 197 -276 -27 165 -96 176 -116 44 51 149 105 121 321 34 28 -22 217 219 31 237 130 157 361 34 295
4081 295 120 238 186 378 291 313 223 7 207 308 208 32 323 -8 421 138 383 386 293 449 307 139
4103 139 370 408 155 17 187 46 57 87 234 321 334 418 84 242 224 -35 142 276 217 80 387 185 109
4126 109 4 268 -14 -73 57 -32 -18 218 93 409 -9 -298 -15 78 -186 -67 -29 -231 -36 -86 -235 -135
4148 -135 -37 -95 -266 72 -76 -495 -280 -35 -66 -556 -193 -340 -254 -168 -73 -174 -144 -166 -133 -191 -260 -270 -160 -246
4172 -246 -233 -67 -165 -253 225 -235 -150 -24 -123 -188 -302 -215 -209 -354 98 20 -312 -206 172 -120 -131 74 161 168 -130
4197 -130 17 -5 254 -345 -55 -53 118 72 -100 2 -56 -60 175 456 348 -51 38 20 137 -58 221 -39 184
4220 184 -220 -87 78 84 -33 123 -93 -102 87 -83 -18 255 139 -23 137 -90 -33 227 37 -48 -193 -6
4242 -6 151 -62 55 -113 86 93 -23 467 204 123 69 257 161 -149 -175 131 188 180 152 255 275 26 249 179 283
4267 283 216 -77 313 172 311 198 274 -32 -95 175 -246 258 -72 -204 368 160 89 -17 -27 108 169 -213
4289 -213 104 -78 79 -79 -137 55 -96 -1 139 313 -272 -22 -35 95 -210 -253 274 -292 -458 10 -171
4310 -171 -107 -259 -107 -256 -54 -131 -128 -62 -321 -174 -198 -380 -220 -135 -521 -138 -99 -363 -247 -142 -191 -188 -161 31
4334 31 -260 -472 -13 -220 -236 -242 -161 -139 -311 -99 -114 46 -109 -89 -77 44 -152 29 -118 -158 -262 -188 -61 86
4358 86 9 73 -30 -109 -38 -105 301 152 360 43 91 -2 493 -37 427 175 426 30 372 374 153 233 32 28
4382 28 153 -26 343 142 232 269 256 298 216 216 55 174 57 116 259 67 -74 80 198 111 226 214 50 104
4406 104 -33 142 86 -125 80 70 255 152 -83 -13 138 -186 126 -421 235 221 17 -46 -53 87 45 -210 123
4429 123 272 105 -60 173 -175 -164 27 -345 -162 -54 -93 105 -10 -303 18 4 -223 -24 0 -66 -392 -89
4451 -89 26 -54 42 -155 55 -306 -246 -101 -102 -77 -184 -11 88 -183 -65 179 51 -46 -254 -13 -354 -14 -191
4474 -191 -242 -328 -64 -233 122 5 -80 -167 -333 -176 -110 -268 18 92 -301 -233 67 -213 -203 149 -180 122 -75
4497 -75 -48 -84 -233 -170 -216 262 -86 -347 -110 -27 209 -241 163 -42 2 -212 -79 124 -140 -47 -10 150 -146
4520 -146 113 -113 196 -224 150 -67 275 -41 245 -90 367 80 72 -39 65 111 155 143 98 192 -77 27
4542 27 265 304 47 215 476 275 301 293 373 -266 77 468 90 94 84 248 348 398 17 287 352 168 466 15
4566 15 355 206 111 -131 90 69 191 49 178 144 -124 78 110 -97 113 454 -48 -152 41 -29 -236 -67
4588 -67 73 -229 113 -194 -205 -94 -130 -235 -203 140 26 -318 -277 -35 -197 -206 -253 -348 -265 -149 -166 -379 -349 -351 -256
4613 -256 -148 -288 -312 -201 -1 -4 -218 -175 -343 -116 -176 -111 -73 -24 -111 -118 -205 76 -74 -139 50 -263 -189 -32 -100
4638 -100 -64 -104 -131 -112 -176 -252 96 313 95 -236 63 -184 -296 -91 222 65 -116 112 -82 100 -70 59
4660 59 101 182 228 -54 3 65 117 159 115 -5 223 136 164 38 -87 40 477 134 -246 83 241 287 1 -38
4684 -38 151 126 81 256 65 -47 -113 74 222 144 278 317 320 -105 -364 263 235 -75 78 304 -87 118 250
4707 250 94 -39 76 131 303 278 -10 221 -59 124 91 -394 209 91 70 161 185 188 -82 -449 -47 230 299
4730 299 26 182 -24 -111 -37 -49 -99 276 213 -48 -138 93 57 -12 135 9 -96 70 27 -25 -18 -88 -67 173 61
4755 61 -207 -414 -18 -28 -180 -217 -217 -114 -76 -42 -112 -49 25 85 -40 -204 -161 32 -384 -220 -52 0 -426 -397 -30
4780 -30 -311 -451 -186 33 -74 -416 -36 -491 -167 -213 -118 -106 81 -52 52 99 -202 -82 -157 -110 -151 -80 164
4803 164 76 42 -129 130 63 275 98 -13 243 219 -63 165 138 153 -13 127 81 365 189 129 -56 346 137
4826 137 90 128 -60 140 101 247 -25 184 439 119 48 41 343 -136 160 261 -58 239 -105 163 -109 28
4848 28 263 201 195 298 -55 142 227 235 325 249 279 -67 181 -58 113 126 18 155 71 53 -88 -259 129 114 -153
4873 -153 49 8 -213 -102 183 -160 -118 88 91 -149 -80 -9 51 -111 -61 8 13 -142 -135 -62 -48 224 -130 -206 -5
4898 -5 -66 -251 -144 -91 -31 -17 -127 -243 -47 -307 -63 -112 110 107 -243 9 -108 6 100 -182 114 123 -43 -205
4922 -205 25 -385 -328 47 -124 -144 -284 -22 -121 -334 0 172 -327 -244 -134 -308 -79 -68 -156 -169 -226 -494 -89
4945 -89 98 169 30 -2 -140 -173 179 149 -42 117 -279 -6 -93 48 -109 17 -131 -126 -20 3 118 -111 195
4968 195 98 20 -105 -28 163 195 -66 124 201 38 127 268 -31 -61 23 215 212 216 74 -84 26 185 214 100
4992 100 170 197 -180 183 409 -8 547 66 30 397 202 167 259 -67 -12 158 419 136 146 210 251 159 -143
5015 -143 174 382 273 185 -330 206 57 -213 -110 230 -173 -25 23 93 155 -70 2 -188 -140 93 -189 -105
5037 -105 -119 59 161 -267 -319 -154 -87 -346 -196 68 -63 -277 35 -107 84 -114 -154 -53 -108 -44 -164 -36
5059 -36 -31 -285 -213 9 114 -192 -37 -317 55 -136 -250 -292 -62 -190 -342 -17 68 -55 -242 -18 -166 -203
5081 -203 0 -95 -12 36 -241 9 137 161 10 -270 -114 -182 188 86 -161 4 -208 72 128 244 -263 144
5103 144 -188 79 -116 78 -32 -80 228 76 116 -69 277 -112 -165 -107 -108 83 -95 -3 82 248 211 -25 262
5126 262 443 233 -81 -86 -32 11 -92 134 93 124 240 396 134 -49 181 -37 204 283 39 267 84 169 165
5149 165 272 2 106 2 -152 240 85 54 27 -45 -90 184 196 39 133 -37 184 123 275 -144 7 50 91
5172 91 -216 -39 114 -125 80 424 92 -49 10 -98 -185 -99 -152 19 170 174 145 171 96 -62 22 278 -25 37
5196 37 -38 -42 36 -68 -4 -161 167 -184 -55 198 279 -317 -66 57 -591 -310 -127 -107 -368 -265 -299 215 -168
5219 -168 -313 -246 -414 59 -179 -219 -152 -378 -176 -198 -48 -153 63 140 -257 -35 -164 -133 165 -138 -442 -8
5241 -8 -136 -196 53 -87 -277 60 -108 -101 -320 -80 -59 -201 -65 216 -236 -74 -211 114 122 -151 71 167 75
5264 75 131 150 383 -187 272 133 -60 219 297 118 -220 -136 294 -152 103 259 92 62 -46 100 13 327
5286 327 113 299 107 219 90 145 170 71 91 -29 -317 202 -258 -145 29 285 -183 -27 5 -151 152 -14
5308 -14 191 -292 -143 158 -30 -184 178 -60 81 -96 -91 289 213 -208 62 179 380 -235 -78 253 88
5329 88 -25 2 -40 -200 152 -117 -267 79 -131 206 75 -256 -180 -57 -236 -31 -142 -13 -350 -130 -318
5350 -318 6 67 153 61 -79 108 266 -18 -234 -89 -159 99 -171 -221 -98 -93 -195 176 95 -72 -18 -57 -132 -180
5374 -180 -44 -84 132 -134 6 -365 -131 -135 -8 167 -165 -27 -56 -195 -21 -132 -74 -107 -257 -133 -160 -186 26
5397 26 -52 -318 20 -161 18 -19 -32 171 -55 87 -104 2 -85 -74 -11 -3 33 132 107 -38 129 220 96 55 129
5422 129 293 -81 -152 148 -160 100 -109 172 3 248 351 203 7 -83 196 -55 -115 193 217 198 198 194 115
5445 115 92 94 71 346 52 32 56 50 285 36 75 75 364 72 151 -105 95 146 53 7 94 207 1 -17 29 66
5471 66 -45 -120 -54 165 -15 124 -35 -78 48 57 -104 181 74 -454 -202 109 -90 -79 -50 -341 -87 -145 -173
5494 -173 -57 15 -124 -328 102 -153 -110 -88 -22 -360 -127 -69 -228 -111 -106 -4 -47 -242 -48 -67 -97 -49 151 -92
5518 -92 -85 174 -186 -117 -298 -159 -88 -136 -57 -45 -181 -128 47 -95 -167 98 -53 -36 -22 -122 75 -110 19 143
5542 143 98 176 56 -204 -386 -31 -64 55 1 194 29 227 -38 -45 114 -50 110 100 268 -119 119 -38
5564 -38 217 154 39 81 81 266 -194 18 5 43 10 5 90 58 201 164 -105 234 -18 260 134 114 50 198 181
5589 181 -92 87 373 149 33 98 -32 182 99 28 254 68 250 198 133 215 59 -122 238 60 -320 -123
5611 -123 208 -204 186 -85 74 40 126 135 -111 364 -45 211 75 79 62 -187 -49 236 82 -19 -76 -87 188
5634 188 7 -24 56 -147 -236 -9 -64 -143 -114 -354 338 -52 -265 -48 132 -330 -160 -3 -58 -40 -162 -208 -200 -151
5658 -151 -222 -173 35 38 -56 -106 -95 -141 -68 -53 -288 -435 -196 -53 -558 -186 -29 -274 -281 8 -97 -247 -76 -50
5682 -50 -344 -39 -50 -208 -59 -5 -72 125 -58 109 -134 43 90 -28 102 -137 -70 93 91 -63 68 151 97
5705 97 91 165 -53 287 -119 308 -20 499 58 -12 52 -87 162 182 250 -29 240 74 226 98 278 -66 92
5728 92 2 195 61 189 230 -26 107 98 101 -1 10 86 198 106 277 49 82 -4 99 393 114 133 -142 80
5752 80 9 162 40 -254 -244 -57 -247 214 144 -71 -180 204 -51 -60 -16 175 -160 -296 -217 -109 -72 -171 -47
5775 -47 -35 113 -26 -162 177 -30 44 -123 -290 34 -22 -179 46 94 -54 -233 64 15 -18 121 -202 -77
5797 -77 -56 236 -281 -3 24 -232 -317 225 -226 109 19 -132 162 -182 78 -36 146 66 -99 -121 -30 -60 -70
5820 -70 -27 -69 -99 201 -46 -244 50 128 -249 -203 44 -122 -94 155 -188 -294 75 43 196 -386 -109 -93 39
5843 39 36 20 191 -23 -120 156 -174 -150 -38 69 -156 -179 -112 149 87 -188 -73 -95 15 59 138 188 76 39 253
5868 253 26 118 -15 117 -147 -126 133 98 -176 399 229 334 69 -54 133 29 134 -84 -2 186 11
5889 11 102 17 293 119 10 150 171 308 307 -125 154 374 -77 9 183 92 16 209 170 75 139 38 -90 158
5913 158 -53 -39 208 41 -191 11 165 -56 -89 -37 275 -117 -359 -197 52 131 79 -29 -204 6 -125 -147
5935 -147 -368 -9 42 -196 -76 -86 -320 36 87 -62 163 -109 -412 -120 -236 -157 -215 -238 -263 -341 13 56 -326
5958 -326 -74 -25 -94 -186 -241 -33 -50 -219 -290 -4 -149 -107 -49 -110 -160 -7 -203 -140 -122 -195 -114 -159 11 52 -60
5983 -60 -161 -117 -238 -220 172 -208 -70 -190 58 -84 -260 43 -72 -66 60 123 114 -162 -13 314 155 130 137 -48
6007 -48 249 -37 -86 51 201 -58 291 44 33 220 -36 178 5 110 -126 194 302 313 -54 -216 -42
6028 -42 225 57 -62 222 225 -24 192 57 -208 281 549 132 -80 -77 128 82 70 -26 219 -53 10 122 -7
6051 -7 175 7 62 84 233 -81 36 -138 147 181 6 199 10 -201 41 6 37 61 42 -27 -21 98 39 126 -7
6076 -7 22 -153 -124 83 -22 -102 -76 -143 -127 -138 -174 -30 -37 -69 -28 -212 46 256 -28 208 -172 -411 -185 -70 -232
6101 -232 -88 -211 -64 -70 -39 -10 -71 -147 -101 -362 -24 -213 143 -192 -193 -222 -233 -6 -3 -250 -357 -216 -255 -327 41
6126 41 -86 -155 -244 -68 -85 -300 -215 -88 -130 -68 -264 -115 22 118 249 -244 -272 -110 -30 -132 213 -66 29 118
6150 118 43 95 41 240 1 80 61 35 -44 56 76 25 236 256 42 315 101 18 19 -223 0 170 23 103 126
6175 126 222 71 291 213 -37 136 -81 -139 96 279 82 -50 197 -30 84 -270 -184 -48 312 59 -227
6196 -227 28 119 132 142 -49 -111 143 149 -50 123 -81 -220 -1 -170 56 -133 -52 10 30 -323 -96 -100 168 -212
6220 -212 -23 -94 -272 -140 47 -2 -232 17 16 -157 -280 113 -2 -189 -133 186 46 39 -125 -120 -97 -136 -124 55
6244 55 -96 -348 45 353 45 -194 -60 101 1 264 31 110 -4 -91 78 -158 -357 -199 33 -211 -58
6265 -58 -271 24 -332 -122 -34 304 128 9 -210 65 109 40 -125 180 1 -145 -41 54 107 -121 -267 -129
6287 -129 -115 101 189 -132 -71 47 -209 41 -13 -23 244 248 -254 -260 -81 88 87 91 140 215 372 -102 28 -7 90 -15
6313 -15 215 126 -53 356 132 48 134 96 276 72 416 122 49 76 107 104 204 173 -4 16 196 160 63 -9 -56
6338 -56 143 152 115 227 373 89 -193 -121 264 81 336 115 310 208 -53 132 209 5 65 172 73 4 -179
6361 -179 -127 -74 -121 -47 -142 -232 -33 132 -145 63 -52 -16 -37 -30 30 -152 -139 -233 -134 -107 -105 -415 78 -44 -304 -160
6387 -160 69 27 -192 -117 -94 -209 15 -70 91 68 -119 -135 -120 246 -112 138 -395 -6 -56 -365 -209 -222 -115
6410 -115 -281 -9 -47 -1 0 -174 -116 -115 41 -9 -141 162 -55 -86 -240 129 -122 106 -45 259 -75 27 60
6433 60 170 329 24 93 -145 149 -90 137 189 54 255 37 -100 164 11 212 161 92 -75 -228 210 20
6455 20 183 129 215 -178 21 -27 -84 372 464 259 55 -86 -113 -171 130 5 -74 80 -96 67 -178 109 205
6478 205 117 372 -15 180 24 80 183 -135 -195 -85 49 49 325 -147 -71 191 -251 -110 52 11 145 23
6500 23 73 139 204 124 64 -246 222 89 -12 -4 -186 169 54 64 40 210 -238 73 -81 127 69 -87 -170 245
6524 245 -87 -95 -116 14 -2 42 -102 45 -20 29 -289 -129 -135 -192 196 159 -110 -269 -53 -111 -55 8 -193 1 -251
6549 -251 -25 219 -232 -56 -339 -41 -105 -90 -255 -128 23 -92 66 -29 -256 9 -187 -236 -155 -185 -223 81
6571 81 -147 -203 -123 -66 44 -262 45 28 -6 -134 -214 65 213 -66 94 -265 165 -5 23 328 119 30 18
6594 18 -91 106 349 15 257 188 7 164 110 -75 233 206 224 -19 119 126 37 230 292 70 208 396 77
6617 77 97 95 285 154 7 -67 347 374 -90 333 350 180 137 20 -180 30 239 118 131 -139 35 -148 146
6640 146 149 5 -87 89 181 -27 116 -98 145 -142 -130 -307 60 -153 -52 37 296 -132 98 267 -200 102
6662 102 81 -157 -81 -11 -61 -308 -291 -97 -64 50 -191 24 120 -60 -268 77 78 -93 39 202 210 -128 -32 -168
6686 -168 -126 -57 173 -220 -51 -218 -346 7 -228 -66 45 -230 -20 -6 -135 -184 -218 -497 50 142 -228 -140
6708 -140 -160 151 180 -23 152 172 -279 -109 -88 94 -147 -204 -54 31 -95 -242 -94 -242 -223 -73 255 -46
6730 -46 -106 -105 56 -205 -107 -53 -15 -39 47 57 172 -72 -112 65 32 60 121 -178 32 252 10 -90 -46 65 -171
6755 -171 -13 140 -3 9 241 -112 92 240 -116 29 -63 122 -47 -19 81 163 13 -43 54 -72 357 217
6777 217 -107 95 239 216 368 255 215 159 106 -140 262 275 288 222 261 60 129 -8 -1 -44 5 152 167 44 155
6802 155 66 72 48 62 -55 10 53 152 -165 -209 92 190 -15 -57 73 -17 -210 -87 211 -76 -168 -80 84 -162 -34
6827 -34 -287 124 -207 155 -235 -57 -443 -48 -9 -127 -20 -144 -106 -55 -66 67 -104 66 -211 110 -183 24
6849 24 -26 105 -117 -40 -269 44 251 -145 -134 -155 85 -272 177 -143 120 68 -231 -94 98 0 -392 36
6871 36 6 -36 -113 121 238 -75 109 290 137 227 94 56 113 136 -37 7 73 8 26 320 115 189 138 -29 128
6896 128 88 93 -56 131 -123 -112 -56 230 -12 144 -88 248 414 -115 33 336 -31 51 142 378 187 206 189
6919 189 121 -19 140 235 0 92 -91 -104 1 -48 -86 166 232 67 3 192 4 -90 19 -40 -171 -20 67 198
6943 198 -171 146 122 -81 -25 23 -32 -247 -35 -232 158 -37 4 199 -7 -196 -120 -177 -163 55 118 79 228
6966 228 73 187 184 284 177 45 195 116 -51 -187 114 -176 -166 19 -260 -84 -198 59 -37 230 18 4
6988 4 -192 -74 -271 -524 98 -34 -71 -292 -261 -14 -267 -155 -77 -12 67 -149 -201 -142 92 -31 -155 -111 56
7011 56 -129 -110 -211 91 118 -71 -174 -120 87 -231 -224 -53 90 217 -261 -532 56 75 191 21 76 34 -8
7034 -8 -188 21 -88 -76 -183 -28 223 55 -161 123 134 43 -47 -110 -4 -145 147 55 -23 187 -143 350 208
7057 208 140 56 284 80 5 65 5 -215 218 -230 219 -115 173 56 22 393 99 1 123 489 145 284
7079 284 -4 228 -129 -28 231 59 -34 5 -12 11 64 44 -149 -237 116 97 72 -70 -47 30 -100 55 220 94
7103 94 -26 -150 -52 63 -74 -222 -330 134 -231 48 34 230 -19 -8 -38 -99 -36 -101 -21 21 -76 144 -29 -334
7127 -334 -254 -122 -73 -2 24 -107 -136 -205 -162 -129 32 -138 -63 30 29 95 -183 -22 -115 138 58 -59 59 -200 102
7152 102 15 193 220 180 -30 -126 -268 191 -252 -105 -34 24 -21 -125 -134 -140 -97 169 222 262 -131 25 -26 -202 62
7177 62 -172 189 58 -120 -154 -481 6 -161 41 78 -38 133 64 95 -13 -65 302 44 -3 226 -87 29
7199 29 28 -19 -40 117 165 350 -249 290 44 21 -143 21 251 183 75 92 102 254 45 263 128 -45 295
7222 295 129 163 372 592 60 151 -115 114 93 280 42 183 32 -97 -41 165 -27 150 229 47 -17 84
7244 84 -2 -38 59 232 -97 123 -65 55 -1 -331 23 46 -18 -85 -58 257 -189 78 300 -470 -83 130 262
7267 262 -147 -239 -220 -376 -255 -210 -377 -88 4 -17 -1 95 -71 -248 -46 -147 -114 -48 -53 -206 -16 -266 -137 110
7291 110 -349 -99 58 -264 -369 -396 79 69 -170 -92 -100 -157 -49 -45 -130 64 -211 -323 -23 254 -58 228 -127
7314 -127 113 -6 191 43 -286 -16 -29 108 149 -20 -74 -73 152 -202 -141 -248 16 45 -27 -91 -3 309 -196
7337 -196 170 8 -30 -7 -110 18 -73 -274 -48 149 -113 -43 156 45 -36 223 -79 127 237 78 -34 25
7359 25 5 219 120 -159 -160 111 3 296 -180 261 112 208 -85 -30 -2 -211 345 185 -94 34 -8 65 95 134
7383 134 72 0 117 4 -96 27 98 -127 -65 81 33 44 -307 133 68 -133 144 80 273 -86 199 81 28
7406 28 -223 70 -16 -11 151 -336 3 52 71 181 162 51 -115 23 -41 190 251 -114 50 250 12 -149 -271
7429 -271 211 80 -101 -182 60 -109 3 282 -210 211 -178 197 -172 -48 8 -264 -158 -37 43 104 -284
7450 -284 -137 -320 120 -410 -350 -31 46 -213 3 154 29 -216 -177 -185 26 -186 -31 -100 -78 189 89 -165
7472 -165 -154 22 81 -132 79 -79 -19 11 -42 82 40 -5 211 -155 106 -171 2 5 -52 143 88 -48 156 252
7496 252 393 -95 -34 172 77 116 150 79 221 111 116 46 70 276 358 302 -108 57 310 402 120 251 153 243 139
7521 139 73 140 142 35 -29 204 152 334 38 148 -143 155 -8 178 50 -69 38 193 10 93 -133 -198 -22
7544 -22 -85 353 0 -69 -67 188 99 -61 -73 -92 64 30 140 -43 -179 195 -106 -70 18 -132 -122 121 -236 -606
7568 -606 -48 -128 -169 -202 -220 -120 23 -121 -32 -17 -63 -170 226 -72 -74 326 -4 217 192 -48 -60 -73 -64 -71 -289
7593 -289 -37 -19 52 -133 63 -232 -158 -35 16 -27 52 -299 23 242 -9 -126 185 10 -77 -33 76 72 -81
7616 -81 -20 -269 -88 44 127 -46 55 -139 -353 -370 -13 -62 -68 -70 -89 56 -296 -77 -80 -114 54 -131 -38 72 -29
7641 -29 263 199 -26 -189 -180 115 -124 144 110 -24 -100 27 294 -70 156 24 27 -75 8 91 -101 171 -52
7664 -52 214 -246 96 -115 278 -96 -57 221 -14 277 164 27 -38 -73 21 -1 87 281 -233 14 125 -166
7686 -166 41 131 -32 264 294 -41 -199 13 -10 -228 -10 53 -22 -138 -13 24 233 23 229 180 27 -87
7708 -87 -387 176 -196 163 51 135 48 -229 -216 -110 -1 -153 68 -62 179 -124 38 -36 113 -7 -39 185
7730 185 -23 5 -297 -146 -110 105 -97 187 -81 -142 -33 -184 -80 -82 -94 -93 99 29 26 -141 -29 108 40 -170
7754 -170 -94 -167 -83 51 -228 -94 126 55 -208 62 -44 135 -114 -57 -190 -25 -76 105 191 -118 293 21
7776 21 -41 -212 40 182 175 299 -218 83 -53 28 -2 -162 182 56 31 -50 35 91 74 72 -23 -183 158 70 -85
7801 -85 94 -94 35 130 -67 81 233 36 -39 -83 58 -161 -33 211 -4 -247 294 -150 -2 -48 245 -47
7823 -47 182 119 -181 -97 92 54 178 148 111 -69 -77 67 -14 -1 -223 -94 4 -99 -201 42 -16 52 30 116 238
7848 238 -273 -113 239 49 100 67 -166 271 212 331 248 27 362 291 -232 14 -320 23 31 -81 23 23 -315
7871 -315 -122 60 -51 77 -93 55 -110 53 -109 -74 199 -142 -90 -239 -47 -105 23 -59 21 -156 88 19
7893 19 -234 -86 5 -58 -534 -72 -45 -356 -336 -292 -158 -32 12 -318 -88 34 41 -229 102 -267 46 117 69 135
7917 135 -159 121 -77 -278 136 -102 7 -379 -107 -5 -133 -133 48 -184 33 173 17 -31 6 167 -125
7938 -125 -58 -198 -29 -27 57 129 168 74 43 382 144 -33 -316 8 -223 107 242 -15 -59 -129 30 13 267 24
7962 24 4 98 281 9 170 201 182 -21 62 -112 -214 408 95 -63 -132 67 209 164 79 157 92 6 -62 243
7986 243 189 -161 200 22 -161 401 99 81 41 237 -45 265 -86 51 -72 208 -250 271 -246 181 -280
8007 -280 65 182 63 158 -156 -133 -236 49 33 76 201 109 42 -142 -267 -219 -111 -265 -89 -97 -158 -202 -161 -204
8031 -204 -179 -180 188 -215 199 -135 101 41 -282 -67 303 -7 -25 -187 102 200 -72 -28 -279 -105 108 28 1
8054 1 17 -56 379 -240 115 -152 36 -54 53 -55 -90 251 59 64 239 -342 -294 -6 -136 -76 -87 93 387 -127
8078 -127 196 -244 118 37 -126 125 54 22 -115 -74 -257 211 125 -34 -36 61 113 310 46 21 -217 -69 -63 -208
8102 -208 -92 -285 -53 178 132 -226 -3 189 -65 -4 0 -70 -67 207 136 -17 -24 9 97 238 -91 -232 70 100
8126 100 65 28 41 -140 14 -46 65 -90 -28 70 94 262 280 41 287 202 239 -41 -133 -242 -57 104 -96 -302
8150 -302 12 3 -61 75 259 54 58 -219 19 -13 105 -339 -196 -4 54 -37 85 -277 77 -16 -48 -90 -56 38
8174 38 -160 -138 146 113 34 -430 35 -136 171 -48 -419 78 -364 -175 -117 -61 94
8191I4
$$ Imaginary data points
##PAGE= N=2
##DATA TABLE= (X++(I..I)), XYDATA
0 0 0 0 0 0 0 0 0 0 0 0 0 0 0 -8 8 -8 8 -8 16 -16 18 -24 28 -32 40 -45 50 -58 69 -79 89 -103 114 -130 146
35 146 -165 184 -206 230 -257 286 -317 351 -389 430 -472 520 -576 633 -697 769 -846 936 -1032
54 -1032 1142 -1267 1408 -1574 1765 -1996 2275 -2624 3070 -3667 4504 -5762 7861 -11978 23012
69 23012 -114452 -270366 77408 91534 -89406 -8600 76133 -39050 -46948 6874 -5209
80 -5209 -20469 -13018 -24875 -7000 9712 6678 -3592 -12633 -24671 -24575 -8783 3433 -25342 -30272
94 -30272 12936 2369 -34333 1032 -3670 -59592 -30638 7819 -10229 14107 4462 -70264 -42107
107 -42107 27271 -152 -16802 -3133 -28878 -19684 5179 -15451 2614 20303 -36765 -36930 34250
120 34250 26691 -27621 -26265 2099 8579 -9265 -3231 27031 -6648 -50627 4798 43949 -5398
133 -5398 -17139 2673 -22520 -19703 20854 21717 843 -9368 -10040 3080 3130 -6823 840 4509
147 4509 5861 19565 8776 -2533 16463 4289 -18933 11470 33294 12149 3574 10181 18042
160 18042 21762 7654 8249 11480 -23378 -10033 61133 46213 -11261 2368 1674 -25542 10716
173 10716 37453 7254 546 4943 -3318 14046 16692 -12606 -8677 12156 5625 2478 9616 5756
187 5756 -1109 -311 8708 8753 -3035 2475 7719 -5634 7843 24810 -164 -6398 10677 -6025
201 -6025 -1727 33394 12417 -23013 -3906 10037 4969 11603 6983 972 544 -16240 -5476 28163
215 28163 5818 -28526 -1732 20858 45 -8044 1761 -3533 -15743 -5225 18573 9644 -19022
228 -19022 -10601 7146 -3123 -188 9263 -7792 -14282 -4322 -4572 4595 10571 -9796 -11936 2531
242 2531 -5252 -8057 -944 -10317 -8972 1146 -6058 -3849 4139 -14986 -22733 -1086 2368 -12573
256 -12573 -14937 -4413 808 -12735 -13866 10210 -274 -36629 -22578 11525 6562 -4053 -5139
269 -5139 -12902 -12664 -5685 -1119 7288 -3288 -19473 -1328 11538 -7983 -6967 8767 -1827 -9902
283 -9902 1981 7751 903 -8546 -6636 8956 11822 1081 -1938 -2130 212 6127 526 601 13878
298 13878 3916 -10612 7619 18803 4100 -2264 -562 343 6945 9811 12592 16000 -2491 -10696
312 -10696 12989 17239 -1366 2015 11470 6507 5828 9715 9318 3104 -6698 4063 22757 9532
326 9532 -4511 6166 4568 -2939 9730 13202 3287 1200 -3341 -2131 11288 8326 -5049 -1347
340 -1347 4562 3534 2699 -1528 119 2365 -7001 -5762 8885 4870 -6906 -3009 1000 -1550 -3684
355 -3684 -3673 399 -5041 -12768 4801 16096 -7485 -18539 -2734 -828 -5046 2056 2978 -3387 -10527
370 -10527 -11326 4632 9220 -10019 -10917 950 -5930 -5728 4873 -3372 -9278 -638 -1348 -3773 -1927
385 -1927 -8033 -8948 -3169 -1490 2286 110 -9445 -5484 -2584 -10155 -689 7394 -9890 -13636 4411
400 4411 5421 -4979 -5737 -2464 -3826 -9906 -5632 12526 8406 -13848 -9183 4816 -1763 -5971
414 -5971 731 162 -3509 -3609 1512 6797 -6327 -15740 409 7620 -1996 1611 1113 -11124 -6460
429 -6460 2545 693 2776 122 -8094 -1335 4529 -605 245 -1848 -5159 3834 5108 -601 7178
444 7178 4812 -9321 -322 11606 3967 -893 3882 7092 6407 811 4138 12589 -1546 -11437 11643
459 11643 19898 802 -1329 7403 993 -1670 8299 12827 3126 -7460 931 14323 6161 -1564
473 -1564 5700 4048 -719 3975 4644 5133 7876 -370 -115 12812 8699 -727 1470 -112 3884 13881
489 13881 5314 -623 8518 1530 -4259 10834 10044 -4938 -159 6912 2221 2989 5624 2547 -2228
504 -2228 -7349 -1277 10282 3147 -7411 -1058 3519 -3629 -5424 1945 3858 -6846 -10302 5787
518 5787 8368 -9764 -8439 1170 -5527 -1653 8135 -2730 -9555 -3356 -5239 -2256 5103 -4440 -10890
533 -10890 -2603 -1671 -2660 -1679 -9029 -8143 -1521 -8432 -7396 3098 -5596 -15540 -5885 -2035 -8747 -8298
549 -8298 -2991 -4285 -12435 -10770 4315 1728 -17392 -13671 2162 -710 -6056 -1828 -3318 -7273
563 -7273 -5952 651 6385 -1971 -10937 -1930 3943 -2532 789 4706 -2877 -3478 1887 1491 2226 155
579 155 -3697 1730 3226 380 5847 2032 -7541 746 5836 -1206 5680 8040 -8281 -4258 13148
594 13148 6752 -4297 302 3522 2358 4154 6231 6618 1263 -4015 3556 10573 3751 -700 5305
609 5305 6862 -1021 -1804 9587 8480 -6676 -2824 10741 3188 -2411 5860 -554 -6937 4789
623 4789 6502 200 3382 -3354 -8532 6188 8998 -3705 -1706 1537 -2191 3884 4810 -2736 891
638 891 3194 -3380 2468 9894 429 -3877 4798 4957 -1996 2094 9871 3526 -6295 972 10435 3792
654 3792 -1884 1529 1597 392 2719 4918 3863 -3441 -8595 4491 12680 -1935 -7144 2550 -102
669 -102 -3669 3409 1105 -3117 345 -924 -2226 2339 777 -3604 -2702 -1881 96 2832 -1486 -3308
685 -3308 -1799 -5578 -2276 5660 -1158 -8975 -3194 624 -2525 -2307 -1652 -4386 -7656 -6097 2665 3332
701 3332 -9056 -11561 -712 714 -6759 -5952 -186 -1953 -9220 -6638 2201 -2200 -8531 -2797 -1111
716 -1111 -5349 -223 1468 -5627 -5435 -1921 -2097 3056 2709 -6293 -4494 1916 148 1057 2120 -4024
732 -4024 -2928 3593 1386 576 2505 -2633 -3389 4505 4422 -2573 -140 5281 138 -4444 3725 8988
748 8988 6 -4363 3816 5352 1568 3047 3334 1264 1969 2460 6411 8320 -1121 -3966 7388 7912
764 7912 734 5038 5751 -1276 1484 6541 3408 2654 2994 852 3046 5599 2764 1324 1242 1193 2461
781 2461 2057 3269 3795 -707 -2772 2209 4472 1145 -904 -620 856 924 42 2748 1625 -6097 -2855
798 -2855 6715 2567 -4729 -365 1414 -3096 -2612 1809 2213 -2129 -5707 -871 3452 -2179 -3942 -316
814 -316 -1733 -2950 21 -12 -1577 -2882 -5058 -1784 2404 -1236 -3647 -2322 -3095 -1660 573 -2011
830 -2011 -2535 -1328 -4688 -2325 3643 -1171 -6643 -1965 1079 -2208 -2970 431 518 -4772 -5390 2346
846 2346 2814 -4328 -3875 501 -1205 -1941 -383 -229 -1438 -3776 -2830 3286 2007 -5234 -2608 790
862 790 -3027 -905 2450 -1647 -3346 -747 -1424 -553 1237 -1777 -3387 -161 792 76 -803 -1656 -296
879 -296 -1452 -1834 2799 2124 -4485 -2677 2920 1579 -1187 -722 1572 863 -2903 -1 6607 807
895 807 -6173 859 5549 -369 -120 3537 597 -1705 187 3885 4079 -740 -1446 3475 3011 79
911 79 2532 2534 -517 1430 3556 2842 2654 1347 34 2323 3720 3218 2712 1228 1527 3529 2130 2831
929 2831 5845 1728 -2022 4250 7044 1601 252 3129 3490 1814 1813 4903 4907 -1805 -1068 6334 4385
946 4385 -1415 1374 3521 54 -72 2670 2911 -240 -2835 359 4088 -248 -1830 1590 -671 -3348
962 -3348 507 1696 -1039 -1876 -2400 -1827 626 -311 -3005 -2753 -2008 -898 -1099 -3143 -1511 -1069 -5253
979 -5253 -4024 1269 -1483 -5645 -3682 -1704 -2887 -3869 -2739 -1374 -4489 -7084 -1163 1517 -5468
994 -5468 -6566 -907 -2544 -5138 -1477 -429 -3355 -5486 -3309 398 -453 -4327 -2294 174 -2684
1009 -2684 -2236 1193 -423 -2868 -926 -113 605 1219 -466 -1668 -560 904 1549 255 -116 755 -17
1026 -17 -1009 2468 3364 -1802 -1524 2086 2018 145 -55 1764 1205 -2237 -354 5569 2336 -4222 667
1043 667 4296 -826 -478 3705 1261 -1444 513 3620 3337 -270 -2245 2017 3302 92 1811 3632
1059 3632 -607 -1163 2777 2617 344 674 911 402 1149 2255 1428 34 903 1157 -580 1708 3814
1076 3814 47 -2582 1259 3664 1426 240 638 1431 1665 149 2665 4608 -1279 -2539 5048 4100
1092 4100 -2099 942 3820 125 -274 3094 3184 714 -1043 380 2440 1019 -171 2136 1329 -2059
1108 -2059 -572 2689 1356 -1535 -1731 -520 1040 1108 -659 -2248 -1696 192 160 -1307 -310 -573 -2758
1125 -2758 -1485 1192 -439 -2630 -1376 -157 -629 -1936 -1566 1234 -1221 -5676 -1369 3064 -2174
1140 -2174 -3498 504 -2406 -4715 -166 1056 -3082 -4261 -2687 -82 640 -3499 -4804 -1288 -1194 -3205
1156 -3205 -1131 -258 -3506 -3290 -434 -873 -1940 -844 -1527 -2464 -1026 -36 -1831 -847 906 -2665 -3651
1173 -3651 1814 2359 -2085 -1705 -202 -448 894 593 -713 5 -1418 -1860 3605 2777 -4248 -1192 4584
1190 4584 288 -1848 2932 1584 -1922 560 2888 1809 825 863 1372 1866 1358 1193 3452 2392 -283
1207 -283 541 3921 3904 1040 1073 1676 1725 3862 3929 776 1126 2760 1362 1520 4612 951 -1624 2743
1225 2743 3755 488 414 1793 1340 736 -236 1445 3268 118 -2288 1832 2200 -1112 853 2839
1241 2839 -938 -2060 1327 2665 291 -2285 -1693 1153 1582 -516 -643 -38 -1674 -1065 855 360
1257 360 -2086 -1835 -252 -165 -410 -922 -1687 -1582 -91 -1319 -2627 551 559 -3468 -2397 905 -1123 -1673
1275 -1673 -745 -1693 -2114 -1077 -640 200 -798 -4868 -1596 3142 -1051 -4142 257 552 -2755 -686 1750
1292 1750 -1679 -3154 -1023 349 -222 -1162 -1116 -1075 -279 -1262 -1596 332 466 -2239 -2018 202 94 -892
1310 -892 -612 -1980 -1740 1000 202 -1748 440 -952 -3320 713 2780 -2097 -2465 1117 -21 -859
1326 -859 189 306 -534 -1059 -731 1313 1284 -1718 -1260 1677 -247 -1903 1455 2281 -1150 -1977 1303
1343 1303 2585 87 -922 360 510 -37 1499 1520 167 -119 708 1250 2070 1026 -127 685 1717
1360 1717 1781 1608 512 1159 2231 410 688 3388 2244 -408 1482 2696 1119 777 2388 1854 269
1377 269 413 2936 3918 612 -848 2627 2968 -414 1360 2835 683 -126 1945 2917 871 -286
1393 -286 565 1949 750 629 904 707 96 38 643 943 416 -605 -471 168 169 167 -51 -1457 -504 3
1413 3 -1628 -446 832 -2236 -2846 913 114 -2683 -1557 -158 -1587 -2309 -802 -253 -1683 -3483 -1681
1430 -1681 337 -1535 -3000 -814 -884 -3152 -2278 -327 -571 -3258 -2515 -89 -1058 -2372 -1230 -463 -2522
1447 -2522 -1999 -134 -1022 -1413 -894 -1931 -900 -60 -760 -1740 -1274 -834 -553 -117 -557 158 -532 -1857
1465 -1857 -375 1605 -299 -1614 26 1001 -583 -327 1411 686 -1556 -1115 2056 1386 -1215 137
1481 137 1563 13 -529 1261 1331 -120 -418 958 2081 766 -218 981 1017 -172 827 1884 672
1498 672 161 1054 1026 1548 1415 668 303 956 1384 1302 857 1033 1167 241 -11 2368 1460 -880 85 2037
1518 2037 1005 146 917 1857 216 -623 1477 2681 -199 -941 1441 1928 -360 290 1970 645 -1168
1535 -1168 305 2321 704 -520 87 1213 152 -39 1690 525 -780 -20 736 737 61 -100 -356
1552 -356 295 194 319 231 -413 -626 59 -375 512 935 -942 -1534 605 888 -1079 -1313 458 -382 -1629
1571 -1629 -253 1228 -228 -2363 -936 893 -254 -1690 -129 622 -1156 -1503 415 363 -1544 -1878
1587 -1878 -189 -208 -1479 -866 79 -1776 -1745 -550 -553 -989 -1566 -1663 -993 -444 -1096 -1552 -1537 -1725 -1238 -664
1607 -664 -1369 -727 -897 -2280 -1543 651 -859 -2491 -603 -110 -1484 -1338 255 -55 -1842 -1563 435
1624 435 331 -1428 -890 750 -217 -1530 183 1390 -295 -1976 344 1862 409 -533 920 728
1640 728 -413 941 1577 464 624 818 1026 1371 1723 811 983 1395 1066 1609 1996 1221 1367 1130 369
1659 369 1812 2444 836 465 2293 1549 657 1902 2179 16 -324 2263 2619 535 15 1227 1931
1676 1931 802 157 1335 1311 -294 -143 1848 1431 -946 -151 1490 -420 -273 1218 644 -540 -34
1693 -34 -216 98 967 -251 -1304 -406 92 -504 113 -185 -1288 -810 -98 -539 73 -640 -2020 -359 1133
1712 1133 -1184 -1873 388 1 -1997 -650 564 -833 -1805 -629 -313 -1052 -964 -578 -148 -833 -1772 -641
1730 -641 1219 -822 -2789 -266 532 -1183 235 522 -1806 -1502 764 -48 -868 -157 -1354 -990 764
1747 764 -435 -1570 23 30 -865 -497 -330 -377 55 -447 -1162 12 620 -625 -294 428 -1463 -1284 1374
1766 1374 1280 -1823 -1595 769 571 -515 86 -413 -739 -268 113 312 -247 -1152 -125 1824 73 -1552
1784 -1552 733 759 -1059 -305 805 -110 185 587 -711 -159 1491 491 -308 392 -139 80 1068 1202
1802 1202 -233 -340 63 1314 1753 -313 -717 1006 1530 -182 316 1857 546 12 1483 1753 81
1819 81 485 1532 1134 345 781 1456 1626 885 28 1282 2318 366 131 1224 657 114 2092 1805
1837 1805 -604 330 1045 511 901 1053 -573 502 1474 224 -145 359 535 -222 -105 229 75 300
1855 300 -655 -338 576 -84 -868 510 449 -1820 -1229 1111 51 -2016 -1105 21 -1431 -986 -412 -728
1873 -728 -1249 -922 -1047 -369 -799 -1961 -1172 -252 -1578 -1709 -389 -1058 -1734 -320 -291 -1145 -995 -822 -1526
1892 -1526 -952 -540 -1240 -1040 -702 -979 -1330 -468 100 -695 -1551 -758 16 -55 -1055 -1206 12 -750 -1323
1911 -1323 370 468 -1108 -1353 697 708 -780 -189 734 -193 -527 539 809 365 -493 -63 760 556 -203
1930 -203 734 1089 -299 153 1301 832 376 437 66 590 1339 832 152 485 767 371 334 839 634 -5
1950 -5 426 1091 1393 280 -75 1196 980 42 584 1536 617 -743 406 1485 533 -310 837 842 -148
1969 -148 88 1107 281 -442 -341 645 1362 -12 -328 594 117 -410 153 864 -314 72 458 292 229
1988 229 638 202 -267 170 283 271 86 375 -110 -798 292 839 407 -605 361 267 -117 -300 696 178
2008 178 -566 -454 798 860 -859 -544 767 26 -467 30 613 -477 -1160 328 374 -395 -826 -218 -312
2027 -312 -793 -475 -146 -813 -1118 -638 21 -315 -808 -892 -994 -824 -655 -659 -739 -888 -949 -857 -874 -348 -529 -1464
2049 -1464 -1321 -390 -632 -1614 -924 -86 -992 -1556 -341 360 -1032 -1848 -192 -193 -1119 -1183 88 -518 -1258
2068 -1258 -572 520 -202 -799 -443 216 69 -613 185 533 -344 -89 498 492 233 273 140 533 471 746 492
2089 492 454 581 952 402 804 853 431 351 1016 1672 497 244 839 1217 776 655 1526 1115 108 764
2109 764 1690 1059 127 938 1263 476 458 1498 1340 280 41 802 1330 415 158 896 754 183 669 1095
2129 1095 202 22 552 707 608 481 161 -221 328 272 -59 309 369 -89 -725 -5 626 -93 -845 -469 -110
2150 -110 -494 -205 -34 195 -787 -937 23 519 -1082 -1015 222 -171 -924 -281 206 -849 -1162 -212 44
2169 44 -216 -799 -483 -105 -784 -737 -514 -378 -976 -1090 -64 -246 -443 -474 -599 -791 -204 -149 -374 -353 -612
2190 -612 -776 -747 281 -58 -1052 -889 113 -263 -798 -388 -315 -231 -620 -383 355 -272 -947 -110 420 -772
2210 -772 -899 469 -9 -987 20 386 38 -422 -156 -223 -174 106 165 30 -563 -694 -83 434 -162 -533
2230 -533 -160 234 176 264 -56 -557 293 212 -603 225 721 -18 -280 833 97 -211 292 629 49 50 773
2251 773 1006 583 -213 -210 883 932 -32 637 1096 94 334 1491 982 -70 361 1017 601 696 792 458
2271 458 892 662 427 897 952 350 672 1074 504 514 1076 391 51 536 453 446 1052 680 -341 430 1392
2292 1392 194 -375 704 233 99 288 188 -32 10 -359 -12 586 -358 -879 486 218 -1023 -337 902
2311 902 -414 -851 -209 -106 -499 -196 -426 -949 -849 -622 -166 -51 -697 -1445 -804 77 -595 -887 -581 -1000
2331 -1000 -800 -160 -817 -1090 -546 -668 -838 -188 -313 -1218 -720 79 -905 -1287 -220 -86 -903 -968 -743 -259
2351 -259 -13 -971 -807 118 -428 -583 104 11 -1274 -584 652 -184 -432 -180 255 -154 234 109 -409 287
2371 287 114 -28 250 292 59 479 799 219 18 618 524 382 657 -43 582 1298 643 -818 319 1060
2391 1060 141 3 859 336 6 726 909 372 239 154 821 868 -202 251 1159 458 -312 533 1008 113
2411 113 252 1053 193 -223 514 588 244 364 149 152 607 202 -212 124 517 342 125 241 -96 350 406
2432 406 44 90 537 -15 -178 828 231 -513 227 744 -337 -369 351 315 -254 -133 344 52 110 48 289
2453 289 103 -527 -43 717 255 -1026 -63 625 35 -352 157 -230 -281 -134 117 -13 -426 -231 -307 220
2473 220 -381 -490 -59 -434 -737 -366 -436 -511 -296 -293 -824 -496 422 -613 -1080 -39 -185 -961 -602 -232 -649
2494 -649 -1082 -571 147 -383 -793 -854 -93 -376 -823 -142 60 -1049 -764 -37 -93 -785 -344 78 -510 -584 -254
2515 -254 -102 -543 -212 -326 -46 95 -104 -352 -162 108 75 -92 -13 -281 84 94 -93 662 319 -247 227
2536 227 645 260 -206 776 518 -38 71 851 616 238 239 744 720 395 639 939 590 -115 722 1255 329
2557 329 -20 549 1058 468 315 873 687 459 690 1020 547 226 354 552 508 783 378 405 643 378 176
2578 176 385 676 436 155 99 403 462 156 302 100 107 -20 30 478 190 -323 12 527 -127 -283 63 -95
2600 -95 -870 -327 120 -68 -581 -421 -183 -165 -489 -386 -41 -272 -299 -270 -258 -595 -728 -364 -112 -56 -483 -546
2622 -546 -161 -275 -574 -254 -298 -212 -339 -536 -295 27 -603 -606 -182 -188 -789 -205 136 -303 -783 -107 -16 -248
2644 -248 -666 -144 34 -127 -543 -32 56 -286 -627 64 123 -554 -234 155 -50 -428 -117 -76 -360 -423 -5
2665 -5 122 -358 -242 -244 -110 -19 -194 126 -115 1 -123 143 -574 464 -32 -251 -75 145 82 -28 42 176
2687 176 -396 -123 417 442 -229 -23 320 126 -18 68 565 167 -249 38 659 -78 35 453 398 415 261
2708 261 587 440 -58 286 694 392 413 244 48 378 388 470 596 419 512 139 591 644 274 148 526 459
2730 459 368 276 207 671 322 -170 648 994 -5 14 427 443 190 397 593 333 -55 143 189 319 -354 -161
2752 -161 187 315 -134 -323 326 -52 -77 105 -100 -321 -85 -112 -246 -266 -119 -592 -201 -333 -694 -496 -247
2773 -247 -417 -726 -250 -458 -446 -397 -869 -968 -516 -542 -630 -260 -629 -870 -652 -246 -494 -736 -274 -100 -540 -572
2795 -572 -406 -433 -327 -806 -507 -49 -428 -658 167 -268 -602 -373 480 -284 -308 -60 -96 -8 42 -61 -417 297
2817 297 15 -192 84 325 -233 -23 523 148 205 42 1 248 155 -26 -39 716 176 -227 631 291 -177
2838 -177 52 360 310 103 692 594 134 165 402 636 540 -167 -397 719 348 13 400 414 -43 380 390 124
2860 124 126 243 301 169 718 104 158 341 443 -126 308 290 302 71 204 113 415 218 -6 375 8 -48 -105
2883 -105 701 24 -448 392 681 -430 -8 310 11 -346 267 -19 78 93 -90 287 153 -289 -335 463 -26
2904 -26 -707 1 351 60 -160 -219 -252 3 200 -210 -416 194 -270 -118 277 -148 -470 99 128 -244 -321 -351
2926 -351 -285 -47 -297 -684 -221 121 -766 -667 85 -421 -688 -224 105 -911 -523 -403 -180 -512 -453 -637 -515
2947 -515 -66 -659 -502 -217 -526 -496 108 -228 -587 -474 -401 -474 -120 -353 -493 -288 24 -332 -459 216 -311
2968 -311 -562 -79 -298 -59 182 -112 20 -192 -140 -70 418 75 -384 -35 731 -232 -117 433 218 -1 508
2989 508 547 197 210 467 307 399 286 342 477 385 -69 567 834 333 288 440 501 373 813 272 256 491 432
3012 432 270 692 343 360 350 749 490 204 67 463 399 403 428 304 535 282 513 578 160 -127 295 462
3034 462 -124 -427 137 352 -259 -101 362 291 4 -227 -50 -174 -346 -137 223 -102 -308 -1 158 -342
3054 -342 -381 -107 -118 -179 -119 -144 -489 -90 -146 -294 -277 -173 -337 -332 -382 -358 -359 -364 -208 -223 -322 -590 -393 -17 -341 -619
3080 -619 -94 -130 -390 -96 43 -151 -504 -140 -16 -192 -293 -303 -217 -266 -164 -76 11 -225 -480 -97 317 107
3102 107 -202 211 -329 -12 -316 -205 -294 -206 -33 79 15 -166 -551 -320 -33 82 -365 -419 161 -210 -286 -297
3124 -297 74 -87 -361 28 175 -76 -147 10 54 -226 -245 150 261 -141 294 216 77 -80 161 -96 264
3145 264 122 27 322 29 115 179 400 247 143 -181 114 323 206 335 315 290 73 22 264 501 400 349
3167 349 246 740 265 270 496 731 291 274 710 450 111 57 500 90 169 335 554 233 301 561 559 223 98
3190 98 55 307 -113 145 114 328 -218 33 338 -140 -63 -8 1 -286 -267 -216 74 -72 -146 -98 26 -102 -8 -64
3214 -64 -297 -122 -198 -449 -63 27 -670 -531 -357 -344 -435 -400 -152 -414 -440 -569 -211 -504 -449 -542 -168 -690 -569
3237 -569 -626 -415 -552 -525 -112 -328 -529 -496 -70 -116 -154 -610 -325 -139 -211 -154 -84 -273 -175 -92 -65 -93 57 -294
3261 -294 -259 59 31 -391 -194 411 95 -290 -39 149 -128 -60 117 261 -132 105 297 268 -123 -51 426 166
3283 166 -285 -149 374 317 188 336 500 256 220 219 -5 105 332 -15 360 344 245 191 -221 242 164 241 151
3306 151 229 210 -46 302 421 234 -198 209 221 -25 239 514 180 -95 89 171 345 -65 63 508 275
3327 275 -67 36 644 107 -244 438 163 -99 387 120 60 -74 4 104 69 -61 -272 121 271 125 -210
3348 -210 131 52 -209 -42 278 -239 58 -118 -3 110 259 -413 -112 174 -15 -134 245 -5 -282 -397
3368 -397 292 -139 -116 -317 -262 -31 -283 -227 -253 -274 -236 -100 3 -427 -589 -116 -403 -226 -244 -225 -395 -278 -293
3391 -293 -572 -216 -245 -440 -539 8 -423 -382 -103 -462 -393 -107 -92 -202 -38 -199 -408 -138 -87 -470 -73 61
3413 61 -112 -442 -8 -68 -189 -219 -88 -124 -371 -414 -411 149 -291 -103 427 374 -483 -173 295 -82 -20 566 264
3436 264 -176 171 163 506 248 155 133 293 112 496 72 378 453 213 577 -44 58 366 330 348 489 353
3458 353 287 637 416 104 408 779 258 289 307 327 493 311 145 122 456 137 -12 534 234 -285 464 690
3480 690 115 -43 487 154 29 228 14 50 250 -40 -181 -99 -73 -177 -14 62 -218 -22 108 -184 -138 104
3502 104 -6 294 222 -205 -481 194 -170 -666 -158 -14 -220 -261 -18 -231 -360 -385 -257 293 -158 -561 -300
3523 -300 148 -195 -272 -5 -113 -372 -327 272 -462 -464 269 -96 -111 -325 -266 -173 112 -488 -624 25 34 -33 -37 -246
3547 -246 -257 48 -26 -379 -230 -50 170 -100 162 -318 -138 -117 -100 -510 -38 90 -462 -177 -54 -75 -198 -341
3569 -341 -178 304 -30 -193 99 303 -341 -277 239 25 -145 13 146 -119 113 -82 -39 167 266 202 123 302
3591 302 196 80 213 -7 66 41 346 41 -269 128 -198 222 56 -373 99 131 -59 -183 476 42 148
3612 148 273 253 400 19 -65 122 249 142 47 336 321 47 10 356 195 -20 468 404 -61 198 349 164
3634 164 459 337 452 204 173 209 132 212 224 -145 167 104 -141 40 -43 128 -79 -75 -153 -65 42 -330 -37 87
3658 87 -190 -367 -74 0 51 -438 -178 -235 -458 -294 -35 151 -65 -302 186 -83 -629 -435 -13 -396 -582
3679 -582 -200 -195 -147 -618 -354 -128 -358 -234 -211 -481 -261 -549 -183 91 -405 -294 -149 -194 -174 -84 6 -96 52
3702 52 -244 -244 -338 -176 -255 -55 63 -30 -306 73 325 7 2 119 328 -164 14 413 -64 -54 -190 81 58
3725 58 -33 101 229 6 -244 -28 165 43 154 -35 137 56 23 205 35 184 -144 -98 206 358 168 -20
3747 -20 412 403 252 215 113 241 64 -23 159 185 140 135 63 337 106 310 261 93 -52 -53 -18 323 -82 -66 188
3772 188 116 -224 210 334 108 -61 47 302 39 92 85 213 59 -15 -28 197 10 92 -146 51 135 -12 -62
3795 -62 -116 202 -81 -62 13 -191 -265 -198 42 31 -123 277 -9 174 -163 185 -159 26 -134 211 143 -247 -282
3818 -282 -142 136 -422 -21 -208 31 -153 -61 160 -347 -85 -67 -249 -286 -482 -125 -195 -148 -142 -433 -289 58
3840 58 -363 -332 -525 -217 -367 -222 -91 -12 -10 -73 -156 -217 -235 -239 -49 -288 -559 -13 34 -430 -357 -42 -167 -109 -122
3865 -122 -183 94 81 -131 -271 169 -246 -100 -81 -266 -491 -172 90 -111 -47 174 -36 34 106 -55 112 202
3887 202 489 -9 198 392 166 650 364 298 -41 78 425 180 223 94 293 525 68 184 257 267 350 323
3909 323 402 295 176 347 199 567 421 59 345 227 70 129 205 173 142 322 409 -124 101 38 -4 193 496
3932 496 138 62 156 344 -57 17 26 -185 -36 68 -134 11 -95 -321 72 -182 -155 405 -95 -318 -117 -139
3954 -139 -59 -178 -139 1 -456 -209 48 -326 -333 -355 -209 12 -216 -345 -106 -104 -64 -148 -44 -7 -345 -229 -98
3977 -98 -384 -394 39 292 -104 -197 -256 105 -107 -183 -289 -264 285 -275 -35 -114 -24 -373 -249 -186 34 -56 -59 -252
4001 -252 -159 -238 -442 74 255 -423 63 69 -107 -186 -161 -17 26 1 15 133 -87 -138 -11 236 -160 -75 -138 52
4025 52 2 96 25 -389 -40 102 -421 -106 255 -72 -233 61 123 83 378 423 23 208 96 -102 -8 -131 -247
4048 -247 94 133 -381 116 -204 -11 144 199 146 38 229 560 -74 194 441 165 445 63 42 210 363
4069 363 411 299 2 -125 -133 352 223 305 198 298 375 97 242 31 210 519 30 176 123 375 27 321
4091 321 10 -33 -1 3 -50 -26 230 -53 314 168 -255 -391 9 -111 -71 -48 -63 -470 184 423 -231 -222 -2 34
4115 34 -47 -209 -343 39 -6 -288 -121 -124 -195 -264 -94 -365 -535 -115 -198 -166 -241 -385 -359 -190 -213 -339 -289 -119
4139 -119 -335 -177 -222 -447 -324 -266 -451 -173 -34 -77 -443 61 239 -297 -401 119 -13 -489 -66 154 -89
4160 -89 -43 -76 173 -184 -292 260 -123 68 176 141 70 57 -63 153 -22 -248 160 -22 112 242 -25 -116
4182 -116 269 167 -362 123 343 66 275 158 327 123 198 285 311 72 192 202 277 129 -73 397 -70 204
4204 204 60 171 202 117 205 396 21 114 -64 -52 128 -47 -50 283 -28 108 60 382 -68 9 69 245 57
4227 57 -144 36 -101 -82 -77 -134 30 -21 -240 132 324 52 -90 -44 206 0 196 89 -127 39 -110 26
4249 26 171 -166 -224 177 258 122 -61 225 98 -179 61 116 76 -146 -98 287 58 -135 -6 -124 -121 -284 -99
4272 -99 34 34 -96 -105 -15 -48 -49 -15 -154 -135 -352 -42 -100 -188 -135 -189 -406 -232 -152 -492 -198 -322 -257 -522 -247 -217
4298 -217 -124 -68 -313 105 -206 -412 -12 -224 -68 -13 -184 -81 -111 -97 -54 -181 -227 95 -127 -282 -90 -200
4320 -200 146 -112 -36 -190 80 -162 -95 -16 111 -55 177 210 185 40 31 311 388 142 -86 390 518 194 192
4343 192 253 221 220 35 106 305 -3 141 333 339 197 228 351 25 113 157 32 73 387 262 85 89 352 14
4367 14 262 241 -73 353 24 26 -213 35 -2 38 -32 42 -1 113 285 -308 278 42 84 73 395 26 148 193
4391 193 -170 -133 -198 4 136 304 -370 63 127 75 -168 61 179 -119 -38 -104 -62 -221 -49 -155 -180 -361 -373
4414 -373 -228 -265 -381 -76 -157 -2 155 -141 -264 -259 96 -383 -5 -261 -2 -115 -119 -73 -74 -562 -173 -109 -395
4437 -395 -10 20 -182 40 30 -97 78 16 -274 -74 -50 -308 -121 -12 -388 -173 -83 35 -94 -394 -108 110
4459 110 -286 309 -109 -158 133 123 -31 -144 -103 -19 -513 -46 -59 -54 50 -66 -66 55 -265 -108 55 -152 101
4482 101 4 -184 -104 67 109 -153 -67 171 -30 132 -171 -129 396 -58 -112 324 -158 -71 -66 112 209 -324 183
4505 183 27 -190 -65 -83 221 86 198 32 -160 186 59 145 -18 -184 -41 68 138 324 114 223 177
4526 177 220 299 -42 415 231 -35 -182 -153 160 -15 133 168 226 78 61 19 -95 -128 -38 105 301 42 -112
4549 -112 138 -36 291 310 307 -293 299 18 -391 -170 -75 -358 3 -363 -187 -293 -239 8 -366 -214 -15 -163
4571 -163 45 -212 -300 -93 16 -220 -234 -120 -302 -42 64 -233 -155 2 -99 -489 -79 -275 70 -110 -102 107
4593 107 -81 103 -263 -12 -178 -323 107 7 -426 -148 -168 87 -171 10 -216 -174 151 181 41 10 61 137
4615 137 -48 224 -63 -99 214 188 -44 92 129 -80 185 241 -241 54 -82 12 117 -26 -120 -2 355 83
4637 83 146 316 79 68 120 183 -140 171 -214 68 250 197 -123 -30 174 99 -13 156 276 30 32 -340 -86
4660 -86 360 -64 195 125 257 -17 300 215 186 226 120 -26 -110 10 -93 123 249 -171 -90 176 337 -109
4682 -109 31 364 23 164 288 375 -59 187 28 151 -69 -13 36 174 20 -83 -151 265 -313 -80 25
4703 25 66 3 -17 -114 60 -110 -90 -231 -81 -94 -7 -65 10 9 5 -251 -148 3 87 -314 188 -48 -122 -107 -97 -68
4729 -68 -130 -212 55 -223 -205 -13 -233 -356 -303 -86 64 -313 -277 73 -366 -274 -66 95 -218 -111 -7 -260
4751 -260 -70 -160 5 13 -103 -70 -115 -154 -26 -154 -138 -33 -49 -37 277 -311 -10 262 251 157 26 -212 -341 34
4775 34 -16 -114 66 -72 222 42 161 67 -76 145 116 -82 137 -76 29 114 119 270 160 264 -117 151 277
4798 277 113 274 89 212 287 116 43 553 35 138 -71 3 125 137 61 -40 137 321 -46 29 133 -198
4820 -198 70 241 46 -34 120 104 94 -22 132 125 122 30 185 59 -49 20 -52 20 127 -164 -198 250 -144 -128
4844 -128 -74 -17 -2 -251 120 -75 43 -78 -156 -230 -156 -96 -193 -294 -68 104 -375 -309 66 -60 0 -29 -144 -9
4868 -9 116 168 -130 -413 -51 -129 -48 -95 -100 -86 83 -218 170 104 -4 -90 185 7 -211 94 -42 42 -161 -103
4892 -103 -126 21 -98 60 90 3 -109 189 -170 41 240 -199 -99 -110 -58 117 -54 -43 86 57 -57 202
4914 202 1 52 114 -104 -139 145 68 32 -169 5 150 251 -87 -52 208 -14 -181 -51 190 -38 17 109 101
4937 101 -28 101 98 -44 -114 219 20 -51 -97 -97 -145 205 -17 271 83 181 158 140 123 5 159 77 198 173 95
4962 95 -217 192 175 -41 -45 -20 240 300 246 412 126 151 -138 34 213 145 266 208 -5 59 370 139 132 -109
4986 -109 -40 28 296 347 0 -48 221 70 144 -50 56 -91 7 212 -53 13 -127 -64 136 -186 48 -276 -91
5009 -91 -352 -135 -12 -194 -132 50 51 21 -179 -152 -97 -275 -204 -289 -226 -474 -197 -257 -301 -122 -280 -77 -179 329
5033 329 -189 -119 -281 -41 88 -146 -66 -113 10 -64 -263 -286 98 109 -111 21 -48 -148 68 -38 -149 -308
5055 -308 -213 -62 -107 109 30 95 -100 187 6 109 -63 -233 234 20 -80 174 134 -236 -18 -82 -58 -161
5077 -161 71 26 -206 -51 310 312 64 44 71 126 -159 -186 173 -92 6 230 168 101 -2 158 -198 -88 -157 67
5101 67 216 93 -129 87 254 336 4 42 1 213 252 -115 -24 -102 30 53 228 -34 -107 -111 6 170 -277 33
5125 33 135 104 143 62 128 40 87 -228 32 -142 83 -72 64 -360 91 26 262 -88 -109 -206 -97 80 -135
5148 -135 215 -314 320 177 -132 73 -80 273 -31 92 -195 -180 -146 6 -61 -130 194 -186 21 60 -26 -203
5170 -203 68 -31 84 -34 -107 180 265 -35 -338 -299 -193 -213 -149 -336 93 -296 -93 -20 -361 -60 -466 60
5192 60 -127 -21 -138 -271 -323 -217 -103 -31 -352 68 -34 -268 -73 33 180 175 -244 -178 -72 -79 -73 -40 196 7
5216 7 -188 -32 -89 8 -37 -69 -166 -68 69 -14 164 136 104 343 -214 179 129 102 225 112 167 -13 37 192 184 347
5242 347 6 -25 169 -51 223 128 173 140 319 113 165 106 103 145 101 74 39 268 291 307 144 193 98 -51 280
5267 280 172 -40 19 -7 276 203 -183 53 171 108 -28 91 127 -27 -223 40 -81 9 98 -153 227 109
5289 109 -88 124 60 85 -406 -113 -311 224 -60 15 -45 9 107 -103 29 -91 -1 -202 -4 -223 -152 -42 -89
5312 -89 -27 -64 -294 64 96 -128 34 -42 -87 -160 117 -356 -404 -49 12 -256 -36 -37 -39 90 -50 -110 16 -193 -197
5337 -197 24 -263 169 92 21 -4 67 -64 -157 95 -72 22 137 49 -263 -172 -202 -275 39 -86 18 205 -100
5360 -100 -185 -27 -135 -6 -48 -59 -59 26 -304 23 206 169 -115 82 311 31 78 101 129 -185 -90 -59 -129 294
5384 294 -11 259 33 130 94 118 75 -70 129 14 79 229 -46 -44 57 117 329 86 127 -109 89 327 68
5407 68 79 -51 52 375 95 308 136 -108 262 -3 -13 54 -7 -39 101 30 391 116 255 115 55 308 78
5430 78 126 147 186 9 68 57 -2 82 271 290 92 191 69 -170 75 -29 382 -148 -21 -40 0 -37 -122 -84 -92 -222
5456 -222 -166 -104 -402 -78 -260 -69 -167 -129 25 12 -57 -159 -174 25 -245 -250 -78 -533 -234 -44 -98 -242 -44
5479 -44 -257 -90 -144 -138 75 -432 -188 98 -114 -285 -115 -123 -142 21 -27 91 57 -127 -70 14 122 -209 -333 -189
5503 -189 1 77 -24 -158 28 125 142 -314 -120 97 -274 99 330 371 -40 -17 220 -10 -46 24 40 189 246
5526 246 -210 131 93 -193 10 104 222 40 75 186 266 95 -50 21 -24 151 79 187 -44 45 -83 217 -110
5549 -110 90 245 79 121 261 27 298 -10 -76 -44 -112 -27 222 67 14 246 -93 -285 115 40 4 50 130
5572 130 2 141 7 -30 52 -15 131 -46 -21 138 -91 -127 -53 -77 -5 -103 192 85 -96 50 -69 71 229
5595 229 -139 -19 -224 -150 72 -81 -199 7 -244 28 80 -133 104 -304 -154 24 41 -263 82 244 -107
5616 -107 27 -69 199 -138 -24 -227 81 -386 -111 -145 -97 -82 -12 -323 24 -47 -30 -80 -117 -247 -63 -9 38 -47
5640 -47 -90 12 -226 -90 -469 53 104 33 -402 -19 -128 43 52 11 -274 -107 -162 80 44 -152 -85 108 11 -40
5664 -40 -255 181 31 -101 276 -107 221 54 79 270 -75 95 92 80 70 198 28 16 403 -186 176 340
5686 340 138 -179 327 200 221 216 350 -84 115 307 -61 66 214 -7 -129 93 58 172 67 24 195 170
5708 170 44 162 258 133 -18 90 298 2 86 121 153 -213 83 23 -9 -134 261 76 -181 447 67 -68
5730 -68 -201 31 -260 184 -304 -105 -346 -47 -18 114 -222 -156 82 -130 -83 25 -144 -410 224 -169 -167 -104
5752 -104 -311 40 169 -228 -249 -69 -481 -14 -166 -281 -109 -173 -118 184 161 -124 -134 -115 -276 -201 203 117 41
5775 41 80 20 44 -176 33 46 -101 32 -24 59 -146 203 -96 97 84 128 -118 -132 -121 -65 -43 -24 -88 -219 -26
5800 -26 -215 -12 -18 290 -71 -142 314 -91 104 -155 -64 11 261 -104 153 9 7 -23 39 149 -75 -108 68 242
5824 242 -55 238 233 -56 -194 32 7 151 197 -58 -118 154 181 258 -34 -213 -166 60 -54 237 182 76 52
5847 52 183 313 13 -105 243 282 -84 68 86 143 180 15 -102 -51 18 99 -24 -82 -81 64 247 77 7 172
5871 172 168 106 443 -76 243 -9 -1 -13 95 -264 -195 256 38 39 -55 -65 -26 159 -284 -77 61 56 -104 -373 210
5896 210 -138 -351 -45 -74 -152 -531 218 -109 -187 -132 -206 -49 -88 -222 -25 -10 -155 15 3 9 -138 -219 -155 -111
5920 -111 -190 -153 -331 -352 -121 -98 -289 -175 -454 -168 -109 -93 -14 -442 219 27 -124 101 -165 -3 -259 -148
5942 -148 -120 -4 -212 -207 -28 24 230 18 8 101 -25 285 172 43 181 33 -129 -91 -205 311 -130 -90 4
5965 4 230 -43 124 309 271 133 125 214 75 -333 105 54 89 61 270 213 268 147 95 156 183 295 -114 120 353
5990 353 -3 173 -167 285 193 269 12 95 309 176 -109 265 -55 -234 18 77 205 257 53 -48 80 -39
6012 -39 -86 -117 -20 98 313 -78 -144 -203 77 125 81 -208 161 -64 79 -32 123 -48 42 -160 -126 69 104 -43
6036 -43 -108 -173 105 -45 -7 135 -25 48 -237 -110 -166 172 -47 -102 -150 -72 -79 45 37 -105 30 183 52 -30 1
6061 1 3 35 -92 -136 336 57 -191 68 -122 -27 94 -179 45 -137 -128 -140 -233 -212 -109 -149 -236 -306 -253 184 -73
6086 -73 -325 -429 -312 -57 -63 -172 1 11 -67 123 86 -39 -3 160 -178 -13 -254 47 -40 2 178 -11 -67
6109 -67 71 72 293 -29 -26 -71 -97 59 -163 15 -146 101 82 -56 -176 140 130 81 89 84 29 -94 97 265 377
6134 377 -29 263 30 -64 218 176 85 233 174 -35 -10 119 -115 118 297 115 68 353 36 151 297 253
6156 253 115 254 -38 231 172 -5 141 165 132 -37 192 -94 20 74 -52 -146 -23 95 223 -252 -191 6
6178 6 64 -26 96 -222 -17 -32 -11 121 -147 189 -37 -366 -41 41 -145 -165 65 151 86 -52 131 -183 -241 -277
6202 -277 -1 -177 -162 -68 54 -132 -43 -139 -141 -94 -19 -166 -4 38 -427 -50 -229 -145 -201 27 -194 -159 -91 -38 52
6227 52 181 107 -189 179 -50 -65 -99 -113 150 274 -15 -63 100 -106 3 -23 214 24 107 -82 -7 -255 -25
6250 -25 63 36 250 16 23 -103 64 113 14 40 -31 -94 -84 125 225 151 103 -147 -28 393 -18 -71 152 -125 -160
6275 -160 249 1 219 145 -371 -28 8 7 214 177 258 112 -37 329 73 115 -137 50 83 7 320 92 347
6298 347 10 101 259 105 40 113 -21 41 156 236 224 -14 -98 -5 149 63 -59 -171 180 -111 -125 89 20 148
6322 148 308 -75 -57 -127 301 -97 263 194 -85 -57 -41 175 61 -63 -23 -124 -38 10 -41 94 -33 -434 -237
6345 -237 -6 220 -209 -42 -265 -189 -345 -51 -49 -228 99 -275 -321 -175 -109 27 -288 -455 -266 270 -316 1
6367 1 -241 -276 -185 -53 -42 -220 5 -72 -238 -38 142 -254 -164 -90 -213 -172 37 143 -357 19 65 -247 74
6390 74 -159 -362 209 75 -259 -259 204 111 -104 47 2 58 -89 44 -169 17 -158 113 -3 -131 87 122
6412 122 168 414 236 -47 65 82 10 -149 -266 48 368 104 214 -193 218 57 227 237 71 204 259 97
6434 97 71 -109 77 259 69 159 26 -168 -266 284 167 79 234 322 396 10 136 -194 56 10 -12 -121 -206
6457 -206 195 76 -159 102 -240 150 69 -86 25 -23 -209 -84 -362 -216 101 19 84 -301 53 -42 18 16 71
6480 71 56 145 -56 -47 123 14 86 -21 -71 -139 116 0 47 -78 -172 -150 151 -73 39 17 -299 -96 -53 127
6504 127 37 -257 149 -47 30 -72 -314 -163 162 -13 -185 -214 -189 149 -218 175 64 -166 -108 228 124 -309
6526 -309 -41 -208 -106 -93 18 -150 -242 -170 -443 -249 -66 -229 0 -46 -131 -14 15 -233 6 66 -278 -54
6548 -54 96 -56 -150 19 -108 -147 -95 64 -33 -225 148 -398 104 -106 -22 -244 322 99 140 141 -50 152 -213
6571 -213 200 147 -146 38 72 190 185 324 201 270 130 376 23 25 -91 -6 209 63 152 156 271 81 -21 231
6595 231 73 156 211 118 133 -51 178 151 141 48 86 -79 125 -217 111 38 264 -6 141 -100 54 278 411
6618 411 155 -37 -245 197 62 -258 -123 -213 155 42 -69 128 46 286 48 75 162 42 25 -31 -9 -285
6640 -285 -304 -31 38 -231 74 -18 -32 -109 15 -53 -100 -172 -173 38 -136 131 -74 -106 -104 -379 -165 -175 -91 33 -242
6665 -242 92 96 -159 -75 172 -44 70 134 163 88 -150 102 96 -81 69 65 -65 -164 -162 23 -3 -34 -33 -14 -97 -270
6691 -270 80 35 53 114 0 174 -281 -1 90 -94 -48 -160 49 173 22 -181 25 254 142 -187 171 74
6713 74 88 305 -30 68 109 -24 14 -29 -36 -109 15 251 -206 73 157 151 110 84 127 256 -214 190 368 42 97
6738 97 48 -128 90 23 48 135 67 243 -85 252 -105 137 -56 -46 -47 -60 -103 79 173 439 55 408 -85 223
6762 223 247 -2 -345 354 -87 -87 101 -276 -194 101 141 64 -109 230 175 -1 280 -54 -134 -266 241 -6 -35
6785 -35 -204 108 -32 106 242 -128 0 -203 62 -112 -165 -130 -104 -426 -25 -116 -203 -142 -53 5 -52 -31 -176 -114
6809 -114 -396 -252 27 -155 -89 -100 -79 -93 60 -79 -72 -220 -147 -3 -131 -97 -44 -202 -117 -305 84 23 -73 -216
6833 -216 -240 95 150 92 -181 -54 -223 -178 -9 -170 132 -247 91 -1 194 67 64 256 12 31 -57 -62 104 17
6857 17 47 252 155 97 306 79 214 90 192 117 92 8 49 24 132 211 335 112 8 389 -33 57 160 329
6881 329 -52 86 34 -105 -166 95 206 -200 4 13 50 370 352 34 35 73 47 161 -80 -112 -27 274 -327 168
6905 168 133 229 204 266 -116 45 -273 -86 58 305 -28 39 71 -79 -38 -88 -9 -183 -76 172 20 -399 87
6928 87 296 -82 207 -407 67 -137 -12 69 -168 -38 -147 -127 -14 207 -63 32 43 -144 -119 94 -181 312
6950 312 -182 85 -15 -51 -95 35 8 -5 114 -47 -39 35 -75 -95 -141 -100 -353 -401 109 38 -293 81 18 -3 -106
6975 -106 283 43 25 147 -164 -95 -239 -211 238 -104 -23 -292 -67 66 -162 24 187 -151 -230 150 -138 -55
6997 -55 119 19 -38 -43 -64 -150 -296 87 38 41 -141 -19 100 -251 -35 -4 202 -117 -185 382 262 -274 256 206
7021 206 -40 102 -97 30 257 127 -111 32 -51 83 27 -94 90 -25 113 17 -153 -157 81 312 -362 108
7043 108 23 149 255 37 106 195 99 -99 -38 192 -132 71 -57 -89 62 207 95 190 14 96 101 66 27 85
7067 85 70 -173 -444 161 7 27 69 -70 -30 142 -22 131 -44 -191 -127 -252 -76 -260 -304 180 42 28 -230
7090 -230 -111 -99 100 -139 -167 -67 8 -27 -300 400 -238 259 -207 -105 2 17 -120 -56 -196 -271 -1 -336
7112 -336 124 -79 105 -57 49 -244 -429 80 -108 -137 330 -272 -321 -57 -57 -138 260 178 -57 -112 -116 -2 15
7135 15 -119 103 -1 144 136 181 47 140 327 94 -189 167 68 20 33 162 170 -211 76 -29 216 64 134 70
7159 70 125 103 -28 251 185 -174 -66 55 18 235 118 76 -41 -59 -203 -122 -311 160 15 -86 77 87 -5
7182 -5 37 116 -176 -16 12 -60 -36 -12 257 120 147 62 14 -163 -11 129 138 265 -236 -25 124 192 270 156 148 40
7208 40 -158 194 -177 87 -38 54 -72 114 137 297 -74 197 173 21 217 -39 41 33 -100 187 -28 -87 123
7231 123 75 20 -170 -93 -88 245 268 105 -135 -334 54 2 -71 -313 -53 237 46 -155 -299 -76 -7 40 -113
7254 -113 -145 -207 4 -234 -238 -100 -206 64 39 -103 -173 -159 -131 -127 -384 -156 -66 -65 -291 -424 -318 -194 -159 -384 -206
7279 -206 -54 -40 -53 -58 49 -119 -189 -9 48 46 254 97 116 -109 335 292 -61 163 169 136 -21 82 -111 -46 -194
7304 -194 -56 -5 20 123 47 10 18 173 -90 161 30 59 45 -12 40 176 48 31 2 65 158 -42 326 286 -20
7329 -20 -68 -22 110 63 382 -113 -100 36 189 184 -82 -152 132 58 163 221 333 38 133 63 -3 164 -139 33
7353 33 101 64 -65 15 -194 242 115 389 -10 -223 -54 -77 -208 85 224 101 -81 -36 39 -102 -7 217 12
7376 12 221 102 5 -24 -214 44 -28 36 111 -32 -332 73 41 70 39 200 204 -140 -13 333 -364 -66 -65 -77 -222
7401 -222 -170 21 -30 -94 -308 -388 135 -162 -184 18 -309 -100 -427 -2 -237 -341 -9 105 -103 -83 -88 44 -70
7424 -70 -97 -88 -38 -119 87 87 -110 -40 -134 150 236 18 -127 -4 -193 -72 146 79 -193 151 -45 -293 211 -154
7448 -154 -208 -65 -126 81 198 49 -37 118 -37 -46 -177 49 83 -81 85 -92 -30 235 241 -16 33 250 -167
7471 -167 112 222 176 20 167 191 169 178 299 165 218 245 -124 248 228 198 169 97 130 -31 253 402 196 151
7495 151 71 -39 177 -8 294 260 242 215 9 212 -97 -74 5 6 -44 66 -123 -188 118 100 -76 142 -165 87
7519 87 -124 -42 5 -2 -183 -136 127 -143 -194 -183 -75 53 98 28 110 -160 122 -381 -64 86 -210 170 55 124
7543 124 -179 -182 -103 193 -184 -121 57 -329 -150 -230 -136 -16 -20 -218 -68 29 -234 165 -116 -145 -116 140 -60 -24
7567 -24 44 19 -88 -129 96 71 12 258 -124 -41 75 94 274 19 -71 79 -95 130 -143 108 146 221 183 -78
7591 -78 125 -3 23 46 29 -20 81 -98 118 213 -124 37 55 19 240 -239 130 91 52 11 -76 110 106 228 313
7616 313 9 149 -140 116 32 -270 -32 91 87 -1 -80 -243 -38 -77 66 251 150 115 228 -22 176 80 116
7639 116 14 100 151 -42 33 45 -5 53 200 -89 -133 -227 -168 248 -19 -118 -14 -126 220 -101 -162 392 -35 34
7663 34 177 -19 209 -100 261 2 148 371 16 -6 -76 -166 -30 104 40 -106 101 -179 295 77 75 0 -266
7686 -266 -134 144 3 -45 9 -90 196 180 -118 -127 -249 -19 94 -99 -183 116 -132 190 -126 -70 -143 -194 -375
7709 -375 -9 -36 -136 -299 93 -156 -137 -263 -43 -31 87 33 -176 -246 68 -25 -88 127 -186 -195 -164 -60 -234
7732 -234 -209 -186 -22 -118 33 -27 24 51 -47 165 -192 -135 -22 185 112 -75 -27 -1 82 137 91 -253 25 -124 -161
7757 -161 252 66 100 -171 2 -39 129 140 66 78 22 -1 252 6 -62 -103 246 -166 -65 -67 26 90 130 7 48
7782 48 -136 198 241 -112 205 46 153 -123 278 -163 26 129 -50 -220 -152 -65 -159 -246 119 -6 20 48 169
7805 169 -5 -55 30 88 33 104 -36 -77 36 -150 37 90 -98 45 -105 37 -39 269 -352 -30 -179 34 0
7828 0 -93 -127 -54 54 -125 3 -89 -88 -125 187 67 -78 -9 201 57 105 -148 236 -57 17 -147 180 -31 -82
7852 -82 91 -143 71 -47 -67 200 158 6 -109 4 -181 31 -112 -288 -38 19 -47 13 278 -102 -35 -134 120
7875 120 -135 45 -22 59 -75 -123 -47 13 -179 -134 139 -238 141 -133 -34 80 -129 131 -177 37 -269 -134
7897 -134 4 102 33 172 47 -16 -69 -6 115 10 -251 -87 -18 -12 181 42 -149 -30 56 -195 -43 -213 -3
7920 -3 151 101 -53 -149 -61 232 -38 6 -152 153 49 -65 104 4 133 193 -161 14 16 -240 209 55 94
7943 94 -41 144 236 36 147 43 -61 174 166 109 -94 43 -142 91 -194 42 162 -5 11 23 -305 92
7965 92 -43 -31 117 -69 163 -243 -104 -46 -116 -21 -108 -93 237 120 -118 192 -47 -81 -339 43 202 56 -58
7988 -58 -165 -187 -92 126 -156 -81 181 -133 145 92 -240 52 59 -79 65 -147 158 -87 -167 70 186 -213 131
8011 131 -67 -54 131 -86 153 -2 -77 -66 -42 -137 -4 -184 -378 -72 -10 -9 51 12 -56 317 -175 -2 41 -70
8035 -70 -81 57 100 29 212 -53 275 257 -143 7 29 149 142 -38 70 180 -128 206 55 218 -56 68 -74
8058 -74 -35 -118 -122 -87 214 7 105 -128 -105 123 -24 -26 120 -24 -148 -30 87 -35 79 194 -210 54 52 -11
8082 -11 52 200 -47 85 55 153 152 56 374 330 5 53 -60 207 181 237 65 -149 129 197 30 20 132 26
8106 26 233 131 -89 -6 -124 -1 -185 42 300 -87 86 -168 -268 -225 -200 93 163 -66 -4 -55 -134 80 312
8129 312 -163 120 -136 -117 -113 -131 -274 -7 -224 70 44 -71 11 -74 -28 -60 88 0 83 -23 47 50 104 -180 253
8154 253 -6 0 -126 -234 79 -111 137 -184 -418 -155 -182 -60 -32 -193 -5 -2 -71 -107 45 -150 -326 -78 -5
8177 -5 -55 183 -136 77 24 -238 -4 -257 38 -129 -56 194 -225 -49
8191d9
##END NTUPLES=NMR FID
##END=
