##TITLE=1H_SL18-DNR(f6)
 CDCl3, 8 sc, 
 25.08.2021
##JCAMPDX= 6.0         $$ Bruker NMR JCAMP-DX V2.0
##DATA TYPE= NMR FID
##DATA CLASS= NTUPLES
##ORIGIN= UXNMR, Bruker Analytische Messtechnik GmbH
##OWNER= root
$$ XWIN-NMR		Version 3.5
$$ Wed Aug 25 09:03:16 2021 Russian Standard Time (UT+4h)  she@DPX200
##.OBSERVE FREQUENCY= 200.131506
##.OBSERVE NUCLEUS= ^1H
##.DELAY= (6, 6)
##.ACQUISITION MODE= SIMULTANEOUS
##.ACQUISITION SCHEME= undefined
##.AVERAGES= 8
##.DIGITISER RES= 18
##SPECTROMETER/DATA SYSTEM= spect
##.PULSE SEQUENCE= zg30
##.SOLVENT NAME= CDCl3
##.SHIFT REFERENCE= (INTERNAL, CDCl3, 0, 15.7039)
##AUDIT TRAIL= $$ (NUMBER, WHEN, WHO, WHERE, WHAT)
$$ ##TITLE= Audit trail, XWIN-NMR		Version 3.5
$$ ##JCAMPDX= 5.01
$$ ##ORIGIN= Bruker BioSpin GmbH
$$ ##OWNER= she
$$ F:/spectra/data/she/nmr/H-F/1/audita.txt
$$ ##AUDIT TRAIL=  $$ (NUMBER, WHEN, WHO, WHERE, WHAT)
(   1,<2021-08-25 09:01:16.14 +0400>,<she>,<DPX200>,
      <created by zg, POWCHK disabled, PULCHK disabled
       configuration hash MD5:
       00 E9 B6 7A A2 85 ED C7 34 08 36 98 17 FE 4E 26
       data hash MD5: 16K
       7E 36 04 95 AC 0B 34 57 89 95 BE 15 A9 92 6A 32>)
$$ ##END=
$$ 
$$ hash MD5
$$ 55 9E A5 63 E4 63 98 7A A0 71 37 92 12 81 46 7B
##$RELAX= 
##$RELAX= 
##$RELAX= 
##$RELAX= 
##$RELAX= 
##$RELAX= 
$$ Bruker specific parameters
$$ --------------------------
##$DU= <F:/spectra>
##$EXPNO= 1
##$NAME= <H-F>
##$PROCNO= 1
##$TYPE= <nmr>
##$USER= <she>
##$AMP= (0..31)
100 100 100 100 100 100 100 100 100 100 100 100 100 100 100 100 100 100 
100 100 100 100 100 100 100 100 100 100 100 100 100 100 
##$AQSEQ= 0
##$AQ_mod= 1
##$AUNM= <au_zg>
##$AUTOPOS= <>
##$BF1= 200.13
##$BF2= 200.13
##$BF3= 200.13
##$BF4= 200.13
##$BF5= 200.13
##$BF6= 200.13
##$BF7= 200.13
##$BF8= 200.13
##$BYTORDA= 1
##$CFDGTYP= 0
##$CFRGTYP= 5
##$CHEMSTR= <none>
##$CNST= (0..31)
1 1 145 1 1 1 1 1 1 1 1 1 1 1 1 1 1 1 1 1 1 1 1 1 1 1 1 1 1 1 1 1 
##$CPDPRG= <>
##$CPDPRG1= <>
##$CPDPRG2= <>
##$CPDPRG3= <>
##$CPDPRG4= <mlev>
##$CPDPRG5= <mlev>
##$CPDPRG6= <mlev>
##$CPDPRG7= <mlev>
##$CPDPRG8= <mlev>
##$CPDPRGB= <>
##$CPDPRGT= <>
##$D= (0..31)
0 1.2 0 0 0 0 0 0 0 0.06 0 0.03 0 0 0 0 0.0002 0 0 0 0 0 0 0 0 0 0 0 0 
0 0 0 
##$DATE= 1629867675
##$DBL= (0..7)
120 120 120 120 120 120 120 120 
##$DBP= (0..7)
150 150 150 150 150 150 150 150 
##$DBP07= 0
##$DBPNAM0= <>
##$DBPNAM1= <>
##$DBPNAM2= <>
##$DBPNAM3= <>
##$DBPNAM4= <>
##$DBPNAM5= <>
##$DBPNAM6= <>
##$DBPNAM7= <>
##$DBPOAL= (0..7)
0.5 0.5 0.5 0.5 0.5 0.5 0.5 0.5 
##$DBPOFFS= (0..7)
0 0 0 0 0 0 0 0 
##$DE= 6
##$DECBNUC= <off>
##$DECIM= 32
##$DECNUC= <off>
##$DECSTAT= 4
##$DIGMOD= 1
##$DIGTYP= 9
##$DL= (0..7)
0 120 120 120 120 120 120 120 
##$DP= (0..7)
150 150 150 150 150 150 150 150 
##$DP07= 0
##$DPNAME0= <>
##$DPNAME1= <>
##$DPNAME2= <>
##$DPNAME3= <>
##$DPNAME4= <>
##$DPNAME5= <>
##$DPNAME6= <>
##$DPNAME7= <>
##$DPOAL= (0..7)
0.5 0.5 0.5 0.5 0.5 0.5 0.5 0.5 
##$DPOFFS= (0..7)
0 0 0 0 0 0 0 0 
##$DQDMODE= 0
##$DR= 18
##$DS= 0
##$DSLIST= <SSSSSSSSSSSSSSS>
$$ [...]
##$SUBNAM2= <"">
##$SUBNAM3= <"">
##$SUBNAM4= <"">
##$SUBNAM5= <"">
##$SUBNAM6= <"">
##$SUBNAM7= <"">
##$SUBNAM8= <"">
##$SUBNAM9= <"">
##$SW= 20.0188882624521
##$SWIBOX= (0..15)
0 0 2 0 0 0 0 0 0 0 0 0 0 0 0 0 
##$SW_h= 4006.41025641026
##$TD= 16384
##$TD0= 1
##$TE= 0
##$TE2= 300
##$TE3= 300
##$TEG= 300
##$TL= (0..7)
0 120 120 120 120 120 120 120 
##$TP= (0..7)
150 150 150 150 150 150 150 150 
##$TP07= 0
##$TPNAME0= <>
##$TPNAME1= <>
##$TPNAME2= <>
##$TPNAME3= <>
##$TPNAME4= <>
##$TPNAME5= <>
##$TPNAME6= <>
##$TPNAME7= <>
##$TPOAL= (0..7)
0.5 0.5 0.5 0.5 0.5 0.5 0.5 0.5 
##$TPOFFS= (0..7)
0 0 0 0 0 0 0 0 
##$TUNHIN= 0
##$TUNHOUT= 0
##$TUNXOUT= 0
##$USERA1= <user>
##$USERA2= <user>
##$USERA3= <user>
##$USERA4= <user>
##$USERA5= <user>
##$V9= 5
##$VALIST= <valist>
##$VCLIST= <CCCCCCCCCCCCCCC>
##$VD= 0
##$VDLIST= <DDDDDDDDDDDDDDD>
##$VPLIST= <PPPPPPPPPPPPPPP>
##$VTLIST= <TTTTTTTTTTTTTTT>
##$WBST= 1024
##$WBSW= 4
##$XGAIN= (0..3)
0 0 0 0 
##$XL= 0
##$YL= 0
##$YMAX_a= 84497
##$YMIN_a= -170160
##$ZGOPTNS= <>
##$ZL1= 120
##$ZL2= 120
##$ZL3= 120
##$ZL4= 120
##$ABSF1= 10
##$ABSF2= 0
##$ABSG= 5
##$ABSL= 3
##$ALPHA= 0
##$AQORDER= 0
##$ASSFAC= 0
##$ASSFACI= 0
##$ASSFACX= 0
##$ASSWID= 0
##$AUNMP= <proc_1d>
##$AZFE= 0.1
##$AZFW= 0.1
##$BCFW= 1
##$BC_mod= 2
##$BYTORDP= 1
##$COROFFS= 0
##$CY= 11.3945322036743
##$DATMOD= 1
##$DC= 2
##$DFILT= <>
##$DTYPP= 0
##$F1P= 2.36226072786647
##$F2P= -0.459571619588291
##$FCOR= 0.5
##$FTSIZE= 0
##$FT_mod= 4
##$GAMMA= 1
##$GB= 0.15
##$INTBC= 1
##$INTSCL= 1
##$ISEN= 128
##$LB= 0.24
##$LEV0= 0
##$LPBIN= 0
##$MAXI= 10000
##$MC2= 0
##$MEAN= 0
##$ME_mod= 0
##$MI= 1.114404
##$NCOEF= 0
##$NC_proc= 0
##$NLEV= 6
##$NOISF1= 3.799351
##$NOISF2= 2.8
##$NSP= 1
##$NTH_PI= 0
##$NZP= 0
##$OFFSET= 15.70392
##$PC= 1
##$PHC0= -13370.29
##$PHC1= 29.20099
##$PH_mod= 1
##$PKNL= yes
##$PPARMOD= 0
##$PSCAL= 0
##$PSIGN= 0
##$REVERSE= no
##$SF= 200.130013532006
##$SI= 16384
##$SIGF1= 3
##$SIGF2= 2
##$SINO= 400
##$SIOLD= 16384
##$SREGLST= <1H.CDCl3>
##$SSB= 0
##$STSI= 0
##$STSR= 0
##$SW_p= 3612.71676300578
##$SYMM= 0
##$S_DEV= 0
##$TDeff= 0
##$TDoff= 0
##$TI= <>
##$TILT= no
##$TM1= 0
##$TM2= 0
##$TOPLEV= 0
##$USERP1= <user>
##$USERP2= <user>
##$USERP3= <user>
##$USERP4= <user>
##$USERP5= <user>
##$WDW= 1
##$XDIM= 8192
##$YMAX_p= 0
##$YMIN_p= 0
$$ End of Bruker specific parameters
$$ ---------------------------------
##NTUPLES= NMR FID
##VAR_NAME=  TIME,          FID/REAL,        FID/IMAG
##SYMBOL=    X,             R,               I
##VAR_TYPE=  INDEPENDENT,   DEPENDENT,       DEPENDENT
##VAR_FORM=  AFFN,          ASDF,            ASDF
##VAR_DIM=   8192,          8192,            8192
##UNITS=     SECONDS,       ARBITRARY UNITS, ARBITRARY UNITS
##FACTOR=    0.0002496,     1,               1
##FIRST=     0,             0,               0
##LAST=      2.0444736,     0,               0
##MIN=       0,             -170160,         0
##MAX=       2.0444736,     84497,           0
$$ Real data points
##PAGE= N=1
##DATA TABLE= (X++(R..R)), XYDATA
$$ [...]
1784B27j22l09J33J85j09J83j43l18J44J15n9j01L52k40j38J93q7K37l35J36K15
$$ 227 105 -204 -71 114 5 188 45 -273 -129 -14 -73 -174 178 -62 -200 -7 -94 143 -192 -56 159
1805A59Mj54o6Q0j93j74L05N0j26k17M21k7l01K24Q1k92l1J01Q7K17j9L8k31J68
$$ 159 163 9 -57 23 -170 -344 -39 11 -115 -332 89 62 -239 -15 66 -226 -257 -156 -69 148 129 167 -64 104
1829A04j79M0O1j05q5J79J81j72m3K49j56p9J2r5P4Jj4p4N6n9J37J85p4J08j16
$$ 104 -75 -35 26 -79 -164 15 196 24 -19 230 74 -5 7 -88 -14 -13 -27 -101 -45 -104 33 218 144 252 136
1854A36N0k72r4K16Q7J60k76K03k40M2J76r5J02j73L4p1J76p8j90K22j11K2J13
$$ 136 186 -86 -180 36 123 283 7 210 -30 12 188 93 195 22 56 -15 161 83 -107 115 4 26 139
1877A39J41j46j28j21J23J6P9j28R7J04k3k23J18R4q0oJ58j63m7l08k9K28Q0m3
$$ 139 280 134 6 -115 8 24 103 -25 72 176 153 -70 48 142 62 56 214 51 4 -304 -333 -105 -25 -68
1901f8n4K39l1k19k61M85L8k02j40k4N05l90J32k2n4K9K95j83m14J44J73K33r4
$$ -68 -122 117 86 -133 -394 91 129 -73 -213 -237 268 -122 10 -12 -66 -37 258 75 -339 -195 -22 211 117
1924A17k93K08l7M1Nl1J74k57j90L18K4N9o4j19MN1j01J58j50J55k00L05m6L3
$$ 117 -176 32 -5 36 41 10 184 -73 -263 55 79 138 74 -45 -41 10 -91 67 -83 72 -128 177 131 164
1948A64k01R8J65k73K99k40Q0k03lK22j28N3J98p9Q3%k05q5K94l82m5N9L3o0J31
$$ 164 -37 61 226 -47 252 12 92 -111 -114 108 -20 33 231 152 235 235 30 -55 239 -143 -188 -129 -96 -156 -25
1973b5P5J63k08J49m72J55R3k3K76p0r6J36j78k92M23k06K69k85j20JK54k53L33
$$ -25 50 213 5 154 -318 -163 -70 -93 183 113 17 153 -25 -317 106 -100 169 -116 -236 -235 19 -234 99
1996I9q6J43l05J55J5o0l69M62k25J35j14K67L8j79N5l11K00J18K18m74J09j50
$$ 99 13 156 -149 6 21 -39 -408 54 -171 -36 -150 117 155 -24 31 -280 -80 38 256 -218 -109 -259
2018b59J11l13N46k26r1L1L64k59J0L26j09j6l53K35J7j18K41O3k97K71P4l50
$$ -259 -148 -461 85 -141 -232 -201 163 -96 -86 240 131 115 -238 -3 14 -104 137 200 -97 174 248 -102
2040a02P2L7R4R8J2j22n9j57L72k63J37k80P2K77j70j3L66l55r5N2Q0j75L0J54
$$ -102 -30 7 101 199 211 89 30 -127 245 -18 119 -161 -89 188 18 5 371 16 -79 -27 53 -122 -92 62
2064F2j04J27o2q8P4j52m6P6K64o1j83j69K16m2j75J96k27L43%l19j17M49q2J01
$$ 62 -42 85 23 -65 9 -143 -189 -113 151 90 -93 -262 -46 -88 -263 -67 -294 49 49 -270 -387 62 -20 81
2088H1Q4k08j0M2m7K33j58Qo6J21k52J67Q1o8k17J77L1J3K2J27l02K53N8j47J9
$$ 81 165 -43 -53 -11 -58 175 17 25 -41 80 -172 -5 76 8 -209 -32 -1 12 34 161 -141 112 170 23 42
2113D2n2j47L11j94q4L37k83k1J79j85q3K37O4m0L5J49k92N3j6O3k53K97O1O2
$$ 42 -10 -157 154 -40 -124 213 -70 -91 88 -97 -180 57 121 81 116 265 -27 26 10 73 -180 117 178 240
2137B40l79J61j27j01K39K3r1J81k10M0q2O6M4j52L56l20J17Q5J43r7P3m05J54
$$ 240 -139 22 -105 -206 33 56 -35 146 -64 -24 -106 -40 4 -148 208 -112 5 90 233 136 209 -196 -42
2160d2n6J06J54K63k23j39j18j21J80j15J85P0l77K05j29J66q7j92K08q3j8J16
$$ -42 -98 8 162 425 202 63 -55 -176 4 -111 74 144 -233 -28 -157 9 -78 -270 -62 -145 -163 -47
2182d7q7j0J52k7j60RK75q8l12K45o6J31R7Nj7l8J7J94k40K5P4m2l20K16q6M85
$$ -47 -134 -144 8 -19 -179 -170 105 17 -295 -50 -116 15 112 117 100 62 79 273 33 58 132 90 -230 -14 -100 385
2208C85l06l94J87K32k01K57j58K2m8j02R9j54l3O8J19k0jl9K93j01P6J1p2Q2
$$ 385 79 -315 -128 104 -97 160 2 24 -24 -126 -27 -181 -214 -146 -27 -47 -48 -87 206 105 181 192 120 202
2232B02k65K37J48l42p9J0K47m7Kn9j23Rj03L38O6l92O5K16k12K0J22j95K09j34
$$ 202 -63 174 322 -20 -99 -89 158 111 113 54 -69 -60 -163 175 241 -151 -86 130 -82 -62 60 -135 74 -60
2256f0r0L85k7m50K03j09L41k38r3K93m6J02k20j61J98J47k67J64P2j19j0j63
$$ -60 -150 235 208 -242 -39 -148 193 -45 -138 155 109 211 -9 -170 28 175 -92 72 144 25 15 -148
2278a48J45l0k52J54K8J64k50L92j85j61K30R1j4p9j80J46j50j55K42K50j61Q
$$ -148 -3 -33 -285 -131 -103 61 -189 203 18 -143 87 178 164 85 -95 51 -99 -254 -12 238 77 85
2300H5P2o4k87J49k13J75J38j03N8NM1o1J49j83j66J8K7L59n07L39J31j13O2k46
$$ 85 157 93 -194 -45 -258 -83 55 -48 10 15 56 -5 144 -39 -205 -187 -160 199 -308 31 162 49 111 -135
2324a35K90m3l43J05K89l4r4J64k15M5P4pK4m4j41j11R2J37J02k49O6P6kj45Q6
$$ -135 155 112 -231 -126 163 129 35 199 -16 29 103 96 120 76 -65 -176 -84 53 155 -94 -28 48 46 -99 -13
2349a3J24j16O9m5r5O3m4O4j66J41j30J63j49j1j7J94j24K40j64P0o1O4m55L32
$$ -13 111 -5 64 19 -76 -13 -57 7 -159 -18 -148 15 -134 -145 -162 32 -92 148 -16 54 -7 57 -398 -66
2373f6q8L37l19J1k69K71J19N9k0l1r5L69j82j28J55n9J48l96k01O31m08PJ59
$$ -66 -154 183 -136 -125 -394 -123 -4 55 35 4 -91 278 96 -32 123 64 212 -184 -385 246 -162 -155 4
2396DO1k7kJ73j89l5Q4J02O7j48M2K0M5j45j54R8L5j8j53K67l26L68l11J34k10
$$ 4 65 38 36 209 20 -15 69 171 238 90 132 152 197 52 -102 -4 31 13 -140 127 -199 169 -142 -8 -218
2421b18L71l4j33jk7K22m1l58L96M8k64K46l90j72M44O5k40Q0o4L23k01k74K72
$$ -218 153 119 -14 -15 -42 180 139 -219 177 225 -39 207 -183 -355 89 154 -86 -6 -70 253 52 -222 50
2444E0j8L4J4l4j56K8q2j74K52J7J09K16j66k84K40J19k31N5J6J33j17J41k14
$$ 50 32 66 80 46 -110 -82 -164 -338 -86 -69 40 256 90 -194 46 165 -66 -11 5 138 21 162 -52
2467e2M90l81l74M38P6l03J24J54l17K45k05J40r6J14K1N9r7J4j25j05O3K77m12
$$ -52 438 57 -317 121 197 -106 18 172 -145 100 -105 35 -61 53 74 133 36 50 -75 -180 -117 160 -252
2490b52L15J2K5j5l2k63K15R2l61N14j36k50J74k8k63PL56k87O4L67r3j44J13
$$ -252 63 75 100 85 53 -210 5 97 -264 250 114 -136 38 10 -253 -246 110 -177 -113 254 161 17 130
2513A30j85l0K81l53J79j63K64q4O9o5k21K63Jl3k22J93L12l80j60O0L23m5j2
$$ 130 -55 -85 196 -157 22 -141 123 39 108 43 -178 85 86 53 -169 24 336 -44 -204 -144 179 134 122
2536A22%k21o7J4J83k18L26K7n56K30J3R4m8J96j0J6k94j4K55m8K1m0p5Mj08j08
$$ 122 122 -99 -166 -152 31 -187 139 166 -390 -160 -147 -53 -101 95 85 101 -193 -207 48 0 21 -19 -94 -90 -198 -306
2562c06M30l6k28j09J01K39j99L4J29j35R8o7pK00j80K6J20j98L18l93K03J23
$$ -306 124 88 -140 -249 -148 91 -108 -74 55 -80 18 -49 -56 144 -36 -10 110 -88 230 -163 40 163
2584A63l93N5J08L51k94j32L52lj7l7j94J27m1n9j43J78j87qJ14K35J5k11J79
$$ 163 -230 -175 -67 284 -10 -142 210 207 190 153 -41 86 45 -14 -157 21 -166 -174 -60 175 190 -21 158
2607A58N6n6j7k44J65O5j2k17N1j58J26K55P6m17K78J23j03M5l03L13k41k16R2
$$ 158 214 158 141 -103 62 127 115 -102 -51 -209 -83 172 248 -169 109 232 129 174 -129 184 -57 -273 -181
2630a81l8K27J87k88J99Jp2J03j47j7J27M6l74K10L4k19L26k17j04%K55k11J22
$$ -181 -219 8 195 -93 106 107 35 138 -9 -26 101 147 -227 -17 17 -202 124 -93 -197 -197 58 -153 -31
2653c1J15o8J36l24K22J32J15k90R0P6j20k46Q0K67k55J55p0K12k92Q4L2O8q3
$$ -31 84 16 152 -172 50 182 297 7 97 173 53 -193 -113 154 -101 54 -16 196 -96 -12 20 88 5
2676Ej35J19jR8j38K30j21j53J38R0m12J24L55j71Q6j88N1Q3n5J18k24L26q0k59
$$ 5 -130 -11 -12 86 -52 178 57 -96 42 132 -280 -156 199 28 114 -74 -23 60 5 123 -101 225 145 -114
2700a14J03J07J10l02J00q8Q2K2m1J79l63J12j95K09J99l04L05K00k05j94M3q6
$$ -114 -11 96 206 -96 4 -84 -2 20 -21 158 -205 -93 -288 -79 120 -184 121 321 116 -78 -35 -121
2722a21K09j33K30p6l2j48P6Q6j18j16m1M18l55J50J81k35q2R0J51k68J42M58
$$ -121 88 -45 185 109 77 -71 5 91 -27 -143 -184 234 -121 29 210 -25 -107 -17 134 -134 8 466
2744D66o19J77n5N4r2j53K85J45k95O8j8K39k80p2j52J11N4K11r4J81k46L48j24
$$ 466 -153 24 -31 23 -69 -222 63 208 -87 -19 -37 202 -78 -150 -302 -191 -137 74 -20 161 -85 263 139
2767A39p5l8k11L81J9l22J64r7K1P1J44l36K79L6k28N5P1%j30p1j8J20j04K45
$$ 139 64 26 -185 196 215 -107 57 -40 -19 52 196 -140 139 175 -53 2 73 73 -57 -128 -146 -26 -130 115
2791A15k70L82o7n6K08m9k60k84K82J04o2p1L2R7J14j79o1j15N9j15m8k2K72J29
$$ 115 -155 227 160 104 312 263 3 -281 1 105 43 -28 4 101 215 36 -25 -140 -81 -196 -244 -266 6 135
2815A35n6K0l98K4K67J41k72J82N8j13k33L70j17r1lK98p2K07n16J06L8j06j13
$$ 135 79 99 -299 -275 -8 133 -139 43 101 -12 -245 125 8 -83 -86 212 140 347 -169 -63 -25 -131 -244
2838b44J95l5M2k2K39j15j54K01p5q6J56l16J3L66j11r4R6l4k92M62o6r2j5J29
$$ -244 -49 -84 -42 -64 175 60 -94 107 32 -54 102 -214 -201 165 54 -40 56 22 -270 192 126 34 19 148
2862A48J36k12O8k67K90k03P8M0p3K15k93J46p3l48K77J05l9k4L81n58k06L47
$$ 148 284 72 140 -127 163 -40 38 78 5 220 -73 73 0 -348 -71 34 -5 -29 352 -206 -412 -65
2884f5K16k99l4K97ll58J57K4j02k11K57RJ12L7K3k23J4m9L04k83PM15j04Lj52
$$ -65 151 -148 -182 115 112 -246 -89 -65 -167 -378 -121 -112 0 37 60 -163 -149 -198 106 -177 -170 245 141 144 -8
2909hj23N3k17M67k47K27j77Qj73R7j02l1K3J06o0K33j28l4J99m68L13J85j86
$$ -8 -131 -78 -295 172 -75 152 -25 -17 -190 -93 -195 -226 -203 -97 -157 76 -52 -86 113 -355 -42 143 -43
2932d3J17K5R4j74nl5K02m31N21k16j2J49l35J31J58J05k97K9M9jr4J04q7P1M7
$$ -43 74 99 193 19 14 -21 181 -250 271 55 43 192 -143 -12 146 251 -46 -17 32 31 -63 41 -46 25 72
2957G2j70K77J7l85L42k25L27l44J86j41O2k20K01J04N4l33M48j18k0l48L51J71
$$ 72 -98 179 196 -189 153 -72 255 -89 97 -44 18 -202 -1 103 157 -176 272 154 134 -214 137 308
2979C08l97K48J24k35k69K01J22j64L25l73J28j29j9j8K41o9j31L17j04k1k00
$$ 308 -89 159 283 48 -221 -20 102 -62 263 -110 18 -111 -130 -148 93 24 -107 210 106 85 -115
3000a15J64Q3j41j44J64k08j41L21j62M6K9L0K09nK27n26K46l37J12j4K75j16
$$ -115 49 132 -9 -153 11 -197 -338 -17 -179 -133 -104 -74 135 130 357 -169 77 -260 -148 -162 113 -3
3022cJ85k93J25P6q9J45j77r2k72K30M66k12k24J80k0j91j7J17k38M53J46%j5
$$ -3 182 -111 14 90 1 146 -31 -123 -395 -165 301 89 -135 45 25 -166 -183 -66 -304 149 295 295 280
3045B80j85k17L32k27L83m48Q8K4o1J4n4j61K24K31j08r9R3j22L3j72K39N5L7
$$ 280 95 -122 210 -17 366 -82 6 30 -31 -17 -71 -232 -8 223 115 16 109 -13 20 -152 87 142 179
3068A79k69K64j19J41q7Lk61M6R7o7J91k36j07Q7PJ23j51R9o2q7J72K25j58p6
$$ 179 -90 174 55 196 109 112 -149 -103 -6 -73 118 -118 -225 -138 -131 -8 -159 -60 -122 -209 -37 188 30 -46
3092d6LJ4Qk7J20l50K13J01j50K3J69k67L12J25j75J29l35K68j03j30M14k22j04
$$ -46 -43 -29 -21 -48 72 -278 -65 36 -114 -91 78 -189 123 248 73 202 -133 135 32 -98 316 94 -10
3115a0K70j08j65K21l26O9J68j54N9M9P0m12L47j15L5j64L16p4K03k23o9O4j15
$$ -10 260 152 -13 208 -118 -49 119 -35 24 73 143 -269 78 -37 -2 -166 150 76 279 56 -13 51 -64
3138f4L40j30n3n1Q4k30mJ60J77j52j30j58J86n3j60K22J50k19j76L68j36%M15
$$ -64 276 146 93 42 126 -104 -108 52 229 77 -53 -211 -25 -78 -238 -16 134 -85 -261 107 -29 -29 386
3161C86k40K6r3j81j38K55r8J31l05J65n7J94j60j78N27m52J52j71K86l8l1j83
$$ 386 146 172 79 -102 -240 15 -83 48 -257 -92 -149 45 -115 -293 234 -218 -66 -237 49 11 -20 -203
3183b03K73k58K82j03J29o3J49l52K20j08j25J40r1Qk06K39K53k30J08k63L32
$$ -203 70 -188 94 -9 120 57 206 -146 74 -34 -159 -19 -110 -102 -308 -69 184 -46 62 -201 131
3204A31J80k76n8m6P9j13K23m8l24K23j03M1J77j07k38J44J32k19r2K04K11j28
$$ 131 311 35 -23 -69 10 -103 120 72 -252 -29 -132 -91 86 -21 -259 -115 17 -202 -294 -90 121 -7
3226gP0J27j67N9M1j18O0k44p3N85k95K48k46n9L4Q1k4M4l46M2N52m69N8o2K75
$$ -7 63 190 23 82 123 5 65 -179 -252 333 38 286 40 -19 15 96 72 116 -230 -188 364 -105 -47 -109 166
3251A66j01n5j00k07K93O1J40l90M99k30pL5K00q4l40J83k67K15k69j20L34%Q9
$$ 166 65 10 -90 -297 -4 57 197 -193 306 76 69 104 304 220 -120 63 -204 11 -258 -378 -44 -44 45
3274D5p0oo4o7L65j90K1r9Q9o6m9J67l01L29k72K87J26l85K35n04L60n6k8O54
$$ 45 -25 -31 -95 -162 203 13 34 -65 24 -42 -91 76 -225 104 -168 119 245 -140 95 -409 -49 -105 -133 521
3298E21m69j14P2J27j88J15r9pj0K3J49J68l05k3K9J4M1nNJ67n1j57J17j55Q3
$$ 521 52 -62 10 137 -51 64 -35 -42 -52 -29 120 288 -17 -40 -11 3 44 39 44 211 160 3 120 -35 48
3323D8J45K10j17j34k64K15J84j65l02J20J81j79J50k78L77k17M5j6L72l64j73
$$ 48 193 403 286 152 -112 103 287 122 -180 -60 121 -58 92 -186 191 -26 19 3 375 11 -162
3344a62J87k2J38Jr8k52K69k51O8K07N5j19j39l9J3m5j18N19m48J16J00J22j06
$$ -162 25 3 141 142 44 -208 61 -190 -122 85 140 21 -118 -157 -144 -189 -307 212 -236 -120 -20 102 -4
3367dj56M7M5J2o5L58k58R7M9k33K41N9o6J4m8J5l6j5P5l25mJ03J55j89M08p1
$$ -4 -160 -113 -68 -56 -121 237 -21 76 125 -108 133 192 126 140 92 107 71 56 131 -194 -198 -95 60 -129 279 208
3393B08j16q8rP0O8M9qq1k5j6J54Q8j57l86L12r2J7J36p7K0L2q1J82k45J76j73
$$ 208 92 4 -5 65 133 182 174 93 68 52 206 294 137 -249 63 -29 -12 124 47 67 99 18 200 -45 131 -42
3419d2j58p5K62r7P5J50j78Q6Q3l3l67N63k54%r9Q3O8j51L6l1J73k62N6j33K63
$$ -42 -200 -275 -13 -110 -35 115 -63 23 106 73 -294 269 15 15 -84 -1 67 -84 -48 -79 94 -168 -112 -245 18
3444A8j86K06N8j16l7J09j78J23p1j46Q1L5K70l29J49m63M10K39m1k82L33l25
$$ 18 -168 38 96 -20 -57 52 -126 -3 -74 -220 -139 -104 166 -163 -14 -477 -67 172 131 -151 182 -143
3466a43J49j02K5J37j00Lj23J61j04%j4P5J01j4r5P1L32m90r8J80K47l47L1L2
$$ -143 6 -96 -71 66 -34 -31 -154 7 -97 -97 -111 -36 65 51 -44 27 359 -131 -229 -49 198 -149 -118 -86
3490h6Q4q7L76l55O3P4j65K49l18P9Q3k06K32J08l32L58m5K36l61J73k62K54j36
$$ -86 -2 -89 287 -68 -5 69 -96 153 -165 -86 -3 -209 23 131 -201 157 112 348 -13 160 -102 152 16
3513A6k13J73J84K2j82Qj7j7j29K43p0l06M15J55l60J04j65j11L53l7r4o2R4Q8
$$ 16 -197 -24 160 182 0 8 -9 -26 -155 88 18 -288 127 282 -78 26 -139 -250 103 66 -28 -90 4 92
3537I2m30J80J29l15Q8P5K5l5L05Rk63J24J05j74P5j3M4j36J83m2j28J21K11m33
$$ 92 -338 -158 -29 -344 -256 -181 -156 -191 114 123 -140 -16 89 -85 -10 -23 21 -115 68 26 -102 19 230 -203
3561b03L76J2m40N42l71J65o6P7J44l02j09L01m7J31l89K10R8j49k40M13q6j75
$$ -203 173 185 -255 287 -84 81 15 92 236 -66 -175 126 79 210 -179 31 129 -20 -260 153 67 -108
3583a08p6L96k03k01K4K27l49K42K67j18j39K8J91j82K35j10n3l03n4M6J14K12
$$ -108 -184 212 9 -192 -168 59 -290 -48 219 101 -38 -10 181 -1 234 124 71 -232 -286 -240 -126 86
3605H6j4k37J40p0P5K8j50K66j83o2N6J68k19p7J74Rn5j39K14k27K98p9lrl1r3
$$ 86 72 -165 -25 -95 -20 8 -142 124 -59 -121 -65 103 -116 -193 -19 -10 -65 -204 10 -217 81 2 -1 -10 -41 -134
3631a34J1j75R0K83k52J79m3K81m32L31j54J8j46J60K2k71M31m97K88J45l9j66
$$ -134 -123 -298 -208 75 -177 2 -41 240 -192 139 -15 3 -143 17 39 -232 199 -298 -10 135 96 -70
3653g0L45l65M5J65m27J44L05k24q6L50J47m17L9K64k2k15K04k13J33j63l8Q4
$$ -70 275 -90 -45 120 -307 -163 142 -82 -168 182 329 -88 -49 215 193 -22 182 -31 102 -61 -99 -15
3675a5K07p8L3Qj30o2J71k56P4J63l6j91N41l89j49K19j87P7J85k25J78L4j46
$$ -15 192 114 147 155 25 -37 134 -122 -48 115 79 -112 429 40 -109 110 -77 0 185 -40 138 172 26
3698B6j42P5P4O1R7k34K19L6l3j72J81k29M64n35OK07m7k13O5J53J49l27M9L33
$$ 26 -116 -41 33 94 191 -43 176 212 179 7 188 -41 423 -112 -106 101 54 -159 -94 59 208 -119 -70 263
3722B63l72l1J37K6j27n5J3J25j02p9j29K86j0J59J26k12p9k41J24K47j28j03
$$ 263 -109 -140 -3 23 -104 -159 -146 -21 -123 -202 -331 -45 -55 104 230 18 -61 -302 -178 69 -59 -162
3744a62J21N3j22J68l12K39J51K13r3m47K34l5M1r2R5q3J06k03M53r8j14j52m2
$$ -162 -41 12 -110 58 -254 -15 136 349 256 -191 43 8 49 -43 52 -31 75 -128 325 227 113 -39 -81
3767h1J31M3k20j4k74N47r5J70n73K50P7j0L32o0l70J45j85J22K01k29K98j61
$$ -81 50 93 -127 -141 -415 132 37 207 -366 -116 -39 -49 283 223 -147 -2 -187 -65 136 -93 205 44
3789D4J07J4k00r3J69M5k19l4J89r5O5O2m9K85k41j23K18m4k1ml01M01j54k0P1
$$ 44 151 165 -35 -128 41 86 -133 -167 22 -73 -8 54 5 290 49 -74 144 100 79 75 -226 175 21 1 72
3814G2k50J83J0k6j41K73m9j12m4L9J00Q2k90Q5K05J4J0l42NL26j29k50L97m2
$$ 72 -178 5 15 -11 -152 121 72 -40 -84 -45 55 137 -153 -68 137 151 161 -181 -176 150 21 -229 168 126
3838A26j02Nm2K5J47q9J6J7k50K31q1m8K1J34J16k27L30j86j16L2n8kp7J28j30
$$ 126 24 29 -13 12 159 70 86 103 -147 84 3 -45 -24 110 226 -1 329 143 27 59 1 -1 -78 50 -80
3863h0K01j43pJ68k48L75k34o6j42K47J47l55K7mQ8P0j61K39k29J21J62j93l73
$$ -80 121 -22 -29 139 -109 266 32 -34 -176 71 218 -137 -110 -114 -26 44 -117 122 -107 14 176 -17 -390
3886c90M72M1J20k45j20J12k10L78l09k0L24L0n4j47j43j2J60J11n0k52K03%J08
$$ -390 82 123 243 -2 -122 -10 -220 158 -151 -171 153 183 129 -18 -161 -173 -13 98 48 -204 -1 -1 107
3909A07k66j24K20L00j03J03k71K46j18k99k5J91J39j24K49l16j16K18M2p5K81
$$ 107 -159 -283 -63 237 134 237 -34 212 94 -205 -230 -39 100 -24 225 -91 -207 11 53 -22 259
3930B59k4k70L6k1Q4l2j80K25l20R0m0K36j17n2j37J59J06J19m25N35n5l33NL
$$ 259 235 -35 1 -20 64 32 -148 77 -243 -153 -193 43 -74 -126 -263 -104 2 121 -304 231 176 -157 -152 -149
3954a49kK82j82P0J5K8j82MR6k8K02k18J16K1j89K81j55j22J36O4m2j47J68N8
$$ -149 -151 131 -51 19 34 62 -120 -116 -20 -48 154 -64 52 73 -116 165 10 -112 24 88 46 -101 67 125
3978A25j15M0l6N6k72K69r1P6k77J45J20k48K64l21L46m5J1j05M4%K1j07J18K05
$$ 125 10 50 14 70 -202 67 -24 52 -225 -80 40 -208 56 -265 81 36 47 -58 -14 -14 7 -100 18 223
4002B23o9L4o2k75J98q0K66k39O6M1m01M12k45O5J32k64L65l05j23L10j68L37
$$ 223 154 188 126 -149 49 -31 235 -4 62 103 -298 114 -131 -66 66 -198 167 -138 -261 49 -119 218
4024B18K22n97k37K90L09l68k6K14Q5j07R2N9k22J19p0Pk9j8O5k00K09J73j85
$$ 218 440 -157 -394 -104 205 -163 -189 25 110 3 95 154 -68 51 -19 -12 -41 -59 6 -194 15 188 3
4047Cj5J77K5l08J14J52k01q0M3NJ11M3j04J34k07J19K40l83k3J80J16l90K44
$$ 3 -12 165 190 -118 -4 148 -53 -133 -90 -85 26 69 -35 99 -108 11 251 -132 -155 25 141 -249 -5
4070eQ5%l41K36K1N0j38J83j62M8j52l2L53o2p1J04j02j46K7M9J13j66r9L73l59
$$ -5 80 80 -261 -25 -4 46 -92 91 -71 -23 -175 -207 146 84 13 117 15 -131 -104 -55 58 -108 -207 166 -193
4095a93R0J79p8Q6M7J66n99K16L42m21K19L6j37o4k4M06l69Q8m7K18k03K18j56
$$ -193 -103 76 -2 84 131 297 -302 -86 256 -165 54 90 -47 -111 -135 271 -98 -10 -57 161 -42 176 20
4118B0m7Q8j12J2j54J84J10k27J62j44N3L0M7q6P5J93l95N07l49J7R1j8n9j73
$$ 20 -27 61 -51 -39 -193 -9 101 -126 36 -108 -55 -25 22 -64 11 204 -191 316 -33 -16 75 57 -2 -175
4142a75L49n2o8j81N7R1o9j48P1K18l63J62J24j07J6L4J19N1q4J20l6l20J74p3
$$ -175 174 122 54 -127 -70 21 -48 -196 -125 93 -270 -108 16 -91 -75 -41 78 129 45 165 129 -191 -17 -90
4166i0Q1p3J5j07L06l60K96Qj75k6J91l77M99j42k23mJ31K57k14p7Q6P3j70j10
$$ -90 -9 -82 -67 -174 132 -228 68 76 -99 -125 66 -311 188 46 -177 -181 -50 207 -7 -84 2 75 -95 -205
4190b05K05N6j13J81j09J96k91k7J64lk31M29l25J38J04l99K84m4j61Q3L61l24
$$ -205 0 56 -57 124 15 211 -80 -107 57 54 -177 252 -73 65 169 -230 54 10 -151 -68 293 -31
4212c1J98r1R9j70N7m4rJ57j85J11J69j57K0m24O3K07j07J51k13lK57kj42l21
$$ -31 167 76 175 5 62 18 9 166 -19 92 261 104 124 -300 -237 -30 -137 14 -199 -202 55 53 -89 -410
4236d10M02K88m66kK63M4o2j06j45J63k23J49L2Q2l9j12J32p4l8j28M85k86k1
$$ -410 -8 280 -186 -188 75 119 57 -49 -194 -31 -254 -105 -73 9 -30 -142 -10 -84 -122 -250 235 -51 -72
4259g2l3Q9L05j65k15n6L35k24J31r0n8K38k43L29n07J67M4j19M53k44n0j08L00
$$ -72 -105 -16 289 124 -91 -147 188 -36 95 5 -53 185 -58 271 -236 -69 -25 -144 309 65 15 -93 207
4282B07k77J79k03P8K65k20L8j45K63k03NK57k83r4P8j12J12K35k9l11J74QJ51
$$ 207 -70 109 -94 -16 249 29 67 -78 185 -18 -13 244 -39 -133 -55 -167 -55 180 151 -160 14 22 173
4305A73m9j83L90k30j43j6R2K01j14K0l2k56M23k35nN5j49j1J21q8Q6K96k94Q3
$$ 173 124 -59 331 101 -42 -58 34 235 121 141 109 -147 276 41 36 91 -58 -69 52 -36 50 346 52 135
4329A35j16o2L8P5r1L4j0J29M2k37K36j15J73nl16n2K78j32j11J8R2q5J47n0k28
$$ 135 19 -43 -5 70 -21 13 3 132 174 -63 173 58 231 226 -90 -142 136 4 -107 -89 3 -82 65 15 -213
4354b13K05M5J05lj36Q1k40L9J81j05rn4o5J59k75K69j71M09Mk6k30JJ68j70J11
$$ -213 -8 37 142 139 3 84 -156 -117 64 -41 -50 -104 -169 -10 -285 -16 -187 222 226 200 -30 -29 139 -31 80
4379H0ok69L03k40K1O0lJ00p3n0L18j52j63K93l00J49N8j94K25l51J30J10l4j4
$$ 80 74 -195 108 -132 -111 -51 -54 46 -27 -77 241 89 -74 219 -81 68 126 -68 157 -194 -64 46 12 -2
4403bK6J24k88L27n6k12J85j76K14r4k48L49k90M3K03J12m74J57J1R4R8j26k6
$$ -2 24 148 -140 187 131 -81 104 -72 142 48 -200 149 -141 -98 105 217 -257 -100 -89 5 103 -23 -49
4426d9J46J0J89m73j36N9K61q1r0L54l27J12j1L11l25Rl1k6L2j95J90J04K03l53
$$ -49 97 107 296 -177 -313 -254 7 -74 -164 190 -137 -25 -36 275 -50 -41 -72 -98 -66 -261 -71 33 236 -117
4450a17j3J18j08M3Pj19J15j32R8QK4J74K9l52R2K66k23K63j87l5M8ML6j08q9
$$ -117 -130 -12 -120 -77 -70 -189 -74 -206 -108 -100 -76 98 127 -225 -133 133 -90 173 -14 -49 -1 3 39 -69 -158
4475a58K14k06J05K23j36R0j94k1L5q6K35m2j06J4p6L20l04o6K17j50j20q5N29
$$ -158 56 -150 -45 178 42 132 -62 -83 -48 -134 101 59 -47 -33 -109 211 -93 -159 58 -92 -212 -297 232
4498B32p9k27J71l89Q2L3r8L43j80L1m2J04J55j58O0k37L33K7l54J00R5J70pJ83
$$ 232 153 -74 97 -292 -210 -177 -275 68 -112 -81 -123 -19 136 -22 38 -199 134 161 -193 -93 2 172 165 348
4522C48o36J05L6J54j95L43L4l16J96l4J91j90k67J80k08O4L6J32N6j14J12r1
$$ 348 -288 -183 -147 7 -188 155 189 -127 69 35 226 36 -231 -51 -259 -195 -159 -27 29 -85 27 -64
4544f4j8J07rm7l6R1J05J80l84J79Mk40j32M4K45M8J01k18j5J35j46J35l54L65
$$ -64 -82 25 16 -31 -67 24 129 309 -75 104 108 -132 -264 -220 25 73 174 -44 -59 76 -70 65 -289 76
4568G6n2K8k38K74j54N4J42j76J08K23l69q4L29k63R0J06j88K12m99N02j80J68
$$ 76 24 52 -186 88 -66 -12 130 -46 62 285 -84 -168 161 -102 -12 94 -94 118 -381 121 -59 109
4590A09k83K10K48l76j83J15J54k05M8O3R9J15N1k27K45q7j75J66j16J13k2K0
$$ 109 -174 36 284 -92 -275 -160 -6 -211 -163 -100 -1 114 165 -62 183 96 -79 87 -29 84 62 82
4612H2j39k8J17j46j18K20P5p1r7K88N5k42J93Mk41k66J23J63J37n9k37P5K23
$$ 82 -57 -85 32 -114 -232 -12 63 -8 -105 183 238 -4 189 193 -48 -314 -191 -28 109 50 -187 -112 111
4635A11o5r7NJ40j01oJ58k33mM64l29j5p6J05k3N6J81j36l57K05oJ18j26K9J09
$$ 111 46 -51 -46 94 -7 -13 145 -88 -92 372 43 28 -48 57 34 90 271 135 -222 -17 -23 95 -31 -2 107
4660A07k54M75m78M7RN7m3j50J67K4J84j52L4L6K45m03K51j23j82J48J87j36j55
$$ 107 -147 328 -150 -103 -94 -37 -80 -230 -63 -39 145 -7 27 63 308 -95 156 33 -149 -1 186 50 -105
4683a05J74oJ30k86L58j54j67J92j97p0p3L8j08M00r9J79k46J77p0j0j57o0RL25
$$ -105 69 63 193 -93 265 111 -56 136 -61 -131 -204 -166 -274 126 27 206 -40 137 67 57 -100 -160 -151 174
4707A74K24o63R3K62k22J99Q7l79K48r9j47J77j74J57r4p8M1k4J9mQ7J69k42N02
$$ 174 398 -265 -172 90 -132 67 154 -225 23 -76 -223 -46 -220 -63 -157 -235 -194 -218 -199 -203 -116 53 -189 313
4731C13l87J64P3j21KL54j43k32J04l9j81J66k06M92l25j38K69k79J71J3j41K11
$$ 313 -74 90 163 42 44 398 255 23 127 88 -93 73 -133 359 34 -104 165 -114 57 70 -71 140
4753A40o4q2J4J54j46p4L22j25L6N3j45J28j67M7k28P9l2K55n0k81O0J89pj70
$$ 140 76 -6 8 162 16 -58 264 139 175 228 83 211 44 91 -137 -58 -90 165 115 -166 -106 83 76 -94
4777i4Q1M7J00k47J34j9J0j32L9J14k18P6J42j13J07k09K04r4k2Q1k3K80m40M41
$$ -94 -13 34 134 -113 21 2 12 -120 -81 33 -185 -109 33 -80 27 -182 22 -72 -94 -13 -36 244 -196 245
4801B45k55j3k25K7J01K11n0J50l60l4L12K3l22L66qm6J8k73K31J49k07J2m4N1
$$ 245 -10 -23 -248 -221 -120 91 41 191 -169 -203 109 132 -190 176 168 122 140 -133 98 247 40 52 8 59
4825E9k4l3Q3J9m9k54L66o2q9lK88m24Q5K6J72j95K84Ql74L6j6P8J68M5k81R9
$$ 59 35 2 85 104 55 -199 167 105 16 13 301 -123 -38 -12 160 -35 249 257 -117 -81 -97 -19 149 194 -87 12
4851A2J99k92J55r9Q7P7j74J35r4k68J90R3p3J32MR7j1N0l17J46j75K57k88K71
$$ 12 211 -81 74 -25 62 139 -35 100 6 -262 -72 21 -52 80 84 181 170 220 -97 49 -126 131 -157 114
4875A14k65K24J22j18o4P0k92L65j64l8K80k55K31l14J19j15J22k46J22J19l7
$$ 114 -151 73 195 77 13 83 -209 156 -8 -46 234 -21 210 -104 15 -100 22 -224 -102 17 -20
4896b0k90K83j3O6jOK45j48l61J40L27m03L28k79J6L30l76j0K76k39j2n0J93K26
$$ -20 -310 -27 -40 26 25 31 276 128 -233 -93 234 -169 159 -120 -104 226 -150 -160 116 -123 -135 -185 8 234
4920B34kk46K79j04j89K01l11n7oL28k56M0P1j01O9K6j26J72j30qr9L53m14M66
$$ 234 232 -14 265 161 -28 173 -138 -195 -201 127 -129 -89 -18 -119 -50 -24 -150 22 -108 -116 -215 138 -276 190
4944A90j35kk72J56J37k06r1Q4L27l51K12j26K1k95N14j52q6K17k45J43Qq9j70
$$ 190 55 53 -219 -63 74 -132 -223 -139 188 -163 49 -77 -56 -351 163 11 -75 142 -103 40 48 -41 -211
4967b11K57j24J87j63J40k6O6L3j42L0k5J03j08K24j39j67j5K19Q0l60J89o2M
$$ -211 46 -78 109 -54 86 60 126 159 17 47 22 125 17 241 102 -65 -80 139 219 -141 48 -14 -10
4990a0o1o2Q0K70l13l9J81j32r2J00L03k05o1l0r8j9J0L00k9k40J51Q3k61L8J19
$$ -10 -71 -133 -53 217 -96 -135 46 -86 -178 -78 225 20 -41 -71 -169 -188 -178 122 93 -147 4 87 -174 -136 -17
5015a7j40J10J23p8j11k17L66O7j64j63J69n4q1J32J33k94L34RL3k12Q9j22j3
$$ -17 -157 -47 76 -2 -113 -330 36 103 -61 -224 -55 -109 -190 -58 75 -219 115 124 157 -55 34 -88 -101
5038a01K46k7k18J00J9J68o9k75K11p6J40m9lk63K81j51N1K5nPk62L73j37k02
$$ -101 145 118 -100 0 19 187 118 -157 54 -22 118 69 66 -197 84 -67 -16 9 4 11 -251 122 -15 -217
5062b17L8K70p0K7j34Q7O4q8qK6J30k14Q4k4J96q7K42j57J4j47r6J95j31O6m7
$$ -217 -179 91 21 48 -86 1 65 -23 -31 -5 125 -89 -5 -29 167 80 322 165 179 32 -64 131 0 66 19
5087A9J85j38Q3k20L3J95k62J12k8j43J17Q0J2M8l19L45j85rK65n40L74q0k7K14
$$ 19 204 66 149 -71 -38 157 -105 7 -21 -164 -47 33 45 93 -226 119 -66 -75 190 -350 24 -56 -83 131
5111A31j34N1j6%p0J28k96J16p5n6L48j93rJ53l91M84L8r3j06J66l0p9o5l0r8
$$ 131 -3 48 32 32 -38 90 -206 -90 -165 -221 127 -66 -75 78 -313 171 209 116 10 176 146 67 2 -28 -126
5136a26P8J31j45K9j75K92k07l9K19J25k86N19n22K08j56J44r7j29L2J8J86r3
$$ -126 -48 83 -62 -33 -208 84 -123 -162 57 182 -104 415 -107 101 -55 89 -8 -137 -105 -87 99 6
5158Fn7K41l43M6K0L00j21l0j09M5j02m4K48o9k71M12K7k15L54l25j59q2P3m3
$$ 6 -51 190 -153 -107 -87 213 92 62 -47 -2 -104 -148 100 31 -240 172 199 -16 338 13 -146 -228 -155 -198
5182a98M14k02R4J31j27k11k74L20K97o4j55J15m3k16L88j6m28J26Q1r6N5o1q3
$$ -198 216 14 108 239 112 -99 -373 -53 244 180 25 140 97 -119 269 253 -175 -49 32 -64 -9 -70 -153
5205a53K48P7k70L3K3r5J99l30K40k9K81r3O2k83l9m4L10j94P7j43K20o5o1K77
$$ -153 95 172 -98 -65 -42 -137 62 -268 -28 -57 224 131 193 -90 -129 -173 137 -57 20 -123 97 32 -29 248
5229B48p3k75L16n58L84k42M00Ok38k13k5J61J27j09n4J81k8k74P6K97o9K14k80
$$ 248 175 -100 216 -342 42 -200 200 206 -32 -245 -270 -109 18 -91 -145 36 8 -266 -190 107 38 252 -28
5252b8L4k5R3k53J02NJ23k6N5k2J5j34J18j0m6m7j12K06j19L15k64l0N4j09O1
$$ -28 6 -19 74 -179 -77 -72 51 25 80 58 73 -61 57 47 1 -46 -158 48 -71 244 -20 -50 4 -105 -44
5277d4J08j44J39J89l26J52j87J1K27k48J39r9J32j60N0J96l30K36K03m08L86
$$ -44 64 -80 59 248 -78 74 -113 -102 125 -123 16 -83 49 -111 -61 135 -195 41 244 -164 222
5298B22r8j65K02k86J17jr4J78J5K1o0Q0n8j04K65k05J19j68MK73o42K60L21j79
$$ 222 124 -41 161 -125 -8 -9 -103 75 90 111 51 131 73 -31 234 29 148 -20 -16 257 -385 -125 196 17
5322A7o4P4k21R5L68l22P0j00q1M3O1p4J84J2n6j46p8K64m1j34NL21n17L72K15
$$ 17 -47 27 -194 -99 269 -53 17 -83 -164 -121 -60 -134 50 62 6 -140 -218 46 5 -129 -124 197 -320 52 267
5347B67k42j3L0J25m21M53k44J46l7p3Q5j64M78p21L07n0J2J25K80l56L1J60o7
$$ 267 25 12 42 167 -254 199 -45 101 64 -9 76 -88 390 -331 -24 -74 -62 63 343 -13 18 178 111
5370A11r0O3r8J08l36J46K37j49L2j95l3M5J44J09Q2l25jQ4M85n41M59j62j4l8
$$ 111 21 84 -14 94 -242 -96 141 -8 24 -171 -204 -159 -15 94 176 -149 -150 -66 419 -122 337 175 161 123
5394A23oN4j39J85k4l44R4Q4p7Q2rJ35l29J44K24J98l66N3j51K76l44Q2J23l9
$$ 123 117 171 32 217 193 -151 -57 27 -50 32 23 158 -171 -27 197 395 29 82 -69 207 -137 -55 68 29
5418B9k0R9n35L06J4m8o5K69k62J15R0j47K39r9p3Q2J01m42J31L69k71l3K7K25
$$ 29 9 108 -427 -121 -107 -155 -220 49 -213 -98 -8 -155 84 -15 -88 -6 95 -347 -216 153 -118 -151 -124 101
5442A01K9j53O1J60l21J43J03j06J06Kk46J56m4K99l21j44P5K52k28J18n6p2M7
$$ 101 130 -23 38 198 -123 20 123 17 123 125 -121 35 -9 290 -31 -175 -100 152 -76 42 -14 -86 -39
5465c9j76K80j83M01l17n8O0j13L37k58l2J39J51j56j92J85%J81k10j12n8K27
$$ -39 -215 65 -118 283 -34 -92 -32 -145 192 -66 -98 41 192 36 -156 29 29 210 0 -112 -170 57
5487E7J31o7N8k65N6kJ5J7O7k10L10l19L13m33K82r2R8J64O4l22O2j2l9pO4L8
$$ 57 188 121 179 -86 -30 -32 -17 0 67 -143 167 -152 161 -272 10 -82 16 180 244 -78 -16 -28 -67 -74 -10 28
5513B8K48n01M06j83O5n6m5J50o6k45L3Q5j7J94po3n1N1K4j65j2Q6J7l5P3J82
$$ 28 276 -225 181 -2 63 7 -38 112 46 -199 -166 -81 -98 96 89 26 -25 26 50 -115 -127 -41 -24 -59 14 196
5539A96j04J0O6k70J89p9J61J1k38O2N9q1Rj64L03j58J62K3k2M7j26Q0l69n0M94
$$ 196 92 102 168 -102 87 8 169 180 -58 4 63 -18 -9 -173 130 -28 134 157 135 182 56 136 -233 -283 211
5564B11j9J0j47m5PN2m3j02L2M0K49n46M63L1j31n3K29k12J41k10m6N8m8L0j2
$$ 211 192 202 55 10 17 69 26 -76 -44 -4 245 -301 162 193 62 9 238 26 167 -43 -89 -31 -79 -49 -61
5589f1L90j68n56L52L29k27r5O0J4k34Q3K35k07O6J9p9j4K62o9j43J86p8l0K11
$$ -61 329 161 -395 -43 286 59 -36 24 38 -196 -113 122 -85 -19 0 -79 -93 169 100 -43 143 65 35 246
5613B46k01p0r6K94k39n2K6Pl80L72L46l53p6K30m3k05L75J1k82J30J8q8K78j83
$$ 246 45 -25 -121 173 -66 -118 -92 -85 -465 -93 253 -100 -176 54 11 -194 181 192 -90 40 58 -30 248 65
5637F5l85K33j45K38M5j52L0oL64l54ONJ03J38k81j98J79J07j15J75j01J10Q4
$$ 65 -320 -87 -232 6 51 -101 -71 -77 287 -67 -61 -56 47 185 -96 -294 -115 -8 -123 52 -49 61 145
5660A45l80K03j17n3j1Q9NJ42Pn3K64m70L21l5j16QL15k38J44k80J23K51j82J1
$$ 145 -235 -32 -149 -202 -213 -124 -119 23 30 -23 241 -229 92 57 -59 -51 264 26 170 -110 13 264 82 93
5684I3r5nj67R9N1j49K44j09N3j27M00l33KJ08j80K01j99l9j70L80j37J10k25
$$ 93 -2 -7 -174 -75 -24 -173 71 -38 15 -112 288 -45 -43 65 -115 86 -113 -152 -322 58 -79 31 -194
5707a94J89L0k9k74L11J68k48J96J1j90L97n17m7K38K46k36L6k15k23M83j08J24
$$ -194 -5 25 -4 -278 33 201 -47 149 160 -30 367 -150 -197 41 287 51 87 -128 -351 132 24 148
5729A48K1l44n0L11j53l2M9J15K14l34P1K4j01K00k19L6m0j83M30j20J9l43M32
$$ 148 169 -175 -225 86 -67 -99 -50 65 279 -55 16 40 -61 139 -80 -44 -84 -267 163 43 62 -281 151
5752A51k62J47K1j38m6K67j56J9j95J53k06M60k05J11N3j41r7p4L02r7j4R0j50
$$ 151 -111 36 57 -81 -127 140 -16 3 -192 -39 -245 215 10 121 174 33 -64 -138 164 67 53 143 -7
5775gr4M4K81j62j01L93j25k93O3j71P1r1p9K49q0K0L0K9J58j88K34k65q6P6M8
$$ -7 -101 -57 224 62 -39 354 229 -64 -1 -172 -101 -192 -271 -22 -102 -82 -52 -23 135 -53 181 -84 -170 -94 -46
5800d6K03o8j24j26K64k5L35l54k71K02k82M10j21K19O9o00L00R8J00j54o1j58
$$ -46 157 89 -35 -161 103 78 413 59 -212 -10 -292 118 -3 216 285 -315 -15 83 183 29 -32 -190
5822a90oJ85K61j87k01K97n5k05Q6J72k54NJ38n3j91K06j45K38k52J56k7J26k80
$$ -190 -196 -11 250 63 -138 159 104 -101 -15 157 -97 -92 46 -7 -198 8 -137 101 -151 5 -22 104 -176
5845a76K75j54p8R1O7J36j55j2R9P4k89Q5L55Ol88mK77j74K11l43m4J36J55J41
$$ -176 99 -55 -133 -42 25 161 6 -6 93 167 -122 -37 318 324 -64 -68 209 35 246 -97 -141 -5 150 291
5869B91n60M37l79L90j20l5K72k72j5J43j39k20N9p3L32m6j3j84K01L9j45q0L16
$$ 291 -269 168 -211 179 59 24 296 24 9 152 13 -207 -148 -221 111 65 52 -132 69 108 -37 -117 199
5892A99j40j88K19NO5J22l12j10P6l2J93j82J71N3k46K57j35J7r0J64j22K20k32
$$ 199 59 -129 90 95 160 282 -30 -140 -64 -96 97 -85 86 139 -107 150 15 32 -58 106 -16 204 -28
5915b8k23L38j66R4J45k45Q4j0K06j13l39J75j09J74j38J58J68j39j57PJ32j21
$$ -28 -251 87 -79 15 160 -85 -1 -11 195 82 -257 -82 -191 -17 -155 3 171 32 -125 -118 14 -107
5937a07J14J46j39k2K08l27m7j34K80j03R7k24K59O7o1R8k07J27Ml06J86K82m25
$$ -107 7 153 14 -8 200 -127 -174 -308 -28 -131 -34 -258 1 68 7 105 -102 25 29 -277 -91 191 -234
5960b34M4p6%L23j53R6J04k16J51j93o5K12R2j84K05j31Q5J68m1J0m56L57p9Q3
$$ -234 -190 -266 -266 57 -96 0 104 -112 39 -154 -219 -7 85 -99 106 -25 60 228 187 197 -259 98 19 102
5984A02On2N5J95k80J48j22r2P3j90L17k45O6kJ04j45L65k61k81J42R3J33q2J95
$$ 102 108 56 111 306 26 174 52 -40 33 -157 160 -85 -19 -21 83 -62 303 42 -239 -97 -4 129 47 242
6008B42j42j12J35j06j92J50P0m4J29j1l6J00l27j7L13k41R1J52j1m2p1p3J50
$$ 242 100 -12 123 17 -175 -25 45 1 130 119 83 183 -144 -161 152 -89 2 154 143 101 30 -43 107
6031A07M0n3j10j63J45j98n2J75M93k63k63J87M3J80k94K26k93j68R5j63N70j78
$$ 107 147 94 -16 -179 -34 -232 -284 -109 384 121 -142 45 88 268 -26 200 -93 -261 -166 -329 241 63
6053F3j50J12k98K14Q6K2o0LR5R1m29L61j04j3j55qJ56K64k88M48o19M6L57j37
$$ 63 -87 25 -273 -59 27 49 -11 -8 87 178 -251 110 6 -7 -162 -170 -14 250 -38 410 -209 -163 194 57
6077E7k10J26J43k47J33R8o0j81J94m2k35J48K72o4l2M1l87n2M12l11K30n2j35
$$ 57 -153 -27 116 -131 2 100 40 -141 53 11 -224 -76 196 132 100 141 -246 -298 114 -197 33 -19 -154
6100a54K92l82M13m50L75p4r0j34L16j04J3J2o2R3k48L66k83K52k51J45p1j73
$$ -154 138 -244 169 -281 94 20 -70 -204 112 8 21 33 -29 64 -184 182 -101 151 -100 45 -26 -199
6122a99Q1K35O1j32j10P0P8j78%J60rk53K46P8l86L70k22J98j85J48p0R3m17K37
$$ -199 -118 117 178 46 -64 6 84 -94 -94 66 57 -196 50 128 -258 112 -110 88 -97 51 -19 74 -343 -106
6146a06R1m1J28l28J97r5M96j18j72j3k42L36M9l99L52j25j32K46j30J57k67M3
$$ -106 -15 -56 72 -256 -59 -154 342 224 52 39 -203 133 182 -217 135 10 -122 124 -6 151 -116 -73
6168g3J95r0N6l2j53l6J38k45K48o2n8N3K51k24o8R8L5j86L59l31K06r9j38j14
$$ -73 122 32 88 56 -97 -133 5 -240 8 -54 -112 -59 192 -32 -100 -2 33 -153 206 -125 81 -18 -156 -270
6192b70N06l30O6P0P3p3N5j1l39M3J36j59L03j07r0R9J27j96L7j0J55J40j42j61
$$ -270 236 -94 -28 42 115 42 97 86 -253 -210 -74 -233 70 -37 -127 -28 99 -97 -60 -70 85 225 83 -78
6216g8L0O7j90M44k36n2n3r5K77J97m15K41m60P13n11o2J68J9J21j97K08n6j86
$$ -78 -48 19 -171 273 37 -15 -68 -163 114 311 -104 137 -323 390 -121 -183 -15 4 125 -72 136 80 -106
6239a06K88n67L87P0j23l4K28j42R0L2j17R2j04K29l30L09m67J92m7K90l57K33
$$ -106 182 -385 2 72 -51 -85 143 1 91 123 6 98 -6 223 -107 202 -265 -73 -120 170 -187 46
6261D6l4Q2K27k59j29L1n6q0J30KK40k29o5O6J17l59K99j16J9O5N1n5j8o0K5Q6
$$ 46 12 94 321 62 -67 -36 -92 -172 -42 -40 200 -29 -94 -28 89 -270 29 -87 -68 -3 48 -7 -25 -85 -60 26
6287B6j79O7Q4o5L52l4j40k57J16L6Kj3r2j57J93K09j14L47m02J88m8k2j12K24
$$ 26 -153 -86 -2 -67 285 251 111 -146 -30 6 8 -5 -97 -254 -61 148 34 381 -21 167 119 97 -15 209
6311B09j48k27K9K68K8k65k98M99k55J44R3l70L13j59J76j5J05p0j48J13r3j49
$$ 209 61 -166 -137 131 159 -106 -404 95 -160 -16 77 -293 20 -139 37 22 127 57 -91 22 -71 -220
6333b20K67o4j67J35R5p3K30j53k09J40l2j34J42J66j03k77J24Q2K19k39K69j77
$$ -220 47 -17 -184 -49 46 -27 203 50 -159 -19 -51 -185 -43 123 20 -257 -133 -51 168 -71 198 21
6355B1N8j88K58j91PO2k0QPJ17O3kk99R1J31J46m09J73j64O4n5K81l76K90j33
$$ 21 79 -109 149 -42 -35 27 7 15 22 139 202 200 -99 -8 123 269 -140 33 -131 -67 -122 159 -217 73 -60
6380f0p1NK26j94J74k34K70j07k28J98J18J73j90j48O1q4J04jk99K34J51o3j62
$$ -60 -131 -126 100 -94 80 -154 116 9 -219 -21 97 270 80 -68 -7 -91 13 12 -287 -53 98 35 -127
6403a27K33j79M2N8K9j31Q9k13K49J53k01m8k14L96m1k9l05L46k90J82k56L33
$$ -127 106 -73 -31 27 56 -75 14 -199 50 203 2 -46 -260 136 95 66 -239 107 -183 -1 -257 76
6425G6k57L37j74K99o5j20k40Q6k14K05j19m0k8L83k88n5K80j47K77k50J55j4
$$ 76 -181 156 -18 281 216 96 -144 -58 -272 -67 -186 -226 -254 129 -159 -214 66 -81 196 -54 101 87
6447H7j13Pk12J87j8R2N4O%q2J08k78P6n6L81l83K24j24K12j86j06O5j62M3J46
$$ 87 -26 -19 -231 -44 -62 30 84 90 90 8 116 -162 -86 -142 239 -144 80 -44 168 -18 -124 -59 -221 -178 -32
6472c2l42M44Mr4K27j2k17j10P3J00j01K38l9l86J50j28K55OM3j26P5k46L84R7
$$ -32 -374 70 74 -20 207 195 -22 -132 -59 41 -60 178 139 -247 -97 -225 30 36 79 -47 28 -218 166 263
6496B63l45j58M22l14K18J60j88K29l55L7%j01q0K56q8n8K94p1K0j18J87j7P4
$$ 263 -82 -240 182 -132 86 246 58 287 -68 -31 -31 -132 -212 44 -44 -102 192 121 141 23 210 193 267
6519B67k69j38r6K29K5q4k19L22J73l22K05n5r6K2J40L1j36J02L4j10J39l91J09
$$ 267 -2 -140 -236 -7 18 -66 -285 37 210 -112 93 38 -58 -36 104 135 -1 101 135 25 164 -227 -118
6542a18j19L09k8j42n1j6K52O4l67K98J2j36K83m03K56k17P3j02J32jK5k55J47
$$ -118 -237 72 44 -98 -149 -165 87 151 -216 82 94 -42 241 -162 94 -123 -50 -152 -20 -21 4 -251 -104
6565a04N0N3j85K31m0K38j50k39K00P4j24J68j78j63J49l55M57k67K15k69L43
$$ -104 -54 -1 -186 45 5 243 93 -146 54 128 4 172 -6 -169 -20 -375 82 -185 30 -239 104
6586A04j08M1qJ0k05J83R5k48J69m4R6k93J92j32r9M45K4n1j50J33j52J06R8k24
$$ 104 -4 37 29 39 -166 17 112 -136 33 -11 85 -208 -16 -148 -247 198 222 171 21 154 2 108 206 -18
6610a8M3j05j6K2J27j45k2J75j15P3o8K18l1j87K36l08K69J02m60L12k01R7J11
$$ -18 25 -80 -96 -74 53 -92 -114 61 -54 19 -49 169 138 -49 187 -121 148 250 -210 102 -99 -2 109
6633A09j67q8K17j12j28J40J53Pl5J0j5J8j01o6M2O3j8k13J28P3pk40O57l69N2
$$ 109 -58 -146 71 -41 -169 -29 124 131 96 106 91 109 8 -58 -16 47 29 -184 -56 17 10 -230 427 58 110
6658A10L1l91K06q9J32kl05M13J61m69J17J3K46l5L2k15MK3r2jq2K10k5N5J48
$$ 110 141 -250 -44 -133 -1 -3 -308 105 266 -203 -86 -73 173 138 170 -45 -41 -18 -110 -111 -193 17 -8 47 195
6683A95j36J02l06l4J0J20J31qm6J69j84p2M9K95j10j49o1Qk29K81j47L72l34
$$ 195 59 161 -145 -179 -169 -49 82 74 28 197 13 -59 -10 285 175 26 -35 -27 -256 25 -122 250 -84
6706h4R9J36k43J73Q4j09K09l09OO6k1L7O0r5J55k70Q0o1J79j29j0j99K63q5K77
$$ -84 15 151 -92 81 165 56 265 -44 -38 28 7 44 104 9 164 -106 -26 -87 92 -37 -47 -246 17 -68 209
6731B09N4j72J01j69j0j27J55L7j3R6p7K8j95K15P0j31J59j96P4k52L80k42k3
$$ 209 263 91 192 23 13 -114 41 78 65 161 84 112 -83 132 202 71 230 34 108 -144 236 -6 -29
6754b9J4N9m2k57K4J08q6j17N26l37J00J75j01K0K47l28K42j52k00K12j25J28
$$ -29 -15 44 2 -255 -231 -123 -209 -326 200 -137 -37 138 37 57 304 -24 218 66 -134 78 -47 81
6776H1j04k41J21N4j00J21J71k55K00J63l78l5K73j32J16J2o3J2k11J08k19J03
$$ 81 -23 -264 -143 -89 -189 -68 103 -152 48 211 -167 -202 71 -61 55 67 4 16 -195 -87 -306 -203
6798b03M7J11j41J72M7K12Jk22O7p8l0r6K27L0k93R5M6L9k57K23p7j47M95k88
$$ -203 -156 -45 -186 -14 33 245 246 24 91 13 -17 -113 114 144 -149 -54 -8 31 -226 -3 -80 -227 268 -20
6822b0K22j31j15j19P8M9J46K1m60J56J88j01M0p2J71q1J19k98j29J80L63J04
$$ -20 202 71 -44 -163 -85 -36 110 131 -329 -173 15 -86 -46 -118 53 -28 91 -207 -336 -156 207 311
6844C11l04j22R0o6L3J07K23m75j83L48lK0o9J29j5O7j32J87j38Q0k58L42k98
$$ 311 7 -115 -25 -91 -58 49 272 -203 -386 -38 -41 -21 -90 39 24 91 -41 146 8 88 -170 172 -126
6867a26K72l25j03J74M6M6k29M11j10M5k21J37J4k79R2K94k74J31j11J85M8j21
$$ -126 146 -179 -282 -108 -62 -16 -245 166 56 101 -120 17 31 -248 -156 138 -136 -5 -116 69 117 -4
6889dl5n7J65q5j09K03p9J14l0k32K26p2QJ9R3l74M44j02J6l4k65J33j68K20j38
$$ -4 -39 -96 69 -16 -125 78 -1 113 83 -149 77 5 13 32 125 -249 195 93 109 75 -190 -57 -225 -5 -143
6914a43J97n8J31j81j36J47j8r0K98L7N3j20j66L6L1Rj17O5k8K05l26J99l28K97
$$ -143 54 -4 127 -54 -190 -43 -61 -151 147 184 237 117 -49 -13 18 27 -90 -25 -53 152 -174 25 -303 -6
6938fk3J91q1O5k24jJ39j13J72j19Q5j81k7Oj87M93j21j2j71oN8L1K18k14p3J78
$$ -6 -29 162 81 146 -78 -79 60 -53 119 0 85 -96 -123 -117 -304 189 68 56 -115 -121 -63 -32 186 -28 -101 77
6964G7l82L16K34l72J82k18L22Jj98j07K79k13M9N3n7J48k1q9M3R5k32j1J05L04
$$ 77 -305 11 245 -127 55 -163 159 160 -38 -145 134 -79 -30 23 -34 114 93 4 47 142 -90 -101 4 308
6988C08k27j19J8j45K9J62nL6j05j79J91m7J0R1q8L5K62l03m3J01P3j20P0k38
$$ 308 81 -38 -20 -165 -136 26 21 57 -48 -227 -36 -83 -73 18 -70 -35 227 -76 -119 -18 55 -65 5 -233
7012b33K50k4K8J88j2j87j05k1J28j01j7K99j65P9k8q0L33m04MJ59k99J47j54
$$ -233 17 -7 21 209 197 10 -95 -116 12 -89 -106 193 28 107 79 -1 332 -72 -68 91 -208 -61 -215
7035b15J73k58L22m0j3J90k15L00n69N02m88p0K76Q5j5J6l3j28J44L0k19L11K5
$$ -215 -42 -300 22 -18 -31 159 -56 244 -325 177 -311 -381 -105 -20 -35 -19 -52 -180 -36 -6 -225 86 111
7058A11j79j08p7K6L51k56J18r2J67l61J22J64K23j53L9k4p8K48j15p7j43J95
$$ 111 -68 -176 -253 -227 124 -132 -14 -106 61 -300 -178 -14 209 56 95 71 -7 241 126 49 -94 101
7080A01Q1j08J63n6l67P5Nj55M42n2j45j8j19oM15m73K12j7R2J11Oo6J84J7m15
$$ 101 182 74 237 181 -186 -111 -106 -261 181 129 -16 -34 -153 -159 256 -217 -5 -22 70 181 187 121 305 322 -93
7105i3j3M18j50k78J55rN8k06M7Q0J39J55l15R1j27J48J24k92j49J13j48M40k1
$$ -93 -106 312 162 -116 39 30 88 -118 -71 9 148 303 -12 79 -48 100 224 -68 -217 -104 -252 188 167
7128A67R8m15K9L51p7j94M9J99k04J39K12k94k14M14k43j28J82j16J35j99M9j00
$$ 167 265 -150 -121 230 153 -41 8 207 3 142 354 60 -154 260 17 -111 71 -45 90 -109 -60 -160
7150a60K11J29m02K17j77J6L01m9m0%M1j57K35r7L89o31J12l5K14j69J03R6j36
$$ -160 51 180 -222 -5 -182 -166 135 86 46 46 87 -70 165 68 457 -174 -62 -97 117 -52 51 147 11
7173A1j0N6k01K99j14l8j43J44k21L62j30K49l78J45j95K75P0j96J97k38P2j2
$$ 11 1 57 -144 155 41 3 -140 4 -217 145 15 264 -114 31 -164 111 181 -15 182 -56 16 4
7195Dq9j45L00j1o5l5J47k09K46j70k56K56J12l7m3J58l76M4L25n8M8k20j85K19
$$ 4 -85 -230 70 59 -6 -41 106 -103 143 -27 -283 -27 85 48 5 163 -213 -169 156 98 146 -74 -259 -40
7219d0j16K42n7J21k19J93N9j74p9j19L04K4k92J73p0l56N24j82J12Q6j13j68
$$ -40 -156 86 29 150 -69 124 183 9 -70 -189 115 139 -153 20 -50 -406 118 -64 48 134 21 -147
7241a47K19J2M5j31J59k59k00M39J70j84o4K9J39r7k76J21K64L4l01J14M8k04
$$ -147 72 84 129 -2 157 -102 -302 137 307 123 59 88 227 130 -146 -25 239 273 -28 86 134 -70
7263g0Ok5K03j46K93l67K28k73J95j78K3J7j86L52r5P4n8R6j53k8lk71L61J78
$$ -70 -64 -89 114 -32 261 -106 122 -151 44 -134 -111 -94 -280 72 -23 51 -7 89 -64 -92 -95 -366 -5 173
7287A73n5j65l1K52j11K5O0lj20j64K55j85j5K83l44J91j46J88%j80K65j1j62
$$ 173 118 -47 -78 174 63 88 148 145 25 -139 116 -69 -84 199 -145 46 -100 88 88 -92 173 162 0
7310@j22J70q1j10K12k3l13L21J0Nj76k24M46R9k19J11j63J70L2m22O44n23J81
$$ 0 -122 48 -33 -143 69 46 -267 54 64 69 -107 -331 115 214 -5 106 -57 113 145 -277 367 -156 25
7333B5K2L48K7l63j24J74j01Rl4j42L66k76J31k21J84l9K88m00K68m8J78l3l53
$$ 25 47 395 422 59 -65 109 8 17 -17 -159 207 -69 62 -159 25 -14 274 -126 142 94 272 239 -114
7356a14L5m5m0R4Q9j52n3J49n5O0K00k30j20L42j6K8pj96K10L8k82J66k53JJ37
$$ -114 -79 -124 -164 -70 19 -133 -186 -37 -92 -32 168 -62 -182 160 144 172 165 -31 179 217 -65 101 -152 -151 -14
7381a4m8K18lJ58m34J02L04k71O4l62J91J53k55K29k36N10l13J05J82j94J6N7
$$ -14 -62 156 153 311 -123 -21 283 12 76 -286 -95 58 -197 32 -204 306 -7 98 280 86 102 159
7403A59k24K48J37n8j58m0J97l96K10J4r5j53K32p7L33r1l43j4J05Q5K9O1n8o3
$$ 159 -65 183 320 262 104 64 261 -135 75 89 -6 -159 73 -4 329 238 -105 -119 -14 71 100 161 103 40
7427D0K7j29K30j40j36J58j96J08o0n5O0L1K63n0J17qj81j0K4L8n9J33k76J07
$$ 40 67 -62 168 28 -108 50 -146 -38 -98 -153 -93 -62 201 151 268 260 79 69 93 131 72 205 -71 36
7451C6n1k1J67k06K29k04J17J70K3l0j30k43L32l24r4J9K99l39J95K08Pn0J7k17
$$ 36 -15 -36 131 -75 154 -50 67 237 260 230 100 -143 189 -135 -229 -210 89 -250 -55 153 160 110 127 -90
7475i0L6kJ49k42K70j93n8O4Q9r0k08J32J13j87M01k57L45l54J0n1K15M5N7k18
$$ -90 -54 -56 93 -149 121 -72 -130 -66 23 -67 -275 -143 -30 -217 184 -73 272 -82 -72 -123 92 137 194 -24
7499b4K22k71kM7L97k17L1k97J72o6J8K2m0N6l17L60J01l73J89j7j27o5J58K18
$$ -24 198 -73 -75 -28 369 152 183 -114 58 -8 10 32 -8 48 -269 91 192 -181 8 -9 -136 -201 -43 175
7523A75k28J95l12J88Q0l77Q5N9P5J00J57k59m9M2J84j34j42K53O8P6m55L00l6
$$ 175 -53 142 -170 18 98 -279 -194 -135 -60 40 197 -62 -111 -69 115 -19 -161 92 160 236 -219 81 45
7546D5m0k5N5p6J21q6nP8j20K49k02N5J9k75K94l05L26l56M42k55K49k98j0j31
$$ 45 5 -20 35 -41 80 -6 -11 67 -53 196 -6 49 68 -207 87 -218 108 -248 194 -61 188 -110 -120 -251
7570b51J2L54j80J57m55L22J04j05J24J9p1K26j17k03o0J5J77M9k04N1L3L7M4
$$ -251 -239 115 -65 92 -363 -41 63 -42 82 101 30 256 139 -64 -124 -109 68 117 -87 -36 -3 34 78
7593G8L3k6koj24K17o8l27J44K7J79k2k01L98j62p9k30J5M31k51k00k19K59L30
$$ 78 111 85 83 77 -47 170 102 -225 -81 -54 125 103 -98 300 138 59 -171 -156 275 24 -176 -395 -136 194
7617A94j90J36pm5l27L89r1l03K22q5L60k72O8MJ36j67j37J44M1o6j44J23L1K9
$$ 194 4 140 133 88 -239 150 59 -244 -22 -107 253 -19 49 53 189 22 -115 29 70 4 -140 -17 14 43
7641D3O1k02J29j72M28m50J35r6J50o2K98j63KM2k38RJ81K5o6j45j56J91m1J02
$$ 43 104 -98 31 -141 287 -163 -28 -124 26 -36 262 99 101 143 -95 -86 95 120 54 -91 -247 -56 -97 5
7665EN1j36q0L47j47j20J35nL19j11l57J44k54P0K71j59J68l12K18q7m6K67r3
$$ 5 56 -80 -160 187 40 -80 55 50 369 258 -99 45 -209 -139 132 -27 141 -171 47 -40 -86 181 88
7688H8K45m9k19n3j85K58j00M8o6l9J98k01J33k1m9J81j21L09m45m5J57k25L23
$$ 88 333 284 65 12 -173 85 -15 33 -33 -72 126 -75 58 37 -12 169 48 357 -88 -133 24 -201 122
7711A22p4p8m6J37N1j21r9M1r1J98j5r0j40P6k03K75R3k92L70k73O5J77k62J94
$$ 122 48 -30 -76 61 112 -9 -108 -67 -158 40 25 -65 -205 -129 -332 -57 36 -256 114 -159 -94 83 -179 15
7735A5o7K5l1j51l7l8K64J05K0j71J07l86L55J60k65j5L8j19OJ99j19J58n4j33
$$ 15 -52 -27 -58 -209 -246 -284 -20 85 105 -66 41 -345 10 170 -95 -110 -72 -191 -185 14 -105 53 -1 -134
7759a34K76l82L10J74m15K95k01KJ00J39k24l5PJ68M5J97m66J02L2j81J58qj37
$$ -134 142 -240 70 244 -171 124 -77 -75 25 164 -60 -95 -88 80 125 322 -144 -42 -10 -191 -33 -41 -178
7782a78K02J65k53j78L26j58Mr0JJ02j16J5N2L29k74J80l50J86m7l5j04J09K03
$$ -178 24 189 -64 -242 84 -74 -70 -160 -159 -57 -173 -158 -106 223 -51 129 -221 -35 -82 -117 -221 -112 91
7805I1p1j22L0J42j56J37J11l19J00RJR0l7J38l56L86j41j08L66l08l7l4l68N21
$$ 91 20 -102 -72 70 -86 51 162 -157 -57 -48 -47 43 6 144 -212 174 33 -75 291 -17 -54 -88 -456 65
7829F5J55q4l3r0j0J10k46J43L6j18J00R5L0m46M58k9k05O0J05K6l02j3L88k82
$$ 65 220 136 103 13 3 113 -133 10 46 -72 28 123 153 -293 165 136 -69 -9 96 122 -180 -193 195 -87
7853h7J4K41k21l6J71M0o5K1k07J02J38j3j85R8J03m9M6l62L12o3k47J97n7M02
$$ -87 -73 168 -53 -89 82 122 57 78 -129 -27 111 98 -87 11 114 65 111 -251 61 -2 -249 -52 -109 293
7877B93j27j60J72m34K58k5J67n7Q2m71J58P4J26p3J89mm63M88n7m53L91j95J66
$$ 293 166 6 178 -256 2 -23 144 87 169 -302 -144 -70 56 -17 172 168 -295 193 136 -317 74 -121 45
7900D5M5q6k47K70l08L11P4k31K12j14J41j78J9K37Lj33o0j01J05m7J94m9n2L0
$$ 45 90 4 -243 27 -281 30 104 -127 85 -29 112 -66 -47 190 193 60 0 -101 4 -43 151 102 50 80
7924H0k48P8j40J06k7L85j67n9j19J02k71O9J68P3J11n5n2l38M13j24j45L36j41
$$ 80 -168 -90 -230 -124 -151 234 67 8 -111 -9 -280 -211 -43 30 141 86 34 -304 109 -15 -160 176 35
7947C5j06J62nL7j29Q0n2q2J11Rq1n0J20K0j89K46j35j10K39r9L0Lk00N0J96j39
$$ 35 -71 91 86 123 -6 74 22 -60 51 60 -21 -71 49 69 -120 126 -9 -119 120 21 51 54 -146 -96 100 -39
7973c9J33j72M7J62j04j07J89j53j43K87m0N2j2j47Pk25rR8J25Jj01R3M9j01J65
$$ -39 94 -78 -31 131 27 -80 109 -44 -187 100 60 112 100 -47 -40 -265 -274 -176 -51 -50 -151 -58 -9 -110 55
7998E5r9nQ8N2j06k78J46k7N5J07l4o8J19l8K31m04L5M04k94k52L26j02O1J57
$$ 55 -44 -49 39 91 -15 -293 -147 -174 -119 -12 -46 -114 5 -33 198 -206 -171 233 -61 -313 13 -89 -28 129
8022A29k13J71j18l0R4J0R5j44j43J55O1j31J63o8r4J15l25J44J69J36j43l11
$$ 129 -84 87 -31 -61 33 43 138 -6 -149 6 67 -64 99 31 -63 52 -273 -129 40 176 33 -278
8044b78K19L4o9J19mOo3K41o9n4m33P14k60L4nj77P0r6j32M94k84P5P9l57L25
$$ -278 -59 -25 -94 25 21 27 -36 205 136 82 -351 363 103 137 132 -45 25 -71 -203 291 7 82 161 -196 129
8069A29r2P2j50J00m39M17m8j97m0K08K68k96n0Q5j63Q1J39j19RJ19o3K4J73k56
$$ 129 37 109 -41 59 -380 37 -11 -208 -248 -40 228 -68 -118 -33 -196 -115 24 -95 -86 33 -30 -6 167 -89
8093h9L9J30J66l33K09p6p0NJ8N6j4k4PJ05jJ13j84P2l19L68j87K36k08K5J18
$$ -89 -50 80 246 -87 122 46 -24 -19 -1 55 41 17 24 129 128 241 57 129 -190 178 -9 227 19 44 162
8118A62j78N8k94M62j36K9j24K37l33L9J63j60L5K09q3k80L77k45M0K19l20J49
$$ 162 -16 42 -252 210 74 103 -21 216 -117 -78 85 -75 -40 169 86 -194 183 -62 -22 197 -123 26
8140B6J67l82L4L08k86K24K47j80M6l34L32j93m1j11J65J74r3k1j09j97J71K21
$$ 26 193 -189 -155 153 -133 91 338 158 204 -130 202 9 -32 -143 22 196 103 82 -27 -224 -53 168
8162A68m3J55k65J02j07N8K12l04k53K11L4M4J97l46K29j74o0J75J3K16k5l16
$$ 168 125 280 15 117 10 68 280 -24 -277 -66 -32 12 209 -137 92 -82 -142 33 46 262 237 -79
8184g9K06m11L53l94M47k18N1
$$ -79 127 -284 69 -325 122 -96 -45
8191d5
$$ Imaginary data points
##PAGE= N=2
##DATA TABLE= (X++(I..I)), XYDATA
0@%%%%%%%%%%%%%%%qJ6j6J6j6K4l2L2m0M8n3O1p2Q2r0J04j20J37j55J75j99K23
$$ 0 0 0 0 0 0 0 0 0 0 0 0 0 0 0 0 -8 8 -8 8 -8 16 -16 16 -24 24 -29 32 -40 42 -48 56 -64 73 -82 93 -106 117
37A17k48K78l10L45l84M25m70N19n74O34p00P69q44R32j029J134j251J384j535
$$ 117 -131 147 -163 182 -202 223 -247 272 -302 332 -368 401 -443 489 -540 594 -657 727 -808
56h08J705j898K125k394K719l118L622m283N192o522Q648j2581K2154q5958r8763
$$ -808 897 -1001 1124 -1270 1449 -1669 1953 -2330 2862 -3660 4988 -7593 14561 -71397 -170160
71a70160K23776J8028j20950K9704N5872m9394k130J7616k734P868j2784l0318
$$ -170160 53616 71644 -49306 -19602 36270 -13124 -15254 2362 -372 7496 -5288 -35606
83c5606L5392L0759k5478j4483J3844r360j0346J1222J2023r832j0226P774Q907
$$ -35606 -214 30545 5067 -9416 4428 -4932 -15278 -4056 7967 -1865 -12091 -4317 4590
96D590l928K55n056j3619L632J1452M031J0420j2016l0479J8997L4277k3703j5871
$$ 4590 662 917 -4139 -17758 -14126 -2674 1357 11777 -239 -30718 -11721 22556 -1147 -17018
110a7018K3257q905j6056K6069N102j6471P836j1818j5229M2129J7398n1041q644
$$ -17018 6239 -2666 -18722 7347 12449 -4022 3814 -8004 -23233 18896 36294 -14747 -23391
123b3391L4300r687j1016K5863r38k5596p22J4437Q373o167j6595J999J2543n887
$$ -23391 10909 1222 -9794 16069 15131 -10465 -11187 3250 11623 5456 -11139 -9140 3403 -2484
137b484K132J6814j1321k0646Q604J1299n049m092K717P949O88j1379M540J3151
$$ -2484 -352 16462 5141 -15505 -6901 4398 -651 -4743 -2026 5923 6611 -4768 -228 12923
151A2923j3149j4639J1349J0582K975n71j2908q14J3725p932p031J5420p389j9402
$$ 12923 -226 -14865 -3516 7066 10041 9470 -3438 -4252 9473 1541 -5490 9930 2541 -16861
165a6861J8117J9710j3855j2243J158j712K565M926O75J345o710r075R604J3635
$$ -16861 1256 20966 7111 -5132 -3974 -5686 -3121 1805 2480 3825 -2885 -11960 -2356 11279
179A1279o712j4430l410J0826Q175o492k062O750n842q066J0110N399o466L54
$$ 11279 4567 -9863 -13273 -2447 5728 -764 -2826 3924 -1918 -9984 126 5525 -941 -587
193e87j510k033R800j939q487J1426j1j9066J0503J9637j4938j2369J0086L082
$$ -587 -2097 -4130 5670 3731 -4756 6670 6659 -12407 -1904 17733 2795 -9574 512 3594
207C594m13L636n536k726L630n355L681J2306j0806j4395J2137J1392o016m294
$$ 3594 3181 6817 1281 -1445 2185 -3170 511 12817 2011 -12384 -247 11145 5129 835
221H35m93k650j37L335M702R72p016l052O385J982k522J0j868k386K64K707O902
$$ 835 342 -2308 -2445 890 5592 6564 -452 -3504 2881 4863 2341 2351 483 -1903 -1639 1068 7970
238G970N59j2284k464J0636j207o121M867n78m838L823J678k030L591o363p730
$$ 7970 8529 -3755 -6219 4417 3210 -2911 1956 1378 -3460 363 2041 11 3602 -2761 -10491
253a0491J0676N184j0072P85O994n797l681O239K338l657n644j287J0155M244
$$ -10491 185 5369 -4703 -3918 3076 -2721 -6402 -163 2175 -1482 -7126 -8413 1742 5986
267E986q831k595L483j385K287M733m714n451K057M882L444l371m723M171J356
$$ 5986 -2845 -5440 -1957 -3342 -1055 3678 -1036 -6487 -4430 452 3896 525 -4198 -27 1329
282A329o426K971P548m431m716K048R87L923J488p727j053O866l299k504P941
$$ 1329 -5097 -2126 5422 991 -3725 -1677 -690 3233 4721 -3006 -4059 2807 -492 -2996 4945
297D945m93p884J265M727q6l98k517j771M306l26k621N348K03p620o76P057J966
$$ 4945 4452 -3432 -2167 2560 2474 2076 -441 -2212 2094 1768 -853 4495 4698 -2922 -3598 3459 5425
314E425m608m233L481M759l970j451N366l812o679O545N243m644k677J26j26M030
$$ 5425 817 -3416 65 4824 854 -597 4769 957 -5722 823 6066 1422 -1255 -1129 -1255 2775
330B775n38l982K990n8n419L437M232l323r46l77j696K952J986l845M10J482m673
$$ 2775 2237 -1745 1245 1187 -4232 -795 3437 114 -832 -1209 -2905 47 2033 -1812 -1402 80 -4593
347d593J675N673j976l301J08k27J709J203k054L5k81j667L775L681n087l560
$$ -4593 -2918 2755 779 -2522 -2414 -2641 -932 271 -1783 -1748 -2029 -3696 79 3760 -1327 -4887
363d887L082J506k73p6o2M95m74j642K884K814n009l258M442K358j004J28r54
$$ -4887 -1805 -299 -572 -648 -710 -215 -689 -2331 553 3367 -1642 -4900 -458 1900 896 1024 70
380G0r60O75J5J139J510l079j841L780J917k841N3K48j272J41M64J466K388k510
$$ 70 -890 -215 -200 939 2449 -630 -2471 1309 3226 385 438 686 -586 -445 19 1485 3873 1363
398A363m737L622M165l579j563K209j470n44K829P75j452l229j011N004J481m732
$$ 1363 -3374 248 4413 834 -729 1480 10 -534 2295 3070 1618 -1611 -2622 2382 3863 -869
414h69M10K928l076r61M246n76l239j026J720K828q8m658O60K725k465p86L583
$$ -869 -459 2469 -607 -1568 2678 2102 -1137 -2163 -443 2385 2297 -2361 -1701 1024 -1441 -2227 1356
431A356l63k176m98m72K919J251l871j352L845l25j168J593j09j599q75J8K798
$$ 1356 993 -1183 -1681 -2153 766 2017 -1854 -3206 639 314 -854 739 630 -969 -1844 -1826 972
448I72J966l946q55L574j164k309L164N79m042L76K933J628j226k787j09K101
$$ 972 2938 -1008 -1863 1711 547 -1762 1402 1981 -2061 -1685 1248 2876 1650 -1137 -1246 855
464H55j243l78K674r42l576K469L001j310k355j092J316K399j554j358L045m7
$$ 855 -388 -766 1908 966 -2610 -141 2860 1550 -805 -1897 -581 1818 264 -1094 1951 1904
480A904l195N46K456j111J19k39j650J781K087j838p15M90j739Q48L193j232k613
$$ 1904 -1291 -745 1711 600 719 480 -1170 611 2698 860 145 635 -1104 -256 2937 1705 -908
497i08J481R7k36J30j99j63J49j767O35L331r73l803N85K050j84p08K37Q68j308
$$ -908 573 670 434 564 365 202 351 -1416 -781 2550 1577 -2226 -1641 409 225 -483 -246 622 -686
516f86j138K165J197k498j050J584J93L28O88j410n83J142j021N76K009j840k101
$$ -686 -1824 341 1538 -960 -2010 -426 -233 95 783 -627 -1210 -68 -1089 -513 1496 -344 -2445
533b445K664N63j737O22P8j208O22N03o14J919r05l677J874K920k607q37K557
$$ -2445 219 782 -955 -333 -255 -1463 -841 -338 -952 967 62 -3615 -1741 1179 -1428 -2265 292
550B92o53k054J368J899o26j926j590K594K355j599j368R51K79o72L49J154o18
$$ 292 -361 -2415 -1047 852 226 -1700 -3290 -696 1659 60 -1308 -357 -78 -750 -401 753 135
567A35j156L71K190n5j639J80N07p58M83J299p23m26J79o58O71J050j318j328
$$ 135 -1021 -650 1540 1485 -154 26 533 -225 258 1557 834 408 587 -71 600 1650 332 -996
585i96J796j97o20J073N01j153q43n17J697J378k149j220K239N8j548J348L39
$$ -996 800 603 -17 1056 1557 404 -439 -956 741 2119 -30 -1250 989 1047 -501 847 1186
602A186j690m68J770P27o14j881M58K076j283j466K199K62k341P18J310n50n51
$$ 1186 -504 -972 798 1525 911 -970 -512 1564 281 -1185 1014 1276 -1065 -347 963 413 -138
619a38n93o92R87L42p26P25M66k164J67K153n26j034L05rL82Q22r32l27K68k04
$$ -138 -731 -1423 -436 -94 -820 -95 371 -1793 -1626 527 1 -1033 -728 -737 -355 467 -465 -792 -524 -728
639g28j98J044J044j405j125J678P48j399n33J827l4j873R38J834p62j192kj82
$$ -728 -926 118 1162 -243 -1368 310 1058 -341 -874 953 919 -954 -16 1818 1056 -136 -138 -320
657c20J277m1q82P20M1j702J129K042k031j682J734P73q24J113n97j402R32N76
$$ -320 957 916 34 754 795 -907 222 2264 233 -1449 285 1058 234 1347 750 -652 280 856
675H56r56P12J22j563J045J173j361L2Q16p94o25O65L49M21m35j056J33J180l93
$$ 856 -100 612 734 -829 216 1389 28 60 876 82 -543 122 471 892 457 -599 -466 714 321
694C21r89n4R79j43o58M94R48j370j687J913Q40j123k27M61l47q6N11n60M03n24
$$ 321 -668 -722 257 114 -544 -50 898 -472 -2159 -246 594 -529 -756 -295 -642 -728 -217 -777 -374 -898
714h98j54P61P67j213L7Q53r30j42R45O4l22k4o46P62R35q14o31L40K21J48L40
$$ -898 -1052 -291 476 -737 -700 153 -777 -919 26 90 -232 -256 -902 -140 795 -19 -650 -310 -89 59 399
735C99J60l71p30j52J134K43q47m47J066j14p01N66K54n28l70L52R79L87j333
$$ 399 559 188 -542 -694 440 683 -164 -611 455 341 -360 206 460 -68 -438 -86 893 1280 -53
754e3m90J160Qj541J388P67j673P9J126J36n92l10j00L30J61k0K83J94n39p23
$$ -53 -543 617 625 -916 472 1239 -434 -355 771 907 315 5 -95 235 396 376 659 853 314 -409
774d09M40N36M2q53N7O13j69m87L85k08l54j38M50K01N51j272k30N08N58j190
$$ -409 31 567 609 -244 -187 426 257 -230 155 -53 -407 -545 -95 106 657 -615 -845 -337 221 -969
794i69Q89M92j459M6J473j01j268L81K36j8L42l92L03K76r98Q1J120m08j050N97
$$ -969 -80 412 -1047 -1001 472 371 -897 -516 -280 -298 44 -348 -45 231 -767 -686 434 26 -1024 -427
814d27K97P2l78N00Nm48j34L20L77M4l55l24N06j5J0o3m03M37m14L05P58l8q66
$$ -427 -130 -58 -436 64 69 -379 -513 -193 184 228 -127 -451 55 40 50 -13 -416 21 -393 -88 670 632 -234
837b34K2N35O8k60m01L08K75j93l64J368n59j197Q17Q49q40k05O36k20n45K52
$$ -234 -212 323 391 131 -270 38 313 120 -244 1124 565 -632 185 1034 194 -11 625 405 -140 112
857A12N07j8l60m43M07Q41o78m83N75l05o04O14L19J09o87m81N61O96n30n46j89
$$ 112 619 601 241 -202 205 1046 368 -115 460 155 -449 165 484 593 -94 -575 -14 682 152 -394 -583
878e83N37K32l15K21K44m54o28L56P48j10q45M92L79p20K10M39j96m26k39O36
$$ -583 -46 186 -129 92 336 -118 -746 -390 358 248 -597 -105 274 -446 -236 203 7 -419 -658 -22
898b2L88n04l18J93K83k63J8Q46q93j0J93K43n5l82l20J64K68N9M39k3m33l96
$$ -22 366 -138 -456 -263 20 -243 -225 621 -272 -282 -89 154 99 -283 -603 -439 -171 -112 327 304 -129 -525
920e25M98J63J04l08l19J60O44n02M85K19n51k85M33K24l08j76R2M03j61j70J59
$$ -525 -27 136 240 -68 -387 -227 417 -85 400 619 68 -217 216 440 132 -44 48 451 290 120 279
941B79K92l22o24P27O74r84m0P8M68l59r9P1M14o92nO09k18l76k70L63K95l9r8
$$ 279 571 249 -375 352 1026 42 2 80 548 189 90 161 575 -117 -122 487 269 -107 -377 -14 281 242 144
964A44l26K23l12j09N93m4q1k27J22j16L72n51k72K94q2J7M22K79o67m00N04K9
$$ 144 -182 41 -271 -380 213 169 88 -139 -17 -133 239 -312 -584 -290 -372 -355 67 346 -321 -721 -217 -188
986a88j35K34jR4n12m1P49p8q80l9J042k56m4j73J60l33k16N41R3m4m07L24M82
$$ -188 -323 -89 -90 4 -508 -549 200 122 -758 -797 245 -11 -55 -228 -68 -401 -617 -76 17 -27 -434 -110 372
1009C72l67j67K59k61l39P05k6K92J40o58J7O45k74k81k41L58j7K99m67M47M3
$$ 372 5 -162 97 -164 -503 202 176 468 608 -50 -33 612 338 57 -184 174 157 456 -11 436 479
1030D79k86k62M05L16q60M04J35q2j84K68R3l87q4K10J28J0l13K04N6p12M42N58
$$ 479 193 -69 336 652 -208 196 331 249 65 333 426 39 -45 165 293 303 -10 194 250 -462 -20 538
1052E38o80j71L41k21M20l16j82K27p7K2L1J41k40j78L9Q7K8L00p08L90L50m83
$$ 538 -142 -313 28 -193 227 -89 -271 -44 -121 -99 -68 73 -167 -345 -306 -219 -191 109 -599 -209 141 -342
1074c42L05K3k89j33O3L73J38l45l94N17L96o83N1O92m02l20N08L43l04l64K92
$$ -342 -37 -14 -303 -436 -373 0 138 -207 -601 -84 312 -371 -320 372 -30 -350 158 501 197 -167 125
1095A25J3k35Q7K28K59m93j38L90K13j32m77L44O5j21m3K52j11k88L59l78L13
$$ 125 138 -97 -10 218 477 -16 -154 236 449 317 -160 184 249 128 85 337 226 -62 297 -81 232
1116B32j01j35JK58k01N6q2J23K9m32L78K10j78l13L02qQ6m19L95J15k55p5K01
$$ 232 131 -4 -3 255 54 110 28 151 180 -252 126 336 158 -155 147 139 225 -194 201 316 61 -14 187
1139A87O6m80n3L04J46k76M73k90n87L98Nj24M15k00k16K06O6j30j96M9k84L68
$$ 187 253 -227 -280 24 170 -106 367 77 -510 -112 -107 -231 184 -16 -232 -26 40 -90 -286 -237 -521 -153
1161a53K10r9j29n5k35L70K87n72J40M7Q6m9o7L33Mn57L36J52J15m34P0M28m18
$$ -153 57 -42 -171 -226 -461 -91 196 -376 -236 -189 -103 -152 -219 114 118 -439 -103 49 164 -270 -200 228 -190
1184a90k88L36L67k55k18L28N12n32k94N66K7m96kJ5M54k23j29R7N2m63J32N49
$$ -190 -478 -142 225 -30 -248 80 592 60 -234 332 359 -137 -139 -124 330 107 -22 75 127 -336 -204 345
1206C45j46j88K36j98J43p5k34k95N25L80n44K40J43n35J58M77j01m45L2J19J38
$$ 345 199 11 247 49 192 117 -117 -412 113 493 -51 189 332 -203 -45 432 331 -114 -82 37 175
1227A75j29k89J50K72j89n58Q91j27l85J11M48k31n13N24j09l49j0M12r4n8L1
$$ 175 46 -243 -93 179 -10 -568 323 196 -189 -78 370 139 -374 150 41 -308 -318 94 0 -58 -27
1248b7j39K10o3l0l49M35k0o7K55q8m18J62N3r8Oj7j11K48P1j64k59L56Q8m04
$$ -27 -166 44 -19 -49 -398 37 17 -50 205 117 -301 -139 -86 -184 -178 -195 -306 -58 13 -151 -410 -54 34 -370
1272c70M05M14m02n3J9k72N9J54lK40k49j21J99N29o42k48N68j43j53K51K33k80
$$ -370 35 449 47 -6 13 -259 -200 -46 -49 191 -58 -179 20 549 -93 -341 227 84 -69 182 415 135
1294A35J90j48q8J97l48J76j87L81k74M5J27J04n54M71j47K70m87J06K07j37l
$$ 135 325 177 89 286 -62 114 -73 308 34 79 206 310 -244 227 80 350 -137 -31 176 39 36
1315C6j00M7j2L9j89N34k51m03j5N19M0m96K01J1J29k11n5K52K26q09N11K21n13
$$ 36 -64 -17 -29 10 -179 355 104 -299 -314 205 245 -251 -50 -39 90 -121 -176 76 302 -507 4 225 -288
1338b88j70Q49l06n04L24M2m0n8k95J08K62j21k40J93L32j3j12m5J13k75K41L3
$$ -288 -458 391 85 -419 -95 -53 -93 -151 -446 -338 -76 -197 -437 -244 88 75 -37 -82 31 -244 -3 30
1360C0J0k33J32k02N57l09j26M47j68J23j76l21K37J65k77O1J79j13q2J60Q5n02
$$ 30 40 -193 -61 -263 294 -15 -141 306 138 261 85 -236 1 166 -111 -50 129 16 -66 94 179 -323
1382c23K51J91L27l19l25L21j10O5L33l67J2l5k8J16k88J72j69L23n5L9J04k7
$$ -323 -72 119 446 127 -198 123 13 78 411 44 56 21 -7 109 -179 -7 -176 147 92 131 235 208
1404B08k06k74L99J7k99J33k57P3K53O6j9o0o2m30P40k99o1k19L07L3l69O2Q5
$$ 208 2 -272 127 144 -155 -22 -279 -206 47 113 94 34 -28 -458 282 -17 -78 -297 10 43 -326 -264 -179
1427a79q5O0R9j80M63j68m09M33J0j44k84M55j07o1j7P2J61j98N9r3L03l62K85
$$ -179 -264 -204 -105 -285 178 10 -399 34 44 -100 -384 71 -36 -97 -114 -42 119 -79 -20 -113 190 -172 113
1450A13j45L2k4j26O5K78O6l79M9J74p5K18k95L25k35k3Q5J49k98l70O71j34l05
$$ 113 -32 0 -24 -150 -85 193 259 -120 -71 103 28 246 -49 276 41 18 103 252 -46 -416 255 121 -184
1473a84J05J30R6M0J08k70M00l63j73K68k32L24l5j06J5l2J76N6n44K57KL07j91
$$ -184 -79 51 147 187 295 25 425 62 -111 157 -75 249 214 108 123 91 267 323 -221 36 38 345 154
1496A54k83M15k22r6N7J37j37J3l48M25k45K71l36j53N28k02q2q0L86m10O6K01
$$ 154 -129 286 64 -32 25 162 25 38 -310 115 -130 141 -195 -348 180 -22 -104 -184 202 -208 -142 59
1518E9M4K0n00L31kR5m15J54m6q1J58M7L31n10K8K48J38j43l3m4J69p2o6o8K07
$$ 59 103 123 -377 -46 -48 47 -368 -214 -260 -341 -183 -136 195 -315 -287 -39 99 -44 -77 -121 48 -24 -90 -158 49
1543D9r3n5J84k68J34q2L52N0j33P3j40m7R8j28K2R2k22J63J37m3k71L49L04m35
$$ 49 -44 -99 85 -183 -49 -131 221 271 138 211 71 24 122 -6 16 108 -114 49 186 143 -128 221 525 90
1567I0q4j32M14j95j24L03J40j69r6k56K48k14q1J14J98K1J6l87L23p6p0O8J60
$$ 90 6 -126 288 93 -31 272 412 243 147 -109 139 -75 -156 -42 156 177 193 -194 129 53 -17 51 211
1590B11m48M2J77P6p4ML9j37J87j84K07J04j08j15q2j2J41j88kK2K91p7j7J23
$$ 211 -237 -195 -18 58 -16 -12 27 -110 77 -107 100 204 96 -19 -101 -113 28 -160 -162 -140 151 74 57 180
1614A80k50j58n4L10k31K85r5k7Qk79L58J93k47k73L41j2l8j24N19n35j72K62
$$ 180 -70 -228 -282 28 -203 82 -13 -40 -32 -311 47 240 -7 -280 61 49 11 -113 406 -129 -301 -39
1636c9J08j66k6J62k1L01l66K9J16pj1j11J49Kj21J9J66J24k17j53R8K28l58J54
$$ -39 69 -97 -123 39 18 319 -47 -18 98 91 80 -31 118 120 -1 18 184 308 91 -62 36 264 -94 60
1660F0m0K15k69P6P8n4q7R0J82l74J81J6j2p9p3RL25j11k57J27J49k72J68J17
$$ 60 20 235 -34 42 120 66 -21 69 251 -123 58 74 62 -17 -90 -81 244 133 -124 3 152 -120 48 165
1684A65k2l62K74Mj0j31%k3Q0l84L14J13l6N7l51N43k06R7o2o7M4j76L10j17k53
$$ 165 143 -219 55 59 49 -82 -82 -105 -25 -409 -95 18 -18 39 -312 231 25 122 60 -7 37 -139 171 54 -199
1709a99k6J95K14j43j13j57L92j43k49K14K49k52j08r4K81j0l17J45K14j40R4
$$ -199 -225 -30 184 41 -72 -229 163 20 -229 -15 234 -18 -126 -220 61 51 -266 -121 93 -47 47
1730D7p4J28M7o22P0N10j2L4P0j77J81q5K4j47K72o1l74O49l42l63K64M5Q1P8
$$ 47 -27 101 148 -474 -404 106 94 128 198 21 202 117 141 -6 266 205 -169 480 138 -225 39 84 165 243
1754B43q9k49J59O4j42J81k83K38K21q2j93J44J7m60L18L1nk28Q6k63L93p1j04
$$ 243 154 -95 64 128 -14 167 -116 122 343 261 68 212 229 -231 87 118 113 -115 -29 -292 101 30 -74
1777g4o9L75n96M30k71K86m0M3J11k21l8J59k90J15n8J01k93K19K23j77k1R3l03
$$ -74 -143 232 -364 66 -205 81 41 84 195 -26 -64 95 -195 -80 -138 -37 -330 -111 112 -65 -86 7 -296
1800b96K79j42j53K88J2o6J73j25j15R3Q9Oq4k78K85J3k50K54j85K76j91K26j44
$$ -296 -17 -159 -312 -24 -12 -78 95 -30 -145 -52 37 43 -41 -319 -34 -21 -271 -17 -202 74 -117 109 -35
1823c5J34j72k61O92l58j45J95K38o6m16N29j03j81J88j22P7j94K12r8m17K68
$$ -35 99 -73 -334 358 0 -145 50 288 222 -194 335 232 51 239 117 194 0 212 114 -303 -35
1844c5R4P9J34k01k21J71J89kj81j66J22k71N64j97j16J73k67k33N5N5K48N9L02
$$ -35 59 138 272 71 -150 21 210 208 27 -139 -17 -288 276 79 -37 136 -131 -364 -309 -254 -6 53 355
1867C55m56j05L21j70l7R2k84L63j4J76j1l60j47K29K20j16j86J32n2j05J41j8
$$ 355 -101 -206 115 -55 -92 0 -284 79 65 241 230 -130 -277 -48 172 56 -130 2 -50 -155 -14 -32
1889c2j18k90M25O6j19K86k00l01L74K9J02r0mn1J94k44lj76O7l23O89k38p5J36
$$ -32 -150 -440 -15 51 -68 218 18 -283 91 120 222 132 128 77 271 27 24 -152 -85 -408 281 43 -32 104
1913A04p0P9n6M0o4J22j5M4m8n2J05q0j72J39k49J98J4k27L01j0j45k37L40J80
$$ 104 34 113 57 97 33 155 140 184 136 84 189 109 -63 76 -173 25 39 -188 113 103 -42 -279 61 241
1937B41k46J86j97L13R4n14J13k30K38L17l19Ko7p8K45r6k54L36j03P3j22p7k22
$$ 241 -5 181 -16 297 391 -123 -10 -240 -2 315 -4 -2 -69 -147 98 2 -252 84 -19 54 -68 -145 -367
1960c67K76R5K26r3k44j19Q2O5J18k07J0K75O9j17m2p0J69l71J80p3J92k4r7q3
$$ -367 -91 4 230 137 -107 -226 -144 -79 39 -168 -158 117 186 69 27 -43 126 -245 -65 -138 54 30 -67 -150
1984a50K46K2l75J52o9L70l09K29l24Q6Q7K65j13m74L76O2J87m18K92J3k21j68
$$ -150 96 118 -257 -105 -174 196 -113 116 -208 -122 -35 230 117 -357 19 81 268 -150 142 155 -66 -234
2006b34K30k02K3J58r2j60K30q9P2P7J7Q6l18K66j10q6L84J26l65lq0J29j39j02
$$ -234 -4 -206 -183 -25 -117 -277 -47 -136 -64 13 30 116 -202 64 -46 -132 252 378 13 10 -70 59 -80 -182
2030a82M47j73j29J78J2q6J94l06J26Q8k36K9J71k68j90M24k9j90M2J59k53L57
$$ -182 265 92 -37 141 153 67 261 -45 81 169 -67 -38 133 -135 -325 99 70 -120 -78 81 -172 185
2052A85j72M7mj2n7J41o5J03r7q7l7j10L24k69K51k45K62k09J15O5j8k9k83L43
$$ 185 13 60 56 44 -13 128 63 166 69 -18 -55 -165 159 -110 141 -104 158 -51 64 129 111 82 -201 142
2076A42l6j20J55j01j81L10k85L1K84l43nK55j94J8J19l33M22o9J26J03l12O5
$$ 142 106 -14 141 40 -141 169 -116 -85 199 -144 -149 106 -88 -70 49 -284 138 69 195 298 -14 51
2098E1N8P1m4j70L02j64o9k53K31J6l79M24j39j57N32k79l6k08J19R1J47m9K3
$$ 51 109 180 136 -34 268 104 35 -218 13 29 -350 74 -65 -222 310 31 -5 -213 -94 -3 144 95 118
2121A18n8Lj01j6K36J20Rk23j80J51J04m46L42J27k44k4N0l9K65j47j41j07K29
$$ 118 60 63 -38 -54 182 302 311 88 -92 59 163 -283 59 186 -58 -82 -32 -71 194 47 -94 -201 28
2144B8M2k0k29K39m3j66J36Jj46J35q3l56K32J07r4J32j53J16K45k30p7M9J10
$$ 28 70 50 -179 60 17 -149 -13 -12 -158 -23 -106 -462 -230 -123 -217 -85 -238 -122 123 -107 -184 -135 -25
2167b5K9J48P6l06L8kl1K20j48r4J35l1m4K07k67O8K3J36j34j0Nn2L6j57J33o3
$$ -25 4 152 228 -78 -40 -42 -73 147 -1 -95 40 9 -35 172 -95 -27 -4 132 -2 -12 -7 -59 -23 -180 -47 -110
2193a10l1J79J30k48L08r5p3l3k33J85l3R5j23K17k55J83j16M69o59K46K08o0
$$ -110 -141 38 168 -80 228 133 60 27 -206 -21 -54 41 -82 135 -120 63 -53 416 -243 3 211 151
2215A51k67kK41q1P8P8k2l89K53p3J05l76L55k76q1M00O9k1k34J64P1j36k40P2
$$ 151 -116 -118 123 42 120 198 176 -213 40 -33 72 -304 51 -225 -306 94 163 142 -92 72 143 7 -233 -161
2239a61J2J00l6J08l37J09J19K0L42k96p8J20k49L18k07L2K67j93K38k5k25J01
$$ -161 -149 -49 -85 23 -314 -205 -86 -66 276 -20 -98 22 -227 91 -116 -84 183 -10 228 203 -22 79
2261G9O7q2j17J8%q8L18l23M32k45n9K6k00K38j67j67P7J72Q8O0m5J45l58K11
$$ 79 146 64 -53 -35 -35 -123 195 -128 304 59 0 26 -174 64 -103 -270 -193 -21 67 127 82 227 -131 80
2285H0N6p8j32J48j70K79j23J19Q6k13k31N3N7P2J24l19R0R0k52M31k29j7k8O8
$$ 80 136 58 -74 74 -96 183 60 179 265 52 -179 -126 -69 3 127 -192 -102 -12 -264 167 -62 -79 -107 -39
2309c9J97k99J29j13O1K3J51j20J37j06j87N6J37K47k48L1l26L98l14R4Pr2L63
$$ -39 158 -141 -12 -125 -64 -41 110 -10 127 21 -166 -110 27 274 26 57 -269 129 -185 -91 -84 -176 187
2332A87l78J59Lp4K22j47k9N5l7L5k99K52J40k81R0K29q5q0j99L14o1P8k5j09
$$ 187 -191 -32 -29 -103 119 -28 -57 -2 -39 -4 -303 -51 89 -192 -102 127 42 -38 -237 77 16 94 69 -40
2356d0M94m29P0K95l47k11M28k83m2j67J36K84k84J94j66M1j37M95l51P0pL5Q1
$$ -40 454 25 95 390 43 -168 260 -23 -65 -232 -96 188 -96 98 -68 -27 -164 331 -20 50 43 78 159
2379A59j53K00p2J77m62L78k56j38J08K08K8Q6k70J26J4j30%k7q8K08M2J53j65
$$ 159 6 206 134 311 -151 227 -29 -167 -59 149 177 263 -7 119 133 3 3 -24 -112 96 138 291 126
2402A26k06J01j1J8J22L5n60K78l1PqK82k13j7J18k34M47j5j98j89K1J81m6q9
$$ 126 -80 21 10 28 150 185 -375 -97 -128 -121 -129 153 -60 -77 41 -193 254 239 41 -148 -127 54 8 -81
2426h1l1J60Q6j71N9K2j6j78J41j9J47j39R1k57K07M4r0j49K25k72M51j94M1j25
$$ -81 -112 48 134 -37 22 44 28 -150 -9 -28 119 -20 71 -186 21 65 -25 -174 51 -221 230 36 77 -48
2450d8J23Oj59K55l30K03l0J13j99Q6M5k16L02K1j69j20R4K89k16q5kM4j56J64
$$ -48 75 81 -78 177 -153 50 20 133 -66 20 65 -151 151 172 3 -117 -23 266 50 -35 -37 7 -149 15
2474A5J14K26l37j04J27j46J68P9o4L15m51K30Lk00J8j7r0K53L3n1Q7l56j3K70
$$ 15 129 355 18 -86 41 -105 63 142 78 393 -58 172 175 -25 -7 -24 -114 139 172 121 208 -148 -161 109
2498A09O7j36J6J9k84J45j29L74l09J86OK17j83j67K0O2j6j50O0j4K36j43k4L2
$$ 109 176 40 56 75 -209 -64 -193 181 -128 58 64 281 98 -69 -49 13 -3 -153 -93 -107 129 -14 -38 -6
2522fo9J85l05J64Mj9m1J08jJ70k34J55P6j79MJ49m08L22l10J61K48k24J86n04
$$ -6 -75 110 -195 -31 -27 -46 -87 21 20 190 -44 111 187 8 12 161 -247 75 -235 -74 174 -50 136 -368
2546c68O43R4j21j93O6n0j2j9k63J29J10qO1k18L71j00n8n0K13q9j9j79K92n2
$$ -368 275 369 248 55 121 71 59 40 -223 -94 16 8 69 -149 222 122 64 14 227 138 119 -60 232 180
2570A80j16J02j23J94j73j46p9j14L23k6q0J9n5K9j03L48o5k81j54K49K3n8j66
$$ 180 64 166 43 237 64 -82 -161 -275 48 22 -58 -39 -94 -65 -168 180 115 -166 -320 -71 -48 -106 -272
2593b72K38Q6o9p9O9J85j72r7K44k7l02OJ33j90K51j00K29l2P3k33j73K70j05
$$ -272 -34 52 -17 -96 -27 158 -14 -111 133 106 -196 -190 -57 -247 4 -96 133 101 174 -59 -232 38 -67
2616f7R3O1j69J13J79j96K07k56J67J2k33J76k20l7K48k13J57J72j98l12L18M6
$$ -67 26 87 -82 31 210 14 221 -35 132 144 -89 87 -133 -170 78 -135 22 194 -4 -316 2 48
2638D8j37L2J07K2J55k74O6L5J66l14QJ02K10k4j7r9L6k76K53o6j1N0J74k05K9
$$ 48 -89 -57 50 72 227 -47 19 54 220 -94 -86 16 226 202 185 86 122 -154 99 33 22 72 246 41 70
2663G0P9l6j31J16n7q9k09pL08o0J43j43L6k4K2j12k01J55J43p7J20l36K87k75
$$ 70 149 113 -18 98 41 -48 -257 -264 44 -16 127 -16 20 -4 18 -94 -295 -140 3 -74 46 -290 -3 -278
2687b78K60j25Q5j24J72l3Q6j31j14K15K07j73k30L62k44jp5j14L01k77J78J76
$$ -278 -18 -143 -58 -182 -10 -43 43 -88 -202 13 220 47 -183 179 -65 -66 -141 -255 46 -231 -53 123
2709A23j64M5J35J1j16Q0m9k92J53J78qj1k53L14k64q3J88L6j54J64O0J25j25
$$ 123 -41 4 139 150 34 114 65 -227 -74 104 96 85 -168 146 -118 -201 -13 23 -131 33 93 218 93
2732I3K10m98K10N8m3j3k76J39L38J04m2l04j06p4K37J93l77K32k06P1J6m3m1
$$ 93 303 -195 15 73 30 17 -259 -120 218 322 280 -24 -130 -204 33 226 -151 81 -125 -54 -38 -81 -122
2755a22L72j00j79p3K13K27m37K43j38j08L7J53n2J7J26k11J11j69L6J71l79O04
$$ -122 250 150 -29 -102 111 338 -99 144 6 -102 -65 88 36 53 179 -32 79 -90 -54 117 -262 342
2777C42n95L20o4O5j03pK60l37O5J42M7j84o9K00m2pJ3q0K30j59L9l29L79j40
$$ 342 -253 67 3 68 -35 -42 218 -119 -54 88 135 -49 -118 82 40 33 46 -34 196 37 76 -253 126 -14
2801a4J69l16O9L01k69K58m34M2K71j22M50k07k38J48j37j08o1L1K74j00Pj45
$$ -14 155 -161 -92 209 -60 198 -236 -194 77 -45 405 198 -40 108 -29 -137 -198 -167 107 7 14 -131
2823a31J31j39r7L66J25m03M15q7k05j09j11K06jq1J89l6l8R5n5J54l96K36q8
$$ -131 0 -139 -236 130 255 -148 267 180 -25 -134 -245 -39 -40 -121 68 32 -6 89 34 188 -208 28 -60
2846f0K02j5k20J85j23j8L7p0K56k04J01q1j22L07k43O9K6N4k73K25m9J51l70
$$ -60 142 127 -93 92 -31 -49 -12 -82 174 -30 71 -10 -132 175 -68 1 27 81 -192 33 -16 135 -235
2869b35J37L92m97O7Q6J71k43M4O0m8M71k60l82J06L1P4J93k08m8j05J67R6LJ08
$$ -235 -98 294 -203 -136 -50 121 -122 -78 -18 -66 405 145 -237 -131 -100 -26 167 -41 -89 -194 -27 69 72 180
2893A80j46P4O0j84j49L98n25K83K26k26J07k03kN2j68J71JR0K5R3q4k60R9K63
$$ 180 34 108 168 -16 -165 233 -292 -9 217 -9 98 -105 -107 -55 -223 -52 -51 39 64 157 73 -187 -88 175
2917A75k90K86k8j8l12K44j57J05p8R5j58l3R8K64k36J46L4Jk16nJ34j09L38k54
$$ 175 -115 171 143 125 -187 57 -100 5 -73 22 -136 -169 -71 193 -43 103 137 138 -78 -83 51 -58 280 26
2941B6R9P6k14Q7P9j46j76K03q5J54j74k0l8k81M18J20j65J4P0j67J95k70K59
$$ 26 125 201 -13 74 153 7 -169 34 -51 103 -71 -91 -129 -410 8 128 -37 -23 47 -120 75 -195 64
2964F4l05L54k2l92M04J06j84k23J52K52m06J46P7n3N4j24O0n7K4K31j68N6n3
$$ 64 -241 113 91 -301 103 209 25 -198 -46 206 -200 -54 23 -30 24 -100 -40 -97 -73 158 -10 46 -7
2987gK96q2j63M0j73J04k0m6K15k90L07l95K28L0p9J03j4P1J1j71k71J05L03K39
$$ -7 289 207 44 84 -89 15 -5 -51 164 -126 181 -214 14 44 -35 68 54 125 136 -35 -306 -201 102 341
3011C41k11k84L09j95o3K83j45r9Mj13K25m29O44j14j17j17Q3J34K9k16n0L26
$$ 341 130 -154 155 -40 -103 180 35 -64 -60 -173 52 -377 267 153 36 -81 2 136 165 -51 -101 225
3033B25R6m66J41J60j23k02M45l58M3K7p1L43l91K14N4j84m4O7r6J56L5j65R6
$$ 225 321 -145 -4 156 33 -169 276 -82 -39 -12 -83 260 -131 83 137 -47 -91 -24 -120 36 71 -94 2
3056Bj51L65k52m7J68j22L5o1O2J40l30J11j80J60J67j83P3r8P3L5LJ22r2m8j26
$$ 2 -149 216 -36 -83 85 -37 -2 -63 -1 139 -191 -80 -260 -100 67 -116 -43 -141 -68 -33 -30 92 0 -48 -174
3081a74L8J2K30q1j76K11MN5k23K05l43K90J51l43K98k42n0J75rL1m5J70m8j46
$$ -174 -136 -124 106 25 -151 60 64 119 -104 101 -242 48 199 -144 154 -88 -138 37 28 59 14 184 136 -10
3105a0m0j50K89k4p4Q0K1l63L53k55L33j12K75m06r3K57J5j91K84j36k44L9K39
$$ -10 -50 -200 89 65 -9 71 92 -271 82 -173 160 48 323 -83 -176 81 96 -95 189 53 -191 -152 87
3128H7l56K84O0j44J99M9l22J85j29J54j57R6j5j77P9P2k16J60K28m96J50N2J26
$$ 87 -269 15 75 -69 130 179 -143 42 -87 67 -90 6 -9 -186 -107 -35 -251 -91 137 -359 -209 -157 -31
3151c1k40J68J21j03j89L08Q5j42j56J20J29Pj18o6j10M37k98O4J01k99J30o5
$$ -31 -271 -103 18 -85 -274 34 119 -23 -179 -59 70 77 -41 -107 -217 220 -78 -14 87 -212 -82 -147
3173a47K22r3K42j79O5j30J06l97M33j67j49K48k59M02k56q8J55p8R2P6J1K6k00
$$ -147 75 -18 224 45 110 -20 86 -311 122 -45 -194 54 -205 197 -59 -147 8 -70 22 98 109 135 -65
3196f5L04q8J34l90J24l7J03j91l9K42R1j90L3j15K75j79k4J23l5o5n1j39K64
$$ -65 239 151 285 -105 19 -18 85 -106 -145 97 188 -2 31 -84 191 12 -12 111 76 11 -40 -179 85
3219H5j65L7J55k70M35m5l14J38k15J13O3j89K00K12l70L30n09N41k86j72K09
$$ 85 -80 -43 112 -158 277 232 -82 56 -159 -46 17 -172 28 240 -130 200 -309 232 -54 -226 -17
3240a7j5n0J26j8K4p6k9K08l29J16l5J07Jj28K42j14K23l6m47K46r4J05j13qK59
$$ -17 -32 -82 44 26 50 -26 -55 153 -176 -60 -95 12 13 -115 127 13 236 200 -247 -1 -95 10 -103 -111 148
3265A48o9j09O6j7O7j35J15l11L17k66J97N8o2J48N0%k64L7o6J56P4J2j7k5K2
$$ 148 79 -30 36 19 86 -49 66 -245 72 -194 3 61 -1 147 197 197 -67 -30 -96 60 134 146 129 104 126
3290A26q2o3K4j47P6R3J45k92J86j37J02Mk37J12J09j68J05P1J34j87OQ7N0m5
$$ 126 44 -19 5 -142 -66 27 172 -120 66 -71 31 35 -202 -90 19 -149 -44 27 161 -26 -20 67 117 72
3314G2k29K5J55L07m60j80K91J31j08J69j18k23K9J08j67J89j71N1J77j53J52
$$ 72 -157 -132 23 330 -130 -310 -19 112 4 173 55 -168 -139 -31 -198 -9 -180 -129 48 -105 47
3335D7j00Lj76K41m2r2J41J97m48Q0K46j89K05k79k7K78O6l55J79O9n07L55k79
$$ 47 -53 -50 -226 15 -27 -119 22 219 -229 -149 97 -92 113 -166 -193 85 151 -204 -25 44 -463 -108 -387
3358c87L88J43J15j24j74L08m39J43k72K87j35j18J43L10n2k79k5K27k5l95R2
$$ -387 1 144 259 135 -39 269 -170 -27 -299 -12 -147 -265 -122 188 136 -143 -168 59 34 -361 -269
3379b69K70J07k64P8J51j16N2j00M1J00M1R4r5j51J56j54R8o3j6J08o6j01K29
$$ -269 1 108 -156 -78 73 -43 9 -91 -50 50 91 185 90 -61 95 -59 39 -24 -40 68 2 -99 130
3402A30j74o7j7R3K30k26J89j29Q0j80P3R7j55J74m20K47O8j24O7R5r2J39K7m50
$$ 130 -44 -111 -128 -35 195 -31 158 29 109 -71 2 99 -56 118 -302 -55 13 -111 -44 51 -41 98 125 -325
3426c25L93j07k64M18J5m5K07m92n3M12M5k50R7k6r7K83j79l42M14K8j68N7l1
$$ -325 68 -39 -303 115 130 85 292 -200 -253 159 204 -46 51 25 -72 211 32 -310 104 132 -36 21 -10
3449a0J42l02J81Rnn9l2J37N5j29j44p0J59K35j2r8j27L38l08K9K06l68J31j26
$$ -10 132 -170 11 20 15 -44 -76 61 116 -13 -157 -227 -68 167 155 57 -70 268 -40 -11 195 -173 -42 -168
3473a68J33o7K34l75K38J56k23K15l07J31L51l54Q4j20N5K53l80K02N3r6j29O0
$$ -168 -35 -102 132 -243 -5 151 -72 143 -164 -33 318 -36 48 -72 -17 236 -144 58 111 15 -114 -54
3495e4O2j31K33j19j47J4J46P6l7k1r2J39l21M62l10N3N1k04O1K83k01K69k27
$$ -54 8 -123 110 -9 -156 -142 4 80 43 22 -70 69 -252 210 -100 -47 4 -200 -139 144 -57 212 -15
3518a5m2J43j19j28q3M18N4r2n5j79J67o7n3j29M0L25R4k02p2K57k63p8L26k01
$$ -15 -57 86 -33 -161 -244 174 228 136 81 -98 69 2 -51 -180 -140 185 279 77 5 262 -1 -79 247 46
3542D6L18m44K70k49J8K7Oq7M43M8l60L3k39J01j88M75j66j70J83J3o0j74R1K22
$$ 46 364 -80 190 -59 -41 -14 -8 -95 348 396 36 69 -170 -69 -257 218 52 -118 65 78 18 -156 -65 157
3566A57m50K62R3n1R2J11l76M45n92J99J23Mo1Q0L6L6p5j3N4Q6m22L07n2k71K53
$$ 157 -293 -31 62 11 103 214 -162 283 -309 -110 13 17 -44 36 72 108 33 20 74 160 -262 45 -7 -278 -25
3591b5j91J36qQ7l9m0J94l1q0K0j60J35J48k26Q6k57J70J14k52P3K09r7R0n4j55
$$ -25 -216 -80 -88 -1 -40 -80 114 83 3 23 -137 -2 146 -80 6 -251 -81 33 -219 -146 63 -34 56 2 -153
3616a53L46k63j16M4l5J92j55K02J30N9m30R0KjpJ2J02qq8j91M86n2l31J2k6L06
$$ -153 193 -70 -186 -142 -177 15 -140 62 192 251 -179 -89 -87 -88 -95 -83 19 11 -77 -268 218 166 -165 -153 -179 127
3642A27o9j35j17N1J05%P4J67k46k3K98l35K11M3q9J29m33J60M13m57Q2K18l17
$$ 127 58 -77 -194 -143 -38 -38 36 203 -43 -66 232 -103 108 151 62 191 -242 -82 331 -126 -44 174 -143
3665a43N0J13J86k22j06J88P2l79L81m3P8m18K55J2m7K10l01L05j27k79K48J50
$$ -143 -93 20 206 -16 -122 66 138 -241 140 97 175 -243 12 24 -23 187 -114 191 64 -215 33 183
3687A83j75J29j84J81m30L87q9r2RL07k0k43N0k76j7K07jM1M8J93J2j90K2ML7
$$ 183 8 137 -47 134 -296 91 2 -90 -81 226 206 -37 13 -263 -280 -73 -74 -33 15 208 220 30 52 56 93
3712I3J68k80j06P1J07j12O7J26j35R1o0JK1K94k28j13JP2o1j25M12o9l85K40
$$ 93 261 -19 -125 -54 53 -59 8 134 -1 90 30 31 52 346 118 5 6 78 17 -108 304 235 -150 90
3736I0j39j53K53J0j55J31n6J83k34o2K20j3N5l10K04Q8P7j91p3J32Kj4O8J41
$$ 90 -49 -202 51 61 -94 37 -19 164 -70 -132 88 75 130 -180 24 112 189 -2 -75 57 59 45 113 254
3760B54m09J31J40k13M2k08P1J49L9l5K76l30p3J72o9J79k14K08j91K90l48J03
$$ 254 -155 -24 116 -97 -55 -263 -192 -43 -4 -39 237 -93 -166 6 -63 116 -98 110 -81 209 -139 -36
3782c6J08K02k32N3N3o9p4j31K02o1l21K75j5l2r1J73K15j32j89K1n6J98j18k08
$$ -36 72 274 42 95 148 79 5 -126 76 15 -306 -31 -46 -78 -169 4 219 87 -102 -81 -137 61 -57 -265
3806b65N22l42J90K2j13Kk13K56j08P8J76k19J12p9k6k89O15j28LN3k31M9j01
$$ -265 257 -85 105 127 14 16 -197 59 -49 29 205 -14 98 19 -7 -296 319 191 194 247 16 65 -36
3829c6kR4j07N5j26K86p2pL2q2%r3J22o1J48k48O1J10j77J16J84q7J21k08M0l42
$$ -36 -38 56 -51 4 -122 164 92 85 117 35 35 -58 64 3 151 -97 -36 74 -103 13 197 110 231 23 63 -279
3855b79J76P6j63J54J07j94K24o6m5j98L54j59j70Q7J50l6P3p5j84qK25j55J59
$$ -279 -103 -27 -190 -36 71 -123 101 35 -10 -208 146 -13 -183 -96 54 18 91 16 -168 -176 49 -106 53
3878E3j59L0P0p0m6J93l69M01J5K0J28n09J36n7J91j90J24O8K86l02J17l7n6K27
$$ 53 -106 -76 -6 -76 -122 71 -298 103 118 138 266 -243 -107 -164 27 -163 -39 29 315 13 130 93 37 264
3902B64k58j58JM56m12J18M6J42j28p1J48k54L08k91J13j76l8N10l63J47j35J50
$$ 264 6 -152 -151 305 -107 11 57 199 71 0 148 -106 202 -89 24 -152 -190 320 -43 104 -31 119
3924A19j18K6j50j56K88L4J30L5k49k93K40K20J16l58N44o25L94k58L5q9J4J1
$$ 119 1 27 -123 -279 9 43 173 208 -41 -334 -94 126 242 -116 428 -197 197 -61 -26 -115 -101 -90
3946i0J79k56J44J74l51K98k48K25j97O1p5r0k6J09L9j74K61J56l8j82J15O4k58
$$ -90 89 -167 -23 151 -200 98 -150 75 -122 -61 -136 -226 -252 -143 -104 -278 -17 139 101 -81 34 98 -160
3969a60K53k07K4j65L69k34n4J82j0k26K2J25J54N7l3q3J14j93L31k43j10J8j2
$$ -160 93 -114 -90 -255 114 -120 -174 8 -2 -228 -206 -81 73 130 97 14 128 -65 266 23 -87 -69 -81
3992h1K46J04m30L03L8k21k5n1L6R8J18j11K3J4M8j89Q9K35k16pl18K00J88j20
$$ -81 165 269 -161 142 180 -41 -66 -117 -81 17 135 24 47 61 109 -80 9 244 28 21 -297 -97 91 -29
4016b9M9o8j02O5j6K51Q5m78L78k23Q8o2j5L34m38m8Q8n9J57J55j33Mk81m6M66
$$ -29 20 -48 -150 -85 -101 150 235 -243 135 -88 0 -62 -77 257 -181 -229 -141 -200 -43 112 -21 -17 -298 -344 122
4041A22rm8l03K88k55K10J01k74L34J19j38j98l0k36K38j29M47k77r6J57r5n0
$$ 122 113 65 -238 50 -205 5 106 -168 166 285 147 -51 -81 -317 -79 -208 239 -38 -134 23 -72 -122
4063a22J78O1j68M9K22n18L59P8j93R7k06K0K97j60K5J08k6m4q3p7l38M25N9J35
$$ -122 56 117 -51 -2 220 -298 61 139 -54 43 -163 -143 154 -6 19 127 101 57 -26 -103 -441 -16 43 178
4087A78k12J34j3j07K34j15j17J11q0j88J24j09M33l91j33J06J67K4R8j28J18
$$ 178 -34 100 87 -20 214 99 -18 93 13 -175 -51 -160 273 -118 -251 -145 22 46 144 16 134
4108A34J44j74k02p6n1k2L05qJ01r8N07n92J58J6j63k02M59l16Qj75K50j38mJ59
$$ 134 278 104 -98 -174 -225 -247 58 50 151 53 560 -32 126 142 -21 -223 236 -80 -72 -247 3 -135 -139 20
4132B0j11j14j27L36k56J09K81l44JP3K19k31J7K66j87K17l36M12k85L5k8k1J66
$$ 20 -91 -205 -332 4 -252 -143 138 -206 -205 -132 87 -144 -127 139 -48 169 -167 245 -40 -5 -33 -54 112
4155A12l18Q4J39J3K15k83j42L23j23q8m7K47j69oJ0J39j53k19N26k07j40P7P8
$$ 112 -206 -122 17 30 245 -38 -180 143 20 -68 -115 132 -37 -43 -33 106 -47 -266 260 53 -87 -10 68
4178F8N0K8l61J36P9k2j41P6K04l09K19l68N85m00J32R6J86o5Q1j62r3k27L07
$$ 68 118 146 -215 -79 0 -22 -163 -87 117 -192 27 -341 244 -156 -24 72 258 193 274 112 19 -208 99
4201I9ll0l98M43l60J31J2K18k09j02J3L68j20j98L2M32k01l32K44O1L0j34MP4
$$ 99 96 66 -332 111 -249 -118 -106 112 -97 -199 -186 182 62 -136 -104 328 127 -205 39 100 130 -4 0 74
4225G4J31j38j51K03k35R8l8N0L4r8K70k69J7j0J78k14J28k19q7K67J20m6Pj19
$$ 74 205 67 -84 119 -116 -18 -56 -6 28 -70 200 -69 -52 -62 116 -98 30 -189 -276 -9 111 65 72 -47
4249d7j23M1J70j58J26O1O4k2j45j44K71l42K00J69L5j51o6J49j09K74l29M1n6
$$ -47 -170 -129 41 -117 9 70 134 112 -33 -177 94 -248 -48 121 156 5 -61 88 -21 253 -76 -35 -91
4272i1K06k4j20L8mJ9k29K03J84M1l95JP2Q7j38J89R2l5l0j71K05k96L8L97k56
$$ -91 115 91 -29 9 5 24 -205 -2 182 223 -172 -171 -99 -12 -150 39 131 96 66 -105 100 -196 -158 239 -17
4297a7k03l7J55O7r8J45n1K5J5M1O3j99N8R1j56o9K82j07K6P5l37J30M7j4J58
$$ -17 -220 -257 -102 -35 -133 12 -39 -14 1 42 105 -94 -36 55 -101 -170 112 5 31 106 -231 -101 -54 -68 90
4322I0n3j05r7P8K03nM2nk35p5O5J09M2j53k8K12j22J23k15K46j30j29K96n9q0
$$ 90 37 -68 -165 -87 116 111 153 148 -87 -162 -97 12 54 -99 -127 85 -37 86 -129 117 -13 -142 154 95 15
4347A5j1k10k7J33J75j45R5r1N3M4J25J28m24N3K5J41M2k94K56j4O8j24N1jQr7
$$ 15 4 -206 -233 -100 75 -70 25 -66 -13 31 156 284 -140 -87 -62 79 121 -173 83 69 137 13 64 63 71 -26
4373b6J7J12j98r8J96j18J49q8K22k59K15n8k84K25j08M1J3q5K11J2j33K0J16
$$ -26 -9 103 -95 -193 3 -115 34 -54 168 -91 124 66 -218 7 -101 -60 -47 -132 79 91 -42 -22 94
4396I4k44L15J02m88J28J17J16j69Ko1P9j01N6j71M30j18j17O1J60k34J76k08
$$ 94 -150 165 267 -221 -93 24 140 -29 -27 -88 -9 -110 -54 -225 205 87 -30 31 191 -43 133 -75
4418g5J17L11l33K81l57j21J63J11m7K27m41J30j14Q2K3j11K48P0k42R3r8P8n9
$$ -75 42 353 20 301 -56 -177 -14 97 50 277 -164 -34 -148 -66 -43 -154 94 164 -78 15 -83 -5 -64
4441f4J01O8j1j11K72l01P9L88m91j5K04o2o5K11l76K81l5J52K4k75q0K28J14
$$ -64 37 105 94 -17 255 -46 33 421 -70 -85 119 57 -8 203 -173 108 73 225 249 -26 -106 122 236
4464B36k48n7L6j68N0K50k9Ol5J41O4k36NP4k26M9K08j26J00j62j0m1J09j4J09
$$ 236 -12 -69 -33 -201 -151 99 70 76 41 182 246 10 15 89 -137 -88 120 -6 94 -68 -78 -119 -10 -24 85
4489H5L6k16L25k09K57j99j65j03J58j26j80K40j81J33J88j92K09j97Q1K38Jk08
$$ 85 121 -95 230 21 278 79 -86 -189 -31 -157 -337 -97 -278 -145 43 -149 60 -137 -56 182 183 -25
4511b5K9p5N7j17J00nO6Ok02Q8Q9JJ10K3n02K03J24J06k77J36j47K18k99J44Q4
$$ -25 4 -71 -14 -131 -31 -36 30 36 -166 -78 11 12 122 145 -357 -154 -30 76 -201 -65 -212 6 -293 -149 -65
4536f5o0J19P7o6J61j7l48L39m7J00l15l4J18J80j78l3J8J3J7oJ08j91R8j26m8
$$ -65 -125 -6 71 5 166 149 -199 140 93 193 -122 -156 -38 142 -36 -69 -51 -38 -21 -27 81 -110 -12 -138 -186
4561a86P0P8j63J70k79Q3K72j68J24j90J6K13k71J49pJ1M8N5k8k66L01nl14K54
$$ -186 -116 -38 -201 -31 -310 -227 45 -123 1 -189 -173 40 -231 -82 -89 -78 -30 25 -3 -269 32 27 -287 -33
4585c3K37j47k73L35k19M13Ln78K96J66k49J18L7k06N9j07L53k33%J26j69J16
$$ -33 204 57 -216 119 -100 313 316 -262 34 200 -49 69 106 -100 -41 -148 205 -28 -28 98 -71 45
4607D5J69n37M01k16J55l9j5J16j15o7J62J03l18q2L14k20K15o2M08l28l96K03
$$ 45 214 -323 78 -138 17 -22 -37 79 -36 -103 59 162 -156 -238 76 -144 71 9 417 89 -307 -104
4629a04J06P4K6j58J12l41J03K40J69j33k76L39m3j60Kj57J30l5J57J0J16l0k88
$$ -104 2 76 102 -56 56 -285 -182 58 227 94 -182 157 114 -46 -44 -201 -71 -106 51 61 177 147 -141
4652a41L07o8j73j9J67J04k03j94L08lk17K50m1k16J60k78K01J65k50K44p7j1
$$ -141 166 98 -75 -94 73 177 -26 -220 88 85 -132 118 77 -139 21 -257 -56 109 -141 103 26 15
4674A5k53N6Q7r8K04j0q8k8L15j00k1J4j67P0j43J72m0M1J20j2j16k11L12j19
$$ 15 -238 -182 -95 -193 11 1 -87 -115 200 100 79 93 -74 -4 -147 25 -15 26 146 134 18 -193 119 0
4698@K09j66p7j34J67J06j94n0Q7j1k2J30J12l39P1K97l64K38Oj61PJ01M3q4j16
$$ 0 209 43 -34 -168 -1 105 -89 -139 -52 -63 -85 45 157 -182 -111 186 -178 60 66 -95 -88 13 56 -28 -144
4723a44L75k44l4j09l5K69j04k25M33l47M59j62k37J80j86J17O7Q6J48k03kk88
$$ -144 231 -13 -47 -156 -191 78 -26 -251 182 -165 294 132 -105 75 -111 6 73 159 307 104 102 -186
4745a86m6L79M1k59M3J15j38Q4j22P7l3J26j32k12J17K25K0k23K40j66l3r3K00
$$ -186 -232 147 188 -71 -28 87 -51 33 -89 -12 -45 81 -51 -263 -146 79 99 -124 116 -50 -83 -176 24
4768B4L12n20L78j86q8J4l7J86j44l3j93L05j1q3l8m0J44Q7R9k13R1K0j45j0Q5
$$ 24 336 -184 194 8 -80 -66 -103 83 -61 -94 -287 18 7 -76 -114 -154 -10 77 176 -37 54 74 -71 -81 4
4793DK0Q1j66R2J30n1o9j42O9q0n9j5P2K06j62O4L5k9K1j18K31Q9l83J64O2Rq9
$$ 4 24 105 -61 31 161 110 41 -101 -32 -112 -171 -186 -114 92 -70 -6 29 0 21 -97 134 223 -160 4 66 75 -14
4820a4M9j28J84l15m2L55J6N4m9J13k51l1j04j25L27j28J12J07j13j25K11k71
$$ -14 35 -93 91 -224 -266 89 105 159 110 223 -28 -59 -163 -288 39 -89 23 130 17 -108 103 -168
4842a68L4K25r2Q1o8L6k65J80k73L93J14n2j94J71j17k78L44r9k39j9K96J4mq9
$$ -168 -134 91 -1 80 12 48 -217 -37 -310 83 197 145 -49 122 5 -273 71 -28 -267 -286 10 24 20 -69
4866f9n1K72l76K40j05RL9J20n1j16k36L58r3M5l8j70L5N1K05q7L14k44j56J90
$$ -69 -120 152 -224 16 -89 -80 -41 79 28 -88 -324 34 -59 -14 -52 -222 -187 -136 69 -18 296 52 -104 86
4890H6J19l12J99k16M10k51k04j6J67o3J45k27K19q6j68L1l8P7J6J26j5Oj2J08
$$ 86 205 -107 92 -124 286 35 -169 -185 -18 -81 64 -163 56 -30 -198 -167 -205 -128 -112 14 -1 5 -7 101
4914A01J47r2L9k11LP7q6nn7J11m1J41K22k86j66J63LJ26j6j76J72k68p6J15L3
$$ 101 248 156 195 -16 -13 64 -22 -27 -84 27 -14 127 349 63 -103 60 63 189 173 -3 169 -99 -175 -60 -27
4939b7J19j50n4ql9l0J03m1J71r5p8K2J98J10l6l90L97j33MQ8j05k8l5L95m59
$$ -27 92 -58 -112 -120 -159 -189 -86 -127 44 -51 -129 -107 91 201 165 -225 172 39 43 131 26 -2 -37 358 -101
4964a01J32J35j88j52q3J72P5n4j23L08n8q2J85p2k11L03k13p6L8Q4j75M0M4j03
$$ -101 31 166 -22 -174 -257 -85 -10 -64 -187 121 63 -19 166 94 -117 186 -27 -103 -65 19 -156 -116 -72 -175
4988a75M23l20J29Oj33J65j18Lo4J85N4l18J16K05m4r2K2N4J45m12J28J2q1l0
$$ -175 248 -72 57 63 -70 95 -23 -20 -84 101 155 -163 -47 158 114 22 44 98 243 -169 -41 -29 -110 -140
5012a40K09RN5Q5n9j09p5Q1J17j24K6%k54K28k61K04k31N9M40l42O2L36k42j98
$$ -140 69 78 133 218 159 50 -25 56 173 49 75 75 -179 49 -212 -8 -239 -180 260 -82 -20 316 74 -124
5036a24K95k86kJ71k02J2M2k1KK7p6J73RL6LJ6L0L2kPk23J76m18K32J00k4k5j1
$$ -124 171 -115 -117 54 -148 -136 -94 -115 -113 -86 -162 11 20 56 59 75 105 137 135 142 -81 95 -323 -91 9 -15 -40 -51
5064e1J32R2l09m6r5J67N7J38J0J9j08R3K7N4j60Q3j32J63k90p6K33p2kq3M52
$$ -51 81 173 -136 -182 -277 -110 -53 85 95 114 6 99 126 180 20 103 -29 134 -156 -232 1 -71 -73 -156 296
5089B96p6k72Q7j18N3oK20k77K52k12k21M0L12k04P4J09J96k66J09r4k1J94l23
$$ 296 220 -52 35 -83 -30 -36 184 -93 159 -53 -274 -234 78 -126 -52 57 253 -13 96 2 -19 175 -148
5112a48j80L3K68o5L72j82q1j55K50j10Jk00K43l79N10m07p0J27O1J21j72K16
$$ -148 -328 -295 -27 -92 280 98 17 -138 112 2 3 -197 46 -333 177 -230 -300 -173 -112 9 -163 53
5134E3j05K44j92J4j7k7k34L79r9q1K47k90J21j66K12k15M09k00k19J54p2k18
$$ 53 -52 192 0 14 -3 -30 -264 115 16 -65 182 -108 13 -153 59 -156 253 53 -166 -12 -84 -302
5156c02O4L14k88L45k61K33P3l26J53rJ55l59J93rJ98l30L6L82n05K2K54j94L35
$$ -302 -238 76 -212 133 -128 105 178 -148 5 -4 151 -208 -15 -24 174 -156 -120 262 -243 -221 33 -161 174
5179A74l17k9J70o5lJ32m8o6q8K57l11J72P2o1q5J89k47Q3J81K60l08k81L29m4
$$ 174 -143 -172 -2 -67 -70 62 14 -52 -140 117 -194 -22 50 -11 -96 93 -154 -71 110 370 62 -219 110 66
5203F6Pk79J48M7L23k63j36J83k3o1J37j81j67M27o6J06j62O9j84k5J72k09k96
$$ 66 73 -206 -58 -11 312 49 -87 96 73 12 149 -32 -199 228 162 268 106 175 -9 -34 138 -71 -367
5226c67L84J26m90K15J95J50j02j09J30k14P5q4n4L38k57o0J03K25L8m60L03k3
$$ -367 17 143 -347 -132 63 213 111 2 132 -82 -7 -91 -145 193 -64 -124 -21 204 242 -218 85 62
5248F2k0J09m4P3k49k81N22O8k66j48K54l03K19P2j21k6L4J47r5mL9J18k06j40
$$ 62 42 151 107 180 -69 -350 172 240 -26 -174 80 -223 -4 68 -53 -79 -45 102 7 3 42 160 -46 -186
5272a86M6J78R3j11M2k37L05k89P0j77L41N9J35l22J18l5O0J77k61j52K6L74k61
$$ -186 -140 38 131 20 62 -175 130 -159 -89 -266 75 134 269 -53 65 30 90 267 6 -146 -120 254 -7
5295gK77j28j28j8J86q2j31j00J5K66j20J1q0J29p7p8l7J21k31K40j31N0n8L71
$$ -7 270 142 14 -4 182 100 -31 -131 -116 150 30 41 -39 90 13 -65 -102 19 -212 28 -103 -53 -111 260
5319B60l58p5R2L7q2m3J62K50l17R7qm8j27J70J95j71m5LO9J21J2j32N3R4k87
$$ 260 -98 -173 -81 -44 -126 -169 -7 243 -74 23 15 -33 -160 10 205 34 -11 -8 61 182 194 62 115 209 -78
5344g8pL9j31K22j14j32J64J40K9k67RK52k98oQ1OJ03q0J4J90J9r9J63k30J08
$$ -78 -85 -46 -177 45 -69 -201 -37 103 132 -135 -126 126 -172 -178 -97 -91 12 -68 -54 136 155 56 219 -11 97
5369I7L3k25m1j78L73Mj95L7o0J81k40J54K19k3k8j64K53N1k41K44l39J68j8j50
$$ 97 130 -95 -136 -314 59 63 -132 -95 -155 26 -214 -60 159 136 108 -56 197 248 7 251 -88 80 62 -88
5393h8o6M58m28K6J59j13M0K41k30k92J59K51j86k14L09j62K1J10J71O9m10L17
$$ -88 -154 304 -124 -98 61 -52 -12 229 -1 -293 -134 117 -69 -283 26 -136 -115 -5 166 235 -175 142
5415A42l16j25R4K89j57Pj5J29O4j50J51n4oJ17j81K56k95j3J22k39O7l04O15
$$ 142 -174 -299 -205 84 -73 -66 -81 48 112 -38 113 59 53 170 -11 245 -50 -63 59 -180 -113 -417 198
5438A98l22L37j24O3k35J63p5r3O6J05j32r2K57j59N8J8k29M02j60j46Q7p4J1
$$ 198 -124 213 89 152 -83 80 5 -88 -22 83 -49 -141 116 -43 15 33 -196 206 46 -100 -13 -87 -76
5461g6J6p0LJ67m18J91J08q7J57J72k90K54m5oj51J59j38k34M75m46Q0J22l02
$$ -76 -60 -130 -127 40 -378 -187 -79 -166 -9 163 -127 127 82 76 -75 84 -54 -288 187 -259 -179 -57 -359
5484c59L12k1j18J80j05J38o4J92M2l65K14k06K36j77L69m43M45j02q1j16J6J47
$$ -359 -47 -68 -186 -6 -111 27 -37 155 197 -168 46 -160 76 -101 268 -175 270 168 87 -29 -13 134
5506A34k7J90l75K11j2j9k81q6J48K59j80P1%n8J43j01o7n5J21J9q9j03J97p2
$$ 134 107 297 -78 133 121 102 -179 -265 -117 142 -38 33 33 -25 118 17 -50 -105 16 35 -54 -157 40 -32
5530c2j88K11R0l39L5M08L2n05M45l37J22l4OJ97K27k30k61K24P1k10L1L41j58
$$ -32 -220 -9 81 -258 -223 185 217 -288 157 -180 -58 -92 -86 111 338 108 -153 71 142 -68 -37 304 146
5553A46l90K40J41n7j41k34K50R9nk69K30m0n3N8J43r6j65K52J32j68k16K10k53
$$ 146 -244 -4 137 80 -61 -295 -45 54 49 -220 10 -30 -83 -25 118 22 -143 109 241 73 -143 67 -186
5576a86L18j45j87K00j53K43J75l34Q7L6j65L3l90K97M26k14qJ41m37L22kQ9j83
$$ -186 132 -13 -200 0 -153 90 265 -69 18 54 -111 -78 -468 -171 255 41 33 174 -263 59 57 146 -37
5599c7Q2O7j1j7Qj99J57R0k10J04J21k94j7L1Q3K1m8J30j45jM4R7m3k0J32j07
$$ -37 45 112 101 84 92 -107 50 140 -70 34 155 -139 -156 -125 -42 -21 -69 61 -84 -85 -41 56 13 -7 125 18
5625A8Q1k57pO5K87O5l32O3l02K35PR5K08q6N5j82j62O5Rl3k04O67o6k58k86L94
$$ 18 99 -158 -165 -100 187 252 -80 -17 -319 -84 -77 18 226 140 195 13 -149 -84 -75 -108 -312 355 289 31 -255 139
5651A39j29j46p8K47j13l1K65l88J14l0L3j41M15nk32k03K71J69j75M1M1k72K90
$$ 139 10 -136 -214 33 -80 -111 154 -234 -120 -150 -117 -258 157 152 -80 -283 -12 157 -18 23 64 -208 82
5674H2l70L55l5Q1j10J33nj96P7m4l0J31j29O9M2l05L72j71P1L5k07R2j80N1K19
$$ 82 -288 67 32 113 3 136 131 -65 12 -32 -62 69 -60 9 51 -254 118 -53 18 53 -154 -62 -242 -191 28
5699B8L26m06P1p1j07M73k55r2N7J71l73L12j48j60L29l6j34N4q7rj63L58k19
$$ 28 354 -52 19 -52 -159 314 59 -33 24 195 -178 134 -14 -174 155 119 -15 39 -48 -57 -220 138 -81
5722h1K73q4k8o2l15J16K03l0mq5O6p4K77j49j48J98m2k11J73K14j15J70j61j96
$$ -81 192 108 80 18 -297 -181 22 -8 -12 -97 -31 -105 172 23 -125 73 31 -180 -7 207 92 262 101 -95
5746i5k5K04j51J46j1k11L13j49q1j21K22j54q2m6K4K64k36O0j6K33j42K10k57
$$ -95 -120 84 -67 79 68 -143 170 21 -60 -181 41 -113 -195 -241 -217 47 -189 -129 -145 88 -54 156 -101
5769a01K60k21kK41k42O4J65n42N98q5q2J40j38L6k01K87k26j24K75k60m0K63
$$ -101 159 -62 -64 177 -65 -1 164 -378 220 135 53 193 55 91 -110 177 -49 -173 102 -158 -198 65
5791F5k8k17L06r5R9rj92Q3P3j96J10l0L1k8Nj18O3K65j27q4j03K7k1Q8N3L33
$$ 65 37 -180 126 31 130 121 -71 12 85 -111 -1 -31 0 -28 -23 -141 -78 187 60 -24 -127 -100 -121 -33 20 353
5817C53j44k94J14N8j35J25j24oj91K01j97K33l46O42l39k09L93k26P8Qm9K8K55
$$ 353 209 -85 29 87 -48 77 -47 -53 -244 -43 -240 -7 -353 289 -50 -259 134 -92 -14 -6 -55 -27 228
5840B28j37k77J93o2J91k40L22k2l75j9j66K82R8o6o1L56l96j6Q4R4m38N60j28
$$ 228 91 -186 7 -55 136 -104 218 196 -179 -198 -364 -82 16 -50 -111 245 -151 -167 -83 11 -427 133 5
5863EJ75j71pj36M12l18L9m5j68K69j17N5L1K1j01j4j1j57J76L26m7k10J38k35
$$ 5 180 9 2 -134 278 -40 -1 -46 -214 55 -62 -7 24 45 -56 -70 -81 -238 -62 264 217 7 145 -90
5887i0M03k55j33P4O6o4R8k36j03P1L70k04m1J99k68J10Q8R6k52O9J19j12o4L42
$$ -90 313 58 -75 -1 65 1 99 -137 -240 -169 201 -3 -44 155 -113 -3 85 181 -71 -2 117 5 -59 283
5911B83j21k35K18k50p1M08M2k25j44M1l2J57q6j26J13Q6p5n8J74k87l0N7J17
$$ 283 162 -73 145 -105 -176 232 274 49 -95 -54 -86 71 -15 -141 -28 58 -17 -75 99 -188 -218 -161 -44
5934d4K3J00Kp1p1q6J06L7j06J83J36m6m1j92j6o9J89P4k31O6P9J85k99K45j34
$$ -44 -21 79 81 10 -61 -147 -41 -4 -110 73 209 163 122 -70 -86 -155 34 108 -123 -57 22 207 -92 153 19
5959A9P2l33QJ58K34j93M9J8J02j69r4K10j36k1K28j29j9J32j59L23n13J01J34
$$ 19 91 -242 -234 -76 158 -35 14 32 134 -35 -129 81 -55 -76 152 23 4 136 -23 300 -213 -112 22
5982B2J11j2m4j94R1n1K10k80J08o6j4K74p6m3O5j5k23K30j04N6m0P1K6J43N9
$$ 22 133 121 77 -117 -26 -77 133 -147 -39 -105 -119 155 79 36 101 86 -137 93 -11 45 5 76 102 245 304
6007C04k88J38j43j03J5q4K52j74J74l7k03M2J15K53j37j37J15K71m23J81k31
$$ 304 16 154 11 -92 -77 -161 91 -83 91 54 -149 -107 8 261 124 -13 102 373 -50 131 -100
6028a00J1j41J96r4o5K68k7j43J45n6J6q6Kl0R7On7j43L35j61K18j74k4L5l18
$$ -100 -89 -230 -34 -128 -193 75 48 -95 50 -6 10 -76 -74 -104 -7 -1 -58 -201 134 -27 191 17 -7 28 -290
6053b90J73J53M0j32k44J61K64l39J16J89j22O7J93j79K7j3k15O9PJ68N6l54J32
$$ -290 -117 36 76 -56 -300 -139 125 -214 -98 91 -31 36 229 50 77 64 -151 -82 -75 93 149 -205 -73
6076g3M50l61j91J61k16L76l47M09j20rp9l1j62J46R1n0j68J97L0l10K04K7J39
$$ -73 377 16 -175 -14 -230 146 -201 208 88 79 0 -31 -193 -47 44 -6 -174 23 53 -257 -53 -26 113
6099A13n3K18k48k92K00L70k03j03Q1J75m46L64k77PQ6j56K35Jm8j59K62l8J3
$$ 113 60 278 30 -262 -62 308 105 2 83 258 -188 176 -101 -94 -8 -164 71 72 24 -135 127 89 102
6122A02j16J33j39j16K25J48j99m5O7J69r4q7p6j2j02Q0K06l32K06N9K8n0Mj88
$$ 102 -14 119 -20 -136 89 237 38 -7 60 229 135 48 -28 -40 -142 -62 144 -188 18 77 105 55 59 -129
6146a29J62l5J38o5J4j48j6R6j51J50j28J79j97m5M47l85K45J5j7%k61L18j46
$$ -129 33 -2 136 71 85 -63 -79 17 -134 16 -112 67 -130 -175 272 -113 132 147 130 130 -131 187 41
6169D1Jm9j54L36j36J09k69R7l2qL52m84K78p0M0Q5l23K89k3r5N7K23j58jO7r1
$$ 41 42 -7 -161 175 39 148 -121 -24 -56 -64 288 -196 82 12 52 137 -186 103 80 -15 42 265 107 106 173 82
6195H2L4k31P8J84l39J93P1q1lq0j24K52o7J12M1j84L1P6m7K6j18K67k62K3K13
$$ 82 116 -115 -37 147 -192 1 72 -9 -12 -92 -216 36 -31 81 122 -62 -31 45 -2 24 -94 173 -89 -66 147
6220A47o2L00o09L63j10J99l28J16R6j49K47l80L10pj01l09J66Q4j5P4j9j00J89
$$ 147 85 385 -224 139 29 228 -100 16 112 -37 210 -170 140 133 32 -277 -111 -27 -42 32 13 -87 102
6243A02j07N9K39l99P7k30J22J22P3k4N2R3j04n6r1J81k22k3J11j68m8K07N7Q4
$$ 102 -5 54 293 -106 -29 -259 -137 -15 58 34 86 179 75 19 -72 109 -113 -136 -25 -193 -241 -34 23 107
6267A07M5n4j35k3N0j54K23o5O6Q3l5j04J38l02J41J53p4j15k34L07M3j21J33
$$ 107 152 98 -37 -60 -10 -164 59 -6 60 143 108 4 142 -160 -19 134 60 -55 -289 18 61 -60 73
6290G3j31q0J98k82M8L19j98n0L25l80J25j51J7K06l19L48j46P9L3n7o1Q3j13
$$ 73 -58 -138 60 -222 -174 145 -53 -103 222 -158 -33 -184 -167 39 -280 68 -78 1 34 -23 -84 -1 -114
6313a14k88K23K44k71M45k38k34J73J35k21Kj15L4L01k83K61J81Kj17j53P0J10
$$ -114 -402 -179 65 -206 239 1 -233 -60 75 -146 -144 -259 -225 76 -207 54 235 237 120 -33 37 147
$$ [...]
8191A94
##END NTUPLES=NMR FID
##END=
