##TITLE=1H_SL17_Dau(500)
 CDCl3, 8 sc, 
 24.12.2020
##JCAMPDX= 6.0         $$ Bruker NMR JCAMP-DX V2.0
##DATA TYPE= NMR FID
##DATA CLASS= NTUPLES
##ORIGIN= UXNMR, Bruker Analytische Messtechnik GmbH
##OWNER= root
$$ XWIN-NMR		Version 3.5
$$ Thu Dec 24 10:32:42 2020 Russian Standard Time (UT+4h)  she@DPX200
##.OBSERVE FREQUENCY= 200.1315066352
##.OBSERVE NUCLEUS= ^1H
##.DELAY= (6, 6)
##.ACQUISITION MODE= SIMULTANEOUS
##.ACQUISITION SCHEME= undefined
##.AVERAGES= 8
##.DIGITISER RES= 18
##SPECTROMETER/DATA SYSTEM= spect
##.PULSE SEQUENCE= zg30
##.SOLVENT NAME= CDCl3
##.SHIFT REFERENCE= (INTERNAL, CDCl3, 0, 15.7039)
##AUDIT TRAIL= $$ (NUMBER, WHEN, WHO, WHERE, WHAT)
$$ ##TITLE= Audit trail, XWIN-NMR		Version 3.5
$$ ##JCAMPDX= 5.01
$$ ##ORIGIN= Bruker BioSpin GmbH
$$ ##OWNER= she
$$ F:/spectra/data/she/nmr/H-F/1/audita.txt
$$ ##AUDIT TRAIL=  $$ (NUMBER, WHEN, WHO, WHERE, WHAT)
(   1,<2020-12-24 10:21:55.65 +0400>,<she>,<DPX200>,
      <created by zg, POWCHK disabled, PULCHK disabled
       configuration hash MD5:
       00 E9 B6 7A A2 85 ED C7 34 08 36 98 17 FE 4E 26
       data hash MD5: 16K
       5B EC 14 07 47 94 45 4E A4 0C DA 68 71 04 8D 00>)
$$ ##END=
$$ 
$$ hash MD5
$$ 7C 0F 93 A5 C9 02 A7 09 8B 43 92 4D F8 01 34 57
##$RELAX= 
##$RELAX= 
##$RELAX= 
##$RELAX= 
##$RELAX= 
##$RELAX= 
$$ Bruker specific parameters
$$ --------------------------
##$DU= <F:/spectra>
##$EXPNO= 1
##$NAME= <H-F>
##$PROCNO= 1
##$TYPE= <nmr>
##$USER= <she>
##$AMP= (0..31)
100 100 100 100 100 100 100 100 100 100 100 100 100 100 100 100 100 100 
100 100 100 100 100 100 100 100 100 100 100 100 100 100 
##$AQSEQ= 0
##$AQ_mod= 1
##$AUNM= <au_zg>
##$AUTOPOS= <>
##$BF1= 200.13
##$BF2= 200.13
##$BF3= 200.13
##$BF4= 200.13
##$BF5= 200.13
##$BF6= 200.13
##$BF7= 200.13
##$BF8= 200.13
##$BYTORDA= 1
##$CFDGTYP= 0
##$CFRGTYP= 5
##$CHEMSTR= <none>
##$CNST= (0..31)
1 1 145 1 1 1 1 1 1 1 1 1 1 1 1 1 1 1 1 1 1 1 1 1 1 1 1 1 1 1 1 1 
##$CPDPRG= <>
##$CPDPRG1= <>
##$CPDPRG2= <>
##$CPDPRG3= <>
##$CPDPRG4= <mlev>
##$CPDPRG5= <mlev>
##$CPDPRG6= <mlev>
##$CPDPRG7= <mlev>
##$CPDPRG8= <mlev>
##$CPDPRGB= <>
##$CPDPRGT= <>
##$D= (0..31)
0 1.2 0 0 0 0 0 0 0 0.06 0 0.03 0 0 0 0 0.0002 0 0 0 0 0 0 0 0 0 0 0 0 
0 0 0 
##$DATE= 1608790915
##$DBL= (0..7)
120 120 120 120 120 120 120 120 
##$DBP= (0..7)
150 150 150 150 150 150 150 150 
##$DBP07= 0
##$DBPNAM0= <>
##$DBPNAM1= <>
##$DBPNAM2= <>
##$DBPNAM3= <>
##$DBPNAM4= <>
##$DBPNAM5= <>
##$DBPNAM6= <>
##$DBPNAM7= <>
##$DBPOAL= (0..7)
0.5 0.5 0.5 0.5 0.5 0.5 0.5 0.5 
##$DBPOFFS= (0..7)
0 0 0 0 0 0 0 0 
##$DE= 6
##$DECBNUC= <off>
##$DECIM= 32
##$DECNUC= <off>
##$DECSTAT= 4
##$DIGMOD= 1
##$DIGTYP= 9
##$DL= (0..7)
0 120 120 120 120 120 120 120 
##$DP= (0..7)
150 150 150 150 150 150 150 150 
##$DP07= 0
##$DPNAME0= <>
##$DPNAME1= <>
##$DPNAME2= <>
##$DPNAME3= <>
##$DPNAME4= <>
##$DPNAME5= <>
##$DPNAME6= <>
##$DPNAME7= <>
##$DPOAL= (0..7)
0.5 0.5 0.5 0.5 0.5 0.5 0.5 0.5 
##$DPOFFS= (0..7)
0 0 0 0 0 0 0 0 
##$DQDMODE= 0
##$DR= 18
##$DS= 0
$$ [...]
##$SUBNAM2= <"">
##$SUBNAM3= <"">
##$SUBNAM4= <"">
##$SUBNAM5= <"">
##$SUBNAM6= <"">
##$SUBNAM7= <"">
##$SUBNAM8= <"">
##$SUBNAM9= <"">
##$SW= 16.9725356469052
##$SWIBOX= (0..15)
0 0 2 0 0 0 0 0 0 0 0 0 0 0 0 0 
##$SW_h= 3396.73913043478
##$TD= 16384
##$TD0= 1
##$TE= 0
##$TE2= 300
##$TE3= 300
##$TEG= 300
##$TL= (0..7)
0 120 120 120 120 120 120 120 
##$TP= (0..7)
150 150 150 150 150 150 150 150 
##$TP07= 0
##$TPNAME0= <>
##$TPNAME1= <>
##$TPNAME2= <>
##$TPNAME3= <>
##$TPNAME4= <>
##$TPNAME5= <>
##$TPNAME6= <>
##$TPNAME7= <>
##$TPOAL= (0..7)
0.5 0.5 0.5 0.5 0.5 0.5 0.5 0.5 
##$TPOFFS= (0..7)
0 0 0 0 0 0 0 0 
##$TUNHIN= 0
##$TUNHOUT= 0
##$TUNXOUT= 0
##$USERA1= <user>
##$USERA2= <user>
##$USERA3= <user>
##$USERA4= <user>
##$USERA5= <user>
##$V9= 5
##$VALIST= <valist>
##$VCLIST= <CCCCCCCCCCCCCCC>
##$VD= 0
##$VDLIST= <DDDDDDDDDDDDDDD>
##$VPLIST= <PPPPPPPPPPPPPPP>
##$VTLIST= <TTTTTTTTTTTTTTT>
##$WBST= 1024
##$WBSW= 4
##$XGAIN= (0..3)
0 0 0 0 
##$XL= 0
##$YL= 0
##$YMAX_a= 125679
##$YMIN_a= -88940
##$ZGOPTNS= <>
##$ZL1= 120
##$ZL2= 120
##$ZL3= 120
##$ZL4= 120
##$ABSF1= 10
##$ABSF2= 0
##$ABSG= 5
##$ABSL= 3
##$ALPHA= 0
##$AQORDER= 0
##$ASSFAC= 0
##$ASSFACI= 0
##$ASSFACX= 0
##$ASSWID= 0
##$AUNMP= <proc_1d>
##$AZFE= 0.1
##$AZFW= 0.1
##$BCFW= 1
##$BC_mod= 2
##$BYTORDP= 1
##$COROFFS= 0
##$CY= 11.3945322036743
##$DATMOD= 1
##$DC= 2
##$DFILT= <>
##$DTYPP= 0
##$F1P= 15.9154993809931
##$F2P= -4.1035820241983
##$FCOR= 0.5
##$FTSIZE= 0
##$FT_mod= 4
##$GAMMA= 1
##$GB= 0.15
##$INTBC= 1
##$INTSCL= 1
##$ISEN= 128
##$LB= 0.24
##$LEV0= 0
##$LPBIN= 0
##$MAXI= 10000
##$MC2= 0
##$MEAN= 0
##$ME_mod= 0
##$MI= 1.114404
##$NCOEF= 0
##$NC_proc= 0
##$NLEV= 6
##$NOISF1= 3.799351
##$NOISF2= 2.8
##$NSP= 1
##$NTH_PI= 0
##$NZP= 0
##$OFFSET= 15.70392
##$PC= 1
##$PHC0= -10760.64
##$PHC1= 12.20095
##$PH_mod= 1
##$PKNL= yes
##$PPARMOD= 0
##$PSCAL= 0
##$PSIGN= 0
##$REVERSE= no
##$SF= 200.130013532006
##$SI= 16384
##$SIGF1= 3
##$SIGF2= 2
##$SINO= 400
##$SIOLD= 16384
##$SREGLST= <1H.CDCl3>
##$SSB= 0
##$STSI= 0
##$STSR= 0
##$SW_p= 3612.71676300578
##$SYMM= 0
##$S_DEV= 0
##$TDeff= 0
##$TDoff= 0
##$TI= <>
##$TILT= no
##$TM1= 0
##$TM2= 0
##$TOPLEV= 0
##$USERP1= <user>
##$USERP2= <user>
##$USERP3= <user>
##$USERP4= <user>
##$USERP5= <user>
##$WDW= 1
##$XDIM= 8192
##$YMAX_p= 0
##$YMIN_p= 0
$$ End of Bruker specific parameters
$$ ---------------------------------
##NTUPLES= NMR FID
##VAR_NAME=  TIME,          FID/REAL,        FID/IMAG
##SYMBOL=    X,             R,               I
##VAR_TYPE=  INDEPENDENT,   DEPENDENT,       DEPENDENT
##VAR_FORM=  AFFN,          ASDF,            ASDF
##VAR_DIM=   8192,          8192,            8192
##UNITS=     SECONDS,       ARBITRARY UNITS, ARBITRARY UNITS
##FACTOR=    0.0002944,     1,               1
##FIRST=     0,             0,               0
##LAST=      2.4114304,     0,               0
##MIN=       0,             -88940,          0
##MAX=       2.4114304,     125679,          0
$$ Real data points
##PAGE= N=1
##DATA TABLE= (X++(R..R)), XYDATA
$$ [...]
2155c34m67r1R32m68j15J087n15o7J000p47k55J531m06p89Q70L29r43Q04P55j495
2175F16L60J288j180J43J185j196k11Q73m09q04R60l82l77J65R5n31M44m39m22
2194A78J36J03k96J7Lr03P25j4j172P15J00j244O43M51r09k4J012j074l93J014
2214i32o48m93J302o56q14J062L96j218J072K7j277R96R78j037L48O54p19K54
2232g05P80l0l55Q58j81k75N64k27k36P46R1k74N17j49l04Q00l79l66P64q7p39
2253H13Q91M9p95O99L85j253K68O48q85k0Q22r73p21J648p49j192J123k25o74
2272a41N91l31j008N73K72p31k19L57n22J82L75q26P3L34o50K08M71o64o3Q60
2292h59j001J34Q97q42J88P79o90J15O26J27p51N24O69j014P04J034j566P25J171
$$ plain form
2155 -334 -801 -892 40 -428 -543 544 29 -38 962 215 -40 1491 1085 296 1166 1495 552 1356 2111 616
2175 616 976 2264 1084 1227 2412 1216 1005 1878 1469 665 1625 1243 866 1031 1126 595 1039 600 178
2194 178 314 417 121 138 141 -762 -37 -51 -1223 -508 -408 -1652 -1009 -558 -1467 -1491 -479 -1553 -1946 -932
2214 -932 -1580 -2073 -771 -1427 -2241 -1179 -783 -2001 -929 -902 -2179 -1183 -205 -1242 -894 -240 -959 -705
2232 -705 75 45 -310 548 367 92 656 429 193 939 1030 756 1273 1124 820 1620 1241 875 1639 1552 813
2253 813 1704 1753 958 1657 2042 789 1057 1705 820 800 1622 649 -72 1576 827 -365 758 533 -141
2272 -141 450 119 -889 -316 -44 -775 -994 -637 -1159 -977 -602 -1428 -1355 -1021 -1671 -1463 -992 -1656 -1719 -859
2292 -859 -1860 -1726 -829 -1671 -1483 -704 -1394 -1279 -653 -526 -1277 -753 -84 -1098 -394 640 -926 -201 970
2311I70j182M26P55j038L11R33p67K05N41jk22M99R4l82J58P64j099L96L68q90
2331H39Q52j55j111Q30K24q98O92k42p16N46m9p55L26K95m55o42R37p94j151J894
2351D67j57j848J223j23j273J496m18j068P89o1m38O4Q0n3j92O53J22j075N00
2370a312M14p30J008j24p88J358o28j12Q54j041L36R81m02l79M73L21L5K27J69
2389F60l19KJ210p40o48J820j746L73J976k058K74J274j119M2N54p21J03L36L09
2408A582n05m72R44o74k07J092j354j22J151j491L01M22j336J238J76j345P28
2425A28m44m29N36k52l77l38L75K04q02K83M66j180J308k36j844J571Q69k075
2443b237J236J44j106R83L50m36k7K27M95o63L61M69j070J055Q98j379Q89J05
$$ plain form
2311 970 -212 214 969 -69 242 1175 408 613 1154 1153 931 1430 1524 1142 1300 2064 965 1361 1729 839
2331 839 1691 1536 425 1255 1479 581 1273 1031 315 861 812 57 383 678 223 -419 518 -276 -1427 467
2351 467 310 -1538 -315 -438 -1711 -215 -633 -1701 -912 -973 -1411 -1347 -1267 -1320 -1512 -859 -737 -1812 -1312
2370 -1312 -898 -1628 -620 -744 -1532 -174 -802 -914 -60 -1101 -765 216 -186 -565 -92 229 264 491 660
2389 660 341 343 1553 813 165 1985 239 612 2588 530 804 2078 959 1001 1555 834 937 1273 1582
2408 1582 1077 605 1549 875 668 1760 406 284 1435 -56 245 667 -669 569 745 -600 128
2425 128 -316 -745 -209 -461 -838 -1176 -801 -597 -1399 -1116 -650 -1830 -522 -758 -2602 -1031 -162 -2237
2443 -2237 -1001 -857 -1963 -980 -630 -1066 -1093 -866 -371 -1034 -673 -204 -1274 -219 679 -700 189 294
2461B94q16J328n03n61J332o72N4R98o89nL52J10r3j11K08K8n69Q11l26o52J506
2482B024q25n09J010j235k02J399j072m39N88j07k18J57p0n75m01J029o23q33
2500i02J106n69n27J173j041o40J201r28m8N51q33K68K94m00J43j18m6R2L17q0
2520i87o39M41P08q84N59Q92j769P86J025j358N88Q59o57K57N09l10k55O56L30
2539G51n85K85P12p40L50P69j199N17P92r97O77j08n55P24ok83J48J15n81J71
2559I57J83m16j48O67k96o84R22o77q82J517o74j071J346o38q87R80k89q30N24
2578c96L52p77k27N51o22J78P20r16l63O72j73o88R04l99l51P68j76o75P95j04
2598i27n2N71j22n02M81k6r6J18O84m98J98O86j054M62Q95r83K65P76n80J49Q29
$$ plain form
2461 294 -522 806 303 -258 1074 402 456 1454 765 760 1112 1222 1129 1018 1226 1254 685 1496 1170 518 2024
2482 2024 1199 690 1700 465 263 1662 590 151 739 632 414 571 501 -74 -475 554 -69 -902
2500 -902 204 -365 -892 281 -760 -1400 -199 -1127 -1175 -624 -1457 -1189 -895 -1295 -1152 -1270 -1316 -1224 -907 -987
2520 -987 -1626 -1185 -477 -1361 -802 90 -1679 -893 132 -1226 -638 221 -436 -179 330 20 -235 421 751
2539 751 166 451 1163 423 773 1542 343 860 1652 655 1332 1224 669 1393 1387 1104 1252 1367 786 957
2559 957 1140 724 576 1243 947 263 1185 508 -374 1143 469 -602 744 106 -781 199 -90 -920 -396
2578 -396 -44 -821 -1048 -497 -1119 -941 -221 -1137 -1500 -828 -1001 -1689 -785 -1184 -1535 -767 -943 -1618 -823 -927
2598 -927 -979 -408 -530 -1032 -551 -577 -673 -555 129 -369 -171 515 -539 -77 818 -165 100 876 296 445 1274
2619A274n06m94R86k19o41R99K4n77J55L09n69J57N52n32j66N76n33J31J45l98
2639F73M0K14m93k86K81l37j43M59o55rJ96j47n31L34Q9n72M7L04o36N08O8q34
2661a430K42P90j043J56Q08q27k86J053l76o59R70j58n59Q70q4l89O91J06q91
2680a016O70J62k59K42N31n48K45L27J4K2K15j71K46J7K4j2N02l71j78N18k46
2701I34j19N66l51l55O20n3p54P20J71p63L07L77o43l6M04o67m59P26m82l77K30
2722dj22k87M11m6n96K94j10n10K14M4l33M11L7p53N69K20q38K27K77n36L41L13
2744g77p24K09J081p57kM43l98p9P31k72l79J125l85n88R35L00q99O04N02o79
2764iM56M18l72P6L53n08K86K80k19L9O1K04j87Q0J02k58J51J99p86Q69m18n66
$$ plain form
2619 1274 768 274 1260 1041 400 1399 1423 846 1001 1310 741 898 1450 918 752 1328 795 926 1071 673
2639 673 713 927 434 148 429 92 -51 408 -247 -256 -60 -207 -738 -404 -315 -887 -840 -536 -1172 -664 -596 -1430
2661 -1430 -1188 -398 -1441 -1285 -477 -1304 -1590 -537 -913 -1572 -602 -760 -1319 -449 -533 -922 -231 -125 -1016
2680 -1016 -346 -184 -443 -201 330 -218 27 354 368 390 605 434 680 697 721 709 1211 840 662 1180 934
2701 934 815 1381 1030 675 1295 1242 488 1208 1379 616 923 1300 657 621 1025 358 -101 625 143 -234 -4
2722 -4 -126 -413 -2 -48 -644 -350 -460 -970 -756 -712 -1045 -634 -597 -1350 -781 -561 -1399 -1172 -895 -1431 -1090 -777
2744 -777 -1501 -1292 -211 -968 -970 -527 -925 -1004 -273 -545 -924 201 -184 -772 163 463 -436 168 670 -9
2764 -9 447 865 493 569 922 414 700 980 761 800 861 1065 878 958 1060 802 953 1152 366 1235 817 251
2786B51Q53l56m98O37j49q38R27m58l34K0J66j17m55M45j95o12P20o55n76J089
2806a35m06q20R72o05l66O23p9j71Q7j41J40L9J26k19nJ15J29l25O20l38L3O31
2828i5p08K54O11m27J69M27o02K67P57l88p1L22K34l05J45L99p56L08R28q71J48
2849G46Q87j361O04P21p73j03L37l20L29j76ql18P6L33n02l61N64m14l3P66j474
2870d80O78J87o35K19k08p15R89O7j178O16k49j0J04K1k82o94R49L5r79R31j05
2891g39p56J113k53r41R34q6k81O96l18n0k3K23K09l43J58N73p86R72l75o01J283
2912F09k57n99J312j022K35Q52o99P8N37l75K47J25l62j0%O79m60m23Q32m74k28
2933E97P83j051k91J321j007m7Q37r52J08L03k05k75k67j26L51o00Q89q76m34
$$ plain form
2786 251 1104 748 250 887 738 -100 827 369 35 55 221 104 -351 94 -101 -713 7 -648 -1224 -135
2806 -135 -541 -1361 -389 -994 -1360 -737 -816 -987 -900 -1041 -901 -862 -736 -955 -960 -845 -716 -1041 -421 -759 -726 -95
2828 -95 -803 -549 62 -365 -196 231 -371 -104 653 265 194 516 750 445 590 989 233 541 1469 598 746
2849 746 1633 272 876 1597 824 721 1058 738 1067 891 883 565 641 974 472 111 675 261 228 994 -480
2870 -480 198 385 -250 -31 -239 -954 35 102 -1076 -460 -709 -719 -615 -594 -876 -1570 -621 -586 -1565 -634 -739
2891 -739 -1495 -382 -635 -1576 -642 -728 -1009 -313 -631 -681 -704 -481 -272 -615 -457 116 -670 302 -73 -674 609
2912 609 352 -247 1065 43 278 1130 431 509 1046 671 918 1043 681 671 671 1350 890 467 1299 825 597
2933 597 1380 329 38 1359 352 305 1142 190 298 601 396 121 -146 -272 79 -521 368 -508 -942
2952i42J230q47k86P36p00J23M36j035N81K0m11M47j04o70P09m1k25j59K33M78
2972d27o18N99J88q97P86M11j074O30N15r63J005J01n21O1K25K79j02J22Mj36
2992A88N24M12n32n0N21n47O37j15o89P41j83k77O72m93j85O10m70k05K07k91
3012D75J07k02L40m89j34N17k50p64R44n58m94Q38p08l15P24m80l13N26ln92L40
3033d91M7j53n07N55j80n20P72n86n3P08m55l60P32o17L45L10k14n1N04m06K89
3054c31j87J60n3L50L98n25N63L01p53M66M95o85K42M07l32o5P08m44r6K71k59
3075F31N3L77J06n50O36k41n61L47K96n74J13Q0o58J97K75l30K43k22P8j53k3
3096A20k62L7K33n08mM70l92n72N83k09l43M41r0o09M30m6m57R8K65k79J62L55
$$ plain form
2952 -942 288 -559 -845 -109 -809 -686 -250 -1285 -704 -684 -1095 -648 -752 -1422 -713 -754 -979 -1138 -905 -427
2972 -427 -1045 -446 -258 -1155 -369 42 -1032 -402 113 -850 155 256 -265 -204 21 300 198 320 324 188
2992 188 712 1124 592 542 1063 516 1153 1038 349 1090 907 630 1302 809 624 1234 764 559 766 475
3012 475 582 380 720 231 97 614 364 -400 544 -14 -508 330 -378 -693 31 -449 -762 -236 -239 -831 -491
3033 -491 -444 -597 -1104 -549 -729 -1249 -477 -1063 -1116 -408 -863 -1223 -491 -1108 -763 -453 -667 -718 -214 -620 -331
3054 -331 -518 -358 -411 -61 337 -188 375 676 -77 389 884 199 441 848 516 451 1159 715 619 890 631
3075 631 684 1061 1167 617 1253 1012 451 798 1094 520 633 713 55 252 527 197 440 218 296 143 120
3096 120 -142 -105 128 -380 -384 86 -306 -878 -295 -504 -847 -406 -496 -1105 -675 -721 -1178 -1080 -815 -1094 -932 -577
3118e77m34N8M89l51k62Q03o16L1N91j68j41L75Q6k79K58K64k47K72N5r2L53k9
3140D39r3K29N3k95L85j08j69L51J71k91k38O23k73k62O91l14o28N42n9n01M77
3161G30K55p63L96j8l60J95Q6q01M19K59m99j17L55m16L80j54l17k30k79N51m48
3182g76j32k48p1Q85n50j09r7K17j87K40K25m08P80k40o56N50M59p31K67M45n06
3203f43J40M63j97j89P58k86k08M32O3m64O39J04n25M05L03k88m9L41k05L5K89
3224I18k46K22j70k73J33J86j27j7K39k34j78L67l78l8K08n49L8M06l50k02L90
3245C45j07m31l6K12l08J67J85n54r2M98n21q0M50m66pJ71k12k57O36l29l63L73
3267g26j00K15j06J91r9R4J96m77L37J64j80j44O04q27Q42K20q88R80M9M81m09
$$ plain form
3118 -577 -1011 -953 -464 -815 -1077 -274 -890 -859 -268 -436 -577 -202 -116 -395 -137 127 -120 152 207 115 468 439
3140 439 346 575 628 333 718 610 441 792 963 672 434 1057 784 522 1213 899 271 813 754 253 730
3161 730 985 222 618 600 240 435 521 -280 139 398 -101 -218 137 -279 101 -53 -370 -600 -879 -328 -776
3182 -776 -908 -1156 -1227 -342 -892 -1001 -1098 -881 -1068 -828 -603 -1011 -231 -471 -1127 -577 -118 -849 -582 -137 -643
3203 -643 -503 -40 -237 -426 332 46 -162 270 333 -131 508 612 87 492 795 507 458 799 594 629 918
3224 918 672 894 724 451 584 770 643 626 865 631 453 820 442 404 612 63 101 507 157 -45 345
3245 345 238 -193 -229 -17 -325 -158 27 -527 -619 -121 -642 -722 -272 -738 -745 -574 -786 -1043 -407 -736 -1099 -726
3267 -726 -826 -611 -717 -526 -625 -531 -335 -812 -475 -311 -491 -635 -31 -858 -16 204 -684 296 345 826 417
3288D17p14K32K27L73k0j70J27N26q45O80J83m53j40M58l99K97J31p06O40k87
3308E57k1J48j54J84K5k12j68k52R3J53m99J84L29m41J75m5p81P50n02j4N40l64
3330c15m17J34L4k12K0M0L00n19M10Jm72N38N2o13O81l41k88P33m66R4O52k33
3352a87k25L56k41Q4j26J61K43j69K45M4r8Q11p37p7O89n03J28L66o43K81N16
3373I18m50K49M8r7j29l3J95k08l20P63m05L8L39o78J09N33p91lL98k94Kj76j80
3396a72P7Q8J28l19q5N0j36l2O3o21K21L71n72O44k40m54P31j98o48O77Rl93L11
3419e00Nj14p9K45J46m27L16K77n29O48M4m77N00O7m14N33j61k38O62k37n6J61
3441C72j53L16k87L03lj95L34J85n07N40m40p8O33l09k71L43k14l30N47n10l9
$$ plain form
3288 417 -297 -65 162 535 515 345 472 998 153 833 1016 563 423 881 482 779 910 204 844 557
3308 557 536 684 530 714 739 527 359 107 200 353 -146 38 367 -74 101 56 -725 25 -477 -491 49 -315
3330 -315 -732 -598 -564 -776 -756 -716 -416 -935 -525 -524 -996 -458 -406 -1019 -338 -679 -967 -234 -700 -606 46 -187
3352 -187 -412 -56 -297 -213 -339 -178 65 -104 141 185 87 898 161 84 773 270 398 764 121 402 918
3373 918 468 717 765 668 539 506 701 493 173 936 531 569 908 230 339 872 81 78 476 182 184 8 -172
3396 -172 -95 -7 121 -198 -283 -233 -369 -401 -338 -959 -738 -367 -939 -295 -535 -989 -258 -456 -1104 -427 -418 -811 -500
3419 -500 -495 -609 -688 -443 -297 -724 -408 -131 -660 -12 32 -445 55 122 -292 241 80 -158 504 267 211 372
3441 372 219 535 248 551 548 353 687 872 365 905 465 387 1020 711 440 783 569 239 786 276 237
3462B37L69j56k03l44M72l88J5M28m38m9J96n20J0O37o85r9O53o00j83K61k74
3483f61K49k66N8n8J20O3j59k66M83k77J46Q2k76M2L86m23K24L72o53M07K79k46
3505c74N5N20k5l95L99l7m63P09J47p13L02O49o14M11j26k09J87L24l12K96J22
3526H53j58k12K47j04k48J1J72j56K18j42m40K83K5l38K35N1k08N5j2l99L08J06
3548A47k95Q5k90q7R7K33o59K94K10j22j29K53m15j58K93J54q07L07N50m28J02
3569f65L68l07QK60j95K62J01j47j0J3K88l57L62j97J45Q5p5K2M62j08j78L69
3591E06j29o9L92l10j84M63j35MJ72K3k37LN22l88j28M41m00l16N49l95q3K14
3613E15k11k72L57n9j63l5K3k50M2N4l33R7P8j07J80l9l64K30j13j28j37J20J5
$$ plain form
3462 237 606 450 247 -97 375 -13 2 430 -8 -57 139 -381 -371 266 -419 -518 135 -465 -648 -387 -661
3483 -661 -412 -678 -620 -678 -558 -495 -654 -920 -437 -714 -568 -486 -762 -720 -334 -757 -533 -161 -814 -407 -128 -374
3505 -374 -319 201 176 -219 180 143 -320 389 536 -177 125 774 160 571 445 236 423 747 435 731 853
3526 853 695 483 730 626 378 389 561 405 623 481 41 324 349 11 246 297 89 144 132 -267 41 147
3548 147 -148 -63 -353 -440 -343 -110 -769 -475 -265 -387 -516 -263 -678 -836 -543 -389 -1196 -889 -339 -767 -665
3569 -665 -297 -604 -596 -336 -531 -269 -168 -315 -325 -312 -24 -381 -19 -216 -71 14 -61 -39 423 315 137 506
3591 506 377 308 700 390 206 669 534 538 710 733 496 499 1021 633 505 946 546 230 779 384 301 515
3613 515 304 32 389 330 167 132 155 -95 -53 1 -332 -235 -157 -264 -84 -123 -487 -257 -370 -498 -635 -515 -500
3636e00k36K99K9k94K20J47l25M22j44l25M23J24m33L09j4m04P13j02k82L64K16
3657B07n06j13O37J1k39L81n5l51L73mr0L84j39j17K21J17k88K44k62J58R7R7
3679G63l60J87p0j80j00N16k73l68O81m36m94P01k52k29Q3j25QJ95l72k8J66J99
3701B12o38L92k37k17Q9J55j79N5Pj38j99N90m83J08j9j14J95l2q9J8O6k7k43
3724g28L49%J47q8K77l84L87R9l36M57M3k25L20l15o8K68K34j97J58J40K8j50
3746D16L04J09l53K48k0l90K51L5j73J99k6j83M10l81N7l43P1N6J90k58j77Q5
3768A27j9p7l13L98o5m54N41l02l53P78p04J01M1l38J38J02j58l3J73j82L02l57
3790f54J49j10m9M17m41j45N43j29k40P65o02M7L91j62J19K12k27K20j81J95L8
$$ plain form
3636 -500 -736 -437 -408 -702 -482 -335 -660 -238 -382 -707 -284 -160 -593 -284 -298 -702 11 -91 -373 -9 207
3657 207 -299 -412 225 236 -3 378 323 -28 345 341 251 635 496 379 600 717 429 673 411 569 666 763
3679 763 403 590 520 340 240 756 483 115 796 360 -134 567 315 86 169 44 52 247 -125 -153 13 212
3701 212 -426 -34 -271 -488 -399 -244 -423 -368 -361 -499 -698 -108 -591 -483 -502 -616 -421 -453 -542 -524 -458 -485 -728
3724 -728 -379 -379 -232 -320 -43 -427 -40 59 -277 180 223 -2 318 3 -65 203 437 240 398 538 566 416
3746 416 720 829 476 724 704 314 565 600 427 626 600 417 827 446 503 160 231 287 477 219 42 127
3768 127 108 31 -282 116 51 -403 138 -164 -517 261 -443 -342 -301 -639 -501 -399 -557 -590 -417 -599 -297 -654
3790 -654 -505 -615 -664 -247 -688 -833 -290 -419 -659 106 -496 -449 -58 -220 -101 111 -116 104 -77 118 156
3811A56o5L76k70k89M15p7K42M34o00m0M58m65L88j80o5J09R8j63k55L10O8k12
3833C73j99O47m51k40N99o43J68K48n26L23m7l33K51j13k94L10l88l5L44m05K85
3854a26k52K8J2k54K06N7m00M34r7l71O21j35n05L09r0k78M73J9j88J66k3L46
3876d8l66M07j56l29O68k50k53O16j49k66O26k86J79J34o03M29j13J81K7j95M19
3897F72j2l05K48j91j52N63l34qJ29k81q5L42k47Q7O2n15J21J30N6l0j72K49j83
3920A44l12L96m88L3M61n50J9L85m23K01K05m95l8J81l60J68q9J4L0L6N0j60K1
3943e71J06L7k19K81o6K02j8l42N12k4m02N65k01k04J81K31J52k06J66J3j71K30
3965B52J15o8K72j00l69M53j60j03L35j25l4J81n9k15o7J31Q4j20j88K07j50J48
$$ plain form
3811 156 91 467 197 -92 323 246 488 922 322 282 740 275 663 483 418 527 625 462 207 517 585 373
3833 373 174 821 370 130 729 86 254 502 -24 299 252 -81 170 57 -237 73 -315 -350 -6 -411 -126
3854 -126 -378 -350 -338 -592 -386 -329 -729 -295 -392 -763 -142 -277 -782 -473 -563 -841 -368 -349 -537 -371 -394 -48
3876 -48 -414 -7 -163 -492 176 -74 -327 289 140 -126 500 214 393 527 -76 353 240 421 448 253 672
3897 672 660 355 603 412 260 823 489 481 610 329 244 586 339 426 488 -27 94 224 280 250 78 327 144
3920 144 -168 228 -260 -227 234 -316 -297 88 -335 -134 71 -424 -462 -281 -641 -473 -562 -548 -518 -482 -432 -592 -571
3943 -571 -465 -428 -647 -366 -432 -230 -248 -590 -78 -102 -504 61 -140 -344 -163 68 220 14 180 193 22 252
3965 252 367 299 571 471 102 555 395 292 627 502 468 649 590 375 308 439 523 403 215 422 272 420
3987D20m8l64L44q6j97m1Q5J27j57j75N7r7r7j80K58N7k24K13k25l74L4M62j58
4010c66q9J85k24J09J90n60K40L03j11m40M46j58k3J02J1j20J68K33N9l80N04
4031G9l34JK23L3Q3K2m2K44J58j29L5P4j5K4Q8j64j39N04m03k04M81J15m68L18
4055E84o5k61K62m6k49J95J5k73n3M25l06j22L25m15j79M84l36j35J47k7m17L51
4077i6j5l32J68n2K7j6j98K43J35j84k72J49J45l3j79M8K41j94M71o16J27K36
4099a97q1p7R2j6K03M5N6j38J25o4p5L31kj57J54l0K38l72K81P4M6J67l15J98
4123D86r1J31r6p1K40j59J9j07q9L13k79j27N9M26l30qj07j19j4P1N0n21O04m22
4147a41NR1p1j28L13l35KJ3P3k24P1Q7k13l9J48K26m54J45K6j22j00J50J51j72
$$ plain form
3987 420 372 8 352 266 69 28 113 240 83 -92 -35 -132 -229 -409 -151 -94 -318 -105 -330 -704 -670 -208 -366
4010 -366 -455 -270 -494 -385 -195 -755 -515 -212 -323 -763 -317 -475 -498 -396 -385 -505 -337 -104 -45 -425 79
4031 79 -255 -254 -31 2 85 107 65 309 467 338 373 447 432 456 544 380 241 745 342 138 619 734 266 584
4055 584 519 258 520 474 225 420 435 162 109 534 228 106 431 16 -163 321 -15 -150 -3 -30 -447 -96
4077 -96 -111 -443 -275 -327 -300 -316 -514 -271 -136 -320 -592 -443 -298 -331 -510 -462 -221 -415 56 -560 -433 -197
4099 -197 -278 -355 -263 -279 -76 -31 25 -113 12 -52 -127 204 202 45 199 169 407 35 316 390 436 603 288 486
4123 486 395 526 430 359 599 440 459 352 263 576 297 170 229 655 325 317 210 91 77 148 198 -323 281 -141
4147 -141 -136 -45 -116 -244 69 -266 -264 -251 -178 -402 -331 -244 -457 -496 -348 -122 -576 -431 -405 -527 -627 -477 -326 -498
4171d98J04NM9J90j64K3J27O3rj66K35P1J3k66L99J69k74J66L2n0r3K00j10L30
4195E46k1k78L8L56k23k77K18L6k23K08j61p1L20N5k76NJ18j17L42m96r5j3J23
4218A14J28k86Q8j16kJ94q1j08J51l47NK07j78l87J65K5l6J96j9p5k08K58n7r0
4242d59K50l77L86j07p9L9J73l2j56J22m9L24l1J97j40Q3j67o6k2J24J26j07L02
4265C34j59l0P2o9K24L2j59J94j1k24L18j19j90J42J92K9l65J08J4j16j25N7J70
4288C19k87M08o08K26M0j40L06j47l65k7J74k6J66k57k2J64k56P8l54L95Nl85
4310e93J68J73l03M00j65j75K74k33K7K36j81k86L57k1J76l30J95J22l7N5R3j8
4332f6J93j08m0J47p2J30J76Oj96J72l02K52J13N2J44j27j43K23j4J9m2k48L48
$$ plain form
4171 -498 -394 -389 -340 -150 -314 -291 -164 -101 -110 -276 -41 30 43 -223 176 345 71 237 269 219 126 326 216 546
4195 546 525 247 285 641 418 141 359 395 172 380 219 148 468 523 247 252 370 253 595 99 4 -9 114
4218 114 242 -44 44 -72 -74 120 39 -69 82 -265 -260 -53 -231 -618 -453 -428 -464 -268 -287 -362 -570 -312 -369 -459
4242 -459 -209 -586 -200 -307 -386 -347 -174 -206 -362 -240 -289 35 4 201 61 144 -23 -89 -111 13 139 32 334
4265 334 175 145 217 148 372 404 245 439 428 204 522 403 213 355 547 576 211 319 333 217 92 149 319
4288 319 32 440 -168 58 98 -42 264 117 -248 -275 -101 -127 39 -218 -240 -76 -332 -254 -608 -213 -208 -593
4310 -593 -425 -252 -555 -155 -320 -495 -221 -454 -427 -191 -372 -658 -301 -322 -146 -476 -281 -159 -196 -141 -48 -66
4332 -66 127 19 -21 126 54 184 360 366 170 342 40 292 405 457 601 474 331 554 540 559 517 269 617
4355F17n84J06M33o16L39O9k13J41J42m45L6K09Ql31J80J38l06q4J66l05K29J25
4377E4o85N92j34l10L1Q6J43n2J07k73M9o9j01K18j91L72j68OQ7j2RK59l17J04
4401a95K68k76L27j20l2j3jJ1K67l42Q6K34j04L0m2J84K15p26P34qm85M48K8k17
4425B71O6lj32K39O7l2mj81O6r6MM1k33N7J41j87N5j96J00O7j94M5k4l33K44O3
4451h9j48o3J53j32j19J23M8J29o56P72l71j73J59K66k54j0J83p4k6j75L75k35
4473c17J41J13P7J24r5j09L2j77o3N68l89j19J001k39r4P2j89J62k00j97L31o03
4495a70M34P52j322N69J49M55m33r3p1N6P4J97l60jK80m43J45k09K08J40k54K64
4517C67l31k24r8J63L9l5O7l88L59M6l1K7k17l41N09l57J37J67q8l1J01j08k15
$$ plain form
4355 617 33 139 572 -44 295 364 151 292 434 -11 25 234 242 -89 91 229 -77 -161 5 -300 -71 54
4377 54 -631 -39 -173 -483 -452 -366 -223 -275 -168 -441 -392 -461 -562 -344 -535 -163 -331 -325 -238 -250 -241 18 -299 -195
4401 -195 73 -203 124 4 -28 -41 -42 -31 236 -106 -20 214 110 140 98 282 497 -229 505 497 12 460 488 271
4425 271 337 334 202 441 508 476 472 291 357 261 265 306 73 130 271 84 139 -57 43 110 -84 -39 -63 -396 -152 -89
4451 -89 -237 -300 -147 -279 -398 -275 -227 -98 -754 18 -353 -526 -367 -101 -355 -365 -182 -256 -282 -457 -82 -317
4473 -317 -176 -63 14 138 43 -66 -34 -211 -274 294 -95 -214 787 548 454 526 337 499 299 102 433 -170
4495 -170 264 1016 -306 263 412 867 434 341 270 326 400 597 237 236 516 73 218 9 217 357 103 367
4517 367 36 -188 -286 -123 -84 -119 -52 -440 -81 -35 -66 -39 -256 -597 -88 -445 -308 -141 -229 -260 -159 -267 -482
4540d82J62r7J08l7J67k81J50K04P2j88J67l66K78L9K18m20L61L1k28J67rR4J16
4563B26K04l32J81PJ65R4k60J97q5k41K80k02J72j43K6Q7n8P1J2L1k87J69J31
4586D45m06J13K57oj52j62J66j36m8j36K26n9m86J75Q8k16K8J51j36K48j06k26
4608c78J70n7l34K2L04J61l58L41r4j12n9J57j84J81J59q6L8j26m6J91J95j78
4630i3oJ36j19J8L97p4l11K76k31N1K42j3O8J9m2l32M99j10r6r5K06o4k5J29j08
4655C22M9n9j58J45j00K13l12k00K49L0j78J20k03L40l38R3m1r0R6j70J82l12
4677c22L24k58j35J4R1j25J03k2n7K79M7q4l81J28j14K47n9Q3L0l9J18k39K30
4700a41j18J34l3L02j57j45L86l21j50J14J52m7J75oL72j77m02K51K0l7O5R5j4
$$ plain form
4540 -482 -320 -417 -309 -346 -179 -460 -310 -106 -34 -222 -55 -421 -143 -104 114 -306 55 86 -142 25 16 110 226
4563 226 430 98 279 286 451 545 285 482 397 156 436 234 406 263 289 376 318 389 401 432 145 314 445
4586 445 39 152 409 403 251 89 255 119 71 -65 161 102 -384 -209 -121 -337 -309 -158 -294 -46 -152 -378
4608 -378 -208 -265 -599 -577 -273 -112 -470 -129 -223 -335 -394 -237 -421 -240 -81 -167 -129 -255 -301 -110 85 -93
4630 -93 -99 37 -82 -64 333 259 -52 224 -7 44 286 273 341 360 318 -14 485 375 279 184 390 326 301 430 322
4655 322 371 312 154 299 199 412 100 -100 149 179 1 121 -82 258 -80 13 -28 -118 -22 -192 -10 -322
4677 -322 2 -256 -391 -377 -286 -411 -308 -330 -387 -108 -61 -145 -526 -398 -512 -265 -324 -241 -211 -250 -132 -371 -141
4700 -141 -259 -125 -158 144 -13 -158 228 -93 -243 -129 23 -24 151 145 517 340 -62 189 209 172 237 332 318
4723C18K0m7P2m10N71k50j47J90J40mm02J63K3Qj68J51k13l1J78l98O53m85KK70
4747B04j10m16L21k59M6Q5j17J76j75K17j89Pj96J54k93M61q7j56R6j92l4K57
4769b00j76J85l4k10J50K85l69N0R8K82j02n3l1J3M4K65J00m40N89m13r7L25j79
4792H2L29q9l29L99j1l08L17j03J90r1l65K49k65L39P2k66J16J46k66L6j01k05
4814a24K40l6mJ37j41p5J37kj30o0k26L37l80M7K36m35K8K06p0Q6Q8j69J71k24
4838c63Q5K92m50K81p9M8ll77M00K60l45K0J67r1J51j23j42J79k7Q6K47l63M6
4861a01J60M6J41j83K14R3j94P5l0J62l2l25J84N74l17k55J32M8Rj07j42J55o4
4884B43n3M0j07P9K94m30J61j68j06J03n8L4K69o50L41L2l67R5K98l67P2%j81
$$ plain form
4723 318 338 291 363 -47 524 274 127 317 457 453 51 214 237 245 77 228 15 -16 162 -236 417 -68 -66 204
4747 204 94 -322 -1 -260 -214 -129 -246 -70 -245 -28 -217 -210 -406 -252 -545 -84 -171 -327 -231 -423 -457 -200
4769 -200 -376 -191 -225 -435 -285 0 -369 -319 -221 61 -41 -94 -125 -112 -68 197 297 -143 446 33 -64 261 82
4792 82 411 322 -7 392 381 73 390 287 477 386 21 270 5 344 416 150 266 412 146 182 81 -124
4814 -124 116 80 76 213 72 -3 134 132 2 -58 -284 53 -327 -280 -44 -479 -451 -245 -315 -229 -141 -310 -139 -363
4838 -363 -278 14 -436 -155 -234 -186 -189 -566 -166 94 -251 -231 -64 -155 -4 -127 -269 -90 -117 -31 216 -147 -101
4861 -101 59 105 246 63 277 370 176 251 221 383 351 26 210 784 467 212 344 392 401 294 152 307 243
4884 243 190 230 123 202 496 66 227 59 -47 56 -2 32 301 -349 -8 24 -343 -248 50 -317 -245 -245 -426
4907d26OJ07L1K48n22K65l42K84L02n04n3M08j14j64K51o2J76J58l14j3J44k9
4929a63N8K09K04m25K97l31J33J66j56j13K41J95j1r1J22k1m2j51K00N8j53K64
4951D90m49J22J92j82K32j20k82K85P5k51K2K56j72K7Pj31m4K9m0j15j2M7J02
4974H8j91ol02L35j90R0L6j63K1m9j22O6L74n80L34m8J67k52k6pK39j27K08j31
4998b36O9K01k54j28L99l76M41k23OK51J2k61o8M20rj40O6L7K5k70M08k81j2K69
5022C46k81K9L56j31k56K97j11m8J23j86J93r8l2j66M36k04R9M7q7l44J16m8j94
5045a44K84J87l58m5j03m9MJ57r8K2m8J02p6k01K34l5K12k90J20k37p6J77J84
5068g7J38k87Q8Q2j26L0K8L0N2k23J27J5N6J34j32K17n7L7k75J7M99j91j02o1
$$ plain form
4907 -426 -420 -313 -282 -34 -556 -291 -633 -349 -47 -551 -604 -196 -310 -474 -223 -285 -109 49 -265 -278 -134 -163
4929 -163 -105 104 308 -117 180 -151 -18 148 -8 -121 120 315 304 213 335 314 272 121 321 379 226 490
4951 490 41 163 355 173 405 285 3 288 363 112 134 390 218 245 252 121 77 106 66 -49 -61 -14 88
4974 88 -103 -109 -411 -76 -266 -176 -140 -303 -282 -331 -453 -387 -13 -593 -259 -307 -140 -392 -418 -425 -186 -313 -105 -236
4998 -236 -167 34 -220 -348 51 -325 116 -107 -101 150 162 -99 -167 253 244 104 170 207 232 -38 370 89 77 346
5022 346 65 94 450 319 63 360 249 201 324 138 331 233 201 35 471 267 366 413 326 -18 98 50 -144
5045 -144 140 327 -31 -76 -179 -228 -224 -67 -165 -143 -191 -89 -165 -366 -132 -167 45 -245 -125 -362 -438 -261 -77
5068 -77 61 -226 -138 -56 -182 -152 -124 -94 -42 -265 -138 -123 -67 67 -65 152 95 132 -143 -126 373 182 80 19
5092A9R2K30n2j67R3K40k29L77m92L04R8n00J03O3J32m5M9k37J57J85l96J00L67
5115D91n04J4o7L73m09J12J21P5m10J014o02n99J65j03j79Q06o42O28o97r13J600
5136B74k33l65kp3L64p0R8l73M9O2r0L96j45k7K0J30j15l4j69L70k15r2K39k02
5160b03N19L7m89J79J29J14j11NJ34j76J03n2j52K37J24j51M4j50p4K62j58Q5
5182B56K6n0k11K42j42O3j7j92K34j26j8r5l7J28k29N7O7m81J91M69j47l28K15
5205a25j72j62J36MJ81r8K2J21l13n0L43k96J96j67qL90k53k2N2J24j46K60j1
5228FR5k87L69k88O3J23J43K3j87J47k9Q1j98J37L0M4j99P3K85k62j06J93ko3
5252A91m2J06Q4n5j13J19j22j72J11K74n13K96p6J34r9k35J4N6J75k16J16r0N2
$$ plain form
5092 19 111 341 289 122 215 455 226 603 111 415 513 13 116 179 311 266 315 78 235 420 24 124 491
5115 491 -13 1 -66 307 -102 10 131 206 -204 810 208 -391 -226 -329 -508 298 -344 284 -413 -1326 274
5136 274 41 -324 -326 -399 -35 -105 -7 -380 -331 -269 -359 37 -108 -135 -115 15 -100 -134 -303 67 -148 -240 -1 -203
5160 -203 316 353 -136 43 172 286 175 180 314 138 241 189 37 274 398 247 291 141 67 329 171 256
5182 256 282 232 21 263 121 184 167 -25 209 83 65 -30 -67 61 -168 -111 -44 -525 -334 135 -12 -340 -125
5205 -125 -297 -459 -323 -319 -138 -236 -214 -93 -406 -456 -113 -409 -213 -380 -388 2 -251 -273 -221 -97 -243 17 6
5228 6 101 -186 183 -105 -42 81 224 247 60 207 178 259 61 198 228 272 73 146 431 169 63 256 254 191
5252 191 149 255 339 284 171 290 168 -4 107 381 -132 164 88 222 123 -112 -98 -42 133 -83 33 -57 -5
5275ek3k33J23k70K61J18l10J25J84k08J44j42l31K78K20k46K4j9J9Q0%N2j02
5298b61J63l2j28J73O3j63K50m03K55K84j49Q1J01j33r9J89j40J57k05L04K19
5319E26k55P9m2n5k23qK75J36q0k06P8j36J97r8P3j64j1N0L02m34J8J46K3j72
5343A9j95J45K01k85j89N39j38j37J88k39p6K69l14Q0l2M0k04m8K45j5m20M89
5365g7j20M4M8k48J09J44k50R0J15j39K56p6m2L6k30L88j64L72k4l27K89K9j79
5388D4N5oM9K72m6k48O6J01Q3j7n8k75K44k9l7J43q6o3o0o2K5q9L38j42k56K91
5414B37j96n8K43k83J01m0N1J38k30J80l15N1J08l57R1K1M5R6k96J63N3l1j64
5437c92M2J14J52j57J10J92m31L9Q0pK01P3l29J85J35j07J47j1o7p1J38lj26K19
$$ plain form
5275 -5 -28 -261 -138 -408 -147 -29 -339 -214 -30 -238 -94 -236 -567 -289 -69 -315 -291 -310 -291 -211 -211 -159 -261
5298 -261 -98 -130 -258 -85 -22 -185 65 -338 -83 201 52 133 234 101 2 191 51 208 3 307 526
5319 526 271 350 308 253 30 22 297 433 353 147 225 89 286 188 261 97 86 136 438 4 22 168 191 19
5343 19 -176 -31 170 -115 -304 235 97 -40 148 -91 -167 102 -212 -132 -164 -124 -328 -376 -131 -146 -566 -77
5365 -77 -197 -153 -105 -353 -244 -100 -350 -260 -145 -284 -28 -104 -146 -110 -340 48 -116 256 232 -95 194 223 44
5388 44 99 93 142 414 368 120 186 287 370 353 295 20 264 235 198 341 255 192 132 70 95 6 344 202 -54 237
5414 237 41 -17 226 -57 44 4 55 193 -37 143 -172 -121 -13 -370 -279 -258 -213 -117 -413 -250 -197 -228 -392
5437 -392 -350 -236 -84 -241 -131 61 -370 -331 -251 -258 -57 16 -313 -128 7 -100 47 36 -31 -102 36 33 -93 126
5461A26m9l61O29l50J65r0K23k83J16j3J07j42Q8lP3j09J92Lj19J6j11J72j01
5484A79j39K25o2j78J28R8j41K4k4J3p4m5j50J99k4k88J20J19j90J30j02k7Q1
5507a28k35K57j58Q0P4p2N8J29k57k8J15o3R2j45K82l05%J34l6J91k83J59R9J3
5531b7l5K01q9R1J52k42J27Q3j17p3J51m1r0L54j30k53K14L2n5K03k36k45L78
5554C53l82K3K03m1J7j15M43m36O0k15L45l38m4j1L78k51p8K09r0j01j49L6J01
5577h3j14N9M8J54j94L4j48J47n3k16K20q7L5Rl3L4J7j6L3Q6o4Mk31L2K71n0J57
5604E1k05M21l00j15J12k6m1ML52j66l7K65L0j96J63k28M08n62L43j17K3K8K36
5627D43j96jj27M6J93j50k68J17K5Q0k23N1P8j77J72N0j79K07m7m89M04J9r8K5
$$ plain form
5461 126 77 -284 345 -5 160 70 293 10 126 113 220 78 166 163 236 127 319 322 203 219 108 280 179
5484 179 40 265 203 25 153 251 110 134 110 123 49 4 -146 53 29 -259 -139 -20 -210 -80 -182 -209 -128
5507 -128 -363 -106 -264 -184 -110 -182 -124 5 -252 -280 -165 -228 -136 -281 1 -304 -304 -170 -206 -15 -298 -139 -40 -27
5531 -27 -62 139 50 141 293 51 178 261 144 71 222 181 91 445 315 62 276 308 253 456 220 -25 353
5554 353 -29 -6 197 156 173 58 501 65 125 -90 255 -83 -127 -138 240 -11 -89 120 30 -71 -220 -184 -83
5577 -83 -197 -138 -90 64 -130 -96 -244 -97 -150 -366 -146 -233 -198 -189 -222 -188 -171 -187 -154 -68 -132 -128 -359 -327 -56 -106 51
5604 51 -154 267 -33 -148 -36 -62 -103 -99 253 87 50 315 345 149 312 84 492 -70 273 156 179 207 443
5627 443 247 246 119 165 358 208 -60 57 82 162 -61 -10 68 -109 63 113 -66 141 94 -395 9 28 -70 -45
5651d5j44Q0K33j52j20k22N1K45J38j84rq2P8k84K32l0L0O2N6k61R5J47L5j23
5675a74Q2j27J67l8J13lj24J97j89k54J82K03r3M46o57L18J65L0k41Q0K3J90l44
5698d8J31QN3P4n6R5J60j59l75K96K02k26K6j09r7J89p6J0m10J69J6L58l15J07
5722B3M4l80K2J84J53n6k49L14k67L8r2O1j08J52qL28m47p2M01j52j14L15j42
5745e2j96k8N4N1j28R0J66k03J0J74jJ46n8m5O6j34J31L14j93Q7L7j07k1j0J49
5770B99K24k82J08l03P7Q9l0J66j54p5J40L37m91k15L00n3r7j8J27J83l02o4M7
5793A3J95p9k09n9M0P0m2j0K1Jj49j25K62Q3m35L59J7j20n4J47k53l9K48J81k09
5818a46J29k58o1N42l3m44K28J0M4j36j20L30J15j95R5J18j30J74k86J99J52l58
$$ plain form
5651 -45 -189 -109 124 -28 -148 -370 -319 -74 64 -120 -129 -211 -133 -417 -185 -215 -185 -123 -67 -328 -233 -86 -51 -174
5675 -174 -92 -219 -52 -90 23 20 -104 93 -96 -350 -168 35 -58 388 -269 49 214 244 3 83 106 296 -48
5698 -48 83 91 144 218 162 257 417 258 -117 179 381 155 181 72 -25 164 88 98 -312 -143 -127 231 -84 23
5722 23 67 -313 -291 -107 46 -10 -259 55 -212 -174 -266 -205 -313 -161 -169 159 -288 -360 41 -111 -225 90 -52
5745 -52 -248 -276 -222 -171 -299 -209 -43 -246 -236 -62 -63 83 25 -20 46 -88 43 357 164 251 288 181 160 150 299
5770 299 523 241 349 46 123 212 182 348 194 119 259 596 105 -110 190 137 40 22 149 332 30 -34 13
5793 13 208 129 -80 -139 -99 -29 -71 -81 -60 -59 -208 -333 -71 12 -423 -64 -47 -167 -221 -74 -327 -366 -118 63 -146
5818 -146 -17 -275 -336 206 173 -271 -43 -33 11 -125 -245 85 200 5 100 218 88 262 -24 175 327 -31
5840c1K68k37o6L36j8j09K46j85J06n3k2j90L5K9K67r4q3J98k59K16k87j1Mm5
5864A5k8N7k75M04k48r8L4L2j0j62L04k33K17k74M31n50N15o1m46Q8K87m08L11
5887i8j49L9q4J3R4r5J90l73N62j69j01L1K9j1PK4RK31p1N0j18J44j60rK53j95
5913D3O0j4J21j54K55k4k59J81J42j65kK6j21L4J60J14j23j25M0j39M2p1j53K41
5937A09m0j30R8J60q6j3J21k11J13j21j40n2L68Lm20J79J38k31M5k0Ok36K49l60
5961d71L83N2p4q8P1J70j99K85j71P7j64n2l7m5K75j27Q5k07j41L70J20j60M2
5984fN0j71J64J77k29J79k5l22N28m1J31j59m2N0J8j79R9q6N8Qn5K39k50J00k75
6009c9J10P7M09l42j24J48j86J76k67J60j05J62j4l33l9J25R7j27K90l85K2RK5
$$ plain form
5840 -31 237 0 -66 270 252 143 389 204 310 257 235 45 80 109 376 282 199 397 138 354 67 56 60 15
5864 15 -13 44 -231 173 -75 -173 -139 -107 -117 -279 25 -208 9 -265 166 -384 131 70 -376 -288 -1 -409 -98
5887 -98 -247 -208 -292 -279 -185 -280 -90 -463 99 -70 -171 -140 -111 -122 -115 -91 -82 149 78 128 10 154 -6 -15 238 43
5913 43 103 89 210 56 311 287 28 209 351 186 184 210 89 123 283 397 274 149 189 50 92 21 -132 109
5937 109 69 -61 37 197 111 98 219 8 121 0 -140 -192 176 179 -241 -62 76 -155 -110 -130 -124 -360 -111 -471
5961 -471 -88 -36 -110 -198 -127 43 -156 129 -42 35 -129 -181 -218 -263 12 -115 -30 -237 -378 -8 112 -48 -6
5984 -6 44 -127 37 214 -15 164 139 -183 345 304 435 276 234 284 302 123 222 136 194 202 147 386 136 236 -39
6009 -39 71 148 557 215 91 239 53 229 -38 122 17 179 165 -168 -207 -82 15 -112 178 -207 -185 -176 -151
6032a51m1p0n5K96j31M5K1o5K4m1Jj03K08q3N0l9J32lk02J46M2n4J55m1k10K36
6058F7J42M2k92L25j8k33O0j4k05K44j25J47j49L05l1N7l19J50J48j1j14j03P3
6081A46R3j83K16o1J6j99k20L94j07R8n4k65J62n1k66L12l08J65j8K25l2k19k52
6104d08K21j10j00M21l62J36j5j40K61J09j81J25k0l6lN4J90m6j29K58j38j11
6126b4l6j1j25L61r3j99J82%J31o3n7R5m5L39m06J44j23q6N8J79Lk30K97j64j78
6151e1J67k1oL65l05N9j12J17p1k5j59K5M4J12J37j60q2o8J83k08R3j28m2Q7q0
6176a29J84j88J24k34l8J5K3J58J07l97K59l1l06Q7J97J56m5n0m8j42K39j60m7
6199b66L15k54P4O8J85j61J64j52J0L3R8j28J02j01L69j28P5l42R5j10L5K36l14
$$ plain form
6032 -151 -192 -262 -317 -21 -152 -107 -86 -151 -127 -168 -167 -270 -62 -145 -95 -134 -2 -5 -207 -61 -19 -73 82 41 -169 67
6058 67 209 251 -41 284 266 33 93 79 -126 118 -7 140 -9 296 265 322 3 153 301 290 176 73 146
6081 146 239 56 272 211 227 28 -192 202 95 193 139 -126 36 -15 -281 31 -277 -112 -130 95 63 -156 -408
6104 -408 -187 -297 -397 24 -338 -202 -217 -357 -96 13 -168 -43 -63 -99 -102 -48 142 96 -33 225 87 -24
6126 -24 -60 -71 -196 165 72 -127 55 55 186 123 66 161 116 455 49 193 70 -16 42 221 224 -6 291 127 -51
6151 -51 116 95 89 454 149 208 96 213 142 117 -42 -17 27 139 276 116 34 -34 149 -59 34 -94 -136 -49 -129
6176 -129 55 -133 -9 -243 -281 -266 -243 -85 22 -375 -116 -147 -453 -366 -169 -13 -58 -108 -156 -298 -59 -219 -266
6199 -266 49 -205 -131 -63 122 -39 125 -27 -17 16 114 -14 88 -13 356 228 303 -39 56 -54 -19 217 -97
6222i7K72j26J75K4r1J56k54K8K60k70r6L43k15j55j01R2P1J55j76J16j56L9l30
6245c36K02j02k87K83J56JJ58k27j10N8J99n20K34j02K4K03J24k92M9J23J09m1
6267i4JL8l65M73%m71L98J4j51J60oJ97m09K22L7k46O30o74K38j19M51m47M72
6290C49o3J43n8l71J35j6J46j63j02j92M20j03l5K72k34m4j97J1K67j21O5j66
6312e7K47k52r6K76m5O9l98L89j93j05J33m0l98M4k6N50j07j46l8j3j03K58K84
6335B33k70p00J53O7N85j93l4M67o5k4o24L32m37J16N86m08l16Q35k80J08j39
6356hM1k60O93l47J50l72K6N10m14m63M56l04K57M3j67R51j040R43q80L09j3M70
6378E81j246L54O76j18K26n50K32Q7p4r04N71J56p68P86J45j00k68l80L13N78
$$ plain form
6222 -97 175 49 224 248 157 313 59 87 347 77 -19 324 109 -46 -147 -55 16 171 -5 111 -45 -6 -336
6245 -336 -134 -236 -523 -240 -84 -83 75 -152 -262 -204 -5 -525 -291 -393 -369 -166 -42 -334 -285 -162 -53 -94
6267 -94 -93 -55 -420 53 53 -418 -20 -6 -157 3 -3 194 -215 7 44 -202 428 -246 -8 -127 324 -123 349
6290 349 286 429 371 0 135 119 265 102 0 -192 228 125 90 362 128 84 -113 -102 165 44 109 -57
6312 -57 190 -62 -158 118 73 142 -256 133 -60 -165 -32 -72 -470 -426 -452 98 -9 -155 -193 -206 -309 -51 233
6335 233 -37 -737 -584 -517 68 -125 -159 308 243 219 -405 -73 -510 -394 192 -216 -532 303 23 131 -8
6356 -8 33 -227 466 119 269 -103 -77 433 19 -444 12 -292 -35 8 -159 792 -248 695 -185 124 111 581
6378 581 -665 -311 365 247 473 -77 155 242 168 -736 -165 -9 -777 9 154 54 -214 -594 -281 297
6398B97m26l37J46N18m7m09K75l09O9L68k87k30O27m41L1j33N79k39n04K96q6
6419b42N59m67k13M45J72N1n32J36O2P15p64M69o54J20j52K48L66o00M65l42K08
6440E0K5J95q0J1n4R5J4q0MR0j33j37K75k41J32r3N6J30j93R0O5j10J8J3j2k6
6466A04j52Q3j22K1R2j43R6q3l0m2k2J18J26j37L3j71K09m4o6J46j26p8Q7OJ69
6491G4k13q7n5J06R6L2Q5q1P2J6K9j09J77j47J6N4K8J43j97JJ16j37J28j67K20
6516B00J31j74J8K5l48L46R8n0r8R8n7N8j41R0L3l89K12J63r9O8Q6r7Lk10o7M05
6542C04k24k81J05p2J36J8k21J40P4k01k03L24J4k9K62l10J48k64K3L29n5r2l58
6565d33nM64j89k4K35k59J15J20k99J24M5l51M10J83l17L25M6j67k17L50q8L8
$$ plain form
6398 297 -129 -466 -320 198 151 -258 17 -292 -223 145 -142 -372 255 -186 -155 -288 291 52 -452 -156 -242
6419 -242 317 -150 -363 82 254 305 -227 -91 -29 686 -78 391 -263 -143 -295 -47 319 -281 184 -158 50
6440 50 75 270 190 201 147 242 256 176 180 270 137 0 275 34 166 73 129 259 66 156 221 111 129 142 130 104
6466 104 -48 35 -87 -66 26 -117 -21 -104 -134 -176 -198 -80 46 -91 -58 -229 -20 -64 -130 16 -110 -188 -101 -95 74
6491 74 -139 -226 -281 -175 -79 -47 38 -43 29 45 74 -35 142 -5 11 65 93 236 39 40 156 19 147 -20 200
6516 200 331 157 175 200 -148 198 296 246 148 246 189 247 106 196 229 -160 52 215 116 184 270 173 176 -34 -101 304
6542 304 80 -201 -96 -168 -32 -14 -235 -95 -21 -222 -425 -101 -87 -116 146 -164 -16 -280 -257 72 17 -75 -433
6565 -433 -438 26 -163 -187 48 -211 -96 24 -275 -151 -106 -457 -47 136 -181 144 190 23 -194 156 68 106
6587A06PP7j38R9J07k22m2M45m47j8J89J34j47J54k52J85J5m64N96l15J70k0j36
6610H3n2j36K59k86J16k8K73j09k92P4N2R8m8j59J08J52l36R1o6j19K71J94n75
6633d35J33K07k3k14J59R0j64K65J2j24l6j90J63k8L5k4N8J08p7K08k33J23k3
6656a0mR2m8L2L11l38r5k7n9M21j92j1J31O1q0l8j8j65J83l9j31J49r8o5J89R0
6682B41Rj8p4m6ll6J39Nj96Q7k00O9OJ90m44L89j00m3K63j47k35J43j85rJ79k05
6708b21j30M57l04Q8Qo3p8J22K24Rj41j90M2ON8O0j80M67m94J56Q9j79L01j41
6732c4K07j0N2p6l29Q6K65j01%J82r4r9J04j80L6J73l01M29K08n00J46j32m3J9
6756Hj4J03J91m05K5P6j30L53M2k15j46J80j40K17k15oK58m82J42J0MJ31L3j35
$$ plain form
6587 106 113 190 52 151 258 36 -6 439 -8 -26 163 297 150 304 52 237 252 -212 384 69 239 219 83
6610 83 31 -105 154 -132 -16 -44 229 120 -172 -98 -46 52 4 -155 -47 105 -231 -140 -206 -325 -54 140 -435
6633 -435 -302 -95 -118 -332 -173 -83 -247 18 30 -94 -130 -320 -157 -185 -150 -174 -116 -8 -85 123 -110 13 -10
6656 -10 -14 78 30 62 373 35 -60 -87 -146 275 83 72 203 264 184 146 128 -37 146 107 -24 125 27 -38 151 241
6682 241 250 232 158 112 109 73 212 217 21 108 -92 -23 -17 173 -271 118 18 -25 238 91 -144 -1 -186 -195 -16 -221
6708 -221 -351 106 -198 -110 -102 -165 -243 -121 103 112 -29 -219 -177 -171 -113 -53 -233 234 -260 -104 -15 -194 107 -34
6732 -34 173 163 215 139 -190 -104 161 60 60 242 148 49 153 -27 9 182 -119 310 518 18 164 32 -11 8
6756 8 -6 97 288 -117 -92 -16 -146 207 249 34 -112 68 -72 145 -70 -76 182 -300 -158 -148 -144 -13 20 -115
6780a15o8oJ58J07l47J77O4p9O5O4K41p8k09n3O9j5o4l4KJ66j50q4M34k46j37
6805a38K01J93K7l63j73K17Q7QQ9r2R1l05j0J60N1Q1n5J04p5j4J98k55L7k70P25
6830E19j69l61L99l15Q7j1Q4k89PL25j92k89M2K87K4j36p1N1k14m3r1N04k71j46
6854b69J48L2J39j79l2k29M46j01k11r5N61j35l89j2J87J55k20J04j0M9k67K74
6876e4o9k9K18k06J49qK48k00J54l77J11J13j40L30P3q5j60m4K58k69J07j33J21
6899A08p2K99j91j51K67k77J37rj59p2L9J06J53k50K23k60J05J78j03K70m45J8
6921h6J90j4k69N7J81l1k18R9r4J9J88k18R7L2j40J90L2k01M1N26n56O0R0L8l22
6946c09O3J91k41J40K99j49j33J17J23j7ok27L95j88R8j89p4L99k84J94M3l63
$$ plain form
6780 -115 -183 -189 -31 76 -271 -94 -30 -109 -44 20 261 183 -26 -79 -10 -25 -89 -123 -121 45 -105 -189 245 -1 -138
6805 -138 63 256 283 -80 -253 -36 51 59 148 56 147 -158 -168 -8 43 124 69 173 98 84 282 27 64 -206 519
6830 519 350 -11 388 73 160 149 233 -56 -49 276 84 -205 -163 124 148 12 -59 -8 -222 -265 -356 148 -123 -269
6854 -269 -121 -89 50 -129 -161 -390 56 -45 -256 -351 210 75 -314 -326 -139 16 -204 -100 -110 -61 -328 -54
6876 -54 -123 -152 66 -140 9 1 249 49 203 -174 -63 50 -90 240 313 228 68 24 282 13 120 -13 108
6899 108 36 335 144 -7 260 -17 120 111 -48 -120 -81 25 178 -72 151 -109 -4 174 71 341 -104 -86
6921 -86 104 90 -179 -122 59 28 -190 -91 -185 -166 22 -196 -99 -67 -207 -17 15 -186 -145 381 -175 -115 -25 13 -309
6946 -309 -246 -55 -296 -156 143 -6 -139 -22 101 84 78 -149 246 58 156 -33 -107 292 8 202 245 -118
6968a18K29pQ5qk5j3j23J93j65L47j47j84q9k12Q4J51K68p8l32M1Q9o4K23k26
6992h1R8J11P3k00j55j0M1M6J79k65J03J39l08J07j2k82Q3M4N3K07j87J37j5J90
7016I6o0j61n3K66j52Q0n5o7K55k56R0J24j37QK70k83l5K29Jj67J88k59K03J22
7040B47p8O6k0k47L45j12J71n09J25K49r5q5J11j48R5n6J16Pj30J42o0J7j81k03
7064b33O7N09l17k0o4K00l77L03l16J33J41r0k8j33J3Q4J36k21K63k37K60j56
7086h3M4j37J66J45k80k7K03j37j2LJ55j74k0J22j17P9o1L1J13L2j18PP1J80p
7111A78p6j89K40j17L6N8l8K01l01J84n7k62N88k53m69L64j18J51MJ54k23k27
7133a72K88N9L9kk51j17J8J44m8K15m57K40j11R2rK9M6J66k66k59K47k71K11L02
$$ plain form
6968 -118 111 104 189 181 156 143 20 213 48 395 248 64 -25 -237 -153 -2 266 188 -144 -103 -14 -78 145 -81
6992 -81 17 128 201 1 -154 -164 -123 -77 102 -163 -60 79 -229 -122 -134 -416 -333 -289 -236 -29 -216 -79 -94 96
7016 96 36 -125 -178 88 -64 16 -39 -106 149 -107 -17 107 -30 -22 248 -35 -70 159 160 -7 181 -78 125 247
7040 247 169 235 215 -32 313 201 372 -137 -12 237 142 57 168 20 115 59 175 182 52 194 134 151 -30 -233
7064 -233 -166 343 26 6 -58 142 -235 68 -248 -115 26 -64 -92 -225 -212 -128 8 -213 50 -187 73 -83
7086 -83 -39 -176 -10 135 -145 -172 31 -106 -118 -115 40 -134 -154 -32 -149 -70 -131 -100 13 45 -73 -66 5 185 178
7111 178 102 -87 153 36 72 130 92 293 -8 176 119 -143 445 192 -277 87 -31 120 124 278 55 -172
7133 -172 116 175 214 212 -39 -156 -138 6 -42 173 -284 -44 -155 -63 -72 -43 3 169 -97 -356 -109 -380 -169 133
7157A33j22l12Q5K16O2j7j8r2R2j66Q7j61K82rJ6j54J55j30r5K5J04l0p3K78k33
7182g7L8l6q2J96K4j47J09j59L04K15j82q3L7q4K14l44O2R2J10k89L4K94L9m24
7206a39J03J43J27k06l8R7N1k14K47J1l13J93j59J48o5R2Rj73J23l19L69l31K39
7229ej14m5Q1J45k23l9Ol3J79j67%N8Nq3mR5J88oj22Q6j26J15k13L24p4n5J62
7256A35r7p8K29l7j1J28k87M7J45o2p0M7J04k4rj50J63P6l4r8r2L73m35J80N5
7281A98O1l50N3K73k50K68m04J44m5p1J68p0J83l86K18l7n1J17J14m5k28m8J77
7304a1m3k44J63K2jj04J46K31k77j0J3p1J65J97j23j33j70L42N1r0L2j73J04J10
7328A26k65K53j03J8k72K86J03Lp5J23j39j72N72l20j85J45j47J64J71j28j50
$$ plain form
7157 133 11 -301 -216 0 62 45 27 -65 27 -139 -52 -213 69 60 76 -78 77 -53 -148 -123 -19 -49 -122 156 -77
7182 -77 -39 -75 -157 39 63 -84 25 -134 170 385 203 120 157 73 287 -57 5 97 207 -82 -48 246 285 -139
7206 -139 -36 107 234 28 -10 87 138 -76 171 182 -131 62 -97 51 -14 78 87 -86 37 -282 87 -244 -5
7229 -5 -119 -164 -83 62 -161 -200 -194 -227 -48 -215 -215 -157 -152 -235 -239 -144 44 38 -84 2 -124 -9 -222 102 28 -27 135
7256 135 38 -40 189 152 141 269 -18 29 174 112 42 89 193 169 160 10 173 249 215 117 25 398 -37 143 198
7281 198 259 -91 -38 235 -15 253 -151 -7 -52 -123 45 -25 158 -228 -10 -47 -98 19 133 88 -140 -188 -11
7304 -11 -54 -298 -135 -113 -114 -218 -72 159 -118 -128 -115 -186 -21 176 53 -80 -250 92 143 53 85 -88 16 126
7328 126 -139 114 11 29 -243 43 146 149 74 197 58 -114 458 138 -47 98 -49 115 286 158 8
7349HJ01K18j83j6P3k63K40j73p9p5L04j76R9N9r0j41J0J58Q1j39r4J46Kj61K8
7374f3L49j58k04oJ29k40J66k58M51j70P0j46j40K67j48p0PJ2q5K65k73m3K10
7397g8Q6M9M3k52J86l08K4K17j27J77k3K6Pl8K6O5R2k00K82j73o8J78P2j63J4
7422A14j78K87J19k43J4j83L15j10j90R2J98n2j22m5J27j16j54J42mr0l5k2Q1
7445e5J1j68K86J41j32J3j98ok3K49j18j98j12K88j39R3l0k00K93j20O4o0Q7m3
7469g7k02P2K68j89J30q6O6j43O4K1J69k58J62k0j2o1O7K23l02K82M3l17K22Q0
7493B02j81K8J26l9k2k5R3K9j29J10q4J58j0k70L38l57K71m22N05l23P6j18j3
7516e7j43J91J47j95Q9o4M3%k88K06N3j01J41K5p1J37l25j35L44K29m13K7M2K4
$$ plain form
7349 8 109 327 144 128 201 -62 178 5 -74 -149 155 -21 78 137 47 -94 -84 74 155 16 -78 68 70 -91 -63
7374 -63 286 128 -76 -82 47 -193 -27 -285 166 -4 66 -80 -220 47 -101 -171 -164 -152 -237 28 -245 -288 -78
7397 -78 8 57 100 -152 34 -274 -250 -33 -160 17 -6 20 27 -11 15 80 172 -28 254 81 13 191 263 100 114
7422 114 -64 223 342 99 113 -70 245 135 -55 37 235 183 61 16 143 27 -127 15 11 -79 -114 -136 -55
7445 -55 -44 -212 74 215 83 96 -102 -108 -131 118 0 -198 -310 -22 -161 -68 -98 -298 -5 -125 -61 -121 -34 -77
7469 -77 -279 -207 61 -128 2 -84 -18 -161 -97 -76 93 -165 -3 -23 -35 -96 -29 194 -108 174 217 -100 122 202
7493 202 21 49 175 136 114 89 182 211 82 192 108 266 256 -14 324 -33 238 -184 321 -2 74 -44 -57
7516 -57 -200 -9 138 -57 32 -32 11 11 -277 -71 -18 -119 22 47 -24 113 -212 -347 -3 226 -187 -160 -118 -94
7540i4k6R1k90L06Nj64J38N5j16k19M01mj28j1J77k24L29k58J41q8l8J39J40j52
7564A10Q1k22K98k05K91j67J08j69P0J2j07L1n2J10k03R3P5J13k11k8K10j45l41
7587b48K72J4j27K62k29j16M23r5j14l9j03J03Lj92K29j40n3L9J0J8j51j02P0
7610b66J78q0j41J0K57m8k83M72j72N5j19K93m00J07J85j11J89j75K85m27m4M66
7632B31m2k06k67L86J10r7J3l5o5o7J90K0j09L0j90Q6K45O7k93j33J67j0J36r5
7656G2j79Q8P4J23Qm1N0j47j60J33j6R9j3k52JK43O7l15r9J70J41j19m6P3n6n3
7682a54J2O8J13l39M7J31K0J83n6j46Q4k82J77P1jK80l65r0L15l65L53k79L67
7705A44K25N1k28K03J32n89J01J34k14M7Q6r1Q9j27K59j84L84l41O8J80l34q2
$$ plain form
7540 -94 -120 -29 -319 -13 -8 -172 -34 21 -95 -314 87 83 -45 -56 121 -103 226 -32 109 21 -17 122 262 110
7564 110 191 -31 267 62 353 186 294 125 195 207 100 131 79 189 -14 79 154 267 56 28 238 93 -248
7587 -248 24 38 -89 173 -56 -172 251 156 42 3 -100 3 6 -186 43 -97 -150 -111 -101 -83 -234 -336 -266
7610 -266 -88 -168 -309 -299 -42 -90 -373 99 -73 -18 -137 156 -244 -137 48 -63 126 -49 236 -191 -235 231
7632 231 189 -17 -284 102 212 115 128 93 28 -39 151 171 62 92 -98 -12 233 300 7 -126 41 31 167 72
7656 72 -107 -19 55 178 186 145 195 48 -112 21 5 104 91 -161 -160 83 150 -165 -264 -94 47 -72 -118 -45 -101 -154
7682 -154 -142 -74 39 -300 -253 -122 -102 81 25 -121 -37 -319 -142 -71 -72 208 -157 -247 68 -297 56 -223 144
7705 144 369 420 192 395 527 -62 39 173 -41 6 92 1 90 -37 222 38 422 81 149 329 -5 -87
7727h7J35K16J1k23m9K06k36J76j68j55K76M7l21n8J16J63oj32L0j6j09L51q0
7750H7k35J61k0n6j21J80J84K8j78j82j55J01O4K02j69K8P3m9j30m8J03l1J02
7773f1j57K69L4l9p9kJ06j24Qo5J01l6K15k18j21J01jJ77J30J18j52j1j19R0n
7798A59K1o3o1K39j62k51K12j22N6J9J01k7J13l87L8J14r8j81L81L3p4k6j10j9
7822i5M0J02m8Rk11j2J32R4j73k5P4P1j87J53j16L6P8J28k0M7j15k80M16j06q4
7847i2M22m40n3J05K21n6o1k83K33Q5l0j24Q5K14j98L56l24k02K66ol73N23l46
7870g8J40J55j1k57L40k13j55M1J86k14J91kj42o3M2R9j36m3K13j6o6k9R0K8j57
7895e7jj00J79j51J51j1m2j82R4K48p9k01J64k1l32P7L02O3l89M61n16L44k6l73
$$ plain form
7727 -87 48 264 275 52 3 209 -27 149 -19 -174 102 149 -172 -230 -114 49 43 -89 -59 -75 -184 167 87
7750 87 -148 13 -7 -63 -184 -4 180 208 30 -152 -307 -206 -142 60 -109 -81 -8 -57 -187 -235 -132 -163 -61
7773 -61 -218 51 85 46 -33 -35 71 -53 -45 -110 -9 -45 170 -48 -169 -68 -69 108 238 356 204 193 74 164 159
7798 159 180 117 56 295 133 -118 94 -28 28 47 148 121 234 -153 -115 -1 -99 -280 101 134 60 34 -76 -95
7822 -95 -55 47 -1 8 -203 -215 -83 11 -162 -187 -113 -42 -229 -76 -192 -156 -78 50 30 77 -38 -318 98 -8 -92
7847 -92 330 -110 -163 -58 163 107 46 -237 -4 81 51 -73 12 226 28 384 60 -142 124 118 -255 268 -78
7870 -78 62 217 206 -51 289 76 -79 -38 148 -66 125 123 -19 -82 -40 59 -77 -120 93 77 11 -18 72 100 -57
7895 -57 -58 -158 21 -130 21 10 -32 -214 -120 128 49 -152 12 -9 -341 -264 38 101 -288 173 -343 1 -25 -398
7919c98O9N54l35m6N6N63R1k5K2Q8o59N66m80n00Q66p80M25k43O55m22K69l90
7941e4K56p5J30l21K49q4j03J5j25K34j33K39j56j5J34N9m6k58N8n3J24O1j55
7964a9j58n3L57k23Q3j05L6o2J58j41J09m4L8j08J12J31k15R9q3%n4O8J1J95l67
7989b35J20J50k21m4K32L7j2j7l40M24K4k31J67K90l56j02J0P0Q0ll10N39m02
8012a30L22j79n3P7P0J30k04j29J91J15k31K6N0R3j98L8O2N4j47J77j54O7n2L0
8036B5k83K86k14J47r9K62mq5k6N8j90k1j41K34k68M21l79J50j33P2J12j78K46
8059hJ63k52M0J42l09J41K37j03j11N9j42O8n2P0Q4q9o6Q6m8j05K15j43RJ95n8
8084B3N8j48K51m02L34J8j33Q5l7K25j31K39k41j94K12K9R3j89j72J81l5J18q1
$$ plain form
7919 -398 -329 225 -110 -156 -100 463 554 529 551 639 -20 546 66 -434 432 -348 77 -166 489 67 336 -54
7941 -54 202 127 257 -64 185 101 -2 13 -112 122 -11 228 72 57 191 250 204 -54 4 -49 75 136 -19
7964 -19 -177 -230 127 -96 -13 -118 -82 -144 14 -127 -18 -62 -24 -132 -20 111 -104 -5 -88 -88 -142 -74 -63 132 -235
7989 -235 -115 35 -186 -230 2 39 27 10 -330 94 118 -113 54 344 -12 -114 -104 -34 46 43 -267 272 -130
8012 -130 192 13 -40 37 107 237 33 -96 95 210 -21 5 55 148 -50 -12 50 104 -43 134 -20 47 -5 25
8036 25 -258 28 -186 -39 -138 124 120 35 9 67 -123 -144 -285 -51 -319 102 -277 -127 -260 -188 -76 -254 -8
8059 -8 155 -97 -57 85 -224 -83 154 51 -60 -1 -143 -75 -127 -57 27 -62 -128 -42 -90 -195 20 -123 -114 81 23
8084 23 81 -67 184 -218 116 134 1 86 49 274 143 382 141 -53 159 188 281 92 -80 101 66 184 103
8107A03J40j71M6R5j55Pr9J01r8P6rJ13l19P6K84k61O4R7j93Q7Q4j12J69j16l40
8132c31M29j06p3j04J01J79R1m29J99j03P6j40J74O6l99J51L13j66O3J36j61m0
8154g4N9o9J92J72j94l4q4r4R1nJ27m9j87L05j46o2J07J18l64R6K93p5J1K2k36
8179h0K33mrk08j5K17j98j13K39N7j31J11
$$ plain form
8107 103 243 72 118 213 58 65 -34 67 -31 45 36 149 -170 -94 190 -71 -7 90 -103 -16 68 -44 125 9 -331
8132 -331 98 -8 -81 -185 -84 95 186 -243 -44 -147 -71 -211 -37 29 -370 -219 94 -72 -9 127 -34 -74
8154 -74 -15 -84 108 280 86 52 -32 -126 -35 -40 87 38 -149 156 10 -52 55 173 -191 -95 198 123 134 156 -80
8179 -80 153 149 140 -68 -83 134 -64 -177 62 119 -12 99
8191I9
$$ Imaginary data points
##PAGE= N=2
##DATA TABLE= (X++(I..I)), XYDATA
0@%%%%%%%%%%%%%Qj6J6j6K1k9L2m0M8n6P2q1R0j06J25j48J70j94K24k56K89l25
35a72L67m14M65n22N84o51P24q06Q96r91J096j210J334j472J623j789J970k169
53a137K391k639K917l227L580l987M459n016N682o497P524q864J0693j3361J7683
68A0201k6284P6229j36168M8904J23583j34877R2513j5256n9144K9726K253R310
80B0990j3543m1713L7846k125k615L194l5154N508M0961m1370o281K5298k7305
93c6309K1206Q248l0954J9686k7966K6051L4301o7566K1756K2409j6830L1834
105E866l9009j56K4830j9772M7200k4464n6304O4304J6256l7381J8002l873k7037
118c1538M0887J6580m5353K0331J9849k2587J1421M07j3206J0325K7637o355l3372
$$ plain form
0 0 0 0 0 0 0 0 0 0 0 0 0 0 0 8 -8 8 -8 13 -16 16 -24 24 -32 40 -41 49 -57 68 -80 90 -104 120 -136 153 -172
35 -172 195 -219 246 -276 308 -343 381 -425 471 -520 576 -634 700 -772 851 -938 1032 -1137
53 -1137 1254 -1385 1532 -1695 1885 -2102 2357 -2659 3023 -3474 4050 -4814 5879 -7482 10201
68 10201 -16083 60146 -76022 -27118 96465 -38412 54101 38845 -20299 9427 11680 20990
80 20990 7447 -34266 3580 1455 -1160 2034 -33120 -27612 13349 -28021 -34302 -9004 -36309
93 -36309 -15103 -6855 -37809 -18123 -46089 -20038 14263 -53303 -31547 -9138 -25968 5866
105 5866 -33143 -33299 -8469 -28241 18959 -5505 -61809 2495 18751 -18630 -628 -4501 -31538
118 -31538 9349 25929 -19424 907 20756 -1831 9590 9997 -3209 7116 34753 28398 -4974
131d974K5711J150j6253K7472k0272Q28K2253k2233J1053q954j8925K4796L376
144B5028o319j1530p521J1332L415l69j8411j2022J9027J2336p932j8440q59j600
158a3865N412J8352k5912j0354K5814k782j2608o138R670l137l22K0192l4155
171b9833J716L2312k8742J4443L850k8209K6094j05r186J0009j0520O735R803
184a633p736q357O073R874l526R710m27j6761O507J7086j770j6385J6551P183
198A6389j7449K2894j0744j8033L2992j0521q905J1483m400P647q363L041j644
211A4387j8237L1176P47k8702J7684p82j3671J0730m79j0991R929N515j5372L440
225E374l349m122J5065j2728j527N649j2794R722Q21o539m586l605J8436j4421
$$ plain form
131 -4974 20737 21887 5634 33106 12834 13662 35915 13682 24735 15781 -3144 21652 25028
144 25028 18709 7179 -342 10990 14405 14036 -4375 -16397 2630 14966 7034 -11406 -12265 -13865
158 -13865 -8453 9899 -16013 -26367 -553 -3335 -15943 -22081 -12411 -15548 -15870 4322 -29833
171 -29833 -28117 4195 -24547 -10104 -6254 -34463 -8369 -8474 -17660 -7651 -18171 -11436 -1633
184 -1633 -9369 -17726 -11653 -1779 -5305 4405 3978 -12783 -6276 10810 9040 -7345 9206 16389
198 16389 -1060 21834 11090 -6943 26049 15528 6623 18106 13706 21353 12990 16031 14387
211 14387 -3850 27326 28073 -629 17055 16273 2602 13332 12853 1862 11791 17306 1934 5374
225 5374 2025 -2097 12968 240 -1287 4362 -8432 1290 2111 -4428 -9014 -12619 5817 -8604
239h604q466J6061j8073J2036J2316k9763K082J7289l631n196P417p439j2775
252b6746K2652L115j9428K620J0008M574q176M029L469j1318J4653n20j0146J5382
266D168n098R43Q304j0717R09L908O739M27k457J231m733J0371m075j0767J8571
281A7724n437n914J7738j5221r830J5874O172j2570L05Q010j4909Q408J1086k0099
295A337N22J1647l539q650M220L803j1510P896P36j8448J4282L062r562K233m847
310f818K606j047J840L51j2968P742L950n493L679r172K801P365o658R50r67m742
326a6581M408J2909p814j5463J5221j438n357J7644j0382j0127J6278K961j2617
339a0358J737J4608r802N00J5078j7789Q72J7951q455l024K189K535J771J981
$$ plain form
239 -8604 -17070 -1009 -19082 -7046 5270 -24493 -22411 -5122 -8753 -13949 -6532 -13971 -26746
252 -26746 -4094 -979 -20407 -17787 -7779 -3205 -11381 -7352 -3883 -15201 -548 -1068 -11214 4168
266 4168 -930 13 8317 -2400 -1491 2417 9156 9583 7126 8357 3624 13995 9920 -847 17724
281 17724 12287 6373 24111 8890 -940 14934 21106 8536 8841 16851 1942 10350 21436 1337
295 1337 1859 13506 9967 1317 5537 9340 -2170 5726 6462 -11986 2296 5358 -4204 -1971 -6818
310 -6818 -4212 -5259 -3419 -3068 -16036 -8294 -4344 -9837 -6158 -15330 -12529 -5164 -11822 -10872 -11839 -16581
326 -16581 -12173 736 -7078 -22541 -7320 -8758 -14115 3529 -6853 -16980 -702 2259 -10358
339 -10358 -8621 5987 -3815 -3315 11763 -6026 -5154 12797 4342 1318 3507 6042 7813 9794
353I794J266r209M935N765m649L767m348L74M003j613J207p247K869M123j648
368I389L430j1156K410Q434j2178P559K407j3861N335O913o816q131J0255N59
382D549j3143Q076k859q162J4034l125j3331L671O482p213K13P508j3090K315
396a4075J1852j0437j045J757J10M825l794L152l395j007R150n811K997j079m368
411a1168J3698n026m303Q717o029M46Q386k932n157P394N374q733J715M163l946
426B599M804O547p057q484J4456K562j5429J5427k536j5189J9405l128r272P380
440A2085m368L751q26n060M319l709K734j208m401M523n327k540O708m865m048
455b232M644l631l824O795q484m09J0550j4422J773R409j1006M057K152m251o34
$$ plain form
353 9794 11060 1851 6786 12551 7902 11669 7321 7695 11698 10085 11292 4045 6914 11037 9389
368 9389 12819 1663 4073 12507 329 7888 10295 -3566 1769 8682 1866 -6265 3990 4549
382 4549 -8594 -518 -3377 -11539 2495 -630 -13961 -10290 -3808 -11021 -10808 -3300 -16390 -14075
396 -14075 -2223 -12660 -13705 -11948 -11838 -7013 -10807 -7655 -11050 -12057 -2907 -8718 -5721 -6800 -11168
411 -11168 2530 -2496 -6799 1918 -4111 -3665 4721 1789 -3368 4026 9400 667 2382 6545 2599
426 2599 7403 13950 6893 -1591 12865 15427 -2 15425 12889 -2300 17105 13977 4705 12085
440 12085 7717 11468 10642 5582 9901 6192 8926 7718 3317 7840 2513 -27 6681 1816 -2232
455 -2232 2412 -1219 -5043 1752 -6732 -7141 3409 -11013 -9240 169 -10837 -6780 -4628 -8879 -9513
470i513k047J1434q029o123J6104j2961j186J3775j2623K276J0808r292k352P758
484a971j890j207L657k650o7L162R39Q78m525M656L025m231N659m182m0Q836q731
501A318O815N57j1642J5161n86r368Q911k927l875M426K178l770m040P841j388
516I611q184O245L24p232O277J901j2813M194Q848j0327J081J961o701M949J017
531A151l133l232m43O337m541j271N02m728R268l650o031O443o925K578P600j0110
547a0185M42M242k603K4L475l072m202P391K554q591J225P309l201j197Q127r124
563g386l978J8697o516p362R738o967L963Q155o844j413J00Q421j99q594P746
578G561l229j173J0867q688m032P103j829L226or315N281N773p532L216Q31r275
$$ plain form
470 -9513 -11560 -126 -8155 -14278 1826 -11135 -12321 1454 -11169 -8893 1915 -7377 -9729 -1971
484 -1971 -3861 -5068 -1411 -4061 -4128 -966 -27 851 -3674 982 4007 -224 5435 1253 1213 10049 1318
501 1318 8133 8690 -2952 12209 11623 2255 11166 8239 4364 8790 10968 7198 3158 10999 9611
516 9611 1427 7672 7996 764 7041 8942 -3871 323 9171 -1156 -75 1886 -4815 134 1151
531 1151 -1982 -5214 -5657 680 -3861 -5132 -4630 -9358 -90 -3740 -9771 -3328 -10253 -7675 -75 -10185
547 -10185 -9743 -5501 -8104 -8080 -4605 -7677 -11879 -4488 -1934 -10525 -9300 -1991 -5192 -6389 1738 -7386
563 -7386 -11364 7333 817 -6545 3193 -3774 189 8344 1500 87 187 8608 8409 -185 7561
578 7561 4332 3159 14026 5338 1306 8409 6580 9806 9800 485 5766 11539 4007 7223 8054 -1221
594a221R562J503r251K368q7K855j408l272L991j1054P718J0248j9548M736O641
609C781j1858R873Q39j2943L799N519j485m498q45K016n55J165P70o004J37P436
625b853l349j827K944o924P879M566j1553O556J028l824R154n586l358P199j154
640a102J462k08j662m24K539Q013p269n608J0513r26m090O840k804o891R636K878
656A0897r670M096K319l671N286j479m872J309M573L64o148K665M6k961O675m742
672D687m888N252j534n7l02m533J602K723j500m665J853n90k889O948m144q068
688a0105P090J737n570J585K507o727J745Q660q740l693R717l741k601M291j911
703e756l202M713L975p864R56O396n262L924J491n613M913J624j692Q74n93J400
$$ plain form
594 -1221 8341 9844 593 2961 2874 5729 4321 1049 5040 -6014 1704 11952 -7596 -2860 3781
609 3781 -8077 1796 2635 -10308 -6509 -990 -2475 -6973 -7818 -5802 -6357 -5192 -4422 -10426 -10289 -2853
625 -2853 -6202 -8029 -5085 -12009 -4130 436 -11117 -4561 -3533 -7357 1797 -3789 -7147 52 -1102
640 -1102 360 152 -1510 -1934 605 8618 1349 -4259 6254 5328 1238 8078 5274 -1617 8019 10897
656 10897 1227 5323 7642 3971 9257 7778 2906 4215 8788 9152 3004 5669 5715 2754 9429 4687
672 4687 -201 5051 3517 3460 3158 -1375 227 2950 1450 -3215 -1362 -1952 -4841 2107 -2037 -10105
688 -10105 -3015 -1278 -6848 -5263 -2756 -9483 -7738 922 -7818 -11511 -1794 -5535 -8136 -3845 -5756
703 -5756 -8958 -4245 -270 -8134 -7178 -782 -6044 -2120 -629 -6242 -1329 295 -1397 -523 -1116 284
719B84J292J548j806j394M118j59J45J595l953J750M301j798l350M201Q3m737
735B120P705k252q362R455K64o719L380N39k754P16L450m564l930P436k505m572
751e93M515l275k502M122q10n021R09K814k594j23j38l305L105l12j521M08k693
768g014R37K699j810k580J344K906l879J127L777o865L088N990o277o43M807r05
784c298k224M644o87n753O974K625o784L835K190l209K410K741l228j247N839
799D828r62l071L819j835L27L300k241j47M60N89J189k15j403j148L487n29l614
816B834L031j430j370M063l121l393L205J331m150J023J811o140K570M798p279
831b217o81M413k867j727K850j300n168N173J664p335L410J768m091L587o84l696
$$ plain form
719 284 1576 3124 1318 -76 4042 3883 4028 5623 1670 3420 7721 5923 2573 6774 6857 2120
735 2120 9825 7573 -789 8666 8930 2211 5591 6130 3376 4092 7542 2978 -952 6484 3979 -593
751 -593 3922 647 -1855 2267 1457 -3564 -2655 159 -2435 -2558 -2696 -6001 -2896 -3208 -4729 -4321 -7014
768 -7014 -6077 -3378 -5188 -7768 -6424 -3518 -7397 -6270 -2493 -9358 -6270 -280 -6557 -7200 -2393 -3298
784 -3298 -5522 -878 -1565 -7318 -344 2281 -4503 -668 1522 -1687 723 3464 236 -1011 4828
799 4828 3866 795 4614 2779 3106 6406 4165 4018 4478 5067 6256 6041 4638 3490 6977 6448 2834
816 2834 5865 4435 3065 7128 4007 614 3819 5150 1000 2023 3834 -2306 264 5062 -2217
831 -2217 -2898 1515 -1352 -3079 -229 -1529 -6697 -1524 140 -7195 -3785 -2017 -6108 -2521 -3205 -6901
847f901K015K057j012j376P16o20J270J441k818P63J738j103J674M03k915P88
863c880M990k198l207N447j900k058P350l289m307O223J245l069J222K120k662
878B027J031N003m922k030O659k173k214L226j972k166M296J70m754K296L22j290
894C509K779l511j407K424q74M03k035p93L40M72J817m896l33L982m236J602J779
911A022p175K977M083n030j253L180k497p67L992k985l939L964K527m116l20K916
927c421l678J466N594o738o85O203l559J709J344l602K951J755R2q28j270L055
943C88N42J38P78k725L001J527j949L100k322k477O835n65o226N101O31m228N479
960G028j161n011L398J803m71l241J310J800m463N066k80q449P282O07o086M941
$$ plain form
847 -6901 -4886 -2829 -3841 -5217 -4501 -5121 -3851 -2410 -5228 -4465 -2727 -3830 -2156 -1753 -4668 -3880
863 -3880 1110 -1088 -4295 1152 -748 -2806 4544 1255 -3052 3171 4416 1347 2569 4689 2027
878 2027 3058 8061 3139 1109 7768 5595 3381 6607 4635 2469 6765 6935 2181 4477 4799 3509
894 3509 6288 2777 1370 3794 2920 3323 1288 495 835 1307 3124 -1772 -2105 1877 -2359 -757 1022
911 1022 -6153 -3176 907 -4123 -5376 -2196 -4693 -5460 -1468 -4453 -8392 -4428 -1901 -6017 -6337 -3421
927 -3421 -7099 -5633 -39 -6777 -7462 -1259 -4818 -3109 -1765 -5367 -2416 -661 -569 -1397 -2667 388
943 388 930 1068 1846 -879 2122 3649 1700 4800 2478 1 6836 6271 45 5146 5777 1549 7028
960 7028 5867 856 4254 6057 5586 2345 3655 5455 992 6058 5778 -2671 4611 5218 -868 4073
976D073k739k998M449j644j902q1r52J904p14k054L06j147J431M95l293J429n35
993c972k203N335m268k817O852n018J13N885p426J565N296l973K67P99N50K06
1009b809k65L843m678n85P850m711j920O374m499k42O089m163j022M066j976Q36
1025B188J240j948J648o00J339J034l453L303m78j684M012m308J019L248n267
1040A293M118M49o216N384P34n548L179M60k952Q49J706k222k458K924M32m600
1056b468K014K398o045K750K945p187L192K457n050K625J28k370J631j049Q55
1071c174q95m40J464k221J820Q24k886K811j25k093L830k245j468M356k085r11
1087c438L671k055j166L915r97j440J515J364j380J08L687k472k053O289k815
$$ plain form
976 4073 1334 -1664 2785 1141 -761 -842 -1794 110 -604 -2658 -2352 -3499 -2068 -1573 -4866 -3437 -3972
993 -3972 -6175 -840 -5108 -7925 -1073 -6091 -5978 -93 -7519 -5954 -658 -4631 -4364 -3565 -3015 -2809
1009 -2809 -3074 769 -3909 -4494 3356 -1355 -3275 3099 -1400 -1642 4447 284 -738 3328 1352 2188
1025 2188 3428 1480 3128 2528 3867 4901 1448 4751 4273 2589 6601 2293 3312 6560 1293
1040 1293 5411 5860 -356 5028 5762 214 3393 3853 901 1750 3456 1234 -1224 1700 2132 -2468
1056 -2468 -454 1944 -4101 -1351 1594 -5593 -2401 56 -4994 -2369 -2241 -4611 -2980 -4029 -3174
1071 -3174 -4069 -4509 -3045 -5266 -3446 -2622 -5508 -2697 -2822 -4915 -1085 -3330 -4798 -442 -2527 -3438
1087 -3438 233 -1822 -2988 927 -70 -1510 5 1369 -11 97 3784 1312 -741 5548 2733
1102B733k937O553l609j798N491k529j652K128J28n80l39J271j596r70K795j643
1118C446j728K416j878j60J645k778l08K619k986L86J691m681K285J868m224R13
1134a474R11j760K2O06K77l469K133K907n747J930K929n559K653K841m771Q58
1150d713L022k330oJ916j730k64K179l31j451Q85J626p29L51J314k547K192K176
1167A560l028J948N49k162L743n54k124K535K18j345K015K35k136R56L014k444
1183B980q82K669j849q45L394j504l562L763J108m488K432R76l666K298J063l251
1199F36J8J808r72j388P58q47j369K333j088j882J193j092L17O10j600q59J244
1216b180j02j043J014j235j512L523r75l532L640J55k504K099R03l010J130L304
$$ plain form
1102 2733 -204 6349 2740 942 6433 3904 2252 4380 4508 3928 3589 4860 3264 2294 5089 3446
1118 3446 1718 4134 2256 2096 3741 963 655 3274 288 674 2365 -2316 -31 1837 -2387 -1474
1134 -1474 -563 -2323 -2301 -1695 -1418 -4887 -2754 153 -5594 -3664 -735 -6294 -3641 -800 -5571 -4713
1150 -4713 -1691 -4021 -4027 -2111 -3841 -4105 -1926 -2257 -3708 -2823 -1197 -1926 -1575 -261 -2808 -616 1560
1167 1560 -1468 480 1029 -1133 2610 2056 -68 2467 2685 1340 3355 3590 1454 2410 5424 2980
1183 2980 2098 4767 2918 2073 5467 3963 401 4164 5272 784 3216 4192 526 2824 3887 636
1199 636 654 2462 1490 102 860 13 -1356 977 -111 -1993 -800 -1892 -1575 -965 -2565 -3424 -2180
1216 -2180 -2282 -3325 -2311 -3546 -5058 -1535 -2510 -6042 -2402 -2247 -4751 -2652 -1749 -4759 -3629 -325
1232c25k907r08L924k181n35L315j319k164L327Q58k411J411J606k634K558J022
1248B637k597J632J124o62M00L43n07M58J350j113o10J367r82O82J177k375M6
1265B370J905j315q74J592j421j450L267j476l372L331k80k917J940K83l179J279
1281c17K153l441r53L241k410j093K720k130j475K282m35j926Q77N55j536J089
1297b799M29k273J261O08l87Q40j077j34J928o93o58J003P12j204J401J355k635
1314b323J042L101k478k62K641j393q99L541j309k336L565J40k566K487J93j601
1330A543J348J327j946m76K367j100r91J915j735k88K350k151o19J400q91k59
1346A794P24j203o02J135o03p87L60o04p41J371p87k149J021J416k671P47J378
$$ plain form
1232 -325 -3232 -4140 -216 -2397 -2932 383 -936 -3100 227 1085 -1326 85 1691 -943 1615 2637
1248 2637 40 1672 2796 2134 2534 2877 2370 2828 4178 3065 2455 3822 2840 3522 4699 2324 2370
1265 2370 4275 2960 2086 3678 2257 807 4074 2598 -774 2557 2277 -640 1300 1583 -1596 -317
1281 -317 1836 -1605 -2558 683 -1727 -2820 -100 -2230 -3705 -1423 -1858 -3784 -2907 -2352 -3888 -2799
1297 -2799 -2370 -4643 -3382 -2774 -3161 -2321 -3398 -3532 -1604 -2297 -2955 -1952 -1240 -2444 -1043 312 -2323
1314 -2323 -1281 1820 -658 -920 1721 328 -571 2970 1661 -675 2890 3030 464 2951 3144 1543
1330 1543 2891 4218 2272 1796 4163 3063 2072 3987 2252 1964 4314 2163 1544 2944 2053 1794
1346 1794 2518 1315 713 1848 1245 458 818 214 -527 844 57 -2092 -1071 345 -2326 -1579 -201
1363b01l747J926K080m073Q33J789k104L61J443j193j339K164J019l035J129J667
1379a281k529J792J359l110J461K129j486M87K05j106J991N78j578J096k7K87
1395B68J078l21k85m63K081K02k425K555n35j939M611j838l331M472n91j733J745
1412C551n80j700J377J586j980j599K341k26j677J571r07k253L245l41l521K062
1428I49p00j062K680k850j012J683n25K43o85j523Q88J72Q56j539j107J700j107
1445b939M86J236l717J428L263k997Q8J842k465J264K553k810m26K031J70l44
1461a337j51J075j827R93L721l791o55M233k247O69J837l222J525K103r93K30
1477B163p58j32K003n52l61p62L82J499q37J94k38j807K881L91l853K185N42k790
$$ plain form
1363 -201 -3948 -2022 58 -4015 -3182 -1393 -3497 -3136 -1693 -2886 -4225 -2061 -1042 -4077 -2948 -1281
1379 -1281 -3810 -2018 -659 -3769 -2308 -179 -1665 -1178 -973 -2079 -88 490 -1088 8 -19 268
1395 268 1346 1025 740 277 2358 2560 135 2690 2155 216 4827 2989 -342 4130 3539 1806 3551
1412 3551 2971 1271 2648 4234 2254 655 2996 2770 1093 2664 1757 -496 2749 2408 -1113 949
1428 949 249 -813 1867 -983 -1995 -312 -837 -594 -1279 -2802 -1914 -1742 -886 -2425 -3532 -1832 -2939
1445 -2939 -2453 -1217 -4934 -3506 -243 -3240 -3152 -1310 -3775 -2511 42 -2768 -3194 -1163 -993 -1337
1461 -1337 -1488 -413 -2240 -1247 2474 -1317 -1972 2261 14 683 2520 -702 823 2926 1933 2163
1477 2163 1405 1273 3276 2724 2363 1601 1983 3482 2645 2839 2601 794 3675 4066 213 2398 2940 150
1495A50L635r18l784K234P19r81n53j92j82o97J669l38m122K859J298l212K006
1512d09o55k808L340R8k614J296r52J97J349j337p69J11N39J496j350n43P32j501
1530c780L565j458j880L221n83j327L088l103M0L840k309j56J654j103L75J293
1546A377L59j642j99L320j532j214K607j945m28M114k662j751L481j554j17R38
1562C152j449L86R43m90r6r24K98N73r60N94j242k30J516j823M27O42k751J749
1580C15J214l558J282J086k249Q13Q29k103j31J471o54j105N77O45j682J143J215
1597h92l132J095J876k511J285R92k057J437Q96j208J09Q20J96j98L32K0j22J061
1615ao0p69J302Q8n61J369n28j139K307j47j253K029l60j533K129k0j819J001
$$ plain form
1495 150 3785 2867 -917 1317 2036 1055 502 310 128 -569 1100 762 -3360 -501 797 -2415 -409
1512 -409 -1064 -3872 -532 -434 -3048 -1752 -2704 -2507 -1158 -2495 -3264 -3153 -2614 -1118 -2468 -3011 -2279 -3780
1530 -3780 -215 -1673 -3553 -332 -915 -2242 846 -2257 -2217 1623 -686 -842 812 -291 84 1377
1546 1377 1736 94 -105 3215 1683 469 3076 1131 703 4817 2155 404 3885 2331 2214 3152
1562 3152 1703 2089 3032 2542 2446 1522 1820 2393 1433 2027 785 555 2071 248 675 1317 -1434 315
1580 315 1529 -2029 -747 339 -1910 -1097 -268 -2371 -2502 -1031 -1685 -2790 -2213 -1568 -3250 -2107 -892
1597 -892 -4024 -2929 -1053 -3564 -2279 -1287 -3344 -1907 -1011 -2219 -2110 -1290 -1094 -1292 -960 -940 -1062 -1
1615 -1 -61 -830 472 560 -1 1368 840 -299 2008 1861 608 2637 2277 744 2873 2853 1034 2035
1633B035J229j353m9J602j746o70K683j524j808K327o48j311J370n28j302J072
1649A379K48j379K56M36j031R6K67j007J14M65r80k92P07j444M80J107j954J93
1667b339J333j699K42J322j736J24J518q57r42J161N65j648J361O24j702J358
1683a315J172j618K00J678j505J11K185j577k02J788p51l00J044k58q4Q29K94
1700A691o71L56N74o79O59K56p57R31K54j100O35N10j289J113L90k091Q74R64
1718B620j638M39J113j723m12J718j084j832K071k31j919J479j31k371J416J028
1734E43k268L27J113j270j62J103j382o12J476o27l02L69o94j0Q01m59l50P42
1752a662k80k66J034q27n50J705j93j159J597j37r70J544L00j197P78J491j446
$$ plain form
1633 2035 3264 1911 1862 3464 1718 1048 3731 2207 399 2726 2078 767 2137 1609 307 1379
1649 1379 1627 248 504 940 -91 5 272 -735 -621 -156 -1136 -1428 -721 -2165 -1685 -578 -2532 -2339
1667 -2339 -1006 -2705 -2463 -1141 -2877 -2753 -1235 -2092 -3034 -1873 -1308 -2956 -1595 -971 -2673 -1315
1683 -1315 -143 -1761 -1561 117 -1388 -1277 908 -669 -871 917 166 -134 910 652 568 1397 1691
1700 1691 1020 1376 1950 1271 1930 2186 1429 2360 2614 1514 2149 2659 1370 2483 2873 782 1656 2620
1718 2620 982 1421 2534 811 399 2117 1033 -799 1272 1041 -878 601 470 -1901 -485 543
1734 543 -1725 -1398 -285 -1555 -1717 -614 -1996 -2608 -1132 -1759 -2061 -1692 -2386 -2396 -1595 -2054 -2404 -1662
1752 -1662 -1942 -2208 -1174 -2001 -2551 -846 -1039 -2198 -601 -738 -1708 -164 136 -1061 -283 1208 -238
1769b38J6K014j678K9K256j211p77J684j80r89J442k00j270J376M63j159M68M18
1787B464q81L64P71j520M02Q49j308J72M53j052M32M85j543N04K11j134L85O00
1805F54r39p23J174m04j678J448l01j624J699n5k457J516R14k017P03J241j748
1822b597J84J049o11p70J154R2j104J041N91j126J005O53j410J088L66q45J281
1839D1j36r12J681l10o93J325m6n83O49N16m57L9J072r64m16J931r10j060K056
1858B823q22j229K168j132j051J890p53o62Q96l75q09M0Q08o71p86J316j099q08
1876b56J717j219q87J678j520k83R43j353J32Q12j516K03N74o40L82j14m41j48
1894a936J23R18j621L16J537k275J164J573k903J264J706k155Q43J059j356N63
$$ plain form
1769 -238 -222 1792 114 143 2399 1188 411 2095 1915 926 2368 2168 898 2274 2737 1578 2046 2464
1787 2464 1583 1947 2718 1198 1600 2449 1141 1313 1766 714 1146 1631 88 592 803 -331 54 654
1805 654 -285 -1008 166 -238 -1916 -468 -769 -2393 -694 -749 -3206 -1690 -776 -2793 -2090 -849 -2597
1822 -2597 -2413 -1364 -1975 -2745 -1591 -1499 -2603 -1562 -971 -2097 -1092 -439 -1849 -761 -395 -1240 41
1839 41 -95 -1007 674 364 -329 996 950 367 1016 1532 1075 1114 2186 1222 806 2737 1827 767 2823
1858 2823 2001 772 2940 1808 757 2647 1894 1232 2128 1753 944 984 1792 1121 335 1651 552 -256
1876 -256 1461 242 -645 1033 -487 -770 173 -1180 -1048 -236 -1752 -1549 -975 -1615 -1233 -1347 -1788 -1936
1894 -1936 -1813 -895 -2516 -2200 -663 -2938 -1774 -201 -3104 -1840 -134 -2289 -1446 -387 -1743 -1180
1910a180O53J45q01K83J338j046M11J207j673Q90J569j884Q77J007j739J798k59
1927A596j226J494k07k54J047j062j42N79M10L6j317Q75M95j435J540o59k183
1944d13K659k67k162K039j120p12J511r42j020K58L05m6o72J04j71j560K033L3
1962a43k622J835r4j522K535j805j162K166j006K20M67j647J189M78l78l56l81
1979b226J037J40k89Q86j285J50K316j793J4J759k074Q99K038k228L28J368p41
1996B99N25P5J49l95J38J849j783o52K283j046k20J866k582O58J792j678N35l51
2014A462r09J432k9q19j7j88J52M19q40Q6r91J127M63k271R67O98k043J969n80
2033H8k490K107L48j538P27l95m14L05L08J20j508O64P32j480J227O7k087K239
$$ plain form
1910 -1180 -527 -382 -1183 -900 438 -608 -197 1010 -663 227 1796 -88 789 1796 57 1855 1596
1927 1596 370 1864 1657 1403 2450 1388 1246 1825 2235 2271 954 1829 2324 889 2429 1770 -413
1944 -413 2246 1979 -183 1856 736 24 1535 593 -427 -169 136 90 -582 -478 -649 -2209 -176 -143
1962 -143 -2765 -930 -1024 -2546 -11 -1816 -2978 -812 -1818 -1598 -1131 -2778 -1589 -1111 -1489 -1845 -2226
1979 -2226 -1189 -1049 -1338 -452 -1737 -1587 729 -1064 -1050 709 -1365 -466 1572 -656 -328 1040 299
1996 299 824 899 1048 653 791 2640 857 205 2488 1442 1222 3088 506 1164 2956 1278 1813 1462
2014 1462 553 1985 1956 1137 1120 932 1084 1503 663 749 -242 885 1348 -923 44 742 -1301 668 88
2033 88 -2402 -295 53 -1485 -758 -1153 -1567 -1262 -954 -834 -2342 -1678 -946 -2426 -1199 -1132 -3219 -980
2051i80L87j872J312l56l64J484o46p31P61P8L31J97m63O83l57R54k12p96J387
2070G97k24l17J463j446j84K163j066m82J291r36r5J302m44r25M24R55q66l35
2088A075J280j077n00J731j275j157K007j151n02J226j126m23Q87o28k55n9l99
2105c46L82l72p6k63l3M72q72k5L34j040N36P51j683M36R73j302M92R12j342K94
2125a772J056q50n85J163j60o46J048J15j091R36O12j189J161M23j090P57J046
2142I34r65mJ151o24J55N20l39j70Q01k49j78L65J79l83M12%q76J440n66p10R25
2163A818o0j046J321k59j228O21M62j115K00Q47j413j03J465j330p07J085o60
2180a02q85J094l17j306J058J54r39K62J96n17J36K56r58J72P85j028L47M23p03
$$ plain form
2051 -980 -593 -2465 -1153 -1509 -1873 -389 -1035 -1766 -1005 -927 -596 -399 -862 -179 -536 418 206 -590 797
2070 797 573 256 1719 273 89 2252 1186 704 1995 1059 964 2266 1822 897 1321 2276 1410 1075
2088 1075 2355 1278 778 2509 1234 77 2084 933 431 1657 531 108 995 367 112 53 -346
2105 -346 36 -336 -412 -675 -708 -236 -1108 -1133 -799 -1839 -1303 -552 -2235 -1799 -826 -2128 -1636 -724 -2066 -1772
2125 -1772 -716 -1566 -2151 -988 -1148 -1794 -746 -631 -1722 -786 -174 -1363 -202 221 -869 -112 934
2142 934 -31 -35 1116 492 647 1167 828 658 1459 1210 1032 1397 1576 1193 1605 1605 729 2169 1603 893 1818
2163 1818 1758 712 2033 1774 546 1167 1629 514 714 1561 148 45 1510 180 -527 558 -102
2180 -102 -987 107 -210 -1516 -458 -304 -1243 -981 -785 -1302 -1166 -910 -1868 -1696 -911 -1939 -1592 -1169 -1872
2199a872L78N33q29K83P60p16J73Q43p35l08J181j78o85J400n15p16J357M6q07
2218d07P06Q27j013P13J71m99N0J244r22k30J197n02m78R25m31m82R74j26o35
2237A082K98K78o73N04q6m93K42K06r83N46J32r61M02M49j091K38M35j027N22
2256B0L33j209m9P92p01o50P82l68p67J148r0j567J252M26j185M30N25r87L39
2275a526N46p08K32L66j33l23Q77l72K8O88l65j29O86l34j02J351o86o26J278
2294G48l20l44Q02p0n24R50K91p53Q4R20o89j47J161j396R7J470j066m37J379
2313B156r39k81R08p76n59P17r6n26K65j60m08J18L78o87n77J096j113L53K32
2332A01j111M45M65j216P60j61p71Q04K08r69K46MJ27o00P65k7j334J242M84j503
$$ plain form
2199 -1872 -1494 -961 -1790 -1507 -747 -1463 -1290 -447 -1182 -1490 -309 -487 -1172 228 -287 -1003 354 400 -407
2218 -407 299 1126 113 826 997 498 548 1792 870 640 1837 1335 857 1782 1351 869 1843 1717 1082
2237 1082 1380 1658 985 1489 1403 910 1152 1358 375 921 1053 92 494 943 -148 90 525 -502 20
2256 20 353 -856 -905 -113 -814 -1464 -682 -1050 -1817 -669 -759 -2326 -1074 -648 -1833 -1403 -878 -1865 -1526
2275 -1526 -980 -1688 -1456 -1090 -1223 -1546 -669 -1041 -1013 -325 -690 -819 -133 -467 -569 782 96 -530 748
2294 748 428 84 886 816 292 1242 1533 780 864 1784 1095 948 2109 713 810 2280 1214 777 2156
2313 2156 1217 936 1844 1068 509 1226 1130 604 869 709 301 419 797 110 -467 629 -484 -131 101
2332 101 -1010 -565 -100 -1316 -556 -717 -1488 -684 -476 -1445 -1199 -1195 -1068 -1668 -903 -930 -2264 -1022 -538 -2041
2352b041P08Q11j392J150P04j541P23P42m23J33J61j5q1M52M72r11L97R07q14
2371A42O00K01r45J254J66p28P62n61l31J640j024n26J135m97m1O7Q2k25l58J074
2391A887n64r76J231n81q30J340r68r61J567o87n16N11p62q0L42j07k65m70N73
2410c16m5r23R20m27o61J222p51n41Q64j034L49P12j014O8O66o23M84J17m98L24
2430a107J39K36o32K19R38r46N00J176j640N52J588j610M96Q67r92O91M95o14
2448C56%M10M46o22J20O72q23K45J297j366J15J210j345Q83Mj427J006K00p62
2467F19O91n32l07N70j04k81m22K78j8o12P56m35j289J423j7j610J415o24j231
2486a730J595n08j115J014p6j98j02j22l7l28J054j55j065Q88J10j234J564l06
$$ plain form
2352 -2041 -1333 -522 -1914 -764 -60 -1601 -878 -136 -559 -426 -265 -280 -361 91 563 -348 49 956 142
2371 142 742 943 -2 1252 1418 690 1452 891 560 2200 1176 650 1785 1288 1247 1314 1396 1171 813 1887
2391 1887 1323 347 1578 997 167 1507 539 -422 1145 458 -58 453 -309 -389 -47 -154 -419 -889 -316
2410 -316 -361 -1284 -364 -791 -1452 -230 -981 -1522 -658 -1692 -1343 -631 -1645 -1577 -911 -1534 -1050 -933 -1431 -1107
2430 -1107 -968 -732 -1364 -1145 -207 -1153 -653 523 -1117 -565 1023 -587 -91 776 -216 475 970 356
2448 356 356 766 1212 590 710 1382 559 804 2101 735 850 2060 715 1598 1602 175 1181 1381 619
2467 619 1310 778 471 1041 937 656 234 512 494 -118 638 203 -1086 337 320 -1290 125 -499 -1730
2486 -1730 -135 -643 -1758 -744 -820 -1018 -1120 -1242 -1279 -1607 -553 -708 -1773 -885 -775 -2009 -445 -751
2504g51r15J601p39l01P20m76J76P09n64M11L3k05L54o1L99l03O9J142q42l66
2524I1J298j025L2J549j232r3J238r15J53N22q82J72L62J70o03PO20n08k83R53
2544A626r60l10R19p73k13M69o70K01L88q77Q4L11o18J31m0j94l06J89P4p22M25
2565h66N5q16P99K43j201P10K43o68M37K99q30M43O90p03r7P07l49k07O66K99
2585a46r62Q05L61q01N33N99q88O50L00o94O10K30j82K42L93l20J79M37l92m0
2605I14M07m45J00O35n10m14J007n70m41Q37m81m96Q01k59j258R93K64r24K03
2624C63K66p13J43M11m81l79M61n77m21Q30n26k32O55n88j21N44n83l03O45m68
2644a074k27M02kl25L95l0n12M36K95o51M99K81n64L88L82p60L78Q62m66j66Q83
$$ plain form
2504 -751 -1666 -65 -804 -1105 -385 -861 -685 24 -540 -129 -96 -301 53 -8 391 88 157 1299 457 91
2524 91 1389 364 396 1945 713 620 1858 943 1096 1618 736 908 1270 1440 837 844 1464 956 673 1626
2544 1626 666 356 1275 502 289 758 88 289 677 -200 -116 195 -423 -292 -332 -526 -832 -643 -569 -1291 -866
2565 -866 -811 -1627 -828 -585 -1786 -1076 -833 -1501 -1064 -765 -1595 -1152 -462 -1165 -1262 -555 -904 -1111 -445 -146
2585 -146 -1108 -303 58 -743 -210 389 -499 151 451 -243 367 597 415 657 1050 730 909 1346 954 914
2605 914 1321 876 976 1611 1101 687 1694 1124 683 1520 1039 543 1344 1085 -173 820 1084 160 363
2624 363 629 -84 59 470 -11 -390 71 -506 -927 -97 -623 -855 -200 -788 -909 -365 -948 -1251 -606 -1074
2644 -1074 -1301 -899 -901 -1226 -831 -861 -1373 -937 -642 -1293 -794 -513 -1077 -689 -307 -1067 -689 173 -293 -459 424
2665D24o08O3N90O0p42R42M2n40M32M36p01O29L47p30L08N45l51k48P13o98J07
2686A020L56j47m53M90k33k19O6j58l59K01J04m94L58k50m25N30K4j162P99no78
2707f35J18K03o38J89O32p91l18N50j64n20N77o4m43L57j09k61M70j45m49P05
2727g36j6k64R6L48k65J61K72m34J54O40m82L5O22m03L82N60m65k87O72k41r8
2748B51N34k21m5P00j27o04M84J66n77M36L76o65K98O63q96R6N55p45M3M90o78
2769E34j02L54k57m0q9Kk14O2j13k25J18l2m31J62P2q11P56j30o06L07Q4r17O95
2792h21J58p97N62L15l82k85M31L6p21P22Oq06J018N32j284O81L29q15R95J39
2812A3m19J78K17m9L07j45J72r6J49M46l33K83K55m68R27q33k44R31k01l35O18
$$ plain form
2665 424 -184 -121 469 529 -213 729 771 231 663 1099 398 1027 1374 644 952 1497 1146 898 1611 913 1020
2686 1020 1376 1229 776 1266 1033 814 880 722 363 564 668 174 532 282 -143 387 411 -751 48 43 -635
2707 -635 -517 -314 -952 -763 -131 -922 -1240 -690 -854 -1374 -797 -861 -1304 -947 -1056 -1317 -847 -992 -1441 -736
2727 -736 -752 -1016 -920 -572 -837 -676 -404 -838 -684 -44 -526 -491 131 -272 110 670 205 -82 590 349 251
2748 251 785 564 519 1219 1092 488 972 1138 561 997 1373 708 1006 1669 773 869 1424 679 722 1212 534
2769 534 432 786 529 489 400 402 188 250 137 -88 30 -2 -433 -271 -199 -1010 -254 -384 -990 -683 -599 -1516 -821
2792 -821 -663 -1460 -898 -583 -965 -1250 -819 -783 -1504 -782 -776 -1582 -564 -32 -1316 -635 -306 -1121 -126 13
2812 13 -406 -228 -11 -60 247 102 274 178 327 773 440 723 978 510 1437 604 360 1291 1090 755 1373
2833A373n74m78J208n06k50J26J27k63mM26p40j91J102q95o19J304j335k68J188
2852G31o72k88L65m64k2J26k49l13J82K65l00l22N76m24j92M58p15M4Q60q75K18
2873a011N01q35Q33K89j107L72K37M2L73k89Kl83N93P62p40q2J016j174Q58N56
2893H13j414Q24P20q29O49j21k94L20L76k34j96J29L69k08J05M7q19J066j57o51
2913D95O39l36m66Q33n04l97O42m11q8L05o50l4K44k5k12n34P63j26p48P58m85
2934c37j017J434l74r17J013o75o8N38m70r8r3J28M76m99L18j9p53J071j82p91
2954a315O19r0p6R60r05q1P84j75J69K60n35L41M56l25J31j89M15k08K45M14q51
2975D4K88J349j367K27Q27j076O48M02q17J23K64n5j45kJ53j60j2L70n26k70O60
$$ plain form
2833 1373 799 321 1529 1023 773 899 1026 763 759 1185 445 254 1356 461 -158 1146 -189 -457 731
2852 731 59 -229 136 -328 -350 -224 -473 -786 -604 -339 -639 -961 -385 -809 -1001 -543 -1258 -1214 -354 -1229 -1011
2873 -1011 -510 -1345 -512 -223 -1330 -958 -721 -679 -306 -595 -593 -976 -383 379 -361 -443 573 -601 257 813
2893 813 -601 223 943 114 763 642 348 668 1044 810 614 743 1112 904 1009 1056 237 1303 1146 495
2913 495 1134 798 332 1165 661 264 906 495 407 712 62 28 272 247 35 -499 264 138 -610 148 -337
2934 -337 -1354 80 -294 -1211 -198 -873 -941 -403 -873 -971 -1064 -936 -460 -959 -641 -660 -1413 -342 -524 -1315
2954 -1315 -696 -786 -862 98 -807 -888 -104 -279 -110 150 -385 -44 412 87 218 29 444 236 481 895 44
2975 44 332 1681 314 541 1368 292 940 1342 525 648 912 857 712 710 863 703 691 1061 535 265 925
2996I25o34K33K40n87K20P0q82O78l54n23O72q4n71J90m2k3l63M04k13l79M68
3017e55j59m67M81J50r69R27o8n98P97k92o86J049l73K6K43M29m29l29P10j27
3037b40k09L95j08k22Q22k66j14N80j48l19K39J66K9K15k39K10P7m4j21O3K95
3058A061l46j28N66n75k4M81m48n6N67o32j24P65p44l6L27k18m27P1L11p90J85
3079b14L74l46r3K80m23j38L72n69K6M52o10O1K12k49j43M50l21j74K93o1qK90
3101e39K2o26N73L6m38M96J56m26N26J6l17K75N47m30j70P52n34K54J84K6m20
3122c7O92l01p5M40K38m90J43N51n85K55q4k27N53k31k10k6K17L0n7J59n53K32
3144F34L1m44o6L80m44Q3K28l92o57Q96No92L77j41n90K71L75o49Q6M95o05p0
$$ plain form
2996 925 291 524 764 177 397 467 -415 263 -91 -614 58 -26 -597 -407 -449 -472 -835 -431 -644 -1023 -555
3017 -555 -714 -1181 -700 -550 -1519 -592 -660 -1258 -461 -753 -1439 -390 -763 -737 -494 -65 -494 -823 -113 -240
3037 -240 -449 -54 -162 -384 438 172 58 638 490 171 410 576 605 820 581 791 868 824 703 766 1061
3058 1061 715 587 1153 578 554 1035 587 531 1098 466 342 1107 363 327 654 436 9 80 391 -399 -214
3079 -214 160 -186 -279 1 -422 -560 -188 -757 -731 -279 -889 -828 -616 -865 -1008 -558 -879 -1053 -760 -821 -829 -539
3101 -539 -517 -1143 -570 -534 -972 -476 -320 -746 -220 -204 -521 -246 301 -129 -299 453 -81 173 357 383 -37
3122 -37 655 354 279 719 957 467 610 1161 576 831 747 520 1073 842 632 606 823 853 796 955 402 634
3144 634 665 221 155 535 91 174 402 10 -647 249 254 -438 -61 -202 -792 -521 -146 -795 -709 -214 -819 -889
3166h89M64n39o1L00k83p2L14K0k31M95j6J20j57j06j98L98n5R5P38m15n74M27
3188b25M81l24J11K70l46J18N06n78O7L79j72m3P09p61J70N25k17n7K07L9k00
3209F59L50J1l31R3K99n48L5J64l01J68k4l91M8J63l8l56K77k81J06j45m6j48
3231b36J61k06k08K36k77m18N42j54l88N27j18m77M69J10m23K47K33m88j08M93
3251d83N4o79O99J8o36M66L08m33L81j16n1M76M6o3J38J45k20j0J73K38k81M58
3273F28k33k28P05k42m96R12o96r1K44J63j67K33m02L29M00j286N64j94O42m40
3293C45K01m5j83mL71p28P9N53p49J52lq4l13M29l22n5J9j21J5k16J26k39K9L35
3317d08k89r6J94n92N97K25p16K81M74q32P09j29m11P37N0m84L44q7K42K7j35
$$ plain form
3166 -889 -425 -964 -1025 -725 -1008 -1080 -766 -746 -977 -482 -498 -378 -535 -641 -839 -441 -496 -401 337 -78 -652 -225
3188 -225 256 -68 43 313 -33 85 591 13 80 459 287 244 953 192 362 887 670 613 820 859 659
3209 659 1009 1020 689 782 1081 533 568 732 431 599 575 184 232 395 357 1 278 -3 103 -42 -88 -236
3231 -236 -75 -281 -489 -253 -530 -948 -406 -560 -948 -421 -539 -1016 -547 -437 -860 -613 -380 -868 -976 -483
3251 -483 -429 -1108 -409 -391 -1027 -561 -253 -686 -305 -421 -472 4 50 -13 125 270 50 40 213 451 170 628
3273 628 395 167 872 630 134 1046 350 259 503 666 499 732 330 659 1059 -227 337 143 785 345
3293 345 546 501 318 314 685 -43 36 589 -160 -8 -11 -95 -408 21 -301 -356 -337 -458 -443 -659 -533 -772 -743 -408
3317 -408 -697 -793 -599 -1191 -594 -369 -1085 -804 -330 -1162 -453 -582 -993 -256 -206 -690 -346 -433 -191 -164 -299
3338b99M04p14O54N34p57M97J66m28O71k9n86K80m7NN58k79n8j4J89J85m32K47
3360G47Kl64N93k97n05O55n9l63L39o88J54N08n86r9L83m60J57Pj43k46l9N46
3382B42n07n36Q40n02k23R96j235L0O49l57k03N00o68J70K05m4J95l36K94j28
3402f18l09N72j58j55P22m54j18N44q33P97M36q44J84L41p8L90k02k37J87K41
3422D08K15m63O8P26n79L19L22p92L14N12p19L84K48r64Q38M3k23j77R4N3j72
3443D55p4n8m9J13K68p90K48K89n84L16p7n13N34p0j84J37m76q0K66J89m70R1
3465e19Q4k20k17M28j69l00M32m1m44O41l58l78R40j34n09K72L82k60J35M2lp1
3487b67J98J76l98N7L91k18L84l0k94P86l49j89L80l26J22J32k46J0M31n4j87
$$ plain form
3338 -299 105 -609 45 579 -178 319 485 57 728 699 113 393 346 351 909 630 572 558 747 932 500 747
3360 747 749 385 978 681 176 831 772 409 748 60 214 722 136 37 420 -40 117 124 -19 -265 -304 242
3382 242 -265 -801 39 -463 -686 310 -925 -895 -246 -603 -806 -306 -974 -804 -599 -643 -448 -784 -490 -618
3402 -618 -927 -355 -513 -668 54 -400 -518 26 -807 -10 426 -418 -234 107 29 419 217 -20 167 408
3422 408 623 160 228 954 375 694 1016 224 538 1050 331 715 963 -1 837 880 657 480 574 627 455
3443 455 381 323 274 387 655 -135 113 402 -182 134 57 -456 78 8 -176 -39 -515 -595 -329 -140 -610 -519
3465 -519 -435 -655 -872 -444 -613 -913 -481 -522 -966 -325 -683 -1061 -121 -255 -764 -492 -110 -370 -235 -193 -196 -267
3487 -267 -69 107 -291 -234 157 -61 323 293 -1 785 436 247 627 301 423 555 309 319 750 696 509
3508E09J83r2j74K20M74p40J41K61l53o4N13p54M4L42l68j21K13l4K6j99j1l51
3530c35J71p8l25J30O3j12J83L09p63J66K37l85M25q2l49J4K43j71K2J77j34K0
3552e74J13L4k01L33k58J53M10j64m17L90J36l30P81l47m03Q41j84k74K32L09
3572E80N7m79N66j48l48K71J81k19J4K25j62l1K21j62K97j35k67K86j44j70L9
3593D72J18k46L1q6j94N7L90m33k65K99m82K34k07o4j82L89m3k55K7k5k49J29
3615e85k2J25j68J90n01M16K49m54J03M31n43N34k15k55M56j37M5k05K48J8R9
3636a71J21j04J32l2K27m20L31M44m78M26j12K2k15N45k11n1M91o95J80L5L15
3657G80j95M42k90l02M15m44M4J83P0l13l94M12n03J33L23k19j68J73J61j4l70
$$ plain form
3508 509 692 600 426 646 1120 380 521 782 429 365 878 124 168 510 142 21 234 200 226 27 16 -335
3530 -335 -164 -242 -567 -437 -374 -486 -303 6 -757 -591 -354 -739 -314 -396 -745 -731 -488 -659 -637 -460 -594 -574
3552 -574 -461 -427 -628 -295 -553 -400 10 -154 -571 -181 -45 -375 406 59 -344 497 313 39 271 580
3572 580 637 158 724 576 228 499 680 461 475 700 538 507 728 566 863 728 461 747 603 433 472
3593 472 590 344 375 289 95 152 542 109 -156 143 -339 -105 -312 -376 -558 -169 -212 -467 -440 -465 -714 -585
3615 -585 -607 -482 -650 -460 -961 -545 -296 -750 -647 -216 -759 -225 -440 -695 -239 -376 -331 -536 -288 -270 -171
3636 -171 -50 -154 -22 -54 173 -247 84 528 50 476 364 386 171 716 505 454 945 250 430 465 780
3657 780 585 1027 737 435 850 406 450 633 703 390 -4 408 -95 38 361 142 -26 147 308 294 -76
3678g6j90j22K79k36r1M33l92m9Q6P8m09J93k3m3j66J83j58K24j6p9j84K63p7
3701e72l5L30l38J15K74j02j89O26p05J57M60k36m5L37l93J77L73j58j56N07k29
3722A98j3ML93O9k2o8o3M7K14k38m0K58m13J18M59o76K92N4j85j33L19k01Oj58
3746B21J87l2k66J23n01J23K93n78J67K61m41Q6J48l12J58j49j16L51j0k66K29
3767c24J77m27K3J66q7K9j48N2o6K09P3k68M55j90k44K85J36k63L86j43J77r7
3789h9P9J30l11L78L66n17N07j13l73M50k33k7M85l26m4J77q4J61J0%j41r0R7
3812D92L4k72J42Q0j57mK8l95O26m66j33O28m54k70K63l7k56p0Q4o0R4j63k82
3835e48K7N21m46k07M58l15j45M28m32J14J17k37J99m5n0R0j47K57Jo7K03k18
$$ plain form
3678 -76 -266 -388 -109 -345 -436 -3 -395 -444 -358 -280 -689 -496 -519 -562 -728 -545 -703 -479 -495 -574 -758 -495 -572
3701 -572 -607 -277 -615 -500 -226 -328 -517 109 -596 -439 21 -215 -260 77 -316 -139 234 76 -80 427 198
3722 198 185 189 582 651 629 561 498 545 759 521 481 739 326 444 903 227 519 573 388 255 574 373 379 221
3746 221 408 376 110 233 -268 -145 148 -430 -263 -2 -443 -357 -209 -521 -363 -512 -628 -277 -287 -553 -324
3767 -324 -147 -574 -551 -385 -472 -443 -591 -539 -605 -396 -323 -591 -136 -326 -570 -285 -149 -412 -26 -169 8 -89
3789 -89 -10 120 -191 187 553 36 543 430 57 507 274 247 732 406 362 539 455 616 626 626 485 395 492
3812 492 526 254 396 476 319 315 343 -52 574 108 -25 603 149 -121 142 105 -151 -221 -137 -197 -103 -266 -548
3835 -548 -521 0 -446 -653 -195 -510 -655 -227 -659 -545 -428 -665 -466 -511 -561 -471 -618 -361 -360 -427 -224 -442
3857d42M5K30j85J69N7n9M04o1o24P19k61PL04O1q2lR8R8k93K14K69m70P2M99
3881G66n08L25L55p39M55j60k67L80k94n9L43k63J57k13pJ62k92j7N5k38J91j35
3903cm59O01m06j97O67l71k23M06n16j10K33l5O9j20Q2K15n26N10j36k25L37n49
3925g56J74L20k79N1N19m58Q1O1j1K79j11j50L28j93J36j57J35K14j03j25L92
3946C47J9J49J1m47J43M49m35K8K82k93R4J89j21J95j5q7l96K28J45j97J54N2
3968D94k90l4J16j95L1K11m51L16j09j52rK7J67l87J94Ol48OJ63n40N04j27k17
3991f24J47J03j69K26j98j33K23Q5o4j47J92Q9r9J81k05K9L32p1k78M29j49k29
4013c30N25j50p0K90J04k62J18m8p4K02K40j84p4J35j73J35j9MK62L0k07j74M93
$$ plain form
3857 -442 -397 -167 -352 -183 -126 -185 219 158 -466 253 -8 -1 303 364 282 279 377 475 182 396 665 195 267 766
3881 766 258 583 938 199 654 494 227 607 313 254 597 334 491 278 271 433 141 124 179 -59 132 -3
3903 -3 -462 139 -267 -464 203 -168 -391 15 -501 -611 -378 -413 -344 -464 -382 -167 -693 -183 -319 -544 -207 -756
3925 -756 -582 -262 -541 -490 29 -429 -348 -287 -298 -19 -130 -280 48 -145 -9 -166 -31 183 80 -45 347
3946 347 366 515 526 79 222 671 236 264 546 253 347 536 415 610 595 508 112 340 485 288 442 494
3968 494 204 170 286 91 122 333 -118 198 89 -63 -72 -45 122 -265 -71 -65 -413 -407 -244 -784 -280 -407 -624
3991 -624 -477 -374 -543 -317 -515 -648 -425 -340 -404 -551 -359 -270 -369 -188 -393 -364 -32 -103 -381 48 -101 -330
4013 -330 195 45 -25 265 369 107 225 177 103 305 545 361 287 422 249 384 365 369 631 661 454 280 773
4036G73m53m3M60k55k23J52j3k33K46k63l69K92J5j20J4Q1k67L0M04m18K06O3
4058G9l57q6J59j28r3J78j61j01L07l87N8K57q9k40L89j32j05m1L84k51n4K76
4080a38l73O5L77n1j11K12k18J77J33l72K13K69K1o83P81L6j84L48j93k76M43
4101D76r0kj5n1n7LJ90O5l85M69j02j20L66k61k42j6Q8o50L82N1R2n6q3RJ4j1
4127F4k56K11q4j82j0J2K4n3J5j96L66j96k2j52J96l01o5L66L1l95J72Q1k39L57
4151b56P3j79o8j0R5K7J37K86j53K17j73j49K95p2l6L03j47K17P1n33L86k60L14
4174C85k33M84r1k45P3Q8n6J99j00m03N29O4l00m2N4r8J8L65o97l4L97j13p7L6
4198B03q6m69L12K41l13K36j24k78K04l0q6M2j11l17L98j56r2L5J20n1k40K98
$$ plain form
4036 773 320 277 737 482 259 411 398 165 411 148 -221 71 86 -34 -20 61 -206 -176 228 -190 16 79
4058 79 -278 -364 -205 -333 -426 -248 -409 -510 -203 -590 -532 -275 -364 -604 -215 -347 -452 -493 -109 -360 -414 -138
4080 -138 -511 -446 -69 -120 -231 -19 -237 -60 73 -299 -86 183 204 -479 302 338 154 502 309 33 476
4101 476 386 384 369 318 261 264 454 519 134 603 501 381 747 486 244 228 316 -334 48 99 191 135 52 61 75 64
4127 64 -192 19 -65 -247 -257 -245 -221 -274 -259 -455 -89 -285 -307 -459 -263 -564 -629 -263 -232 -627 -455 -374 -613 -256
4151 -256 -183 -362 -430 -440 -345 -318 -181 105 -48 169 -4 -153 142 70 34 337 190 407 478 -55 331 71 385
4174 385 152 636 545 300 373 461 405 604 504 101 630 694 394 352 406 308 326 691 -6 -40 357 244 167 203
4198 203 117 -352 -40 201 -112 124 0 -278 -74 -104 -190 -148 -259 -576 -178 -334 -426 -391 -271 -322 -562 -264
4220b64j14k39K81l35J48K35N3k26L75l26J36O3j69J58R8k08L7K61J29l02QL96
4242A95Mk39J38M9Q1L30k27p0L80l39j22L59j98m5Q7j17J93j46J65l5k83K01q8
4265B73L1M50m54o5K81o22K74q3j2K4M52q82K63K48j03m10K15K55m97K49m9j76
4287c38j43N80n31j72L83k8k4P5m07K31J24j36j6K4J43P4j72j09O7P3L49k53M
4310b02Q5j97L59K36n13L75J42l72K91j67M9K64k42J57r0K16L24l47o0M69n11
4331B66J18M6l62L65p9j76N02n11k2J04Q9J05M4m25K44j43M4j9k46L05j32k67
4353a50L45k20m22L15K3k82O3K9J22R2k97k5N25m59l4j67J85P7j3J6j60j76L24
4376b89j63j88M46qj57L00k93L02k06K4L79n5l19J19j11M02P6l58K79n6l8M02
$$ plain form
4220 -264 -378 -617 -336 -671 -523 -288 -235 -461 -86 -412 -276 -213 -382 -224 -126 -334 -297 -36 93 -209 -201 195
4242 195 199 -40 98 147 228 558 331 261 641 302 180 539 341 296 383 266 459 313 478 443 160 361 273
4265 273 304 754 300 235 516 -106 168 85 73 97 549 -333 -70 178 75 -335 -120 135 -362 -113 -162 -338
4287 -338 -481 99 -432 -604 -221 -249 -273 -198 -605 -374 -250 -386 -402 -378 -235 -161 -333 -442 -375 -302 47 -206 -202
4310 -202 -117 -314 45 281 -232 143 285 -87 204 37 86 350 108 265 175 391 715 368 308 777 266
4331 266 384 430 68 433 354 178 680 169 147 251 340 445 489 64 308 165 209 190 -56 249 117 -150
4353 -150 195 -25 -447 -132 -109 -391 -328 -299 -177 -85 -382 -407 118 -341 -375 -542 -357 -280 -293 -277 -437 -613 -289
4376 -289 -452 -640 -194 -202 -359 -59 -352 -50 -256 -232 147 92 -227 -108 -219 183 259 -99 180 124 86 488
4398D88l87J90R0j21J65L17n99L28k32j55L38j01J09k15J55K40n38K1K89m36J60
4419A06M11l06k9J2k82J88rJ01j44j69j50Q0O3Q4k13L0L17k72j04Pj44R7jo3O0
4444c30j7l15N66j35l16K69J02o1j02M9q1R8p5J34J25J70k07j9J10L42m79M08
4466B36J16m67M95k30j9Q2l88K86K39N57l60m32O69o18P6K91k26J7J87m18J001
4487A094l98m16m09M71m36J58L9j330J779K89p76pK1M15m89L84m1l56j60r3J39
4508a22k56K83j95k7L83k02l45M82k34k55J85lL3J05n6p3k80K34q3J80J18J6j07
4531b19J62jlo6j2l8L99j16j25L16l52J63K27k31kJ40j32J68j22K07k7J59j77
4554C18j78L11j64J78O9j89jk1M3l55J76J55k02q5J56j5J11l24l9K43j96k49K92
$$ plain form
4398 488 101 291 381 260 425 742 143 471 239 84 422 321 430 215 370 610 72 93 382 -54 106
4419 106 517 211 182 194 -88 100 91 192 48 -121 -271 -191 -128 -44 -257 -227 90 -182 -286 -279 -423 -326 -327 -390 -330
4444 -330 -347 -662 -96 -231 -547 -278 -176 -237 -339 -290 -371 -273 -348 -214 -89 81 -126 -145 -35 307 -172 236
4466 236 352 -115 380 150 131 213 -175 111 350 907 547 115 784 166 242 533 307 324 511 93 1094
4487 1094 696 280 -129 342 -94 64 103 -1227 552 841 65 58 79 494 5 389 348 -8 -168 -261 -122
4508 -122 -378 -95 -290 -317 66 -136 -481 1 -233 -488 -303 -306 -273 -168 -224 -297 -577 -343 -426 -246 -128 -112 -219
4531 -219 -57 -58 -61 -127 -139 -177 222 106 -19 297 -55 108 335 104 102 242 110 278 156 363 336 495 318
4554 318 140 451 287 465 534 345 344 323 366 11 187 342 140 55 211 196 307 -17 -56 187 -9 -258 34
4577C4j95l9R6R6J45k92J02m12K31K23k17k15QK93k90J55Mq1j03K12p6L27n69
4600e63K12J39K5j08N2J29R8j30lJ86j4k97M16j28j18K84l36J55J29j71K56K25
4622D38k87M7j93J28L1K12j31J92k0k23J91n1J82l60K73j84j87L03j56nPp2j56
4645b1J75J62j36k73K19j54n5J7j45o9K92n7l06K17J26l87L49J6m32M36l24m6
4667c96L53k41q6j01Q8j24J82P6j09J2n2J22l08M15l2j42K61j16J28R8k31J78
4689b5M5p3K2J73M6j10J10J24j69J63J24j46J67m32J14o2J50jR6N1j99K40l15
4712I3J44m2N3k4L6j2R7l78K60r7j42K74K0k46Q1p0j23j96M38l81k61M31j84J70
4736e9k91K1j11J0K09j69K0L17m20J89J86o1m2K08m68M95m37n0L46j42Q4P2j29
$$ plain form
4577 34 -161 -200 -104 -8 137 -155 -53 -465 -234 -11 -228 -443 -435 -142 -432 -277 -273 -354 -457 -245 -321 6 -563
4600 -563 -351 -212 -187 -295 -243 -114 -16 -146 -149 37 23 -274 142 14 -104 180 -156 -1 128 -43 213 438
4622 438 151 198 5 133 164 376 245 437 417 194 385 334 516 156 429 245 58 361 205 200 207 135 -21
4645 -21 154 316 180 -93 126 -28 -83 -66 -211 -280 12 -45 -351 -134 -8 -395 -46 -30 -462 -26 -350 -396
4667 -396 -43 -284 -370 -471 -383 -507 -325 -249 -358 -346 -398 -276 -584 -169 -201 -343 -82 -198 -70 28 -203 -25
4689 -25 20 -53 -31 142 188 78 188 312 143 306 430 284 451 19 133 71 221 220 316 367 168 408 93
4712 93 237 195 248 224 260 248 345 -33 227 130 -12 262 282 36 117 47 -76 -272 166 -215 -476 -45 -229 -59
4736 -59 -350 -329 -440 -430 -221 -390 -370 -53 -473 -284 -98 -159 -201 7 -461 34 -403 -453 -107 -249 -165 -93 -222
4759b22J98k31J67R5k22L54K12l28L16n1j90j7J66k42L37j70M8OK10M5m36M59
4781E04n9l08N01k45j25J40k57J54J70k38p8J07l84K77o5j09O3M7J93j98q1O5
4803G4p8j34L8j79L9K53k46j40M45m77PL78n9k68l4J01j16N2J25ol2R4j37Q6L41
4828A27k24j7K04k3M7j52k37P0Q8P1N6j55L16J1qj31K10L7j2k09J10J55j40K10
4852D04j03r5J73k56q8K43n9J68Nj45K07j14k77K91j62J2n8R1J06K9k92R2k8l00
4876a56J39k1k63N16k06j97M5j94j1L57k30J47k81j4J45k44K60J34j99N2j50l8
4898d09M39j46l02O0J83k2j01J33k3O7P3jj15K60j75J66m4j20M6N4J14j27nO3
4922F8N5q5P2K27K5k76M34l07k50N11l35J6J59k9k7k08J97J50m87M21j83k9Q8
$$ plain form
4759 -222 -24 -255 -88 7 -215 139 351 23 339 288 98 81 247 5 342 172 220 226 436 481 45 504
4781 504 445 137 638 393 268 408 151 305 475 237 159 266 -118 159 94 -15 48 95 288 90 9 74
4803 74 -4 -138 -100 -279 -240 13 -233 -373 72 -405 -398 -20 -79 -347 -381 -280 -396 -344 -219 -225 -257 -163 -300 -214 127
4828 127 -97 -114 90 67 114 -38 -275 -205 -117 -46 10 -145 171 182 174 43 253 290 278 69 179 334 194 404
4852 404 301 206 379 123 35 278 219 387 392 247 454 340 63 354 192 204 146 237 343 372 80 172 144 -156
4876 -156 -17 -38 -301 215 9 -188 -143 -337 -348 9 -221 -74 -355 -369 -224 -468 -208 -74 -273 -221 -371 -409
4898 -409 30 -116 -418 -358 -175 -197 -298 -165 -188 -121 -48 -49 -164 96 -79 87 43 -77 -31 23 137 10 5 68
4922 68 123 38 110 337 362 86 520 213 -37 474 139 155 314 285 258 50 247 397 -90 331 148 119 207
4945B07n6l2j07m4J79k22K38o9q4j26K41j89j22K70k02J0k6r5l78M17k12J79N0
4968a73J34j98j11R6N3P2j27M3j59K55j13K00p9k70J54K86k46J55J76k15J46j36
4990e7J88k43J82j06J08M8K02l80L98j23l44K30l2J98rN2j20K72p3j4k57l9M6
5013A27J22K8l6J61k6k36j5K69k70k32L33l73M40l14k22J19J66n5j63K35j48k09
5035b99q9N71m83K18n6j22K09k60J23J02k32Qj00J74J24j17O9m6J01K0J81l05
5057b09K16j77K34k89L77k4p3q7Q4P4j69K84o3o4Nj58L93Pj00p5J65j99J47k91
5081HK12Q2q6k6K40j46k16J48m9J50k78J57j8p4K52m41K45j14K18j69j52J2l47
5104c92M10j83K8pJ60k39J21K9k52L25o63K45J95jj85K6j15O3l6Q3L30m69N93
$$ plain form
4945 207 151 119 12 -32 147 -75 163 94 10 -116 125 -64 -186 84 -118 -108 -134 -229 -607 -190 -402 -223 -173
4968 -173 -39 -237 -348 -252 -199 -127 -254 -211 -370 -115 -228 -28 -107 -377 -223 63 -183 -28 148 -67 79 -57
4990 -57 131 -112 70 -36 72 120 322 -58 340 217 -127 103 71 269 260 312 192 464 391 377 120 81 127
5013 127 249 277 241 402 376 140 125 394 124 -108 225 -148 292 -22 -244 -125 41 -14 -177 58 -90 -299
5035 -299 -388 183 -300 -82 -138 -260 -51 -311 -188 -86 -318 -310 -410 -236 -112 -229 -160 -206 -105 -85 96 -209
5057 -209 7 -170 64 -225 152 128 55 -32 52 126 -43 241 178 114 119 -39 354 361 261 186 351 152 299 8
5081 8 220 302 216 190 430 284 68 216 167 317 39 196 178 104 356 -85 160 46 264 95 -57 -45 -392
5104 -392 18 -165 -137 -144 16 -223 -102 -73 -325 0 -663 -418 -223 -224 -409 -383 -498 -435 -471 -388 -58 -527 66
5127F6j32J34l85O72p09J68J73L56K68o62k84L83j20q3M22k82J12m4K64j72J53
5148B98k8J19j66Q4p1K76o8j97J40j09o8o8J18j53J70L8j10j54J84j34k5n3m8
5171b5J07J50j88PJ45j95o8K20n1r1r6r0j08R6M9J64k32K4k15M23q4j5j92K01
5195f4j23l69L68l1j67L07k29R7q4K79k01MJ5K26k64J92m3K19O3k37j57L76q5
5218I2j32K28K48k76J45j59o6K49p3J34mP7k95j02P7j5M04k54q4O0Oj65K3J05
5242B23k88J52J97m45L04L69l04n1p6k86K99k09N1j43J29n6j76K56m6R1k65K74
5264@n45J48K24j91n3oP9J15K3K1J38l53M47j13n5Q4l61K55L55l48M1Q4l51M94
5288A32k30n8Q0J29j91K72L6J42j12P7j1j59K04R7l13K82m2j57k4K3j24J48l5
$$ plain form
5127 66 -66 68 -317 355 -354 -186 -13 343 611 -51 -335 48 -72 -155 267 -15 97 53 317 145 298
5148 298 270 389 223 307 236 512 444 247 387 278 210 142 260 107 277 315 205 51 235 101 76 23 -25
5171 -25 82 232 44 51 196 1 -67 153 102 11 -85 -175 -283 -187 -138 26 -206 -182 -397 26 -58 -73 -265 -64
5195 -64 -187 -556 -188 -219 -386 -79 -308 -211 -295 -16 -217 -213 -198 28 -236 -44 -87 132 195 -42 -199 177 92
5218 92 -40 188 436 160 305 146 80 329 256 390 386 463 168 66 143 128 532 278 194 254 260 95 118 223
5242 223 -65 87 284 -161 143 512 208 157 81 -205 94 -115 -64 -207 -78 -134 -310 -54 -100 -9 -274 0
5264 0 -545 -397 -173 -364 -417 -423 -344 -229 -206 -185 -47 -400 47 -66 -121 -37 -398 -143 212 -136 -95 -11 -362 132
5288 132 -98 -156 -76 53 -138 134 170 312 200 277 266 107 311 408 95 377 335 178 154 177 53 201 166
5311A66j05L94j87M6j96M8L77m89J26j8L5j18Kk6k02Q0o3M8Q4k03J10J59k51M19
5335B36n36K2m7J75Q4k59J60K14k65N9l4l16K79n6q0K70k16P1K13k20L1j02K86
5358c1j4r6J76j69LK19J04k70O5J55L8j4p7k29M37j55k2m6K8L34k44j8j5K43p2
$$ plain form
5311 166 61 455 268 314 118 166 543 54 180 162 197 79 81 55 -147 -67 -130 -82 2 -201 -91 68 -183 236
5335 236 -300 -278 -325 -150 -66 -325 -165 49 -216 -157 -191 -507 -228 -284 -364 -94 -310 -239 -26 -246 -215 -317 -31
5358 -31 -45 -141 35 -134 -131 88 192 -78 -13 142 180 166 89 -140 297 142 120 74 102 436 192 174 159 402 330
$$ [...]
8191b08
##END NTUPLES=NMR FID
##END=
