##TITLE=1H_SL17RIM4-5
 200.13Hz,CDCl3.
 8 sc
 3.6.2026
##JCAMPDX= 6.0         $$ Bruker NMR JCAMP-DX V2.0
##DATA TYPE= NMR FID
##DATA CLASS= NTUPLES
##ORIGIN= UXNMR, Bruker Analytische Messtechnik GmbH
##OWNER= pz
$$ XWIN-NMR		Version 3.5
$$ Wed Jun  3 16:14:01 2026 Russian Standard Time (UT+4h)  she@DPX200
##.OBSERVE FREQUENCY= 200.131
##.OBSERVE NUCLEUS= ^1H
##.DELAY= (6, 6)
##.ACQUISITION MODE= SIMULTANEOUS
##.ACQUISITION SCHEME= undefined
##.AVERAGES= 8
##.DIGITISER RES= 18
##SPECTROMETER/DATA SYSTEM= spect
##.PULSE SEQUENCE= zg30
##.SOLVENT NAME= CDCl3
##.SHIFT REFERENCE= (INTERNAL, CDCl3, 0, 14.3821)
##AUDIT TRAIL= $$ (NUMBER, WHEN, WHO, WHERE, WHAT)
$$ ##TITLE= Audit trail, XWIN-NMR		Version 3.5
$$ ##JCAMPDX= 5.01
$$ ##ORIGIN= Bruker BioSpin GmbH
$$ ##OWNER= she
$$ F:/spectra/data/she/nmr/H-C/1/audita.txt
$$ ##AUDIT TRAIL=  $$ (NUMBER, WHEN, WHO, WHERE, WHAT)
(   1,<2026-06-03 16:12:31.60 +0400>,<she>,<DPX200>,
      <created by zg, POWCHK disabled, PULCHK disabled
       configuration hash MD5:
       00 E9 B6 7A A2 85 ED C7 34 08 36 98 17 FE 4E 26
       data hash MD5: 16K
       E9 E8 C4 90 B1 BE FB 7B 55 9D 39 FD 0E B1 FA 29>)
$$ ##END=
$$ 
$$ hash MD5
$$ A3 4D F9 30 50 0A C5 1C F8 AD C0 58 02 28 19 3D
##$RELAX= 
##$RELAX= 
##$RELAX= 
##$RELAX= 
##$RELAX= 
##$RELAX= 
$$ Bruker specific parameters
$$ --------------------------
##$DU= <F:/spectra>
##$EXPNO= 1
##$NAME= <H-C>
##$PROCNO= 1
##$TYPE= <nmr>
##$USER= <she>
##$AMP= (0..31)
100 100 100 100 100 100 100 100 100 100 100 100 100 100 100 100 100 100 
100 100 100 100 100 100 100 100 100 100 100 100 100 100 
##$AQSEQ= 0
##$AQ_mod= 1
##$AUNM= <au_zg>
##$AUTOPOS= <>
##$BF1= 200.13
##$BF2= 200.13
##$BF3= 200.13
##$BF4= 200.13
##$BF5= 200.13
##$BF6= 200.13
##$BF7= 200.13
##$BF8= 200.13
##$BYTORDA= 1
##$CFDGTYP= 0
##$CFRGTYP= 5
##$CHEMSTR= <none>
##$CNST= (0..31)
1 1 145 1 1 1 1 1 1 1 1 1 1 1 1 1 1 1 1 1 1 1 1 1 1 1 1 1 1 1 1 1 
##$CPDPRG= <>
##$CPDPRG1= <>
##$CPDPRG2= <>
##$CPDPRG3= <>
##$CPDPRG4= <mlev>
##$CPDPRG5= <mlev>
##$CPDPRG6= <mlev>
##$CPDPRG7= <mlev>
##$CPDPRG8= <mlev>
##$CPDPRGB= <>
##$CPDPRGT= <>
##$D= (0..31)
0 0.7 0 0 0 0 0 0 0 0 0 0.03 0 0 0 0 0 0 0 0 0 0 0 0 0 0 0 0 0 0 0 0 
##$DATE= 1780488750
##$DBL= (0..7)
120 120 120 120 120 120 120 120 
##$DBP= (0..7)
150 150 150 150 150 150 150 150 
##$DBP07= 0
##$DBPNAM0= <>
##$DBPNAM1= <>
##$DBPNAM2= <>
##$DBPNAM3= <>
##$DBPNAM4= <>
##$DBPNAM5= <>
##$DBPNAM6= <>
##$DBPNAM7= <>
##$DBPOAL= (0..7)
0.5 0.5 0.5 0.5 0.5 0.5 0.5 0.5 
##$DBPOFFS= (0..7)
0 0 0 0 0 0 0 0 
##$DE= 6
##$DECBNUC= <off>
##$DECIM= 32
##$DECNUC= <off>
##$DECSTAT= 4
##$DIGMOD= 1
##$DIGTYP= 9
##$DL= (0..7)
0 120 120 120 120 120 120 120 
##$DP= (0..7)
150 150 150 150 150 150 150 150 
##$DP07= 0
##$DPNAME0= <>
##$DPNAME1= <>
##$DPNAME2= <>
##$DPNAME3= <>
##$DPNAME4= <>
##$DPNAME5= <>
##$DPNAME6= <>
##$DPNAME7= <>
##$DPOAL= (0..7)
0.5 0.5 0.5 0.5 0.5 0.5 0.5 0.5 
##$DPOFFS= (0..7)
0 0 0 0 0 0 0 0 
##$DQDMODE= 0
##$DR= 18
##$DS= 0
##$DSLIST= <SSSSSSSSSSSSSSS>
$$ [...]
##$SUBNAM0= <"">
##$SUBNAM1= <"">
##$SUBNAM2= <"">
##$SUBNAM3= <"">
##$SUBNAM4= <"">
##$SUBNAM5= <"">
##$SUBNAM6= <"">
##$SUBNAM7= <"">
##$SUBNAM8= <"">
##$SUBNAM9= <"">
##$SW= 18.0517599122864
##$SWIBOX= (0..15)
0 0 2 0 0 0 0 0 0 0 0 0 0 0 0 0 
##$SW_h= 3612.71676300578
##$TD= 16384
##$TD0= 1
##$TE= 0
##$TE2= 300
##$TE3= 300
##$TEG= 300
##$TL= (0..7)
0 120 120 120 120 120 120 120 
##$TP= (0..7)
150 150 150 150 150 150 150 150 
##$TP07= 0
##$TPNAME0= <>
##$TPNAME1= <>
##$TPNAME2= <>
##$TPNAME3= <>
##$TPNAME4= <>
##$TPNAME5= <>
##$TPNAME6= <>
##$TPNAME7= <>
##$TPOAL= (0..7)
0.5 0.5 0.5 0.5 0.5 0.5 0.5 0.5 
##$TPOFFS= (0..7)
0 0 0 0 0 0 0 0 
##$TUNHIN= 0
##$TUNHOUT= 0
##$TUNXOUT= 0
##$USERA1= <user>
##$USERA2= <user>
##$USERA3= <user>
##$USERA4= <user>
##$USERA5= <user>
##$V9= 5
##$VALIST= <valist>
##$VCLIST= <CCCCCCCCCCCCCCC>
##$VD= 0
##$VDLIST= <DDDDDDDDDDDDDDD>
##$VPLIST= <PPPPPPPPPPPPPPP>
##$VTLIST= <TTTTTTTTTTTTTTT>
##$WBST= 1024
##$WBSW= 4
##$XGAIN= (0..3)
0 0 0 0 
##$XL= 0
##$YL= 0
##$YMAX_a= 59312
##$YMIN_a= -44895
##$ZGOPTNS= <>
##$ZL1= 120
##$ZL2= 120
##$ZL3= 120
##$ZL4= 120
##$ABSF1= 10
##$ABSF2= 0
##$ABSG= 5
##$ABSL= 3
##$ALPHA= 0
##$AQORDER= 0
##$ASSFAC= 0
##$ASSFACI= 0
##$ASSFACX= 0
##$ASSWID= 0
##$AUNMP= <proc_1d>
##$AZFE= 0.1
##$AZFW= 0.1
##$BCFW= 1
##$BC_mod= 2
##$BYTORDP= 1
##$COROFFS= 0
##$CY= -3
##$DATMOD= 1
##$DC= 2
##$DFILT= <>
##$DTYPP= 0
##$F1P= 0
##$F2P= 0
##$FCOR= 0.5
##$FTSIZE= 0
##$FT_mod= 4
##$GAMMA= 1
##$GB= 0.15
##$INTBC= 1
##$INTSCL= 1
##$ISEN= 128
##$LB= 0.25
##$LEV0= 0
##$LPBIN= 0
##$MAXI= 10000
##$MC2= 0
##$MEAN= 0
##$ME_mod= 0
##$MI= 1.114404
##$NCOEF= 0
##$NC_proc= 0
##$NLEV= 6
##$NOISF1= 3.799351
##$NOISF2= 2.8
##$NSP= 1
##$NTH_PI= 0
##$NZP= 0
##$OFFSET= 14.38212
##$PC= 1
##$PHC0= -4225.828
##$PHC1= 24.59229
##$PH_mod= 1
##$PKNL= yes
##$PPARMOD= 0
##$PSCAL= 0
##$PSIGN= 0
##$REVERSE= no
##$SF= 200.129724274929
##$SI= 16384
##$SIGF1= 3
##$SIGF2= 2
##$SINO= 400
##$SIOLD= 16384
##$SREGLST= <1H.CDCl3>
##$SSB= 0
##$STSI= 0
##$STSR= 0
##$SW_p= 3205.1282051282
##$SYMM= 0
##$S_DEV= 0
##$TDeff= 0
##$TDoff= 0
##$TI= <>
##$TILT= no
##$TM1= 0
##$TM2= 0
##$TOPLEV= 0
##$USERP1= <user>
##$USERP2= <user>
##$USERP3= <user>
##$USERP4= <user>
##$USERP5= <user>
##$WDW= 1
##$XDIM= 8192
##$YMAX_p= 0
##$YMIN_p= 0
$$ End of Bruker specific parameters
$$ ---------------------------------
##NTUPLES= NMR FID
##VAR_NAME=  TIME,          FID/REAL,        FID/IMAG
##SYMBOL=    X,             R,               I
##VAR_TYPE=  INDEPENDENT,   DEPENDENT,       DEPENDENT
##VAR_FORM=  AFFN,          ASDF,            ASDF
##VAR_DIM=   8192,          8192,            8192
##UNITS=     SECONDS,       ARBITRARY UNITS, ARBITRARY UNITS
##FACTOR=    0.0002768,     1,               1
##FIRST=     0,             0,               0
##LAST=      2.2672688,     0,               0
##MIN=       0,             -44895,          0
##MAX=       2.2672688,     59312,           0
$$ Real data points
##PAGE= N=1
##DATA TABLE= (X++(R..R)), XYDATA
$$ [...]
$$ plain form
1852 799 695 -407 -761 -341 148 156 -325 -62 380 120 -333 -832 -511 207 633 468 180 -199 -150 38 -231
1873 -231 -217 109 750 770 -246 -869 -372 220 311 18 -2 310 -13 -86 -470 -362 167 697 317 -228 -603
1894 -603 -194 -159 -118 -83 335 492 0 -614 -617 -471 -18 498 220 -64 -222 8 -248 -515 -352 49 694 518
1916 518 -352 -585 -453 92 -192 81 548 457 228 -82 -466 -62 232 496 115 -125 -94 -52 -192 -419 -114
1937 -114 335 628 203 -602 -494 -223 280 405 339 105 535 112 -465 -630 -35 587 772 423 64 -122
1957 -122 -377 44 -156 35 303 559 159 -196 -650 -409 252 334 -2 142 -231 74 -473 -649 -276 169
1977 169 746 36 -358 -676 -311 337 168 -3 337 224 41 -732 -412 -282 323 614 -20 -383 46 -264
1997 -264 -230 -160 68 494 691 -108 -382 -217 -296 179 -10 100 -81 -253 -431 -363 -455 -46 511 266 42 9
$$ packed form
1852G99j04j102l54M20M89Qm81K63M42k60m53m99L21P18M26j65k88l79M9J88k69
1873b31J4L26O41K0j016o23M97N92R1k93k0L12l23p3l84J08N29N30l80n45l75
1894f03M09L5M1L5M18J57m92o14lJ46M53N16k78k84j58K30k56k67J63M01O45j76
1916E18q70k33J32N45k84K73M67r1k29l10l84M04K94K64l81k40L1M2j40k27L05
1937a14M49K93m25q05J08K71N03J25o6k34M30m23n77j65N95O22J85l49l59j86
1957a22k55M21k00J91K68K56m00l55m54K41O61Q2l36J44l73L05n47j76L73M45
1977A69N77p10l94l18L65O48j69j71L40j13j83p73L20J30O05K91o34l63M29l10
1997b64L4P0K28M26J97p99k74J65p9M75j89J10j81j72j78O8r2M09N57k45k24l3
$$ plain form
2019 9 -349 96 177 -133 201 210 303 -226 -352 -420 -60 150 145 330 264 -295 -189 -145 -515 6 554 228 -7 -430
2043 -430 -133 156 65 294 -162 283 89 -535 -122 -433 220 454 217 -223 -21 -225 -272 -269 6 213 346
2064 346 251 -254 -380 -387 -70 115 215 -96 246 5 -243 -496 -58 234 210 157 72 -174 -390 -119 -74 145
2086 145 322 194 -1 -78 -457 10 -54 437 240 70 62 -162 -238 -19 231 203 319 -92 -198 -188 -292 -208 -23
2109 -23 151 314 113 -50 -152 -425 -60 174 433 96 -204 -440 -449 -163 85 440 -27 154 36 -32 -205
2130 -205 -66 277 165 451 176 121 -112 -476 111 -45 269 427 107 -27 -153 -165 -256 -12 248 172 148 -247
2152 -247 -430 -240 36 296 100 243 199 -78 -271 -275 -154 81 162 203 -76 -213 -20 -33 61 169 554 337
2174 337 -318 -268 59 -55 48 87 464 272 197 -333 -379 56 7 296 179 -25 -128 -164 57 -217 217 43
$$ packed form
2019Il58M45Q1l10L34RR3n29j26o8L60K10nJ85o6n59J06M4l70N21N48l26k35m23
2043d30K97K89r1K29m56M45j94o24M13l11O53K34k37m40K02k04m7LK75K07J33
2064C46r5n05j26pL17J85J00l11L42k41k48k53M38K92k4n3q5k46k16K71M5K19
2086A45J77j28j95p7l79M67o4M91j97j70qk24p6K19K50k8J16m11j06J0j04Q4J85
2109b3J74J63k01j63j02k73L65K34K59l37l00k36rK86K48L55m67J81j18o8j73
2130b05J39L43j12K86k75n5k33l64N87j56L14J58l20j34j26j2r1K44K60p6k4l95
2152b47j83J90K76K60j96J43m4k77j93mJ21K35Q1M1k79j37J93j3R4J08L85k17
2174C37o55N0L27j14J03L9L77j92p5n30m6M35m9K89j17k04j03l6K21k74M34j74
$$ plain form
2196 43 403 -158 -113 -393 -35 179 109 -191 400 379 114 -256 -419 -19 203 228 89 147 -27 -277 -294 255
2218 255 163 353 270 -14 -348 -139 -5 121 12 224 41 180 -180 -259 -36 -32 123 129 185 -165 -280 -30 178
2241 178 195 453 288 207 124 -168 -404 -353 22 85 32 -91 -81 164 -51 -216 266 244 282 77 -264 -274 22
2264 22 -18 97 -22 88 -197 -219 -206 -240 32 369 130 -91 -405 -15 -45 -13 -117 90 366 122 79 -101 -164
2287 -164 26 312 198 4 51 -150 -149 -74 -183 186 166 200 -79 -397 27 265 133 26 128 -51 311 82
2309 82 -249 -251 -139 385 171 -181 -148 -6 -61 -296 -65 109 342 324 -142 -455 -266 3 149 248 -71 -25 32
2332 32 -282 -274 -315 327 456 147 101 -315 -108 86 -14 67 165 53 229 -103 -465 -441 209 280 141 -57 -76
2355 -76 -204 -122 31 -117 260 352 91 -271 -289 134 -280 -64 108 139 -9 258 -208 -509 -633 218 264 106
$$ packed form
2196D3L60n61M5k80L58K14p0l00N91k1k65l70j63M00K22K5j39N8j74k50j7N49
2218B55r2J90q3k84l34K09J34J26j09K12j83J39l60p9K23MJ55ON6l50j15K50K08
2241A78J7K58j65q1q3k92k36N1L75O3n3j23J0K45k15j65M82k2L8k05l41j0K96
2264B2m0J15j19J10k85k2J3l4K72L37k39k21l14L90l0L2j04K07K76k44m3j80o3
2287a64J90K86j14j94M7k01JP5j09L69k0L4k79l18M24K38j32j07J02j79L62k29
2309H2l31kJ12N24k14l52L3J42n5k35K31J74K33j8m66l13J89K69J46R9l19M6N7
2332C2l14Qm1O42J29l09m6m16K07J94j00Q1R8j12J76l32l62K4O50P1j39j98j9
2355g6j28Q2J53j48L77R2k61l62j8M23m14K16J72L1j48K67m66l01j24Q51M6j58
$$ plain form
2377 106 0 -110 -77 9 -300 95 90 243 46 -228 -32 -19 -6 182 -93 60 -22 63 22 -225 -168 167 423
2400 423 222 -35 -146 257 74 73 -128 149 70 -174 -147 -549 -35 -41 87 -252 -128 -39 30 -361 -220 66 154
2423 154 537 106 18 -93 -318 223 44 -34 114 12 16 -251 -351 147 402 243 166 -104 -351 -224 8 -221
2445 -221 35 327 358 108 -151 -446 11 364 333 -89 -3 70 26 3 -221 -11 45 252 36 -202 -386 -52
2467 -52 -19 43 92 172 218 169 254 -208 169 272 349 -188 -176 -91 -156 -69 -29 177 607 285 -107 -377 89 123 4
2492 4 41 -229 -66 -85 -292 151 -228 -27 -1 316 -100 -234 -58 90 -120 -157 235 100 264 -173 -199 -107 178
2515 178 180 -23 135 -66 112 -127 -81 -124 162 322 122 -19 -273 -151 191 71 206 -8 -83 147 72 -461
2537 -461 -277 205 196 145 -39 68 -378 -125 -280 12 -45 191 214 87 -250 -148 30 214 -127 51 97 -27
$$ packed form
2377A06j06j10L3Q6l09L95nJ53j97k74J96J3J3J88k75J53q2Q5m1k47N7L35K56
2400D23k01k57j11M03j83jk01K77p9k44K7m02N14oJ28l39J24Q9O9l91J41K86Q8
2423A54L83m31q8j11k25N41j79p8J48j02Mk67j00M98K55j59p7k70k47J27K32k29
2445b21K56K92L1k50k59k95M57L53l1m22Q6P3m4k3k24K10N6K07k16k38j84L34
2467e2L3O2M9Q0M6m9Q5m62L77J03P7n37J2Q5o5Q7M0K06M30l22l92k70M66L4j19
2492DL7k70J63j9k07M43l79K01K6L17m16j34J76J48k10l7L92j35J64m37k6R2K85
2515A78Kk03J58k01J78k39M6m3K86J60k00j41k54J22L42j20J35k14p5K30p5n33
2537d61J84M82rn1j84J07m46K53j55K92n7K36K3j27l37J02J78J84l41J78M6j24
$$ plain form
2559 -27 -122 -15 181 121 423 46 -198 -208 -245 91 -29 -346 58 383 177 -109 -129 59 119 -6 11 -264 2
2582 2 -30 -246 79 -110 59 298 -6 -223 -139 -11 -103 2 -16 69 187 281 -288 -393 -36 74 39 99 -135
2605 -135 -41 -225 -172 49 14 313 1 93 -135 -119 42 -187 -65 -44 117 -101 -240 124 17 78 192 196 169
2628 169 5 -84 -104 -44 85 461 102 36 26 -108 -94 28 233 344 179 -35 -24 -202 -149 -30 327 254 212
2651 212 113 -148 -7 -122 -84 247 66 169 -173 -136 -70 64 -250 -79 -92 -257 -116 -1 164 159 283 293 134
2674 134 87 -39 -311 -218 67 99 90 42 -195 -2 -164 -359 150 -35 296 -42 24 -296 -306 -228 89 -102 13
2697 13 -193 437 206 -70 -223 -23 151 313 150 89 -209 -167 95 -53 101 138 13 -62 -248 -115 -132 -26
2719 -26 87 -54 51 -287 -141 86 -95 13 98 43 -60 -13 -242 75 -89 125 -179 -161 -93 -124 38 54 48
$$ packed form
2559b7r5J07J96o0L02l77k44j0l7L36j20l17M04L25k06k86k0J88O0j25J7k75K66
2582Bl2k16L25j89J69K39l04k17Q4J28r2J05j8Q5J18R4n69j05L57J10l5O0k34
2605a35R4j84N3K21l5K99l12R2k28J6J61k29J22K1J61k18j39L64j07O1J14Mk7
2628A69j64q9k0O0J29L76l59o6j0j34J4J22K05J11j65k14J1j78N3J19L57p3m2
2651B12r9k61J41j15L8L31j81J03l42L7O6J34l14J71j3j65J41J15J65nJ24J0j59
2674A34m7j26k72R3K85L2rm8k37J93j62j95N09j85L31l38O6l20j0P8L17j91J15
2697A3k06O30k31k76j53K00J74J62j63o1k98M2K62j48J54L7j25p5j86J33j7J06
2719b6J13j41J05l38J46K27j81J08Q5n5j03M7k29L17j64K14l04J8O8l1J62J6o
$$ plain form
2742 48 195 123 60 74 78 0 102 -95 -53 47 -39 -91 48 -64 -178 -105 9 -36 -231 -190 -135 -134 -76 388 -242 -64
2768 -64 8 60 -91 139 -7 125 85 217 -323 65 -26 -96 -21 367 108 -45 78 -101 -53 60 80 88 -32 -329
2792 -329 -104 70 -260 239 1 17 178 127 60 30 -193 -187 113 -222 -51 -245 -153 -91 -164 -79 -60 -32 219 151
2816 151 20 -59 -26 -247 -97 91 72 109 97 -69 -79 -122 15 -38 -20 -60 31 -35 14 92 217 151 81 -142 -15
2841 -15 -73 -23 -43 -72 273 105 297 -366 -20 89 -69 -29 -1 188 -198 61 -199 -284 47 12 191 -243 -113
2864 -113 62 -69 -124 50 70 -15 45 -71 -218 204 15 398 -62 -109 142 226 -111 -110 90 -50 -291 84 -309
2887 -309 14 205 0 -118 304 90 -103 134 -59 -5 105 -237 94 106 -241 41 129 -128 174 87 43 -35
2909 -35 -26 -76 204 82 45 -9 46 -62 -24 -223 -146 241 -174 -114 87 -53 -137 119 -71 118 -263 1 177 54
$$ packed form
2742D8J47p2o3J4Mp8J02j97M2J00q6n2J39j12j14P3J14m5j95M1N5JN8M64o30J78
2768f4P2N2j51K30j46J32m0J32n40L88r1p0P5L88k59j53J23j79M8J13K0Qj20k97
2792c29K25J74l30M99k38J6J61n1o7l0k23OL00l35J71j94R2O2p3Q5J9K8K51o8
2816A51j31p9L3k21J50J88j9L7j2j66j0m3J37n3J8m0R1o6M9P8J25o6p0k23J27
2841a5n8N0k0k9L45j68J92o63L46J09j58M0K8J89l86K59k60q5L31l5J79m34J30
2864a13J75j31n5J74K0q5O0j16j47M22j89L83m60m7K51Q4l37JK00j40k41L75l93
2887c09L23J91k05j18M22k14j93K37j93N4J10l42L31J2l47K82Q8k57L02q7m4p8
2909c5Rn0K80j22l7n4N5j08L8j99P7L87m15O0K01j40q4K56j90J89l81K64J76j23
$$ plain form
2933 54 84 -106 0 -112 -92 -111 3 5 35 -164 -153 272 15 57 -12 -381 -4 73 128 213 70 192 53 98 -8
2958 -8 -89 270 167 -61 294 -345 221 115 10 -90 113 437 -18 -54 43 -1 208 200 140 -103 159 206 -52
2981 -52 -127 -126 -270 -157 258 -127 18 -39 104 -241 -128 -148 110 239 121 -220 -204 19 -16 -11 11 -97 -4 -34
3005 -34 16 -224 49 112 159 -88 -371 -163 -83 103 201 83 -149 95 -62 -113 55 55 129 -124 26 20 -218 50
3029 50 -178 76 93 -16 -125 67 -44 38 -66 120 -62 -163 -74 6 -162 116 41 73 139 -62 163 -209 -234
3052 -234 31 181 93 109 -186 185 61 102 -63 201 261 24 -4 212 -62 -223 61 -185 -50 320 50 14
3074 14 -119 113 207 68 -50 46 171 279 -69 132 -51 -64 -116 103 136 127 -91 -148 -179 217 -13 -21 -141 -259
3098 -259 207 -114 6 42 162 -183 90 15 62 288 -89 -37 70 -146 94 -118 -148 70 41 -190 28 -406
$$ packed form
2933E4L0j90J06j12K0j9J14KL0j99J1M25k57M2o9l69L77P7N5Q5j43J22j39M5j06
2958hq1L59j03k28L55o39N66j06j05j00K03L24m55l6R7m4K09qo0k43K62M7k58
2981e2p5Jj44J13M15l85J45n7J43l45J13k0K58J29j18l41J6K23l5NK2j08R3l0
3005c4N0k40K73O3M7k47k83K08Q0J86R8j18k32K44j57n1J68%P4k53J50ok38K68
3029E0k28K54J7j09j09J92j11Q2j04J86j82j01Q9Q0j68K78p5L2O6k01K25l72k5
3052b34K65J50q8J6k95L71j24M1j65K64O0k37k8K16k74j61K84k46J35L70k70l6
3074A4j33K32R4j39j18R6J25J08l48K01j83j3n2K19L3rk18n7l1L96k30qj20j18
3098b59M66l21J20L6J20l45K73p5M7K26l77N2J07k16K40k12l0K18k9k31K18m34
$$ plain form
3120 -406 -8 121 -109 -197 8 21 -170 217 -203 -208 -34 93 56 -247 -51 -106 0 55 70 -184 -80 149 185
3143 185 -66 141 -169 -67 -75 -39 31 -79 16 5 -19 61 160 195 222 -75 -125 185 -170 -14 -240 40 -84 117
3167 117 -19 55 -194 -62 140 32 169 -38 0 -56 77 -164 393 42 84 255 56 -22 74 191 52 -90
3189 -90 -49 278 -2 -31 -16 64 101 120 83 -90 -52 107 -38 -100 -86 25 28 -181 -34 -12 71 -65 48 206 233
3214 233 -90 30 -317 47 10 103 145 385 -136 -133 -442 -114 90 -11 109 344 114 -105 -146 93 41 -115
3236 -115 186 9 99 199 11 48 -51 131 -252 245 -102 -36 -84 136 69 182 245 -279 -97 -197 116 -88
3258 -88 2 156 -21 -61 -42 -5 -6 -63 -114 44 121 96 99 11 -58 59 -9 -11 41 -308 118 -17 63 47 8 75 57 -8
3286 -8 -196 86 55 57 12 216 -78 -59 -6 -4 -32 233 -85 209 152 50 -51 91 146 -116 25 69 200 -204 -53
$$ packed form
3120d06L98J29k30q8K05J3j91L87m20nJ74J27l7l03J96n5J06N5J5k54J04K29L6
3143A85k51K07l10J02qL6P0j10R5j1k4Q0R9L5K7k97n0L10l55J56k26K80j24K01
3167A17j36P4k49J32K02j08J37k07L8n6J33k41N57l51M2J71j99p8R6J17j39j42
3189i0M1L27k80k9J5Q0L7J9l7j73L8J59j45o2J4J11Lk09J47K2Q3j36J13J58K7
3214B33l23J20l47L64l7R3M2K40n21Ll09L28K04j01J20K35k30k19m1K39n2j56
3236a15L01j77R0J00j88L7r9J82l83M97l47O6m8K20o7J13O3n24J82j00L13k04
3258h8R0J54j77m0J9L7jn7n1J58P7k5Lq8o9J17o8kN2l49M26j35Q0j6l9O7j8o5
3286hj88K82l1Km5K04k94J9N3Kk8K65l18K94n7j02j01J42N5k62J41M4J31m04J51
$$ plain form
3311 -53 172 224 272 -188 150 -74 -214 37 48 -41 10 285 -4 -202 11 4 -262 -18 149 55 -171 136 -43
3334 -43 -169 -198 -231 -15 163 -205 -49 -57 222 -197 -27 -89 -73 -1 -45 -147 141 -147 -17 44 68 -67 -76 -112 253
3359 253 -229 49 -52 122 55 -161 -13 54 48 -83 127 93 241 23 -121 -187 -121 -105 5 -118 62 -59 -161
3382 -161 -155 -37 45 23 -131 -36 -29 70 121 112 24 -204 -9 4 18 195 112 -12 -11 -92 257 40 168 -161 172 265
3408 265 116 93 -113 -116 24 185 201 -164 -190 2 25 285 59 -159 -80 102 27 0 34 149 -283 10 -18 -160
3432 -160 118 -289 -77 167 338 -18 43 -112 36 -202 312 113 233 -12 -55 40 -159 283 -206 -54 -381
3453 -381 186 -20 8 203 -39 -16 -274 54 1 -13 -119 80 142 -6 -217 -264 -191 -97 -49 -171 144 143 -20 37
3477 37 264 89 -68 87 -25 55 -225 121 78 135 -262 -192 35 69 -4 -113 -49 113 222 -230 95 -23 47
$$ packed form
3311e3K25N2M8m60L38k24j40K51J1q9N1K75k89j98K13pk66K44J67r4k26L07j79
3334d3j26k9l3K16J78l68J56qK79m19J70o2J6P2m4j02K88k88J30O1K4j35rl6L65
3359B53m82K78j01J74o7k16J48O7oj31K10l4J48k18j44o6O6J6J10j23J80j21j02
3382a61OJ18Q2k2j54R5PR9N1rq8k28J95J3J4J77q3j24Jq1L49k17J28l29L33R3
3408B65j49k3k06lJ40J61J6l65k6J92K3K60k26k18P9J82p5k7L4J15m32K93k8j42
3432a60K78m07K12K44J71l56O1j55J48k38N14j99J20k45m3R5j99M42m89J52l27
3453c81N67k06K8J95k42K3k58L28n3j4j06J99O2j48k11m7P3R4M8j22L15jj63N7
3477C7K27j75j57J55j12Q0k80L46m3N7l97P0K27L4p3j09O4J62J09m52L25j18P0
$$ plain form
3500 47 27 -290 178 -148 -64 115 68 283 341 -8 68 -98 -124 -131 8 57 321 77 227 117 -86 -157 81 -209
3524 -209 -87 42 -99 91 -82 1 25 -128 -112 74 72 -111 -160 -73 344 -20 40 -29 -103 -176 -161 11 -103 -34
3548 -34 -48 -17 -153 -183 263 138 230 -178 111 308 132 107 -46 5 -99 179 61 57 -230 49 177 276 -22
3571 -22 220 11 145 136 22 -297 21 30 164 42 64 -30 -129 -143 -27 354 63 117 -266 -14 -268 -9 191
3594 191 304 -48 261 -47 14 22 -89 282 -138 11 108 -28 28 -153 -85 -158 -126 -69 67 67 -88 -299 241 273
3618 273 -42 191 10 72 45 -13 4 119 90 -295 -123 -64 222 -60 230 -78 -80 -148 63 -6 70 -35 91 -55
3642 -55 -268 -12 3 117 222 110 77 112 136 -198 -178 -108 -116 -180 -42 2 -138 -55 9 136 190 441 39 217 86
3667 86 22 -32 51 -3 116 -86 32 -30 -69 103 69 175 -49 -31 -349 146 53 224 -143 -242 32 -166 38 16
$$ packed form
3500D7k0l17M68l26Q4J79m7K15N8l49P6j66k6pJ39M9K64k44J50j10k03p1K38k90
3524b09J22J29j41J90j73Q3K4j53J6J86kj83m9Q7M17l64O0o9p4p3J5J72j14O9
3548c4j4L1j36l0M46j25R2m08K89J97j76k5j53N1j04K78j18mk87K79J28R9k98
3571b2K42k09J34rj14l19L18RJ34j22K2r4r9j4J16L81k91N4l83K52k54K59K00
3594A91J13l52L09l08O1Qj11L71m20J49R7j36N6j81O8p3L2N7J36%j55k11N40L2
3618B73l15K33j81O2k7n8J7J15k9l85J72N9K86k82K90l08ko8K11o9P6j05J26j46
3642e5k13K56J5J14J05j12l3L5K4l34K0P0qo4J38M4j40Q3O4J27N4K51m02J78j31
3667H6o4n4Q3n4J19k02J18o2l9J72l4J06k24J8l18M95r3J71l67r9K74j98K04k2
$$ plain form
3691 16 -216 -154 -80 -55 -114 206 73 202 -170 77 321 315 -199 24 -160 182 -45 -91 -54 -166 150 1 -352
3714 -352 -129 -78 11 42 -51 -498 130 283 274 -102 -192 -78 83 -77 -194 -120 -96 11 185 -86 94 200 -166
3737 -166 -12 207 185 -112 316 -73 -133 92 101 -55 185 -128 -229 160 128 111 36 -60 -19 -188 137 -188 10
3760 10 84 -70 95 -59 103 310 36 -22 24 303 -95 95 106 -150 199 -182 -91 -44 -308 49 73 -41 -179
3783 -179 -68 59 -134 138 -59 173 63 -192 -261 -91 -53 -75 -130 -308 213 269 83 -336 -100 -99 -25 -48 -207
3806 -207 -54 57 251 83 -62 142 72 -175 169 99 3 -171 -93 -16 -245 -65 34 57 89 118 -30 119 -97
3829 -97 -135 35 -38 -38 27 -3 262 -28 28 -322 -154 54 148 202 91 -30 69 10 -65 -120 136 108 77 70 36 33 25 85
3857 85 172 -166 89 -191 49 128 -142 264 -61 125 -2 52 -46 1 224 -78 -105 -89 168 -53 -95 12 -3
$$ packed form
3691A6k32O2P4K5n9L20j33J29l72K47K44on14K23j84L42k27m6L7j12L16j49l53
3714c52K23N1Q9L1r3m47O28J53rl76r0J14J61j60j17P4K4J07J74k71J80J06l66
3737a66J54K19k2k97M28l89o0K25Rj56K40l13j01L89l2j7p5r6M1j69L25l25J98
3760A0P4j54J65j54J62K07k74n8M6K79l98J90J1k56L49l81R1M7k64L57K4j14j38
3783a79J11J27j93K72j97K32j10k55o9J70L8k2n5j78N21N6j86m19K36JP4k3j59
3806b07J53J11J94j68j45K04p0k47L44p0r6j74P8P7k29J80R9K3L2K9j48J49k16
3829i7l8J70p3%O5l0K65k90N6l50J68K08R4N4j11j21R9n9p5n5K56k8l1pl4lqO0
3857H5Q7l38K55k80K40P9k70M06l25J86j27N4r8M7K23l02k7J6K57k21m2J07j5
$$ plain form
3880 -3 -95 -87 -165 33 -188 -138 1 4 -283 245 -70 15 171 114 -13 126 -127 44 137 198 120 -109 -167 -177 125
3905 125 215 -111 -96 93 -93 233 -159 9 -218 -134 28 128 -24 -153 -56 -36 -80 -103 34 281 -264 97
3927 97 141 56 57 -240 101 161 19 -156 64 -215 188 42 27 -175 -44 109 44 -28 265 -99 -255 17 25 -149
3951 -149 164 120 -128 20 58 -213 27 -2 -30 -4 222 -281 181 -179 69 90 -119 176 -227 -143 -68 60 -161
3974 -161 233 -3 -43 184 -103 -289 -179 105 -71 45 187 -120 42 142 282 226 -63 121 198 57 -66
3995 -66 -337 -309 171 134 90 57 -271 127 168 -28 -239 -113 9 94 274 -94 26 -37 18 221 -6 -73 -156 286
4019 286 -280 -368 -116 -197 0 20 207 42 7 105 51 85 -40 -103 245 -69 298 198 283 0 -202 -59 7
4042 7 80 -168 198 41 -233 222 240 -86 -32 -207 4 -59 -402 -41 235 -137 169 92 -39 -35 -10 20 -190 -84
$$ packed form
3880cr2Qp8J98k21N0J39Lk87N28l15Q5J56n7j27J39k53J71R3O1p8k29n8j0L02
3905A25R0l26J5J89j86L26l92J68k27Q4J62J00j52j29R7K0m4k3J37K47n45L61
3927I7M4q5Jk97L41O0j42j75K20k79M03j46j5k02J31J53o5p2K93l64j56K72Qj74
3951a49L13m4k48J48L8k71K40k9k8K6K26n03M62l60K48K1k09K95m03Q4P5J28k21
3974a61L94k36m0K27k87j86J10K84j76J16J42l07J62J00J40n6k89J84P7j41j23
3995f6k71K8M80l7m4l3l28L98M1j96k11J26J22Q5J80l68J20o3N5K03k27o7q3M42
4019B86n66q8K52q1J97K0J87j65l5R8n4L4j25o3L48l14L67j00Q5k83k02J43O6
4042GP3k48L66j57k74M55J8l26N4j75K11o3l43L61K76l72L06p7j31MK5L0k10J06
$$ plain form
4066 -84 55 -36 -26 2 5 176 117 7 18 -165 15 -100 -306 -102 207 -66 -122 -59 -261 54 123 -90 -69 356
4090 356 33 -233 -118 -80 -28 -156 -208 -98 -249 -138 130 -295 -59 -171 -112 37 -45 -200 263 68 -224 72
4112 72 -25 -78 -115 -27 42 -22 44 -176 -140 -145 -134 2 -16 -173 -2 5 137 38 -266 5 -224 29 60 -115 47 -302
4138 -302 48 -43 22 -352 -119 200 -57 -27 56 -79 -32 16 156 146 -66 22 -6 151 -14 370 -57 221 -74
4161 -74 123 -42 -208 89 -51 151 34 53 -133 385 -79 -69 57 -24 -212 -185 63 -84 -56 -121 78 2 131
4184 131 48 60 -133 -88 45 275 143 -87 7 -92 -31 298 -34 67 -158 27 -22 73 -105 -20 -197 45 195
4207 195 -3 276 -144 -13 -133 -93 -18 -65 171 192 70 19 25 136 80 -143 -310 247 160 -126 -146 198 -354
4230 -354 32 18 -205 -3 251 338 1 322 -189 -143 49 118 209 -54 1 -329 -46 163 -67 344 48 -272
$$ packed form
4066h4J39r1J0K8LJ71n9j10J1j83J80j15k06K04L09k73n6O3k02L15O9k13K1M25
4090C56l23k66J15L8N2j28n2J10j51J11K68m25K36j12N9J49q2j55M63j95k92K96
4112G2r7n3l7Q8O9o4O6k20L6nJ1J36j8j57J71PJ32r9l04K71k29K53L1j75J62l49
4138c02L50r1O5l74K33L19k57L0Q3j35M7M8J40j0k12Q8k8J57j65L84m27K78k95
4161g4J97j65j66K97j40K02j17J9j86N18m64J0J26q1j88K7K48j47K8o5J99p6J29
4184A31q3J2j93M5J33K30j32k30R4r9O1L29l32J01k25J85m9R5j78Q5j77K42J50
4207A95j98K79m20J31j20M0P5m7K36K1j22n1OJ11n6k23j67N57q7k86k0L44n52
4230c54L86j4k23K02K54Q7l37L21n11M6J92O9R1k63N5l30K83K09k30M11k96l20
$$ plain form
4252 -272 154 -49 -252 156 -179 -71 -316 201 -108 -131 -43 -10 -214 -262 -30 12 74 153 -105 66 -1 -83 -94
4275 -94 51 5 326 198 24 -15 36 81 101 75 101 -3 18 -231 -129 -231 -27 -32 -17 180 76 111 45 246 -201
4300 -201 -115 -242 367 -262 2 173 162 -121 22 158 58 3 -298 59 -279 23 69 262 32 -4 -206 -93
4322 -93 223 -120 -208 -36 -4 75 -15 -142 -229 67 266 34 -310 53 -72 -190 52 -48 119 -15 137 -148
4344 -148 100 -76 241 139 60 45 150 -37 12 -153 44 -73 104 184 70 -204 166 -241 -169 61 32 19
4366 19 -102 37 -136 -78 127 95 -302 -38 -380 -53 48 -118 114 175 -48 -285 139 -93 140 138 -83 -87 407
4389 407 -137 -169 -32 -41 -198 122 76 -141 241 -37 -196 -118 5 18 -232 -8 320 43 -129 13 40 158
4411 158 -211 -117 -7 -333 126 222 236 -43 64 -273 75 99 210 105 -112 87 -55 129 -109 -23 -190 -25
$$ packed form
4252b72M26k03k03M08l35J08k45N17l09k3Q8L3k04m8K32M2O2P9k58J71o7q2j1
4275i4J45m6L21j28j74l9N1M5K0k6K6j04K1k49J02j02K04nJ5J97j04L5o6K01m47
4300b01Q6j27O09o29K64J71j1k83J43J36j00n5l01L57l38L02M6J93k30l6k02J13
4322i3L16l43q8J72L2P9r0j27q7K96J99k32l44L63j25j18K42j00J67j34J52k85
4344a48K48j76L17j02p9j5J05j87M9j65J97j17J77Q0j14k74L70m07P2K30k9j3
4366A9j21J39j73N8K05l2l97K64l42L27J01j66K32O1k23k37M24k32K33kk21mM94
4389D07n44l2J37rj57L20m6k17L82k78j59P8J23J3k50K24L28k77j72J42K7J18
4411A58l69R4J10l26M59R6J4k79J07l37L48K4J11j05k17J99j42J84k38Q6j67J65
$$ plain form
4433 -25 -164 4 117 -213 194 243 -212 86 181 220 189 74 187 70 85 40 202 36 45 -68 49 134 68 -424
4457 -424 161 53 30 -196 -118 -153 14 -172 -3 154 14 130 -141 176 -127 -18 15 -87 183 81 -280
4478 -280 -218 -25 8 60 -74 -70 -203 72 -79 -135 -149 -157 -26 -125 -65 90 -120 -166 86 157 -85 -3 4 94 14 127
4504 127 22 -97 401 149 -465 -190 96 149 -63 -45 43 -37 -117 21 108 -132 266 -68 -258 -166 94 -146
4526 -146 52 -17 196 33 -47 -5 6 -100 -201 132 240 178 -106 -108 58 0 -66 379 -118 25 31 -142 247 184
4550 184 166 -131 89 -62 51 134 -77 8 33 44 -42 -115 9 -226 -52 153 40 41 120 -20 108 57 0 -26
4574 -26 83 -47 -54 176 -110 62 -95 96 89 -161 -27 -65 104 99 116 340 -42 -239 30 315 -98 -199 -257
4597 -257 22 -58 86 -139 149 -51 -73 -207 -157 38 25 -180 -167 -53 116 61 -94 -259 204 -223 161 22
$$ packed form
4433b5j39J68J13l30M07M9m55K98R5L9l1j15J13j17J5m5J62j66Rj13J17Q5o6m92
4457d24N85j08k3k26P8l5J67j86J69J57j40J16k71L17l03J09L3j02K70j02l61
4478b80O2J93L3N2j34Mj33K75j51n6j4qJ31r9O0J55k10m6K52P1k42Q2PR0q0J13
4504A27j05j19M98k52o14K75K86N3k12J8Q8q0q0J38Q7k40L98l34j90R2K60k40
4526a46J98o9K13j63q0M2J1j06j01L33J08o2k84kJ66n8o6M45m97J43Oj73L89o3
4550A84j8k97K20j51J13Q3k11Q5K5J1q6p3J24k35J74K05j13JP9j40J28n1n7k6
4574b6J09j30pK30k86J72j57J91pk50J34l8J69nJ7K24l82j97K69K85m13j01n8
4597b57K79q0J44k25K88k00k2j34N0J95j3k05J3J14J69n5j55j65M63m27L84j39
$$ plain form
4619 22 -62 -43 103 36 -270 -166 -252 146 -196 -101 94 -177 190 79 -32 -46 239 130 24 -25 -74 169 159
4642 159 -75 -54 49 202 73 -454 -148 -192 -78 93 79 -186 20 -109 -275 -110 -4 199 102 -113 22
4663 22 -173 20 -19 106 16 -20 -198 164 -315 35 -363 -223 29 -207 -37 49 -108 -92 -171 9 -270 43
4685 43 108 95 70 -64 -3 -77 6 -83 155 2 193 348 1 78 64 -6 -209 99 149 -124 162 72 74 42 28 159
4711 159 -9 -252 -41 -64 -4 61 -244 280 33 -237 -33 -270 -227 160 -58 -72 93 40 178 -249 205 -145
4733 -145 262 20 -140 96 -99 144 70 -69 66 -203 -62 -132 -111 -136 -27 13 109 -89 -16 102 -255 -87
4755 -87 244 -94 31 -121 -46 -13 -146 97 74 14 9 88 50 40 28 22 73 -52 -99 -137 215 255 157 138 -82 -213
4781 -213 -187 -73 -37 -15 234 169 305 -106 -22 -19 -80 117 -19 -54 18 137 152 -116 -58 98 55 82 -17 146 -190
$$ packed form
4619B2q4J9J46o7l06J04q6L98l42R5J95k71L67j11j11j4K85j09j06m9m9K43j0
4642A59k34K1J03J53j29n27L06m4J14J71j4k65K06j29j66J65J06K03r7k15J35
4663B2j95J93l9J25r0l6j78L62m79L50l98J40K52k36J70Q6j57J6p9J80k79L13
4685D3O5j3k5j34O1p4Q3q9K38j53J91J55l47P7j4p0k03L08N0k73K86r0Kl2j4J31
4711A59j68k43K11k3O0O5l05N24k47k70K04k37M3L87k18j4J65n3J38m27M54l50
4733a45M07k42j60K36j95K43p4j39J35k69J41p0K1k5J09M0R6j98P3J18l57J68
4755h7L31l38J25j52P5L3j33K43k3o0nP9l8j0j2oN1j25m7l8L52M0r8j9k20j31
4781b13K6J14L6K2K49o5J36m11Q4Lo1J97j36l5P2J19J5k68N8J56m3K7r9J63l36
$$ plain form
4806 -190 -53 -1 -108 -198 142 -231 -217 18 260 186 -47 -33 125 -62 -217 80 -22 230 242 -147 -123 23
4828 23 86 141 165 93 79 177 -135 101 20 113 -163 106 32 -156 95 143 -103 42 36 85 56 -113 -136 -93 86 145
4854 145 321 258 166 -200 -47 42 -110 -124 184 15 144 -22 -163 186 11 124 350 131 29 -61 192 286
4876 286 -237 19 -162 31 -281 2 -3 36 -57 -16 294 -265 155 -180 132 -119 -243 -52 19 173 154 -49
4898 -49 426 -22 80 -343 -85 353 -33 -108 127 -147 -90 -41 258 255 47 126 -131 -52 -13 -35 -115 158 30 -57
4922 -57 -179 -163 -230 129 -168 127 100 -7 -200 -32 -200 -101 -64 -168 -63 15 376 -65 -35 -29 -5 13 230 51
4946 51 62 -206 -65 198 25 12 56 185 21 -204 156 -36 194 21 102 -82 -123 -145 92 -315 -95 -17 -19
4969 -19 -155 37 -49 -88 154 51 186 -17 -183 59 307 -44 -231 -74 127 13 297 8 100 48 -168 -120
$$ packed form
4806a90J37N2j07r0L40l73J4K35K42p4k33J4J58j87j55K97j02K52J2l89K4J46
4828B3O3N5K4p2j4R8l12K36q1R3k76K69p4j88K51M8k46J45oM9k9j69k3M3J79N9
4854A45J76o3r2l66J53Q9j52j4L08j69J29j66j41L49j75J13K26k19j02r0K53R4
4876B86n23K56j81J93l12K83nL9r3M1L10n59M20l35L12k51j24J91P1J54j9k03
4898d9M75m48J02m23K58M38l86p5K35k74N7M9K99lk08P9k57P9L9k2q0K73j28q7
4922e7j22J6o7L59k97K95k7j07j93J68j68R9L7j04J05P8L61m41L0OK4J8K17j79
4946E1J1k68J41K63j73j3M4J29j64k25L60j92K30j73Q1j84m1k2K37m07K20P8k
4969a9j36J92q6l9K42j03J35k03j66K42K48l51j87J57K01j14K84k89R2n2k16M8
$$ plain form
4991 -120 85 -144 41 45 70 126 210 -170 112 275 26 57 -269 -31 169 -70 -40 -15 43 84 -39 140 -79
5014 -79 -60 -19 165 -71 -207 -132 -157 -159 -249 -37 -25 23 257 -180 -5 92 -88 113 -322 42 157 286 131 -112
5038 -112 -156 -147 -139 196 -60 409 241 5 30 -7 -24 91 -40 200 161 59 75 -194 170 -82 52 276 113
5061 113 10 24 110 188 66 54 -6 134 -133 -9 -169 -12 96 -94 55 4 32 10 -15 -19 55 -151 -302 -34
5085 -34 -146 52 106 60 -104 299 142 -54 122 235 -16 -71 218 19 43 -19 -55 56 -76 90 -5 -42 194
5108 194 4 -36 -2 -59 30 266 -56 -111 -56 -78 -48 100 -42 5 1 -17 259 227 144 133 88 -32 -92 234 -30 -176
5134 -176 -108 -100 182 -92 -71 328 -138 -64 -129 59 -69 22 171 -82 -283 21 8 -34 115 142 -127 -39 26 83
5158 83 -121 -373 45 12 39 -30 155 -247 24 9 62 167 -31 279 -1 0 91 -170 -120 60 -141 -254 127
$$ packed form
4991a20K05k29J85MK5N6Q4l80K82J63k49L1l26K38K00k39L0K5N8M1j23J79k19
5014g9J9M1J84k36j36P5k5kr0K12J2M8K34m37J75R7j80K01m35L64J15J29j55k43
5038a12m4RQL35k56M69j68k36K5l7j7J15j31K40l9j02J6k69L64k52J34K24j63
5061A13j03J4Q6P8j22j2o0J40k67J24j60J57J08j90J49n1K8k2k5mP4k06j51K68
5085c4j12J98N4m6j64M03j57j96J76J13k51n5K89j99K4o2l6J11j32J66r5l7K36
5108A94j90m0L4n7Q9K36l22n5N5k2L0J48j42M7mj8K76l2q3j1m5j20o0L26k64j46
5134a76O8QK82k74K1L99m66P4o5J88j28R1J49k53k01L04j3m2J49K7k69Q8O5N7
5158H3k04k52M18l3K7o9J85m02K71j5N3J05j98L10k80JR1k61N0J80k01j13L81
$$ plain form
5181 127 128 12 -35 -13 -154 -133 14 308 -152 117 136 -57 -108 -170 -36 11 -100 -53 79 -60 -76 -34 -4 -138
5205 -138 19 31 132 -172 62 -151 183 -104 -55 222 145 48 20 69 -223 -123 -180 -301 -85 33 199 -109
5227 -109 -232 -16 58 -113 115 -63 169 67 -79 -230 50 243 -218 198 -130 -156 94 -160 -219 -257 -86
5248 -86 -51 197 237 -90 -318 134 -296 7 -193 -154 -209 -191 -161 -129 68 172 174 -27 -8 -159 -105 -357 44 -150
5272 -150 -332 -271 -25 -202 29 62 -50 -56 -143 -104 38 33 318 7 -325 180 198 140 40 -64 -11 150 57 83
5296 83 87 -248 -75 -164 39 -2 126 -26 303 -63 -119 44 -45 263 -18 70 -64 -68 -135 -44 160 24 -21 13 -33
5321 -33 -23 -413 -60 -34 10 9 86 -160 -199 -219 -161 -15 116 -300 -123 14 -38 -165 -188 -223 69 228 129 -195 37
5346 37 -181 -124 41 210 271 170 -100 96 -236 201 -162 68 230 75 345 -60 -270 -209 43 -79 -140 61
$$ packed form
5181A27Jj16m7K2j41K1J47K94m60K69J9j93n1o2J34M7j11M7J32j39j6M2L0j34
5205a38J57J2J01l04K34k13L34k87M9K77p7r7k8M9k92J00n7j21K16J18J66l08
5227a09j23K16P4j71K28j78K32j02j46j51K80J93m61M16l28k6K50k54n9l8J71
5248h6L5K48M0l27k28M52m30L03k00L9n5J8L0L2J97J04Kk01J9j51N4k52M01j94
5272a50j82O1K46j77K31L3j12oq7L9J42nK85l11l32N05J8n8j00j04N3J61r3K6
5296H3Ml35J73q9K03m1J28j52L29l66n6J63q9L08k81Q8j34mo7R1K04j36m5L4m6
5321c3J0l90L53K6M4jP7k46l9k0N8J46J31m16J77J37n2j27k3l5K92J59r9l24K32
5346C7k18N7J65J69O1j01k70J96l32M37l63K30J62j55K70m05k10O1K52j22o1K01
$$ plain form
5368 61 -37 -189 59 -147 16 -110 -117 -156 11 -33 121 -62 -219 75 95 -170 -74 16 -196 -71 127 161 -153
5391 -153 71 -166 17 73 -35 77 69 5 -40 44 21 9 15 -40 4 -109 20 265 -269 -100 45 50 -5 110 -323
5416 -323 -412 18 201 -40 56 43 -46 -28 -310 21 142 -181 -88 233 91 1 213 101 130 300 -8 -70 -90
5439 -90 201 333 -230 33 8 173 -117 -11 138 -16 -38 49 -7 225 296 22 160 -184 178 -254 155 -21
5461 -21 9 -221 30 -24 -88 268 112 17 67 34 70 120 -37 -70 39 -91 -25 -374 54 301 -24 -50 -29 -154
5485 -154 -29 100 19 -224 -46 -115 11 -242 9 37 -28 -3 220 -6 -33 -296 32 167 261 -136 177 -109
5507 -109 73 49 206 -118 -234 10 141 -50 -156 406 31 -304 -11 284 231 10 336 -26 -106 87 -96
5528 -96 -74 -145 17 90 -39 -41 -37 -86 120 54 -60 -138 -196 15 67 -130 25 234 -34 -114 -32 99 98 13 155 70
$$ packed form
5368F1r8j52K48k06J63j26pl9J67m4J54j83j57K94K0k65R6R0k12J25J98L4l14
5391a53K24k37J83N6j08J12qo4m5Q4k3j2On5M4j13J29K45n34J69J45Nn5J15m33
5416c23q9M30J83k41R6j3q9J8k82L31J21l23R3L21j42r0K12j12K9J70l08o2k0
5439i0K91J32n63K63k5J65k90J06J49j54k2Q7n6K32P1k74J38l44L62m32M09j76
5461b1L0k30K51n4o4L56j56r5N0l3L6N0j57l3J09j30O6l49M28K47l25k6K1j25
5485a54J25J29q1k43J78o9J26k53K51K8o5K5K23k26k7k63L28J35R4l97L13k86
5507a09J82k4J57l24j16K44J31j91j06N62l75l35K93K95n3k21L26l62q0J93j83
5528i6K2p1J62P3j29kMm9K06o6j14p8n8K11N2j97J55K09k68q0Q2J31jq5J42q5
$$ plain form
5554 70 394 -105 -155 64 76 -15 -52 -57 -231 -100 -110 36 83 -56 -33 -90 198 71 -17 159 -6 22 -87 -19 192
5579 192 -130 -38 -183 106 106 -66 -102 176 240 -191 16 -161 -25 40 161 -182 -79 4 -109 37 292 329 -40
5602 -40 -44 79 -32 75 82 -62 -102 86 48 -358 -15 -10 128 55 69 -140 179 114 -121 92 41 189 133 -30 -142
5627 -142 -83 -47 39 -90 156 -184 -187 132 -28 -69 365 146 -191 -228 -23 101 176 197 6 119 -273 -25 7
5650 7 205 -106 -69 255 -89 34 150 -169 -125 -50 182 -133 -186 -158 -75 -11 -96 -9 -188 -144 -396 -42 -135 -62 135
5675 135 -182 -38 88 -62 38 -94 -31 -314 -97 212 -36 250 264 -200 111 -253 16 -161 40 -92 -83
5696 -83 -79 -137 -72 62 28 -46 9 -11 -14 -180 112 119 -20 -314 96 21 122 150 53 -162 -58 353 256 -102 -239 131
5722 131 123 -68 131 49 -127 151 -212 -240 -137 -91 147 -156 -188 -238 -125 87 -103 -152 -420 45 10 -168 -58
$$ packed form
5554G0L24m99n0K19J2r1l7nj74J31j0J46M7j39K3n7K88j27q8J76j65K8j09O8K11
5579A92l22R2j45K89%j72l6K78O4m31K07j77J36O5J21l43J03Q3j13J46K55L7l69
5602d0mJ23j11J07Pj44m0J88l8m06L43NJ38p3J4k09L19o5k35K13n1J48n6j63j12
5627a42N9L6Q6j29K46l40lL19j60m1M34k19l37l7K05J24P5K1j91J13l92K48L2
5650GJ98l11L7L24l44J23J16l19M4P5K32l15n3K8Q3O4q5Q7j79M4k52L54r3P3J97
5675A35l17J44J26j50J00j32O3k83K17L09k48K86J4m64L11l64K69j77K01j32R
5696h3Mn8O5J34l4p4N5k0lj66K92Pj39k94M10p5J01K8r7k15J04M11r7l58j37L70
5722A31qj91J99q2j76K78l63k8J03M6K38l03l2n0J13K12j90m9k68M65l5j78J10
$$ plain form
5745 -58 102 174 170 -70 105 -85 45 247 -44 25 104 106 -78 -107 -37 413 38 -21 278 540 -23 173 -371 42
5769 42 43 10 11 -159 271 -280 -101 -85 164 -6 -185 211 -69 -104 -2 -57 -127 -57 -27 125 -90 177 27 -77
5793 -77 -298 -41 -206 54 204 97 -66 45 304 67 -95 -96 -110 -76 -31 -87 -25 65 147 14 -213 -43 197
5816 197 44 103 -23 -185 -85 113 47 24 -139 72 115 -92 -193 83 -75 48 35 -143 -75 128 139 40 40
5839 40 -180 259 -227 -107 70 -336 110 51 152 -18 197 132 14 -156 152 134 19 -98 59 219 -146
5860 -146 52 61 -151 -92 -134 84 141 264 -10 110 -109 247 121 -203 -238 -405 -84 50 -259 -59 404 170
5882 170 -114 92 -136 -321 27 -103 178 4 98 197 -173 125 245 -48 13 103 234 -222 161 74 116 -194
5904 -194 0 99 40 2 -125 37 -14 -290 -101 -32 -42 -37 -218 240 -48 -322 166 16 174 41 -157 -152 54
$$ packed form
5745e8J60P2mk40J75j90J30K02k91O9P9Kj84k9P0M50l75n9K99K62n63J96n44M13
5769D2Jl3Jj70M30n51J79J6K49j70j79L96k80l5J02n5p0P0L0J52k15K67j50j04
5793g7k21K57j65K60J50j07j63J11K59k37j62jj4L4M5n6O2R0Q2j33k27J70K40
5816A97j53N9j26j62J00J98o6k3j63K11M3k07j01K76j58J23j3j78O8K03J1r9%
5839D0k20M39m86J20J77m06M46n9J01j70K15o5j18j70L08j8j15j17J57J60l65
5860a46J98Rk12N9m2K18N7J23k74J20k19L56j26l24l5j67L21J34l09K00M63k34
5882A70k84K06k28j85L48j30K81j74R4R9l70K98J20k93O1R0J31m56L83q7M2l10
5904a94J94R9n9l8j27J62n1k76J89O9j0Nj81M58k88k74M88j50J58j33j98NK06
$$ plain form
5927 54 73 -59 -147 -95 174 -139 -92 37 36 31 -211 8 43 -103 157 104 25 245 2 114 -248 122 44 102 199
5952 199 136 -191 12 64 -117 38 44 -18 91 17 59 95 116 117 24 -70 60 147 -63 -48 -61 129 72 196 130 -159
5978 -159 135 114 219 -101 19 -241 229 87 -201 63 -397 88 124 59 -40 77 -117 44 -110 386 152
5999 152 139 -258 -63 -134 138 4 197 153 -42 -114 -139 -114 206 -189 -67 -97 201 196 31 14 -214 -164 262 61
6023 61 59 -189 -33 71 -170 35 -131 14 -234 -95 -236 -28 194 122 -31 218 55 -175 26 -60 131 -112
6045 -112 -174 -30 175 218 21 290 -83 -77 168 -16 83 238 54 120 17 1 313 -98 -8 -112 -301 -43 -112
6068 -112 -47 -24 254 -53 117 -10 -129 66 66 17 -81 91 -34 108 -180 -194 181 -11 -194 68 -55 -67 -353
6091 -353 87 -32 104 -103 222 240 -37 -12 50 -132 25 -44 2 -80 -100 -273 58 -162 -113 -152 -104 -141 74 101
$$ packed form
5927E4J9j32q8N2K69l13M7J29jnk42K19L5j46K60n3p9K20k43J12l62L70p8N8R7
5952A99o3l27K03N2j81J55Oo2J09p4M2L6K1Jr3r4J30Q7k10J5j3J90n7J24o6k89
5978a59K94k1J05l20J20k60M70j42k88K64m60M85L6o5r9J17j94J61j54M96k34
5999A52j3l97J95p1K72j34J93m4j95p2k5K5L20l95J22l0K98nj65j7k28N0M26k01
6023F1kk48J56J04k41K05j66J45k48J39j41K08K22p2j53K49j63k30K01q6J91k43
6045a12o2J44K05M3j97K69l73OK45j84R9J55j84O6j03j6L12m11R0j04j89K58o9
6068a12O5K3K78l07J70j27j19J95%m9r8J72j25J42k88j4L75j92j83K62j23j2k86
6091c53M40j19J36k07L25J8k77K5O2j82J57o9M6q2k0j73L31k20M9l9M8l7K15K7
$$ plain form
6115 101 -49 226 -213 -201 -149 -63 151 -232 -142 -7 123 -13 -120 92 281 -332 -207 -44 -143 -320 95 68
6137 68 181 -102 63 10 9 211 187 -24 -105 -4 -154 134 30 -140 -35 -131 19 -31 200 -158 -51 81 -187
6160 -187 21 3 -47 -130 -45 45 -218 -76 130 -109 -30 -138 154 -85 -218 155 13 -37 38 -149 -141 26 72 -88
6184 -88 34 62 -283 -11 76 -38 63 -125 -10 -16 120 -66 -9 1 -211 136 -118 -48 -160 -192 46 135 13
6207 13 300 88 -15 -190 -466 -70 -62 -274 -53 -28 -90 41 -8 -37 -141 -223 292 50 76 -107 -282 -19 -70
6230 -70 276 111 39 -1 -121 -96 27 -304 35 117 -105 181 -126 115 -227 144 -181 -33 -8 -72 0 -119 17
6253 17 251 200 64 110 -49 55 97 83 -101 -45 257 -6 -96 176 36 54 216 -83 258 -121 -108 -102 -210 -115
6277 -115 33 -121 99 56 50 128 89 -19 -32 -172 -312 -157 235 135 -128 322 93 11 -38 149 -166 61 29
$$ packed form
6115A01j50K75m39J2N2Q6K14l83R0J35J30j36j07K12J89o13J25J63r9j77M15k7
6137F8J13k83J65n3jK02k4k11q1J01j50K88j04j70J05r6J50n0K31l58J07J32k68
6160a87K08j8n0q3Q5R0k63J42K06k39P9j08K92k39j33L73j42n0P5j87QJ67M6j60
6184h8J22K8l45K72Q7j14J01j88J15oJ36j86N7J0k12L47k54P0j12l2K38Q9j22
6207A3K87k12j03j75k76L96Qk12K21K5o2J31m9k9j04q2N15k42K6j83j75K63n1
6230g0L46j65p2m0j20K5J23l31L39Q2k22K86l07K41l42L71l25J48K5o4P2j19J36
6253A7K34n1j36M6j59J04M2j4j84N6L02k63r0K72j40J8J62k99L41l79J3Oj08R5
6277a15J48j54K20m3oP8l9j08j3j40j40J55L92j00k63M50k29q2m9J87l15K27l2
$$ plain form
6300 29 -25 94 95 -131 10 -289 313 -31 170 116 251 171 -35 32 -62 381 -34 122 8 325 21 -281 -140
6323 -140 28 219 0 186 98 -19 323 -282 11 112 -183 35 115 81 17 -4 -240 -48 394 112 79 -64
6345 -64 -83 74 -146 -201 -72 -6 -118 208 147 -12 157 46 -135 36 56 -302 -11 -184 -15 1 -112 -196 34
6368 34 140 43 -71 124 57 -20 105 26 -176 52 -13 -32 1 -13 93 -58 293 75 -27 -144 254 -36 -137
6391 -137 77 4 -20 -227 109 -112 -12 -169 -21 212 93 238 -146 -135 -196 -41 -5 150 -58 -147 -47 -105
6413 -105 -96 -64 -159 -28 -93 9 82 -44 90 -51 186 -39 189 -98 -24 129 35 65 -119 -67 107 -108 239
6436 239 103 93 -145 -99 62 52 -203 88 74 -384 215 55 -56 96 226 217 247 -144 -156 -49 63 -2 -45
6459 -45 76 -349 -149 -175 -10 -74 -55 -21 15 212 -14 -111 85 41 -34 -56 50 192 11 255 -38 261 32
$$ packed form
6300B9n4J19Jk26J41k99O02l44K01n4J35q0k06O7r4M43m15J56j14L17l04l02J41
6323a40J68J91k19J86q8j17L42o05K93J01k95K18Q0l4o4k1k36J92M42k82l3j43
6345f4j9J57k20n5J29O6j12L26o1j59J69j11j81J71K0l58K91j73J69J6j13q4K30
6368C4J06r7j14J95o7p7J25p9k02K28o5j9L3j4J06j51L51k18j02j17L98k90j01
6391a37K14p3k4k07L36k21J00j57J48K33j19J45l84J1o1J55L6J55k08q9J00n8
6413a05RL2r5J31o5J02P3j26J34j41K37k25K28k87P4J53r4L0j84N2J74k15L47
6436B39j36j0k38M6J61j0k55K91j4m58N99j60j11J52J30rL0l91j2J07J12o5m3
6459d5J21m25K00k6J65o4J9L4L6J97k26r7J96m4p5k2J06J42j81K44k93K99k29
$$ plain form
6482 32 -90 -152 -80 -13 -229 -137 57 79 -142 -146 -253 231 -6 -184 -75 94 -154 -94 225 91 24 84 -96 -128
6506 -128 102 112 -351 -88 247 388 275 8 -63 123 -80 159 167 -121 210 144 -154 -262 11 -61 -75 -123 -2
6529 -2 -93 8 150 -145 -62 -47 -105 40 104 -93 311 -93 0 -162 148 -148 -109 -49 19 -177 -71 29 -6 -193
6553 -193 26 127 264 -112 87 71 -53 22 -3 66 147 0 26 131 -115 153 -161 62 -96 291 -163 186
6575 186 -115 327 154 18 13 -31 41 148 387 115 -6 115 77 -121 -25 90 -12 221 -56 89 -87 66
6597 66 -40 -47 -286 -23 -154 206 186 105 -58 -228 -271 132 -91 -105 72 -4 218 207 -38 58 -49 -73 -286 48
6621 48 127 208 -157 177 76 -154 181 187 3 54 -31 -100 -170 150 16 168 118 32 32 -122 -201 20 -69 -185 135
6646 135 -272 -187 74 -15 263 127 -98 12 -168 86 -133 125 95 74 -224 76 -71 -44 95 -92 224 -26
$$ packed form
6482C2j22o2P2O7k16R2J94K2k21mj07M84k37j78J09J69k48O0L19j34o7O0j80l2
6506a28K30J0m63K63L35J41j13k67p1J86k03K39Qk88L31o6k98j08K73p2j4m8J21
6529br1J01J42k95Q3J5n8J45O4j97M04m04R3j62L10k96L9O0O8j96J06J00l5j87
6553a93K19J01J37l76J99j6j24P5k5O9Q1j47K6J05k46K68l14K23j58L87m54L49
6575A86l01M42j73j36nm4P2J07K39k72j21J21l8j98R6J15j02K33k77J45j76J53
6597F6j06pk39K63j31L60k0q1j63j70m3M03k23j4J77p6K22j1k45R6j07k4k13L34
6621D8P9Q1l65L34j01k30L35Oj84N1q5o9p0L20j34J52n0q6%j54p9K21q9j16L20
6646A35m07Q5K61q9K78j36k25J10j80K54k19K58l0k1k98L00j47K7J39j87L16k50
$$ plain form
6668 -26 -47 118 226 -37 -29 -243 275 276 72 -53 -212 357 10 181 10 74 -35 179 -246 285 75 -6 264
6691 264 63 -6 4 -114 -34 -4 -38 -244 2 -54 44 -78 -82 -74 -9 26 132 50 138 10 62 189 141 -178 -253 130
6717 130 44 300 23 -82 213 244 138 59 -210 109 -352 149 -28 168 36 83 110 36 -194 -171 44 276
6739 276 42 214 -156 -330 -83 -16 -130 -108 -119 -222 -208 -158 259 -88 59 -34 -109 -96 -83 -328 -100 181 41
6762 41 3 9 -186 -107 242 127 50 -39 39 104 178 152 50 80 31 119 78 147 -10 -24 41 -156 9 99 11 -168 -244
6789 -244 191 25 -70 77 -101 -27 90 -109 -73 159 -154 101 -56 -48 -163 -83 10 243 272 95 220 -144 252
6812 252 212 -230 -122 11 -325 183 -44 -260 -171 86 -324 228 -93 134 -14 128 -30 -138 -78 -107 282
6833 282 -115 -10 -15 -217 -118 -81 66 -483 238 -85 -61 -67 -229 -2 -70 -33 174 195 71 52 231 -98 64 -132
$$ packed form
6668b6k1J65J08k63Qk14N18Jk04j25j59N69l47J71j71O4j09K14m25N31k10q1K70
6691B64k01o9J0j18Q0L0l4k06K46n6R8j22mQO5L5J06q2Q8j28N2J27m8l19p5L83
6717A30q6K56k77j05K95L1j06p9k69L19m61N01j77J96j32M7K7p4k30K3K15K32
6739B76k34J72l70j74K47O7j14K2j1j03J4N0M17l47J47r3p5J3J3k45K28K81j40
6762D1l8Oj95P9L49j15p7q9P8O5P4k6j02L0m9Q8m1O9j57j4O5j97J65R0q8j79p6
6789b44M35j66r5J47j78P4J17j99L6K32l13K55j57Qj15Q0R3K33K9j77J25l64L96
6812B52m0m42J08J33l36N08k27k16Q9K57m10N52l21K27j48J42j58j08O0k9L89
6833B82l97J05nk02R9L7J47n49P21l23K4oj62K27o8L7K07K1j24j9J79l29J62j96
$$ plain form
6857 -132 8 138 68 169 -220 -105 -239 -90 -105 108 16 86 222 26 60 170 226 -127 -13 -90 208 39
6879 39 8 -21 279 -86 13 18 154 72 -135 -155 166 67 -251 -14 -149 -40 -40 68 321 236 -172 48 -34 57 -128
6904 -128 -19 -201 178 47 -255 48 218 -50 134 -171 73 -22 -62 -54 -49 108 -70 65 253 -209 180 -88
6926 -88 -150 61 -25 -13 -145 101 31 -87 248 197 98 -311 135 10 -88 13 159 186 174 40 -32 82 60 63 24
6951 24 158 -220 -302 15 116 261 261 -178 -57 -246 141 -19 -51 -24 -20 112 27 -215 25 -25 249 -32 10 115
6975 115 -54 -5 -344 123 85 -197 -69 -113 531 -58 18 252 42 40 -8 -3 85 163 -13 -106 -156 -2 -72 10 291
7000 291 136 -101 -49 -327 -83 146 152 268 5 -197 -36 -98 185 178 137 13 11 -176 133 -246 52 219 65
7023 65 -91 -92 -72 -177 277 -109 198 58 21 -121 -158 42 -19 -191 198 68 -130 71 -148 55 26 -48 -69
$$ packed form
6857a32J40J30p0J01l89J15j34J49j5K13r2P0J36j96L4J10N6l53J14p7K98j69
6879C9l1k9L00l65R9NJ36q2k07k0L21r9l18K37j35J09%J08K53q5m08K20q2R1j85
6904a28J09j82L79j31l02L03J70k68J84l05K44r5m0QNJ57j78J35J88m62L89k68
6926h8o2K11q6J2j32K46p0j18L35n1r9m09M46j25r8J01J46K7j2j34p2J14k2Ll9
6951B4J34l78q2L17J01J45%m39J21j89L87j60l2K7MJ32q5k42K40n0K74k81M2J05
6975A15j69M9l39M67l8k82J28m4O44n89P6K34k10km8NQ8P8j76r3n0J54p0Q2K81
7000B91j55k37N2k78K44K29OJ16k63k02J61o2K83pm1j24kj87L09l79K98J67j54
7023F5j56jK0j05M54l86L07j40l7j42l7K00o1j72L89j30j98K01k19K03k9p4k1
$$ plain form
7046 -69 -49 100 74 -63 -283 -56 88 195 -198 -107 -49 143 -80 -24 190 170 29 58 -32 -3 265 121 138 34
7070 34 -84 156 55 132 47 324 -234 165 -91 -14 -95 67 174 39 -129 91 79 -204 47 20 220 95
7092 95 -141 -266 -63 157 -159 -56 56 163 67 -128 -99 209 19 -201 142 -98 -22 -97 -321 283 114 -64
7114 -64 -71 107 -88 -126 -130 -207 78 21 213 183 146 188 -155 -17 108 127 -76 -61 147 -81 -110 31 71 59 -227
7139 -227 -66 86 -24 -103 -162 -26 18 29 -165 -3 -131 105 213 -10 66 0 106 -5 -124 -334 17 25 -152
7162 -152 -93 192 212 122 -83 -43 37 -100 87 -25 254 95 -291 -143 -82 -176 218 -88 86 35 -63 -64 14 150
7186 150 -306 -137 163 -275 -396 80 -87 104 19 -114 -26 158 -75 65 227 -150 -60 -116 238 -43 100
7207 100 70 135 95 180 114 -24 1 -99 -264 60 -20 -399 9 0 66 205 53 -230 248 58 -135 -199 -134 -52
$$ packed form
7046f9K0J49k6j37k20K27J44J07l93R1N8J92k23N6K14k0j41K9r0K9K68j44J7j04
7070C4j18K40j01P7q5K77n58L99k56P7q1J62J07j35j68K20j2k83K51k7K00j25
7092I5k36j25K03K20l16J03J12J07r6j95K9L08j90k20L43k40P6p5k24O04j69j78
7114f4pJ78j95l8mp7K85n7J92l0l7M2l43J38J25J9k03J5K08k28k9J41M0j2k86
7139b27J61J52j10p9n9J36M4J1j94J62j28K36J08k23P6o6J06j11j19k10L51Qj77
7162a52N9K85K0r0k05M0Q0j37J87j12K79j59l86J48O1r4L94l06J74n1r8jP8J36
7186A50m56J69L00m38j21M76j67J91q5j33Q8J84k33J40J62l77R0n6L54k81J43
7207A00l0O5m0Q5o6j38K5j00j65L24q0l79M08rO6J39j52k83M78j90j93o4O5Q2
$$ plain form
7231 -52 133 -174 -148 342 118 -6 -66 -65 247 123 18 181 -246 196 -107 86 44 151 93 43 221 145 218
7254 218 -131 -38 -32 162 61 206 227 -99 -24 -112 -103 -197 15 -293 -302 -47 114 -161 -304 -196 250 52 88 38
7278 38 -124 -134 -116 56 -188 180 179 83 -219 21 41 -47 -288 19 249 -36 -153 178 -162 -39 258 0 -65
7301 -65 -87 -207 208 33 -119 179 70 26 -154 63 -71 -179 -109 -261 -227 -286 167 100 110 -2 -145 24 165
7324 165 286 -184 -158 -145 60 108 16 280 -94 -126 30 -6 -56 -98 -192 -60 -155 -278 161 171 -43 51 -14 -172
7348 -172 169 -141 -328 106 117 176 -50 -47 9 233 -188 93 74 -56 151 -137 -49 122 -20 102 -23 32 -96
7371 -96 155 -91 153 -133 145 -186 90 -234 34 -62 -128 32 186 3 -85 21 203 66 -170 -192 199 100
7393 100 -135 103 -109 239 -269 -71 -48 -31 -49 150 -9 -14 307 -86 100 206 -77 -66 94 225 -187 38
$$ packed form
7231e2J85l07K6M90k24j24o0JL12j24j05J63m27M42l03J93m2J07n8n0J78p6P3
7254B18l49R3OJ94j01J45K1l26P5q8Rr4K12l08rK55J61k75j43J08M46j98L6n0
7278C8j62j0J8J72k44L68jr6l02K40K0q8k41L07K30k85j17L31l40J23K97k58o5
7301f5k2j20M15j75j52K98j09m4j80K17j34j08P0j52L4n9M53o7J0j12j43J69J41
7324A65J21m70K6J3K05M8r2K64l74l2J56l6n0m2r4J32r5j23M39J0k14R4o5j58
7348a72L41l10j87M34J1N9k26LN6K24m21K81j9j30K07k88Q8J71j42J22j25N5j28
7371i6K51k46K44k86K78l31K76l24K68r6o6J60J54j83q8J06J82j37k36k2L91r9
7393A00k35K38k12L48n08J98K3J7j8J99j59nL21l93J86J06k83J1J60J31m12K25
$$ plain form
7415 38 -87 -148 -117 91 -99 -270 118 -160 -28 1 -68 -6 158 31 -307 -92 -185 -123 77 74 29 -62 161 129
7439 129 -128 18 11 104 2 177 -41 95 19 34 -74 -69 -63 -4 -222 60 138 35 -115 94 143 -59 -133 165
7463 165 -137 45 -83 -46 -206 -153 22 125 135 -245 35 23 189 -53 123 -145 88 373 -298 94 8 112
7485 112 217 150 16 72 102 -132 103 192 136 365 -65 -4 389 44 -100 -22 -69 37 -222 143 -70 -91 -136
7508 -136 -240 58 183 57 108 -65 21 11 -58 -43 38 338 -155 241 -8 -209 60 -69 -151 78 -215 -109
7530 -109 -205 56 -50 120 14 20 48 76 -39 -7 65 92 171 -121 -139 -216 -292 20 116 -2 155 25 54 209 -2
7555 -2 29 -7 -101 -195 212 -186 81 70 22 -38 -77 88 -265 -64 -127 -240 -110 21 111 45 52 -77 249 75 105
7580 105 -1 322 86 -157 -117 143 -3 182 28 -339 -107 -77 -106 -61 91 -313 85 -90 222 -9 16 141
$$ packed form
7415C8j25o1L1K08j90j71L88k78J32K9o9O2J64j27l38K15r3O2K00lm5r1K23l2
7439A29k57J46pR3j02J75k18J36p6J5j08NON9k18K82P8j03j50K09M9k02p4K98
7463A65l02J82j28L7j60N3J75J03J0l80K80j2J66k42J76k68K33K85o71L92q6J04
7485A12J05o7j34N6L0k34K35Q9n6K29m30O1L93l45j44P8m7J06k59L65k13k1m5
7508a36j04K98J25j26N1j73Q6j0o9J5Q1L00m93L96k49k01K69j29q2K29k93J06
7530a09r6K61j06J70j06OK8K8j15L2P2K7P9k92j8p7p6L12R6j18J57j30K9J55k11
7555bL1l6r4r4M07l98K67j1m8o0l9J65l53K01o3j13J30J31R0o6Pj29L26j74L0
7580A05j06L23k36k43M0K60j46J85j54l67K32L0k9M5J52m04L98j75L12k31K5J25
$$ plain form
7602 141 -245 -93 -105 68 25 -139 119 215 44 -268 118 -195 -43 28 -18 20 51 -77 -122 -23 -152 -121 -183 -45
7626 -45 -21 171 -114 -122 30 -21 84 -3 -34 -30 -151 -162 36 131 -18 80 -65 87 -25 112 66 105 100 48 -198 -61
7652 -61 67 -59 210 -81 59 26 50 71 104 212 17 -62 -95 -16 -98 -117 -109 70 -199 -106 136 16 -26 45 136
7677 136 -331 -39 -156 96 28 -101 -76 8 95 -6 -42 44 59 199 -48 61 32 166 31 117 76 -186 322
7700 322 27 91 145 125 277 -233 -239 -66 -33 -73 122 103 -34 -99 67 73 -79 -382 -20 -222 -70 71 -92 -9
7724 -9 18 -69 5 -302 -127 -212 -16 54 255 109 18 39 -8 -140 10 23 75 -63 -206 0 84 -399 -15 -120
7748 -120 -4 187 0 68 -200 185 -296 208 -103 -41 221 -24 -163 -57 63 120 15 227 -79 -129 30
7769 30 33 -2 -136 -6 -41 52 -119 -1 16 -284 -82 99 -132 106 -62 175 126 14 60 -170 -19 13 -239
$$ packed form
7602A41l86J52j2J73m3j64K58R6j71l12L86l13J52P1m6L8L1j28m5R9j29L1o2J38
7626d5K4J92k85qJ52n1J05q7l1Mj21j1J98R5j49R8j45J52j12J37m6L9nn2k46J37
7652f1J28j26K69k91J40l3K4K1L3J08j95p9l3P9q2j9QJ79k69R3K42j20m2P1R1
7677A36m67K92j17K52o8j29K5Q4Q7j01l6Q6J5J40k47J09k9J34j35Q6m1k62N08
7700C22k95O4N4k0J52n10oJ73L3m0J95j9j37o5J66Oj52l03L62k02J52J41j63Q3
7724iK7q7P4l07J75q5J96P0K01j46r1K1m7j32J50J3N2j38j43K06Q4m83L84j05
7748a20J16J91j87O8k68L85m81N04l11O2K62k45j39J06J20N7j05K12l06n0J59
7769C0Ll5j34J30l5R3j71J18J7l00K02J81k31K38j68K37m9j12M6k30J51L2k52
$$ plain form
7792 -239 131 -10 23 150 96 -117 -68 123 150 -160 40 251 -90 196 -224 -19 68 174 -12 42 -291 181
7814 181 39 -180 75 9 -148 9 -185 -52 -174 -105 143 -56 -64 89 -24 58 140 -103 -106 -149 -24 40 -110
7837 -110 -140 10 92 -140 -129 190 37 40 -147 -206 -203 -112 72 65 4 226 -172 -107 94 -33 -8 -292 108 -30 245
7862 245 124 182 5 155 80 -85 71 -242 133 -255 -118 30 97 180 -21 15 2 118 205 155 137 -224 55
7885 55 -51 106 89 101 -57 -297 82 -145 11 18 29 22 -51 167 -149 14 13 99 190 30 23 84 10 282 -134 148
7911 148 -206 62 28 111 -32 1 144 -51 134 -59 -30 186 -192 213 104 63 -109 -39 -17 -225 41 -5 -266
7934 -266 67 147 179 0 16 136 39 -204 -312 -54 -11 19 77 309 -17 135 -121 45 55 -159 9 -41 -64
7957 -64 12 -158 -72 -213 -154 -24 -124 247 -149 -31 114 121 -167 154 130 5 19 216 -33 10 210 -171 -5
$$ packed form
7792b39L70j41L3J27n4k13M9J91K7l10K00K11l41K86m20K05Q7J06j86N4l33M72
7814A81j42k19K55o6j57J57j94J33j22O9K48j99qJ53j13Q2Q2k43lm3J25O4j50
7837a10l0J50Q2k32J1L19j53Lj87n9LR1J84po1K22l98O5K01j27K5k84M00j38K75
7862B45j21N8j77J50p5j65J56l13L75l88J37J48O7Q3k01L6j3J16Q7n0j8l61K79
7885E5j06J57j7J2j58k40L79k27J56PJ1pp3K18l16J63jQ6R1j60pO1p4K72m16K82
7911A48l54K68l4Q3j43L3J43j95J85j93K9K16l78M05j09m1j72P0K2k08K66m6k61
7934b66L33Q0L2j79J6J20r7k43j08K58M3L0N8K32l26J52k56J66J0k14J68n0k3
7957f4P6j70Q6j41N9J30j00L71l96J18J45Pk88L21k4j25J4J97k49M3K00l81J66
$$ plain form
7980 -5 144 6 -95 202 173 187 100 328 -22 57 -88 -146 256 -111 -161 48 -215 203 -81 126 45 129 1
8003 1 18 -263 57 99 -158 -84 258 35 224 57 -44 158 100 318 66 39 242 -141 -18 70 -51 -3 -75
8026 -75 94 32 -101 -154 -121 -7 -63 223 -122 -90 -124 3 271 145 -188 -228 28 220 -219 -203 83 169 4
8049 4 104 35 -306 -93 -143 -89 189 163 -62 -282 -55 125 6 -19 -200 78 92 106 50 3 237 -99 0 61
8073 61 171 38 33 -217 16 -324 99 -198 -160 -44 7 -130 -26 112 -91 -46 -60 85 228 -73 78 16 -130
8096 -130 -60 96 -218 -115 17 239 -55 88 -64 27 -115 -16 -166 -207 131 69 86 80 -23 -232 -38 -73 -22
8119 -22 4 -88 -218 15 -14 -432 -173 -213 26 -37 -169 -20 -104 -494 -116 260 -69 -275 -179 153 -96 13 -152
8142 -152 270 134 -93 102 139 32 187 -203 224 -141 159 186 159 -3 33 -18 99 110 -38 -30 123 91 -49
$$ packed form
7980eJ49j38j01K97k9J4q7K28l50P9j45n8M02l67n0K09k63M18k84K07q1Q4j28
8003AJ7k81L20M2k57P4L42k23J89j67j01K02n8K18k52k7K03l83J23Q8j21M8p2
8026g5J69o2j33n3L3J14n6K86l45L2l4J27K68j26l33m0K56J92m39J6K86Q6j65
8049DJ00o9l41K13n0N4K78k6k25k20K27J80j19k5j81K78J4J4n6m7K34l36R9O1
8073F1J10j33nk50K33l40M23k97L8J16N1j37J04J38k03M5j4J45J43l01J51o2j46
8096a30P0J56l14J03J32K22k94J43j52R1j42R9j50m1L38o2J7oj03k09J94l5N1
8119b2K6r2j30K33k9m18K59m0K39o3j32J49q4l90L78L76l29k06R6L32k49J09j65
8142a52M22j36k27J95L7j07J55l90M27l65L00K7k7j62L6n1J17J1j48QJ53l2j40
$$ plain form
8165 -49 152 90 -3 -32 60 22 167 -165 -177 115 41 -16 221 -157 -12 -270 87 -140 -112 -6 -192 72 -63
8188 -63 -182 -196 92
$$ packed form
8165d9K01o2r3k9R2l8J45l32j2K92p4n7K37l78J45k58L57k27K8J06j86K64j35
8188f3j19j4K88
8191I2
$$ Imaginary data points
##PAGE= N=2
##DATA TABLE= (X++(I..I)), XYDATA
$$ plain form
0 0 0 0 0 0 0 0 0 0 0 0 0 0 0 0 0 0 0 6 -8 8 -8 8 -8 12 -16 16 -16 24 -24 32 -32 40 -44 48 -56 63 -71 79 -88
39 -88 99 -108 122 -134 148 -164 180 -201 221 -244 269 -296 325 -357 397 -438 485 -539 601 -673
59 -673 758 -859 985 -1145 1354 -1642 2066 -2756 4063 -7453 39278 59312 -16163 -44895
73 -44895 -19320 32874 35343 3004 -23435 -10346 11248 14786 -3198 -14157 -8807 7197 14094
86 14094 8273 -6683 -14459 -9999 4277 11816 6324 -5326 -7665 -2613 2223 -334 -3796 -1386
100 -1386 5040 8236 4869 -3722 -9717 -7648 3245 13298 10811 -2750 -12067 -5732 7122 8681
114 8681 -1768 -7187 870 11123 7304 -7113 -13550 -4391 8582 11145 4347 -1704 -2089 -719
128 -719 -780 -420 2691 6680 7043 2179 -5131 -8280 -4460 2148 3535 -955 -3240 -401 3054 -1844
$$ packed form
0@%%%%%%%%%%%%%%%%%Oj4J6j6J6j6K0k8L2l2M0m8N6o4P2q4R2j04J19j34J50j67
39h8J87k07K30k56K82l12L44l81M22m65N13n65O21o82P54q35R23j024J140j274
59f73J431j617J844k130K499k996L708m822O819j1516M6731K0034p5475k8732
73d4895K5575N2194K469l2339k6439J3089K1594L538j7984j0959N350J6004O897
86A4094n821j4956p776M460J4276P539n492j1650k339N052M836k557l462K410
100a386O426L196l367q591n995K069J0893J0053k487j3561r317O335J2854J559
114H681j0449n419Q057J0253l819j4417o437R159J2973K563o798o051l85J370
128g19o1L60L111L989L63m864p310l149L820O608J387m490k285K839L455m898
$$ plain form
144 -1844 -9225 -7665 3714 11522 5864 -5205 -7965 -2047 1512 30 864 6179 6986 -1653 -10389
159 -10389 -6865 4492 8319 1717 -4196 -464 3657 -373 -7442 -7525 833 6489 3103 -2023 -3433
174 -3433 -2483 -2556 -3443 -511 3965 5022 1248 -3602 -4949 -2759 2122 5730 5098 1027 -1766 -855 990
191 990 -639 -3852 -1962 5069 7534 -339 -9625 -9793 -1535 3846 1031 -2592 -1013 1321 -2164 -7456
207 -7456 -6794 614 5567 3353 -1522 -3582 -3439 -3439 -3112 1 3962 5042 1068 -3652 -4416 -2286 886
224 886 2170 1727 830 27 148 -1775 -4658 -4569 825 7518 6793 -1700 -8355 -5655 1654 4144 772
241 772 -1459 1361 3128 -1028 -6545 -5507 291 3840 2237 192 -412 -2542 -5985 -6099 -531 6207
257 6207 5055 -2662 -7276 -5347 -648 638 -518 -308 2237 2557 381 -2807 -4417 -2519 1878 5504
$$ packed form
144a844p381J560J1379P808n658j1069k760N918L559j482Q34N315Q07q639q736
159a0389L524J1357L827o602n913L732M121m030p069q3Q358N656l386n126j410
174c433R50p3q87K932M476J057l774m850j347K190M881L608o32m071k793R11J845
191I90j629l213J890P031K465p873r286j68Q258N381k815l623J579K334l485n292
207g456O62P408M953k214m875k060J43%L27L113L961J080l974m720p64K130L172
224H86J284m43q97q03J21j923k883Q9N394O693p25q493o655K700P309K490l372
241G72k231K820J767m156n517J038N798L549j603k045o04k130l443j14N568O738
257F207j152p717m614J929M699J286j156K10K545L20k176l188j610J898M397L626
$$ plain form
273 5504 4785 167 -4295 -4214 -549 1693 1494 1476 2908 2656 -1632 -5511 -4488 570 3698 2814 237
290 237 -998 -2239 -3856 -3695 -98 4588 4247 993 -2676 -2593 -1605 -1186 -152 2820 4248 2146 -2194
307 -2194 -4129 -3148 -574 1380 3193 3842 1865 -1735 -4226 -3839 -1052 1758 3112 3010 7 -3236
323 -3236 -4537 -2140 1799 2958 1751 1126 1315 292 -2811 -4680 -936 4387 6015 2236 -1622 -3258
339 -3258 -2099 -114 1187 2878 3590 1711 -689 -2026 -1861 -1518 -599 1583 3775 3241 -866 -4541
355 -4541 -3979 -577 2856 4186 3367 1144 -1909 -3708 -2449 951 3143 2472 1361 1146 43 -2267
371 -2267 -3057 -1055 3324 5390 3574 -748 -3427 -3203 -1247 1698 3109 2758 916 -262 -935 -1338
387 -1338 -1571 -296 3038 5136 3411 -1212 -3691 -2253 844 2458 1939 1971 1910 852 -2214 -3130 -251
$$ packed form
273E504p19m618m462Q1L665K242j99j8J432k52m288l879J023N058L128q84k577
290B37j235j241j617J61L597M686l41l254l669Q3R88M19J034K972J428k102m340
307b194j935R81K574J954J813O49j977l600k491L87K787K810J354j02l003l243
323c236j301K397L939J159j207o25J89j023l103j869L744N323J628l779l858j636
339c258J159J985J301J691P12j879k400j337J65L43R19K182K192n34m107l675
355d541N62L402L433J330q19k223l053j799J259L400K192o71j111k15j103k310
371b267p90K002M379K066j816m322k679K24J956K945J411l51j842j178o73m03
387a338k33J275L334K098j725m623k479J438L097J614n19L2o1j058l066r16K879
$$ plain form
404 -251 3167 3677 1947 183 -633 -1863 -3102 -2083 1277 4270 3600 527 -2002 -2855 -1391 470
420 470 2255 3296 2803 1162 -1886 -2825 -2044 644 3162 3920 2106 -401 -1901 -1956 -1195 10 2077
437 2077 4113 2742 -833 -4598 -4105 -164 2429 2524 1229 643 92 -1241 -2594 -1936 1501 4567 4133
454 4133 1040 -2164 -3297 -2122 385 2303 2618 2525 1135 -1311 -2954 -2508 295 2909 3110 579
470 579 -1216 -1851 -1771 -2198 -1648 1189 4641 4093 -526 -4933 -3578 350 2917 2015 769 1813 1697
487 1697 -1392 -4576 -3664 1435 4715 3507 -472 -2422 -1830 -1294 -1534 -101 2681 3725 933 -3766
503 -3766 -4818 -1804 1600 2714 1065 355 927 1204 -1125 -3586 -1713 2322 5164 3178 -1819 -4041
519 -4041 -2251 -121 632 651 1580 2521 556 -3092 -5100 -2531 1899 3186 1257 -886 -1250 -1547 -2392
$$ packed form
404b51L418N10j730j764q16j230j239J019L360K993o70l073k529q53J464J861
420D70J785J041m93j641l048r39P81K688K518P58j814k507j500n5P61J205K067
437B077K036j371l575l765M93L941K593R5j295n86n51j333j353O58L437L066m34
454D133l093l204j133J175K507J918L15r3j390k446j643M46K803K614K01k531
470E79j795o35Q0m27N50K837L452n48m619m407J355L928K567r02j246J044j16
487A697l089l184R12N099L280j208l979j950N92N36k40J433K782J044k792m699
503c766j052L014L404J114j649p10N72K77k329k461J873M035K842j986m997k222
519d041J790K130P53J9R29R41j965l648k008K569M430J287j929k143l64k97q45
$$ plain form
536 -2392 -2451 -162 3653 4510 1369 -2955 -3827 -1571 796 1434 358 -132 845 142 -2823 -4653 -2664
553 -2664 2637 4912 2702 -1801 -3124 -1758 -714 -961 -602 2224 4159 994 -4191 -5092 -880 2860
569 2860 2605 34 197 1823 745 -3170 -4379 -504 4716 5101 -278 -4278 -3431 -483 87 -757 -495
586 -495 1879 2429 -610 -4649 -4642 -947 3147 2773 692 -617 -267 -506 -1993 -2451 856 4445 4240 -429
604 -429 -4571 -4118 -471 1466 545 -106 1279 1819 -891 -4162 -3688 1470 5052 3862 -175 -2578 -1978
621 -1978 -1117 -1098 -703 985 3110 2371 -799 -3969 -3667 -582 2275 2669 1326 403 91 -661 -2308 -2800
639 -2800 240 3899 3659 -735 -5137 -3485 159 1860 -235 -645 1686 3025 -681 -4527 -3939 1840
655 1840 5291 2968 -1049 -1244 645 -73 -2928 -2761 1669 4638 2485 -3037 -4769 -1760 1658 1642
$$ packed form
536b392n9K289L815Q57l141m324q72K256K367O38j076m90R77p03k965j830J989
553b664N301K275k210m503j323J366J044k47L59K826J935l165n185r01M212L740
569B860k55k571J63J626j078l915j209L875N220L85n379m000Q47K948N70q44K62
586d95K374N50l039m039PL695M094l74k081j309L50k39j487m58L307L589k05m669
604d29m142M53L647J937r21o51J385N40k710l271M74N158L582j190m037k403O00
621a978Q61J9L95J688K125p39l170l170L02L085K857L94j343r23l12p52j647m92
639b800L040L659k40m394m402J652L644J701k095m10K331J339l706l846N88N779
655A840L451k323m017j95J889p18k855J67M430K969k153n522j732L009L418j6
$$ plain form
671 1642 222 751 2220 1429 -1966 -3741 -1358 2850 4595 1762 -1579 -2468 -1005 -349 -1132 -1066 1356
688 1356 4000 2361 -2015 -4539 -1893 2213 3492 1205 -153 724 691 -1789 -3954 -1486 2965 4014
704 4014 1010 -2999 -2967 -633 1002 723 251 2138 2626 754 -2219 -3395 -1285 2149 3455 1805
720 1805 -348 -1597 -996 -967 -1518 -600 1839 3728 2009 -2172 -4002 -1514 1913 2264 122 194 2010
737 2010 1865 -1751 -4381 -1319 3969 4691 430 -3232 -2225 484 30 -1999 -936 2988 4327 471
753 471 -3889 -3789 -147 2385 1748 249 497 767 -666 -2546 -2230 565 3240 3027 589 -1878 -1785
770 -1785 -359 759 675 759 1863 2205 177 -3219 -3856 -258 3356 3311 242 -1491 -600 -60 -1018 -1873
788 -1873 421 3467 3075 -811 -3488 -2461 273 1299 782 793 1839 1185 -1370 -3088 -2212 845 2716
$$ packed form
671A642j420N29J469p91l395j775K383M208J745k833l341q89J463O56p83O6K422
688A356K644j639m376k524K646M106J279k287j358Q77l3k480k165K468M451J049
704D014l004m009L2K334J635k79m72J887M88j872k973j176K110L434J306j650
720A805k153j249O01K9n51R18K439J889j719m181j830K488L427L51k142P2J816
737B010j45l616k630L062N288P22m261l662J007K709m54k029J063L924J339l856
753D71m360J00L642K532o37j499K48K70j433j880L16K795K675k13k438k467R3
770a785J426J118q4Q4J104L42k028l396o37L598L614m5l069j733Q91N40r58q55
788a873K294L046l92l886k677J027K734J026n17J1J046o54k555j718Q76L057J871
$$ plain form
805 2716 2277 33 -1189 -1456 -959 -307 121 960 2306 2161 41 -2703 -2896 -150 2554 2391 623
822 623 -512 -154 -513 -1959 -1908 1042 3729 3031 -587 -2640 -1471 -2 -145 -362 932 2128 1205
839 1205 -2195 -3607 -1487 1646 2330 1169 66 -231 -1098 -1466 -1444 -174 1934 2843 1269 -719 -2261
856 -2261 -2059 -750 1081 2095 1377 565 -196 -1425 -2585 -1412 1056 2686 1950 -443 -1705 -1355 -721
873 -721 -305 -240 1735 2730 1155 -1795 -3039 -1285 1221 1390 992 368 207 -590 -2120 -2042 119 2269
891 2269 2129 890 -686 -1464 -1751 -1453 384 1447 1803 736 -421 -1469 -1723 -825 585 2242 1838
908 1838 274 -1169 -1614 -933 -361 233 1374 2087 907 -1434 -2525 -1543 491 1209 1296 1193 596 -1078
926 -1078 -2322 -2121 360 1505 1293 1022 -49 -715 -1418 -1375 -26 1763 1826 978 -787 -1548 -1570 -1157 251
$$ packed form
805B716m39k244j222k67M97O52M28Q39J346j45k120k744j93K746K704j63j768
822F23j135L58l59j446N1K950K687o98l618k053J169J469j43k17J294J196r23
839A205l400j412K120L133O84j161j103k97q67l68K2J270K108R09j574j988j542
856b261K02J309J831J014p18q12p61j229j160J173K468J630p36k393j262L50O34
873g21M16O5J975R95j575k950j244J754K506J69l98o24j61p97j530P8K161K150
891B269j40j239j576p78k87K98J837J063L56j067j157j048k54Q98J410J657m04
908A838j564j443m45O81N72N94J141P13j180k341j091R82K034P18Q7j03n97j674
926a078j244K01K481J145k12k71j071o66p03M3J349J789O3q48j765p61k2M13J408
$$ plain form
945 251 1610 2035 916 -759 -1743 -903 -270 253 989 1865 892 -814 -1978 -1565 -239 1071 1432 1312
963 1312 417 -1000 -1990 -1229 55 1432 1465 1039 -29 -642 -1840 -1738 -380 1602 1889 828 -591
980 -591 -999 -1158 -1431 -444 1629 2588 916 -1039 -1963 -786 -72 33 698 1423 1574 108 -2143 -2214 -590
999 -590 1259 1723 968 65 -256 -1453 -2075 -1253 989 1794 1867 78 -1320 -1536 -679 271 1217 1338 1181
1018 1181 648 -840 -1650 -1557 -335 1910 2453 586 -964 -1472 -765 -571 -342 332 2169 1568 -491 -2397
1036 -2397 -1870 63 1293 1133 1083 903 305 -754 -1789 -1194 907 1929 1447 42 -1350 -1460 -1020
1053 -1020 -93 519 1000 1091 670 -416 -1776 -1769 30 1952 1791 480 -942 -1190 -442 -468 -522 537 2130
1072 2130 2093 -100 -2237 -1966 138 1377 301 -115 635 854 -868 -2552 -1416 968 2629 1631 -402
$$ packed form
945B51J359M25j119j675r84Q40O33N23P36Q76r73j706j164M13J326J310L61j20
963A312q95j417r90P61J284J377L3m26j068o13j198J02J358J982K87j061j419
980e91m08j59k73R87K073R59j672j955r24J177P14J05O65P25J51j466k251p1J624
999e90J849M64p55r03l21j197o22Q22K242Q05P3j789j398k16Q57R50R46J21j57
1018A181n33j488q10R3J222K245N43j867j550n08P07J94K29O74J837o01k059j906
1036b397N27J933J230j60n0j80n98j059j035N95K101J022m82j405j392j10M40
1053a020R27O12M81R1m21j086j360PJ799J922j61j311j422k48P48k6n4J059J593
1072B130l7k193k137K71K104J239j076m16P50K19j722j684J136K384J661r98k033
$$ plain form
1089 -402 -1370 -899 -646 -299 -226 767 2025 1083 -1134 -2307 -1393 582 1326 1215 412 301 24 -796 -1473
1108 -1473 -896 1198 2443 1534 -1053 -2045 -1461 11 337 -64 602 1833 774 -1142 -2204 -1271 1183
1125 1183 2192 1110 -253 -673 -437 -303 -1006 -519 1169 1923 1203 -1116 -2068 -1025 388 819 669
1142 669 324 734 82 -1352 -2149 -1063 1345 2261 1205 -956 -1941 -503 302 -34 -357 403 2067 1164
1160 1164 -1730 -2699 -617 1576 1532 301 -368 186 299 -1450 -2571 -881 1913 2269 287 -1729 -1604
1177 -1604 -57 560 -70 171 1127 1685 35 -1736 -1985 -115 1469 1881 423 -864 -395 -289 -778
1194 -778 -1176 -29 1450 1867 160 -1805 -1735 -230 1101 958 263 464 367 -186 -1899 -1734 60 1951
1212 1951 2136 194 -1195 -1012 -243 -44 -407 294 1526 1657 401 -1909 -2023 -4 1598 1251 -63
$$ packed form
1089d02r68M71K53L47P3R93J258r42k217j173R14J975P44j11q03j11k77q20o77
1108a473N77K094J245r09k587r92N84J472L26m01O66J231j059j916j062R33K454
1125A183J009j082j363m20K36J34p03M87J688P54p20k319r52J043J413M31j50
1142F69l45M10o52j434p97J086K408R16j056k161r85J438Q05l36l23P60J664r03
1160A164k894r69K082K193m4j231o69N54J13j749j121J690K794L56j982k016J25
1177a604J547O17o30K41R56N58j650j771k49J870J584M12j458j287M69J06m89
1194g78l98J147J479M17j707j965P0J505J331j43o95K01r7n53j713J65J794J891
1212A951J85j942j389J83P69J99l63P01J232J31j256k310j14K019J602l47j314
$$ plain form
1229 -63 -361 -163 -428 -1176 -1542 389 2081 1795 -112 -1610 -1254 38 756 -100 93 975 1130 -166
1247 -166 -2335 -1907 441 2058 1059 -682 -1056 -89 280 -779 -1166 790 2292 1475 -804 -2300 -994
1264 -994 573 1149 408 -266 436 722 -696 -1992 -1020 1189 2151 1216 -559 -926 -524 -42 -186 -330
1282 -330 919 2113 854 -948 -2313 -1297 644 1290 424 -526 -339 69 -239 -1651 -631 1150 2082
1299 2082 934 -859 -1458 -479 351 589 -8 490 810 446 -1115 -2081 -1221 999 1638 883 -384 -561
1317 -561 -111 62 -881 -552 873 1846 890 -1360 -1710 -568 727 1180 221 99 976 283 -911 -1856
1335 -1856 -756 1336 2100 599 -776 -840 -239 148 -416 -166 957 1186 275 -1405 -1915 -586 1137
1352 1137 1194 274 -122 -59 -62 -968 -1056 -33 1459 1665 361 -895 -1165 -364 507 416 150 486 724 -180
$$ packed form
1229f3k98J98k65p48l66J931J692k86j907j498L56J292P18q56J93Q82J55j296
1247a66k169M28K348J617r99j741l74R67L69j059l87J956J502q17k279j496J306
1264i94J567N76p41o74P02K86j418j296R72K209R62r35j775l67M02M82j44j44
1282c30J249J194j259j802j365J016J941O46q66r50J87M08l08j412J020J781R32
1299B082j148j793n99R79Q30K38n97M98L20l64j561r66Q60K220O39p55j267j77
1317e61M50J73r43L29J425R73r56k250l50J142J295M53r59j22Q77o93j194r45
1335a856J100K092P64j501j375o4O01L87n64K50J123K29r11j680n10J329J723
1352A137N7r20l96O3lr06q8J023J492K06j304j256k70Q01Q71r1k66L36K38r04
$$ plain form
1372 -180 -1310 -1607 154 1244 1623 511 -383 -331 -314 -787 -588 318 1342 1295 13 -1297 -1450 -78
1390 -78 441 692 376 164 229 -547 -1150 -1082 38 1254 1044 16 -824 -762 -555 94 -176 522 616 945 -78
1411 -78 -1387 -1276 -67 1081 1047 131 -213 49 -242 -949 -650 670 1289 1148 -119 -1235 -996 -154 12
1430 12 158 426 679 333 -857 -1508 -884 396 1118 752 72 -293 -411 -656 -327 -213 398 925 538 -608
1450 -608 -875 -966 109 722 629 683 19 -120 -789 -918 -497 646 1141 630 -261 -697 -735 -228 -269 136 844
1471 844 921 232 -743 -1053 -468 235 721 550 122 79 -494 -826 -525 -30 619 1108 496 -281 -845 -846 71
1492 71 175 373 426 114 -217 -691 -1023 -410 571 1176 775 -43 -538 -762 -632 -396 414 472 607 221 -708
1513 -708 -945 -619 9 770 709 436 -153 -544 -671 -527 -122 647 857 430 -106 -551 -881 -41 325 185
$$ packed form
1372a80j130k97J761J090L79j112q94N2J7m73J99R06J024m7j282j310j53J372
1390g8N19K51l16k12O5p76o03O8J120J216k10j028q40O2K07O49k70O98R4L29j023
1411g8j309J11J209J148l4r16l44K62k91p07K99J320O19j41j267j116K39Q42J66
1430A2J46K68K53l46j190o51O24J280P22l66o80l65j18k45L29J14O11N27l87j146
1450f08k67r1J075O13r3N4o64j39o69j29M21J143M95n11q91m36l8N07m1M05P08
1471H44P7o89r75l10N85P03M86j71m28m3n73l32L01M95O49M89o12p77n64jR17
1492G1J04J98N3l12l31m74l32O13R81O05m01q18m95k24J30K36Q10N8J35l86r29
1513g08k37L26O28P61o1k73n89l91j27J44M05P69K10m27n36m45l30Q40L66j40
$$ plain form
1533 185 533 219 -463 -422 -690 -363 280 743 774 85 -255 -962 -530 -279 574 1009 678 78 -533 -867 -591
1554 -591 -267 441 637 597 304 -550 -897 -350 282 382 712 462 203 -576 -691 -734 77 852 937 337 -209
1575 -209 -508 -484 -525 65 807 678 108 -394 -491 -900 262 268 465 438 295 -320 -691 -967 -239 414 910 639
1597 639 -92 -496 -615 -380 -53 525 719 700 232 -664 -853 -228 345 562 615 178 -127 -92 -761 -684 148
1618 148 809 1249 50 -366 -532 -385 -300 -217 219 748 525 18 -580 -923 -64 553 285 340 -25 -292 -490
1639 -490 -194 -67 -8 679 640 102 -712 -860 -293 109 560 275 374 327 -206 -621 -874 -199 517 750 262
1660 262 -451 -593 -168 -373 -75 458 668 780 -272 -801 -815 132 752 483 78 -32 181 -323 -775 -631
1680 -631 183 874 702 -319 -654 -203 172 101 -96 160 755 219 -429 -1031 -683 -71 776 414 -158 -138
$$ packed form
1533A85L48l14o82M1k68L27O43M63L1o89l40p07M32K51Q53M35l31o00o11l34K76
1554e91L24P08J96m0k93q54l47N47O32J00L30k50k59p79j15m3Q11P75Q5o00n46
1575b09k99K4m1N90P42j29n70n02r7m09J162OJ97k7j43o15l71k76P28O53M96k71
1597F39p31m04j19K35L27N78J94j9m68q96j89O25N73K17N3m37l05L5o69P7Q32
1618A48O61M40j199m16j66J47Q5Q3M36N29k23n07n98l43Q59O17k68N5l65k67j98
1639d90K96J27N9O87l9n38q14j48N67M02M51k85R9m7n33m15k53O75P16K33m88
1660B62p13j42M25k05K98N33K10J12j052n29j4R47O20k69m05j10K13n04m52J44
1680f31Q14O91j72j021l35M51L75p1j97K56N95n36o48o02L48O12Q47l62n72K0
$$ plain form
1700 -138 81 -127 -782 -450 263 908 706 -388 -776 -670 348 418 346 0 373 141 -397 -885 -408 574
1720 574 860 681 -225 -349 -149 -274 -61 0 401 714 400 -53 -937 -425 369 413 291 -72 147 -11 -258
1741 -258 -529 -563 672 972 708 -472 -691 1 113 123 -204 319 603 39 -587 -942 -61 518 894 180
1761 180 -255 -99 132 -256 -754 -146 459 777 230 -728 -795 -333 209 442 -134 148 603 42 -483 -738
1781 -738 -270 661 894 78 -704 -335 -26 38 -125 42 489 458 4 -650 -367 -56 557 449 -186 63 -298
1802 -298 -134 -314 -289 181 639 773 -108 -459 -459 12 453 111 21 424 357 14 -633 -628 -169 902 804 179
1824 179 -374 -206 -63 24 -367 -173 582 1041 5 -826 -879 -72 528 192 -65 18 154 -202 -489 -597 81
1845 81 678 929 -211 -593 -449 -217 -82 -153 243 459 778 -377 -801 -192 3 983 218 26 15 -51 -190
$$ packed form
1700a38K19k08o55L32P13O45k02j094l88J06J018P0p2l46L73k32n38m88M77R82
1720E74K86j79r06j24K00j25K13O1M01L13l14m53q84N12P94M4j22l63K19j58k47
1741b58k71l4J235L00k64j180k19O92J12J0l27N23K84n64o26l55Q81N79L76p14
1761A80m35J56K31l88m98O08O05L18n47r58o7M62N42K33n76K82M55n61n25k55
1781g38M68R31K33q16p82L69L09O4j63J67M47l1m54o54K83L11O13j08o35K49l61
1802b98J64j80K5M70M58J34q81l51%M71M41l42r0M03o7l43o47NM59J071r8o25
1824A79n53J68J43Q7l91J94P55M59j036q31n3Q07O00l36k57Q3J36l56k87j08O78
1845H1N97K51j140l82J44K32J35p1L96K16L19j155m24O09J95R80p65j92j1o6j39
$$ plain form
1866 -190 -508 -609 107 928 692 -357 -713 -455 -323 230 164 -25 53 -64 -284 -834 -346 361 688 541
1886 541 -236 -254 -158 -4 -558 -273 159 472 232 -537 -547 -365 198 122 -41 368 -220 -75 -243 -447 -259
1907 -259 465 633 453 -1 -519 -360 2 -95 159 273 425 425 -454 -741 -579 406 659 266 2 -52 80
1928 80 -342 -568 -453 464 700 425 -389 -530 -246 126 257 293 218 462 104 -396 -706 -96 613 720 233
1949 233 -326 -247 -20 -47 -242 131 420 624 162 -374 -593 -230 301 286 234 49 32 -221 -388 -357 61 546
1971 546 519 31 -376 -536 -158 76 -112 116 20 272 90 -332 -316 -20 310 568 -85 -370 -113 -193 -213 -241
1993 -241 -254 574 661 94 -431 -527 -151 -99 241 95 288 88 24 -243 -234 109 310 632 112 -395 -235 51
2015 51 -19 -74 124 330 37 -383 -409 -451 -48 293 244 174 -277 203 -347 -331 -48 106 612 286 257 -237 -115
$$ packed form
1866a90l18j01P16Q21k36j049l56K58J32N53o6j89P8j17k20n50M88P07L27j47
1886E41p77j8R6J54n54K85M32L13k40p69j0J82N63p6j63M09n88J45j68k04J88
1907b59P24J68j80m54n18J59L62r7K54J14J52%q79k87J62R85K53l93k64n4J32
1928H0m22k26J15R17K36k75q14j41K84L72J31L6p5K44l58n00l10O10P09J07m87
1949B33n59P9K27k7j95L73K89K04m62n36k19L63N31j5n2j85j7k53j67L1M18M85
1971E46k7m88m07j60L78K34j88K28r6K52j82m22J6K96L30K58o53k85K57q0k0k8
1993b41j3Q28Q7n67n25r6L76N2L40j46J93k00o4k67RL43K01L22n20n07J60K86
2015E1p0n5J98K06k93m20k6m2M03L41m9p0m51M80n50J6K83J54N06l26k9m94J22
$$ plain form
2038 -115 64 30 74 -55 182 435 13 -196 -258 -36 569 432 -17 -238 154 198 -253 -118 190 458 136
2059 136 -151 -505 -430 -12 111 307 268 455 -94 -280 -524 -211 286 492 696 19 -160 -296 34 135 19
2080 19 239 219 -94 -108 -458 -206 117 -24 76 -38 -291 -367 -460 -242 299 -6 382 469 -205 -150 -453 210
2102 210 -84 -241 -46 366 40 -282 -327 -67 -97 202 298 274 -111 -298 -298 60 47 215 -88 171 -111 -475
2124 -475 -82 191 74 493 -55 -127 3 -321 -198 121 45 261 56 -232 -158 -121 -315 -181 52 131 -168 -82
2146 -82 -153 -76 43 134 194 182 64 61 -161 -382 102 93 212 219 -69 -42 -176 -128 -252 381 401 -96 243 -180 -363
2171 -363 -164 14 9 181 161 -61 -404 -195 -314 -209 346 135 -209 -4 -232 35 -46 -32 220 476 148 -200
2193 -200 -297 -239 77 -57 275 43 312 -20 -518 -126 143 139 146 81 19 -118 -166 -351 20 107 169 197 -109 -398
$$ packed form
2038a15J79l4M4j29K37K53m22k09o2K22O05j37m49k21L92M4m51J35L08K68l22
2059A36k87l54P5M18J23J96l9J87n49j86k44L13M97K06K04o77j79j36L30J01j16
2080A9K20k0l13j4l50K52L23j41J00j14k53p6r3K18N41l05L88Q7o74N5l03O63
2102B10k94j57J95M12l26l22m5K60l0K99R6k4l85j87%L58j3J68l03K59k82l64
2124d75L93K73j17M19n48p2J30l24J23L19p6K16k05k88P4L7j94J34K33P9k99Q6
2146h2p1P7J19R1O0j2j18lk22k21M84rJ19Pk88K7j34M8j24O33K0m97L39m23j83
2171c63J99J78nJ72k0k22l43K09j19J05N55k11l44K05k28K67q1J4K52K56l28l48
2193b00r7N8L16j34L32k32K69l32m98L92K69mPo5o2j37m8j85L71Q7O2K8l06k89
$$ plain form
2217 -398 -368 -94 368 231 352 -24 -58 243 -147 -253 59 353 394 152 -166 -246 -99 -189 258 224 80 84 -135
2240 -135 -283 -451 -256 572 53 118 24 -75 -169 -77 -141 39 -15 365 39 -125 -569 -227 -36 243 276 -173 87
2263 87 -108 -404 -218 -86 205 251 20 -304 -120 -252 -216 -54 -213 382 282 -31 -353 -286 192 -209 203
2284 203 241 -96 -124 -68 -150 -242 146 280 442 -148 -359 -475 225 165 -52 74 68 90 1 -265 -273 -14 304 261
2308 261 -89 -258 -143 199 -14 -309 148 -146 172 -247 -94 -269 -13 159 180 -111 58 89 -381 -120 -167
2329 -167 184 382 111 -100 24 -210 9 -163 62 277 58 162 -114 -314 -14 -24 498 231 47 -126
2349 -126 27 -181 -241 22 198 268 248 -322 -387 -314 -205 -49 9 142 213 33 -96 -397 194 445 78 155 -178
2372 -178 -366 107 -184 -35 19 -45 398 287 -376 -395 -76 -88 55 -20 -15 116 -90 -11 -166 253 -13 417 -118
$$ packed form
2217c98L0K74M62j37J21l76l4L01l90j06L12K94M1k42l18q0J47r0M47l4j44Mk19
2240a35j48j68J95Q28n19O5r4r9r4R2o4J80n4L80l26j64m44L42J91K79L3m49K60
2263H7j95k96J86J32K91M6k31l24J84j32L6J62j59N95j00l13l22O7M78m01M12
2284B03L8l37k8N6q2r2L88J34J62n90k11j16P00o0k17J26oK2q9k66qK59L18m3
2308B61l50j69J15L42k13k95M57k94L18m19J53j75K56J72K1k91J69L1m70K61m7
2329a67L51J98k71k11J24k34K19j72K25K15k19J04k76k00L00j0N22k67j84j73
2349a26J53k08o0K63J76P0k0n70o5P3J09J56N8J33P1j80j29l01N91K51l67P7l33
2372a78j88M73k91J49N4o4M43j11o63j9L19j2J43p5NJ31k06P9j55M19k66M30n35
$$ plain form
2395 -118 -123 -158 -219 142 149 321 215 315 -79 -443 -365 63 165 241 68 -288 -186 -146 -306 -106 -72 21 316 -39
2419 -39 -277 -299 45 152 217 76 -151 327 55 19 -103 17 281 145 -24 4 -14 -58 -53 -193 180 187 278 -62
2443 -62 -385 -523 -23 177 30 -95 -167 293 227 -244 -136 177 363 220 -213 -307 -379 7 -26 41 71 107 181
2466 181 -130 -254 -175 -248 140 79 80 -187 19 -222 30 -19 183 119 282 -55 -485 -50 372 442 -143 -88 34
2489 34 -81 93 -77 -134 78 111 -91 29 40 -138 28 65 2 -1 74 34 163 -218 -15 -33 161 75 59 51 109
2514 109 -288 -193 -189 13 313 220 -268 -66 -221 -73 -60 -120 148 453 -31 -79 -190 -268 190 -5 167 402 102
2537 102 -168 -14 -136 -128 314 51 220 -94 -120 193 -53 267 290 149 127 239 74 -21 -247 342 281 -38
2559 -38 -89 -194 -131 -11 32 -242 -204 115 140 -71 -256 -84 75 23 118 95 -104 -48 -228 -193 6 201 353 15
$$ packed form
2395a18nl5o1L61PJ72j06J00l94l64P8M28J02P6j73l56J02M0j60K00L4R3K95l55
2419c9k38k2L44J07O5j41k27M78k72l6j22J20K64j36j69K8j8m4Nj40L73PR1l40
2443f2l23j38N00K00j47j25p2M60o6m71J08L13J86j43m33r4p2L86l3O7L0L6P4
2466A81l11j24P9p3L88o1Jk67K06k41K52m9K02o4J63l37m30M35M22P0n85N5J22
2489C4j15J74j70n7K12L3k02J20J1j78J66L7o3lP5m0J29l81K03j8J94q6j6qN8
2514A09l97R5MK02L00r3m88K02j55J48J3o0K68L05m84m8j11p8M58j95J72K35l00
2537A02k70J54j22QM42k63J69l14k6L13k46L20K3j41k2J12j65r5k26N89o1l19
2559c8n1j05O3J20M3k74L8L19K5k11j85J72J59n2R5k3j99N6j80L5J99J95J52l38
$$ plain form
2583 15 -196 -235 5 39 108 8 157 199 45 -49 -174 -20 -23 0 -13 -81 54 112 -139 -143 88 -41 328 -11 75
2608 75 -43 343 115 96 138 153 15 -25 -315 -101 82 57 40 77 -53 43 -74 135 96 35 -53 11 -196 -101 -103
2633 -103 -31 7 65 -97 15 -170 -87 -14 -225 -88 229 56 108 -55 -194 -47 -67 134 36 23 111 -201 -99
2656 -99 -112 -110 130 278 62 197 -70 -96 -71 -72 -127 -45 2 195 -90 -160 2 132 -101 42 193 -195 -141 66
2680 66 -147 83 2 -64 184 74 118 -143 93 206 113 47 202 5 -85 -118 102 43 238 90 100 -63 44
2703 44 -222 0 358 115 -128 -11 -105 -219 -76 76 129 227 -99 -226 172 156 98 32 269 86 -16 -93 -235
2726 -235 -403 203 -1 -173 -127 -28 -59 -81 -186 -99 225 152 173 87 -142 56 40 84 32 218 30 -69 -148 124
2750 124 177 -219 122 104 138 -53 -201 -3 -95 184 92 36 99 34 -154 -243 -88 162 327 -82 15 -54 -91 -282
$$ packed form
2583A5k11l9K40L4O9j00J49M2j54r4j25J54lK3j3o8J35N8k51mK31j29L69l39Q6
2608G5j18L86k28j9M2J5j38m0k90K14J83k5j7L7j30R6j17K09l9o1q8O4k07R5k
2633a03P2L8N8j62J12j85Q3P3k11J37L17j73N2j63j39J47k0K01r8j3Q8l12J02
2656i9j3KK40J48k16J35k67k6K5jn5Q2M7J93k85p0J62J30k33J43J51l88N4K07
2680F6k13K30q1o6K48j10M4k61K36J13r3o6J55j97r0l3K20n9J95j48J0j63J07
2703D4k66K22L58k43k43J17r4j14J43J52N3R8l26j27L98j6n8o6K37j83j02p7j42
2726b35j68O06k04j72M6R9l1k2j05Q7L24p3K1q6k29J98j6M4n2J86j88r9p9K72
2750A24N3l96L41j8L4j91j48J98r2K79r2n6O3o5j88q9J55K50J65m09R7o9l7j91
$$ plain form
2774 -282 28 261 316 166 -5 -161 20 -147 -112 -39 243 163 62 -41 139 -347 22 -12 108 -149 -166 86
2796 86 -6 136 24 210 197 25 -275 -80 -221 -3 -96 201 -147 -25 -92 -227 -358 -201 60 103 -189 -248
2818 -248 -99 -146 -39 20 346 92 103 159 60 31 -86 -252 76 225 -24 -121 -236 -255 -43 -14 132 -15 -169
2841 -169 -136 -10 -73 155 43 78 74 -67 -294 -7 0 -215 -65 181 37 -33 8 -138 17 171 99 128 133 21
2865 21 275 27 127 -228 18 -1 -30 8 -260 -43 -178 -84 280 155 72 12 20 -162 -59 20 19 -329 63 139
2889 139 -67 -68 -66 -45 -53 -229 -99 -66 -130 93 -28 -93 344 184 -39 -113 -345 66 304 -61 -90 143 254 2
2913 2 -107 -209 43 233 89 -27 31 67 303 95 -113 -25 223 -170 45 -137 -80 55 118 -119 -38 17 74
2936 74 295 -101 -236 31 405 175 -42 29 -124 -400 -11 0 160 -15 96 -46 171 -3 40 258 147
$$ packed form
2774b82L10K33N5j50j71j56J81j67L5P3K82q0j01j03J80m86L69l4J20k57j7K52
2796H6r2J42j12J86j3j72l00J95j41K18r3K97l48J22o7j35j31J57K61M3k92n9
2818b48J49m7J07N9L26k54J1N6r9k9j17j66L28J49k49r7j15j9K12K9J46j47j54
2841a69L3J26o3K28j12L5mj41k27K87Pk15J50K46j44p0M1j46J55J54p2K9Nj12
2865B1K54k48J00l55K46j9k9L8k68K17j35R4L64j25q3o0Qj82J03P9jl48L92P6
2889A39k06jKK1qj76J30L3o4K23j21o5M37j60k23p4k32M11K38l65k9K33J11k52
2913Bj09j02K52J90j44j16N8L6K36k08k08Q8K48l93K15j82N7J35O3k37Q1N5N7
2936G4K21l96j35K67L74k30k17P1j53k76L89J1J60j75J11j42K17j74M3K18j11
$$ plain form
2957 147 -39 -55 216 152 173 54 89 287 140 -167 38 -12 307 68 -86 -88 -115 -37 -29 -22 -43 -150 31 -60 -86
2982 -86 -30 -27 271 -65 21 39 100 -218 -164 -39 4 -179 161 90 -137 77 -261 39 217 218 96 219 -58 -40
3006 -40 -43 4 25 89 22 79 -49 13 148 -365 -164 -49 124 -32 28 -154 -15 295 -79 288 -100 100 129 79
3030 79 -145 28 51 -16 221 -121 -439 -216 217 -66 96 -143 149 -47 -70 -58 122 -78 44 -15 -75 84
3052 84 -32 223 109 46 -2 -239 -54 -196 -157 -247 140 -231 170 -29 132 79 -79 -16 37 -118 156 -205 -60
3075 -60 79 173 -259 81 49 172 135 42 12 150 168 -307 211 -5 274 131 -186 -79 -169 -23 238 128 -37
3098 -37 -120 -64 105 173 -129 2 41 -101 112 -119 27 405 307 148 118 -8 -165 -299 17 -3 66 123 -5
3121 -5 -89 75 -211 -150 246 217 -68 328 45 -282 -15 -204 -146 137 -393 -267 -61 -71 110 -2 -37 -38 183
$$ packed form
2957A47j86j6K71o4K1j19L5J98j47l07K05n0L19k39j54kk7P8QPk1j07J81r1k6
2982h6N6LK98l36Q6J8O1l18N4J25M3j83L40p1k27K14l38L00J78Jj22J23k77J8
3006d0lM7K1O4o7N7j28O2J35n13K01J15J73j56O0j82J39L10l74L67l88K00K9n0
3030G9k24J73K3o7K37l42l18K23M33k83J62k39K92j96k3J2J80k00J22n9o0J59
3052H4j16K55j14o3m8k37J85j42L9r0L87l71M01j99J61n3j58O3N3j55K74l61J45
3075f0J39R4m32L40l2J23l7r3l0J38J8m75N18k16K79j43l17J07r0J46K61j10j65
3098c7q3N6J69O8l02J31L9j42K13k31J46L78r8j59l0j26j57j34L16k0O9N7j28
3121eq4J64k86O1L96k9k85L96k83l27K67j89N8K83n30J26K06j0J81j12l5jK21
$$ plain form
3144 183 -3 278 -199 58 -88 167 -46 -93 -91 200 48 -47 -64 41 -137 -122 64 -62 -171 -174 8 1 106
3167 106 291 24 -114 -181 254 -88 -25 40 -45 39 90 64 19 -52 145 219 165 111 -107 -3 5 4 110 -66 0 33
3193 33 87 -238 -66 -115 98 -8 29 -98 -60 9 -35 306 86 76 -102 -16 -160 88 -29 163 -27 39 91 -137
3217 -137 -145 157 196 181 -35 -177 54 -129 39 -163 130 21 -61 -80 -79 35 174 116 -112 -61 123 -25 42 97
3241 97 -272 -172 -158 6 98 -308 -111 147 -113 -7 -127 139 -256 -37 206 -40 -17 -50 -60 -107 46 154
3263 154 105 -10 142 -26 -216 9 176 187 -12 -18 -19 315 86 103 185 189 -288 -78 10 324 12 -19 -48 -60 -144
3288 -144 20 53 -184 105 112 -57 108 281 195 1 85 -18 32 115 -292 -156 162 -78 61 4 -68 110 107 -177
3312 -177 -83 -103 39 -19 -308 236 155 81 37 290 125 73 -59 -41 8 20 73 -49 -84 -466 168 28 -119 -57
$$ packed form
3144A83j86K81m77K57j46K55k13m7KK91j52r5j7J05j78J5J86j26j09lJ82pJ05
3167A06J85k67j38o7M35l42O3O5q5Q4N1k6m5p1J97P4n4n4k18J04QjJ06j76O6L3
3193C3N4l25J72m9K13j06L7j27L8O9m4L41k20j0j78Q6j44K48j17J92j90O6N2k28
3217a37qL02L9j5k16j42K31j83J68k02K93j09q2j9JJ14J39n8k28N1J84j48O7N5
3241I7l69J00J4J64R2m06J97K58k60J06j20K66l95K19K43k46K3l3j0m7J53J08
3263A54m9j15J52j68j90K25J67J1j99ojL34k29J7Q2Mm77K10Q8L14l12l1k9j2q4
3288a44J64L3k37K89Pj69J65J73q6j94Q4j03N0Q3m07J36L18k40J39n7p2J78lk84
3312a77R4k0J42n8k89N44q1p4m4K53j65n2j32J8M9J2N3j22l5l82O34j40j47O2
$$ plain form
3336 -57 -56 172 -107 -145 -135 119 -275 -94 -144 114 154 -193 -43 177 -78 -118 -67 74 20 176 -169 103 -230
3359 -230 -52 -16 71 157 -146 -15 -35 0 67 -89 -185 -39 304 121 -175 -4 79 -70 77 7 -28 -5 29 -37
3383 -37 254 112 -53 52 -48 -187 76 50 121 38 8 257 -87 -1 310 190 238 193 -27 -69 -143 33 133
3406 133 351 151 186 -79 -93 -27 -232 -270 100 11 28 21 -41 -295 44 52 -188 235 -36 71 225 2 4 -27 110
3431 110 301 144 46 99 -29 -58 55 230 -52 -56 -301 0 -87 111 233 -91 -68 146 230 80 -43 -98 -50
3454 -50 -8 -141 -107 214 -10 -155 150 -6 140 54 -115 94 3 -200 38 284 -11 -50 -116 236 332 -12 -103
3477 -103 -256 33 158 -105 -228 -97 69 34 125 -186 41 -21 92 -56 230 261 -172 141 -29 -77 -160 -83
3499 -83 17 211 47 -249 -78 -90 -122 -50 404 79 -156 220 105 80 -102 36 -196 -166 320 212 -74 -146
$$ packed form
3336e7JK28k79l8J0K54l94J81n0K58M0l47J50K20k55m0N1J41n4J56l45K72l33
3359b30J78L6Q7Q6l03J31k0L5O7j56r6J46L43j83k96J71Q3j49J47p0l5K3L4o6
3383c7K91j42j65J05j00j39K63k6P1q3l0K49l44Q6L11j20M8m5k20m2p4J76J00
3406A33K18k00L5k65j4O6k05l8L70q9J7po2k54L39Qk40M23k71J07J54k23Kl1J37
3431A10J91j57r8N3j28k9J13J75k82mk45L01q7J98J22l24K3K14Q4j50j23n5M8
3454e0M2j33L4L21k24j45L05j56J46q6j69K09r1k03K38K46k95l9o6L52R6l44r1
3477a03j53K89J25k63j23J31J66l5R1l11K27o2J13j48K86L1m33L13j70m8q3P7
3499h3J00J94j64k96J71j2l2P2M54l25k35L76j15k5j82J38k32L0M86j08k86p2
$$ plain form
3521 -146 163 42 -74 -58 -80 116 -185 329 -29 -130 -51 116 -96 -84 -62 -98 63 -12 -225 -27 214 169 -35
3544 -35 -133 -214 157 137 -165 246 -201 -179 -54 -147 -162 183 -15 172 90 -97 -8 136 174 215 318 46 87 -96
3568 -96 134 -26 55 284 180 223 -229 -132 -54 -93 75 -31 190 -148 18 -298 -179 127 342 82 -46 16
3590 16 81 -178 -53 -58 97 116 -365 105 328 -46 -242 229 47 -67 73 65 26 20 140 31 17 -254 52 97
3614 97 -31 36 140 -305 291 -3 343 241 -132 185 -6 50 -81 18 303 -240 -62 -182 14 73 -241 -13
3636 -13 322 -53 -101 148 -187 223 -121 98 -155 -103 -172 -214 -27 -166 -219 91 32 -128 -57 190 -494 93 20
3659 20 220 -129 48 84 -22 86 -99 -69 255 249 187 222 -25 7 -85 -44 -72 -95 363 -33 -38 -190 170 1 -166
3684 -166 -35 8 35 64 143 60 73 165 4 -21 121 184 148 -128 22 26 -260 74 94 -140 153 -226 -76 -75 149
$$ packed form
3521a46L09j21j16J6k2J96l01N14l58j01P9J67k12J2K2l6J61p5k13J98K41m5k04
3544c5r8q1L71k0l02M11m47K2J25r3j5L45j98J87q2j87Q9J44L8M1J03k72M1j83
3568i6K30j60Q1K29j04M3m52R7P8l9J68j06K21l38J66l16J19L06K15k60j28O2
3590A6O5k59J25nJ55J9m81M70K23l74j96M71j82j14J40ql9oJ20j09j4k71L06M5
3614I7j28O7J04m45N96k94L46j02l73L17j91N6j31R9K85n43J78j20J96N9l14K28
3636a3L35l75m8K49l35M10l44K19k53N2o9m2J87j39n3L10n9j60P1K47o84N87p3
3659B0K00l49J77L6j06J08j85L0L24oo2L5k47L2r2M1k8k3M58l96nj52L60j69j67
3684a66J31M3K7K9P9q3J3R2j61k5J42O3l6k76J50Mk86L34K0k34K93l79J50JK24
$$ plain form
3709 149 -244 -53 -149 42 -188 131 -56 -64 108 -191 27 78 209 134 -56 -20 183 -275 10 225 -155 165
3731 165 -276 -216 74 -74 188 -30 -46 65 154 213 56 -213 64 177 17 26 -219 -72 -39 258 251 63 -230
3754 -230 -110 23 -216 128 5 41 10 -25 17 2 -192 113 -139 -123 42 81 -125 -121 -114 64 71 22 -134 171 -51
3779 -51 -209 -173 207 128 95 -39 -44 36 22 41 -343 29 -15 -49 43 -12 -97 -28 10 282 2 -37 -170 -30 40 -70
3805 -70 -226 -155 -105 64 -15 -14 -95 -116 24 -269 -3 268 196 41 -67 65 186 -12 48 -183 172 -47 -121 50
3829 50 -93 34 33 -104 -45 -244 -82 -223 -140 116 60 -58 22 -8 -160 -35 -109 213 -38 74 32 168 -56
3852 -56 -31 -34 146 52 401 21 83 -35 50 20 90 150 90 81 47 -15 224 -174 -118 98 -179 227 -56 -75 282 87
3878 87 -120 65 -101 25 -76 29 49 -73 -20 25 -99 -254 -169 -39 132 -70 32 135 -110 -171 268 -196
$$ packed form
3709A49l93J91r6J91k30L19j87qJ72k99K18N1J31p5j90L6K03m58K85K15l80L20
3731A65m41O0K90j48K62k18j6J11Q9N9j57k69K77J13j60Rk45J47L3K97pj88k93
3754b30J20J33k39L44j23L6l1l5M2j5j94L05k52J6J65L9k06MPJ78Pm9j56L05k22
3779e1j58L6L80p9l3j34nQ0j4J9l84L72m4l4R2n5q5O9L8K72k80l9j33J40P0j10
3805g0j56P1N0J69p9Jq1k1J40k93K66K71p2j55j08J32J21j98O0k31L55k19p4J71
3829E0j43J27jj37N9j99J62j41Q3K56n6j18Q0l0j52J25p4L22k51J12m2J36k24
3852e6K5lJ80r4L49l80O2j18Q5l0P0O0o0rl4o2K39l98N6K16k77M06k83j9L57j95
3878H7k07J85j66J26j01J05K0j22N3M5j24j55Q5J30J71k02J02J03k45o1M39m64
$$ plain form
3900 -196 -30 164 186 5 24 -2 -109 50 -112 -147 48 221 75 24 58 -91 36 331 -175 162 12 95
3922 95 -25 -40 3 136 181 113 234 -231 247 94 88 -123 -165 -162 -467 72 -192 312 -18 -50 98 208 -196 112
3946 112 232 103 -107 22 123 24 -132 110 -288 -53 -200 251 -131 198 68 -162 -263 -194 -146 -250 -161
3967 -161 99 -27 -91 121 -106 -8 -54 38 -39 -35 10 263 -197 23 89 -36 -296 133 -85 195 58 1 -58 144
3991 144 125 -129 307 87 -240 236 -127 164 157 96 64 288 -201 -64 -78 -168 43 53 -64 193 -157 -81 245
4014 245 194 200 -137 133 5 -181 12 -15 205 -112 -250 86 -132 -150 -177 -94 176 0 64 -97 85 97 -30
4037 -30 169 -99 -48 -121 -122 102 -32 105 125 49 273 112 10 -25 -21 -48 65 13 31 -5 -136 99 141 293 -181
4062 -181 -188 183 -180 67 104 18 -194 6 -16 -156 -82 0 -34 102 78 -53 -74 33 -258 24 61 -275 275 -1
$$ packed form
3900a96J66J94K2j81J9k6j07J59j62l5J95J73j46n1L4j49J27K95n06L37j50Q3
3922I5j20j5M3J33M5o8J21m65M78j53ok11m2Ll05N39k64N04l30l2J48J10m04L08
3946A12J20j29k10J29J01r9j56K42l98K35j47M51l82L29j30k30j01O9M8j04Q9
3967a61K60j26o4K12k27R8m6R2p7MM5K53m60K20O6j25k60M29k18K80j37n7n9K02
3991A44j9k54M36k20l27M76l63K91po1l2K24m89J37j4r0K11J0j17K57l50P6L26
4014B45n1Ol37K70j28j86J93k7K20l17j38L36k18j8k7Q3K70j76O4j61J82J2j27
4037c0J99k68N1p3jK24j34J37K0p6K24j61j02l5Mk7J13n2J8l6j31K35M2J52m74
4062a81pL71l63K47L7q6k12K00k2j40P4Q2l4J36k4j31k1J07k91K82L7l36N50k76
$$ plain form
4086 -1 52 267 -143 -32 170 -12 -143 8 132 241 254 15 189 337 81 -59 92 -152 -120 144 132 111
4108 111 32 -85 73 -119 13 -109 -153 -135 -224 269 171 121 2 88 -221 66 -12 -164 -196 52 106 -101 42
4131 42 63 58 79 -76 223 155 0 -11 -59 -117 247 110 -61 11 -6 -103 -184 18 62 -36 29 302 9 109 -19
4156 -19 29 56 35 14 -50 -339 110 -219 -113 121 -9 95 11 -231 52 243 95 17 -373 -28 151 -332 0
4179 0 167 180 -28 -3 18 18 132 -172 43 75 -56 35 -28 83 -28 178 57 -27 49 -143 30 291 -34 148
4203 148 71 134 -337 26 -123 -49 85 226 -5 8 79 227 59 -68 -26 -242 -21 -99 -21 -11 -290 -123 128
4226 128 200 84 -166 234 -197 -23 120 20 55 -114 -192 119 150 -353 175 -69 -71 -78 298 -27 -377 8 -84
4249 -84 44 -69 198 -44 2 86 -77 142 -128 -53 -116 -83 230 -215 17 -85 -234 -210 224 -106 145 249
$$ packed form
4086aN3K15m10J11K02j82j31J51J24J09J3k39J74J48k56j40J51k44L2K64j2k1
4108A11p9j17J58j92J32j22m4J8q9M93r8n0j19Q6l09K87p8j52l2K48N4k07J43
4131D2K1nK1j55K99o8j55j1m8n8L64j37j71P2j7r7q1K02M4r8O5K73k93J00j28
4156a9M8K7k1k1o4k89M49l29J06K34j30J04q4k42K83J91j48p8l90L45J79m83L32
4179@J67J3k08K5K1%J14l04K15L2j31R1o3J11j11K06j21q4P6j92J73K61l25J82
4203A48p7O3m71L63j49P4J34J41k31J3P1J48j68j27M2k16K21p8P8J0k79J67K51
4226A28P2j16k50M00m31J74J43j00L5j69p8L11L1n03N28k44kpL76l25l50L85r2
4249h4J28j13K67k42M6Q4j63K19k70P5o3L3L13m45K32j02j49K4M34l30K51J04
$$ plain form
4271 249 -43 109 32 -200 195 92 -255 -36 37 -123 -300 -205 26 -22 51 87 179 -33 -232 224 -113 190
4293 190 -46 64 -154 -111 326 -106 91 11 -81 32 -209 -369 -26 -305 6 -305 -154 -16 -249 85 70
4314 70 54 -9 204 -98 165 245 277 0 72 -148 167 -101 -145 -25 -239 -171 -94 94 -156 116 88 -6 -26 169
4338 169 -89 14 105 97 28 100 -31 -246 -4 17 259 188 -205 -153 25 -112 91 19 134 -93 64 214 -80
4361 -80 91 75 158 -131 28 52 259 -14 115 26 157 114 271 214 -52 36 261 -124 -93 1 -123 3 -119
4384 -119 -59 -123 -252 -21 244 9 -63 58 68 64 -134 189 -80 -183 36 152 -195 -33 12 39 208 -91 37
4407 37 97 -16 -279 -15 -109 -202 30 -200 9 122 -77 -44 -186 73 -79 61 28 37 119 298 -4 139 -354
4430 -354 206 -134 -132 -57 -96 -119 -29 -119 -90 -88 -205 -70 -39 -33 134 -173 -159 -205 294 94 -4 128 -196 -66 164
$$ packed form
4271B49k92J52p7k32L95j03l47K19P3j60j77R5K31m8P3L6R2k12j99M56l37L03
4293A90k36J10k18M3M37m32J97q0r2J13k41j60L43k79L11l11J51J38k33L34j5
4314G0j6o3K13l02K63Q0L2k77P2k20L15k68m4J20k14O8P7J88k50K72k8r4k0J95
4338A69k58J03R1qo9P2j31k15K42K1K42p1l93N2J78j37K03p2J15k27J57J50k94
4361h0J71j6Q3k89J59K4K07k73J29q9J31m3J57n7k66Q8K25l85L1R4j24J26j22
4384a19O0o4j29K31K65k35p2J21J0mj98L23k69j03K19J16l47J62M5K7J69k99J28
4407C7O0j13k63K64r4r3K32k30K09J13j99L3j42K59j52J40l3RQ2J79l02J43m93
4430c54N60l40KP5l9k3R0r0K9Kj17J35L1OJ67l07J4m6M99k00r8J32l24J30K30
$$ plain form
4455 164 116 -91 127 -102 -5 144 53 106 202 -169 125 33 84 163 8 360 216 -74 -136 -202 1 -53 -166 -40
4479 -40 -8 -208 -46 10 -97 75 110 -114 -87 -189 -124 -39 215 221 210 -158 -101 -239 25 72 212 -23 16 165
4503 165 73 -129 -137 -120 -54 172 -9 -34 32 386 224 49 -148 284 -121 52 131 40 -71 201 167 153 -239 226
4527 226 -428 141 173 -64 179 -101 -182 -374 100 -190 230 -42 -105 -259 115 168 -202 -311 -123 -17 8 -26
4549 -26 -94 -235 -7 338 20 167 103 -273 86 -321 -69 -36 64 123 -138 -62 113 -8 37 2 -78 -102 -1
4572 -1 -163 -83 -194 -62 -33 32 94 26 33 -291 -140 67 105 376 72 37 82 -220 -165 -215 162 -41 235 72 11
4597 11 -163 48 -131 123 -52 -119 39 -164 -4 13 -54 89 156 7 -43 134 120 -172 169 82 280 77 3
4620 3 -10 -140 7 -70 -14 115 9 134 -45 128 -262 200 -57 9 43 -9 6 50 22 -151 -59 -116 -187 147 153
$$ packed form
4455A64m8k07K18k29R7J49r1N3R6l71K94r2N1P9j55L52j44k90o2o6K03n4j13J26
4479d0L2k00J62N6j07J72L5k24K7j02O5Q5K54Oj1l68N7j38K64M7J40k35L9J49
4503A65r2k02qJ7O6K26j81k5O6L54j62j75j97M32m05J73P9r1j11K72l4j4l92M65
4527B26o54N69L2k37K43k80q1j92M74k90M20k72o3j54L74N3l70j09J88J06K5l4
4549b6o8j41K28L45l18J47o4l76L59m07K52L3J00N9k61P6J75j21M5l5q0k4J01
4572aj62Q0j11J32K9O5O2o8Pl24J51K07L8K71l04l5M5l02N5n0L77k03K76j63o1
4597A1j74K11j79K54j75o7J58k03J60J7o7J43O7j49n0J77j4k92L41q7J98k03p4
4620Cj3j30J47p7N6J29j06J25j79J73l90M62k57O6L4n2J5M4k8j73R2n7p1L34O
$$ plain form
4645 153 12 120 -28 137 -110 457 347 294 105 -239 -29 82 78 221 19 -23 133 261 90 23 42 -119
4667 -119 -379 36 17 -111 124 175 -158 17 99 -76 -188 -72 311 -8 -181 -78 -10 193 31 -211 36
4688 36 -124 74 -13 -212 388 99 70 -261 15 24 243 45 166 16 -246 -143 36 -223 -119 -111 -159 -126 22
4711 22 175 207 -12 -247 3 109 137 -152 -205 253 125 212 129 -23 161 46 72 -102 -79 -350 167 111 87
4734 87 54 171 -65 -62 30 -434 32 147 185 57 -66 11 -116 -53 42 -89 111 -34 -118 -93 -396 69 -4 -10 -167
4759 -167 -50 -59 366 92 -71 117 -371 218 11 147 251 25 -68 283 59 76 -64 -152 -27 339 -106 -145
4781 -145 -115 -18 78 -31 55 -161 -23 38 -142 157 35 99 -6 -54 123 -30 306 43 112 82 -236 -121 20
4804 20 106 -89 -120 -92 -50 -70 -2 -23 150 111 -38 -46 -222 36 -203 -163 100 -339 14 -104 -150 -61 212 306 75
$$ packed form
4645A53j41J08j48J65k47N67j10n3j89l44K10J11mJ43k02m2J56J28j71o7J9j61
4667a19k60M15j9j28K35N1l33J75Q2j75j12J16L83l19j73J03O8K03j62k42K47
4688C6j60J98q7j99O00k89k9l31K76RK19j98J21j50k62J03J79k59J04Qm8L3J48
4711B2J53L2k19k35K50J06K8k89n3M58j28Q7q3j52J84j15K6j74K3k71N17n6k4
4734H7l3J17k36LR2m64M66J15L8j28j23P7j27O3R5j31K00j45q4K5l03M65p3oj57
4759a67J17rM25k74j63J88m88N89k07J36J04k26r3L51k24J7j40q8J25L66m45l9
4781a45L0R7R6j09Q6k16J38O1j80K99j22O4j05m8J77j53L36k63O9l0l18J15J41
4804B0Q6j95l1K8M2k0O8k1J73l9j49qj76K58k39M0K63m39L53j18m6Q9K73R4k31
$$ plain form
4829 75 31 -141 27 -206 104 -103 32 -26 -183 -4 68 -153 37 -41 124 145 157 -172 -4 -101 -82 100 -21
4852 -21 -91 -145 -90 113 -75 80 5 35 162 -194 -258 -176 108 92 169 4 1 6 -134 -26 -91 62 -230 130 46
4877 46 57 -209 177 -13 41 -95 92 -19 -207 -246 48 -192 47 -47 86 -154 -173 48 -67 -28 246 183 11
4900 11 -117 -104 -173 -316 71 129 13 -71 134 90 -91 -115 -238 -44 -223 204 28 117 -182 -34 133 56 202
4923 202 -253 -83 -98 39 259 136 27 -222 -27 177 -77 121 280 -89 45 102 -11 54 -130 -57 216
4944 216 32 -71 -76 -22 97 90 169 -7 -48 148 -288 303 -8 -92 -38 -93 355 97 112 -14 15 -22 40 206 4
4969 4 -67 216 75 230 306 -10 -288 -180 -114 -164 -233 -18 102 151 -137 -30 401 -15 -294 -127 13 236 25
4992 25 -97 0 90 121 -137 -66 306 153 -53 83 95 -32 65 200 -70 53 -184 -2 -279 79 -85 48
$$ packed form
4829G5m4j72J68k33L10k07J35n8j57J79P2k21J90p8J65K1J2l29J68r7J9J82j21
4852b1p0n4N5K03j88J55p5L0J27l56o4Q2K84j6P7j65lNj40J08o5J53k92L60q4
4877D6J1k66L86j90N4j36J87j11j88l9K94k40K39r4J33k40j9K21j15L9K74o3j72
4900A1j28J3o9j43L87N8j16q4K05m4j81k4j23J94j79M27j76Q9k99J48J67p7J46
4923B02m55J70j5J37K20j23j09k49J95K04k54J98J59l69J34N7j13O5j84P3K73
4944B16j84j03nN4J19pP9j76m1J96m36N91l11q4N4n5M48k58J5j26K9l7O2J66k02
4969Dp1K83j41J55P6l16k78J08O6n0o9K15J20M9k88J07M31m16k79J67J40K23k11
4992B5j22R7R0L1k58P1L72j53k06J36J2j27R7J35k70J23k37J82k77L58j64J33
$$ plain form
5014 48 37 -106 -41 221 210 -148 -112 21 253 39 -34 -78 -17 -303 114 395 34 -139 299 36 140 -144 163
5037 163 76 116 -56 3 -35 -226 -165 17 58 314 194 -52 -16 40 -142 23 234 61 -30 -56 9 38 -109 33
5061 33 -273 299 314 92 205 -157 -372 8 55 -65 -66 99 -261 113 13 -169 139 141 70 -181 -43 160 166
5084 166 17 -102 17 -58 -237 253 -89 -107 45 -183 -31 -5 60 125 -14 10 433 -72 -2 373 -114 -120 -96
5107 -96 -40 34 -176 127 -191 -171 3 -43 87 -241 119 -47 -255 -72 -200 188 122 182 62 219 160 218 69
5130 69 -64 117 324 50 -58 -64 -64 50 171 -112 -271 54 -189 106 -115 -296 -23 -32 -92 -103 -101 19 -91 -425
5154 -425 5 4 -60 68 180 -198 -26 178 292 -1 -11 164 -238 46 -140 22 102 45 91 132 -322 30 82
5177 82 -19 20 213 49 -66 22 -164 11 -98 -23 138 -75 -28 29 -50 -64 -116 -87 202 42 -45 249 -19 -102
$$ packed form
5014D8j1j43O5K62j1l58L6J33K32k14p3m4O1k86M17K81l61j73M38k63J04k84L07
5037A63q7M0j72N9l8j91O1J82M1K56j20k46L6N6j82J65K11j73r1k6O5K9j47J42
5061C3l06N72J5k22J13l62k15L80M7j20jJ65l60L74j00j82L08Kp1k51J38K03O
5084A66j49j19J19p5j79M90l42j8J52k28J52K6O5O5j39K4M23n05P0L75m87oK4
5107i6N6P4k10L03l18K0J74m6J30l28L60j66k08J83j28L88o6O0j20J57n9N8j49
5130F9j33J81K07k74j08o%J14J21k83j59L25k43K95k21j81K73ro0j1KJ20j10l34
5154d25M30jo4J28J12l78J72K04J14k93j0J75m02K84j86J62Q0n7M6M1m54L52N2
5177H2j01L9J93j64j15Q8j86J75j09P5J61k13M7N7p9j4n2K9K89j60q7K94k68q3
$$ plain form
5201 -102 63 5 36 -111 -29 -178 -118 -181 2 -53 -20 -25 -50 -220 50 -193 -44 -268 -5 -13 -55 162 157 -159 21
5226 21 -93 -264 -17 -91 -370 -10 150 68 -14 -149 -26 190 225 128 -108 171 46 -155 -127 12 -194 379
5248 379 -41 -199 275 37 61 -383 -54 -331 -354 -195 255 63 73 -116 -236 -248 233 -140 -44 80 -29 -246
5270 -246 184 29 -182 -15 21 65 -5 -139 127 198 107 -94 -37 -14 -154 -201 -62 -18 103 154 60 -51 -34 105
5294 105 -130 245 82 -70 -67 -67 38 -278 85 72 -210 -120 267 -104 194 -10 60 -75 71 -210 -45 20 -125
5317 -125 62 -123 -77 212 -138 -23 -60 -532 173 34 112 -107 156 117 -54 -6 -111 -278 99 77 73 210 -343
5340 -343 -7 41 294 -169 -19 -23 169 2 -161 -95 399 379 -42 68 99 235 -138 58 -120 -125 59 161 -132
5363 -132 -60 200 350 -108 83 -165 143 103 -84 169 -378 97 228 -130 -250 60 -52 -107 -53 -60 239 -68
$$ packed form
5201a02J65n8L1j47Q2j49O0o3J83n5L3nk5j70K70k43J49k24K63qm2K17nl16J80
5226B1j14j71K47p4k79L60J60q2q2j35J23K16L5r7k36K79j25k01K8J39k06N73
5248C79m20j58M74k38K4m44L29k77k3J59M50j92J0j89j20j2M81l73R6J24j09k17
5270b46M30j55k11J67L6M4p0j34K66P1r1k01N7K3j40m7J39M4J21N1r4j11J7J39
5294A05k35L75j63j52L%J05l16L63j3k82R0L87l71K98k04P0j35J46k81J65O5j45
5317a25J87j85M6K89l50J15l7m72P05j39P8k19K63l9j71M8j05j67L77k2mJ37n53
5340c43L36M8K53m63J50mJ92j67j63O6M94k0m21J10L1J36l73J96j78nJ84J02k93
5363a32P2K60J50m58J91k48L08m0j87K53n47M75J31l58j20L10j12n5N4pK99l07
$$ plain form
5385 -68 7 -120 -221 177 -293 124 -13 12 52 59 -80 46 -66 -232 -51 34 -232 -160 -56 -36 92 141 -336
5408 -336 76 113 -239 -127 20 -83 -232 72 84 90 -16 115 207 -38 16 -225 13 -61 -162 -5 183 6
5430 6 150 21 -214 -17 98 19 89 116 197 -52 59 -121 165 33 163 130 -116 252 -158 108 -75 23 147
5453 147 -23 -60 50 196 306 14 62 47 119 120 48 -186 -223 215 -54 -134 135 17 249 -367 -28 49 -71
5476 -71 13 -183 -185 70 -156 -17 -113 108 3 97 21 -102 68 -60 87 -126 6 104 -128 -76 -55 -219 138
5499 138 106 -50 228 25 137 191 50 -174 -138 28 -93 24 -99 -195 -133 110 274 17 68 195 62 -200
5521 -200 -38 5 197 122 -64 45 206 8 115 7 -150 -47 36 117 -109 94 -43 -80 83 -278 124 -86
5543 -86 52 39 -60 102 -132 77 -5 -55 -35 47 -204 119 209 188 94 14 -81 18 158 51 24 -97 -143 64 153
$$ packed form
5385f8P5j27j01L98m70M17j37K5M0Pj39J26j12j66J81Q5k66P2J04K0J28M9m77
5408c36M12L7l52J12J47j03j49L04J2Oj06J31R2k45N4k41K38p4j01J57J88j77
5430FJ44j29k35J97J15p9P0K7Q1k49J11j80K86j32J30l3k46L68m10K66j83R8J24
5453A47j70l7J10J46J10k92M8j5P2Jp2k34l7M38k69q0K69j18K32o16L39P7j20
5476g1Q4j96kK55k26J39r6K21j05R4p6j23J70j28J47k13J32R8k32N2K1j64L57
5499A38l2j56K78k03J12N4j41k24L6J66j21J17j23r6O2K43J64k57N1J27j33k62
5521b00J62M3J92p5j86J09J61j98J07j08j57J03Q3Q1k26K03j37l7J63l61M02k10
5543h6J38j3r9J62k34K09q2n0K0Q2k51L23R0k1r4q0r5R9J40j07k7j21m6K07Q9
$$ plain form
5568 153 -97 -107 -165 235 214 160 172 -3 -113 -33 74 154 31 -307 -171 -4 -59 33 -38 -38 155 -35 -40 -46 58
5593 58 15 196 223 -43 75 -84 82 38 103 11 226 183 147 -25 -37 -13 31 78 -34 144 -18 217 207 -15
5617 -15 -126 151 -24 -15 -167 -28 192 2 -218 37 -123 -271 -41 -6 -157 -203 81 -10 452 22 63 -187
5639 -187 54 143 -79 61 38 44 -182 -237 -233 -58 -12 -107 -28 142 101 66 80 109 121 24 246 249 36 99 81 -142 -4
5666 -4 -125 -52 -76 -5 -143 195 54 -38 90 -6 44 -220 -182 -55 -92 -226 -216 98 -46 76 236 -24 81 10
5690 10 -171 -45 184 15 -76 85 41 196 8 -134 -101 172 132 149 58 85 66 -22 -89 -15 -141 -112 -266 -21
5714 -21 -101 -94 153 119 124 199 147 64 10 -140 142 71 -35 100 -104 26 -114 -64 -179 -83 -162 47 122 40 287 103
5740 103 224 4 -129 20 67 24 22 -58 118 -117 183 55 202 46 -274 -16 63 -18 -81 -4 134 217 -316
$$ packed form
5568A53k50j0n8M00k1n4J2j75j10Q0J07Q0j23l38J36J67n5R2p1%J93j90noJ04
5593E8m3J81K7k66J18j59J66m4O5r2K15m3l6j72j2K4M4M7j12J78j62K35j0k22
5617a5j11K77j75Rj52J39K20j90k20K55j60j48K30L5j51m6K84r1M62m30M1k50
5639a87K41Q9k22J40k3Ok26n5MJ75M6r5P9J70m1l5J4K9J2r7K22Lk13O3j8k23J38
5666dj21P3k4P1j38L38j41r2J28r6N0k64L8J27l7j34J0L14j44J22J60k60J05p1
5690A0j81J26K29j69r1J61m4J55j88j42L3K73m0J7r1K7j9q8o7P4j26K9j54K45
5714b1q0PK47l4NP5n2q3n4j50K82p1j06J35k04J30j40N0j15R6p9K09P5q2K47j84
5740A03J21k20j33J49M7m3kq0J76k35L00j28J47j56l20K58P9q1o3P7J38Q3n33
$$ plain form
5763 -316 -155 -55 18 -6 -102 14 141 39 156 43 -196 -31 34 -65 -60 -138 70 -133 -23 4 -111 96 214
5786 214 114 -69 168 115 -30 56 92 123 -361 320 -227 50 6 -56 63 -19 -115 -152 272 -15 -166 -57 -11
5809 -11 117 -61 -137 -45 14 -73 -101 -96 29 -21 108 123 91 163 -167 88 45 6 -241 220 285 -252 121 84 -23
5834 -23 146 -50 77 30 220 -209 -141 18 258 -71 -141 -41 58 -104 57 77 -44 59 -206 -62 -54 -177 -283
5857 -283 -52 -103 -7 103 62 -17 15 110 6 -195 299 76 32 110 -20 24 119 -60 79 99 -73 274 131 -39
5881 -39 90 -151 83 66 -241 -55 -13 158 -138 -144 -87 -107 111 -156 276 124 108 -78 119 100 -305 -238 -22
5904 -22 36 -55 169 200 -150 229 -305 -136 -65 59 320 -63 11 -194 -332 124 42 -158 -110 90 69 164 139 176
5928 176 -122 -248 -222 69 200 -15 150 139 7 17 -324 -4 87 113 25 -300 -65 80 68 135 133 42 35 -43 84
$$ packed form
5763c16J61J00P3k4r6J16J27j02J17j13k39J65O5r9Np8K08k03J10K7j15K07J18
5786B14j00j83K37n3j45Q6L6L1m84O81n47K77m4o2J19q2r6l7M24k87j51J09M6
5809a1J28j78p6R2N9q7k8NJ25n0J29J5l2P2l30K55m3l9k47M61O5n37L73l7j07
5834b3J69j96J27m7J90m29O8J59K40l29p0J00R9j62J61K0j21J03k65J44Qj23j06
5857b83K31n1R6J10m1p9L2R5j04k01M94k23m4P8j30M4R5j79J39K0j72L47j43j70
5881c9J29k41K34j7l07J86M2J71k96oN7k0K18k67M32j52j6j86J97j9m05O7K16
5904b2N8r1K24L1l50L79n34J69P1J24K61l83P4k05j38M56q2k00M8K00k1R5k5L7
5928A76k98j26K6K91J31k15J65j1j32J0l41L20R1K6q8l25K35J45j2O7kr1pp8J27
$$ plain form
5953 84 -175 -21 -25 240 0 165 -13 281 97 128 31 159 38 42 448 -92 90 159 -239 -148 84 -129 -242
5976 -242 -125 81 52 -273 133 -226 216 24 47 82 49 16 -3 -125 -193 78 -157 75 1 98 111 -152 -169 12
6000 12 -47 -78 -186 47 -91 -149 -140 -252 49 19 45 -185 256 -245 70 57 -213 -30 -2 63 -84 -14 127 -222
6024 -222 -167 -43 -195 24 34 154 23 -146 -243 50 -233 -57 144 117 -7 16 -189 -50 -4 -103 39 215
6046 215 -198 147 168 53 -169 -1 144 147 -20 -86 8 107 -83 -124 83 -232 32 -31 167 102 -93 129 101
6069 101 -78 -110 6 238 -345 78 117 -15 -12 -35 337 -242 138 98 150 -85 44 99 -51 -41 146 -190 139
$$ packed form
5953H4k59J54mK65k40J65j78K94j84L1r7J28j21MM06n40J82O9l98R1K32k13j13
5976b42J17K06k9l25M06l59M42j92K3L5l3l3j9j22o8K71k35K32p4R7J3k63j7J81
6000A2n9l1j08K33j38n8Rj12L01l0K6k30M41n01L15j3k70J83K8O5j47P0J41l49
6024b22N5J24j52K19J0J20j31j69r7K93k83J76K01k7j24K3k05J39M6r9J42J76
6046B15m13L45K1j15k22J68J45Lj67o6R4R9j90m1K07l15K64o3J98o5j95K22k8
6069A01j79l2J16K32n83M23L9j32Lk3L72n79L80m0N2k35J29N5j50J0J87l36L29
$$ [...]
8191A68
##END NTUPLES=NMR FID
##END=
